,feat_set_id,classifier,fold_id,feat_th,score,geo_score,exec_t,geo_score_woz
0,0,KNeighbors Classifier,0,1.0,0.9166666666666666,0.9210078746600967,0.02349233627319336,0.9210078746600967
1,0,SVC Classifier,0,1.0,0.45,0.3872983346207417,0.003099203109741211,0.0
2,0,Decision Tree,0,1.0,0.75,0.7406240171018427,0.0098724365234375,0.7406240171018427
3,0,RandomForest,0,1.0,0.85,0.8549879733383485,0.16684722900390625,0.8549879733383485
4,0,AdaBoost (Discrete),0,1.0,0.9166666666666666,0.9210078746600967,8.740778684616089,0.9210078746600967
5,0,AdaBoost (Real),0,1.0,0.9333333333333333,0.9410360288810286,9.752435445785522,0.9410360288810286
6,0,Logistic Regression (Penalty = L2),0,1.0,0.9333333333333333,0.9410360288810286,0.15306568145751953,0.9410360288810286
7,0,Naive Bayes,0,1.0,0.95,0.9564655913861946,0.027367591857910156,0.9564655913861946
8,0,KNeighbors Classifier,1,1.0,0.95,0.9564655913861946,0.027487754821777344,0.9564655913861946
9,0,SVC Classifier,1,1.0,0.4,1.0,0.024112939834594727,0.0
10,0,Decision Tree,1,1.0,0.7833333333333333,0.7537619628284087,0.002051115036010742,0.7537619628284087
11,0,RandomForest,1,1.0,0.85,0.8414757379333423,0.11971879005432129,0.8414757379333423
12,0,AdaBoost (Discrete),1,1.0,0.8833333333333333,0.8662391053409028,9.52760934829712,0.8662391053409028
13,0,AdaBoost (Real),1,1.0,0.85,0.8358603846235818,10.190479755401611,0.8358603846235818
14,0,Logistic Regression (Penalty = L2),1,1.0,0.95,0.9518891309816516,0.02329874038696289,0.9518891309816516
15,0,Naive Bayes,1,1.0,0.9666666666666667,0.9654893846056297,0.02293252944946289,0.9654893846056297
16,0,KNeighbors Classifier,2,1.0,0.9655172413793104,0.9701312318500641,0.023444175720214844,0.9701312318500641
17,0,SVC Classifier,2,1.0,0.39655172413793105,1.0,0.02250504493713379,0.0
18,0,Decision Tree,2,1.0,0.9482758620689655,0.9544812172391356,0.0014524459838867188,0.9544812172391356
19,0,RandomForest,2,1.0,0.9827586206896551,0.9852919811325488,0.14641356468200684,0.9852919811325488
20,0,AdaBoost (Discrete),2,1.0,0.9655172413793104,0.967693705920519,9.556508779525757,0.967693705920519
21,0,AdaBoost (Real),2,1.0,0.9482758620689655,0.9470981939677545,10.468644857406616,0.9470981939677545
22,0,Logistic Regression (Penalty = L2),2,1.0,1.0,1.0,0.02370762825012207,1.0
23,0,Naive Bayes,2,1.0,0.9655172413793104,0.967693705920519,0.02051711082458496,0.967693705920519
