,feat_set_id,classifier,fold_id,feat_th,score,geo_score,exec_t,geo_score_woz
0,0,KNeighbors Classifier,0,0.3,0.8050389922015597,0.805067728655833,7.525184392929077,0.805067728655833
1,0,SVC Classifier,0,0.3,0.8356328734253149,0.8248407745748454,16.090476989746094,0.8248407745748454
2,0,Decision Tree,0,0.3,0.7468506298740252,0.7462912845432296,0.462252140045166,0.7462912845432296
3,0,RandomForest,0,0.3,0.7510497900419916,0.7479496182961262,1.7728230953216553,0.7479496182961262
4,0,AdaBoost (Discrete),0,0.3,0.8110377924415118,0.8083831493897159,238.08832693099976,0.8083831493897159
5,0,AdaBoost (Real),0,0.3,0.7954409118176364,0.7929879413480506,263.3627655506134,0.7929879413480506
6,0,Logistic Regression (Penalty = L2),0,0.3,0.8608278344331134,0.8606661036630807,1.3111212253570557,0.8606661036630807
7,0,Naive Bayes,0,0.3,0.8002399520095981,0.7738572879472512,0.28234291076660156,0.7738572879472512
8,0,KNeighbors Classifier,1,0.3,0.7954409118176364,0.7953389569629324,6.821573495864868,0.7953389569629324
9,0,SVC Classifier,1,0.3,0.8308338332333534,0.8220109373384643,15.377868413925171,0.8220109373384643
10,0,Decision Tree,1,0.3,0.7396520695860828,0.7394270221211018,0.4149942398071289,0.7394270221211018
11,0,RandomForest,1,0.3,0.767246550689862,0.7606111146441636,1.7313461303710938,0.7606111146441636
12,0,AdaBoost (Discrete),1,0.3,0.8062387522495501,0.8053539501217866,199.14258813858032,0.8053539501217866
13,0,AdaBoost (Real),1,0.3,0.8032393521295741,0.7999028886112598,237.9726619720459,0.7999028886112598
14,0,Logistic Regression (Penalty = L2),1,0.3,0.8494301139772046,0.8492780430638707,1.0836718082427979,0.8492780430638707
15,0,Naive Bayes,1,0.3,0.7780443911217756,0.7479618620978208,0.23537421226501465,0.7479618620978208
16,0,KNeighbors Classifier,2,0.3,0.826530612244898,0.8261269206805326,6.877029180526733,0.8261269206805326
17,0,SVC Classifier,2,0.3,0.8385354141656662,0.8283484985748348,15.079466104507446,0.8283484985748348
18,0,Decision Tree,2,0.3,0.7503001200480192,0.7502412669678882,0.5555074214935303,0.7502412669678882
19,0,RandomForest,2,0.3,0.765906362545018,0.746896439586843,1.6304295063018799,0.746896439586843
20,0,AdaBoost (Discrete),2,0.3,0.8277310924369747,0.8246145214198227,189.30309748649597,0.8246145214198227
21,0,AdaBoost (Real),2,0.3,0.8229291716686674,0.8178800650656918,174.38687086105347,0.8178800650656918
22,0,Logistic Regression (Penalty = L2),2,0.3,0.8637454981992797,0.8635678685084482,0.7290170192718506,0.8635678685084482
23,0,Naive Bayes,2,0.3,0.7929171668667467,0.7610260831625505,0.19576406478881836,0.7610260831625505
24,1,KNeighbors Classifier,0,0.3,0.8146370725854829,0.8144896621796408,5.502509117126465,0.8144896621796408
25,1,SVC Classifier,0,0.3,0.8434313137372526,0.8392353564007903,10.662282943725586,0.8392353564007903
26,1,Decision Tree,0,0.3,0.740251949610078,0.7402060214500673,0.43479442596435547,0.7402060214500673
27,1,RandomForest,0,0.3,0.7744451109778044,0.7672384024622471,1.0900332927703857,0.7672384024622471
28,1,AdaBoost (Discrete),0,0.3,0.8110377924415118,0.8102991456946783,170.2395236492157,0.8102991456946783
29,1,AdaBoost (Real),0,0.3,0.8206358728254349,0.8199923374324992,216.95620560646057,0.8199923374324992
30,1,Logistic Regression (Penalty = L2),0,0.3,0.856628674265147,0.8563319124303788,1.0486552715301514,0.8563319124303788
31,1,Naive Bayes,0,0.3,0.8140371925614877,0.7990369129940008,0.2680957317352295,0.7990369129940008
32,1,KNeighbors Classifier,1,0.3,0.8062387522495501,0.8059615208431312,7.5329811573028564,0.8059615208431312
33,1,SVC Classifier,1,0.3,0.8446310737852429,0.8400098799568633,14.455385446548462,0.8400098799568633
34,1,Decision Tree,1,0.3,0.7420515896820636,0.7419391045149646,0.5345518589019775,0.7419391045149646
35,1,RandomForest,1,0.3,0.7474505098980204,0.7355459114395709,1.5752720832824707,0.7355459114395709
36,1,AdaBoost (Discrete),1,0.3,0.8104379124175165,0.8083508881166052,198.45620155334473,0.8083508881166052
37,1,AdaBoost (Real),1,0.3,0.8020395920815837,0.7990814158180306,211.06755876541138,0.7990814158180306
38,1,Logistic Regression (Penalty = L2),1,0.3,0.856628674265147,0.8565198953967875,1.0961685180664062,0.8565198953967875
39,1,Naive Bayes,1,0.3,0.8146370725854829,0.801531808472504,0.275104284286499,0.801531808472504
40,1,KNeighbors Classifier,2,0.3,0.8325330132052821,0.8324072577089544,6.231127977371216,0.8324072577089544
41,1,SVC Classifier,2,0.3,0.8505402160864346,0.84468475140009,12.405635118484497,0.84468475140009
42,1,Decision Tree,2,0.3,0.7496998799519808,0.7497332488392056,0.36051511764526367,0.7497332488392056
43,1,RandomForest,2,0.3,0.7707082833133253,0.7603951863953522,1.0730249881744385,0.7603951863953522
44,1,AdaBoost (Discrete),2,0.3,0.8367346938775511,0.8339867500904866,211.10930061340332,0.8339867500904866
45,1,AdaBoost (Real),2,0.3,0.8325330132052821,0.8281794796065592,292.99655294418335,0.8281794796065592
46,1,Logistic Regression (Penalty = L2),2,0.3,0.8613445378151261,0.8613090310067498,1.0986614227294922,0.8613090310067498
47,1,Naive Bayes,2,0.3,0.8217286914765907,0.8056486754422577,0.33538389205932617,0.8056486754422577
48,2,KNeighbors Classifier,0,0.3,0.6730653869226155,0.6687371557678884,11.566076040267944,0.6687371557678884
49,2,SVC Classifier,0,0.3,0.7198560287942412,0.6437981344427148,20.797227144241333,0.6437981344427148
50,2,Decision Tree,0,0.3,0.6274745050989802,0.6257897736190443,0.6399505138397217,0.6257897736190443
51,2,RandomForest,0,0.3,0.6940611877624475,0.6676623938090223,1.79768967628479,0.6676623938090223
52,2,AdaBoost (Discrete),0,0.3,0.6274745050989802,0.6117922297065908,230.20293831825256,0.6117922297065908
53,2,AdaBoost (Real),0,0.3,0.6760647870425914,0.6723879109857057,254.59263563156128,0.6723879109857057
54,2,Logistic Regression (Penalty = L2),0,0.3,0.7690461907618477,0.7634830578912248,1.0001773834228516,0.7634830578912248
55,2,Naive Bayes,0,0.3,0.7000599880023995,0.6329260976739713,0.15055441856384277,0.6329260976739713
56,2,KNeighbors Classifier,1,0.3,0.6598680263947211,0.6534696491860124,10.361751556396484,0.6534696491860124
57,2,SVC Classifier,1,0.3,0.6940611877624475,0.609835155057399,19.34549069404602,0.609835155057399
58,2,Decision Tree,1,0.3,0.6172765446910617,0.6161069707935533,0.5926110744476318,0.6161069707935533
59,2,RandomForest,1,0.3,0.6712657468506299,0.6199157109713604,1.8961875438690186,0.6199157109713604
60,2,AdaBoost (Discrete),1,0.3,0.6340731853629274,0.6194956165623525,220.07382988929749,0.6194956165623525
61,2,AdaBoost (Real),1,0.3,0.6400719856028795,0.6320696716459644,262.1680736541748,0.6320696716459644
62,2,Logistic Regression (Penalty = L2),1,0.3,0.7534493101379725,0.7485462882437758,1.2394251823425293,0.7485462882437758
63,2,Naive Bayes,1,0.3,0.6760647870425914,0.6018688209540676,0.3590521812438965,0.6018688209540676
64,2,KNeighbors Classifier,2,0.3,0.6698679471788715,0.664911121310347,14.155081510543823,0.664911121310347
65,2,SVC Classifier,2,0.3,0.7244897959183674,0.6580685024033455,14.461369752883911,0.6580685024033455
66,2,Decision Tree,2,0.3,0.6446578631452581,0.642453137203746,0.5297996997833252,0.642453137203746
67,2,RandomForest,2,0.3,0.6992797118847539,0.6795807005225247,2.0695106983184814,0.6795807005225247
68,2,AdaBoost (Discrete),2,0.3,0.6554621848739496,0.6426967805422662,252.82593822479248,0.6426967805422662
69,2,AdaBoost (Real),2,0.3,0.6932773109243697,0.6924518945620262,272.9155697822571,0.6924518945620262
70,2,Logistic Regression (Penalty = L2),2,0.3,0.7701080432172869,0.7680199426196894,0.6255478858947754,0.7680199426196894
71,2,Naive Bayes,2,0.3,0.7100840336134454,0.6504347376413868,0.1509404182434082,0.6504347376413868
72,3,KNeighbors Classifier,0,0.3,0.8122375524895021,0.8119797605026425,3.8530633449554443,0.8119797605026425
73,3,SVC Classifier,0,0.3,0.8338332333533294,0.8269970685261346,13.534589052200317,0.8269970685261346
74,3,Decision Tree,0,0.3,0.749250149970006,0.749114661238654,0.6054046154022217,0.749114661238654
75,3,RandomForest,0,0.3,0.7426514697060588,0.7285451152558448,2.226706027984619,0.7285451152558448
76,3,AdaBoost (Discrete),0,0.3,0.7948410317936413,0.7916079643372704,203.79119682312012,0.7916079643372704
77,3,AdaBoost (Real),0,0.3,0.8104379124175165,0.8088495661618492,217.05656838417053,0.8088495661618492
78,3,Logistic Regression (Penalty = L2),0,0.3,0.8572285542891421,0.8572135280586797,1.198730707168579,0.8572135280586797
79,3,Naive Bayes,0,0.3,0.8038392321535693,0.7842166987499664,0.28301000595092773,0.7842166987499664
80,3,KNeighbors Classifier,1,0.3,0.7864427114577085,0.786314262191196,5.826007843017578,0.786314262191196
81,3,SVC Classifier,1,0.3,0.8344331133773245,0.8277969603681379,13.141870498657227,0.8277969603681379
82,3,Decision Tree,1,0.3,0.7360527894421116,0.7358748852252115,0.42043495178222656,0.7358748852252115
83,3,RandomForest,1,0.3,0.734253149370126,0.7238846056915659,1.586543321609497,0.7238846056915659
84,3,AdaBoost (Discrete),1,0.3,0.8026394721055788,0.8008916011516625,186.19816398620605,0.8008916011516625
85,3,AdaBoost (Real),1,0.3,0.7804439112177565,0.7766697335071053,229.57499957084656,0.7766697335071053
86,3,Logistic Regression (Penalty = L2),1,0.3,0.8398320335932813,0.8396584188579429,1.0827076435089111,0.8396584188579429
87,3,Naive Bayes,1,0.3,0.7870425914817036,0.7662290489620307,0.32407212257385254,0.7662290489620307
88,3,KNeighbors Classifier,2,0.3,0.8211284513805522,0.8207063769128168,5.760465860366821,0.8207063769128168
89,3,SVC Classifier,2,0.3,0.8385354141656662,0.8307335031619025,15.323684453964233,0.8307335031619025
90,3,Decision Tree,2,0.3,0.7665066026410564,0.7665455002054339,0.49264979362487793,0.7665455002054339
91,3,RandomForest,2,0.3,0.790516206482593,0.7775180231969175,1.6952590942382812,0.7775180231969175
92,3,AdaBoost (Discrete),2,0.3,0.8091236494597839,0.8047154893871633,197.36148047447205,0.8047154893871633
93,3,AdaBoost (Real),2,0.3,0.8253301320528211,0.8220102142728001,235.4403440952301,0.8220102142728001
94,3,Logistic Regression (Penalty = L2),2,0.3,0.8547418967587035,0.8546520796267838,0.7733523845672607,0.8546520796267838
95,3,Naive Bayes,2,0.3,0.8109243697478992,0.7911678850067111,0.31131434440612793,0.7911678850067111
96,4,KNeighbors Classifier,0,0.3,0.6934613077384523,0.6895041700805322,2.002119779586792,0.6895041700805322
97,4,SVC Classifier,0,0.3,0.7060587882423516,0.6160368869605298,14.328659296035767,0.6160368869605298
98,4,Decision Tree,0,0.3,0.6106778644271146,0.6088352383198641,0.4609959125518799,0.6088352383198641
99,4,RandomForest,0,0.3,0.671865626874625,0.6084608654702,1.6632039546966553,0.6084608654702
100,4,AdaBoost (Discrete),0,0.3,0.5650869826034793,0.5255966409200046,164.18137645721436,0.5255966409200046
101,4,AdaBoost (Real),0,0.3,0.6220755848830234,0.6165437534284629,188.9450376033783,0.6165437534284629
102,4,Logistic Regression (Penalty = L2),0,0.3,0.7618476304739052,0.7565453220739481,0.8979048728942871,0.7565453220739481
103,4,Naive Bayes,0,0.3,0.6904619076184763,0.6216363603032509,0.1577155590057373,0.6216363603032509
104,4,KNeighbors Classifier,1,0.3,0.6814637072585483,0.6756876151707563,2.3148317337036133,0.6756876151707563
105,4,SVC Classifier,1,0.3,0.6820635872825435,0.5812643310815281,15.579544305801392,0.5812643310815281
106,4,Decision Tree,1,0.3,0.6226754649070186,0.6195056012021077,0.5296425819396973,0.6195056012021077
107,4,RandomForest,1,0.3,0.6466706658668266,0.5996888612856834,1.736757755279541,0.5996888612856834
108,4,AdaBoost (Discrete),1,0.3,0.5590881823635273,0.5258836833013929,143.5246443748474,0.5258836833013929
109,4,AdaBoost (Real),1,0.3,0.5584883023395321,0.5186135624880694,173.9554567337036,0.5186135624880694
110,4,Logistic Regression (Penalty = L2),1,0.3,0.7426514697060588,0.7367062394417581,0.7167320251464844,0.7367062394417581
111,4,Naive Bayes,1,0.3,0.6658668266346731,0.5905504569108365,0.27111244201660156,0.5905504569108365
112,4,KNeighbors Classifier,2,0.3,0.6812725090036015,0.674137772222079,2.0071215629577637,0.674137772222079
113,4,SVC Classifier,2,0.3,0.7166866746698679,0.6376131945607161,12.924185276031494,0.6376131945607161
114,4,Decision Tree,2,0.3,0.6362545018007203,0.6334774866660533,0.2871701717376709,0.6334774866660533
115,4,RandomForest,2,0.3,0.6884753901560624,0.6427582067526592,1.4733021259307861,0.6427582067526592
116,4,AdaBoost (Discrete),2,0.3,0.5834333733493398,0.5517862549961274,152.09094166755676,0.5517862549961274
117,4,AdaBoost (Real),2,0.3,0.6398559423769508,0.6336001164001256,187.30384230613708,0.6336001164001256
118,4,Logistic Regression (Penalty = L2),2,0.3,0.741296518607443,0.7367897127361263,0.7742888927459717,0.7367897127361263
119,4,Naive Bayes,2,0.3,0.6920768307322929,0.6282088596698782,0.13273262977600098,0.6282088596698782
120,5,KNeighbors Classifier,0,0.3,0.6838632273545291,0.6802206578768865,1.267214298248291,0.6802206578768865
121,5,SVC Classifier,0,0.3,0.7066586682663467,0.6391502820796391,13.137861728668213,0.6391502820796391
122,5,Decision Tree,0,0.3,0.6532693461307738,0.651344089480292,0.4552881717681885,0.651344089480292
123,5,RandomForest,0,0.3,0.6814637072585483,0.6159622700106483,1.7013435363769531,0.6159622700106483
124,5,AdaBoost (Discrete),0,0.3,0.5824835032993402,0.5576477615251912,122.1087749004364,0.5576477615251912
125,5,AdaBoost (Real),0,0.3,0.6040791841631674,0.585073914554711,169.8339684009552,0.585073914554711
126,5,Logistic Regression (Penalty = L2),0,0.3,0.755248950209958,0.7495714564104646,0.9167313575744629,0.7495714564104646
127,5,Naive Bayes,0,0.3,0.7012597480503899,0.6484110182001858,0.1495671272277832,0.6484110182001858
128,5,KNeighbors Classifier,1,0.3,0.674865026994601,0.6710712684947208,1.2077271938323975,0.6710712684947208
129,5,SVC Classifier,1,0.3,0.6916616676664668,0.6143376970225788,14.852953910827637,0.6143376970225788
130,5,Decision Tree,1,0.3,0.6496700659868027,0.6483413144376674,0.5134749412536621,0.6483413144376674
131,5,RandomForest,1,0.3,0.6676664667066586,0.618566731675159,1.3990237712860107,0.618566731675159
132,5,AdaBoost (Discrete),1,0.3,0.5770845830833833,0.5490087953116569,121.40508246421814,0.5490087953116569
133,5,AdaBoost (Real),1,0.3,0.6172765446910617,0.6031606432209583,146.5025713443756,0.6031606432209583
134,5,Logistic Regression (Penalty = L2),1,0.3,0.7378524295140971,0.7329269901124875,0.7649221420288086,0.7329269901124875
135,5,Naive Bayes,1,0.3,0.6922615476904619,0.6393569876540656,0.3058009147644043,0.6393569876540656
136,5,KNeighbors Classifier,2,0.3,0.6962785114045619,0.6943163241272751,1.2913353443145752,0.6943163241272751
137,5,SVC Classifier,2,0.3,0.7286914765906363,0.6735467561462012,11.18420124053955,0.6735467561462012
138,5,Decision Tree,2,0.3,0.6542617046818727,0.6535700426674227,0.43277859687805176,0.6535700426674227
139,5,RandomForest,2,0.3,0.695078031212485,0.6483811578852068,1.28395414352417,0.6483811578852068
140,5,AdaBoost (Discrete),2,0.3,0.5942376950780313,0.567080522606752,120.32916116714478,0.567080522606752
141,5,AdaBoost (Real),2,0.3,0.673469387755102,0.6733746506921156,154.05997967720032,0.6733746506921156
142,5,Logistic Regression (Penalty = L2),2,0.3,0.7599039615846338,0.7582546129625353,0.6582896709442139,0.7582546129625353
143,5,Naive Bayes,2,0.3,0.7148859543817527,0.669131827595161,0.26636314392089844,0.669131827595161
144,6,KNeighbors Classifier,0,0.3,0.8086382723455309,0.8086699768216675,7.620558023452759,0.8086699768216675
145,6,SVC Classifier,0,0.3,0.8356328734253149,0.826111067554682,14.896918296813965,0.826111067554682
146,6,Decision Tree,0,0.3,0.7630473905218956,0.7629335761433258,0.5403637886047363,0.7629335761433258
147,6,RandomForest,0,0.3,0.749250149970006,0.7251887122818879,1.849076271057129,0.7251887122818879
148,6,AdaBoost (Discrete),0,0.3,0.8116376724655069,0.80998025256976,215.5990433692932,0.80998025256976
149,6,AdaBoost (Real),0,0.3,0.8140371925614877,0.8120437110235419,1307.111098766327,0.8120437110235419
150,6,Logistic Regression (Penalty = L2),0,0.3,0.862627474505099,0.8624225699712091,1.4541475772857666,0.8624225699712091
151,6,Naive Bayes,0,0.3,0.794241151769646,0.7653204191777547,0.33151817321777344,0.7653204191777547
152,6,KNeighbors Classifier,1,0.3,0.7906418716256749,0.7904888908425346,7.2265496253967285,0.7904888908425346
153,6,SVC Classifier,1,0.3,0.8344331133773245,0.8250854100193232,12.808825492858887,0.8250854100193232
154,6,Decision Tree,1,0.3,0.7366526694661067,0.7365881491489871,0.3914632797241211,0.7365881491489871
155,6,RandomForest,1,0.3,0.7450509898020395,0.7249003556983932,1.4574687480926514,0.7249003556983932
156,6,AdaBoost (Discrete),1,0.3,0.8092381523695261,0.8086337207101333,179.55782675743103,0.8086337207101333
157,6,AdaBoost (Real),1,0.3,0.8026394721055788,0.799540619545418,190.99394392967224,0.799540619545418
158,6,Logistic Regression (Penalty = L2),1,0.3,0.8572285542891421,0.8569523487363506,0.8783926963806152,0.8569523487363506
159,6,Naive Bayes,1,0.3,0.785242951409718,0.7547415113195142,0.21497583389282227,0.7547415113195142
160,6,KNeighbors Classifier,2,0.3,0.8337334933973589,0.8337208034385253,6.878535270690918,0.8337208034385253
161,6,SVC Classifier,2,0.3,0.8379351740696278,0.8286895755288962,12.761611700057983,0.8286895755288962
162,6,Decision Tree,2,0.3,0.7448979591836735,0.7448834206515302,0.5410904884338379,0.7448834206515302
163,6,RandomForest,2,0.3,0.7725090036014406,0.7555409819033648,1.3430781364440918,0.7555409819033648
164,6,AdaBoost (Discrete),2,0.3,0.8343337334933973,0.8318118306528456,172.75744009017944,0.8318118306528456
165,6,AdaBoost (Real),2,0.3,0.8325330132052821,0.8301998054664103,188.86501097679138,0.8301998054664103
166,6,Logistic Regression (Penalty = L2),2,0.3,0.865546218487395,0.8655082478099856,0.7681798934936523,0.8655082478099856
167,6,Naive Bayes,2,0.3,0.7935174069627852,0.7597732467800339,0.19882535934448242,0.7597732467800339
168,7,KNeighbors Classifier,0,0.3,0.7984403119376124,0.79820912082716,13.295359373092651,0.79820912082716
169,7,SVC Classifier,0,0.3,0.8530293941211757,0.8474304246005804,13.882638216018677,0.8474304246005804
170,7,Decision Tree,0,0.3,0.74625074985003,0.7462632673855251,0.493847131729126,0.7462632673855251
171,7,RandomForest,0,0.3,0.7720455908818237,0.769440800732812,1.3969476222991943,0.769440800732812
172,7,AdaBoost (Discrete),0,0.3,0.8224355128974206,0.8219781781652663,203.3591513633728,0.8219781781652663
173,7,AdaBoost (Real),0,0.3,0.8242351529694061,0.8234761732524039,209.7709710597992,0.8234761732524039
174,7,Logistic Regression (Penalty = L2),0,0.3,0.865626874625075,0.865451452145108,0.8951804637908936,0.865451452145108
175,7,Naive Bayes,0,0.3,0.8044391121775645,0.7797893409551341,0.15628814697265625,0.7797893409551341
176,7,KNeighbors Classifier,1,0.3,0.7996400719856028,0.7994890936449026,13.000446796417236,0.7994890936449026
177,7,SVC Classifier,1,0.3,0.850629874025195,0.8447117616400552,14.033026933670044,0.8447117616400552
178,7,Decision Tree,1,0.3,0.7258548290341932,0.7256893260096106,0.3886697292327881,0.7256893260096106
179,7,RandomForest,1,0.3,0.7474505098980204,0.737590687370211,1.2789785861968994,0.737590687370211
180,7,AdaBoost (Discrete),1,0.3,0.8248350329934013,0.824570341836536,197.25049233436584,0.824570341836536
181,7,AdaBoost (Real),1,0.3,0.8092381523695261,0.8077065925524712,200.5027048587799,0.8077065925524712
182,7,Logistic Regression (Penalty = L2),1,0.3,0.862627474505099,0.8625544430328572,0.9147379398345947,0.8625544430328572
183,7,Naive Bayes,1,0.3,0.7984403119376124,0.7745662553407251,0.28235793113708496,0.7745662553407251
184,7,KNeighbors Classifier,2,0.3,0.819327731092437,0.819109549194946,12.706465721130371,0.819109549194946
185,7,SVC Classifier,2,0.3,0.8547418967587035,0.8480390597347272,13.114583492279053,0.8480390597347272
186,7,Decision Tree,2,0.3,0.7454981992797118,0.745151039564247,0.4549531936645508,0.745151039564247
187,7,RandomForest,2,0.3,0.7725090036014406,0.7600779011648235,1.1148676872253418,0.7600779011648235
188,7,AdaBoost (Discrete),2,0.3,0.8523409363745498,0.8507095224143708,185.53958702087402,0.8507095224143708
189,7,AdaBoost (Real),2,0.3,0.8433373349339736,0.8407521195847668,189.9494743347168,0.8407521195847668
190,7,Logistic Regression (Penalty = L2),2,0.3,0.8721488595438175,0.8721153297211617,0.7805862426757812,0.8721153297211617
191,7,Naive Bayes,2,0.3,0.8109243697478992,0.7842845152399078,0.17218852043151855,0.7842845152399078
192,8,KNeighbors Classifier,0,0.3,0.6778644271145771,0.6743268750212159,0.6702916622161865,0.6743268750212159
193,8,SVC Classifier,0,0.3,0.6976604679064187,0.6157887083870185,8.174298286437988,0.6157887083870185
194,8,Decision Tree,0,0.3,0.6352729454109178,0.6336159664111288,0.26711106300354004,0.6336159664111288
195,8,RandomForest,0,0.3,0.6982603479304139,0.6707922108390808,0.9395315647125244,0.6707922108390808
196,8,AdaBoost (Discrete),0,0.3,0.5482903419316136,0.5069486413948827,67.8380217552185,0.5069486413948827
197,8,AdaBoost (Real),0,0.3,0.6172765446910617,0.6050414091691961,78.27996587753296,0.6050414091691961
198,8,Logistic Regression (Penalty = L2),0,0.3,0.752249550089982,0.7481208770114348,0.33523035049438477,0.7481208770114348
199,8,Naive Bayes,0,0.3,0.6922615476904619,0.6366737277884782,0.1533808708190918,0.6366737277884782
200,8,KNeighbors Classifier,1,0.3,0.6790641871625674,0.6740084886629919,0.4967060089111328,0.6740084886629919
201,8,SVC Classifier,1,0.3,0.6760647870425914,0.5794984939525156,6.552049875259399,0.5794984939525156
202,8,Decision Tree,1,0.3,0.6226754649070186,0.620814173943681,0.14748883247375488,0.620814173943681
203,8,RandomForest,1,0.3,0.6550689862027594,0.6175094090228247,0.716590166091919,0.6175094090228247
204,8,AdaBoost (Discrete),1,0.3,0.5566886622675465,0.5317857402091318,65.5753288269043,0.5317857402091318
205,8,AdaBoost (Real),1,0.3,0.5932813437312537,0.5878257006329696,77.92538976669312,0.5878257006329696
206,8,Logistic Regression (Penalty = L2),1,0.3,0.7270545890821836,0.7214221859354358,0.3377420902252197,0.7214221859354358
207,8,Naive Bayes,1,0.3,0.6760647870425914,0.6172738881327214,0.16999316215515137,0.6172738881327214
208,8,KNeighbors Classifier,2,0.3,0.6752701080432173,0.6727699318429922,0.5321869850158691,0.6727699318429922
209,8,SVC Classifier,2,0.3,0.7034813925570228,0.6284412439235352,7.024444818496704,0.6284412439235352
210,8,Decision Tree,2,0.3,0.6422569027611045,0.6416265477120381,0.15445923805236816,0.6416265477120381
211,8,RandomForest,2,0.3,0.6794717887154862,0.6246558150387547,0.8933694362640381,0.6246558150387547
212,8,AdaBoost (Discrete),2,0.3,0.5846338535414166,0.5725304577615536,63.834648847579956,0.5725304577615536
213,8,AdaBoost (Real),2,0.3,0.6176470588235294,0.6113708498062513,78.57471895217896,0.6113708498062513
214,8,Logistic Regression (Penalty = L2),2,0.3,0.7394957983193278,0.7359724554413809,0.3828775882720947,0.7359724554413809
215,8,Naive Bayes,2,0.3,0.7010804321728692,0.6510824190526464,0.07635998725891113,0.6510824190526464
