,feat_set_id,classifier,fold_id,feat_th,score,geo_score,exec_t,geo_score_woz
0,0,KNeighbors Classifier,0,0.7,0.9333333333333333,0.9410360288810286,0.06624555587768555,0.9410360288810286
1,0,SVC Classifier,0,0.7,0.4166666666666667,0.22360679774997896,0.05226874351501465,0.0
2,0,Decision Tree,0,0.7,0.9,0.900068581879409,0.0014295578002929688,0.900068581879409
3,0,RandomForest,0,0.7,0.85,0.8549879733383485,0.27161073684692383,0.8549879733383485
4,0,AdaBoost (Discrete),0,0.7,0.9166666666666666,0.9210078746600967,15.660003662109375,0.9210078746600967
5,0,AdaBoost (Real),0,0.7,0.95,0.9564655913861946,14.936216115951538,0.9564655913861946
6,0,Logistic Regression (Penalty = L2),0,0.7,0.9666666666666667,0.9714127805419094,0.08618378639221191,0.9714127805419094
7,0,Naive Bayes,0,0.7,0.9333333333333333,0.9410360288810286,0.03153705596923828,0.9410360288810286
8,0,KNeighbors Classifier,1,0.7,0.9833333333333333,0.9859136166167861,0.002366781234741211,0.9859136166167861
9,0,SVC Classifier,1,0.7,0.4,1.0,0.030884742736816406,0.0
10,0,Decision Tree,1,0.7,0.8333333333333334,0.8083117812890779,0.02983999252319336,0.8083117812890779
11,0,RandomForest,1,0.7,0.9166666666666666,0.8825870838315157,0.17818832397460938,0.8825870838315157
12,0,AdaBoost (Discrete),1,0.7,0.9,0.8879040017426008,12.875808477401733,0.8879040017426008
13,0,AdaBoost (Real),1,0.7,0.85,0.8358603846235818,14.313775539398193,0.8358603846235818
14,0,Logistic Regression (Penalty = L2),1,0.7,0.9333333333333333,0.9339246536301676,0.0347442626953125,0.9339246536301676
15,0,Naive Bayes,1,0.7,0.9666666666666667,0.9654893846056297,0.031032085418701172,0.9654893846056297
16,0,KNeighbors Classifier,2,0.7,0.9655172413793104,0.9701312318500641,0.035738229751586914,0.9701312318500641
17,0,SVC Classifier,2,0.7,0.39655172413793105,1.0,0.03497433662414551,0.0
18,0,Decision Tree,2,0.7,0.9655172413793104,0.9701312318500641,0.002000093460083008,0.9701312318500641
19,0,RandomForest,2,0.7,1.0,1.0,0.25917935371398926,1.0
20,0,AdaBoost (Discrete),2,0.7,0.9827586206896551,0.9852919811325488,13.326354503631592,0.9852919811325488
21,0,AdaBoost (Real),2,0.7,0.9310344827586207,0.932525134875023,14.86186170578003,0.932525134875023
22,0,Logistic Regression (Penalty = L2),2,0.7,0.9655172413793104,0.9701312318500641,0.0030739307403564453,0.9701312318500641
23,0,Naive Bayes,2,0.7,0.9655172413793104,0.967693705920519,0.03749561309814453,0.967693705920519
24,1,KNeighbors Classifier,0,0.7,0.9333333333333333,0.9410360288810286,0.03555607795715332,0.9410360288810286
25,1,SVC Classifier,0,0.7,0.45,0.3872983346207417,0.03423309326171875,0.0
26,1,Decision Tree,0,0.7,0.8,0.7636393430362007,0.03375816345214844,0.7636393430362007
27,1,RandomForest,0,0.7,0.9166666666666666,0.9250831838185912,0.21450471878051758,0.9250831838185912
28,1,AdaBoost (Discrete),0,0.7,0.9166666666666666,0.9210078746600967,12.259862661361694,0.9210078746600967
29,1,AdaBoost (Real),0,0.7,0.9166666666666666,0.9210078746600967,12.883394002914429,0.9210078746600967
30,1,Logistic Regression (Penalty = L2),0,0.7,0.9833333333333333,0.9859136166167861,0.03060770034790039,0.9859136166167861
31,1,Naive Bayes,0,0.7,0.9666666666666667,0.9714127805419094,0.03134965896606445,0.9714127805419094
32,1,KNeighbors Classifier,1,0.7,0.9666666666666667,0.9691999875015047,0.028126239776611328,0.9691999875015047
33,1,SVC Classifier,1,0.7,0.4,1.0,0.0022208690643310547,0.0
34,1,Decision Tree,1,0.7,0.8333333333333334,0.8168569365543992,0.030092954635620117,0.8168569365543992
35,1,RandomForest,1,0.7,0.9333333333333333,0.9316299892151044,0.2034623622894287,0.9316299892151044
36,1,AdaBoost (Discrete),1,0.7,0.9166666666666666,0.9085602964160698,11.767509460449219,0.9085602964160698
37,1,AdaBoost (Real),1,0.7,0.85,0.8358603846235818,16.750528812408447,0.8358603846235818
38,1,Logistic Regression (Penalty = L2),1,0.7,0.9666666666666667,0.9691999875015047,0.038822174072265625,0.9691999875015047
39,1,Naive Bayes,1,0.7,0.9666666666666667,0.9654893846056297,0.03924369812011719,0.9654893846056297
40,1,KNeighbors Classifier,2,0.7,1.0,1.0,0.039864301681518555,1.0
41,1,SVC Classifier,2,0.7,0.39655172413793105,1.0,0.03795742988586426,0.0
42,1,Decision Tree,2,0.7,0.8620689655172413,0.8702359432298691,0.0011293888092041016,0.8702359432298691
43,1,RandomForest,2,0.7,1.0,1.0,0.2888963222503662,1.0
44,1,AdaBoost (Discrete),2,0.7,0.9655172413793104,0.967693705920519,15.225805044174194,0.967693705920519
45,1,AdaBoost (Real),2,0.7,0.9655172413793104,0.967693705920519,17.0527925491333,0.967693705920519
46,1,Logistic Regression (Penalty = L2),2,0.7,1.0,1.0,0.07147932052612305,1.0
47,1,Naive Bayes,2,0.7,0.9827586206896551,0.9821390252341226,0.05467391014099121,0.9821390252341226
48,2,KNeighbors Classifier,0,0.7,0.9,0.9085602964160698,0.05184459686279297,0.9085602964160698
49,2,SVC Classifier,0,0.7,0.4,1.0,0.0019292831420898438,0.0
50,2,Decision Tree,0,0.7,0.7166666666666667,0.696953883947433,0.04543471336364746,0.696953883947433
51,2,RandomForest,0,0.7,0.85,0.8549879733383485,0.331204891204834,0.8549879733383485
52,2,AdaBoost (Discrete),0,0.7,0.9166666666666666,0.9210078746600967,17.63239574432373,0.9210078746600967
53,2,AdaBoost (Real),0,0.7,0.9333333333333333,0.9410360288810286,19.662458181381226,0.9410360288810286
54,2,Logistic Regression (Penalty = L2),0,0.7,0.9333333333333333,0.9410360288810286,0.0026483535766601562,0.9410360288810286
55,2,Naive Bayes,0,0.7,0.9166666666666666,0.9250831838185912,0.04744410514831543,0.9250831838185912
56,2,KNeighbors Classifier,1,0.7,1.0,1.0,0.04367208480834961,1.0
57,2,SVC Classifier,1,0.7,0.4,1.0,0.04693865776062012,0.0
58,2,Decision Tree,1,0.7,0.8166666666666667,0.7953506357775911,0.0011219978332519531,0.7953506357775911
59,2,RandomForest,1,0.7,0.95,0.933127789204312,0.2838780879974365,0.933127789204312
60,2,AdaBoost (Discrete),1,0.7,0.8833333333333333,0.8662391053409028,17.17942214012146,0.8662391053409028
61,2,AdaBoost (Real),1,0.7,0.85,0.8254818122236567,20.133714199066162,0.8254818122236567
62,2,Logistic Regression (Penalty = L2),1,0.7,0.95,0.9472682371859096,0.05107569694519043,0.9472682371859096
63,2,Naive Bayes,1,0.7,0.9333333333333333,0.9283177667225558,0.04840087890625,0.9283177667225558
64,2,KNeighbors Classifier,2,0.7,0.9827586206896551,0.9852919811325488,0.04815936088562012,0.9852919811325488
65,2,SVC Classifier,2,0.7,0.39655172413793105,1.0,0.0017085075378417969,0.0
66,2,Decision Tree,2,0.7,0.9482758620689655,0.9470981939677545,0.04598426818847656,0.9470981939677545
67,2,RandomForest,2,0.7,1.0,1.0,0.3628382682800293,1.0
68,2,AdaBoost (Discrete),2,0.7,0.9655172413793104,0.967693705920519,18.314138889312744,0.967693705920519
69,2,AdaBoost (Real),2,0.7,0.8793103448275862,0.8858189155864656,23.177119970321655,0.8858189155864656
70,2,Logistic Regression (Penalty = L2),2,0.7,1.0,1.0,0.08347630500793457,1.0
71,2,Naive Bayes,2,0.7,0.9655172413793104,0.967693705920519,0.07453727722167969,0.967693705920519
72,3,KNeighbors Classifier,0,0.7,0.95,0.9564655913861946,0.12085962295532227,0.9564655913861946
73,3,SVC Classifier,0,0.7,0.45,0.3872983346207417,0.06279420852661133,0.0
74,3,Decision Tree,0,0.7,0.8333333333333334,0.8381526310717358,0.061754465103149414,0.8381526310717358
75,3,RandomForest,0,0.7,0.9166666666666666,0.9250831838185912,0.3876519203186035,0.9250831838185912
76,3,AdaBoost (Discrete),0,0.7,0.9333333333333333,0.9361090484023133,24.15173029899597,0.9361090484023133
77,3,AdaBoost (Real),0,0.7,0.9,0.900068581879409,25.453242778778076,0.900068581879409
78,3,Logistic Regression (Penalty = L2),0,0.7,0.9666666666666667,0.9714127805419094,0.002529144287109375,0.9714127805419094
79,3,Naive Bayes,0,0.7,0.9333333333333333,0.9410360288810286,0.0018057823181152344,0.9410360288810286
80,3,KNeighbors Classifier,1,0.7,0.9666666666666667,0.9691999875015047,0.05956101417541504,0.9691999875015047
81,3,SVC Classifier,1,0.7,0.4,1.0,0.05942487716674805,0.0
82,3,Decision Tree,1,0.7,0.85,0.8315517494203829,0.0015263557434082031,0.8315517494203829
83,3,RandomForest,1,0.7,0.8666666666666667,0.8434326653017493,0.5065517425537109,0.8434326653017493
84,3,AdaBoost (Discrete),1,0.7,0.8666666666666667,0.8434326653017493,27.045377254486084,0.8434326653017493
85,3,AdaBoost (Real),1,0.7,0.8666666666666667,0.8540369292015386,27.901017665863037,0.8540369292015386
86,3,Logistic Regression (Penalty = L2),1,0.7,0.9666666666666667,0.9691999875015047,0.0027947425842285156,0.9691999875015047
87,3,Naive Bayes,1,0.7,0.9666666666666667,0.9654893846056297,0.05516529083251953,0.9654893846056297
88,3,KNeighbors Classifier,2,0.7,1.0,1.0,0.05596613883972168,1.0
89,3,SVC Classifier,2,0.7,0.39655172413793105,1.0,0.044403791427612305,0.0
90,3,Decision Tree,2,0.7,0.9827586206896551,0.9821390252341226,0.0018351078033447266,0.9821390252341226
91,3,RandomForest,2,0.7,1.0,1.0,0.5368573665618896,1.0
92,3,AdaBoost (Discrete),2,0.7,0.9827586206896551,0.9821390252341226,31.366523265838623,0.9821390252341226
93,3,AdaBoost (Real),2,0.7,0.9827586206896551,0.9821390252341226,32.967544078826904,0.9821390252341226
94,3,Logistic Regression (Penalty = L2),2,0.7,1.0,1.0,0.08995628356933594,1.0
95,3,Naive Bayes,2,0.7,0.9827586206896551,0.9821390252341226,0.07461118698120117,0.9821390252341226
96,4,KNeighbors Classifier,0,0.7,0.8833333333333333,0.8892233261225158,0.0839395523071289,0.8892233261225158
97,4,SVC Classifier,0,0.7,0.4,1.0,0.0025506019592285156,0.0
98,4,Decision Tree,0,0.7,0.8,0.7867500769388359,0.0739145278930664,0.7867500769388359
99,4,RandomForest,0,0.7,0.9333333333333333,0.9410360288810286,0.5720014572143555,0.9410360288810286
100,4,AdaBoost (Discrete),0,0.7,0.9166666666666666,0.9210078746600967,30.062376022338867,0.9210078746600967
101,4,AdaBoost (Real),0,0.7,0.95,0.9564655913861946,30.64620327949524,0.9564655913861946
102,4,Logistic Regression (Penalty = L2),0,0.7,0.9833333333333333,0.9859136166167861,0.07477903366088867,0.9859136166167861
103,4,Naive Bayes,0,0.7,0.9333333333333333,0.9410360288810286,0.010547161102294922,0.9410360288810286
104,4,KNeighbors Classifier,1,0.7,1.0,1.0,0.07175636291503906,1.0
105,4,SVC Classifier,1,0.7,0.4,1.0,0.0024962425231933594,0.0
106,4,Decision Tree,1,0.7,0.9333333333333333,0.927006439217119,0.06200718879699707,0.927006439217119
107,4,RandomForest,1,0.7,0.9166666666666666,0.915241126759053,0.5572009086608887,0.915241126759053
108,4,AdaBoost (Discrete),1,0.7,0.9,0.8879040017426008,25.290590524673462,0.8879040017426008
109,4,AdaBoost (Real),1,0.7,0.8166666666666667,0.7836526036203351,36.77166199684143,0.7836526036203351
110,4,Logistic Regression (Penalty = L2),1,0.7,0.9333333333333333,0.9339246536301676,0.09094667434692383,0.9339246536301676
111,4,Naive Bayes,1,0.7,0.95,0.9472682371859096,0.003183126449584961,0.9472682371859096
112,4,KNeighbors Classifier,2,0.7,1.0,1.0,0.09203624725341797,1.0
113,4,SVC Classifier,2,0.7,0.39655172413793105,1.0,0.14899373054504395,0.0
114,4,Decision Tree,2,0.7,0.9137931034482759,0.9215414830498454,0.08635234832763672,0.9215414830498454
115,4,RandomForest,2,0.7,0.9827586206896551,0.9821390252341226,0.5545973777770996,0.9821390252341226
116,4,AdaBoost (Discrete),2,0.7,0.9655172413793104,0.967693705920519,34.81304860115051,0.967693705920519
117,4,AdaBoost (Real),2,0.7,0.9482758620689655,0.9470981939677545,39.21155881881714,0.9470981939677545
118,4,Logistic Regression (Penalty = L2),2,0.7,1.0,1.0,0.09498906135559082,1.0
119,4,Naive Bayes,2,0.7,0.9655172413793104,0.967693705920519,0.09534049034118652,0.967693705920519
120,5,KNeighbors Classifier,0,0.7,0.8833333333333333,0.8892233261225158,0.09177660942077637,0.8892233261225158
121,5,SVC Classifier,0,0.7,0.4,1.0,0.09389233589172363,0.0
122,5,Decision Tree,0,0.7,0.9,0.900068581879409,0.0019555091857910156,0.900068581879409
123,5,RandomForest,0,0.7,0.9333333333333333,0.9410360288810286,0.5962278842926025,0.9410360288810286
124,5,AdaBoost (Discrete),0,0.7,0.9166666666666666,0.9148264275057428,36.07772421836853,0.9148264275057428
125,5,AdaBoost (Real),0,0.7,0.9333333333333333,0.9410360288810286,46.428086280822754,0.9410360288810286
126,5,Logistic Regression (Penalty = L2),0,0.7,0.9833333333333333,0.9859136166167861,0.11857867240905762,0.9859136166167861
127,5,Naive Bayes,0,0.7,0.9333333333333333,0.9410360288810286,0.09108757972717285,0.9410360288810286
128,5,KNeighbors Classifier,1,0.7,1.0,1.0,0.003529787063598633,1.0
129,5,SVC Classifier,1,0.7,0.4,1.0,0.11880826950073242,0.0
130,5,Decision Tree,1,0.7,0.8333333333333334,0.8168569365543992,0.0017311573028564453,0.8168569365543992
131,5,RandomForest,1,0.7,0.9166666666666666,0.915241126759053,0.8121404647827148,0.915241126759053
132,5,AdaBoost (Discrete),1,0.7,0.9,0.8879040017426008,43.941760540008545,0.8879040017426008
133,5,AdaBoost (Real),1,0.7,0.85,0.8254818122236567,45.99930739402771,0.8254818122236567
134,5,Logistic Regression (Penalty = L2),1,0.7,0.9333333333333333,0.9339246536301676,0.002717733383178711,0.9339246536301676
135,5,Naive Bayes,1,0.7,0.95,0.9472682371859096,0.0031588077545166016,0.9472682371859096
136,5,KNeighbors Classifier,2,0.7,1.0,1.0,0.11172795295715332,1.0
137,5,SVC Classifier,2,0.7,0.39655172413793105,1.0,0.0026290416717529297,0.0
138,5,Decision Tree,2,0.7,0.9137931034482759,0.9215414830498455,0.10984635353088379,0.9215414830498455
139,5,RandomForest,2,0.7,0.9827586206896551,0.9821390252341226,0.672482967376709,0.9821390252341226
140,5,AdaBoost (Discrete),2,0.7,0.9655172413793104,0.967693705920519,41.95506525039673,0.967693705920519
141,5,AdaBoost (Real),2,0.7,0.9482758620689655,0.9470981939677545,46.86669850349426,0.9470981939677545
142,5,Logistic Regression (Penalty = L2),2,0.7,1.0,1.0,0.0023260116577148438,1.0
143,5,Naive Bayes,2,0.7,0.9655172413793104,0.967693705920519,0.1113433837890625,0.967693705920519
144,6,KNeighbors Classifier,0,0.7,0.9,0.9085602964160698,0.11154580116271973,0.9085602964160698
145,6,SVC Classifier,0,0.7,0.4,1.0,0.11073803901672363,0.0
146,6,Decision Tree,0,0.7,0.85,0.8549879733383485,0.10592222213745117,0.8549879733383485
147,6,RandomForest,0,0.7,0.9333333333333333,0.9410360288810286,0.7020120620727539,0.9410360288810286
148,6,AdaBoost (Discrete),0,0.7,0.9333333333333333,0.9361090484023133,38.96742868423462,0.9361090484023133
149,6,AdaBoost (Real),0,0.7,0.9333333333333333,0.9410360288810286,39.47905921936035,0.9410360288810286
150,6,Logistic Regression (Penalty = L2),0,0.7,0.95,0.9564655913861946,0.10640263557434082,0.9564655913861946
151,6,Naive Bayes,0,0.7,0.9166666666666666,0.9250831838185912,0.10949254035949707,0.9250831838185912
152,6,KNeighbors Classifier,1,0.7,0.9833333333333333,0.9859136166167861,0.10769796371459961,0.9859136166167861
153,6,SVC Classifier,1,0.7,0.4,1.0,0.002359151840209961,0.0
154,6,Decision Tree,1,0.7,0.85,0.8358603846235818,0.0012180805206298828,0.8358603846235818
155,6,RandomForest,1,0.7,0.9,0.8932667961445252,0.6462080478668213,0.8932667961445252
156,6,AdaBoost (Discrete),1,0.7,0.8833333333333333,0.8521284604293675,34.33657908439636,0.8521284604293675
157,6,AdaBoost (Real),1,0.7,0.85,0.8358603846235818,41.410298109054565,0.8358603846235818
158,6,Logistic Regression (Penalty = L2),1,0.7,0.95,0.9518891309816516,0.0028481483459472656,0.9518891309816516
159,6,Naive Bayes,1,0.7,0.95,0.9472682371859096,0.0027124881744384766,0.9472682371859096
160,6,KNeighbors Classifier,2,0.7,0.9827586206896551,0.9852919811325488,0.11914587020874023,0.9852919811325488
161,6,SVC Classifier,2,0.7,0.39655172413793105,1.0,0.0016074180603027344,0.0
162,6,Decision Tree,2,0.7,0.9827586206896551,0.9852919811325488,0.0015795230865478516,0.9852919811325488
163,6,RandomForest,2,0.7,1.0,1.0,0.6492245197296143,1.0
164,6,AdaBoost (Discrete),2,0.7,1.0,1.0,36.55496788024902,1.0
165,6,AdaBoost (Real),2,0.7,0.9827586206896551,0.9821390252341226,47.04575800895691,0.9821390252341226
166,6,Logistic Regression (Penalty = L2),2,0.7,1.0,1.0,0.09888195991516113,1.0
167,6,Naive Bayes,2,0.7,0.9655172413793104,0.967693705920519,0.10703468322753906,0.967693705920519
168,7,KNeighbors Classifier,0,0.7,0.8833333333333333,0.8892233261225158,0.0959482192993164,0.8892233261225158
169,7,SVC Classifier,0,0.7,0.4,1.0,0.002599000930786133,0.0
170,7,Decision Tree,0,0.7,0.8333333333333334,0.8355496558274308,0.10601353645324707,0.8355496558274308
171,7,RandomForest,0,0.7,0.9333333333333333,0.9410360288810286,0.6503584384918213,0.9410360288810286
172,7,AdaBoost (Discrete),0,0.7,0.9333333333333333,0.9361090484023133,40.271949768066406,0.9361090484023133
173,7,AdaBoost (Real),0,0.7,0.9166666666666666,0.9148264275057428,45.99684524536133,0.9148264275057428
174,7,Logistic Regression (Penalty = L2),0,0.7,0.9833333333333333,0.9859136166167861,0.0015790462493896484,0.9859136166167861
175,7,Naive Bayes,0,0.7,0.9333333333333333,0.9410360288810286,0.10688352584838867,0.9410360288810286
176,7,KNeighbors Classifier,1,0.7,1.0,1.0,0.10737776756286621,1.0
177,7,SVC Classifier,1,0.7,0.4,1.0,0.11050772666931152,0.0
178,7,Decision Tree,1,0.7,0.8833333333333333,0.8801286112531638,0.00183868408203125,0.8801286112531638
179,7,RandomForest,1,0.7,0.9166666666666666,0.915241126759053,0.6532943248748779,0.915241126759053
180,7,AdaBoost (Discrete),1,0.7,0.9,0.8879040017426008,40.4998095035553,0.8879040017426008
181,7,AdaBoost (Real),1,0.7,0.85,0.8254818122236567,45.51506590843201,0.8254818122236567
182,7,Logistic Regression (Penalty = L2),1,0.7,0.9333333333333333,0.9339246536301676,0.09948396682739258,0.9339246536301676
183,7,Naive Bayes,1,0.7,0.95,0.9472682371859096,0.12226581573486328,0.9472682371859096
184,7,KNeighbors Classifier,2,0.7,1.0,1.0,0.09471368789672852,1.0
185,7,SVC Classifier,2,0.7,0.39655172413793105,1.0,0.0015881061553955078,0.0
186,7,Decision Tree,2,0.7,0.9655172413793104,0.967693705920519,0.0011510848999023438,0.967693705920519
187,7,RandomForest,2,0.7,0.9827586206896551,0.9821390252341226,0.6687755584716797,0.9821390252341226
188,7,AdaBoost (Discrete),2,0.7,0.9655172413793104,0.967693705920519,45.464234828948975,0.967693705920519
189,7,AdaBoost (Real),2,0.7,0.9655172413793104,0.967693705920519,51.53006672859192,0.967693705920519
190,7,Logistic Regression (Penalty = L2),2,0.7,1.0,1.0,0.12341594696044922,1.0
191,7,Naive Bayes,2,0.7,0.9655172413793104,0.967693705920519,0.1180260181427002,0.967693705920519
192,8,KNeighbors Classifier,0,0.7,0.9166666666666666,0.9250831838185912,0.0022025108337402344,0.9250831838185912
193,8,SVC Classifier,0,0.7,0.45,0.3872983346207417,0.0029430389404296875,0.0
194,8,Decision Tree,0,0.7,0.75,0.7406240171018427,0.0017855167388916016,0.7406240171018427
195,8,RandomForest,0,0.7,0.8166666666666667,0.8177016702861758,0.9775936603546143,0.8177016702861758
196,8,AdaBoost (Discrete),0,0.7,0.9166666666666666,0.9210078746600967,48.956794023513794,0.9210078746600967
197,8,AdaBoost (Real),0,0.7,0.9,0.900068581879409,39.569889068603516,0.900068581879409
198,8,Logistic Regression (Penalty = L2),0,0.7,0.9666666666666667,0.9714127805419094,0.0023682117462158203,0.9714127805419094
199,8,Naive Bayes,0,0.7,0.9333333333333333,0.9410360288810286,0.09113478660583496,0.9410360288810286
200,8,KNeighbors Classifier,1,0.7,0.9666666666666667,0.9691999875015047,0.09925246238708496,0.9691999875015047
201,8,SVC Classifier,1,0.7,0.4,1.0,0.0016429424285888672,0.0
202,8,Decision Tree,1,0.7,0.8166666666666667,0.7867500769388359,0.09366083145141602,0.7867500769388359
203,8,RandomForest,1,0.7,0.9666666666666667,0.9691999875015047,0.5155749320983887,0.9691999875015047
204,8,AdaBoost (Discrete),1,0.7,0.8333333333333334,0.8018835824989566,60.879377126693726,0.8018835824989566
205,8,AdaBoost (Real),1,0.7,0.8666666666666667,0.8540369292015386,90.74994206428528,0.8540369292015386
206,8,Logistic Regression (Penalty = L2),1,0.7,0.9833333333333333,0.9859136166167861,0.0016632080078125,0.9859136166167861
207,8,Naive Bayes,1,0.7,0.95,0.9472682371859096,0.19405031204223633,0.9472682371859096
208,8,KNeighbors Classifier,2,0.7,1.0,1.0,0.002184629440307617,1.0
209,8,SVC Classifier,2,0.7,0.39655172413793105,1.0,0.19843840599060059,0.0
210,8,Decision Tree,2,0.7,1.0,1.0,0.19368696212768555,1.0
211,8,RandomForest,2,0.7,0.9827586206896551,0.9821390252341226,1.192641019821167,0.9821390252341226
212,8,AdaBoost (Discrete),2,0.7,0.9827586206896551,0.9821390252341226,80.4529173374176,0.9821390252341226
213,8,AdaBoost (Real),2,0.7,0.9827586206896551,0.9821390252341226,86.67655444145203,0.9821390252341226
214,8,Logistic Regression (Penalty = L2),2,0.7,0.9827586206896551,0.9821390252341226,0.18990516662597656,0.9821390252341226
215,8,Naive Bayes,2,0.7,1.0,1.0,0.19551396369934082,1.0
216,9,KNeighbors Classifier,0,0.7,0.8833333333333333,0.8892233261225158,0.17933058738708496,0.8892233261225158
217,9,SVC Classifier,0,0.7,0.4,1.0,0.1946735382080078,0.0
218,9,Decision Tree,0,0.7,0.8333333333333334,0.831802746039737,0.0018801689147949219,0.831802746039737
219,9,RandomForest,0,0.7,0.8833333333333333,0.8892233261225158,1.1398987770080566,0.8892233261225158
220,9,AdaBoost (Discrete),0,0.7,0.9166666666666666,0.9210078746600967,71.59568309783936,0.9210078746600967
221,9,AdaBoost (Real),0,0.7,0.8,0.799174495693515,78.74993634223938,0.799174495693515
222,9,Logistic Regression (Penalty = L2),0,0.7,0.9333333333333333,0.9410360288810286,0.0016376972198486328,0.9410360288810286
223,9,Naive Bayes,0,0.7,0.8833333333333333,0.8914135402065606,0.1918935775756836,0.8914135402065606
224,9,KNeighbors Classifier,1,0.7,1.0,1.0,0.19112825393676758,1.0
225,9,SVC Classifier,1,0.7,0.4,1.0,0.19082379341125488,0.0
226,9,Decision Tree,1,0.7,0.75,0.7049919520232129,0.0015223026275634766,0.7049919520232129
227,9,RandomForest,1,0.7,0.9333333333333333,0.9339246536301676,1.1358153820037842,0.9339246536301676
228,9,AdaBoost (Discrete),1,0.7,0.8333333333333334,0.8018835824989566,70.23426532745361,0.8018835824989566
229,9,AdaBoost (Real),1,0.7,0.8666666666666667,0.8478028607535417,81.00843381881714,0.8478028607535417
230,9,Logistic Regression (Penalty = L2),1,0.7,0.9666666666666667,0.9654893846056297,0.21503019332885742,0.9654893846056297
231,9,Naive Bayes,1,0.7,0.9333333333333333,0.9283177667225558,0.21526837348937988,0.9283177667225558
232,9,KNeighbors Classifier,2,0.7,1.0,1.0,0.22729277610778809,1.0
233,9,SVC Classifier,2,0.7,0.39655172413793105,1.0,0.23437738418579102,0.0
234,9,Decision Tree,2,0.7,0.9827586206896551,0.9821390252341226,0.21405386924743652,0.9821390252341226
235,9,RandomForest,2,0.7,0.9827586206896551,0.9852919811325488,1.3692340850830078,0.9852919811325488
236,9,AdaBoost (Discrete),2,0.7,0.9827586206896551,0.9821390252341226,75.0953643321991,0.9821390252341226
237,9,AdaBoost (Real),2,0.7,0.9655172413793104,0.967693705920519,83.01679635047913,0.967693705920519
238,9,Logistic Regression (Penalty = L2),2,0.7,0.9827586206896551,0.9821390252341226,0.15075469017028809,0.9821390252341226
239,9,Naive Bayes,2,0.7,1.0,1.0,0.16742396354675293,1.0
240,10,KNeighbors Classifier,0,0.7,0.95,0.9564655913861946,0.17189764976501465,0.9564655913861946
241,10,SVC Classifier,0,0.7,0.45,0.3872983346207417,0.1870718002319336,0.0
242,10,Decision Tree,0,0.7,0.9166666666666666,0.9210078746600967,0.14563465118408203,0.9210078746600967
243,10,RandomForest,0,0.7,0.9,0.9053945554302176,0.700286865234375,0.9053945554302176
244,10,AdaBoost (Discrete),0,0.7,0.9333333333333333,0.9361090484023133,41.634944677352905,0.9361090484023133
245,10,AdaBoost (Real),0,0.7,0.9,0.900068581879409,44.93663477897644,0.900068581879409
246,10,Logistic Regression (Penalty = L2),0,0.7,0.9833333333333333,0.9859136166167861,0.0026102066040039062,0.9859136166167861
247,10,Naive Bayes,0,0.7,0.9666666666666667,0.9714127805419094,0.09125375747680664,0.9714127805419094
248,10,KNeighbors Classifier,1,0.7,0.9666666666666667,0.9691999875015047,0.002402782440185547,0.9691999875015047
249,10,SVC Classifier,1,0.7,0.4,1.0,0.09945034980773926,0.0
250,10,Decision Tree,1,0.7,0.8,0.7663094323935531,0.10202646255493164,0.7663094323935531
251,10,RandomForest,1,0.7,0.8666666666666667,0.8540369292015386,0.6268999576568604,0.8540369292015386
252,10,AdaBoost (Discrete),1,0.7,0.9166666666666666,0.9085602964160698,40.25682783126831,0.9085602964160698
253,10,AdaBoost (Real),1,0.7,0.8333333333333334,0.813853758940804,45.890591859817505,0.813853758940804
254,10,Logistic Regression (Penalty = L2),1,0.7,0.9666666666666667,0.9691999875015047,0.0016891956329345703,0.9691999875015047
255,10,Naive Bayes,1,0.7,0.9666666666666667,0.9654893846056297,0.10741043090820312,0.9654893846056297
256,10,KNeighbors Classifier,2,0.7,0.9827586206896551,0.9852919811325488,0.1077420711517334,0.9852919811325488
257,10,SVC Classifier,2,0.7,0.39655172413793105,1.0,0.13077211380004883,0.0
258,10,Decision Tree,2,0.7,0.8448275862068966,0.8474876923747772,0.09375166893005371,0.8474876923747772
259,10,RandomForest,2,0.7,1.0,1.0,0.6584575176239014,1.0
260,10,AdaBoost (Discrete),2,0.7,0.9655172413793104,0.967693705920519,39.785768032073975,0.967693705920519
261,10,AdaBoost (Real),2,0.7,0.9655172413793104,0.967693705920519,45.3902633190155,0.967693705920519
262,10,Logistic Regression (Penalty = L2),2,0.7,1.0,1.0,0.10666036605834961,1.0
263,10,Naive Bayes,2,0.7,0.9827586206896551,0.9821390252341226,0.10745859146118164,0.9821390252341226
264,11,KNeighbors Classifier,0,0.7,0.9166666666666666,0.9210078746600967,0.10782599449157715,0.9210078746600967
265,11,SVC Classifier,0,0.7,0.45,0.3872983346207417,0.10651254653930664,0.0
266,11,Decision Tree,0,0.7,0.9166666666666666,0.9133720110188648,0.0011334419250488281,0.9133720110188648
267,11,RandomForest,0,0.7,0.85,0.8549879733383485,0.7666423320770264,0.8549879733383485
268,11,AdaBoost (Discrete),0,0.7,0.9166666666666666,0.9210078746600967,40.369876861572266,0.9210078746600967
269,11,AdaBoost (Real),0,0.7,0.9333333333333333,0.9410360288810286,45.54799246788025,0.9410360288810286
270,11,Logistic Regression (Penalty = L2),0,0.7,0.9333333333333333,0.9410360288810286,0.16307473182678223,0.9410360288810286
271,11,Naive Bayes,0,0.7,0.95,0.9564655913861946,0.1030888557434082,0.9564655913861946
272,11,KNeighbors Classifier,1,0.7,0.95,0.9564655913861946,0.1035008430480957,0.9564655913861946
273,11,SVC Classifier,1,0.7,0.4,1.0,0.11491179466247559,0.0
274,11,Decision Tree,1,0.7,0.8833333333333333,0.8648486709999246,0.0016789436340332031,0.8648486709999246
275,11,RandomForest,1,0.7,0.85,0.8414757379333423,0.7617032527923584,0.8414757379333423
276,11,AdaBoost (Discrete),1,0.7,0.8833333333333333,0.8662391053409028,40.191452980041504,0.8662391053409028
277,11,AdaBoost (Real),1,0.7,0.85,0.8358603846235818,46.34129476547241,0.8358603846235818
278,11,Logistic Regression (Penalty = L2),1,0.7,0.95,0.9518891309816516,0.1077127456665039,0.9518891309816516
279,11,Naive Bayes,1,0.7,0.9666666666666667,0.9654893846056297,0.10672116279602051,0.9654893846056297
280,11,KNeighbors Classifier,2,0.7,0.9655172413793104,0.9701312318500641,0.10793638229370117,0.9701312318500641
281,11,SVC Classifier,2,0.7,0.39655172413793105,1.0,0.10646224021911621,0.0
282,11,Decision Tree,2,0.7,0.9655172413793104,0.967693705920519,0.0944375991821289,0.967693705920519
283,11,RandomForest,2,0.7,0.9827586206896551,0.9852919811325488,0.6356015205383301,0.9852919811325488
284,11,AdaBoost (Discrete),2,0.7,0.9655172413793104,0.967693705920519,42.2933554649353,0.967693705920519
285,11,AdaBoost (Real),2,0.7,0.9655172413793104,0.967693705920519,48.375272274017334,0.967693705920519
286,11,Logistic Regression (Penalty = L2),2,0.7,1.0,1.0,0.0025730133056640625,1.0
287,11,Naive Bayes,2,0.7,0.9655172413793104,0.967693705920519,0.11138725280761719,0.967693705920519
288,12,KNeighbors Classifier,0,0.7,0.8833333333333333,0.8892233261225158,0.13961219787597656,0.8892233261225158
289,12,SVC Classifier,0,0.7,0.4,1.0,0.11092472076416016,0.0
290,12,Decision Tree,0,0.7,0.9333333333333333,0.9291228996211249,0.0016465187072753906,0.9291228996211249
291,12,RandomForest,0,0.7,0.8833333333333333,0.8892233261225158,0.7796125411987305,0.8892233261225158
292,12,AdaBoost (Discrete),0,0.7,0.9166666666666666,0.9210078746600967,41.21784543991089,0.9210078746600967
293,12,AdaBoost (Real),0,0.7,0.9333333333333333,0.9410360288810286,46.306488275527954,0.9410360288810286
294,12,Logistic Regression (Penalty = L2),0,0.7,0.9333333333333333,0.9410360288810286,0.11094236373901367,0.9410360288810286
295,12,Naive Bayes,0,0.7,0.8833333333333333,0.8914135402065606,0.15883684158325195,0.8914135402065606
296,12,KNeighbors Classifier,1,0.7,1.0,1.0,0.0022873878479003906,1.0
297,12,SVC Classifier,1,0.7,0.4,1.0,0.1108400821685791,0.0
298,12,Decision Tree,1,0.7,0.8666666666666667,0.8586534347188229,0.10575127601623535,0.8586534347188229
299,12,RandomForest,1,0.7,0.9333333333333333,0.9339246536301676,0.6878476142883301,0.9339246536301676
300,12,AdaBoost (Discrete),1,0.7,0.8333333333333334,0.8018835824989566,40.81792187690735,0.8018835824989566
301,12,AdaBoost (Real),1,0.7,0.8833333333333333,0.8662391053409028,45.314090728759766,0.8662391053409028
302,12,Logistic Regression (Penalty = L2),1,0.7,0.9666666666666667,0.9654893846056297,0.11054849624633789,0.9654893846056297
303,12,Naive Bayes,1,0.7,0.9333333333333333,0.9283177667225558,0.11152505874633789,0.9283177667225558
304,12,KNeighbors Classifier,2,0.7,1.0,1.0,0.10773396492004395,1.0
305,12,SVC Classifier,2,0.7,0.39655172413793105,1.0,0.10614824295043945,0.0
306,12,Decision Tree,2,0.7,0.9482758620689655,0.9443263914173669,0.0018908977508544922,0.9443263914173669
307,12,RandomForest,2,0.7,0.9827586206896551,0.9852919811325488,0.6765904426574707,0.9852919811325488
308,12,AdaBoost (Discrete),2,0.7,0.9827586206896551,0.9821390252341226,41.16902303695679,0.9821390252341226
309,12,AdaBoost (Real),2,0.7,0.9827586206896551,0.9821390252341226,42.96129131317139,0.9821390252341226
310,12,Logistic Regression (Penalty = L2),2,0.7,0.9827586206896551,0.9821390252341226,0.09899544715881348,0.9821390252341226
311,12,Naive Bayes,2,0.7,1.0,1.0,0.0018782615661621094,1.0
