,feat_set_id,classifier,fold_id,feat_th,score,geo_score,exec_t,geo_score_woz
0,0,KNeighbors Classifier,0,0.05,0.5857988165680473,0.6299605249474366,0.503582239151001,0.6299605249474366
1,0,SVC Classifier,0,0.05,0.591715976331361,0.2429598032242956,0.39668798446655273,0.2429598032242956
2,0,Decision Tree,0,0.05,0.46153846153846156,0.540337765179472,0.0020847320556640625,0.540337765179472
3,0,RandomForest,0,0.05,0.591715976331361,0.4095406585368938,0.9185390472412109,0.4095406585368938
4,0,AdaBoost (Discrete),0,0.05,0.42011834319526625,0.45305764459017334,59.31672811508179,0.45305764459017334
5,0,AdaBoost (Real),0,0.05,0.5088757396449705,0.6326122240777239,74.16333651542664,0.6326122240777239
6,0,Logistic Regression (Penalty = L2),0,0.05,0.6035502958579881,0.6096587193774394,0.3048231601715088,0.6096587193774394
7,0,Naive Bayes,0,0.05,0.6390532544378699,0.6990711990623946,0.002645254135131836,0.6990711990623946
8,0,KNeighbors Classifier,1,0.05,0.5535714285714286,0.6537548083052067,0.4248085021972656,0.6537548083052067
9,0,SVC Classifier,1,0.05,0.5952380952380952,1.0,0.3919990062713623,0.0
10,0,Decision Tree,1,0.05,0.5595238095238095,0.6714323544203868,0.0017199516296386719,0.6714323544203868
11,0,RandomForest,1,0.05,0.5952380952380952,1.0,0.8727560043334961,0.0
12,0,AdaBoost (Discrete),1,0.05,0.32142857142857145,0.41183972222685883,62.971620082855225,0.41183972222685883
13,0,AdaBoost (Real),1,0.05,0.5833333333333334,0.6786044041487267,81.86142110824585,0.6786044041487267
14,0,Logistic Regression (Penalty = L2),1,0.05,0.6488095238095238,0.7306220099819558,0.1690371036529541,0.7306220099819558
15,0,Naive Bayes,1,0.05,0.6488095238095238,0.7490911285328291,0.17171716690063477,0.7490911285328291
16,0,KNeighbors Classifier,2,0.05,0.5508982035928144,0.6615467691941467,0.6528065204620361,0.6615467691941467
17,0,SVC Classifier,2,0.05,0.5988023952095808,0.3508781470347296,0.5069715976715088,0.3508781470347296
18,0,Decision Tree,2,0.05,0.5568862275449101,0.650874793832672,0.15850472450256348,0.650874793832672
19,0,RandomForest,2,0.05,0.6107784431137725,0.48133829047370646,1.3822031021118164,0.48133829047370646
20,0,AdaBoost (Discrete),2,0.05,0.39520958083832336,0.486570638339579,74.49734449386597,0.486570638339579
21,0,AdaBoost (Real),2,0.05,0.4550898203592814,0.5878336719301894,83.52267980575562,0.5878336719301894
22,0,Logistic Regression (Penalty = L2),2,0.05,0.592814371257485,0.622539344601534,0.1728203296661377,0.622539344601534
23,0,Naive Bayes,2,0.05,0.592814371257485,0.6631762013160654,0.16787147521972656,0.6631762013160654
24,1,KNeighbors Classifier,0,0.05,0.44970414201183434,0.5496557646848895,0.5134477615356445,0.5496557646848895
25,1,SVC Classifier,0,0.05,0.5680473372781065,1.0,0.49977564811706543,0.0
26,1,Decision Tree,0,0.05,0.5443786982248521,0.5028601768761598,0.002129077911376953,0.0
27,1,RandomForest,0,0.05,0.5857988165680473,0.3822764257713037,1.1954355239868164,0.0
28,1,AdaBoost (Discrete),0,0.05,0.5976331360946746,0.5492089172460775,65.65141344070435,0.0
29,1,AdaBoost (Real),0,0.05,0.6035502958579881,0.497578678263852,68.73903799057007,0.0
30,1,Logistic Regression (Penalty = L2),0,0.05,0.5739644970414202,0.4423258684646914,0.1680443286895752,0.0
31,1,Naive Bayes,0,0.05,0.46153846153846156,0.8779711460710616,0.16417837142944336,0.0
32,1,KNeighbors Classifier,1,0.05,0.3869047619047619,0.5211514396594348,0.3259763717651367,0.5211514396594348
33,1,SVC Classifier,1,0.05,0.5714285714285714,1.0,0.5040686130523682,0.0
34,1,Decision Tree,1,0.05,0.6428571428571429,0.4981583731163036,0.16234946250915527,0.0
35,1,RandomForest,1,0.05,0.6011904761904762,0.2711630722733202,1.416095495223999,0.0
36,1,AdaBoost (Discrete),1,0.05,0.6130952380952381,0.4841229182759271,62.292505979537964,0.0
37,1,AdaBoost (Real),1,0.05,0.6190476190476191,0.46442036401282394,66.35639095306396,0.0
38,1,Logistic Regression (Penalty = L2),1,0.05,0.6726190476190477,0.60380736442456,0.15168452262878418,0.0
39,1,Naive Bayes,1,0.05,0.44642857142857145,0.22051558973138222,0.15498948097229004,0.22051558973138222
40,1,KNeighbors Classifier,2,0.05,0.3652694610778443,0.4882899835039205,0.4575371742248535,0.4882899835039205
41,1,SVC Classifier,2,0.05,0.5748502994011976,1.0,0.4560680389404297,0.0
42,1,Decision Tree,2,0.05,0.5868263473053892,0.46966821831386213,0.0015218257904052734,0.0
43,1,RandomForest,2,0.05,0.5808383233532934,0.34831527300961795,1.1067430973052979,0.0
44,1,AdaBoost (Discrete),2,0.05,0.6047904191616766,0.5072996561958923,62.984286069869995,0.0
45,1,AdaBoost (Real),2,0.05,0.6047904191616766,0.4783934511650918,59.84433937072754,0.0
46,1,Logistic Regression (Penalty = L2),2,0.05,0.592814371257485,0.4919698300968162,0.25666165351867676,0.0
47,1,Naive Bayes,2,0.05,0.41317365269461076,0.2151349997158924,0.15166783332824707,0.2151349997158924
48,2,KNeighbors Classifier,0,0.05,0.42011834319526625,0.14433756729740643,2.7778565883636475,0.0
49,2,SVC Classifier,0,0.05,0.5680473372781065,1.0,2.9521238803863525,0.0
50,2,Decision Tree,0,0.05,0.46153846153846156,0.30618621784789724,0.13318920135498047,0.0
51,2,RandomForest,0,0.05,0.5680473372781065,1.0,0.8062574863433838,0.0
52,2,AdaBoost (Discrete),0,0.05,0.46745562130177515,0.3227486121839514,74.85149621963501,0.0
53,2,AdaBoost (Real),0,0.05,0.46745562130177515,0.3227486121839514,73.71144795417786,0.0
54,2,Logistic Regression (Penalty = L2),0,0.05,0.46745562130177515,0.3227486121839514,0.24659419059753418,0.0
55,2,Naive Bayes,0,0.05,0.46745562130177515,0.3227486121839514,0.3928542137145996,0.0
56,2,KNeighbors Classifier,1,0.05,0.02976190476190476,0.10206207261596575,2.70589280128479,0.0
57,2,SVC Classifier,1,0.05,0.5714285714285714,1.0,2.7573933601379395,0.0
58,2,Decision Tree,1,0.05,0.4642857142857143,0.3227486121839514,0.14623522758483887,0.0
59,2,RandomForest,1,0.05,0.5714285714285714,1.0,1.116417646408081,0.0
60,2,AdaBoost (Discrete),1,0.05,0.47619047619047616,0.3535533905932738,73.97357726097107,0.0
61,2,AdaBoost (Real),1,0.05,0.48214285714285715,0.3679900360969936,75.90924048423767,0.0
62,2,Logistic Regression (Penalty = L2),1,0.05,0.4880952380952381,0.3818813079129867,0.3539259433746338,0.0
63,2,Naive Bayes,1,0.05,0.4880952380952381,0.3818813079129867,0.29250121116638184,0.0
64,2,KNeighbors Classifier,2,0.05,0.03592814371257485,0.1767766952966369,2.8668458461761475,0.0
65,2,SVC Classifier,2,0.05,0.5748502994011976,1.0,3.331941843032837,0.0
66,2,Decision Tree,2,0.05,0.4550898203592814,0.28867513459481287,0.154435396194458,0.0
67,2,RandomForest,2,0.05,0.5748502994011976,1.0,1.1859381198883057,0.0
68,2,AdaBoost (Discrete),2,0.05,0.4550898203592814,0.28867513459481287,89.90673851966858,0.0
69,2,AdaBoost (Real),2,0.05,0.4550898203592814,0.28867513459481287,88.68992304801941,0.0
70,2,Logistic Regression (Penalty = L2),2,0.05,0.4550898203592814,0.28867513459481287,0.36658668518066406,0.0
71,2,Naive Bayes,2,0.05,0.4550898203592814,0.28867513459481287,0.4408121109008789,0.0
72,3,KNeighbors Classifier,0,0.05,0.5680473372781065,0.5241740685175872,0.17707610130310059,0.0
73,3,SVC Classifier,0,0.05,0.5680473372781065,1.0,0.0031499862670898438,0.0
74,3,Decision Tree,0,0.05,0.5680473372781065,0.5241740685175872,0.15007972717285156,0.0
75,3,RandomForest,0,0.05,0.5798816568047337,0.4559390691557466,1.0269079208374023,0.0
76,3,AdaBoost (Discrete),0,0.05,0.5680473372781065,0.5241740685175872,59.875391721725464,0.0
77,3,AdaBoost (Real),0,0.05,0.5680473372781065,0.5241740685175872,65.49554467201233,0.0
78,3,Logistic Regression (Penalty = L2),0,0.05,0.5798816568047337,0.4559390691557466,0.0019719600677490234,0.0
79,3,Naive Bayes,0,0.05,0.38461538461538464,0.5193688327767603,0.027477502822875977,0.5193688327767603
80,3,KNeighbors Classifier,1,0.05,0.3273809523809524,0.45625101951480496,0.2824678421020508,0.45625101951480496
81,3,SVC Classifier,1,0.05,0.5714285714285714,1.0,0.3367609977722168,0.0
82,3,Decision Tree,1,0.05,0.6785714285714286,0.6213126521846355,0.023788928985595703,0.0
83,3,RandomForest,1,0.05,0.6309523809523809,0.43035125872053975,1.4418931007385254,0.0
84,3,AdaBoost (Discrete),1,0.05,0.6785714285714286,0.6213126521846355,74.92516136169434,0.0
85,3,AdaBoost (Real),1,0.05,0.6785714285714286,0.6213126521846355,65.55256676673889,0.0
86,3,Logistic Regression (Penalty = L2),1,0.05,0.6845238095238095,0.625,0.17813706398010254,0.0
87,3,Naive Bayes,1,0.05,0.3869047619047619,0.5008156621310763,0.16310334205627441,0.5008156621310763
88,3,KNeighbors Classifier,2,0.05,0.592814371257485,0.4725945283594533,0.20742201805114746,0.0
89,3,SVC Classifier,2,0.05,0.5748502994011976,1.0,0.1455848217010498,0.0
90,3,Decision Tree,2,0.05,0.592814371257485,0.4725945283594533,0.0012044906616210938,0.0
91,3,RandomForest,2,0.05,0.592814371257485,0.4725945283594533,0.9505050182342529,0.0
92,3,AdaBoost (Discrete),2,0.05,0.592814371257485,0.4725945283594533,62.52319550514221,0.0
93,3,AdaBoost (Real),2,0.05,0.6047904191616766,0.5072996561958923,84.93165302276611,0.0
94,3,Logistic Regression (Penalty = L2),2,0.05,0.592814371257485,0.4725945283594533,0.06313109397888184,0.0
95,3,Naive Bayes,2,0.05,0.2694610778443114,0.3994272849602297,0.0636439323425293,0.3994272849602297
96,5,KNeighbors Classifier,0,0.05,0.5680473372781065,1.0,0.07638263702392578,0.0
97,5,SVC Classifier,0,0.05,0.5680473372781065,1.0,0.07452821731567383,0.0
98,5,Decision Tree,0,0.05,0.5680473372781065,1.0,0.0018208026885986328,0.0
99,5,RandomForest,0,0.05,0.5680473372781065,1.0,0.44092535972595215,0.0
100,5,AdaBoost (Discrete),0,0.05,0.5680473372781065,1.0,39.87395620346069,0.0
101,5,AdaBoost (Real),0,0.05,0.5680473372781065,1.0,50.189871072769165,0.0
102,5,Logistic Regression (Penalty = L2),0,0.05,0.5680473372781065,1.0,0.11049675941467285,0.0
103,5,Naive Bayes,0,0.05,0.42011834319526625,0.14433756729740643,0.13852262496948242,0.0
104,5,KNeighbors Classifier,1,0.05,0.5714285714285714,1.0,0.14375090599060059,0.0
105,5,SVC Classifier,1,0.05,0.5714285714285714,1.0,0.19707179069519043,0.0
106,5,Decision Tree,1,0.05,0.5714285714285714,1.0,0.12194442749023438,0.0
107,5,RandomForest,1,0.05,0.5714285714285714,1.0,0.8711168766021729,0.0
108,5,AdaBoost (Discrete),1,0.05,0.5714285714285714,1.0,50.077730655670166,0.0
109,5,AdaBoost (Real),1,0.05,0.5714285714285714,1.0,59.61338925361633,0.0
110,5,Logistic Regression (Penalty = L2),1,0.05,0.5714285714285714,1.0,0.5410850048065186,0.0
111,5,Naive Bayes,1,0.05,0.42857142857142855,0.2041241452319315,0.2668783664703369,0.0
112,5,KNeighbors Classifier,2,0.05,0.5748502994011976,1.0,0.21101117134094238,0.0
113,5,SVC Classifier,2,0.05,0.5748502994011976,1.0,0.1835649013519287,0.0
114,5,Decision Tree,2,0.05,0.5748502994011976,1.0,0.056478023529052734,0.0
115,5,RandomForest,2,0.05,0.5748502994011976,1.0,1.0072712898254395,0.0
116,5,AdaBoost (Discrete),2,0.05,0.5748502994011976,1.0,62.09790229797363,0.0
117,5,AdaBoost (Real),2,0.05,0.5748502994011976,1.0,63.66534662246704,0.0
118,5,Logistic Regression (Penalty = L2),2,0.05,0.5748502994011976,1.0,0.16765308380126953,0.0
119,5,Naive Bayes,2,0.05,0.40718562874251496,1.0,0.19483375549316406,0.0
120,6,KNeighbors Classifier,0,0.05,0.5857988165680473,0.5137011669140813,0.19705629348754883,0.0
121,6,SVC Classifier,0,0.05,0.5680473372781065,1.0,0.19620466232299805,0.0
122,6,Decision Tree,0,0.05,0.5680473372781065,0.5241740685175872,0.0016765594482421875,0.0
123,6,RandomForest,0,0.05,0.5857988165680473,0.5137011669140813,1.2276027202606201,0.0
124,6,AdaBoost (Discrete),0,0.05,0.5680473372781065,0.5241740685175872,61.264973402023315,0.0
125,6,AdaBoost (Real),0,0.05,0.5857988165680473,0.5137011669140813,62.896971225738525,0.0
126,6,Logistic Regression (Penalty = L2),0,0.05,0.5798816568047337,0.4559390691557466,0.15492463111877441,0.0
127,6,Naive Bayes,0,0.05,0.28402366863905326,0.23319522537959197,0.0031795501708984375,0.23319522537959197
128,6,KNeighbors Classifier,1,0.05,0.35119047619047616,0.4625415919092956,0.15543675422668457,0.4625415919092956
129,6,SVC Classifier,1,0.05,0.5714285714285714,1.0,0.1576087474822998,0.0
130,6,Decision Tree,1,0.05,0.6785714285714286,0.6213126521846355,0.0014677047729492188,0.0
131,6,RandomForest,1,0.05,0.5654761904761905,0.9895833333333334,1.0798423290252686,0.0
132,6,AdaBoost (Discrete),1,0.05,0.6785714285714286,0.6213126521846355,58.768404483795166,0.0
133,6,AdaBoost (Real),1,0.05,0.6785714285714286,0.6213126521846355,63.0031042098999,0.0
134,6,Logistic Regression (Penalty = L2),1,0.05,0.6845238095238095,0.625,0.16634225845336914,0.0
135,6,Naive Bayes,1,0.05,0.3273809523809524,0.3065202947524105,0.1834547519683838,0.3065202947524105
136,6,KNeighbors Classifier,2,0.05,0.2874251497005988,0.42068017041013767,0.1559915542602539,0.42068017041013767
137,6,SVC Classifier,2,0.05,0.5748502994011976,1.0,0.1606431007385254,0.0
138,6,Decision Tree,2,0.05,0.592814371257485,0.4725945283594533,0.15362834930419922,0.0
139,6,RandomForest,2,0.05,0.6047904191616766,0.5072996561958923,0.8879227638244629,0.0
140,6,AdaBoost (Discrete),2,0.05,0.592814371257485,0.4725945283594533,48.482224464416504,0.0
141,6,AdaBoost (Real),2,0.05,0.592814371257485,0.4725945283594533,55.69755005836487,0.0
142,6,Logistic Regression (Penalty = L2),2,0.05,0.592814371257485,0.4725945283594533,0.13931822776794434,0.0
143,6,Naive Bayes,2,0.05,0.2215568862275449,0.7071067811865476,0.003237009048461914,0.0
144,7,KNeighbors Classifier,0,0.05,0.5266272189349113,0.6291987823363357,3.1288766860961914,0.6291987823363357
145,7,SVC Classifier,0,0.05,0.6094674556213018,0.43836710608902335,2.8519582748413086,0.43836710608902335
146,7,Decision Tree,0,0.05,0.591715976331361,0.6907344827105579,0.13704347610473633,0.6907344827105579
147,7,RandomForest,0,0.05,0.591715976331361,1.0,0.9790441989898682,0.0
148,7,AdaBoost (Discrete),0,0.05,0.4556213017751479,0.4116301878624143,80.53378963470459,0.4116301878624143
149,7,AdaBoost (Real),0,0.05,0.591715976331361,0.6644324361444984,85.3000545501709,0.6644324361444984
150,7,Logistic Regression (Penalty = L2),0,0.05,0.4970414201183432,0.5279929179413227,0.4204277992248535,0.5279929179413227
151,7,Naive Bayes,0,0.05,0.48520710059171596,0.4682339104383278,0.4405701160430908,0.4682339104383278
152,7,KNeighbors Classifier,1,0.05,0.5059523809523809,0.602816730604466,3.2110273838043213,0.602816730604466
153,7,SVC Classifier,1,0.05,0.5952380952380952,1.0,3.1038923263549805,0.0
154,7,Decision Tree,1,0.05,0.5059523809523809,0.6271170041795728,0.1403350830078125,0.6271170041795728
155,7,RandomForest,1,0.05,0.5952380952380952,1.0,0.9646615982055664,0.0
156,7,AdaBoost (Discrete),1,0.05,0.49404761904761907,0.5278335959890004,85.13201570510864,0.5278335959890004
157,7,AdaBoost (Real),1,0.05,0.6190476190476191,0.7258075448402647,97.71693587303162,0.7258075448402647
158,7,Logistic Regression (Penalty = L2),1,0.05,0.49404761904761907,0.5445279230906311,0.5333726406097412,0.5445279230906311
159,7,Naive Bayes,1,0.05,0.5,0.5211514396594348,0.308441162109375,0.5211514396594348
160,7,KNeighbors Classifier,2,0.05,0.5329341317365269,0.6249019454015914,3.1755895614624023,0.6249019454015914
161,7,SVC Classifier,2,0.05,0.6107784431137725,0.44050551605704025,2.990849733352661,0.44050551605704025
162,7,Decision Tree,2,0.05,0.5568862275449101,0.6697290686804895,0.29250597953796387,0.6697290686804895
163,7,RandomForest,2,0.05,0.592814371257485,1.0,1.1489627361297607,0.0
164,7,AdaBoost (Discrete),2,0.05,0.38323353293413176,0.4728132605897698,92.06962561607361,0.4728132605897698
165,7,AdaBoost (Real),2,0.05,0.5508982035928144,0.6592049911221002,99.59646511077881,0.6592049911221002
166,7,Logistic Regression (Penalty = L2),2,0.05,0.46107784431137727,0.504854672541121,0.37126755714416504,0.504854672541121
167,7,Naive Bayes,2,0.05,0.4431137724550898,0.44050551605704025,0.32065701484680176,0.44050551605704025
