,feat_set_id,classifier,fold_id,feat_th,score,geo_score,exec_t,geo_score_woz
0,0,KNeighbors Classifier,0,1.0,0.6851851851851852,0.6903394942828609,0.04259181022644043,0.6903394942828609
1,0,SVC Classifier,0,1.0,0.46296296296296297,1.0,0.03741455078125,0.0
2,0,Decision Tree,0,1.0,0.7037037037037037,0.621109111037185,0.0341796875,0.621109111037185
3,0,RandomForest,0,1.0,0.7592592592592593,0.651089322621271,0.2280423641204834,0.651089322621271
4,0,AdaBoost (Discrete),0,1.0,0.7870370370370371,0.7467932171403544,16.44853901863098,0.7467932171403544
5,0,AdaBoost (Real),0,1.0,0.7962962962962963,0.7731688352097259,16.59197759628296,0.7731688352097259
6,0,Logistic Regression (Penalty = L2),0,1.0,0.7777777777777778,0.687912955883534,0.08708739280700684,0.687912955883534
7,0,Naive Bayes,0,1.0,0.8240740740740741,0.800467765133614,0.04428410530090332,0.800467765133614
8,0,KNeighbors Classifier,1,1.0,0.8598130841121495,0.8490583671115974,0.03636884689331055,0.8490583671115974
9,0,SVC Classifier,1,1.0,0.4672897196261682,1.0,0.0023572444915771484,0.0
10,0,Decision Tree,1,1.0,0.794392523364486,0.7560076763164566,0.03747296333312988,0.7560076763164566
11,0,RandomForest,1,1.0,0.7476635514018691,0.9534625892455924,0.16113758087158203,0.0
12,0,AdaBoost (Discrete),1,1.0,0.822429906542056,0.8045072205795996,11.887720346450806,0.8045072205795996
13,0,AdaBoost (Real),1,1.0,0.8504672897196262,0.8029898262497313,12.605870008468628,0.8029898262497313
14,0,Logistic Regression (Penalty = L2),1,1.0,0.8504672897196262,0.8210967436686386,0.03455948829650879,0.8210967436686386
15,0,Naive Bayes,1,1.0,0.822429906542056,0.8019636390719966,0.030515193939208984,0.8019636390719966
16,0,KNeighbors Classifier,2,1.0,0.7641509433962265,0.7656402892684244,0.030827999114990234,0.7656402892684244
17,0,SVC Classifier,2,1.0,0.4716981132075472,1.0,0.002409219741821289,0.0
18,0,Decision Tree,2,1.0,0.8018867924528302,0.7742378103686055,0.029966115951538086,0.7742378103686055
19,0,RandomForest,2,1.0,0.7830188679245284,0.9687293061514642,0.19623255729675293,0.0
20,0,AdaBoost (Discrete),2,1.0,0.8018867924528302,0.791814134591313,11.416408777236938,0.791814134591313
21,0,AdaBoost (Real),2,1.0,0.8584905660377359,0.8530159862351343,12.867939233779907,0.8530159862351343
22,0,Logistic Regression (Penalty = L2),2,1.0,0.8773584905660378,0.8723418074966099,0.03162550926208496,0.8723418074966099
23,0,Naive Bayes,2,1.0,0.8584905660377359,0.8575926892959443,0.03165936470031738,0.8575926892959443
24,1,KNeighbors Classifier,0,1.0,0.6851851851851852,0.6903394942828609,0.0316615104675293,0.6903394942828609
25,1,SVC Classifier,0,1.0,0.46296296296296297,1.0,0.03147459030151367,0.0
26,1,Decision Tree,0,1.0,0.75,0.7243512817115213,0.029940128326416016,0.7243512817115213
27,1,RandomForest,0,1.0,0.7592592592592593,0.651089322621271,0.16382479667663574,0.651089322621271
28,1,AdaBoost (Discrete),0,1.0,0.7870370370370371,0.7467932171403544,11.211366653442383,0.7467932171403544
29,1,AdaBoost (Real),0,1.0,0.7962962962962963,0.7731688352097259,12.71935486793518,0.7731688352097259
30,1,Logistic Regression (Penalty = L2),0,1.0,0.7777777777777778,0.687912955883534,0.03238940238952637,0.687912955883534
31,1,Naive Bayes,0,1.0,0.8240740740740741,0.800467765133614,0.0025146007537841797,0.800467765133614
32,1,KNeighbors Classifier,1,1.0,0.8598130841121495,0.8490583671115974,0.031319618225097656,0.8490583671115974
33,1,SVC Classifier,1,1.0,0.4672897196261682,1.0,0.03168535232543945,0.0
34,1,Decision Tree,1,1.0,0.7850467289719626,0.761350819167864,0.0015075206756591797,0.761350819167864
35,1,RandomForest,1,1.0,0.7476635514018691,0.9534625892455924,0.16556715965270996,0.0
36,1,AdaBoost (Discrete),1,1.0,0.822429906542056,0.8045072205795996,11.285093307495117,0.8045072205795996
37,1,AdaBoost (Real),1,1.0,0.794392523364486,0.7307113314965984,13.67667531967163,0.7307113314965984
38,1,Logistic Regression (Penalty = L2),1,1.0,0.8504672897196262,0.8210967436686386,0.03458547592163086,0.8210967436686386
39,1,Naive Bayes,1,1.0,0.822429906542056,0.8019636390719966,0.05827140808105469,0.8019636390719966
40,1,KNeighbors Classifier,2,1.0,0.7641509433962265,0.7656402892684244,0.034970998764038086,0.7656402892684244
41,1,SVC Classifier,2,1.0,0.4716981132075472,1.0,0.03536081314086914,0.0
42,1,Decision Tree,2,1.0,0.839622641509434,0.8291873437000402,0.03355598449707031,0.8291873437000402
43,1,RandomForest,2,1.0,0.7830188679245284,0.9687293061514642,0.27651071548461914,0.0
44,1,AdaBoost (Discrete),2,1.0,0.8018867924528302,0.791814134591313,13.753988027572632,0.791814134591313
45,1,AdaBoost (Real),2,1.0,0.839622641509434,0.7988612070779082,14.869343519210815,0.7988612070779082
46,1,Logistic Regression (Penalty = L2),2,1.0,0.8773584905660378,0.8723418074966099,0.057041168212890625,0.8723418074966099
47,1,Naive Bayes,2,1.0,0.8584905660377359,0.8575926892959443,0.0020623207092285156,0.8575926892959443
48,2,KNeighbors Classifier,0,1.0,0.6851851851851852,0.6903394942828609,0.0027191638946533203,0.6903394942828609
49,2,SVC Classifier,0,1.0,0.46296296296296297,1.0,0.02081298828125,0.0
50,2,Decision Tree,0,1.0,0.8148148148148148,0.8143115015102661,0.03006911277770996,0.8143115015102661
51,2,RandomForest,0,1.0,0.7592592592592593,0.651089322621271,0.19293737411499023,0.651089322621271
52,2,AdaBoost (Discrete),0,1.0,0.7870370370370371,0.7467932171403544,15.618151187896729,0.7467932171403544
53,2,AdaBoost (Real),0,1.0,0.7962962962962963,0.7731688352097259,19.534483671188354,0.7731688352097259
54,2,Logistic Regression (Penalty = L2),0,1.0,0.7777777777777778,0.687912955883534,0.0355372428894043,0.687912955883534
55,2,Naive Bayes,0,1.0,0.8240740740740741,0.800467765133614,0.05920219421386719,0.800467765133614
56,2,KNeighbors Classifier,1,1.0,0.8598130841121495,0.8490583671115974,0.047624826431274414,0.8490583671115974
57,2,SVC Classifier,1,1.0,0.4672897196261682,1.0,0.04800224304199219,0.0
58,2,Decision Tree,1,1.0,0.6915887850467289,0.6559667370298917,0.0014162063598632812,0.6559667370298917
59,2,RandomForest,1,1.0,0.7476635514018691,0.9534625892455924,0.28911399841308594,0.0
60,2,AdaBoost (Discrete),1,1.0,0.822429906542056,0.8045072205795996,16.196932554244995,0.8045072205795996
61,2,AdaBoost (Real),1,1.0,0.8037383177570093,0.7003244496815454,17.231613159179688,0.7003244496815454
62,2,Logistic Regression (Penalty = L2),1,1.0,0.8504672897196262,0.8210967436686386,0.04841256141662598,0.8210967436686386
63,2,Naive Bayes,1,1.0,0.822429906542056,0.8019636390719966,0.04801201820373535,0.8019636390719966
64,2,KNeighbors Classifier,2,1.0,0.7641509433962265,0.7656402892684244,0.04795432090759277,0.7656402892684244
65,2,SVC Classifier,2,1.0,0.4716981132075472,1.0,0.04322671890258789,0.0
66,2,Decision Tree,2,1.0,0.8018867924528302,0.8045072205795996,0.07872962951660156,0.8045072205795996
67,2,RandomForest,2,1.0,0.7830188679245284,0.9687293061514642,0.2540268898010254,0.0
68,2,AdaBoost (Discrete),2,1.0,0.8113207547169812,0.8002839397075241,17.86658263206482,0.8002839397075241
69,2,AdaBoost (Real),2,1.0,0.8207547169811321,0.8152877107428989,19.476916551589966,0.8152877107428989
70,2,Logistic Regression (Penalty = L2),2,1.0,0.8773584905660378,0.8723418074966099,0.0029420852661132812,0.8723418074966099
71,2,Naive Bayes,2,1.0,0.8584905660377359,0.8575926892959443,0.028100967407226562,0.8575926892959443
72,3,KNeighbors Classifier,0,1.0,0.6851851851851852,0.6903394942828609,0.08916544914245605,0.6903394942828609
73,3,SVC Classifier,0,1.0,0.46296296296296297,1.0,0.04470491409301758,0.0
74,3,Decision Tree,0,1.0,0.7685185185185185,0.7607001983173814,0.0018579959869384766,0.7607001983173814
75,3,RandomForest,0,1.0,0.7592592592592593,0.651089322621271,0.29366397857666016,0.651089322621271
76,3,AdaBoost (Discrete),0,1.0,0.8333333333333334,0.8180709816392515,20.266704559326172,0.8180709816392515
77,3,AdaBoost (Real),0,1.0,0.7962962962962963,0.7731688352097259,25.167163133621216,0.7731688352097259
78,3,Logistic Regression (Penalty = L2),0,1.0,0.7777777777777778,0.687912955883534,0.05952119827270508,0.687912955883534
79,3,Naive Bayes,0,1.0,0.8240740740740741,0.800467765133614,0.05955243110656738,0.800467765133614
80,3,KNeighbors Classifier,1,1.0,0.8598130841121495,0.8490583671115974,0.002507925033569336,0.8490583671115974
81,3,SVC Classifier,1,1.0,0.4672897196261682,1.0,0.05941343307495117,0.0
82,3,Decision Tree,1,1.0,0.7289719626168224,0.7077487308091998,0.057383060455322266,0.7077487308091998
83,3,RandomForest,1,1.0,0.7476635514018691,0.9534625892455924,0.35568737983703613,0.0
84,3,AdaBoost (Discrete),1,1.0,0.822429906542056,0.8045072205795996,20.958057403564453,0.8045072205795996
85,3,AdaBoost (Real),1,1.0,0.794392523364486,0.7445830086269069,24.939579248428345,0.7445830086269069
86,3,Logistic Regression (Penalty = L2),1,1.0,0.8504672897196262,0.8210967436686386,0.06355810165405273,0.8210967436686386
87,3,Naive Bayes,1,1.0,0.822429906542056,0.8019636390719966,0.06630825996398926,0.8019636390719966
88,3,KNeighbors Classifier,2,1.0,0.7641509433962265,0.7656402892684244,0.002643108367919922,0.7656402892684244
89,3,SVC Classifier,2,1.0,0.4716981132075472,1.0,0.06352639198303223,0.0
90,3,Decision Tree,2,1.0,0.7641509433962265,0.7621050061441578,0.0020072460174560547,0.7621050061441578
91,3,RandomForest,2,1.0,0.7830188679245284,0.9687293061514642,0.47052550315856934,0.0
92,3,AdaBoost (Discrete),2,1.0,0.8113207547169812,0.8002839397075241,24.93896174430847,0.8002839397075241
93,3,AdaBoost (Real),2,1.0,0.8301886792452831,0.8207681077238245,30.22698998451233,0.8207681077238245
94,3,Logistic Regression (Penalty = L2),2,1.0,0.8773584905660378,0.8723418074966099,0.0023508071899414062,0.8723418074966099
95,3,Naive Bayes,2,1.0,0.8584905660377359,0.8575926892959443,0.05555844306945801,0.8575926892959443
96,4,KNeighbors Classifier,0,1.0,0.6851851851851852,0.6903394942828609,0.07026290893554688,0.6903394942828609
97,4,SVC Classifier,0,1.0,0.46296296296296297,1.0,0.08001708984375,0.0
98,4,Decision Tree,0,1.0,0.6666666666666666,0.6842242816416392,0.06606101989746094,0.6842242816416392
99,4,RandomForest,0,1.0,0.7592592592592593,0.651089322621271,0.3524363040924072,0.651089322621271
100,4,AdaBoost (Discrete),0,1.0,0.7870370370370371,0.7467932171403544,32.009852170944214,0.7467932171403544
101,4,AdaBoost (Real),0,1.0,0.7870370370370371,0.7659082299181033,36.14618229866028,0.7659082299181033
102,4,Logistic Regression (Penalty = L2),0,1.0,0.7777777777777778,0.687912955883534,0.08004117012023926,0.687912955883534
103,4,Naive Bayes,0,1.0,0.8240740740740741,0.800467765133614,0.08328771591186523,0.800467765133614
104,4,KNeighbors Classifier,1,1.0,0.8598130841121495,0.8490583671115974,0.07931160926818848,0.8490583671115974
105,4,SVC Classifier,1,1.0,0.4672897196261682,1.0,0.07924103736877441,0.0
106,4,Decision Tree,1,1.0,0.8130841121495327,0.8127596564026885,0.0012521743774414062,0.8127596564026885
107,4,RandomForest,1,1.0,0.7476635514018691,0.9534625892455924,0.47754883766174316,0.0
108,4,AdaBoost (Discrete),1,1.0,0.822429906542056,0.8045072205795996,32.323896169662476,0.8045072205795996
109,4,AdaBoost (Real),1,1.0,0.8130841121495327,0.7454806389590128,37.308220863342285,0.7454806389590128
110,4,Logistic Regression (Penalty = L2),1,1.0,0.8504672897196262,0.8210967436686386,0.09929227828979492,0.8210967436686386
111,4,Naive Bayes,1,1.0,0.822429906542056,0.8019636390719966,0.09478092193603516,0.8019636390719966
112,4,KNeighbors Classifier,2,1.0,0.7641509433962265,0.7656402892684244,0.002567291259765625,0.7656402892684244
113,4,SVC Classifier,2,1.0,0.4716981132075472,1.0,0.09990882873535156,0.0
114,4,Decision Tree,2,1.0,0.7547169811320755,0.7288987909313764,0.002130270004272461,0.7288987909313764
115,4,RandomForest,2,1.0,0.7830188679245284,0.9687293061514642,0.4849550724029541,0.0
116,4,AdaBoost (Discrete),2,1.0,0.8018867924528302,0.791814134591313,38.30540060997009,0.791814134591313
117,4,AdaBoost (Real),2,1.0,0.8301886792452831,0.8127596564026885,43.991665840148926,0.8127596564026885
118,4,Logistic Regression (Penalty = L2),2,1.0,0.8773584905660378,0.8723418074966099,0.0953066349029541,0.8723418074966099
119,4,Naive Bayes,2,1.0,0.8584905660377359,0.8575926892959443,0.10668468475341797,0.8575926892959443
120,5,KNeighbors Classifier,0,1.0,0.6851851851851852,0.6903394942828609,0.0025637149810791016,0.6903394942828609
121,5,SVC Classifier,0,1.0,0.46296296296296297,1.0,0.09618663787841797,0.0
122,5,Decision Tree,0,1.0,0.7129629629629629,0.7091773942151992,0.09824061393737793,0.7091773942151992
123,5,RandomForest,0,1.0,0.7592592592592593,0.651089322621271,0.6398744583129883,0.651089322621271
124,5,AdaBoost (Discrete),0,1.0,0.7870370370370371,0.7467932171403544,38.81469535827637,0.7467932171403544
125,5,AdaBoost (Real),0,1.0,0.8055555555555556,0.7742800549635175,53.00120997428894,0.7742800549635175
126,5,Logistic Regression (Penalty = L2),0,1.0,0.7777777777777778,0.687912955883534,0.12285208702087402,0.687912955883534
127,5,Naive Bayes,0,1.0,0.8240740740740741,0.800467765133614,0.09590840339660645,0.800467765133614
128,5,KNeighbors Classifier,1,1.0,0.8598130841121495,0.8490583671115974,0.11169719696044922,0.8490583671115974
129,5,SVC Classifier,1,1.0,0.4672897196261682,1.0,0.11169981956481934,0.0
130,5,Decision Tree,1,1.0,0.7757009345794392,0.7382067873658885,0.002009153366088867,0.7382067873658885
131,5,RandomForest,1,1.0,0.7476635514018691,0.9534625892455924,0.7687869071960449,0.0
132,5,AdaBoost (Discrete),1,1.0,0.822429906542056,0.8045072205795996,42.041295528411865,0.8045072205795996
133,5,AdaBoost (Real),1,1.0,0.8037383177570093,0.7382067873658885,44.966286420822144,0.7382067873658885
134,5,Logistic Regression (Penalty = L2),1,1.0,0.8504672897196262,0.8210967436686386,0.10378861427307129,0.8210967436686386
135,5,Naive Bayes,1,1.0,0.822429906542056,0.8019636390719966,0.10331273078918457,0.8019636390719966
136,5,KNeighbors Classifier,2,1.0,0.7641509433962265,0.7656402892684244,0.10422730445861816,0.7656402892684244
137,5,SVC Classifier,2,1.0,0.4716981132075472,1.0,0.11063694953918457,0.0
138,5,Decision Tree,2,1.0,0.839622641509434,0.8291873437000402,0.0013124942779541016,0.8291873437000402
139,5,RandomForest,2,1.0,0.7830188679245284,0.9687293061514642,0.7214820384979248,0.0
140,5,AdaBoost (Discrete),2,1.0,0.8018867924528302,0.791814134591313,41.688817262649536,0.791814134591313
141,5,AdaBoost (Real),2,1.0,0.7735849056603774,0.7563580855304949,46.089134216308594,0.7563580855304949
142,5,Logistic Regression (Penalty = L2),2,1.0,0.8773584905660378,0.8723418074966099,0.10392928123474121,0.8723418074966099
143,5,Naive Bayes,2,1.0,0.8584905660377359,0.8575926892959443,0.10309362411499023,0.8575926892959443
144,6,KNeighbors Classifier,0,1.0,0.6851851851851852,0.6903394942828609,0.10420823097229004,0.6903394942828609
145,6,SVC Classifier,0,1.0,0.46296296296296297,1.0,0.10307478904724121,0.0
146,6,Decision Tree,0,1.0,0.7685185185185185,0.7607001983173814,0.10220193862915039,0.7607001983173814
147,6,RandomForest,0,1.0,0.7592592592592593,0.651089322621271,0.5232887268066406,0.651089322621271
148,6,AdaBoost (Discrete),0,1.0,0.8333333333333334,0.8180709816392515,43.81111025810242,0.8180709816392515
149,6,AdaBoost (Real),0,1.0,0.8055555555555556,0.7742800549635175,50.7865686416626,0.7742800549635175
150,6,Logistic Regression (Penalty = L2),0,1.0,0.7777777777777778,0.687912955883534,0.11167550086975098,0.687912955883534
151,6,Naive Bayes,0,1.0,0.8240740740740741,0.800467765133614,0.002134561538696289,0.800467765133614
152,6,KNeighbors Classifier,1,1.0,0.8598130841121495,0.8490583671115974,0.23998355865478516,0.8490583671115974
153,6,SVC Classifier,1,1.0,0.4672897196261682,1.0,0.11215353012084961,0.0
154,6,Decision Tree,1,1.0,0.8317757009345794,0.8127596564026885,0.10988235473632812,0.8127596564026885
155,6,RandomForest,1,1.0,0.7476635514018691,0.9534625892455924,0.5742306709289551,0.0
156,6,AdaBoost (Discrete),1,1.0,0.822429906542056,0.8045072205795996,43.76799774169922,0.8045072205795996
157,6,AdaBoost (Real),1,1.0,0.8037383177570093,0.7382067873658885,49.000794649124146,0.7382067873658885
158,6,Logistic Regression (Penalty = L2),1,1.0,0.8504672897196262,0.8210967436686386,0.11602973937988281,0.8210967436686386
159,6,Naive Bayes,1,1.0,0.822429906542056,0.8019636390719966,0.11178398132324219,0.8019636390719966
160,6,KNeighbors Classifier,2,1.0,0.7641509433962265,0.7656402892684244,0.10035514831542969,0.7656402892684244
161,6,SVC Classifier,2,1.0,0.4716981132075472,1.0,0.11134219169616699,0.0
162,6,Decision Tree,2,1.0,0.8207547169811321,0.8317269977642151,0.002084016799926758,0.8317269977642151
163,6,RandomForest,2,1.0,0.7830188679245284,0.9687293061514642,0.6737315654754639,0.0
164,6,AdaBoost (Discrete),2,1.0,0.8113207547169812,0.8002839397075241,45.91338109970093,0.8002839397075241
165,6,AdaBoost (Real),2,1.0,0.8679245283018868,0.8678566110556613,51.27076268196106,0.8678566110556613
166,6,Logistic Regression (Penalty = L2),2,1.0,0.8773584905660378,0.8723418074966099,0.1078042984008789,0.8723418074966099
167,6,Naive Bayes,2,1.0,0.8584905660377359,0.8575926892959443,0.10774898529052734,0.8575926892959443
168,7,KNeighbors Classifier,0,1.0,0.6851851851851852,0.6903394942828609,0.10308170318603516,0.6903394942828609
169,7,SVC Classifier,0,1.0,0.46296296296296297,1.0,0.002733469009399414,0.0
170,7,Decision Tree,0,1.0,0.7592592592592593,0.6828428405522907,0.10633087158203125,0.6828428405522907
171,7,RandomForest,0,1.0,0.7592592592592593,0.651089322621271,0.7448735237121582,0.651089322621271
172,7,AdaBoost (Discrete),0,1.0,0.7870370370370371,0.7467932171403544,45.17098379135132,0.7467932171403544
173,7,AdaBoost (Real),0,1.0,0.7870370370370371,0.7659082299181033,48.34969973564148,0.7659082299181033
174,7,Logistic Regression (Penalty = L2),0,1.0,0.7777777777777778,0.687912955883534,0.0023229122161865234,0.687912955883534
175,7,Naive Bayes,0,1.0,0.8240740740740741,0.800467765133614,0.09636116027832031,0.800467765133614
176,7,KNeighbors Classifier,1,1.0,0.8598130841121495,0.8490583671115974,0.10751724243164062,0.8490583671115974
177,7,SVC Classifier,1,1.0,0.4672897196261682,1.0,0.20913124084472656,0.0
178,7,Decision Tree,1,1.0,0.719626168224299,0.7168049268431441,0.09827542304992676,0.7168049268431441
179,7,RandomForest,1,1.0,0.7476635514018691,0.9534625892455924,0.5449833869934082,0.0
180,7,AdaBoost (Discrete),1,1.0,0.822429906542056,0.8045072205795996,45.00059485435486,0.8045072205795996
181,7,AdaBoost (Real),1,1.0,0.822429906542056,0.7805586434374694,56.11440658569336,0.7805586434374694
182,7,Logistic Regression (Penalty = L2),1,1.0,0.8504672897196262,0.8210967436686386,0.0024788379669189453,0.8210967436686386
183,7,Naive Bayes,1,1.0,0.822429906542056,0.8019636390719966,0.055040597915649414,0.8019636390719966
184,7,KNeighbors Classifier,2,1.0,0.7641509433962265,0.7656402892684244,0.02925562858581543,0.7656402892684244
185,7,SVC Classifier,2,1.0,0.4716981132075472,1.0,0.02810215950012207,0.0
186,7,Decision Tree,2,1.0,0.8113207547169812,0.8185117926786795,0.0019457340240478516,0.8185117926786795
187,7,RandomForest,2,1.0,0.7830188679245284,0.9687293061514642,0.1994919776916504,0.0
188,7,AdaBoost (Discrete),2,1.0,0.8113207547169812,0.8002839397075241,40.94683122634888,0.8002839397075241
189,7,AdaBoost (Real),2,1.0,0.8490566037735849,0.8548773221615306,58.091293811798096,0.8548773221615306
190,7,Logistic Regression (Penalty = L2),2,1.0,0.8773584905660378,0.8723418074966099,0.0024509429931640625,0.8723418074966099
191,7,Naive Bayes,2,1.0,0.8584905660377359,0.8575926892959443,0.1003725528717041,0.8575926892959443
192,8,KNeighbors Classifier,0,1.0,0.6851851851851852,0.6903394942828609,0.14731240272521973,0.6903394942828609
193,8,SVC Classifier,0,1.0,0.46296296296296297,1.0,0.12422609329223633,0.0
194,8,Decision Tree,0,1.0,0.8055555555555556,0.7852137729405617,0.11094927787780762,0.7852137729405617
195,8,RandomForest,0,1.0,0.7592592592592593,0.651089322621271,0.8516764640808105,0.651089322621271
196,8,AdaBoost (Discrete),0,1.0,0.7870370370370371,0.7467932171403544,51.40847563743591,0.7467932171403544
197,8,AdaBoost (Real),0,1.0,0.7962962962962963,0.7731688352097259,83.47091293334961,0.7731688352097259
198,8,Logistic Regression (Penalty = L2),0,1.0,0.7777777777777778,0.687912955883534,0.21211457252502441,0.687912955883534
199,8,Naive Bayes,0,1.0,0.8240740740740741,0.800467765133614,0.18641018867492676,0.800467765133614
200,8,KNeighbors Classifier,1,1.0,0.8598130841121495,0.8490583671115974,0.2080399990081787,0.8490583671115974
201,8,SVC Classifier,1,1.0,0.4672897196261682,1.0,0.21979570388793945,0.0
202,8,Decision Tree,1,1.0,0.7850467289719626,0.7740091855657797,0.18987369537353516,0.7740091855657797
203,8,RandomForest,1,1.0,0.7476635514018691,0.9534625892455924,1.4997353553771973,0.0
204,8,AdaBoost (Discrete),1,1.0,0.822429906542056,0.8045072205795996,92.6565330028534,0.8045072205795996
205,8,AdaBoost (Real),1,1.0,0.7850467289719626,0.7067207706080761,92.17988634109497,0.7067207706080761
206,8,Logistic Regression (Penalty = L2),1,1.0,0.8504672897196262,0.8210967436686386,0.20006680488586426,0.8210967436686386
207,8,Naive Bayes,1,1.0,0.822429906542056,0.8019636390719966,0.2118532657623291,0.8019636390719966
208,8,KNeighbors Classifier,2,1.0,0.7641509433962265,0.7656402892684244,0.2086954116821289,0.7656402892684244
209,8,SVC Classifier,2,1.0,0.4716981132075472,1.0,0.07571077346801758,0.0
210,8,Decision Tree,2,1.0,0.8018867924528302,0.7830634640118486,0.21027779579162598,0.7830634640118486
211,8,RandomForest,2,1.0,0.7830188679245284,0.9687293061514642,1.1161057949066162,0.0
212,8,AdaBoost (Discrete),2,1.0,0.8113207547169812,0.8002839397075241,91.15228867530823,0.8002839397075241
213,8,AdaBoost (Real),2,1.0,0.8113207547169812,0.8265168183793801,98.45277881622314,0.8265168183793801
214,8,Logistic Regression (Penalty = L2),2,1.0,0.8773584905660378,0.8723418074966099,0.4125344753265381,0.8723418074966099
215,8,Naive Bayes,2,1.0,0.8584905660377359,0.8575926892959443,0.0037059783935546875,0.8575926892959443
216,9,KNeighbors Classifier,0,1.0,0.6851851851851852,0.6903394942828609,0.20032095909118652,0.6903394942828609
217,9,SVC Classifier,0,1.0,0.46296296296296297,1.0,0.20797467231750488,0.0
218,9,Decision Tree,0,1.0,0.7777777777777778,0.7392105781043004,0.21400070190429688,0.7392105781043004
219,9,RandomForest,0,1.0,0.7592592592592593,0.651089322621271,1.5603930950164795,0.651089322621271
220,9,AdaBoost (Discrete),0,1.0,0.7870370370370371,0.7467932171403544,88.17345190048218,0.7467932171403544
221,9,AdaBoost (Real),0,1.0,0.7870370370370371,0.7659082299181033,90.80669569969177,0.7659082299181033
222,9,Logistic Regression (Penalty = L2),0,1.0,0.7777777777777778,0.687912955883534,0.18652963638305664,0.687912955883534
223,9,Naive Bayes,0,1.0,0.8240740740740741,0.800467765133614,0.0036537647247314453,0.800467765133614
224,9,KNeighbors Classifier,1,1.0,0.8598130841121495,0.8490583671115974,0.18843293190002441,0.8490583671115974
225,9,SVC Classifier,1,1.0,0.4672897196261682,1.0,0.18790459632873535,0.0
226,9,Decision Tree,1,1.0,0.7663551401869159,0.7190161765309578,0.22169995307922363,0.7190161765309578
227,9,RandomForest,1,1.0,0.7476635514018691,0.9534625892455924,1.2714684009552002,0.0
228,9,AdaBoost (Discrete),1,1.0,0.822429906542056,0.8045072205795996,83.4550199508667,0.8045072205795996
229,9,AdaBoost (Real),1,1.0,0.8411214953271028,0.7661124697514069,70.35981154441833,0.7661124697514069
230,9,Logistic Regression (Penalty = L2),1,1.0,0.8504672897196262,0.8210967436686386,0.11058998107910156,0.8210967436686386
231,9,Naive Bayes,1,1.0,0.822429906542056,0.8019636390719966,0.11042213439941406,0.8019636390719966
232,9,KNeighbors Classifier,2,1.0,0.7641509433962265,0.7656402892684244,0.11591792106628418,0.7656402892684244
233,9,SVC Classifier,2,1.0,0.4716981132075472,1.0,0.1113433837890625,0.0
234,9,Decision Tree,2,1.0,0.7735849056603774,0.75735408890954,0.11025547981262207,0.75735408890954
235,9,RandomForest,2,1.0,0.7830188679245284,0.9687293061514642,0.7825205326080322,0.0
236,9,AdaBoost (Discrete),2,1.0,0.8018867924528302,0.791814134591313,42.88600254058838,0.791814134591313
237,9,AdaBoost (Real),2,1.0,0.7830188679245284,0.7745966692414834,50.94761800765991,0.7745966692414834
238,9,Logistic Regression (Penalty = L2),2,1.0,0.8773584905660378,0.8723418074966099,0.11882543563842773,0.8723418074966099
239,9,Naive Bayes,2,1.0,0.8584905660377359,0.8575926892959443,0.12345457077026367,0.8575926892959443
240,10,KNeighbors Classifier,0,1.0,0.6851851851851852,0.6903394942828609,0.0027337074279785156,0.6903394942828609
241,10,SVC Classifier,0,1.0,0.46296296296296297,1.0,0.1237945556640625,0.0
242,10,Decision Tree,0,1.0,0.7685185185185185,0.7387185907581785,0.12214350700378418,0.7387185907581785
243,10,RandomForest,0,1.0,0.7592592592592593,0.651089322621271,0.8642032146453857,0.651089322621271
244,10,AdaBoost (Discrete),0,1.0,0.7870370370370371,0.7467932171403544,48.64170503616333,0.7467932171403544
245,10,AdaBoost (Real),0,1.0,0.7962962962962963,0.7731688352097259,53.61585807800293,0.7731688352097259
246,10,Logistic Regression (Penalty = L2),0,1.0,0.7777777777777778,0.687912955883534,0.0025060176849365234,0.687912955883534
247,10,Naive Bayes,0,1.0,0.8240740740740741,0.800467765133614,0.12013888359069824,0.800467765133614
248,10,KNeighbors Classifier,1,1.0,0.8598130841121495,0.8490583671115974,0.11947774887084961,0.8490583671115974
249,10,SVC Classifier,1,1.0,0.4672897196261682,1.0,0.11928582191467285,0.0
250,10,Decision Tree,1,1.0,0.7757009345794392,0.7481723425287042,0.001294851303100586,0.7481723425287042
251,10,RandomForest,1,1.0,0.7476635514018691,0.9534625892455924,0.8160688877105713,0.0
252,10,AdaBoost (Discrete),1,1.0,0.822429906542056,0.8045072205795996,47.40468907356262,0.8045072205795996
253,10,AdaBoost (Real),1,1.0,0.7850467289719626,0.7407546915250726,50.81649374961853,0.7407546915250726
254,10,Logistic Regression (Penalty = L2),1,1.0,0.8504672897196262,0.8210967436686386,0.13853931427001953,0.8210967436686386
255,10,Naive Bayes,1,1.0,0.822429906542056,0.8019636390719966,0.12402081489562988,0.8019636390719966
256,10,KNeighbors Classifier,2,1.0,0.7641509433962265,0.7656402892684244,0.12436532974243164,0.7656402892684244
257,10,SVC Classifier,2,1.0,0.4716981132075472,1.0,0.12340044975280762,0.0
258,10,Decision Tree,2,1.0,0.839622641509434,0.8127596564026885,0.12230205535888672,0.8127596564026885
259,10,RandomForest,2,1.0,0.7830188679245284,0.9687293061514642,0.8608849048614502,0.0
260,10,AdaBoost (Discrete),2,1.0,0.8113207547169812,0.8002839397075241,49.724483489990234,0.8002839397075241
261,10,AdaBoost (Real),2,1.0,0.839622641509434,0.8207681077238245,53.640286684036255,0.8207681077238245
262,10,Logistic Regression (Penalty = L2),2,1.0,0.8773584905660378,0.8723418074966099,0.1240990161895752,0.8723418074966099
263,10,Naive Bayes,2,1.0,0.8584905660377359,0.8575926892959443,0.12398862838745117,0.8575926892959443
264,11,KNeighbors Classifier,0,1.0,0.6851851851851852,0.6903394942828609,0.12378621101379395,0.6903394942828609
265,11,SVC Classifier,0,1.0,0.46296296296296297,1.0,0.12411904335021973,0.0
266,11,Decision Tree,0,1.0,0.7592592592592593,0.7663333803620854,0.12196826934814453,0.7663333803620854
267,11,RandomForest,0,1.0,0.7592592592592593,0.651089322621271,0.8774619102478027,0.651089322621271
268,11,AdaBoost (Discrete),0,1.0,0.7870370370370371,0.7467932171403544,43.219208002090454,0.7467932171403544
269,11,AdaBoost (Real),0,1.0,0.7962962962962963,0.7731688352097259,43.71777129173279,0.7731688352097259
270,11,Logistic Regression (Penalty = L2),0,1.0,0.7777777777777778,0.687912955883534,0.20468688011169434,0.687912955883534
271,11,Naive Bayes,0,1.0,0.8240740740740741,0.800467765133614,0.002142190933227539,0.800467765133614
272,11,KNeighbors Classifier,1,1.0,0.8598130841121495,0.8490583671115974,0.21582627296447754,0.8490583671115974
273,11,SVC Classifier,1,1.0,0.4672897196261682,1.0,0.1080019474029541,0.0
274,11,Decision Tree,1,1.0,0.8411214953271028,0.8169601045778886,0.0013136863708496094,0.8169601045778886
275,11,RandomForest,1,1.0,0.7476635514018691,0.9534625892455924,0.6485676765441895,0.0
276,11,AdaBoost (Discrete),1,1.0,0.822429906542056,0.8045072205795996,39.33668565750122,0.8045072205795996
277,11,AdaBoost (Real),1,1.0,0.8037383177570093,0.7382067873658885,41.37474536895752,0.7382067873658885
278,11,Logistic Regression (Penalty = L2),1,1.0,0.8504672897196262,0.8210967436686386,0.09513449668884277,0.8210967436686386
279,11,Naive Bayes,1,1.0,0.822429906542056,0.8019636390719966,0.11476731300354004,0.8019636390719966
280,11,KNeighbors Classifier,2,1.0,0.7641509433962265,0.7656402892684244,0.11245298385620117,0.7656402892684244
281,11,SVC Classifier,2,1.0,0.4716981132075472,1.0,0.11130166053771973,0.0
282,11,Decision Tree,2,1.0,0.7924528301886793,0.7747759118010302,0.002061128616333008,0.7747759118010302
283,11,RandomForest,2,1.0,0.7830188679245284,0.9687293061514642,0.660759687423706,0.0
284,11,AdaBoost (Discrete),2,1.0,0.8018867924528302,0.791814134591313,41.29971480369568,0.791814134591313
285,11,AdaBoost (Real),2,1.0,0.8113207547169812,0.8002839397075241,44.620951414108276,0.8002839397075241
286,11,Logistic Regression (Penalty = L2),2,1.0,0.8773584905660378,0.8723418074966099,0.1125187873840332,0.8723418074966099
287,11,Naive Bayes,2,1.0,0.8584905660377359,0.8575926892959443,0.10635757446289062,0.8575926892959443
288,12,KNeighbors Classifier,0,1.0,0.6851851851851852,0.6903394942828609,0.11661195755004883,0.6903394942828609
289,12,SVC Classifier,0,1.0,0.46296296296296297,1.0,0.111572265625,0.0
290,12,Decision Tree,0,1.0,0.8148148148148148,0.8024815364287942,0.10595870018005371,0.8024815364287942
291,12,RandomForest,0,1.0,0.7592592592592593,0.651089322621271,0.7300558090209961,0.651089322621271
292,12,AdaBoost (Discrete),0,1.0,0.7870370370370371,0.7467932171403544,41.113678216934204,0.7467932171403544
293,12,AdaBoost (Real),0,1.0,0.8148148148148148,0.7816200229187737,45.587961196899414,0.7816200229187737
294,12,Logistic Regression (Penalty = L2),0,1.0,0.7777777777777778,0.687912955883534,0.10765719413757324,0.687912955883534
295,12,Naive Bayes,0,1.0,0.8240740740740741,0.800467765133614,0.10733842849731445,0.800467765133614
296,12,KNeighbors Classifier,1,1.0,0.8598130841121495,0.8490583671115974,0.1078178882598877,0.8490583671115974
297,12,SVC Classifier,1,1.0,0.4672897196261682,1.0,0.10765504837036133,0.0
298,12,Decision Tree,1,1.0,0.7850467289719626,0.7854194189759214,0.0018465518951416016,0.7854194189759214
299,12,RandomForest,1,1.0,0.7476635514018691,0.9534625892455924,0.6459686756134033,0.0
300,12,AdaBoost (Discrete),1,1.0,0.822429906542056,0.8045072205795996,40.63572025299072,0.8045072205795996
301,12,AdaBoost (Real),1,1.0,0.7850467289719626,0.7269543364343135,43.03576445579529,0.7269543364343135
302,12,Logistic Regression (Penalty = L2),1,1.0,0.8504672897196262,0.8210967436686386,0.10259008407592773,0.8210967436686386
303,12,Naive Bayes,1,1.0,0.822429906542056,0.8019636390719966,0.0021216869354248047,0.8019636390719966
304,12,KNeighbors Classifier,2,1.0,0.7641509433962265,0.7656402892684244,0.10793566703796387,0.7656402892684244
305,12,SVC Classifier,2,1.0,0.4716981132075472,1.0,0.10797548294067383,0.0
306,12,Decision Tree,2,1.0,0.7169811320754716,0.7037835959252762,0.10606670379638672,0.7037835959252762
307,12,RandomForest,2,1.0,0.7830188679245284,0.9687293061514642,0.5346865653991699,0.0
308,12,AdaBoost (Discrete),2,1.0,0.8018867924528302,0.791814134591313,40.127382040023804,0.791814134591313
309,12,AdaBoost (Real),2,1.0,0.6886792452830188,0.7355560918322337,42.170222997665405,0.7355560918322337
310,12,Logistic Regression (Penalty = L2),2,1.0,0.8773584905660378,0.8723418074966099,0.09546184539794922,0.8723418074966099
311,12,Naive Bayes,2,1.0,0.8584905660377359,0.8575926892959443,0.09452223777770996,0.8575926892959443
