,feat_set_id,classifier,fold_id,feat_th,score,geo_score,exec_t,geo_score_woz
0,0,KNeighbors Classifier,0,0.4,0.6851851851851852,0.6745644277573617,0.06774258613586426,0.6745644277573617
1,0,SVC Classifier,0,0.4,0.46296296296296297,1.0,0.05794239044189453,0.0
2,0,Decision Tree,0,0.4,0.6111111111111112,0.6398245235763461,0.030583620071411133,0.6398245235763461
3,0,RandomForest,0,0.4,0.6296296296296297,0.821651382743258,0.25156331062316895,0.0
4,0,AdaBoost (Discrete),0,0.4,0.6203703703703703,0.6333835690593327,17.790109634399414,0.6333835690593327
5,0,AdaBoost (Real),0,0.4,0.46296296296296297,0.5517062567322718,17.855733633041382,0.5517062567322718
6,0,Logistic Regression (Penalty = L2),0,0.4,0.6481481481481481,0.8448085774721481,0.08405447006225586,0.0
7,0,Naive Bayes,0,0.4,0.6851851851851852,0.6745644277573617,0.03628206253051758,0.6745644277573617
8,0,KNeighbors Classifier,1,0.4,0.616822429906542,0.6391753205681777,0.0350489616394043,0.6391753205681777
9,0,SVC Classifier,1,0.4,0.4672897196261682,1.0,0.03463459014892578,0.0
10,0,Decision Tree,1,0.4,0.6074766355140186,0.6513555624326306,0.0013263225555419922,0.6513555624326306
11,0,RandomForest,1,0.4,0.7009345794392523,0.5918091029279334,0.2445681095123291,0.5918091029279334
12,0,AdaBoost (Discrete),1,0.4,0.5233644859813084,0.5643751425617494,13.624793529510498,0.5643751425617494
13,0,AdaBoost (Real),1,0.4,0.48598130841121495,0.5673852500666509,15.37141752243042,0.5673852500666509
14,0,Logistic Regression (Penalty = L2),1,0.4,0.6915887850467289,0.5029733718731741,0.0020160675048828125,0.5029733718731741
15,0,Naive Bayes,1,0.4,0.719626168224299,0.7044563365978103,0.0022249221801757812,0.7044563365978103
16,0,KNeighbors Classifier,2,0.4,0.6320754716981132,0.5981395124884883,0.03581523895263672,0.5981395124884883
17,0,SVC Classifier,2,0.4,0.4716981132075472,1.0,0.0023801326751708984,0.0
18,0,Decision Tree,2,0.4,0.6509433962264151,0.6324555320336759,0.0022165775299072266,0.6324555320336759
19,0,RandomForest,2,0.4,0.7075471698113207,0.6315552371794037,0.28136444091796875,0.6315552371794037
20,0,AdaBoost (Discrete),2,0.4,0.660377358490566,0.6610079036990795,16.284305095672607,0.6610079036990795
21,0,AdaBoost (Real),2,0.4,0.5188679245283019,0.581375669416627,18.991363763809204,0.581375669416627
22,0,Logistic Regression (Penalty = L2),2,0.4,0.7264150943396226,0.6821138637199773,0.04384422302246094,0.6821138637199773
23,0,Naive Bayes,2,0.4,0.7169811320754716,0.7221746273694555,0.04414796829223633,0.7221746273694555
24,1,KNeighbors Classifier,0,0.4,0.6018518518518519,0.5891064086338552,0.0428159236907959,0.5891064086338552
25,1,SVC Classifier,0,0.4,0.46296296296296297,1.0,0.043372392654418945,0.0
26,1,Decision Tree,0,0.4,0.6296296296296297,0.6062206705349796,0.042009830474853516,0.6062206705349796
27,1,RandomForest,0,0.4,0.6388888888888888,0.46720665934113104,0.30690932273864746,0.46720665934113104
28,1,AdaBoost (Discrete),0,0.4,0.5462962962962963,0.5171555185527454,16.847407579421997,0.5171555185527454
29,1,AdaBoost (Real),0,0.4,0.6203703703703703,0.5704346472015741,19.76038098335266,0.5704346472015741
30,1,Logistic Regression (Penalty = L2),0,0.4,0.6111111111111112,0.5248499947933156,0.003566741943359375,0.5248499947933156
31,1,Naive Bayes,0,0.4,0.6574074074074074,0.6697215846587604,0.04585671424865723,0.6697215846587604
32,1,KNeighbors Classifier,1,0.4,0.6074766355140186,0.6338880565711903,0.003772258758544922,0.6338880565711903
33,1,SVC Classifier,1,0.4,0.4672897196261682,1.0,0.0040035247802734375,0.0
34,1,Decision Tree,1,0.4,0.5233644859813084,0.5643751425617494,0.0013589859008789062,0.5643751425617494
35,1,RandomForest,1,0.4,0.6542056074766355,0.4155471323550328,0.26332879066467285,0.4155471323550328
36,1,AdaBoost (Discrete),1,0.4,0.5794392523364486,0.5926115577918006,19.627756118774414,0.5926115577918006
37,1,AdaBoost (Real),1,0.4,0.6542056074766355,0.6717595253170683,22.579862356185913,0.6717595253170683
38,1,Logistic Regression (Penalty = L2),1,0.4,0.7009345794392523,0.6687656346094419,0.05819249153137207,0.6687656346094419
39,1,Naive Bayes,1,0.4,0.7009345794392523,0.7387335139138633,0.05526542663574219,0.7387335139138633
40,1,KNeighbors Classifier,2,0.4,0.6037735849056604,0.6042750794713536,0.052915096282958984,0.6042750794713536
41,1,SVC Classifier,2,0.4,0.4716981132075472,1.0,0.050919532775878906,0.0
42,1,Decision Tree,2,0.4,0.6037735849056604,0.6220184293096723,0.0017833709716796875,0.6220184293096723
43,1,RandomForest,2,0.4,0.6886792452830188,0.6717595253170683,0.368455171585083,0.6717595253170683
44,1,AdaBoost (Discrete),2,0.4,0.6415094339622641,0.6377782076894628,19.634552240371704,0.6377782076894628
45,1,AdaBoost (Real),2,0.4,0.5471698113207547,0.5967540575449654,20.231332302093506,0.5967540575449654
46,1,Logistic Regression (Penalty = L2),2,0.4,0.6792452830188679,0.6738490047470291,0.05092477798461914,0.6738490047470291
47,1,Naive Bayes,2,0.4,0.6981132075471698,0.7297775131909429,0.002194643020629883,0.7297775131909429
48,2,KNeighbors Classifier,0,0.4,0.75,0.7665456905030681,0.0483853816986084,0.7665456905030681
49,2,SVC Classifier,0,0.4,0.46296296296296297,1.0,0.002420186996459961,0.0
50,2,Decision Tree,0,0.4,0.7685185185185185,0.7387185907581785,0.0021741390228271484,0.7387185907581785
51,2,RandomForest,0,0.4,0.75,0.44400173782005525,0.2423572540283203,0.0
52,2,AdaBoost (Discrete),0,0.4,0.5277777777777778,0.5509164103883684,19.075172662734985,0.5509164103883684
53,2,AdaBoost (Real),0,0.4,0.7685185185185185,0.7730733645855429,27.376688957214355,0.7730733645855429
54,2,Logistic Regression (Penalty = L2),0,0.4,0.8240740740740741,0.7378964207690792,0.07058358192443848,0.7378964207690792
55,2,Naive Bayes,0,0.4,0.8055555555555556,0.7252781566485548,0.0718224048614502,0.7252781566485548
56,2,KNeighbors Classifier,1,0.4,0.8317757009345794,0.8162784518321073,0.0025708675384521484,0.8162784518321073
57,2,SVC Classifier,1,0.4,0.4672897196261682,1.0,0.07091093063354492,0.0
58,2,Decision Tree,1,0.4,0.7383177570093458,0.7584503823779923,0.0012907981872558594,0.7584503823779923
59,2,RandomForest,1,0.4,0.7570093457943925,0.35838344896737145,0.43419909477233887,0.0
60,2,AdaBoost (Discrete),1,0.4,0.6448598130841121,0.9746794344808963,25.505483150482178,0.0
61,2,AdaBoost (Real),1,0.4,0.7757009345794392,0.7525475961486577,26.11393976211548,0.7525475961486577
62,2,Logistic Regression (Penalty = L2),1,0.4,0.8317757009345794,0.7716457711532202,0.05183267593383789,0.7716457711532202
63,2,Naive Bayes,1,0.4,0.8317757009345794,0.7716457711532202,0.06238079071044922,0.7716457711532202
64,2,KNeighbors Classifier,2,0.4,0.7830188679245284,0.7957222025388657,0.06394577026367188,0.7957222025388657
65,2,SVC Classifier,2,0.4,0.4716981132075472,1.0,0.06446266174316406,0.0
66,2,Decision Tree,2,0.4,0.7735849056603774,0.7745966692414834,0.0020189285278320312,0.7745966692414834
67,2,RandomForest,2,0.4,0.7735849056603774,0.5588597702164573,0.39841508865356445,0.0
68,2,AdaBoost (Discrete),2,0.4,0.7641509433962265,0.7113117640155692,26.989205360412598,0.7113117640155692
69,2,AdaBoost (Real),2,0.4,0.7641509433962265,0.7425375075264609,35.25496029853821,0.7425375075264609
70,2,Logistic Regression (Penalty = L2),2,0.4,0.8301886792452831,0.8031068545740871,0.08380961418151855,0.8031068545740871
71,2,Naive Bayes,2,0.4,0.8018867924528302,0.7742378103686055,0.003143787384033203,0.7742378103686055
72,3,KNeighbors Classifier,0,0.4,0.5277777777777778,0.5054969206745503,0.08409595489501953,0.5054969206745503
73,3,SVC Classifier,0,0.4,0.46296296296296297,1.0,0.08339786529541016,0.0
74,3,Decision Tree,0,0.4,0.5648148148148148,0.4973316569054668,0.08200192451477051,0.4973316569054668
75,3,RandomForest,0,0.4,0.6481481481481481,0.8288491160501965,0.422471284866333,0.0
76,3,AdaBoost (Discrete),0,0.4,0.5277777777777778,0.4949232003839766,31.753268480300903,0.4949232003839766
77,3,AdaBoost (Real),0,0.4,0.5740740740740741,0.49346107746612433,34.879714012145996,0.49346107746612433
78,3,Logistic Regression (Penalty = L2),0,0.4,0.6203703703703703,0.7810497525992064,0.0870656967163086,0.0
79,3,Naive Bayes,0,0.4,0.6111111111111112,0.8080678730723118,0.08764839172363281,0.0
80,3,KNeighbors Classifier,1,0.4,0.514018691588785,0.5404800619228137,0.07912278175354004,0.5404800619228137
81,3,SVC Classifier,1,0.4,0.4672897196261682,1.0,0.08308196067810059,0.0
82,3,Decision Tree,1,0.4,0.5420560747663551,0.5794383693420786,0.0015969276428222656,0.5794383693420786
83,3,RandomForest,1,0.4,0.6542056074766355,0.8532572237201199,0.517578125,0.0
84,3,AdaBoost (Discrete),1,0.4,0.48598130841121495,0.5209224607559049,33.67779326438904,0.5209224607559049
85,3,AdaBoost (Real),1,0.4,0.5607476635514018,0.5935557301892008,42.151691913604736,0.5935557301892008
86,3,Logistic Regression (Penalty = L2),1,0.4,0.6542056074766355,0.8431485855681351,0.09436655044555664,0.0
87,3,Naive Bayes,1,0.4,0.6448598130841121,0.8501939370835523,0.09118223190307617,0.0
88,3,KNeighbors Classifier,2,0.4,0.5943396226415094,0.5673852500666509,0.09593057632446289,0.5673852500666509
89,3,SVC Classifier,2,0.4,0.4716981132075472,1.0,0.08684968948364258,0.0
90,3,Decision Tree,2,0.4,0.5754716981132075,0.49227746805221545,0.09798908233642578,0.49227746805221545
91,3,RandomForest,2,0.4,0.6226415094339622,0.8230659353832263,0.5100710391998291,0.0
92,3,AdaBoost (Discrete),2,0.4,0.5377358490566038,0.4848726899487158,36.65115714073181,0.4848726899487158
93,3,AdaBoost (Real),2,0.4,0.330188679245283,0.3653556657482992,39.535107135772705,0.3653556657482992
94,3,Logistic Regression (Penalty = L2),2,0.4,0.6509433962264151,0.8371381570959275,0.0016431808471679688,0.0
95,3,Naive Bayes,2,0.4,0.6226415094339622,0.8230659353832263,0.09836721420288086,0.0
96,4,KNeighbors Classifier,0,0.4,0.5833333333333334,0.6011405346781413,0.10692000389099121,0.6011405346781413
97,4,SVC Classifier,0,0.4,0.46296296296296297,1.0,0.09891939163208008,0.0
98,4,Decision Tree,0,0.4,0.5648148148148148,0.5760553716900688,0.09747099876403809,0.5760553716900688
99,4,RandomForest,0,0.4,0.5740740740740741,0.7794393361692682,0.7096266746520996,0.0
100,4,AdaBoost (Discrete),0,0.4,0.6203703703703703,0.6204944550532654,34.50658106803894,0.6204944550532654
101,4,AdaBoost (Real),0,0.4,0.4722222222222222,0.527123766408901,44.80712914466858,0.527123766408901
102,4,Logistic Regression (Penalty = L2),0,0.4,0.6018518518518519,0.7693028590054619,0.002956867218017578,0.0
103,4,Naive Bayes,0,0.4,0.6203703703703703,0.5974511242926364,0.13456463813781738,0.5974511242926364
104,4,KNeighbors Classifier,1,0.4,0.48598130841121495,0.5099705096063886,0.11153817176818848,0.5099705096063886
105,4,SVC Classifier,1,0.4,0.4672897196261682,1.0,0.11833429336547852,0.0
106,4,Decision Tree,1,0.4,0.5046728971962616,0.5435251404952659,0.12259864807128906,0.5435251404952659
107,4,RandomForest,1,0.4,0.5981308411214953,0.8060152634567825,0.7162621021270752,0.0
108,4,AdaBoost (Discrete),1,0.4,0.5233644859813084,0.5446539630663001,43.16439342498779,0.5446539630663001
109,4,AdaBoost (Real),1,0.4,0.4953271028037383,0.5450286822167724,52.07954144477844,0.5450286822167724
110,4,Logistic Regression (Penalty = L2),1,0.4,0.6355140186915887,0.39895423941956587,0.1231689453125,0.39895423941956587
111,4,Naive Bayes,1,0.4,0.6074766355140186,0.6251426784081837,0.11623048782348633,0.6251426784081837
112,4,KNeighbors Classifier,2,0.4,0.6509433962264151,0.6365481572054327,0.11168718338012695,0.6365481572054327
113,4,SVC Classifier,2,0.4,0.4716981132075472,1.0,0.12366390228271484,0.0
114,4,Decision Tree,2,0.4,0.5754716981132075,0.5580318787171654,0.11369991302490234,0.5580318787171654
115,4,RandomForest,2,0.4,0.6792452830188679,0.8917312214665997,0.835167407989502,0.0
116,4,AdaBoost (Discrete),2,0.4,0.6226415094339622,0.5751861902449834,42.03407430648804,0.5751861902449834
117,4,AdaBoost (Real),2,0.4,0.6415094339622641,0.6076795808137692,51.0530743598938,0.6076795808137692
118,4,Logistic Regression (Penalty = L2),2,0.4,0.660377358490566,0.4893299499801468,0.0019159317016601562,0.4893299499801468
119,4,Naive Bayes,2,0.4,0.6886792452830188,0.6978409905410441,0.11510014533996582,0.6978409905410441
120,5,KNeighbors Classifier,0,0.4,0.4444444444444444,0.46132867593156524,0.11185431480407715,0.46132867593156524
121,5,SVC Classifier,0,0.4,0.46296296296296297,1.0,0.11032223701477051,0.0
122,5,Decision Tree,0,0.4,0.4351851851851852,0.4675667418121198,0.10551857948303223,0.4675667418121198
123,5,RandomForest,0,0.4,0.4722222222222222,0.33254809470829577,0.69541335105896,0.0
124,5,AdaBoost (Discrete),0,0.4,0.4537037037037037,0.4766499490546816,40.72545838356018,0.4766499490546816
125,5,AdaBoost (Real),0,0.4,0.3055555555555556,0.2968460350462866,50.4732608795166,0.2968460350462866
126,5,Logistic Regression (Penalty = L2),0,0.4,0.5092592592592593,0.5667243338592717,0.0025207996368408203,0.0
127,5,Naive Bayes,0,0.4,0.5740740740740741,0.7794393361692682,0.11874198913574219,0.0
128,5,KNeighbors Classifier,1,0.4,0.40186915887850466,0.4472135954999579,0.1311941146850586,0.4472135954999579
129,5,SVC Classifier,1,0.4,0.4672897196261682,1.0,0.0022199153900146484,0.0
130,5,Decision Tree,1,0.4,0.4392523364485981,0.44516679764190065,0.001268625259399414,0.44516679764190065
131,5,RandomForest,1,0.4,0.5046728971962616,0.6826924810955317,0.8920481204986572,0.0
132,5,AdaBoost (Discrete),1,0.4,0.4485981308411215,0.4541646125423012,44.101826190948486,0.4541646125423012
133,5,AdaBoost (Real),1,0.4,0.35514018691588783,0.4063798282013443,47.85656714439392,0.4063798282013443
134,5,Logistic Regression (Penalty = L2),1,0.4,0.48598130841121495,0.5908391567007971,0.11071896553039551,0.0
135,5,Naive Bayes,1,0.4,0.5233644859813084,0.7423464047399292,0.11880826950073242,0.0
136,5,KNeighbors Classifier,2,0.4,0.39622641509433965,0.3672056269893592,0.11570334434509277,0.3672056269893592
137,5,SVC Classifier,2,0.4,0.4716981132075472,1.0,0.1158592700958252,0.0
138,5,Decision Tree,2,0.4,0.4056603773584906,0.3708238533191544,0.11376786231994629,0.3708238533191544
139,5,RandomForest,2,0.4,0.49056603773584906,0.6570331816408039,0.9272105693817139,0.0
140,5,AdaBoost (Discrete),2,0.4,0.4056603773584906,0.3708238533191544,42.33324599266052,0.3708238533191544
141,5,AdaBoost (Real),2,0.4,0.4528301886792453,0.2883070263787606,48.09231948852539,0.2883070263787606
142,5,Logistic Regression (Penalty = L2),2,0.4,0.4528301886792453,0.47989897926858555,0.11460161209106445,0.0
143,5,Naive Bayes,2,0.4,0.5,0.7200548655035272,0.11954689025878906,0.0
144,6,KNeighbors Classifier,0,0.4,0.6203703703703703,0.6167675930722297,0.23646831512451172,0.6167675930722297
145,6,SVC Classifier,0,0.4,0.46296296296296297,1.0,0.1389603614807129,0.0
146,6,Decision Tree,0,0.4,0.5370370370370371,0.5492377104496441,0.0012593269348144531,0.5492377104496441
147,6,RandomForest,0,0.4,0.6296296296296297,0.39879975565801373,0.8639407157897949,0.39879975565801373
148,6,AdaBoost (Discrete),0,0.4,0.6018518518518519,0.6204944550532654,50.41145586967468,0.6204944550532654
149,6,AdaBoost (Real),0,0.4,0.5925925925925926,0.5466454184531375,53.36377191543579,0.5466454184531375
150,6,Logistic Regression (Penalty = L2),0,0.4,0.6388888888888888,0.5493264474604478,0.0021805763244628906,0.5493264474604478
151,6,Naive Bayes,0,0.4,0.6666666666666666,0.627752934248428,0.11977505683898926,0.627752934248428
152,6,KNeighbors Classifier,1,0.4,0.616822429906542,0.6610079036990795,0.12811040878295898,0.6610079036990795
153,6,SVC Classifier,1,0.4,0.4672897196261682,1.0,0.13061928749084473,0.0
154,6,Decision Tree,1,0.4,0.5327102803738317,0.5688725111853764,0.0013206005096435547,0.5688725111853764
155,6,RandomForest,1,0.4,0.6635514018691588,0.4180581054124661,0.6883788108825684,0.4180581054124661
156,6,AdaBoost (Discrete),1,0.4,0.6635514018691588,0.7012489724198862,54.011202335357666,0.7012489724198862
157,6,AdaBoost (Real),1,0.4,0.5607476635514018,0.602758693418601,61.37674951553345,0.602758693418601
158,6,Logistic Regression (Penalty = L2),1,0.4,0.7102803738317757,0.6959158936085519,0.13456201553344727,0.6959158936085519
159,6,Naive Bayes,1,0.4,0.6728971962616822,0.6864173363017501,0.002197742462158203,0.6864173363017501
160,6,KNeighbors Classifier,2,0.4,0.6886792452830188,0.7153193127921719,0.1117255687713623,0.7153193127921719
161,6,SVC Classifier,2,0.4,0.4716981132075472,1.0,0.13216662406921387,0.0
162,6,Decision Tree,2,0.4,0.6415094339622641,0.6296519852933434,0.12997817993164062,0.6296519852933434
163,6,RandomForest,2,0.4,0.6415094339622641,0.5289353788134001,0.8372113704681396,0.5289353788134001
164,6,AdaBoost (Discrete),2,0.4,0.6415094339622641,0.6594284231087459,50.025688886642456,0.6594284231087459
165,6,AdaBoost (Real),2,0.4,0.6886792452830188,0.6830191263138586,55.460628271102905,0.6830191263138586
166,6,Logistic Regression (Penalty = L2),2,0.4,0.7358490566037735,0.7425375075264609,0.1346731185913086,0.7425375075264609
167,6,Naive Bayes,2,0.4,0.7075471698113207,0.7525120424388688,0.13579511642456055,0.7525120424388688
168,7,KNeighbors Classifier,0,0.4,0.6851851851851852,0.6903394942828609,0.13254046440124512,0.6903394942828609
169,7,SVC Classifier,0,0.4,0.46296296296296297,1.0,0.135176420211792,0.0
170,7,Decision Tree,0,0.4,0.7870370370370371,0.7971353857128798,0.1342916488647461,0.7971353857128798
171,7,RandomForest,0,0.4,0.7592592592592593,0.651089322621271,1.1018083095550537,0.651089322621271
172,7,AdaBoost (Discrete),0,0.4,0.7870370370370371,0.7467932171403544,51.843493700027466,0.7467932171403544
173,7,AdaBoost (Real),0,0.4,0.7962962962962963,0.7731688352097259,54.39320254325867,0.7731688352097259
174,7,Logistic Regression (Penalty = L2),0,0.4,0.7777777777777778,0.687912955883534,0.0023376941680908203,0.687912955883534
175,7,Naive Bayes,0,0.4,0.8240740740740741,0.800467765133614,0.002139568328857422,0.800467765133614
176,7,KNeighbors Classifier,1,0.4,0.8598130841121495,0.8490583671115974,0.1321711540222168,0.8490583671115974
177,7,SVC Classifier,1,0.4,0.4672897196261682,1.0,0.26056504249572754,0.0
178,7,Decision Tree,1,0.4,0.8130841121495327,0.8235490260528069,0.13016867637634277,0.8235490260528069
179,7,RandomForest,1,0.4,0.7476635514018691,0.9534625892455924,0.9227907657623291,0.0
180,7,AdaBoost (Discrete),1,0.4,0.822429906542056,0.8045072205795996,53.102304220199585,0.8045072205795996
181,7,AdaBoost (Real),1,0.4,0.794392523364486,0.7307113314965984,57.75635838508606,0.7307113314965984
182,7,Logistic Regression (Penalty = L2),1,0.4,0.8504672897196262,0.8210967436686386,0.13068819046020508,0.8210967436686386
183,7,Naive Bayes,1,0.4,0.822429906542056,0.8019636390719966,0.002229928970336914,0.8019636390719966
184,7,KNeighbors Classifier,2,0.4,0.7641509433962265,0.7656402892684244,0.24918580055236816,0.7656402892684244
185,7,SVC Classifier,2,0.4,0.4716981132075472,1.0,0.1438307762145996,0.0
186,7,Decision Tree,2,0.4,0.7452830188679245,0.7003244496815454,0.1384260654449463,0.7003244496815454
187,7,RandomForest,2,0.4,0.7830188679245284,0.9687293061514642,0.8530292510986328,0.0
188,7,AdaBoost (Discrete),2,0.4,0.8018867924528302,0.791814134591313,53.621413230895996,0.791814134591313
189,7,AdaBoost (Real),2,0.4,0.8490566037735849,0.8506628162713077,57.61402750015259,0.8506628162713077
190,7,Logistic Regression (Penalty = L2),2,0.4,0.8773584905660378,0.8723418074966099,0.13431954383850098,0.8723418074966099
191,7,Naive Bayes,2,0.4,0.8584905660377359,0.8575926892959443,0.1318652629852295,0.8575926892959443
