,feat_set_id,classifier,fold_id,feat_th,score,geo_score,exec_t,geo_score_woz
0,0,KNeighbors Classifier,0,0.75,0.9,0.9085602964160698,0.07958221435546875,0.9085602964160698
1,0,SVC Classifier,0,0.75,0.4166666666666667,0.22360679774997896,0.03912615776062012,0.0
2,0,Decision Tree,0,0.75,0.8833333333333333,0.8892233261225158,0.03841733932495117,0.8892233261225158
3,0,RandomForest,0,0.75,0.8666666666666667,0.8724415058636109,0.2567458152770996,0.8724415058636109
4,0,AdaBoost (Discrete),0,0.75,0.9,0.9053945554302176,16.931669235229492,0.9053945554302176
5,0,AdaBoost (Real),0,0.75,0.9333333333333333,0.9410360288810286,19.046024799346924,0.9410360288810286
6,0,Logistic Regression (Penalty = L2),0,0.75,0.9166666666666666,0.9250831838185912,0.09728717803955078,0.9250831838185912
7,0,Naive Bayes,0,0.75,0.9333333333333333,0.9410360288810286,0.003484964370727539,0.9410360288810286
8,0,KNeighbors Classifier,1,0.75,0.9666666666666667,0.9691999875015047,0.040207624435424805,0.9691999875015047
9,0,SVC Classifier,1,0.75,0.4,1.0,0.0017330646514892578,0.0
10,0,Decision Tree,1,0.75,0.8333333333333334,0.7819527010941333,0.0019779205322265625,0.7819527010941333
11,0,RandomForest,1,0.75,0.9166666666666666,0.9140478514466457,0.29300951957702637,0.9140478514466457
12,0,AdaBoost (Discrete),1,0.75,0.8833333333333333,0.8662391053409028,14.853869438171387,0.8662391053409028
13,0,AdaBoost (Real),1,0.75,0.85,0.8358603846235818,16.858741998672485,0.8358603846235818
14,0,Logistic Regression (Penalty = L2),1,0.75,0.9333333333333333,0.9339246536301676,0.04628896713256836,0.9339246536301676
15,0,Naive Bayes,1,0.75,0.9666666666666667,0.9654893846056297,0.04351401329040527,0.9654893846056297
16,0,KNeighbors Classifier,2,0.75,0.9655172413793104,0.9701312318500641,0.04383444786071777,0.9701312318500641
17,0,SVC Classifier,2,0.75,0.39655172413793105,1.0,0.04313802719116211,0.0
18,0,Decision Tree,2,0.75,0.9655172413793104,0.9701312318500641,0.0018537044525146484,0.9701312318500641
19,0,RandomForest,2,0.75,1.0,1.0,0.3623323440551758,1.0
20,0,AdaBoost (Discrete),2,0.75,0.9655172413793104,0.967693705920519,17.652770042419434,0.967693705920519
21,0,AdaBoost (Real),2,0.75,0.9655172413793104,0.967693705920519,19.936344861984253,0.967693705920519
22,0,Logistic Regression (Penalty = L2),2,0.75,0.9655172413793104,0.9701312318500641,0.04318118095397949,0.9701312318500641
23,0,Naive Bayes,2,0.75,0.9655172413793104,0.967693705920519,0.04353976249694824,0.967693705920519
24,1,KNeighbors Classifier,0,0.75,0.95,0.9564655913861946,0.04033017158508301,0.9564655913861946
25,1,SVC Classifier,0,0.75,0.45,0.3872983346207417,0.03914618492126465,0.0
26,1,Decision Tree,0,0.75,0.8,0.7978130373574884,0.001661539077758789,0.7978130373574884
27,1,RandomForest,0,0.75,0.8666666666666667,0.8724415058636109,0.3122291564941406,0.8724415058636109
28,1,AdaBoost (Discrete),0,0.75,0.9166666666666666,0.9210078746600967,16.838499307632446,0.9210078746600967
29,1,AdaBoost (Real),0,0.75,0.9166666666666666,0.9210078746600967,18.44819736480713,0.9210078746600967
30,1,Logistic Regression (Penalty = L2),0,0.75,1.0,1.0,0.039643287658691406,1.0
31,1,Naive Bayes,0,0.75,0.95,0.9564655913861946,0.04727673530578613,0.9564655913861946
32,1,KNeighbors Classifier,1,0.75,0.9333333333333333,0.9402511777839014,0.04365110397338867,0.9402511777839014
33,1,SVC Classifier,1,0.75,0.4,1.0,0.046692848205566406,0.0
34,1,Decision Tree,1,0.75,0.9333333333333333,0.9378887276834518,0.04190182685852051,0.9378887276834518
35,1,RandomForest,1,0.75,0.8666666666666667,0.8625212951870681,0.2615346908569336,0.8625212951870681
36,1,AdaBoost (Discrete),1,0.75,0.8833333333333333,0.8662391053409028,18.004284620285034,0.8662391053409028
37,1,AdaBoost (Real),1,0.75,0.8166666666666667,0.7836526036203351,19.932908058166504,0.7836526036203351
38,1,Logistic Regression (Penalty = L2),1,0.75,0.9833333333333333,0.9830475724915585,0.04286956787109375,0.9830475724915585
39,1,Naive Bayes,1,0.75,0.9666666666666667,0.9654893846056297,0.04361581802368164,0.9654893846056297
40,1,KNeighbors Classifier,2,0.75,0.9827586206896551,0.9852919811325488,0.03562569618225098,0.9852919811325488
41,1,SVC Classifier,2,0.75,0.39655172413793105,1.0,0.0032427310943603516,0.0
42,1,Decision Tree,2,0.75,0.9310344827586207,0.9383004435957202,0.02972245216369629,0.9383004435957202
43,1,RandomForest,2,0.75,1.0,1.0,0.2608907222747803,1.0
44,1,AdaBoost (Discrete),2,0.75,0.9655172413793104,0.967693705920519,17.55159831047058,0.967693705920519
45,1,AdaBoost (Real),2,0.75,0.9655172413793104,0.967693705920519,20.612565755844116,0.967693705920519
46,1,Logistic Regression (Penalty = L2),2,0.75,1.0,1.0,0.04709982872009277,1.0
47,1,Naive Bayes,2,0.75,1.0,1.0,0.0018262863159179688,1.0
48,2,KNeighbors Classifier,0,0.75,0.9,0.9085602964160698,0.047574520111083984,0.9085602964160698
49,2,SVC Classifier,0,0.75,0.45,0.3872983346207417,0.05023598670959473,0.0
50,2,Decision Tree,0,0.75,0.8166666666666667,0.8018835824989566,0.0016624927520751953,0.8018835824989566
51,2,RandomForest,0,0.75,0.8833333333333333,0.8892233261225158,0.333545446395874,0.8892233261225158
52,2,AdaBoost (Discrete),0,0.75,0.9333333333333333,0.9361090484023133,19.23876643180847,0.9361090484023133
53,2,AdaBoost (Real),0,0.75,0.9166666666666666,0.9210078746600967,26.191993236541748,0.9210078746600967
54,2,Logistic Regression (Penalty = L2),0,0.75,0.9333333333333333,0.9410360288810286,0.06705689430236816,0.9410360288810286
55,2,Naive Bayes,0,0.75,0.9333333333333333,0.9410360288810286,0.06747770309448242,0.9410360288810286
56,2,KNeighbors Classifier,1,0.75,0.9666666666666667,0.9691999875015047,0.06789588928222656,0.9691999875015047
57,2,SVC Classifier,1,0.75,0.4,1.0,0.06695747375488281,0.0
58,2,Decision Tree,1,0.75,0.8166666666666667,0.7867500769388359,0.0016870498657226562,0.7867500769388359
59,2,RandomForest,1,0.75,0.9,0.8892233261225158,0.48831748962402344,0.8892233261225158
60,2,AdaBoost (Discrete),1,0.75,0.8666666666666667,0.8478028607535417,27.519979000091553,0.8478028607535417
61,2,AdaBoost (Real),1,0.75,0.85,0.8358603846235818,29.755181312561035,0.8358603846235818
62,2,Logistic Regression (Penalty = L2),1,0.75,0.9333333333333333,0.9339246536301676,0.07074642181396484,0.9339246536301676
63,2,Naive Bayes,1,0.75,0.9333333333333333,0.9283177667225558,0.0712733268737793,0.9283177667225558
64,2,KNeighbors Classifier,2,0.75,0.9827586206896551,0.9852919811325488,0.07188248634338379,0.9852919811325488
65,2,SVC Classifier,2,0.75,0.39655172413793105,1.0,0.0030138492584228516,0.0
66,2,Decision Tree,2,0.75,0.9655172413793104,0.967693705920519,0.0013484954833984375,0.967693705920519
67,2,RandomForest,2,0.75,1.0,1.0,0.43084096908569336,1.0
68,2,AdaBoost (Discrete),2,0.75,0.9655172413793104,0.967693705920519,29.985365867614746,0.967693705920519
69,2,AdaBoost (Real),2,0.75,0.8793103448275862,0.8858189155864656,34.83540749549866,0.8858189155864656
70,2,Logistic Regression (Penalty = L2),2,0.75,1.0,1.0,0.002376556396484375,1.0
71,2,Naive Bayes,2,0.75,1.0,1.0,0.003140687942504883,1.0
72,3,KNeighbors Classifier,0,0.75,0.8666666666666667,0.8690066612216124,0.07205533981323242,0.8690066612216124
73,3,SVC Classifier,0,0.75,0.4,1.0,0.07875585556030273,0.0
74,3,Decision Tree,0,0.75,0.7166666666666667,0.696953883947433,0.07745170593261719,0.696953883947433
75,3,RandomForest,0,0.75,0.8833333333333333,0.8900459198627492,0.5607008934020996,0.8900459198627492
76,3,AdaBoost (Discrete),0,0.75,0.9,0.9053945554302176,32.307806968688965,0.9053945554302176
77,3,AdaBoost (Real),0,0.75,0.9333333333333333,0.9410360288810286,38.08993601799011,0.9410360288810286
78,3,Logistic Regression (Penalty = L2),0,0.75,0.9666666666666667,0.9714127805419094,0.002860546112060547,0.9714127805419094
79,3,Naive Bayes,0,0.75,0.9333333333333333,0.9410360288810286,0.10303187370300293,0.9410360288810286
80,3,KNeighbors Classifier,1,0.75,0.95,0.9549449757989991,0.002336740493774414,0.9549449757989991
81,3,SVC Classifier,1,0.75,0.4,1.0,0.09487438201904297,0.0
82,3,Decision Tree,1,0.75,0.8166666666666667,0.7836526036203351,0.11409854888916016,0.7836526036203351
83,3,RandomForest,1,0.75,0.8666666666666667,0.8360467110641325,0.614642858505249,0.8360467110641325
84,3,AdaBoost (Discrete),1,0.75,0.8833333333333333,0.8662391053409028,41.24686670303345,0.8662391053409028
85,3,AdaBoost (Real),1,0.75,0.85,0.8254818122236567,46.64158797264099,0.8254818122236567
86,3,Logistic Regression (Penalty = L2),1,0.75,0.9333333333333333,0.9339246536301676,0.0951089859008789,0.9339246536301676
87,3,Naive Bayes,1,0.75,0.9666666666666667,0.9654893846056297,0.0019145011901855469,0.9654893846056297
88,3,KNeighbors Classifier,2,0.75,0.9827586206896551,0.9852919811325488,0.10380768775939941,0.9852919811325488
89,3,SVC Classifier,2,0.75,0.39655172413793105,1.0,0.098114013671875,0.0
90,3,Decision Tree,2,0.75,0.9827586206896551,0.9821390252341226,0.001214742660522461,0.9821390252341226
91,3,RandomForest,2,0.75,0.9827586206896551,0.9821390252341226,0.7900846004486084,0.9821390252341226
92,3,AdaBoost (Discrete),2,0.75,0.9655172413793104,0.967693705920519,39.33290243148804,0.967693705920519
93,3,AdaBoost (Real),2,0.75,0.8793103448275862,0.8858189155864656,41.233872175216675,0.8858189155864656
94,3,Logistic Regression (Penalty = L2),2,0.75,1.0,1.0,0.08718371391296387,1.0
95,3,Naive Bayes,2,0.75,0.9655172413793104,0.967693705920519,0.09432268142700195,0.967693705920519
96,4,KNeighbors Classifier,0,0.75,0.8833333333333333,0.8914135402065606,0.003553152084350586,0.8914135402065606
97,4,SVC Classifier,0,0.75,0.4,1.0,0.0908966064453125,0.0
98,4,Decision Tree,0,0.75,0.9166666666666666,0.9148264275057428,0.09805059432983398,0.9148264275057428
99,4,RandomForest,0,0.75,0.9,0.9053945554302176,0.7252590656280518,0.9053945554302176
100,4,AdaBoost (Discrete),0,0.75,0.9333333333333333,0.9361090484023133,38.734575033187866,0.9361090484023133
101,4,AdaBoost (Real),0,0.75,0.9333333333333333,0.9410360288810286,46.722830295562744,0.9410360288810286
102,4,Logistic Regression (Penalty = L2),0,0.75,0.9333333333333333,0.9410360288810286,0.00177001953125,0.9410360288810286
103,4,Naive Bayes,0,0.75,0.9333333333333333,0.9410360288810286,0.08612799644470215,0.9410360288810286
104,4,KNeighbors Classifier,1,0.75,0.9833333333333333,0.9859136166167861,0.11160683631896973,0.9859136166167861
105,4,SVC Classifier,1,0.75,0.4,1.0,0.10692548751831055,0.0
106,4,Decision Tree,1,0.75,0.7666666666666667,0.7231223709405562,0.10168337821960449,0.7231223709405562
107,4,RandomForest,1,0.75,0.9,0.8839223159487537,0.6295900344848633,0.8839223159487537
108,4,AdaBoost (Discrete),1,0.75,0.8666666666666667,0.8478028607535417,43.09079432487488,0.8478028607535417
109,4,AdaBoost (Real),1,0.75,0.85,0.8254818122236567,48.28185772895813,0.8254818122236567
110,4,Logistic Regression (Penalty = L2),1,0.75,0.9333333333333333,0.9339246536301676,0.10219383239746094,0.9339246536301676
111,4,Naive Bayes,1,0.75,0.9333333333333333,0.9283177667225558,0.003107309341430664,0.9283177667225558
112,4,KNeighbors Classifier,2,0.75,0.9827586206896551,0.9852919811325488,0.10052800178527832,0.9852919811325488
113,4,SVC Classifier,2,0.75,0.39655172413793105,1.0,0.10284805297851562,0.0
114,4,Decision Tree,2,0.75,0.9827586206896551,0.9821390252341226,0.0012183189392089844,0.9821390252341226
115,4,RandomForest,2,0.75,0.9827586206896551,0.9821390252341226,0.7672164440155029,0.9821390252341226
116,4,AdaBoost (Discrete),2,0.75,0.9655172413793104,0.967693705920519,44.38523554801941,0.967693705920519
117,4,AdaBoost (Real),2,0.75,0.8793103448275862,0.8858189155864656,48.453553915023804,0.8858189155864656
118,4,Logistic Regression (Penalty = L2),2,0.75,1.0,1.0,0.09442663192749023,1.0
119,4,Naive Bayes,2,0.75,0.9655172413793104,0.967693705920519,0.10659265518188477,0.967693705920519
120,5,KNeighbors Classifier,0,0.75,0.9166666666666666,0.9250831838185912,0.11205601692199707,0.9250831838185912
121,5,SVC Classifier,0,0.75,0.43333333333333335,0.31622776601683794,0.11091780662536621,0.0
122,5,Decision Tree,0,0.75,0.9166666666666666,0.9148264275057428,0.0018355846405029297,0.9148264275057428
123,5,RandomForest,0,0.75,0.8833333333333333,0.8892233261225158,0.5618922710418701,0.8892233261225158
124,5,AdaBoost (Discrete),0,0.75,0.9333333333333333,0.9361090484023133,44.295086145401,0.9361090484023133
125,5,AdaBoost (Real),0,0.75,0.9166666666666666,0.9148264275057428,54.855957984924316,0.9148264275057428
126,5,Logistic Regression (Penalty = L2),0,0.75,0.9833333333333333,0.9859136166167861,0.11493086814880371,0.9859136166167861
127,5,Naive Bayes,0,0.75,0.9666666666666667,0.9714127805419094,0.0019483566284179688,0.9714127805419094
128,5,KNeighbors Classifier,1,0.75,0.95,0.9518891309816516,0.12280106544494629,0.9518891309816516
129,5,SVC Classifier,1,0.75,0.4,1.0,0.0027298927307128906,0.0
130,5,Decision Tree,1,0.75,0.7833333333333333,0.7612501546617364,0.0011539459228515625,0.7612501546617364
131,5,RandomForest,1,0.75,0.9166666666666666,0.904387441634126,0.7989985942840576,0.904387441634126
132,5,AdaBoost (Discrete),1,0.75,0.85,0.8254818122236567,45.94326853752136,0.8254818122236567
133,5,AdaBoost (Real),1,0.75,0.85,0.8254818122236567,50.92782735824585,0.8254818122236567
134,5,Logistic Regression (Penalty = L2),1,0.75,0.95,0.9518891309816516,0.11102771759033203,0.9518891309816516
135,5,Naive Bayes,1,0.75,0.95,0.9472682371859096,0.1147463321685791,0.9472682371859096
136,5,KNeighbors Classifier,2,0.75,0.9827586206896551,0.9852919811325488,0.11180830001831055,0.9852919811325488
137,5,SVC Classifier,2,0.75,0.39655172413793105,1.0,0.11484050750732422,0.0
138,5,Decision Tree,2,0.75,0.9655172413793104,0.967693705920519,0.11322331428527832,0.967693705920519
139,5,RandomForest,2,0.75,0.9827586206896551,0.9821390252341226,0.701556921005249,0.9821390252341226
140,5,AdaBoost (Discrete),2,0.75,0.9655172413793104,0.967693705920519,45.3313992023468,0.967693705920519
141,5,AdaBoost (Real),2,0.75,0.8793103448275862,0.8858189155864656,57.018845558166504,0.8858189155864656
142,5,Logistic Regression (Penalty = L2),2,0.75,1.0,1.0,0.0029180049896240234,1.0
143,5,Naive Bayes,2,0.75,0.9827586206896551,0.9821390252341226,0.12313246726989746,0.9821390252341226
144,6,KNeighbors Classifier,0,0.75,0.9,0.9085602964160698,0.1273796558380127,0.9085602964160698
145,6,SVC Classifier,0,0.75,0.45,0.3872983346207417,0.13107776641845703,0.0
146,6,Decision Tree,0,0.75,0.7833333333333333,0.7842881696763961,0.0017576217651367188,0.7842881696763961
147,6,RandomForest,0,0.75,0.8666666666666667,0.8724415058636109,0.9446816444396973,0.8724415058636109
148,6,AdaBoost (Discrete),0,0.75,0.9,0.9053945554302176,48.545029163360596,0.9053945554302176
149,6,AdaBoost (Real),0,0.75,0.9333333333333333,0.9410360288810286,56.49593663215637,0.9410360288810286
150,6,Logistic Regression (Penalty = L2),0,0.75,0.9333333333333333,0.9410360288810286,0.11872982978820801,0.9410360288810286
151,6,Naive Bayes,0,0.75,0.95,0.9564655913861946,0.12339901924133301,0.9564655913861946
152,6,KNeighbors Classifier,1,0.75,0.95,0.9549449757989991,0.12731528282165527,0.9549449757989991
153,6,SVC Classifier,1,0.75,0.4,1.0,0.12300992012023926,0.0
154,6,Decision Tree,1,0.75,0.7333333333333333,0.6946229170914542,0.0011620521545410156,0.6946229170914542
155,6,RandomForest,1,0.75,0.9,0.8957619677539866,0.9336411952972412,0.8957619677539866
156,6,AdaBoost (Discrete),1,0.75,0.85,0.8193212706006459,50.62507200241089,0.8193212706006459
157,6,AdaBoost (Real),1,0.75,0.85,0.8254818122236567,57.404863595962524,0.8254818122236567
158,6,Logistic Regression (Penalty = L2),1,0.75,0.95,0.9518891309816516,0.13481354713439941,0.9518891309816516
159,6,Naive Bayes,1,0.75,0.9666666666666667,0.9654893846056297,0.002946138381958008,0.9654893846056297
160,6,KNeighbors Classifier,2,0.75,0.9827586206896551,0.9852919811325488,0.13619112968444824,0.9852919811325488
161,6,SVC Classifier,2,0.75,0.39655172413793105,1.0,0.1343393325805664,0.0
162,6,Decision Tree,2,0.75,0.9827586206896551,0.9821390252341226,0.0017611980438232422,0.9821390252341226
163,6,RandomForest,2,0.75,1.0,1.0,1.0974912643432617,1.0
164,6,AdaBoost (Discrete),2,0.75,0.9655172413793104,0.967693705920519,53.14953637123108,0.967693705920519
165,6,AdaBoost (Real),2,0.75,0.8793103448275862,0.8858189155864656,57.98115301132202,0.8858189155864656
166,6,Logistic Regression (Penalty = L2),2,0.75,1.0,1.0,0.13086247444152832,1.0
167,6,Naive Bayes,2,0.75,0.9827586206896551,0.9852919811325488,0.13077092170715332,0.9852919811325488
168,7,KNeighbors Classifier,0,0.75,0.9166666666666666,0.9210078746600967,0.1315469741821289,0.9210078746600967
169,7,SVC Classifier,0,0.75,0.45,0.3872983346207417,0.12750673294067383,0.0
170,7,Decision Tree,0,0.75,0.7833333333333333,0.7621478561475696,0.1257929801940918,0.7621478561475696
171,7,RandomForest,0,0.75,0.85,0.8549879733383485,0.8448610305786133,0.8549879733383485
172,7,AdaBoost (Discrete),0,0.75,0.9166666666666666,0.9210078746600967,49.591228008270264,0.9210078746600967
173,7,AdaBoost (Real),0,0.75,0.9333333333333333,0.9410360288810286,59.60486316680908,0.9410360288810286
174,7,Logistic Regression (Penalty = L2),0,0.75,0.9333333333333333,0.9410360288810286,0.13500213623046875,0.9410360288810286
175,7,Naive Bayes,0,0.75,0.95,0.9564655913861946,0.0019025802612304688,0.9564655913861946
176,7,KNeighbors Classifier,1,0.75,0.95,0.9564655913861946,0.13143277168273926,0.9564655913861946
177,7,SVC Classifier,1,0.75,0.4,1.0,0.0017580986022949219,0.0
178,7,Decision Tree,1,0.75,0.7833333333333333,0.7329486044391188,0.13409018516540527,0.7329486044391188
179,7,RandomForest,1,0.75,0.85,0.8414757379333423,0.9356529712677002,0.8414757379333423
180,7,AdaBoost (Discrete),1,0.75,0.8833333333333333,0.8662391053409028,52.74269509315491,0.8662391053409028
181,7,AdaBoost (Real),1,0.75,0.85,0.8254818122236567,56.775845766067505,0.8254818122236567
182,7,Logistic Regression (Penalty = L2),1,0.75,0.95,0.9518891309816516,0.13090968132019043,0.9518891309816516
183,7,Naive Bayes,1,0.75,0.9666666666666667,0.9654893846056297,0.0032579898834228516,0.9654893846056297
184,7,KNeighbors Classifier,2,0.75,0.9655172413793104,0.9701312318500641,0.1268622875213623,0.9701312318500641
185,7,SVC Classifier,2,0.75,0.39655172413793105,1.0,0.002696514129638672,0.0
186,7,Decision Tree,2,0.75,0.9137931034482759,0.9215414830498454,0.13771438598632812,0.9215414830498454
187,7,RandomForest,2,0.75,0.9827586206896551,0.9852919811325488,0.8021814823150635,0.9852919811325488
188,7,AdaBoost (Discrete),2,0.75,0.9655172413793104,0.967693705920519,53.230207204818726,0.967693705920519
189,7,AdaBoost (Real),2,0.75,0.9655172413793104,0.967693705920519,60.246854305267334,0.967693705920519
190,7,Logistic Regression (Penalty = L2),2,0.75,1.0,1.0,0.13083291053771973,1.0
191,7,Naive Bayes,2,0.75,0.9655172413793104,0.967693705920519,0.1312100887298584,0.967693705920519
192,8,KNeighbors Classifier,0,0.75,0.8833333333333333,0.8892233261225158,0.13211417198181152,0.8892233261225158
193,8,SVC Classifier,0,0.75,0.4,1.0,0.12689709663391113,0.0
194,8,Decision Tree,0,0.75,0.85,0.8485871376676988,0.001619100570678711,0.8485871376676988
195,8,RandomForest,0,0.75,0.9333333333333333,0.9410360288810286,1.0987651348114014,0.9410360288810286
196,8,AdaBoost (Discrete),0,0.75,0.9333333333333333,0.9361090484023133,55.983020305633545,0.9361090484023133
197,8,AdaBoost (Real),0,0.75,0.95,0.9564655913861946,62.501858711242676,0.9564655913861946
198,8,Logistic Regression (Penalty = L2),0,0.75,0.9833333333333333,0.9859136166167861,0.1575314998626709,0.9859136166167861
199,8,Naive Bayes,0,0.75,0.9333333333333333,0.9410360288810286,0.1390979290008545,0.9410360288810286
200,8,KNeighbors Classifier,1,0.75,1.0,1.0,0.1438136100769043,1.0
201,8,SVC Classifier,1,0.75,0.4,1.0,0.15013790130615234,0.0
202,8,Decision Tree,1,0.75,0.7666666666666667,0.7426756176575613,0.0011894702911376953,0.7426756176575613
203,8,RandomForest,1,0.75,0.9166666666666666,0.915241126759053,0.8679039478302002,0.915241126759053
204,8,AdaBoost (Discrete),1,0.75,0.8666666666666667,0.8434326653017493,54.65669631958008,0.8434326653017493
205,8,AdaBoost (Real),1,0.75,0.85,0.8254818122236567,64.90370392799377,0.8254818122236567
206,8,Logistic Regression (Penalty = L2),1,0.75,0.9333333333333333,0.9339246536301676,0.001766204833984375,0.9339246536301676
207,8,Naive Bayes,1,0.75,0.95,0.9472682371859096,0.0029408931732177734,0.9472682371859096
208,8,KNeighbors Classifier,2,0.75,1.0,1.0,0.14337539672851562,1.0
209,8,SVC Classifier,2,0.75,0.39655172413793105,1.0,0.1387004852294922,0.0
210,8,Decision Tree,2,0.75,0.9655172413793104,0.967693705920519,0.001219034194946289,0.967693705920519
211,8,RandomForest,2,0.75,0.9827586206896551,0.9821390252341226,1.0226128101348877,0.9821390252341226
212,8,AdaBoost (Discrete),2,0.75,0.9655172413793104,0.967693705920519,52.3698935508728,0.967693705920519
213,8,AdaBoost (Real),2,0.75,0.8793103448275862,0.8858189155864656,57.92413306236267,0.8858189155864656
214,8,Logistic Regression (Penalty = L2),2,0.75,1.0,1.0,0.14280080795288086,1.0
215,8,Naive Bayes,2,0.75,0.9655172413793104,0.967693705920519,0.1387481689453125,0.967693705920519
