,feat_set_id,classifier,fold_id,feat_th,score,geo_score,exec_t,geo_score_woz
0,0,KNeighbors Classifier,0,0.4,0.47619047619047616,0.11302515955266824,0.17764019966125488,0.0
1,0,SVC Classifier,0,0.4,0.5301587301587302,1.0,0.6692912578582764,0.0
2,0,Decision Tree,0,0.4,0.3888888888888889,0.11470239531186098,0.0605769157409668,0.11470239531186098
3,0,RandomForest,0,0.4,0.5301587301587302,1.0,0.5381076335906982,0.0
4,0,AdaBoost (Discrete),0,0.4,0.3126984126984127,0.16020641536971025,32.094578981399536,0.16020641536971025
5,0,AdaBoost (Real),0,0.4,0.2650793650793651,0.19528951107516768,61.372328758239746,0.19528951107516768
6,0,Logistic Regression (Penalty = L2),0,0.4,0.5317460317460317,0.0999959601158343,0.5195670127868652,0.0
7,0,Naive Bayes,0,0.4,0.526984126984127,0.19958154571882178,0.1383357048034668,0.0
8,0,KNeighbors Classifier,1,0.4,0.4483306836248013,0.10303658525930855,0.20200848579406738,0.0
9,0,SVC Classifier,1,0.4,0.5294117647058824,1.0,0.7457044124603271,0.0
10,0,Decision Tree,1,0.4,0.35453100158982515,0.10724528019625007,0.06282591819763184,0.10724528019625007
11,0,RandomForest,1,0.4,0.5294117647058824,1.0,0.4592442512512207,0.0
12,0,AdaBoost (Discrete),1,0.4,0.3052464228934817,0.1766861898495115,35.42542886734009,0.1766861898495115
13,0,AdaBoost (Real),1,0.4,0.24960254372019078,0.19294737173726742,53.79498314857483,0.19294737173726742
14,0,Logistic Regression (Penalty = L2),1,0.4,0.5278219395866455,0.12321247217216007,0.33292341232299805,0.0
15,0,Naive Bayes,1,0.4,0.4546899841017488,0.17708437972955374,0.09722018241882324,0.0
16,0,KNeighbors Classifier,2,0.4,0.4696485623003195,0.14893377646254113,0.43488407135009766,0.0
17,0,SVC Classifier,2,0.4,0.5319488817891374,1.0,0.9350526332855225,0.0
18,0,Decision Tree,2,0.4,0.4009584664536741,0.16330131806108197,0.002554655075073242,0.16330131806108197
19,0,RandomForest,2,0.4,0.5319488817891374,1.0,0.7032148838043213,0.0
20,0,AdaBoost (Discrete),2,0.4,0.31789137380191695,0.18232242022615902,38.40221071243286,0.18232242022615902
21,0,AdaBoost (Real),2,0.4,0.2012779552715655,0.2004534014331737,61.86073040962219,0.2004534014331737
22,0,Logistic Regression (Penalty = L2),2,0.4,0.5095846645367412,0.12366359931339786,0.3828587532043457,0.0
23,0,Naive Bayes,2,0.4,0.46645367412140576,0.3969747539656212,0.09215831756591797,0.0
24,1,KNeighbors Classifier,0,0.4,0.47619047619047616,0.07511193303076398,0.19389820098876953,0.0
25,1,SVC Classifier,0,0.4,0.5301587301587302,1.0,1.0478105545043945,0.0
26,1,Decision Tree,0,0.4,0.4,0.11215743876125803,0.10039544105529785,0.11215743876125803
27,1,RandomForest,0,0.4,0.5301587301587302,1.0,0.7599465847015381,0.0
28,1,AdaBoost (Discrete),0,0.4,0.3396825396825397,0.13301211464527782,45.62824463844299,0.13301211464527782
29,1,AdaBoost (Real),0,0.4,0.33015873015873015,0.1702516638006262,61.35382699966431,0.1702516638006262
30,1,Logistic Regression (Penalty = L2),0,0.4,0.5301587301587302,0.1476591498227212,0.4041588306427002,0.0
31,1,Naive Bayes,0,0.4,0.5333333333333333,0.1214339524192488,0.12189459800720215,0.0
32,1,KNeighbors Classifier,1,0.4,0.4562798092209857,0.09606288659871623,0.3626830577850342,0.0
33,1,SVC Classifier,1,0.4,0.5294117647058824,1.0,0.8771231174468994,0.0
34,1,Decision Tree,1,0.4,0.34022257551669316,0.14370182692837205,0.0028543472290039062,0.0
35,1,RandomForest,1,0.4,0.5294117647058824,1.0,0.5846161842346191,0.0
36,1,AdaBoost (Discrete),1,0.4,0.3449920508744038,0.29618049380798306,48.766698598861694,0.0
37,1,AdaBoost (Real),1,0.4,0.3052464228934817,0.19071976022055875,76.48697209358215,0.19071976022055875
38,1,Logistic Regression (Penalty = L2),1,0.4,0.5262321144674086,0.09516877881959714,0.607982873916626,0.0
39,1,Naive Bayes,1,0.4,0.4356120826709062,0.1474173376711058,0.24584531784057617,0.0
40,1,KNeighbors Classifier,2,0.4,0.4936102236421725,0.11197799696150243,0.25807785987854004,0.11197799696150243
41,1,SVC Classifier,2,0.4,0.5319488817891374,1.0,1.288628101348877,0.0
42,1,Decision Tree,2,0.4,0.4073482428115016,0.12606279031920153,0.0029993057250976562,0.12606279031920153
43,1,RandomForest,2,0.4,0.5319488817891374,1.0,0.9558031558990479,0.0
44,1,AdaBoost (Discrete),2,0.4,0.33226837060702874,0.1652784901525437,54.38408303260803,0.1652784901525437
45,1,AdaBoost (Real),2,0.4,0.3242811501597444,0.2255878841081863,73.9567642211914,0.2255878841081863
46,1,Logistic Regression (Penalty = L2),2,0.4,0.5271565495207667,0.1932269659610596,0.45998477935791016,0.0
47,1,Naive Bayes,2,0.4,0.46485623003194887,0.21687505552680064,0.11616921424865723,0.0
48,2,KNeighbors Classifier,0,0.4,0.5031746031746032,0.10061017685017755,0.3400540351867676,0.0
49,2,SVC Classifier,0,0.4,0.5301587301587302,1.0,1.3933372497558594,0.0
50,2,Decision Tree,0,0.4,0.3825396825396825,0.1253594616463251,0.11511969566345215,0.0
51,2,RandomForest,0,0.4,0.5301587301587302,1.0,0.811786413192749,0.0
52,2,AdaBoost (Discrete),0,0.4,0.28888888888888886,0.10450058314300793,53.96454954147339,0.10450058314300793
53,2,AdaBoost (Real),0,0.4,0.22380952380952382,0.14781416786773913,77.95797896385193,0.14781416786773913
54,2,Logistic Regression (Penalty = L2),0,0.4,0.5333333333333333,0.25,0.44673919677734375,0.0
55,2,Naive Bayes,0,0.4,0.5126984126984127,0.1125373515391207,0.10069680213928223,0.0
56,2,KNeighbors Classifier,1,0.4,0.4133545310015898,0.08343639631083258,0.3289213180541992,0.0
57,2,SVC Classifier,1,0.4,0.5294117647058824,1.0,1.3604352474212646,0.0
58,2,Decision Tree,1,0.4,0.31160572337042924,0.10613779236016276,0.11576509475708008,0.10613779236016276
59,2,RandomForest,1,0.4,0.5294117647058824,1.0,0.8321549892425537,0.0
60,2,AdaBoost (Discrete),1,0.4,0.32273449920508746,0.15567522543603934,54.66678857803345,0.0
61,2,AdaBoost (Real),1,0.4,0.24006359300476948,0.1947416979323548,72.86413502693176,0.0
62,2,Logistic Regression (Penalty = L2),1,0.4,0.5166931637519873,0.31221416825989473,0.49210405349731445,0.0
63,2,Naive Bayes,1,0.4,0.4356120826709062,0.32741079043343985,0.24665594100952148,0.0
64,2,KNeighbors Classifier,2,0.4,0.476038338658147,0.11276565777362724,0.2698252201080322,0.11276565777362724
65,2,SVC Classifier,2,0.4,0.5319488817891374,1.0,1.3212919235229492,0.0
66,2,Decision Tree,2,0.4,0.3514376996805112,0.13308387627602364,0.12439537048339844,0.13308387627602364
67,2,RandomForest,2,0.4,0.5303514376996805,0.996996996996997,0.9875893592834473,0.0
68,2,AdaBoost (Discrete),2,0.4,0.33706070287539935,0.14445095985339731,61.41666531562805,0.14445095985339731
69,2,AdaBoost (Real),2,0.4,0.23961661341853036,0.16893396315825146,81.76843690872192,0.16893396315825146
70,2,Logistic Regression (Penalty = L2),2,0.4,0.5111821086261981,0.25095573772626,0.5436961650848389,0.0
71,2,Naive Bayes,2,0.4,0.4728434504792332,0.14182335174655325,0.26702260971069336,0.0
72,3,KNeighbors Classifier,0,0.4,0.4634920634920635,0.08075360415805906,0.2743380069732666,0.0
73,3,SVC Classifier,0,0.4,0.5301587301587302,1.0,1.3909626007080078,0.0
74,3,Decision Tree,0,0.4,0.42698412698412697,0.12911083217648464,0.13671207427978516,0.12911083217648464
75,3,RandomForest,0,0.4,0.5301587301587302,1.0,1.2478158473968506,0.0
76,3,AdaBoost (Discrete),0,0.4,0.33015873015873015,0.2103589513675473,65.29940986633301,0.2103589513675473
77,3,AdaBoost (Real),0,0.4,0.30317460317460315,0.1835904633882358,81.05981588363647,0.1835904633882358
78,3,Logistic Regression (Penalty = L2),0,0.4,0.5285714285714286,0.14107987040114367,0.4069685935974121,0.0
79,3,Naive Bayes,0,0.4,0.5301587301587302,0.21646717204196392,0.27823448181152344,0.0
80,3,KNeighbors Classifier,1,0.4,0.4642289348171701,0.11580835122782895,0.33274292945861816,0.0
81,3,SVC Classifier,1,0.4,0.5294117647058824,1.0,1.508265733718872,0.0
82,3,Decision Tree,1,0.4,0.35930047694753575,0.11870322293300097,0.0025298595428466797,0.0
83,3,RandomForest,1,0.4,0.5294117647058824,1.0,1.107468843460083,0.0
84,3,AdaBoost (Discrete),1,0.4,0.3004769475357711,0.14426200374934006,59.486005783081055,0.14426200374934006
85,3,AdaBoost (Real),1,0.4,0.2527821939586645,0.18220429368008748,78.08541226387024,0.18220429368008748
86,3,Logistic Regression (Penalty = L2),1,0.4,0.5278219395866455,0.1245026863963108,0.38919496536254883,0.0
87,3,Naive Bayes,1,0.4,0.4562798092209857,0.1258971079649827,0.2625610828399658,0.0
88,3,KNeighbors Classifier,2,0.4,0.4696485623003195,0.10522712709521191,0.3980839252471924,0.0
89,3,SVC Classifier,2,0.4,0.5319488817891374,1.0,1.1873059272766113,0.0
90,3,Decision Tree,2,0.4,0.41373801916932906,0.14561589241072162,0.1366713047027588,0.14561589241072162
91,3,RandomForest,2,0.4,0.5319488817891374,1.0,1.0409455299377441,0.0
92,3,AdaBoost (Discrete),2,0.4,0.329073482428115,0.21346054204031076,62.03742218017578,0.21346054204031076
93,3,AdaBoost (Real),2,0.4,0.1964856230031949,0.1925508928702248,82.15839147567749,0.1925508928702248
94,3,Logistic Regression (Penalty = L2),2,0.4,0.5191693290734825,0.13741192959018664,0.6807291507720947,0.0
95,3,Naive Bayes,2,0.4,0.4680511182108626,0.169466420675073,0.14012384414672852,0.0
96,4,KNeighbors Classifier,0,0.4,0.4793650793650794,0.1437982589563431,0.280759334564209,0.0
97,4,SVC Classifier,0,0.4,0.5301587301587302,1.0,1.1467556953430176,0.0
98,4,Decision Tree,0,0.4,0.5095238095238095,0.04687618345181464,0.001931905746459961,0.0
99,4,RandomForest,0,0.4,0.5333333333333333,0.25,1.0801987648010254,0.0
100,4,AdaBoost (Discrete),0,0.4,0.45555555555555555,0.14136793500001213,57.41027021408081,0.0
101,4,AdaBoost (Real),0,0.4,0.2571428571428571,0.16879151703439468,78.79100441932678,0.0
102,4,Logistic Regression (Penalty = L2),0,0.4,0.5333333333333333,0.25,0.4117138385772705,0.0
103,4,Naive Bayes,0,0.4,0.5333333333333333,0.3524932581000494,0.13619589805603027,0.0
104,4,KNeighbors Classifier,1,0.4,0.4276629570747218,0.15464722819648966,0.25945448875427246,0.0
105,4,SVC Classifier,1,0.4,0.5294117647058824,1.0,1.2119317054748535,0.0
106,4,Decision Tree,1,0.4,0.44992050874403816,0.1347951869997597,0.1301746368408203,0.0
107,4,RandomForest,1,0.4,0.5294117647058824,1.0,0.925452470779419,0.0
108,4,AdaBoost (Discrete),1,0.4,0.4117647058823529,0.08135960485423795,62.73628067970276,0.08135960485423795
109,4,AdaBoost (Real),1,0.4,0.24006359300476948,0.153266049390247,78.74893116950989,0.0
110,4,Logistic Regression (Penalty = L2),1,0.4,0.5087440381558028,0.22199649060228704,0.38802409172058105,0.0
111,4,Naive Bayes,1,0.4,0.5087440381558028,0.46116886682367136,0.24578619003295898,0.0
112,4,KNeighbors Classifier,2,0.4,0.48562300319488816,0.12603459764425634,0.12656068801879883,0.0
113,4,SVC Classifier,2,0.4,0.5319488817891374,1.0,1.235168695449829,0.0
114,4,Decision Tree,2,0.4,0.48242811501597443,0.09791815906636234,0.0027370452880859375,0.0
115,4,RandomForest,2,0.4,0.5319488817891374,1.0,0.8934111595153809,0.0
116,4,AdaBoost (Discrete),2,0.4,0.4233226837060703,0.16372827069995582,56.9974102973938,0.0
117,4,AdaBoost (Real),2,0.4,0.2364217252396166,0.1832389888041143,69.77746319770813,0.1832389888041143
118,4,Logistic Regression (Penalty = L2),2,0.4,0.5399361022364217,0.22487184577932245,0.36005544662475586,0.0
119,4,Naive Bayes,2,0.4,0.4936102236421725,0.4168213793678789,0.23760461807250977,0.0
120,5,KNeighbors Classifier,0,0.4,0.5063492063492063,0.06799105464354147,0.12248969078063965,0.0
121,5,SVC Classifier,0,0.4,0.5301587301587302,1.0,1.1164026260375977,0.0
122,5,Decision Tree,0,0.4,0.44285714285714284,0.09214284822614005,0.13429665565490723,0.0
123,5,RandomForest,0,0.4,0.5301587301587302,1.0,1.014265537261963,0.0
124,5,AdaBoost (Discrete),0,0.4,0.273015873015873,0.08132476131481345,50.23328971862793,0.08132476131481345
125,5,AdaBoost (Real),0,0.4,0.1523809523809524,0.1268795788643703,82.16766333580017,0.1268795788643703
126,5,Logistic Regression (Penalty = L2),0,0.4,0.5333333333333333,0.25,0.4040565490722656,0.0
127,5,Naive Bayes,0,0.4,0.5365079365079365,0.15238855545379826,0.36078786849975586,0.0
128,5,KNeighbors Classifier,1,0.4,0.43402225755166934,0.09966642214504505,0.3295164108276367,0.0
129,5,SVC Classifier,1,0.4,0.5294117647058824,1.0,0.43860387802124023,0.0
130,5,Decision Tree,1,0.4,0.33068362480127184,0.11205229959819815,0.0025000572204589844,0.0
131,5,RandomForest,1,0.4,0.5294117647058824,1.0,0.48627233505249023,0.0
132,5,AdaBoost (Discrete),1,0.4,0.26232114467408585,0.12824980865742217,53.469674825668335,0.12824980865742217
133,5,AdaBoost (Real),1,0.4,0.17647058823529413,0.1407325550565403,78.7919614315033,0.1407325550565403
134,5,Logistic Regression (Penalty = L2),1,0.4,0.519872813990461,0.28000141189302663,0.3826868534088135,0.0
135,5,Naive Bayes,1,0.4,0.4944356120826709,0.48545449134171187,0.12897753715515137,0.0
136,5,KNeighbors Classifier,2,0.4,0.46645367412140576,0.11658707208805777,0.38642358779907227,0.0
137,5,SVC Classifier,2,0.4,0.5319488817891374,1.0,1.3582279682159424,0.0
138,5,Decision Tree,2,0.4,0.41054313099041534,0.10025212705810375,0.12792444229125977,0.10025212705810375
139,5,RandomForest,2,0.4,0.5319488817891374,1.0,0.9013106822967529,0.0
140,5,AdaBoost (Discrete),2,0.4,0.31309904153354634,0.16893589453845045,58.400317907333374,0.16893589453845045
141,5,AdaBoost (Real),2,0.4,0.16134185303514376,0.14508302498936546,76.4090347290039,0.14508302498936546
142,5,Logistic Regression (Penalty = L2),2,0.4,0.512779552715655,0.23362991088455293,0.47795915603637695,0.0
143,5,Naive Bayes,2,0.4,0.5,0.4812758886965547,0.10925459861755371,0.0
144,6,KNeighbors Classifier,0,0.4,0.47619047619047616,0.07511193303076398,0.5254051685333252,0.0
145,6,SVC Classifier,0,0.4,0.5301587301587302,1.0,1.4898555278778076,0.0
146,6,Decision Tree,0,0.4,0.4,0.10363513399187937,0.23648667335510254,0.10363513399187937
147,6,RandomForest,0,0.4,0.5301587301587302,1.0,1.0705626010894775,0.0
148,6,AdaBoost (Discrete),0,0.4,0.3396825396825397,0.13301211464527782,56.56417679786682,0.13301211464527782
149,6,AdaBoost (Real),0,0.4,0.33015873015873015,0.1702516638006262,83.81021499633789,0.1702516638006262
150,6,Logistic Regression (Penalty = L2),0,0.4,0.5301587301587302,0.1476591498227212,0.5332183837890625,0.0
151,6,Naive Bayes,0,0.4,0.5333333333333333,0.1214339524192488,0.14681339263916016,0.0
152,6,KNeighbors Classifier,1,0.4,0.4562798092209857,0.09606288659871623,0.40783119201660156,0.0
153,6,SVC Classifier,1,0.4,0.5294117647058824,1.0,1.5815904140472412,0.0
154,6,Decision Tree,1,0.4,0.3354531001589825,0.12099156866963517,0.13209056854248047,0.12099156866963517
155,6,RandomForest,1,0.4,0.5294117647058824,1.0,1.0703785419464111,0.0
156,6,AdaBoost (Discrete),1,0.4,0.3449920508744038,0.29618049380798306,62.74010348320007,0.0
157,6,AdaBoost (Real),1,0.4,0.3052464228934817,0.19071976022055875,85.07048487663269,0.19071976022055875
158,6,Logistic Regression (Penalty = L2),1,0.4,0.5262321144674086,0.09516877881959714,0.5245473384857178,0.0
159,6,Naive Bayes,1,0.4,0.4356120826709062,0.1474173376711058,0.1322786808013916,0.0
160,6,KNeighbors Classifier,2,0.4,0.4936102236421725,0.11197799696150243,0.3721897602081299,0.11197799696150243
161,6,SVC Classifier,2,0.4,0.5319488817891374,1.0,1.4788694381713867,0.0
162,6,Decision Tree,2,0.4,0.3865814696485623,0.15144365419746667,0.13105392456054688,0.15144365419746667
163,6,RandomForest,2,0.4,0.5319488817891374,1.0,1.0583977699279785,0.0
164,6,AdaBoost (Discrete),2,0.4,0.33226837060702874,0.1652784901525437,62.8740234375,0.1652784901525437
165,6,AdaBoost (Real),2,0.4,0.29073482428115016,0.20505488146679043,91.82688570022583,0.20505488146679043
166,6,Logistic Regression (Penalty = L2),2,0.4,0.5271565495207667,0.1932269659610596,0.5921070575714111,0.0
167,6,Naive Bayes,2,0.4,0.46485623003194887,0.21687505552680064,0.148637056350708,0.0
168,7,KNeighbors Classifier,0,0.4,0.49682539682539684,0.07894971651184211,0.5878574848175049,0.07894971651184211
169,7,SVC Classifier,0,0.4,0.5301587301587302,1.0,2.2280356884002686,0.0
170,7,Decision Tree,0,0.4,0.40634920634920635,0.10700192749019523,0.14815855026245117,0.10700192749019523
171,7,RandomForest,0,0.4,0.5301587301587302,1.0,1.3198719024658203,0.0
172,7,AdaBoost (Discrete),0,0.4,0.29365079365079366,0.13122111294506542,77.97886347770691,0.13122111294506542
173,7,AdaBoost (Real),0,0.4,0.33174603174603173,0.16901429383802827,106.31560230255127,0.16901429383802827
174,7,Logistic Regression (Penalty = L2),0,0.4,0.5253968253968254,0.14247743226551407,0.8696761131286621,0.0
175,7,Naive Bayes,0,0.4,0.45555555555555555,0.17568117078442225,0.15109658241271973,0.0
176,7,KNeighbors Classifier,1,0.4,0.46740858505564387,0.1193246697048031,0.7351679801940918,0.0
177,7,SVC Classifier,1,0.4,0.5294117647058824,1.0,1.559065818786621,0.0
178,7,Decision Tree,1,0.4,0.35294117647058826,0.1741364789772147,0.14785027503967285,0.0
179,7,RandomForest,1,0.4,0.5294117647058824,1.0,1.1993472576141357,0.0
180,7,AdaBoost (Discrete),1,0.4,0.3004769475357711,0.17397211341521607,72.7694878578186,0.0
181,7,AdaBoost (Real),1,0.4,0.30842607313195547,0.19365114769160863,99.77130389213562,0.19365114769160863
182,7,Logistic Regression (Penalty = L2),1,0.4,0.5278219395866455,0.11779113272549839,0.9774930477142334,0.0
183,7,Naive Bayes,1,0.4,0.4069952305246423,0.1580484612356296,0.278749942779541,0.0
184,7,KNeighbors Classifier,2,0.4,0.4968051118210863,0.18667263446172386,0.5810918807983398,0.0
185,7,SVC Classifier,2,0.4,0.5319488817891374,1.0,1.8946442604064941,0.0
186,7,Decision Tree,2,0.4,0.36900958466453676,0.13356560075268062,0.16016697883605957,0.13356560075268062
187,7,RandomForest,2,0.4,0.5319488817891374,1.0,0.9602868556976318,0.0
188,7,AdaBoost (Discrete),2,0.4,0.3306709265175719,0.19425989976319277,71.64919328689575,0.0
189,7,AdaBoost (Real),2,0.4,0.30990415335463256,0.18002425434980757,95.44082260131836,0.18002425434980757
190,7,Logistic Regression (Penalty = L2),2,0.4,0.5223642172523961,0.11040412053570675,0.8075151443481445,0.0
191,7,Naive Bayes,2,0.4,0.43130990415335463,0.17645484746749382,0.1451411247253418,0.17645484746749382
192,8,KNeighbors Classifier,0,0.4,0.4793650793650794,0.1437982589563431,0.14715051651000977,0.0
193,8,SVC Classifier,0,0.4,0.5301587301587302,1.0,1.4660353660583496,0.0
194,8,Decision Tree,0,0.4,0.5095238095238095,0.04687618345181464,0.14717578887939453,0.0
195,8,RandomForest,0,0.4,0.5333333333333333,0.25,1.0044021606445312,0.0
196,8,AdaBoost (Discrete),0,0.4,0.45555555555555555,0.14136793500001213,60.7013955116272,0.0
197,8,AdaBoost (Real),0,0.4,0.2571428571428571,0.16879151703439468,77.72001481056213,0.0
198,8,Logistic Regression (Penalty = L2),0,0.4,0.5333333333333333,0.25,0.4000284671783447,0.0
199,8,Naive Bayes,0,0.4,0.5333333333333333,0.3524932581000494,0.12866568565368652,0.0
200,8,KNeighbors Classifier,1,0.4,0.4276629570747218,0.15464722819648966,0.2563149929046631,0.0
201,8,SVC Classifier,1,0.4,0.5294117647058824,1.0,1.2833490371704102,0.0
202,8,Decision Tree,1,0.4,0.43084260731319557,0.12993601191148532,0.001955747604370117,0.0
203,8,RandomForest,1,0.4,0.5294117647058824,1.0,0.8511059284210205,0.0
204,8,AdaBoost (Discrete),1,0.4,0.4117647058823529,0.08135960485423795,58.90645384788513,0.08135960485423795
205,8,AdaBoost (Real),1,0.4,0.24006359300476948,0.153266049390247,70.92542457580566,0.0
206,8,Logistic Regression (Penalty = L2),1,0.4,0.5087440381558028,0.22199649060228704,0.48514461517333984,0.0
207,8,Naive Bayes,1,0.4,0.5087440381558028,0.46116886682367136,0.16049647331237793,0.0
208,8,KNeighbors Classifier,2,0.4,0.48562300319488816,0.12603459764425634,0.2987997531890869,0.0
209,8,SVC Classifier,2,0.4,0.5319488817891374,1.0,1.32881498336792,0.0
210,8,Decision Tree,2,0.4,0.48722044728434505,0.10014584914658031,0.002218961715698242,0.0
211,8,RandomForest,2,0.4,0.5319488817891374,1.0,1.1457674503326416,0.0
212,8,AdaBoost (Discrete),2,0.4,0.4233226837060703,0.16372827069995582,64.36686420440674,0.0
213,8,AdaBoost (Real),2,0.4,0.23003194888178913,0.16547574237599935,78.91400337219238,0.16547574237599935
214,8,Logistic Regression (Penalty = L2),2,0.4,0.5399361022364217,0.22487184577932245,0.1844487190246582,0.0
215,8,Naive Bayes,2,0.4,0.4936102236421725,0.4168213793678789,0.10644030570983887,0.0
