,feat_set_id,classifier,fold_id,feat_th,score,geo_score,exec_t,geo_score_woz
0,0,KNeighbors Classifier,0,1.0,0.6416184971098265,0.49771148228661405,3.295027017593384,0.0
1,0,SVC Classifier,0,1.0,0.5028901734104047,0.5227579585747102,3.7326817512512207,0.0
2,0,Decision Tree,0,1.0,0.6473988439306358,0.5548371241927504,0.3021848201751709,0.0
3,0,RandomForest,0,1.0,0.5260115606936416,0.2863424630911014,1.3580529689788818,0.0
4,0,AdaBoost (Discrete),0,1.0,0.7225433526011561,0.5619921735989805,205.7380666732788,0.0
5,0,AdaBoost (Real),0,1.0,0.6242774566473989,0.7244007043050418,255.7836184501648,0.0
6,0,Logistic Regression (Penalty = L2),0,1.0,0.6936416184971098,0.6226764059032338,5.808801174163818,0.0
7,0,Naive Bayes,0,1.0,0.26011560693641617,0.44572384648725094,0.6987669467926025,0.0
8,0,KNeighbors Classifier,1,1.0,0.6488095238095238,0.6474380034053117,3.208749532699585,0.0
9,0,SVC Classifier,1,1.0,0.5238095238095238,0.6933612743506347,4.04286527633667,0.0
10,0,Decision Tree,1,1.0,0.7083333333333334,0.6431380876369222,0.2335062026977539,0.6431380876369222
11,0,RandomForest,1,1.0,0.5476190476190477,0.48549177170732344,1.7742676734924316,0.0
12,0,AdaBoost (Discrete),1,1.0,0.7440476190476191,0.7299790169008447,244.9167182445526,0.0
13,0,AdaBoost (Real),1,1.0,0.6547619047619048,0.6461257294487789,248.026184797287,0.0
14,0,Logistic Regression (Penalty = L2),1,1.0,0.7321428571428571,0.7038952103609406,5.413390398025513,0.0
15,0,Naive Bayes,1,1.0,0.25595238095238093,0.4410714231202338,0.7689008712768555,0.0
16,0,KNeighbors Classifier,2,1.0,0.656441717791411,0.6549050373521691,2.208155393600464,0.0
17,0,SVC Classifier,2,1.0,0.5337423312883436,0.7937005259840998,3.1035804748535156,0.0
18,0,Decision Tree,2,1.0,0.6012269938650306,0.6911189505417961,0.2836189270019531,0.0
19,0,RandomForest,2,1.0,0.5705521472392638,0.3891852707755854,1.1932451725006104,0.0
20,0,AdaBoost (Discrete),2,1.0,0.7791411042944786,0.6811164343095505,216.04735565185547,0.0
21,0,AdaBoost (Real),2,1.0,0.6012269938650306,0.7927451559942899,201.28546833992004,0.0
22,0,Logistic Regression (Penalty = L2),2,1.0,0.7239263803680982,0.6951415456598962,4.272271633148193,0.0
23,0,Naive Bayes,2,1.0,0.2883435582822086,0.49453559168067723,0.7545182704925537,0.0
24,1,KNeighbors Classifier,0,1.0,0.6416184971098265,0.49771148228661405,2.0867156982421875,0.0
25,1,SVC Classifier,0,1.0,0.5028901734104047,0.5227579585747102,2.60738205909729,0.0
26,1,Decision Tree,0,1.0,0.6878612716763006,0.5464476182578306,0.13870453834533691,0.0
27,1,RandomForest,0,1.0,0.5260115606936416,0.2863424630911014,1.1445975303649902,0.0
28,1,AdaBoost (Discrete),0,1.0,0.7225433526011561,0.5619921735989805,195.18613815307617,0.0
29,1,AdaBoost (Real),0,1.0,0.6242774566473989,0.7244007043050418,221.5399136543274,0.0
30,1,Logistic Regression (Penalty = L2),0,1.0,0.6936416184971098,0.6226764059032338,4.622544288635254,0.0
31,1,Naive Bayes,0,1.0,0.26011560693641617,0.44572384648725094,0.8651490211486816,0.0
32,1,KNeighbors Classifier,1,1.0,0.6488095238095238,0.6474380034053117,2.653947353363037,0.0
33,1,SVC Classifier,1,1.0,0.5238095238095238,0.6933612743506347,3.1822707653045654,0.0
34,1,Decision Tree,1,1.0,0.6309523809523809,0.5736826812493337,0.15320086479187012,0.0
35,1,RandomForest,1,1.0,0.5476190476190477,0.48549177170732344,1.146589994430542,0.0
36,1,AdaBoost (Discrete),1,1.0,0.7440476190476191,0.7299790169008447,202.51200485229492,0.0
37,1,AdaBoost (Real),1,1.0,0.6607142857142857,0.6671125599275987,227.40207052230835,0.0
38,1,Logistic Regression (Penalty = L2),1,1.0,0.7321428571428571,0.7038952103609406,4.365267038345337,0.0
39,1,Naive Bayes,1,1.0,0.25595238095238093,0.4410714231202338,0.7751891613006592,0.0
40,1,KNeighbors Classifier,2,1.0,0.656441717791411,0.6549050373521691,2.3655054569244385,0.0
41,1,SVC Classifier,2,1.0,0.5337423312883436,0.7937005259840998,2.832998275756836,0.0
42,1,Decision Tree,2,1.0,0.6196319018404908,0.6323520680549051,0.1446826457977295,0.0
43,1,RandomForest,2,1.0,0.5705521472392638,0.3891852707755854,1.4765872955322266,0.0
44,1,AdaBoost (Discrete),2,1.0,0.7730061349693251,0.6457511760157583,209.81720900535583,0.0
45,1,AdaBoost (Real),2,1.0,0.6196319018404908,0.8107767673127881,225.99186158180237,0.0
46,1,Logistic Regression (Penalty = L2),2,1.0,0.7239263803680982,0.6951415456598962,5.404804229736328,0.0
47,1,Naive Bayes,2,1.0,0.2883435582822086,0.49453559168067723,0.8877806663513184,0.0
48,2,KNeighbors Classifier,0,1.0,0.6416184971098265,0.49771148228661405,2.154575824737549,0.0
49,2,SVC Classifier,0,1.0,0.5028901734104047,0.5227579585747102,2.9344394207000732,0.0
50,2,Decision Tree,0,1.0,0.630057803468208,0.5930779295527094,0.357959508895874,0.0
51,2,RandomForest,0,1.0,0.5260115606936416,0.2863424630911014,1.505403757095337,0.0
52,2,AdaBoost (Discrete),0,1.0,0.7225433526011561,0.5619921735989805,219.07023215293884,0.0
53,2,AdaBoost (Real),0,1.0,0.6242774566473989,0.7244007043050418,230.39005303382874,0.0
54,2,Logistic Regression (Penalty = L2),0,1.0,0.6936416184971098,0.6226764059032338,4.688902378082275,0.0
55,2,Naive Bayes,0,1.0,0.26011560693641617,0.44572384648725094,0.7284862995147705,0.0
56,2,KNeighbors Classifier,1,1.0,0.6488095238095238,0.6474380034053117,2.5275750160217285,0.0
57,2,SVC Classifier,1,1.0,0.5238095238095238,0.6933612743506347,2.8645975589752197,0.0
58,2,Decision Tree,1,1.0,0.6071428571428571,0.5461903700376946,0.27094531059265137,0.5461903700376946
59,2,RandomForest,1,1.0,0.5476190476190477,0.48549177170732344,1.215294599533081,0.0
60,2,AdaBoost (Discrete),1,1.0,0.7440476190476191,0.7299790169008447,199.19906735420227,0.0
61,2,AdaBoost (Real),1,1.0,0.6607142857142857,0.6671125599275987,191.38085103034973,0.0
62,2,Logistic Regression (Penalty = L2),1,1.0,0.7321428571428571,0.7038952103609406,3.763310194015503,0.0
63,2,Naive Bayes,1,1.0,0.25595238095238093,0.4410714231202338,0.6584250926971436,0.0
64,2,KNeighbors Classifier,2,1.0,0.656441717791411,0.6549050373521691,2.0457518100738525,0.0
65,2,SVC Classifier,2,1.0,0.5337423312883436,0.7937005259840998,2.7128312587738037,0.0
66,2,Decision Tree,2,1.0,0.5521472392638037,0.5734613301477106,0.2580113410949707,0.0
67,2,RandomForest,2,1.0,0.5705521472392638,0.3891852707755854,0.932849645614624,0.0
68,2,AdaBoost (Discrete),2,1.0,0.7668711656441718,0.6405387365293822,182.80134415626526,0.0
69,2,AdaBoost (Real),2,1.0,0.6319018404907976,0.8529286505232769,204.05656361579895,0.0
70,2,Logistic Regression (Penalty = L2),2,1.0,0.7239263803680982,0.6951415456598962,4.113294363021851,0.0
71,2,Naive Bayes,2,1.0,0.2883435582822086,0.49453559168067723,0.6640036106109619,0.0
72,3,KNeighbors Classifier,0,1.0,0.6416184971098265,0.49771148228661405,2.1483447551727295,0.0
73,3,SVC Classifier,0,1.0,0.5028901734104047,0.5227579585747102,2.5597727298736572,0.0
74,3,Decision Tree,0,1.0,0.653179190751445,0.7076936189880492,0.2652158737182617,0.0
75,3,RandomForest,0,1.0,0.5260115606936416,0.2863424630911014,0.9966781139373779,0.0
76,3,AdaBoost (Discrete),0,1.0,0.7225433526011561,0.5619921735989805,197.9965329170227,0.0
77,3,AdaBoost (Real),0,1.0,0.6242774566473989,0.7244007043050418,187.41156220436096,0.0
78,3,Logistic Regression (Penalty = L2),0,1.0,0.6936416184971098,0.6226764059032338,4.317929983139038,0.0
79,3,Naive Bayes,0,1.0,0.26011560693641617,0.44572384648725094,0.6673660278320312,0.0
80,3,KNeighbors Classifier,1,1.0,0.6488095238095238,0.6474380034053117,2.2060916423797607,0.0
81,3,SVC Classifier,1,1.0,0.5238095238095238,0.6933612743506347,2.5513875484466553,0.0
82,3,Decision Tree,1,1.0,0.5416666666666666,0.6075828176162397,0.12094235420227051,0.0
83,3,RandomForest,1,1.0,0.5476190476190477,0.48549177170732344,0.981337308883667,0.0
84,3,AdaBoost (Discrete),1,1.0,0.7440476190476191,0.7299790169008447,209.30633187294006,0.0
85,3,AdaBoost (Real),1,1.0,0.6607142857142857,0.6507757151501802,1226.2182009220123,0.0
86,3,Logistic Regression (Penalty = L2),1,1.0,0.7321428571428571,0.7038952103609406,3.4574577808380127,0.0
87,3,Naive Bayes,1,1.0,0.25595238095238093,0.4410714231202338,0.5034537315368652,0.0
88,3,KNeighbors Classifier,2,1.0,0.656441717791411,0.6549050373521691,1.8062307834625244,0.0
89,3,SVC Classifier,2,1.0,0.5337423312883436,0.7937005259840998,2.2990665435791016,0.0
90,3,Decision Tree,2,1.0,0.6319018404907976,0.7292439916210143,0.18881464004516602,0.0
91,3,RandomForest,2,1.0,0.5705521472392638,0.3891852707755854,1.0659823417663574,0.0
92,3,AdaBoost (Discrete),2,1.0,0.7730061349693251,0.6756185299636077,157.64259219169617,0.0
93,3,AdaBoost (Real),2,1.0,0.6012269938650306,0.600273054483637,159.97567796707153,0.0
94,3,Logistic Regression (Penalty = L2),2,1.0,0.7239263803680982,0.6951415456598962,3.5755224227905273,0.0
95,3,Naive Bayes,2,1.0,0.2883435582822086,0.49453559168067723,0.4400675296783447,0.0
96,4,KNeighbors Classifier,0,1.0,0.6416184971098265,0.49771148228661405,1.9245707988739014,0.0
97,4,SVC Classifier,0,1.0,0.5028901734104047,0.5227579585747102,2.131969690322876,0.0
98,4,Decision Tree,0,1.0,0.6763005780346821,0.6646897174360538,0.21393680572509766,0.0
99,4,RandomForest,0,1.0,0.5260115606936416,0.2863424630911014,0.749993085861206,0.0
100,4,AdaBoost (Discrete),0,1.0,0.7225433526011561,0.5619921735989805,148.15070152282715,0.0
101,4,AdaBoost (Real),0,1.0,0.6242774566473989,0.7244007043050418,145.03468012809753,0.0
102,4,Logistic Regression (Penalty = L2),0,1.0,0.6936416184971098,0.6226764059032338,3.1358766555786133,0.0
103,4,Naive Bayes,0,1.0,0.26011560693641617,0.44572384648725094,0.5938420295715332,0.0
104,4,KNeighbors Classifier,1,1.0,0.6488095238095238,0.6474380034053117,1.606292963027954,0.0
105,4,SVC Classifier,1,1.0,0.5238095238095238,0.6933612743506347,1.9422202110290527,0.0
106,4,Decision Tree,1,1.0,0.6488095238095238,0.6121334662729019,0.1020660400390625,0.0
107,4,RandomForest,1,1.0,0.5476190476190477,0.48549177170732344,0.7871034145355225,0.0
108,4,AdaBoost (Discrete),1,1.0,0.7440476190476191,0.7299790169008447,136.0826861858368,0.0
109,4,AdaBoost (Real),1,1.0,0.6607142857142857,0.6671125599275987,135.40051245689392,0.0
110,4,Logistic Regression (Penalty = L2),1,1.0,0.7321428571428571,0.7038952103609406,2.7458887100219727,0.0
111,4,Naive Bayes,1,1.0,0.25595238095238093,0.4410714231202338,0.46783447265625,0.0
112,4,KNeighbors Classifier,2,1.0,0.656441717791411,0.6549050373521691,1.456641674041748,0.0
113,4,SVC Classifier,2,1.0,0.5337423312883436,0.7937005259840998,1.9701342582702637,0.0
114,4,Decision Tree,2,1.0,0.5644171779141104,0.6225054826945144,0.20176076889038086,0.0
115,4,RandomForest,2,1.0,0.5705521472392638,0.3891852707755854,0.7686209678649902,0.0
116,4,AdaBoost (Discrete),2,1.0,0.7791411042944786,0.6811164343095505,132.5045394897461,0.0
117,4,AdaBoost (Real),2,1.0,0.6319018404907976,0.8529286505232769,136.11801147460938,0.0
118,4,Logistic Regression (Penalty = L2),2,1.0,0.7239263803680982,0.6951415456598962,3.230931043624878,0.0
119,4,Naive Bayes,2,1.0,0.2883435582822086,0.49453559168067723,0.46294260025024414,0.0
120,5,KNeighbors Classifier,0,1.0,0.6416184971098265,0.49771148228661405,1.5385630130767822,0.0
121,5,SVC Classifier,0,1.0,0.5028901734104047,0.5227579585747102,1.7521109580993652,0.0
122,5,Decision Tree,0,1.0,0.7109826589595376,0.7019410317362997,0.09345269203186035,0.0
123,5,RandomForest,0,1.0,0.5260115606936416,0.2863424630911014,0.7726969718933105,0.0
124,5,AdaBoost (Discrete),0,1.0,0.7225433526011561,0.5619921735989805,126.97929668426514,0.0
125,5,AdaBoost (Real),0,1.0,0.6242774566473989,0.7244007043050418,124.06491947174072,0.0
126,5,Logistic Regression (Penalty = L2),0,1.0,0.6936416184971098,0.6226764059032338,2.776517152786255,0.0
127,5,Naive Bayes,0,1.0,0.26011560693641617,0.44572384648725094,0.373565673828125,0.0
128,5,KNeighbors Classifier,1,1.0,0.6488095238095238,0.6474380034053117,1.478656530380249,0.0
129,5,SVC Classifier,1,1.0,0.5238095238095238,0.6933612743506347,1.7430362701416016,0.0
130,5,Decision Tree,1,1.0,0.6845238095238095,0.7166901449621026,0.1870133876800537,0.0
131,5,RandomForest,1,1.0,0.5476190476190477,0.48549177170732344,0.563929557800293,0.0
132,5,AdaBoost (Discrete),1,1.0,0.7380952380952381,0.7175559338604465,120.97812724113464,0.0
133,5,AdaBoost (Real),1,1.0,0.6607142857142857,0.6671125599275987,124.76340436935425,0.0
134,5,Logistic Regression (Penalty = L2),1,1.0,0.7321428571428571,0.7038952103609406,2.827343225479126,0.0
135,5,Naive Bayes,1,1.0,0.25595238095238093,0.4410714231202338,0.43980956077575684,0.0
136,5,KNeighbors Classifier,2,1.0,0.656441717791411,0.6549050373521691,1.4189555644989014,0.0
137,5,SVC Classifier,2,1.0,0.5337423312883436,0.7937005259840998,1.7922329902648926,0.0
138,5,Decision Tree,2,1.0,0.6073619631901841,0.6885156100257558,0.1780531406402588,0.0
139,5,RandomForest,2,1.0,0.5705521472392638,0.3891852707755854,0.7593693733215332,0.0
140,5,AdaBoost (Discrete),2,1.0,0.7730061349693251,0.6457511760157583,128.8486692905426,0.0
141,5,AdaBoost (Real),2,1.0,0.588957055214724,0.7567837271227947,124.17462062835693,0.0
142,5,Logistic Regression (Penalty = L2),2,1.0,0.7239263803680982,0.6951415456598962,2.5896637439727783,0.0
143,5,Naive Bayes,2,1.0,0.2883435582822086,0.49453559168067723,0.3487131595611572,0.0
144,6,KNeighbors Classifier,0,1.0,0.6416184971098265,0.49771148228661405,1.3329179286956787,0.0
145,6,SVC Classifier,0,1.0,0.5028901734104047,0.5227579585747102,1.7267820835113525,0.0
146,6,Decision Tree,0,1.0,0.6416184971098265,0.6267349765154125,0.1701817512512207,0.0
147,6,RandomForest,0,1.0,0.5260115606936416,0.2863424630911014,0.5963082313537598,0.0
148,6,AdaBoost (Discrete),0,1.0,0.7225433526011561,0.5619921735989805,106.77628135681152,0.0
149,6,AdaBoost (Real),0,1.0,0.630057803468208,0.7175801436772925,107.16675162315369,0.0
150,6,Logistic Regression (Penalty = L2),0,1.0,0.6936416184971098,0.6226764059032338,2.5927534103393555,0.0
151,6,Naive Bayes,0,1.0,0.26011560693641617,0.44572384648725094,0.397036075592041,0.0
152,6,KNeighbors Classifier,1,1.0,0.6488095238095238,0.6474380034053117,1.286531925201416,0.0
153,6,SVC Classifier,1,1.0,0.5238095238095238,0.6933612743506347,1.506697177886963,0.0
154,6,Decision Tree,1,1.0,0.5833333333333334,0.697109217567309,0.07744956016540527,0.0
155,6,RandomForest,1,1.0,0.5476190476190477,0.48549177170732344,0.4682881832122803,0.0
156,6,AdaBoost (Discrete),1,1.0,0.7440476190476191,0.7299790169008447,97.87327194213867,0.0
157,6,AdaBoost (Real),1,1.0,0.6607142857142857,0.6671125599275987,108.8110294342041,0.0
158,6,Logistic Regression (Penalty = L2),1,1.0,0.7321428571428571,0.7038952103609406,2.192716598510742,0.0
159,6,Naive Bayes,1,1.0,0.25595238095238093,0.4410714231202338,0.33632779121398926,0.0
160,6,KNeighbors Classifier,2,1.0,0.656441717791411,0.6549050373521691,1.194751501083374,0.0
161,6,SVC Classifier,2,1.0,0.5337423312883436,0.7937005259840998,1.451200246810913,0.0
162,6,Decision Tree,2,1.0,0.6012269938650306,0.5857168366422586,0.15842056274414062,0.0
163,6,RandomForest,2,1.0,0.5705521472392638,0.3891852707755854,0.5546400547027588,0.0
164,6,AdaBoost (Discrete),2,1.0,0.7730061349693251,0.6756185299636077,102.72285676002502,0.0
165,6,AdaBoost (Real),2,1.0,0.6319018404907976,0.8529286505232769,103.35952401161194,0.0
166,6,Logistic Regression (Penalty = L2),2,1.0,0.7239263803680982,0.6951415456598962,2.154087543487549,0.0
167,6,Naive Bayes,2,1.0,0.2883435582822086,0.49453559168067723,0.3008151054382324,0.0
168,7,KNeighbors Classifier,0,1.0,0.6416184971098265,0.49771148228661405,1.1655080318450928,0.0
169,7,SVC Classifier,0,1.0,0.5028901734104047,0.5227579585747102,1.3687877655029297,0.0
170,7,Decision Tree,0,1.0,0.6589595375722543,0.6154615876053701,0.0875556468963623,0.0
171,7,RandomForest,0,1.0,0.5260115606936416,0.2863424630911014,0.536311149597168,0.0
172,7,AdaBoost (Discrete),0,1.0,0.7225433526011561,0.5619921735989805,98.05349707603455,0.0
173,7,AdaBoost (Real),0,1.0,0.6242774566473989,0.7244007043050418,106.2213876247406,0.0
174,7,Logistic Regression (Penalty = L2),0,1.0,0.6936416184971098,0.6226764059032338,2.5514750480651855,0.0
175,7,Naive Bayes,0,1.0,0.26011560693641617,0.44572384648725094,0.42209291458129883,0.0
176,7,KNeighbors Classifier,1,1.0,0.6488095238095238,0.6474380034053117,1.2900938987731934,0.0
177,7,SVC Classifier,1,1.0,0.5238095238095238,0.6933612743506347,1.7504758834838867,0.0
178,7,Decision Tree,1,1.0,0.6309523809523809,0.712581425040589,0.10062980651855469,0.0
179,7,RandomForest,1,1.0,0.5476190476190477,0.48549177170732344,0.7065415382385254,0.0
180,7,AdaBoost (Discrete),1,1.0,0.7440476190476191,0.7299790169008447,103.83473014831543,0.0
181,7,AdaBoost (Real),1,1.0,0.6607142857142857,0.6671125599275987,110.72300791740417,0.0
182,7,Logistic Regression (Penalty = L2),1,1.0,0.7321428571428571,0.7038952103609406,2.278456211090088,0.0
183,7,Naive Bayes,1,1.0,0.25595238095238093,0.4410714231202338,0.39476799964904785,0.0
184,7,KNeighbors Classifier,2,1.0,0.656441717791411,0.6549050373521691,1.2716023921966553,0.0
185,7,SVC Classifier,2,1.0,0.5337423312883436,0.7937005259840998,1.5266084671020508,0.0
186,7,Decision Tree,2,1.0,0.6257668711656442,0.6229344598959825,0.08150148391723633,0.0
187,7,RandomForest,2,1.0,0.5705521472392638,0.3891852707755854,0.5604512691497803,0.0
188,7,AdaBoost (Discrete),2,1.0,0.7791411042944786,0.6811164343095505,102.39788556098938,0.0
189,7,AdaBoost (Real),2,1.0,0.6319018404907976,0.8529286505232769,105.74615383148193,0.0
190,7,Logistic Regression (Penalty = L2),2,1.0,0.7239263803680982,0.6951415456598962,2.1884307861328125,0.0
191,7,Naive Bayes,2,1.0,0.2883435582822086,0.49453559168067723,0.2984127998352051,0.0
192,8,KNeighbors Classifier,0,1.0,0.6416184971098265,0.49771148228661405,1.1561462879180908,0.0
193,8,SVC Classifier,0,1.0,0.5028901734104047,0.5227579585747102,1.4296448230743408,0.0
194,8,Decision Tree,0,1.0,0.6936416184971098,0.6584217447739513,0.15159964561462402,0.0
195,8,RandomForest,0,1.0,0.5260115606936416,0.2863424630911014,0.6096100807189941,0.0
196,8,AdaBoost (Discrete),0,1.0,0.7225433526011561,0.5619921735989805,96.27731370925903,0.0
197,8,AdaBoost (Real),0,1.0,0.6242774566473989,0.7244007043050418,102.17619252204895,0.0
198,8,Logistic Regression (Penalty = L2),0,1.0,0.6936416184971098,0.6226764059032338,2.432908058166504,0.0
199,8,Naive Bayes,0,1.0,0.26011560693641617,0.44572384648725094,0.36195898056030273,0.0
200,8,KNeighbors Classifier,1,1.0,0.6488095238095238,0.6474380034053117,1.2997407913208008,0.0
201,8,SVC Classifier,1,1.0,0.5238095238095238,0.6933612743506347,1.450012445449829,0.0
202,8,Decision Tree,1,1.0,0.6488095238095238,0.7723581060204571,0.07637763023376465,0.0
203,8,RandomForest,1,1.0,0.5476190476190477,0.48549177170732344,0.5609323978424072,0.0
204,8,AdaBoost (Discrete),1,1.0,0.75,0.7463130721628397,102.41873574256897,0.0
205,8,AdaBoost (Real),1,1.0,0.6607142857142857,0.6671125599275987,104.40382695198059,0.0
206,8,Logistic Regression (Penalty = L2),1,1.0,0.7321428571428571,0.7038952103609406,2.087839365005493,0.0
207,8,Naive Bayes,1,1.0,0.25595238095238093,0.4410714231202338,0.2977766990661621,0.0
208,8,KNeighbors Classifier,2,1.0,0.656441717791411,0.6549050373521691,1.231891393661499,0.0
209,8,SVC Classifier,2,1.0,0.5337423312883436,0.7937005259840998,1.528721570968628,0.0
210,8,Decision Tree,2,1.0,0.5828220858895705,0.575916333117885,0.08141350746154785,0.0
211,8,RandomForest,2,1.0,0.5705521472392638,0.3891852707755854,0.5815567970275879,0.0
212,8,AdaBoost (Discrete),2,1.0,0.7668711656441718,0.6405387365293822,110.62782764434814,0.0
213,8,AdaBoost (Real),2,1.0,0.6134969325153374,0.782139021094949,120.79366302490234,0.0
214,8,Logistic Regression (Penalty = L2),2,1.0,0.7239263803680982,0.6951415456598962,2.4802777767181396,0.0
215,8,Naive Bayes,2,1.0,0.2883435582822086,0.49453559168067723,0.429746150970459,0.0
