,feat_set_id,classifier,fold_id,feat_th,score,geo_score,exec_t,geo_score_woz
0,0,KNeighbors Classifier,0,0.3,0.1907514450867052,0.27174064489288746,0.07118844985961914,0.0
1,0,SVC Classifier,0,0.3,0.49710982658959535,1.0,0.08719873428344727,0.0
2,0,Decision Tree,0,0.3,0.5317919075144508,0.33403088378766416,0.027745485305786133,0.0
3,0,RandomForest,0,0.3,0.5028901734104047,0.5227579585747102,0.10045790672302246,0.0
4,0,AdaBoost (Discrete),0,0.3,0.5144508670520231,0.27508926666187744,6.785929203033447,0.0
5,0,AdaBoost (Real),0,0.3,0.5375722543352601,0.32448260169662924,10.153802394866943,0.0
6,0,Logistic Regression (Penalty = L2),0,0.3,0.49710982658959535,1.0,0.09454774856567383,0.0
7,0,Naive Bayes,0,0.3,0.12138728323699421,0.25901399985300266,0.05817294120788574,0.0
8,0,KNeighbors Classifier,1,0.3,0.5535714285714286,0.3118681550488477,0.12573885917663574,0.0
9,0,SVC Classifier,1,0.3,0.5119047619047619,1.0,0.10999846458435059,0.0
10,0,Decision Tree,1,0.3,0.5178571428571429,0.4770242243933277,0.003107309341430664,0.0
11,0,RandomForest,1,0.3,0.5178571428571429,0.5848035476425733,0.14346671104431152,0.0
12,0,AdaBoost (Discrete),1,0.3,0.5,0.4125060218132505,6.758618593215942,0.0
13,0,AdaBoost (Real),1,0.3,0.5,0.28455190077633413,8.19081735610962,0.0
14,0,Logistic Regression (Penalty = L2),1,0.3,0.5119047619047619,1.0,0.07666301727294922,0.0
15,0,Naive Bayes,1,0.3,0.13690476190476192,0.2707825387824117,0.06843900680541992,0.0
16,0,KNeighbors Classifier,2,0.3,0.5214723926380368,0.4603405631176504,0.10213136672973633,0.0
17,0,SVC Classifier,2,0.3,0.5153374233128835,1.0,0.07152771949768066,0.0
18,0,Decision Tree,2,0.3,0.558282208588957,0.3390265140668218,0.002367734909057617,0.0
19,0,RandomForest,2,0.3,0.5153374233128835,1.0,0.07263350486755371,0.0
20,0,AdaBoost (Discrete),2,0.3,0.5521472392638037,0.28555239487607714,6.861353158950806,0.0
21,0,AdaBoost (Real),2,0.3,0.5644171779141104,0.38828872506189793,8.016833543777466,0.0
22,0,Logistic Regression (Penalty = L2),2,0.3,0.5153374233128835,1.0,0.06348609924316406,0.0
23,0,Naive Bayes,2,0.3,0.15950920245398773,0.3240225931048854,0.06754899024963379,0.0
24,1,KNeighbors Classifier,0,0.3,0.5953757225433526,0.5113816523189061,0.12730050086975098,0.0
25,1,SVC Classifier,0,0.3,0.49710982658959535,1.0,0.09461498260498047,0.0
26,1,Decision Tree,0,0.3,0.6184971098265896,0.6378960308276387,0.027604103088378906,0.0
27,1,RandomForest,0,0.3,0.5491329479768786,0.37829638948612676,0.10272502899169922,0.0
28,1,AdaBoost (Discrete),0,0.3,0.6936416184971098,0.6382690707175309,9.731210947036743,0.0
29,1,AdaBoost (Real),0,0.3,0.5375722543352601,0.4215502518650414,10.94253158569336,0.0
30,1,Logistic Regression (Penalty = L2),0,0.3,0.5144508670520231,0.7539474411291538,0.13085174560546875,0.0
31,1,Naive Bayes,0,0.3,0.2254335260115607,0.362173177978653,0.04571533203125,0.0
32,1,KNeighbors Classifier,1,0.3,0.5892857142857143,0.5624405562674705,0.1178126335144043,0.0
33,1,SVC Classifier,1,0.3,0.5119047619047619,1.0,0.0938711166381836,0.0
34,1,Decision Tree,1,0.3,0.5892857142857143,0.5094646551194891,0.003444671630859375,0.0
35,1,RandomForest,1,0.3,0.5535714285714286,0.35802241335294416,0.12738037109375,0.0
36,1,AdaBoost (Discrete),1,0.3,0.6845238095238095,0.6688029510395079,9.662989854812622,0.0
37,1,AdaBoost (Real),1,0.3,0.6369047619047619,0.68148875036395,10.91785454750061,0.0
38,1,Logistic Regression (Penalty = L2),1,0.3,0.5297619047619048,0.3860973950960897,0.1623082160949707,0.0
39,1,Naive Bayes,1,0.3,0.2261904761904762,0.3233583926199941,0.05736088752746582,0.3233583926199941
40,1,KNeighbors Classifier,2,0.3,0.6196319018404908,0.6544507022213436,0.1621701717376709,0.0
41,1,SVC Classifier,2,0.3,0.5153374233128835,1.0,0.1328282356262207,0.0
42,1,Decision Tree,2,0.3,0.5521472392638037,0.6252737030267062,0.02006053924560547,0.0
43,1,RandomForest,2,0.3,0.5766871165644172,0.5109716537267232,0.09862375259399414,0.0
44,1,AdaBoost (Discrete),2,0.3,0.7055214723926381,0.5063115447268629,9.111425161361694,0.0
45,1,AdaBoost (Real),2,0.3,0.50920245398773,0.6182119282517224,10.5633225440979,0.0
46,1,Logistic Regression (Penalty = L2),2,0.3,0.5828220858895705,0.4418417888846301,0.12687158584594727,0.0
47,1,Naive Bayes,2,0.3,0.2883435582822086,0.5057746205271176,0.06361770629882812,0.0
48,2,KNeighbors Classifier,0,0.3,0.6184971098265896,0.4883613915385975,0.12051129341125488,0.0
49,2,SVC Classifier,0,0.3,0.49710982658959535,1.0,0.09392309188842773,0.0
50,2,Decision Tree,0,0.3,0.6763005780346821,0.7052924935751647,0.028261423110961914,0.0
51,2,RandomForest,0,0.3,0.5606936416184971,0.7186082239261684,0.07903218269348145,0.0
52,2,AdaBoost (Discrete),0,0.3,0.6878612716763006,0.4996293309689043,12.08678388595581,0.0
53,2,AdaBoost (Real),0,0.3,0.5433526011560693,0.6867564474811643,13.516883134841919,0.0
54,2,Logistic Regression (Penalty = L2),0,0.3,0.7109826589595376,0.5889324178164866,0.23210573196411133,0.0
55,2,Naive Bayes,0,0.3,0.26011560693641617,0.4265939486454942,0.07289552688598633,0.0
56,2,KNeighbors Classifier,1,0.3,0.6785714285714286,0.5222905774061756,0.09978675842285156,0.0
57,2,SVC Classifier,1,0.3,0.5119047619047619,1.0,0.10012102127075195,0.0
58,2,Decision Tree,1,0.3,0.6190476190476191,0.6435624081722217,0.02898573875427246,0.6435624081722217
59,2,RandomForest,1,0.3,0.5595238095238095,0.6389431042462725,0.10061383247375488,0.0
60,2,AdaBoost (Discrete),1,0.3,0.7261904761904762,0.6702523448530006,11.782433032989502,0.0
61,2,AdaBoost (Real),1,0.3,0.6011904761904762,0.7186317636033005,13.492176294326782,0.0
62,2,Logistic Regression (Penalty = L2),1,0.3,0.7321428571428571,0.6864573750169374,0.2373344898223877,0.0
63,2,Naive Bayes,1,0.3,0.30357142857142855,0.5180746996344445,0.07588768005371094,0.0
64,2,KNeighbors Classifier,2,0.3,0.6687116564417178,0.5799728900990626,0.09614396095275879,0.0
65,2,SVC Classifier,2,0.3,0.5153374233128835,1.0,0.0741879940032959,0.0
66,2,Decision Tree,2,0.3,0.558282208588957,0.6409494086961653,0.0025823116302490234,0.0
67,2,RandomForest,2,0.3,0.5644171779141104,0.6782652182061499,0.11828041076660156,0.0
68,2,AdaBoost (Discrete),2,0.3,0.754601226993865,0.6399219491948362,12.53017807006836,0.0
69,2,AdaBoost (Real),2,0.3,0.5828220858895705,0.810908927640115,14.126111507415771,0.0
70,2,Logistic Regression (Penalty = L2),2,0.3,0.6993865030674846,0.5242940719584684,0.24175810813903809,0.0
71,2,Naive Bayes,2,0.3,0.26380368098159507,0.4894387461264661,0.04208230972290039,0.0
72,3,KNeighbors Classifier,0,0.3,0.6416184971098265,0.5221015686583925,0.08676910400390625,0.0
73,3,SVC Classifier,0,0.3,0.49710982658959535,1.0,0.07555913925170898,0.0
74,3,Decision Tree,0,0.3,0.6184971098265896,0.5976239239330374,0.01981663703918457,0.0
75,3,RandomForest,0,0.3,0.5549132947976878,0.5502003442684831,0.1036689281463623,0.0
76,3,AdaBoost (Discrete),0,0.3,0.7167630057803468,0.6260783571559488,11.797239303588867,0.0
77,3,AdaBoost (Real),0,0.3,0.6647398843930635,0.7701393616522492,12.491671085357666,0.0
78,3,Logistic Regression (Penalty = L2),0,0.3,0.7052023121387283,0.6719286100483727,0.18808555603027344,0.0
79,3,Naive Bayes,0,0.3,0.24855491329479767,0.3818771122587039,0.07579565048217773,0.0
80,3,KNeighbors Classifier,1,0.3,0.6428571428571429,0.5136481403512527,0.11337590217590332,0.0
81,3,SVC Classifier,1,0.3,0.5119047619047619,1.0,0.09730768203735352,0.0
82,3,Decision Tree,1,0.3,0.6130952380952381,0.6979467407032794,0.003267526626586914,0.0
83,3,RandomForest,1,0.3,0.5654761904761905,0.6943374004077716,0.1248781681060791,0.0
84,3,AdaBoost (Discrete),1,0.3,0.7142857142857143,0.6272003988887598,11.276530265808105,0.0
85,3,AdaBoost (Real),1,0.3,0.5952380952380952,0.6306382912220819,12.77207612991333,0.0
86,3,Logistic Regression (Penalty = L2),1,0.3,0.7857142857142857,0.7090463473477887,0.17530608177185059,0.0
87,3,Naive Bayes,1,0.3,0.2857142857142857,0.5062519503725174,0.04532480239868164,0.0
88,3,KNeighbors Classifier,2,0.3,0.6809815950920245,0.5773021346015218,0.1309809684753418,0.0
89,3,SVC Classifier,2,0.3,0.5153374233128835,1.0,0.0987234115600586,0.0
90,3,Decision Tree,2,0.3,0.6319018404907976,0.7071067811865476,0.02722930908203125,0.0
91,3,RandomForest,2,0.3,0.5828220858895705,0.7476743906106103,0.09687519073486328,0.0
92,3,AdaBoost (Discrete),2,0.3,0.7730061349693251,0.7650608565193362,11.31362795829773,0.0
93,3,AdaBoost (Real),2,0.3,0.588957055214724,0.7625393619485479,12.594621896743774,0.0
94,3,Logistic Regression (Penalty = L2),2,0.3,0.7361963190184049,0.6344777498626243,0.15746092796325684,0.0
95,3,Naive Bayes,2,0.3,0.27607361963190186,0.49778639312768813,0.05793309211730957,0.0
96,4,KNeighbors Classifier,0,0.3,0.19653179190751446,0.30411803432509316,0.06033587455749512,0.0
97,4,SVC Classifier,0,0.3,0.49710982658959535,1.0,0.026668548583984375,0.0
98,4,Decision Tree,0,0.3,0.5086705202312138,0.36650623447373354,0.0015392303466796875,0.0
99,4,RandomForest,0,0.3,0.49710982658959535,1.0,0.06756114959716797,0.0
100,4,AdaBoost (Discrete),0,0.3,0.5086705202312138,0.3526226762923214,5.697294473648071,0.0
101,4,AdaBoost (Real),0,0.3,0.4913294797687861,0.34718575301367877,7.040771245956421,0.0
102,4,Logistic Regression (Penalty = L2),0,0.3,0.49710982658959535,1.0,0.08158516883850098,0.0
103,4,Naive Bayes,0,0.3,0.12138728323699421,0.28113635884545596,0.053891658782958984,0.0
104,4,KNeighbors Classifier,1,0.3,0.5416666666666666,0.3769637041247438,0.06882405281066895,0.0
105,4,SVC Classifier,1,0.3,0.5119047619047619,1.0,0.03544902801513672,0.0
106,4,Decision Tree,1,0.3,0.5178571428571429,0.4468653707072605,0.0015642642974853516,0.0
107,4,RandomForest,1,0.3,0.5119047619047619,1.0,0.13185811042785645,0.0
108,4,AdaBoost (Discrete),1,0.3,0.49404761904761907,0.38037506624785244,6.077942609786987,0.0
109,4,AdaBoost (Real),1,0.3,0.5238095238095238,0.4478662036326834,7.122456789016724,0.0
110,4,Logistic Regression (Penalty = L2),1,0.3,0.5119047619047619,1.0,0.041635751724243164,0.0
111,4,Naive Bayes,1,0.3,0.08928571428571429,0.3618804613969556,0.03240633010864258,0.0
112,4,KNeighbors Classifier,2,0.3,0.5214723926380368,0.43761446284608135,0.04449725151062012,0.0
113,4,SVC Classifier,2,0.3,0.5153374233128835,1.0,0.042610883712768555,0.0
114,4,Decision Tree,2,0.3,0.558282208588957,0.3302399076441038,0.001661062240600586,0.0
115,4,RandomForest,2,0.3,0.5153374233128835,1.0,0.09539341926574707,0.0
116,4,AdaBoost (Discrete),2,0.3,0.5460122699386503,0.2824174146135648,5.6131591796875,0.0
117,4,AdaBoost (Real),2,0.3,0.5644171779141104,0.41178429371642805,7.217545032501221,0.0
118,4,Logistic Regression (Penalty = L2),2,0.3,0.5153374233128835,1.0,0.06203866004943848,0.0
119,4,Naive Bayes,2,0.3,0.13496932515337423,0.27693786279296806,0.030736684799194336,0.0
120,6,KNeighbors Classifier,0,0.3,0.5144508670520231,0.3193278811348795,0.005610466003417969,0.0
121,6,SVC Classifier,0,0.3,0.49710982658959535,1.0,0.03335881233215332,0.0
122,6,Decision Tree,0,0.3,0.5260115606936416,0.4213556652878199,0.0012311935424804688,0.0
123,6,RandomForest,0,0.3,0.5086705202312138,0.4899973050296446,0.09475183486938477,0.0
124,6,AdaBoost (Discrete),0,0.3,0.5260115606936416,0.45581444384758507,5.411682844161987,0.0
125,6,AdaBoost (Real),0,0.3,0.5260115606936416,0.45581444384758507,7.227706670761108,0.0
126,6,Logistic Regression (Penalty = L2),0,0.3,0.49710982658959535,1.0,0.03100728988647461,0.0
127,6,Naive Bayes,0,0.3,0.09826589595375723,0.36771267917269485,0.03175473213195801,0.0
128,6,KNeighbors Classifier,1,0.3,0.5297619047619048,0.35625867032960373,0.023347139358520508,0.0
129,6,SVC Classifier,1,0.3,0.5119047619047619,1.0,0.0312497615814209,0.0
130,6,Decision Tree,1,0.3,0.5297619047619048,0.35625867032960373,0.001219034194946289,0.0
131,6,RandomForest,1,0.3,0.5119047619047619,1.0,0.0883643627166748,0.0
132,6,AdaBoost (Discrete),1,0.3,0.5297619047619048,0.35625867032960373,5.601633071899414,0.0
133,6,AdaBoost (Real),1,0.3,0.5357142857142857,0.3773576771934654,6.3844335079193115,0.0
134,6,Logistic Regression (Penalty = L2),1,0.3,0.5119047619047619,1.0,0.03125905990600586,0.0
135,6,Naive Bayes,1,0.3,0.10119047619047619,0.21221579034383975,0.029274940490722656,0.0
136,6,KNeighbors Classifier,2,0.3,0.5153374233128835,0.3513504584954156,0.032126665115356445,0.0
137,6,SVC Classifier,2,0.3,0.5153374233128835,1.0,0.005971670150756836,0.0
138,6,Decision Tree,2,0.3,0.5337423312883436,0.3993688317469616,0.0018010139465332031,0.0
139,6,RandomForest,2,0.3,0.5214723926380368,0.3968502629920499,0.09282898902893066,0.0
140,6,AdaBoost (Discrete),2,0.3,0.5153374233128835,0.3751380505593989,4.948084115982056,0.0
141,6,AdaBoost (Real),2,0.3,0.5337423312883436,0.3993688317469616,6.590424060821533,0.0
142,6,Logistic Regression (Penalty = L2),2,0.3,0.5153374233128835,1.0,0.02606797218322754,0.0
143,6,Naive Bayes,2,0.3,0.10429447852760736,0.43527528164806206,0.03116631507873535,0.0
144,7,KNeighbors Classifier,0,0.3,0.6127167630057804,0.44990805293583286,0.03372907638549805,0.0
145,7,SVC Classifier,0,0.3,0.49710982658959535,1.0,0.03377676010131836,0.0
146,7,Decision Tree,0,0.3,0.5895953757225434,0.5951954563701254,0.0020475387573242188,0.0
147,7,RandomForest,0,0.3,0.5375722543352601,1.0,0.06928300857543945,0.0
148,7,AdaBoost (Discrete),0,0.3,0.6011560693641619,0.5774099382962109,7.041405916213989,0.0
149,7,AdaBoost (Real),0,0.3,0.5895953757225434,0.49944898275193084,8.551100492477417,0.0
150,7,Logistic Regression (Penalty = L2),0,0.3,0.5028901734104047,0.5227579585747102,0.08226656913757324,0.0
151,7,Naive Bayes,0,0.3,0.30057803468208094,0.6531118840490285,0.03159165382385254,0.0
152,7,KNeighbors Classifier,1,0.3,0.6488095238095238,0.4851133694383107,0.058696746826171875,0.0
153,7,SVC Classifier,1,0.3,0.5119047619047619,1.0,0.04097270965576172,0.0
154,7,Decision Tree,1,0.3,0.5357142857142857,0.5158767311081396,0.003022432327270508,0.0
155,7,RandomForest,1,0.3,0.5654761904761905,0.6865890479690393,0.10624909400939941,0.0
156,7,AdaBoost (Discrete),1,0.3,0.6309523809523809,0.7162058828858341,7.321324348449707,0.0
157,7,AdaBoost (Real),1,0.3,0.5892857142857143,0.6830451166761059,8.357399940490723,0.0
158,7,Logistic Regression (Penalty = L2),1,0.3,0.5297619047619048,0.3860973950960897,0.10893964767456055,0.0
159,7,Naive Bayes,1,0.3,0.27976190476190477,0.5929976373901024,0.05640435218811035,0.0
160,7,KNeighbors Classifier,2,0.3,0.6134969325153374,0.6092278968221744,0.06314754486083984,0.0
161,7,SVC Classifier,2,0.3,0.5153374233128835,1.0,0.02519083023071289,0.0
162,7,Decision Tree,2,0.3,0.5214723926380368,0.7479074418287661,0.002716064453125,0.0
163,7,RandomForest,2,0.3,0.558282208588957,0.5169731539571706,0.0735173225402832,0.0
164,7,AdaBoost (Discrete),2,0.3,0.656441717791411,0.5429182279905018,7.584768533706665,0.0
165,7,AdaBoost (Real),2,0.3,0.49693251533742333,0.542788732658922,8.32736849784851,0.0
166,7,Logistic Regression (Penalty = L2),2,0.3,0.5398773006134969,0.9371474058908325,0.06616735458374023,0.0
167,7,Naive Bayes,2,0.3,0.2883435582822086,0.5513574693673032,0.023482561111450195,0.0
168,8,KNeighbors Classifier,0,0.3,0.6069364161849711,0.6015541152838155,0.0602421760559082,0.0
169,8,SVC Classifier,0,0.3,0.49710982658959535,1.0,0.02092576026916504,0.0
170,8,Decision Tree,0,0.3,0.6127167630057804,0.6516736149469351,0.0019469261169433594,0.0
171,8,RandomForest,0,0.3,0.5144508670520231,0.5609068938801836,0.06961345672607422,0.0
172,8,AdaBoost (Discrete),0,0.3,0.5895953757225434,0.5591270219539636,5.482128381729126,0.0
173,8,AdaBoost (Real),0,0.3,0.5780346820809249,0.6101041364194887,7.108206510543823,0.0
174,8,Logistic Regression (Penalty = L2),0,0.3,0.49710982658959535,1.0,0.08260607719421387,0.0
175,8,Naive Bayes,0,0.3,0.15028901734104047,0.4995148345250046,0.04089546203613281,0.0
176,8,KNeighbors Classifier,1,0.3,0.6190476190476191,0.5671498823937595,0.06528615951538086,0.0
177,8,SVC Classifier,1,0.3,0.5119047619047619,1.0,0.03288769721984863,0.0
178,8,Decision Tree,1,0.3,0.5535714285714286,0.5422844746028286,0.0026504993438720703,0.0
179,8,RandomForest,1,0.3,0.5357142857142857,0.7009055322276453,0.09441113471984863,0.0
180,8,AdaBoost (Discrete),1,0.3,0.6309523809523809,0.58429741737839,5.669835805892944,0.0
181,8,AdaBoost (Real),1,0.3,0.5416666666666666,0.3828305999536911,6.874645709991455,0.0
182,8,Logistic Regression (Penalty = L2),1,0.3,0.5119047619047619,1.0,0.055542945861816406,0.0
183,8,Naive Bayes,1,0.3,0.13095238095238096,0.4344571293873613,0.027292251586914062,0.0
184,8,KNeighbors Classifier,2,0.3,0.6073619631901841,0.5648613001511684,0.06805276870727539,0.0
185,8,SVC Classifier,2,0.3,0.5153374233128835,1.0,0.03943824768066406,0.0
186,8,Decision Tree,2,0.3,0.5276073619631901,0.5195173625368654,0.0016672611236572266,0.0
187,8,RandomForest,2,0.3,0.558282208588957,0.7591472429689157,0.06944966316223145,0.0
188,8,AdaBoost (Discrete),2,0.3,0.588957055214724,0.572614712891872,5.182400226593018,0.0
189,8,AdaBoost (Real),2,0.3,0.5766871165644172,0.5656075228721481,7.584050416946411,0.0
190,8,Logistic Regression (Penalty = L2),2,0.3,0.5214723926380368,0.3968502629920499,0.05462980270385742,0.0
191,8,Naive Bayes,2,0.3,0.1901840490797546,0.39044706241957833,0.021736860275268555,0.0
192,9,KNeighbors Classifier,0,0.3,0.6473988439306358,0.525130759321963,0.0818471908569336,0.0
193,9,SVC Classifier,0,0.3,0.49710982658959535,1.0,0.03719496726989746,0.0
194,9,Decision Tree,0,0.3,0.630057803468208,0.4853159387487024,0.026040077209472656,0.0
195,9,RandomForest,0,0.3,0.5260115606936416,0.37703367184101144,0.07535219192504883,0.0
196,9,AdaBoost (Discrete),0,0.3,0.7052023121387283,0.6379637951036246,7.000847101211548,0.0
197,9,AdaBoost (Real),0,0.3,0.5317919075144508,0.6583043382423259,8.462231636047363,0.0
198,9,Logistic Regression (Penalty = L2),0,0.3,0.6878612716763006,0.49934534599236985,0.09503722190856934,0.0
199,9,Naive Bayes,0,0.3,0.1907514450867052,0.4764146453129165,0.016696691513061523,0.0
200,9,KNeighbors Classifier,1,0.3,0.6428571428571429,0.6732195143399302,0.05397772789001465,0.0
201,9,SVC Classifier,1,0.3,0.5119047619047619,1.0,0.045720577239990234,0.0
202,9,Decision Tree,1,0.3,0.6369047619047619,0.6051174940418621,0.003473043441772461,0.0
203,9,RandomForest,1,0.3,0.5357142857142857,0.42728700639623407,0.08976030349731445,0.0
204,9,AdaBoost (Discrete),1,0.3,0.7142857142857143,0.6724777340816905,8.02246880531311,0.0
205,9,AdaBoost (Real),1,0.3,0.5595238095238095,0.7412733111728259,9.251999378204346,0.0
206,9,Logistic Regression (Penalty = L2),1,0.3,0.7083333333333334,0.7132531419533907,0.07930850982666016,0.0
207,9,Naive Bayes,1,0.3,0.27976190476190477,0.45675609195103206,0.024930953979492188,0.0
208,9,KNeighbors Classifier,2,0.3,0.6871165644171779,0.5769117323650694,0.059361934661865234,0.0
209,9,SVC Classifier,2,0.3,0.5153374233128835,1.0,0.0337369441986084,0.0
210,9,Decision Tree,2,0.3,0.5766871165644172,0.5451479808141922,0.019816875457763672,0.0
211,9,RandomForest,2,0.3,0.5460122699386503,0.5721248424548514,0.07027125358581543,0.0
212,9,AdaBoost (Discrete),2,0.3,0.7607361963190185,0.8056845373767234,8.09720492362976,0.0
213,9,AdaBoost (Real),2,0.3,0.5337423312883436,0.7074700523529377,8.223407506942749,0.0
214,9,Logistic Regression (Penalty = L2),2,0.3,0.6932515337423313,0.5001320830579157,0.11304974555969238,0.0
215,9,Naive Bayes,2,0.3,0.20245398773006135,0.3441013796735213,0.02610492706298828,0.0
216,10,KNeighbors Classifier,0,0.3,0.6473988439306358,0.525130759321963,0.13732314109802246,0.0
217,10,SVC Classifier,0,0.3,0.49710982658959535,1.0,0.09350204467773438,0.0
218,10,Decision Tree,0,0.3,0.6184971098265896,0.46225101965462,0.029422283172607422,0.46225101965462
219,10,RandomForest,0,0.3,0.5260115606936416,0.6434588841607617,0.11294960975646973,0.0
220,10,AdaBoost (Discrete),0,0.3,0.7283236994219653,0.6267349765154125,9.566341638565063,0.0
221,10,AdaBoost (Real),0,0.3,0.6358381502890174,0.7097977142586079,10.53853702545166,0.0
222,10,Logistic Regression (Penalty = L2),0,0.3,0.6878612716763006,0.49934534599236985,0.1382296085357666,0.0
223,10,Naive Bayes,0,0.3,0.23121387283236994,0.403174114659548,0.05572175979614258,0.0
224,10,KNeighbors Classifier,1,0.3,0.6488095238095238,0.6741617542090412,0.08115077018737793,0.0
225,10,SVC Classifier,1,0.3,0.5119047619047619,1.0,0.09632182121276855,0.0
226,10,Decision Tree,1,0.3,0.6666666666666666,0.7449032218389622,0.01902174949645996,0.0
227,10,RandomForest,1,0.3,0.5773809523809523,0.7660279498482804,0.16022872924804688,0.0
228,10,AdaBoost (Discrete),1,0.3,0.7083333333333334,0.6504824759131858,9.310959339141846,0.0
229,10,AdaBoost (Real),1,0.3,0.5773809523809523,0.5875060464998257,8.984636545181274,0.0
230,10,Logistic Regression (Penalty = L2),1,0.3,0.7083333333333334,0.7270053245770842,0.11911177635192871,0.0
231,10,Naive Bayes,1,0.3,0.25,0.5145349407997528,0.04144144058227539,0.0
232,10,KNeighbors Classifier,2,0.3,0.6748466257668712,0.6263990269685724,0.08172059059143066,0.0
233,10,SVC Classifier,2,0.3,0.5153374233128835,1.0,0.1024940013885498,0.0
234,10,Decision Tree,2,0.3,0.558282208588957,0.5560751705072365,0.021071195602416992,0.0
235,10,RandomForest,2,0.3,0.5521472392638037,0.31241519207647167,0.12358355522155762,0.0
236,10,AdaBoost (Discrete),2,0.3,0.7361963190184049,0.6013620274183673,9.343879699707031,0.0
237,10,AdaBoost (Real),2,0.3,0.558282208588957,0.5416402462947645,10.824549198150635,0.0
238,10,Logistic Regression (Penalty = L2),2,0.3,0.6993865030674846,0.5421520055992455,0.17268610000610352,0.0
239,10,Naive Bayes,2,0.3,0.3006134969325153,0.48094861014454465,0.04221177101135254,0.48094861014454465
240,11,KNeighbors Classifier,0,0.3,0.6127167630057804,0.5423952077828974,0.21029424667358398,0.0
241,11,SVC Classifier,0,0.3,0.49710982658959535,1.0,0.1977684497833252,0.0
242,11,Decision Tree,0,0.3,0.6589595375722543,0.6827146606545587,0.02141737937927246,0.0
243,11,RandomForest,0,0.3,0.5722543352601156,0.38261174825664274,0.11909270286560059,0.0
244,11,AdaBoost (Discrete),0,0.3,0.7341040462427746,0.6012848150036745,15.241575241088867,0.0
245,11,AdaBoost (Real),0,0.3,0.5953757225433526,0.7335231009510449,14.540697574615479,0.0
246,11,Logistic Regression (Penalty = L2),0,0.3,0.7052023121387283,0.5718974661828817,0.2821347713470459,0.0
247,11,Naive Bayes,0,0.3,0.24277456647398843,0.41927854491353267,0.08321595191955566,0.0
248,11,KNeighbors Classifier,1,0.3,0.625,0.5599772620099059,0.2001628875732422,0.0
249,11,SVC Classifier,1,0.3,0.5119047619047619,1.0,0.18020367622375488,0.0
250,11,Decision Tree,1,0.3,0.5535714285714286,0.638824574549834,0.021640777587890625,0.0
251,11,RandomForest,1,0.3,0.5714285714285714,0.519343393866387,0.1125030517578125,0.0
252,11,AdaBoost (Discrete),1,0.3,0.7142857142857143,0.7111151944042754,14.156558752059937,0.0
253,11,AdaBoost (Real),1,0.3,0.6428571428571429,0.6377249697546198,15.90736174583435,0.0
254,11,Logistic Regression (Penalty = L2),1,0.3,0.7440476190476191,0.6631874073258032,0.2925875186920166,0.0
255,11,Naive Bayes,1,0.3,0.2619047619047619,0.4375111383115107,0.09413766860961914,0.0
256,11,KNeighbors Classifier,2,0.3,0.6319018404907976,0.7106904175441259,0.1310865879058838,0.0
257,11,SVC Classifier,2,0.3,0.5153374233128835,1.0,0.128509521484375,0.0
258,11,Decision Tree,2,0.3,0.588957055214724,0.5737589185629246,0.005743265151977539,0.0
259,11,RandomForest,2,0.3,0.6257668711656442,0.6004684775880014,0.08305978775024414,0.0
260,11,AdaBoost (Discrete),2,0.3,0.7914110429447853,0.7041965442839412,13.798040866851807,0.0
261,11,AdaBoost (Real),2,0.3,0.6319018404907976,0.8529286505232769,14.960922479629517,0.0
262,11,Logistic Regression (Penalty = L2),2,0.3,0.7361963190184049,0.7004602588315901,0.2699589729309082,0.0
263,11,Naive Bayes,2,0.3,0.294478527607362,0.46371627097572204,0.07813429832458496,0.46371627097572204
