,feat_set_id,classifier,fold_id,feat_th,score,geo_score,exec_t,geo_score_woz
0,0,KNeighbors Classifier,0,0.35,0.7937608318890814,0.8733741082267049,0.23949408531188965,0.0
1,0,SVC Classifier,0,0.35,0.6845753899480069,0.8129520829107402,0.5702598094940186,0.0
2,0,Decision Tree,0,0.35,0.7417677642980935,0.8617274844321391,0.06706547737121582,0.0
3,0,RandomForest,0,0.35,0.7001733102253033,1.0,0.48632168769836426,0.0
4,0,AdaBoost (Discrete),0,0.35,0.7452339688041595,0.7844920354680928,30.297581672668457,0.0
5,0,AdaBoost (Real),0,0.35,0.7452339688041595,0.7844920354680928,41.785160541534424,0.0
6,0,Logistic Regression (Penalty = L2),0,0.35,0.7417677642980935,0.8617274844321391,0.2662506103515625,0.0
7,0,Naive Bayes,0,0.35,0.5805892547660312,0.6192878878744241,0.09298157691955566,0.0
8,0,KNeighbors Classifier,1,0.35,0.7413194444444444,0.6920039139148341,0.33586907386779785,0.0
9,0,SVC Classifier,1,0.35,0.78125,0.7990572919580082,0.610278844833374,0.0
10,0,Decision Tree,1,0.35,0.71875,0.6234161071707248,0.07070302963256836,0.0
11,0,RandomForest,1,0.35,0.6996527777777778,1.0,0.42061305046081543,0.0
12,0,AdaBoost (Discrete),1,0.35,0.7361111111111112,0.45621327850879984,33.37224268913269,0.0
13,0,AdaBoost (Real),1,0.35,0.3125,0.4102115633234443,44.61370849609375,0.0
14,0,Logistic Regression (Penalty = L2),1,0.35,0.71875,0.6234161071707248,0.24905800819396973,0.0
15,0,Naive Bayes,1,0.35,0.6840277777777778,0.7034341761336865,0.09309172630310059,0.0
16,0,KNeighbors Classifier,2,0.35,0.7982608695652174,0.6048387456236007,0.4205660820007324,0.6048387456236007
17,0,SVC Classifier,2,0.35,0.7617391304347826,0.5617326583032773,0.6308310031890869,0.0
18,0,Decision Tree,2,0.35,0.7843478260869565,0.6339634597648305,0.07892417907714844,0.6339634597648305
19,0,RandomForest,2,0.35,0.7008695652173913,1.0,0.7106304168701172,0.0
20,0,AdaBoost (Discrete),2,0.35,0.3826086956521739,0.4559087061053287,35.436737298965454,0.4559087061053287
21,0,AdaBoost (Real),2,0.35,0.42434782608695654,0.4731429604729496,75.94300603866577,0.4731429604729496
22,0,Logistic Regression (Penalty = L2),2,0.35,0.7791304347826087,0.5744179739510636,0.2847867012023926,0.5744179739510636
23,0,Naive Bayes,2,0.35,0.46608695652173915,0.6897771060056679,0.09277486801147461,0.0
24,1,KNeighbors Classifier,0,0.35,0.6897746967071057,0.5203328124828597,0.28168630599975586,0.0
25,1,SVC Classifier,0,0.35,0.7417677642980935,0.7407118766149331,0.697087287902832,0.0
26,1,Decision Tree,0,0.35,0.6707105719237435,0.48151041713656495,0.0893707275390625,0.0
27,1,RandomForest,0,0.35,0.7001733102253033,1.0,0.5701181888580322,0.0
28,1,AdaBoost (Discrete),0,0.35,0.24263431542461006,0.3018927548712959,40.91273880004883,0.0
29,1,AdaBoost (Real),0,0.35,0.2391681109185442,0.27115004335578646,51.82350969314575,0.0
30,1,Logistic Regression (Penalty = L2),0,0.35,0.7469670710571924,0.7439161246370787,0.29000210762023926,0.0
31,1,Naive Bayes,0,0.35,0.4610051993067591,0.6356906798026111,0.11902284622192383,0.0
32,1,KNeighbors Classifier,1,0.35,0.5520833333333334,0.3949801561877868,0.31277036666870117,0.0
33,1,SVC Classifier,1,0.35,0.7517361111111112,0.5058589726871897,0.700026273727417,0.0
34,1,Decision Tree,1,0.35,0.6145833333333334,0.4124924727323495,0.09793400764465332,0.0
35,1,RandomForest,1,0.35,0.7517361111111112,0.5058589726871897,0.5982320308685303,0.0
36,1,AdaBoost (Discrete),1,0.35,0.7534722222222222,0.3931263836162414,39.03433895111084,0.0
37,1,AdaBoost (Real),1,0.35,0.6302083333333334,0.3079934482436341,80.03661775588989,0.0
38,1,Logistic Regression (Penalty = L2),1,0.35,0.5833333333333334,0.34150246310529536,0.3399639129638672,0.0
39,1,Naive Bayes,1,0.35,0.5625,0.5737363779874164,0.1280820369720459,0.0
40,1,KNeighbors Classifier,2,0.35,0.6608695652173913,0.3969608370470871,0.6052298545837402,0.0
41,1,SVC Classifier,2,0.35,0.7234782608695652,0.37266643657948806,0.8423798084259033,0.0
42,1,Decision Tree,2,0.35,0.40869565217391307,0.32572193163831065,0.1186215877532959,0.0
43,1,RandomForest,2,0.35,0.697391304347826,0.9950372208436724,0.9744012355804443,0.0
44,1,AdaBoost (Discrete),2,0.35,0.5391304347826087,0.4370394654841031,52.03522086143494,0.4370394654841031
45,1,AdaBoost (Real),2,0.35,0.6052173913043478,0.35043500141563716,62.42030072212219,0.35043500141563716
46,1,Logistic Regression (Penalty = L2),2,0.35,0.5756521739130435,0.3596654674975672,0.3365058898925781,0.0
47,1,Naive Bayes,2,0.35,0.2991304347826087,0.5108125823268509,0.23273968696594238,0.0
48,2,KNeighbors Classifier,0,0.35,0.6741767764298093,0.7297961605580298,0.5601224899291992,0.0
49,2,SVC Classifier,0,0.35,0.6845753899480069,0.8129520829107402,1.0040514469146729,0.0
50,2,Decision Tree,0,0.35,0.6551126516464472,0.6528052599874394,0.0944981575012207,0.6528052599874394
51,2,RandomForest,0,0.35,0.7001733102253033,1.0,0.9106931686401367,0.0
52,2,AdaBoost (Discrete),0,0.35,0.6447140381282496,0.5441053224393056,47.705281019210815,0.5441053224393056
53,2,AdaBoost (Real),0,0.35,0.7036395147313691,0.650129273775849,61.570300817489624,0.650129273775849
54,2,Logistic Regression (Penalty = L2),0,0.35,0.682842287694974,0.7475165381080043,0.3571178913116455,0.0
55,2,Naive Bayes,0,0.35,0.6325823223570191,0.7081129360743638,0.15707898139953613,0.7081129360743638
56,2,KNeighbors Classifier,1,0.35,0.7864583333333334,0.6335143739645305,0.6995136737823486,0.6335143739645305
57,2,SVC Classifier,1,0.35,0.7274305555555556,0.7636780043269571,0.9686648845672607,0.0
58,2,Decision Tree,1,0.35,0.5694444444444444,0.6223240122014155,0.14233636856079102,0.6223240122014155
59,2,RandomForest,1,0.35,0.6024305555555556,0.5453247035098121,0.8669302463531494,0.0
60,2,AdaBoost (Discrete),1,0.35,0.8472222222222222,0.5576687380587515,49.92630457878113,0.5576687380587515
61,2,AdaBoost (Real),1,0.35,0.8715277777777778,0.7331272008399923,58.175729751586914,0.7331272008399923
62,2,Logistic Regression (Penalty = L2),1,0.35,0.8038194444444444,0.6652823806993893,0.3473470211029053,0.0
63,2,Naive Bayes,1,0.35,0.8125,0.7204184105774583,0.10532689094543457,0.7204184105774583
64,2,KNeighbors Classifier,2,0.35,0.7565217391304347,0.6694252221915413,0.5826451778411865,0.6694252221915413
65,2,SVC Classifier,2,0.35,0.782608695652174,0.6280786458396762,0.9283239841461182,0.0
66,2,Decision Tree,2,0.35,0.8486956521739131,0.8560813665070081,0.0026047229766845703,0.8560813665070081
67,2,RandomForest,2,0.35,0.7008695652173913,1.0,0.5842504501342773,0.0
68,2,AdaBoost (Discrete),2,0.35,0.44,0.62924173969546,47.195841550827026,0.62924173969546
69,2,AdaBoost (Real),2,0.35,0.5878260869565217,0.7383458939362914,62.91167330741882,0.7383458939362914
70,2,Logistic Regression (Penalty = L2),2,0.35,0.8295652173913044,0.7267468599948267,0.3830232620239258,0.7267468599948267
71,2,Naive Bayes,2,0.35,0.8434782608695652,0.8052963298792027,0.12588238716125488,0.8052963298792027
72,3,KNeighbors Classifier,0,0.35,0.7105719237435009,0.809961285133951,0.4676518440246582,0.0
73,3,SVC Classifier,0,0.35,0.7417677642980935,0.7407118766149331,1.0300264358520508,0.0
74,3,Decision Tree,0,0.35,0.7417677642980935,0.7407118766149331,0.0023484230041503906,0.0
75,3,RandomForest,0,0.35,0.7001733102253033,1.0,1.0065765380859375,0.0
76,3,AdaBoost (Discrete),0,0.35,0.7036395147313691,0.7558686441295325,52.15838813781738,0.0
77,3,AdaBoost (Real),0,0.35,0.7590987868284229,0.793803839680238,98.60949754714966,0.0
78,3,Logistic Regression (Penalty = L2),0,0.35,0.7417677642980935,0.7407118766149331,0.27448391914367676,0.0
79,3,Naive Bayes,0,0.35,0.3986135181975737,0.5242766356244375,0.1402897834777832,0.0
80,3,KNeighbors Classifier,1,0.35,0.7378472222222222,0.42336937219191195,0.40457653999328613,0.0
81,3,SVC Classifier,1,0.35,0.6996527777777778,1.0,1.082185983657837,0.0
82,3,Decision Tree,1,0.35,0.7934027777777778,0.6697965970274694,0.13394951820373535,0.0
83,3,RandomForest,1,0.35,0.6996527777777778,1.0,0.683605432510376,0.0
84,3,AdaBoost (Discrete),1,0.35,0.7934027777777778,0.6697965970274694,55.65935397148132,0.0
85,3,AdaBoost (Real),1,0.35,0.5503472222222222,0.6848230649393702,110.2375910282135,0.0
86,3,Logistic Regression (Penalty = L2),1,0.35,0.7934027777777778,0.6697965970274694,0.14273643493652344,0.0
87,3,Naive Bayes,1,0.35,0.4652777777777778,0.5932993620407754,0.13625788688659668,0.0
88,3,KNeighbors Classifier,2,0.35,0.6608695652173913,0.5341432132906365,0.5489177703857422,0.5341432132906365
89,3,SVC Classifier,2,0.35,0.7234782608695652,0.37266643657948806,0.8268837928771973,0.0
90,3,Decision Tree,2,0.35,0.5495652173913044,0.3936726671318366,0.11824679374694824,0.3936726671318366
91,3,RandomForest,2,0.35,0.7234782608695652,0.37266643657948806,0.810626745223999,0.0
92,3,AdaBoost (Discrete),2,0.35,0.3791304347826087,0.3206820665359413,52.23645329475403,0.3206820665359413
93,3,AdaBoost (Real),2,0.35,0.3165217391304348,0.30317642339382095,87.85870790481567,0.30317642339382095
94,3,Logistic Regression (Penalty = L2),2,0.35,0.5460869565217391,0.35702168004077167,0.38654446601867676,0.35702168004077167
95,3,Naive Bayes,2,0.35,0.3165217391304348,0.4464902853385481,0.14339423179626465,0.4464902853385481
96,4,KNeighbors Classifier,0,0.35,0.7417677642980935,0.7407118766149331,0.42954540252685547,0.0
97,4,SVC Classifier,0,0.35,0.6845753899480069,0.8129520829107402,0.7171757221221924,0.0
98,4,Decision Tree,0,0.35,0.7417677642980935,0.8617274844321391,0.0024836063385009766,0.0
99,4,RandomForest,0,0.35,0.6429809358752167,0.5376812956971576,0.9934003353118896,0.0
100,4,AdaBoost (Discrete),0,0.35,0.7417677642980935,0.8617274844321391,53.26148319244385,0.0
101,4,AdaBoost (Real),0,0.35,0.7417677642980935,0.8617274844321391,115.73869633674622,0.0
102,4,Logistic Regression (Penalty = L2),0,0.35,0.7417677642980935,0.8617274844321391,0.2428147792816162,0.0
103,4,Naive Bayes,0,0.35,0.5233968804159446,0.7201922951672233,0.12709283828735352,0.0
104,4,KNeighbors Classifier,1,0.35,0.7065972222222222,0.753294030738896,0.38609814643859863,0.0
105,4,SVC Classifier,1,0.35,0.78125,0.7990572919580082,0.7873070240020752,0.0
106,4,Decision Tree,1,0.35,0.7916666666666666,0.8719038629079734,0.12980318069458008,0.0
107,4,RandomForest,1,0.35,0.6649305555555556,0.5533004963001166,0.7804007530212402,0.0
108,4,AdaBoost (Discrete),1,0.35,0.7916666666666666,0.8719038629079734,51.48332762718201,0.0
109,4,AdaBoost (Real),1,0.35,0.7916666666666666,0.8719038629079734,85.03151297569275,0.0
110,4,Logistic Regression (Penalty = L2),1,0.35,0.7916666666666666,0.8719038629079734,0.23309755325317383,0.0
111,4,Naive Bayes,1,0.35,0.6701388888888888,0.5937155022689299,0.12083601951599121,0.5937155022689299
112,4,KNeighbors Classifier,2,0.35,0.7234782608695652,0.37266643657948806,0.47920823097229004,0.0
113,4,SVC Classifier,2,0.35,0.7008695652173913,1.0,0.9058749675750732,0.0
114,4,Decision Tree,2,0.35,0.8382608695652174,0.8340051055773173,0.1185297966003418,0.0
115,4,RandomForest,2,0.35,0.7008695652173913,1.0,0.8437597751617432,0.0
116,4,AdaBoost (Discrete),2,0.35,0.8382608695652174,0.8340051055773173,52.56104755401611,0.0
117,4,AdaBoost (Real),2,0.35,0.8382608695652174,0.8340051055773173,69.15493535995483,0.0
118,4,Logistic Regression (Penalty = L2),2,0.35,0.8382608695652174,0.8340051055773173,0.07953667640686035,0.0
119,4,Naive Bayes,2,0.35,0.7791304347826087,0.6214035074764954,0.04841113090515137,0.6214035074764954
120,5,KNeighbors Classifier,0,0.35,0.5753899480069324,0.8217821782178217,0.17052316665649414,0.0
121,5,SVC Classifier,0,0.35,0.7001733102253033,1.0,0.47340965270996094,0.0
122,5,Decision Tree,0,0.35,0.4506065857885615,0.6435643564356436,0.0021185874938964844,0.0
123,5,RandomForest,0,0.35,0.7001733102253033,1.0,0.7302589416503906,0.0
124,5,AdaBoost (Discrete),0,0.35,0.4506065857885615,0.6435643564356436,44.23197627067566,0.0
125,5,AdaBoost (Real),0,0.35,0.4506065857885615,0.6435643564356436,125.44646215438843,0.0
126,5,Logistic Regression (Penalty = L2),0,0.35,0.7001733102253033,1.0,0.21608924865722656,0.0
127,5,Naive Bayes,0,0.35,0.41767764298093585,0.5598055961226205,0.11232900619506836,0.0
128,5,KNeighbors Classifier,1,0.35,0.546875,0.5302569722084589,0.40751147270202637,0.0
129,5,SVC Classifier,1,0.35,0.6996527777777778,1.0,1.3292052745819092,0.0
130,5,Decision Tree,1,0.35,0.6024305555555556,0.5453247035098121,0.0015225410461425781,0.0
131,5,RandomForest,1,0.35,0.6024305555555556,0.5453247035098121,0.693976879119873,0.0
132,5,AdaBoost (Discrete),1,0.35,0.6024305555555556,0.5453247035098121,56.61500096321106,0.0
133,5,AdaBoost (Real),1,0.35,0.4149305555555556,0.43417515419025193,93.94120621681213,0.0
134,5,Logistic Regression (Penalty = L2),1,0.35,0.5225694444444444,0.5010070503656899,0.22923731803894043,0.0
135,5,Naive Bayes,1,0.35,0.5833333333333334,0.7687577219743259,0.11635947227478027,0.0
136,5,KNeighbors Classifier,2,0.35,0.6226086956521739,0.5847955942863918,0.3351926803588867,0.0
137,5,SVC Classifier,2,0.35,0.7008695652173913,1.0,0.7973909378051758,0.0
138,5,Decision Tree,2,0.35,0.6226086956521739,0.5847955942863918,0.11054587364196777,0.0
139,5,RandomForest,2,0.35,0.7008695652173913,1.0,0.7681665420532227,0.0
140,5,AdaBoost (Discrete),2,0.35,0.6226086956521739,0.5847955942863918,48.16356611251831,0.0
141,5,AdaBoost (Real),2,0.35,0.6226086956521739,0.5847955942863918,62.18540668487549,0.0
142,5,Logistic Regression (Penalty = L2),2,0.35,0.6226086956521739,0.5847955942863918,0.33408069610595703,0.0
143,5,Naive Bayes,2,0.35,0.49391304347826087,0.5394982012463508,0.11631560325622559,0.0
144,6,KNeighbors Classifier,0,0.35,0.6967071057192374,0.5916516027851242,0.5545475482940674,0.0
145,6,SVC Classifier,0,0.35,0.6845753899480069,0.8129520829107402,1.1715786457061768,0.0
146,6,Decision Tree,0,0.35,0.6152512998266898,0.5183775377196999,0.002407073974609375,0.0
147,6,RandomForest,0,0.35,0.7417677642980935,0.7407118766149331,0.7780358791351318,0.0
148,6,AdaBoost (Discrete),0,0.35,0.24610051993067592,0.274094199045684,48.90586829185486,0.0
149,6,AdaBoost (Real),0,0.35,0.2391681109185442,0.27115004335578646,61.11038565635681,0.0
150,6,Logistic Regression (Penalty = L2),0,0.35,0.6395147313691508,0.6832394989103653,0.4985532760620117,0.0
151,6,Naive Bayes,0,0.35,0.6429809358752167,0.7508927762297288,0.21054720878601074,0.0
152,6,KNeighbors Classifier,1,0.35,0.7013888888888888,0.4390407365289393,0.6990978717803955,0.0
153,6,SVC Classifier,1,0.35,0.7274305555555556,0.7636780043269571,1.177584171295166,0.0
154,6,Decision Tree,1,0.35,0.7777777777777778,0.49888606438933114,0.0026094913482666016,0.0
155,6,RandomForest,1,0.35,0.8315972222222222,0.7905448932779473,0.8286681175231934,0.0
156,6,AdaBoost (Discrete),1,0.35,0.5920138888888888,0.5202456966162713,55.8273766040802,0.0
157,6,AdaBoost (Real),1,0.35,0.359375,0.3541312724744528,65.70138430595398,0.0
158,6,Logistic Regression (Penalty = L2),1,0.35,0.7309027777777778,0.6198297312824206,0.44812750816345215,0.0
159,6,Naive Bayes,1,0.35,0.78125,0.6802396938019404,0.12947607040405273,0.0
160,6,KNeighbors Classifier,2,0.35,0.7321739130434782,0.7039170352611752,0.7049129009246826,0.0
161,6,SVC Classifier,2,0.35,0.8434782608695652,0.837206672457254,1.0724294185638428,0.0
162,6,Decision Tree,2,0.35,0.7339130434782609,0.5358772988495021,0.13419842720031738,0.0
163,6,RandomForest,2,0.35,0.7617391304347826,0.5617326583032773,0.9656248092651367,0.0
164,6,AdaBoost (Discrete),2,0.35,0.2678260869565217,0.3546449546461407,54.25420570373535,0.3546449546461407
165,6,AdaBoost (Real),2,0.35,0.12173913043478261,0.2298591884735653,64.59861063957214,0.2298591884735653
166,6,Logistic Regression (Penalty = L2),2,0.35,0.6173913043478261,0.5013533515942621,0.45938706398010254,0.5013533515942621
167,6,Naive Bayes,2,0.35,0.528695652173913,0.7234770261807716,0.11655926704406738,0.0
168,7,KNeighbors Classifier,0,0.35,0.6845753899480069,0.5871350021982059,0.8168232440948486,0.0
169,7,SVC Classifier,0,0.35,0.6845753899480069,0.8129520829107402,1.2663133144378662,0.0
170,7,Decision Tree,0,0.35,0.6845753899480069,0.5871350021982059,0.11494064331054688,0.0
171,7,RandomForest,0,0.35,0.6932409012131716,0.40101588200938176,0.8086543083190918,0.0
172,7,AdaBoost (Discrete),0,0.35,0.729636048526863,0.6300815843286437,51.86717081069946,0.0
173,7,AdaBoost (Real),0,0.35,0.7175043327556326,0.6239375890153178,77.82800960540771,0.0
174,7,Logistic Regression (Penalty = L2),0,0.35,0.6880415944540728,0.7603453162872774,0.5987739562988281,0.0
175,7,Naive Bayes,0,0.35,0.6672443674176777,0.7914018355435688,0.14528250694274902,0.0
176,7,KNeighbors Classifier,1,0.35,0.703125,0.4882089284946247,1.0517899990081787,0.0
177,7,SVC Classifier,1,0.35,0.7274305555555556,0.7636780043269571,1.4205279350280762,0.0
178,7,Decision Tree,1,0.35,0.7951388888888888,0.6202901857819391,0.1306455135345459,0.0
179,7,RandomForest,1,0.35,0.6892361111111112,0.35388222655701834,1.0976622104644775,0.0
180,7,AdaBoost (Discrete),1,0.35,0.7638888888888888,0.47477625608187457,68.6010582447052,0.0
181,7,AdaBoost (Real),1,0.35,0.7482638888888888,0.613700236755791,78.4169991016388,0.0
182,7,Logistic Regression (Penalty = L2),1,0.35,0.7638888888888888,0.5874287808097735,0.5546090602874756,0.0
183,7,Naive Bayes,1,0.35,0.7829861111111112,0.6820345298093242,0.1491990089416504,0.0
184,7,KNeighbors Classifier,2,0.35,0.8191304347826087,0.698811468419966,1.0695469379425049,0.698811468419966
185,7,SVC Classifier,2,0.35,0.8139130434782609,0.7434578189352642,1.198624610900879,0.0
186,7,Decision Tree,2,0.35,0.6678260869565218,0.6518657337053846,0.15086746215820312,0.6518657337053846
187,7,RandomForest,2,0.35,0.7130434782608696,0.27846619959632063,1.1980807781219482,0.0
188,7,AdaBoost (Discrete),2,0.35,0.37043478260869567,0.4402291378924226,64.01867938041687,0.0
189,7,AdaBoost (Real),2,0.35,0.40695652173913044,0.42204133418785444,79.05871272087097,0.42204133418785444
190,7,Logistic Regression (Penalty = L2),2,0.35,0.5721739130434783,0.4899214885910749,0.6415278911590576,0.4899214885910749
191,7,Naive Bayes,2,0.35,0.5478260869565217,0.8392974277582299,0.14010906219482422,0.0
192,8,KNeighbors Classifier,0,0.35,0.7001733102253033,1.0,0.4464101791381836,0.0
193,8,SVC Classifier,0,0.35,0.7001733102253033,1.0,0.7355098724365234,0.0
194,8,Decision Tree,0,0.35,0.7001733102253033,1.0,0.15803837776184082,0.0
195,8,RandomForest,0,0.35,0.7001733102253033,1.0,0.8911776542663574,0.0
196,8,AdaBoost (Discrete),0,0.35,0.7001733102253033,1.0,58.64851522445679,0.0
197,8,AdaBoost (Real),0,0.35,0.7001733102253033,1.0,235.4535984992981,0.0
198,8,Logistic Regression (Penalty = L2),0,0.35,0.7001733102253033,1.0,0.27472448348999023,0.0
199,8,Naive Bayes,0,0.35,0.32062391681109187,0.6332377902572627,0.13947105407714844,0.0
200,8,KNeighbors Classifier,1,0.35,0.6996527777777778,1.0,0.41907262802124023,0.0
201,8,SVC Classifier,1,0.35,0.6996527777777778,1.0,0.7031917572021484,0.0
202,8,Decision Tree,1,0.35,0.6996527777777778,1.0,0.0020852088928222656,0.0
203,8,RandomForest,1,0.35,0.6996527777777778,1.0,0.8369505405426025,0.0
204,8,AdaBoost (Discrete),1,0.35,0.6996527777777778,1.0,51.75617551803589,0.0
205,8,AdaBoost (Real),1,0.35,0.6996527777777778,1.0,119.5903959274292,0.0
206,8,Logistic Regression (Penalty = L2),1,0.35,0.6996527777777778,1.0,0.22044754028320312,0.0
207,8,Naive Bayes,1,0.35,0.4305555555555556,0.5090374832823014,0.16806459426879883,0.0
208,8,KNeighbors Classifier,2,0.35,0.6139130434782609,0.6822706033376054,0.3305776119232178,0.0
209,8,SVC Classifier,2,0.35,0.7008695652173913,1.0,1.0746605396270752,0.0
210,8,Decision Tree,2,0.35,0.7008695652173913,1.0,0.1697218418121338,0.0
211,8,RandomForest,2,0.35,0.7008695652173913,1.0,1.2743337154388428,0.0
212,8,AdaBoost (Discrete),2,0.35,0.7008695652173913,1.0,39.29727101325989,0.0
213,8,AdaBoost (Real),2,0.35,0.7008695652173913,1.0,116.32534980773926,0.0
214,8,Logistic Regression (Penalty = L2),2,0.35,0.7008695652173913,1.0,0.13075804710388184,0.0
215,8,Naive Bayes,2,0.35,0.49391304347826087,0.5394982012463508,0.14716601371765137,0.0
