,feat_set_id,classifier,fold_id,feat_th,score,geo_score,exec_t,geo_score_woz
0,0,KNeighbors Classifier,0,0.05,0.3359872611464968,0.7687061147858074,4.652268886566162,0.0
1,0,SVC Classifier,0,0.05,0.4410828025477707,1.0,9.079472303390503,0.0
2,0,Decision Tree,0,0.05,0.4442675159235669,0.5222329678670935,0.08797860145568848,0.0
3,0,RandomForest,0,0.05,0.4432059447983015,0.4264014327112209,0.7626562118530273,0.0
4,0,AdaBoost (Discrete),0,0.05,0.4442675159235669,0.5222329678670935,40.53382420539856,0.0
5,0,AdaBoost (Real),0,0.05,0.4410828025477707,1.0,104.9079315662384,0.0
6,0,Logistic Regression (Penalty = L2),0,0.05,0.4442675159235669,0.5222329678670935,0.9259834289550781,0.0
7,0,Naive Bayes,0,0.05,0.333864118895966,0.6396021490668313,0.11085343360900879,0.0
8,0,KNeighbors Classifier,1,0.05,0.0707070707070707,0.6900655593423543,4.7174787521362305,0.0
9,0,SVC Classifier,1,0.05,0.44178628389154706,1.0,8.817445993423462,0.0
10,0,Decision Tree,1,0.05,0.44657097288676234,0.6546536707079771,0.0025784969329833984,0.0
11,0,RandomForest,1,0.05,0.44178628389154706,1.0,0.5621328353881836,0.0
12,0,AdaBoost (Discrete),1,0.05,0.44178628389154706,1.0,37.139487743377686,0.0
13,0,AdaBoost (Real),1,0.05,0.44178628389154706,1.0,65.48214793205261,0.0
14,0,Logistic Regression (Penalty = L2),1,0.05,0.44657097288676234,0.6546536707079771,0.5595321655273438,0.0
15,0,Naive Bayes,1,0.05,0.3328017012227539,0.5345224838248488,0.09331369400024414,0.0
16,0,KNeighbors Classifier,2,0.05,0.07610431080361894,1.0,4.486170291900635,0.0
17,0,SVC Classifier,2,0.05,0.42948376796168175,0.9731330596620531,8.852334260940552,0.0
18,0,Decision Tree,2,0.05,0.42948376796168175,0.9731330596620531,0.07895565032958984,0.0
19,0,RandomForest,2,0.05,0.42948376796168175,0.9731330596620531,0.5865719318389893,0.0
20,0,AdaBoost (Discrete),2,0.05,0.42948376796168175,0.9731330596620531,36.82537293434143,0.0
21,0,AdaBoost (Real),2,0.05,0.42948376796168175,0.9731330596620531,65.24580955505371,0.0
22,0,Logistic Regression (Penalty = L2),2,0.05,0.42948376796168175,0.9731330596620531,0.427379846572876,0.0
23,0,Naive Bayes,2,0.05,0.42948376796168175,0.9731330596620531,0.16878557205200195,0.0
24,1,KNeighbors Classifier,0,0.05,0.6571125265392781,0.8597523071804674,2.6816799640655518,0.0
25,1,SVC Classifier,0,0.05,0.6502123142250531,0.7815678276732434,6.217630386352539,0.0
26,1,Decision Tree,0,0.05,0.6454352441613588,0.8175188964941128,0.08021354675292969,0.0
27,1,RandomForest,0,0.05,0.6502123142250531,0.7815678276732434,0.5571451187133789,0.0
28,1,AdaBoost (Discrete),0,0.05,0.5652866242038217,0.6588139335520611,39.42718982696533,0.0
29,1,AdaBoost (Real),0,0.05,0.6454352441613588,0.8175188964941128,68.804678440094,0.0
30,1,Logistic Regression (Penalty = L2),0,0.05,0.6454352441613588,0.8175188964941128,0.6818935871124268,0.0
31,1,Naive Bayes,0,0.05,0.17887473460721867,0.8386747408491846,0.17127537727355957,0.0
32,1,KNeighbors Classifier,1,0.05,0.7937267410951622,0.808633173536614,2.5238490104675293,0.0
33,1,SVC Classifier,1,0.05,0.7650186071238703,0.9902752957083816,6.917794942855835,0.0
34,1,Decision Tree,1,0.05,0.7650186071238703,0.9902752957083816,0.07927203178405762,0.0
35,1,RandomForest,1,0.05,0.7650186071238703,0.9902752957083816,0.5672614574432373,0.0
36,1,AdaBoost (Discrete),1,0.05,0.7783094098883573,0.9956802917199704,38.822855710983276,0.0
37,1,AdaBoost (Real),1,0.05,0.7676767676767676,0.9943388141973313,65.73223805427551,0.0
38,1,Logistic Regression (Penalty = L2),1,0.05,0.7650186071238703,0.9902752957083816,0.536989688873291,0.0
39,1,Naive Bayes,1,0.05,0.12812333864965444,1.0,0.09044551849365234,0.0
40,1,KNeighbors Classifier,2,0.05,0.4353379457158063,0.2561229427838334,2.711556911468506,0.0
41,1,SVC Classifier,2,0.05,0.4353379457158063,0.2561229427838334,3.5173752307891846,0.0
42,1,Decision Tree,2,0.05,0.4353379457158063,0.2561229427838334,0.07626867294311523,0.0
43,1,RandomForest,2,0.05,0.42841937200638636,0.13027818601761548,0.6081678867340088,0.0
44,1,AdaBoost (Discrete),2,0.05,0.4491750931346461,0.25905189034663834,34.80966854095459,0.0
45,1,AdaBoost (Real),2,0.05,0.4310803618946248,0.21828463603472137,62.30718946456909,0.0
46,1,Logistic Regression (Penalty = L2),2,0.05,0.4353379457158063,0.2561229427838334,0.6881916522979736,0.0
47,1,Naive Bayes,2,0.05,0.10856838744012773,0.8567472128117785,0.15861797332763672,0.0
48,2,KNeighbors Classifier,0,0.05,0.3375796178343949,0.8528028654224418,4.5612406730651855,0.0
49,2,SVC Classifier,0,0.05,0.4410828025477707,1.0,8.992804765701294,0.0
50,2,Decision Tree,0,0.05,0.44851380042462846,0.7977240352174656,0.0800626277923584,0.0
51,2,RandomForest,0,0.05,0.4463906581740977,0.674199862463242,0.5607779026031494,0.0
52,2,AdaBoost (Discrete),0,0.05,0.45276008492569003,1.0,34.47286891937256,0.0
53,2,AdaBoost (Real),0,0.05,0.4442675159235669,0.5222329678670935,62.68708562850952,0.0
54,2,Logistic Regression (Penalty = L2),0,0.05,0.44851380042462846,0.7977240352174656,0.5040390491485596,0.0
55,2,Naive Bayes,0,0.05,0.33970276008492567,0.9534625892455924,0.1517019271850586,0.0
56,2,KNeighbors Classifier,1,0.05,0.07655502392344497,1.0,4.932680606842041,0.0
57,2,SVC Classifier,1,0.05,0.44178628389154706,1.0,10.44035530090332,0.0
58,2,Decision Tree,1,0.05,0.44869750132908026,0.7867957924694432,0.08401131629943848,0.0
59,2,RandomForest,1,0.05,0.44657097288676234,0.6546536707079771,0.6720237731933594,0.0
60,2,AdaBoost (Discrete),1,0.05,0.4529505582137161,1.0,43.746289014816284,0.0
61,2,AdaBoost (Real),1,0.05,0.44231791600212655,0.21821789023599236,74.30927062034607,0.0
62,2,Logistic Regression (Penalty = L2),1,0.05,0.4449760765550239,0.5345224838248488,0.5636439323425293,0.0
63,2,Naive Bayes,1,0.05,0.33705475810738966,0.816496580927726,0.07912039756774902,0.0
64,2,KNeighbors Classifier,2,0.05,0.07610431080361894,1.0,5.6703712940216064,0.0
65,2,SVC Classifier,2,0.05,0.42948376796168175,0.9731330596620531,10.152541160583496,0.0
66,2,Decision Tree,2,0.05,0.42948376796168175,0.9731330596620531,0.08340978622436523,0.0
67,2,RandomForest,2,0.05,0.42948376796168175,0.9731330596620531,0.6447162628173828,0.0
68,2,AdaBoost (Discrete),2,0.05,0.42948376796168175,0.9731330596620531,43.68901014328003,0.0
69,2,AdaBoost (Real),2,0.05,0.42948376796168175,0.9731330596620531,77.39488339424133,0.0
70,2,Logistic Regression (Penalty = L2),2,0.05,0.42948376796168175,0.9731330596620531,0.529198169708252,0.0
71,2,Naive Bayes,2,0.05,0.42948376796168175,0.9731330596620531,0.22874093055725098,0.0
72,3,KNeighbors Classifier,0,0.05,0.34076433121019106,1.0,2.956968307495117,0.0
73,3,SVC Classifier,0,0.05,0.4410828025477707,1.0,7.127810716629028,0.0
74,3,Decision Tree,0,0.05,0.4410828025477707,1.0,0.07522130012512207,0.0
75,3,RandomForest,0,0.05,0.4410828025477707,1.0,0.6583192348480225,0.0
76,3,AdaBoost (Discrete),0,0.05,0.45276008492569003,1.0,39.93956017494202,0.0
77,3,AdaBoost (Real),0,0.05,0.4410828025477707,1.0,70.79547834396362,0.0
78,3,Logistic Regression (Penalty = L2),0,0.05,0.4410828025477707,1.0,0.5345768928527832,0.0
79,3,Naive Bayes,0,0.05,0.34076433121019106,1.0,0.17766308784484863,0.0
80,3,KNeighbors Classifier,1,0.05,0.07655502392344497,1.0,3.1086056232452393,0.0
81,3,SVC Classifier,1,0.05,0.44178628389154706,1.0,7.758558034896851,0.0
82,3,Decision Tree,1,0.05,0.44178628389154706,1.0,0.0031766891479492188,0.0
83,3,RandomForest,1,0.05,0.44178628389154706,1.0,0.7840313911437988,0.0
84,3,AdaBoost (Discrete),1,0.05,0.44178628389154706,1.0,40.58757472038269,0.0
85,3,AdaBoost (Real),1,0.05,0.44178628389154706,1.0,73.01621890068054,0.0
86,3,Logistic Regression (Penalty = L2),1,0.05,0.44178628389154706,1.0,0.710918664932251,0.0
87,3,Naive Bayes,1,0.05,0.34077618288144607,1.0,0.09006690979003906,0.0
88,3,KNeighbors Classifier,2,0.05,0.07610431080361894,1.0,2.949943780899048,0.0
89,3,SVC Classifier,2,0.05,0.42948376796168175,0.9731330596620531,7.807954549789429,0.0
90,3,Decision Tree,2,0.05,0.42948376796168175,0.9731330596620531,0.08710885047912598,0.0
91,3,RandomForest,2,0.05,0.42948376796168175,0.9731330596620531,0.7689142227172852,0.0
92,3,AdaBoost (Discrete),2,0.05,0.42948376796168175,0.9731330596620531,41.24215817451477,0.0
93,3,AdaBoost (Real),2,0.05,0.42948376796168175,0.9731330596620531,71.42579531669617,0.0
94,3,Logistic Regression (Penalty = L2),2,0.05,0.42948376796168175,0.9731330596620531,0.527247428894043,0.0
95,3,Naive Bayes,2,0.05,0.42948376796168175,0.9731330596620531,0.15462779998779297,0.0
96,4,KNeighbors Classifier,0,0.05,0.3359872611464968,0.7687061147858074,3.5670220851898193,0.0
97,4,SVC Classifier,0,0.05,0.4410828025477707,1.0,8.499059200286865,0.0
98,4,Decision Tree,0,0.05,0.4442675159235669,0.5222329678670935,0.002340078353881836,0.0
99,4,RandomForest,0,0.05,0.4463906581740977,0.674199862463242,0.6359500885009766,0.0
100,4,AdaBoost (Discrete),0,0.05,0.4410828025477707,1.0,41.80339550971985,0.0
101,4,AdaBoost (Real),0,0.05,0.4410828025477707,1.0,83.44643640518188,0.0
102,4,Logistic Regression (Penalty = L2),0,0.05,0.4442675159235669,0.5222329678670935,0.8096332550048828,0.0
103,4,Naive Bayes,0,0.05,0.34076433121019106,1.0,0.18412470817565918,0.0
104,4,KNeighbors Classifier,1,0.05,0.0707070707070707,0.6900655593423543,4.353425741195679,0.0
105,4,SVC Classifier,1,0.05,0.44178628389154706,1.0,9.721606731414795,0.0
106,4,Decision Tree,1,0.05,0.44657097288676234,0.6546536707079771,0.09181618690490723,0.0
107,4,RandomForest,1,0.05,0.44657097288676234,0.6546536707079771,0.754406213760376,0.0
108,4,AdaBoost (Discrete),1,0.05,0.44869750132908026,0.7867957924694432,46.835866928100586,0.0
109,4,AdaBoost (Real),1,0.05,0.44657097288676234,0.6546536707079771,80.31922364234924,0.0
110,4,Logistic Regression (Penalty = L2),1,0.05,0.44657097288676234,0.6546536707079771,0.5907590389251709,0.0
111,4,Naive Bayes,1,0.05,0.34077618288144607,1.0,0.1755673885345459,0.0
112,4,KNeighbors Classifier,2,0.05,0.07610431080361894,1.0,4.180743455886841,0.0
113,4,SVC Classifier,2,0.05,0.42948376796168175,0.9731330596620531,9.500053644180298,0.0
114,4,Decision Tree,2,0.05,0.42948376796168175,0.9731330596620531,0.08770990371704102,0.0
115,4,RandomForest,2,0.05,0.42948376796168175,0.9731330596620531,0.7136721611022949,0.0
116,4,AdaBoost (Discrete),2,0.05,0.42948376796168175,0.9731330596620531,43.918843030929565,0.0
117,4,AdaBoost (Real),2,0.05,0.42948376796168175,0.9731330596620531,79.71219611167908,0.0
118,4,Logistic Regression (Penalty = L2),2,0.05,0.42948376796168175,0.9731330596620531,0.5365433692932129,0.0
119,4,Naive Bayes,2,0.05,0.42948376796168175,0.9731330596620531,0.24130988121032715,0.0
120,5,KNeighbors Classifier,0,0.05,0.34076433121019106,1.0,3.1232376098632812,0.0
121,5,SVC Classifier,0,0.05,0.4410828025477707,1.0,7.610938787460327,0.0
122,5,Decision Tree,0,0.05,0.4410828025477707,1.0,0.0866544246673584,0.0
123,5,RandomForest,0,0.05,0.4410828025477707,1.0,0.7018213272094727,0.0
124,5,AdaBoost (Discrete),0,0.05,0.45276008492569003,1.0,43.34808135032654,0.0
125,5,AdaBoost (Real),0,0.05,0.4410828025477707,1.0,75.71557879447937,0.0
126,5,Logistic Regression (Penalty = L2),0,0.05,0.4410828025477707,1.0,0.4972560405731201,0.0
127,5,Naive Bayes,0,0.05,0.34076433121019106,1.0,0.16222095489501953,0.0
128,5,KNeighbors Classifier,1,0.05,0.07655502392344497,1.0,3.132056713104248,0.0
129,5,SVC Classifier,1,0.05,0.44178628389154706,1.0,7.401346921920776,0.0
130,5,Decision Tree,1,0.05,0.44178628389154706,1.0,0.07889270782470703,0.0
131,5,RandomForest,1,0.05,0.44178628389154706,1.0,0.743818998336792,0.0
132,5,AdaBoost (Discrete),1,0.05,0.44178628389154706,1.0,40.85700559616089,0.0
133,5,AdaBoost (Real),1,0.05,0.44178628389154706,1.0,77.89138221740723,0.0
134,5,Logistic Regression (Penalty = L2),1,0.05,0.44178628389154706,1.0,0.4528961181640625,0.0
135,5,Naive Bayes,1,0.05,0.34077618288144607,1.0,0.08921003341674805,0.0
136,5,KNeighbors Classifier,2,0.05,0.07610431080361894,1.0,3.0484302043914795,0.0
137,5,SVC Classifier,2,0.05,0.42948376796168175,0.9731330596620531,7.295687198638916,0.0
138,5,Decision Tree,2,0.05,0.42948376796168175,0.9731330596620531,0.08240890502929688,0.0
139,5,RandomForest,2,0.05,0.42948376796168175,0.9731330596620531,0.7543313503265381,0.0
140,5,AdaBoost (Discrete),2,0.05,0.42948376796168175,0.9731330596620531,42.17418169975281,0.0
141,5,AdaBoost (Real),2,0.05,0.42948376796168175,0.9731330596620531,79.17074227333069,0.0
142,5,Logistic Regression (Penalty = L2),2,0.05,0.42948376796168175,0.9731330596620531,0.6345129013061523,0.0
143,5,Naive Bayes,2,0.05,0.42948376796168175,0.9731330596620531,0.08866620063781738,0.0
144,6,KNeighbors Classifier,0,0.05,0.3386411889596603,0.9045340337332909,4.1502861976623535,0.0
145,6,SVC Classifier,0,0.05,0.4410828025477707,1.0,9.52110481262207,0.0
146,6,Decision Tree,0,0.05,0.4442675159235669,0.5222329678670935,0.08669543266296387,0.0
147,6,RandomForest,0,0.05,0.4463906581740977,0.674199862463242,0.7917008399963379,0.0
148,6,AdaBoost (Discrete),0,0.05,0.4410828025477707,1.0,45.052441358566284,0.0
149,6,AdaBoost (Real),0,0.05,0.4410828025477707,1.0,74.4522020816803,0.0
150,6,Logistic Regression (Penalty = L2),0,0.05,0.4442675159235669,0.5222329678670935,0.5588030815124512,0.0
151,6,Naive Bayes,0,0.05,0.34076433121019106,1.0,0.2319355010986328,0.0
152,6,KNeighbors Classifier,1,0.05,0.07655502392344497,1.0,3.8364527225494385,0.0
153,6,SVC Classifier,1,0.05,0.44178628389154706,1.0,8.708553552627563,0.0
154,6,Decision Tree,1,0.05,0.44657097288676234,0.6546536707079771,0.07957100868225098,0.0
155,6,RandomForest,1,0.05,0.44657097288676234,0.6546536707079771,0.7128696441650391,0.0
156,6,AdaBoost (Discrete),1,0.05,0.44869750132908026,0.7867957924694432,43.878377199172974,0.0
157,6,AdaBoost (Real),1,0.05,0.44657097288676234,0.6546536707079771,78.64529585838318,0.0
158,6,Logistic Regression (Penalty = L2),1,0.05,0.44657097288676234,0.6546536707079771,0.769890546798706,0.0
159,6,Naive Bayes,1,0.05,0.34077618288144607,1.0,0.1626594066619873,0.0
160,6,KNeighbors Classifier,2,0.05,0.07610431080361894,1.0,4.092060565948486,0.0
161,6,SVC Classifier,2,0.05,0.42948376796168175,0.9731330596620531,8.464910507202148,0.0
162,6,Decision Tree,2,0.05,0.42948376796168175,0.9731330596620531,0.08392047882080078,0.0
163,6,RandomForest,2,0.05,0.42948376796168175,0.9731330596620531,0.7602357864379883,0.0
164,6,AdaBoost (Discrete),2,0.05,0.42948376796168175,0.9731330596620531,42.63637852668762,0.0
165,6,AdaBoost (Real),2,0.05,0.42948376796168175,0.9731330596620531,76.10212659835815,0.0
166,6,Logistic Regression (Penalty = L2),2,0.05,0.42948376796168175,0.9731330596620531,0.6329751014709473,0.0
167,6,Naive Bayes,2,0.05,0.42948376796168175,0.9731330596620531,0.16800212860107422,0.0
168,7,KNeighbors Classifier,0,0.05,0.6539278131634819,0.7939582675278565,5.070957899093628,0.0
169,7,SVC Classifier,0,0.05,0.6502123142250531,0.7815678276732434,10.898077011108398,0.0
170,7,Decision Tree,0,0.05,0.6560509554140127,0.8395086564550109,0.16601037979125977,0.0
171,7,RandomForest,0,0.05,0.6475583864118896,0.8016588333013621,0.8441951274871826,0.0
172,7,AdaBoost (Discrete),0,0.05,0.5610403397027601,0.6018715938038269,50.201481103897095,0.0
173,7,AdaBoost (Real),0,0.05,0.7239915074309978,0.7125828754221665,85.3830132484436,0.0
174,7,Logistic Regression (Penalty = L2),0,0.05,0.6560509554140127,0.8395086564550109,0.6985514163970947,0.0
175,7,Naive Bayes,0,0.05,0.12473460721868365,0.8601386275372181,0.14934134483337402,0.0
176,7,KNeighbors Classifier,1,0.05,0.7761828814460393,0.9935063103670373,4.988234043121338,0.0
177,7,SVC Classifier,1,0.05,0.7650186071238703,0.9902752957083816,11.938008785247803,0.0
178,7,Decision Tree,1,0.05,0.772461456671983,0.8679077043288821,0.07589578628540039,0.0
179,7,RandomForest,1,0.05,0.7650186071238703,0.9902752957083816,0.7644200325012207,0.0
180,7,AdaBoost (Discrete),1,0.05,0.8011695906432749,0.7767131609252154,50.747994899749756,0.0
181,7,AdaBoost (Real),1,0.05,0.7655502392344498,0.3601064207825454,87.33544278144836,0.0
182,7,Logistic Regression (Penalty = L2),1,0.05,0.772461456671983,0.8679077043288821,0.7835311889648438,0.0
183,7,Naive Bayes,1,0.05,0.12068048910154174,0.6933612743506347,0.24321532249450684,0.0
184,7,KNeighbors Classifier,2,0.05,0.46780202235231505,0.32060913140269004,7.513595104217529,0.0
185,7,SVC Classifier,2,0.05,0.4353379457158063,0.2561229427838334,6.759060859680176,0.0
186,7,Decision Tree,2,0.05,0.4321447578499202,0.2289492039738046,0.07718372344970703,0.0
187,7,RandomForest,2,0.05,0.4353379457158063,0.2561229427838334,0.8089282512664795,0.0
188,7,AdaBoost (Discrete),2,0.05,0.4491750931346461,0.25905189034663834,47.77075934410095,0.0
189,7,AdaBoost (Real),2,0.05,0.4310803618946248,0.21828463603472137,80.6752142906189,0.0
190,7,Logistic Regression (Penalty = L2),2,0.05,0.4353379457158063,0.2561229427838334,0.7159528732299805,0.0
191,7,Naive Bayes,2,0.05,0.10856838744012773,0.8567472128117785,0.14870691299438477,0.0
192,8,KNeighbors Classifier,0,0.05,0.34076433121019106,1.0,2.714759111404419,0.0
193,8,SVC Classifier,0,0.05,0.4410828025477707,1.0,7.077918767929077,0.0
194,8,Decision Tree,0,0.05,0.4410828025477707,1.0,0.003088235855102539,0.0
195,8,RandomForest,0,0.05,0.4410828025477707,1.0,0.7074129581451416,0.0
196,8,AdaBoost (Discrete),0,0.05,0.45276008492569003,1.0,40.01515460014343,0.0
197,8,AdaBoost (Real),0,0.05,0.4410828025477707,1.0,71.20419836044312,0.0
198,8,Logistic Regression (Penalty = L2),0,0.05,0.4410828025477707,1.0,0.48809170722961426,0.0
199,8,Naive Bayes,0,0.05,0.34076433121019106,1.0,0.0815114974975586,0.0
200,8,KNeighbors Classifier,1,0.05,0.07655502392344497,1.0,2.8312032222747803,0.0
201,8,SVC Classifier,1,0.05,0.44178628389154706,1.0,7.083951711654663,0.0
202,8,Decision Tree,1,0.05,0.44178628389154706,1.0,0.0790400505065918,0.0
203,8,RandomForest,1,0.05,0.44178628389154706,1.0,0.7378816604614258,0.0
204,8,AdaBoost (Discrete),1,0.05,0.44178628389154706,1.0,38.876680850982666,0.0
205,8,AdaBoost (Real),1,0.05,0.44178628389154706,1.0,68.6878354549408,0.0
206,8,Logistic Regression (Penalty = L2),1,0.05,0.44178628389154706,1.0,0.526247501373291,0.0
207,8,Naive Bayes,1,0.05,0.34077618288144607,1.0,0.07253694534301758,0.0
208,8,KNeighbors Classifier,2,0.05,0.07610431080361894,1.0,2.974243640899658,0.0
209,8,SVC Classifier,2,0.05,0.42948376796168175,0.9731330596620531,7.068102598190308,0.0
210,8,Decision Tree,2,0.05,0.42948376796168175,0.9731330596620531,0.07055878639221191,0.0
211,8,RandomForest,2,0.05,0.42948376796168175,0.9731330596620531,0.6045353412628174,0.0
212,8,AdaBoost (Discrete),2,0.05,0.42948376796168175,0.9731330596620531,38.23383069038391,0.0
213,8,AdaBoost (Real),2,0.05,0.42948376796168175,0.9731330596620531,67.56339025497437,0.0
214,8,Logistic Regression (Penalty = L2),2,0.05,0.42948376796168175,0.9731330596620531,0.43753957748413086,0.0
215,8,Naive Bayes,2,0.05,0.42948376796168175,0.9731330596620531,0.11213278770446777,0.0
