,feat_set_id,classifier,fold_id,feat_th,score,geo_score,exec_t,geo_score_woz
0,0,KNeighbors Classifier,0,0.65,0.7388535031847133,0.8506249596566804,8.9223473072052,0.0
1,0,SVC Classifier,0,0.65,0.692144373673036,0.6735857567000605,17.7310049533844,0.0
2,0,Decision Tree,0,0.65,0.7091295116772823,0.8309126695814102,0.15837526321411133,0.0
3,0,RandomForest,0,0.65,0.5429936305732485,0.5514511030090963,0.6196389198303223,0.0
4,0,AdaBoost (Discrete),0,0.65,0.7558386411889597,0.8557096657051672,61.73606324195862,0.0
5,0,AdaBoost (Real),0,0.65,0.31475583864118895,0.36003689309827996,82.57551884651184,0.0
6,0,Logistic Regression (Penalty = L2),0,0.65,0.7367303609341825,0.8741540685835897,1.6420464515686035,0.0
7,0,Naive Bayes,0,0.65,0.7032908704883227,0.7676217005470146,0.403484582901001,0.7676217005470146
8,0,KNeighbors Classifier,1,0.65,0.8128654970760234,0.4841123056819556,11.496070146560669,0.4841123056819556
9,0,SVC Classifier,1,0.65,0.7682083997873471,0.6177320829257733,19.913638591766357,0.0
10,0,Decision Tree,1,0.65,0.7607655502392344,0.27637848725848546,0.15724825859069824,0.0
11,0,RandomForest,1,0.65,0.7698032961190856,0.9975777114203086,0.5656321048736572,0.0
12,0,AdaBoost (Discrete),1,0.65,0.7963849016480595,0.8209152583812477,67.50338792800903,0.0
13,0,AdaBoost (Real),1,0.65,0.7804359383306751,0.9822786963053242,105.99657034873962,0.0
14,0,Logistic Regression (Penalty = L2),1,0.65,0.7676767676767676,0.6396859802836975,1.5178542137145996,0.0
15,0,Naive Bayes,1,0.65,0.8793195108984583,0.9450934259848028,0.31626176834106445,0.9450934259848028
16,0,KNeighbors Classifier,2,0.65,0.41245343267695583,0.33106200411743414,9.98627758026123,0.33106200411743414
17,0,SVC Classifier,2,0.65,0.3469930814262906,0.3267273117482309,8.079173803329468,0.0
18,0,Decision Tree,2,0.65,0.40766365087812667,0.45447832008679484,0.15461993217468262,0.0
19,0,RandomForest,2,0.65,0.292176689728579,0.2570933814605736,0.6231391429901123,0.0
20,0,AdaBoost (Discrete),2,0.65,0.4635444385311336,0.40081868520958497,58.43830490112305,0.40081868520958497
21,0,AdaBoost (Real),2,0.65,0.3677488025545503,0.784611766697512,73.2743170261383,0.0
22,0,Logistic Regression (Penalty = L2),2,0.65,0.3746673762639702,0.36809366911334873,1.1490938663482666,0.0
23,0,Naive Bayes,2,0.65,0.37360298030867484,0.40828021205743065,0.2846674919128418,0.40828021205743065
24,1,KNeighbors Classifier,0,0.65,0.7383227176220807,0.36989155087962566,9.985917806625366,0.36989155087962566
25,1,SVC Classifier,0,0.65,0.7011677282377919,0.7493364174536107,16.693867444992065,0.0
26,1,Decision Tree,0,0.65,0.7361995753715499,0.8560953927464221,0.1384410858154297,0.0
27,1,RandomForest,0,0.65,0.5981953290870489,0.6909553927994988,0.5269827842712402,0.0
28,1,AdaBoost (Discrete),0,0.65,0.7961783439490446,0.7583289961832346,58.107999086380005,0.7583289961832346
29,1,AdaBoost (Real),0,0.65,0.3211252653927813,0.31169803187753203,70.97642827033997,0.0
30,1,Logistic Regression (Penalty = L2),0,0.65,0.7367303609341825,0.3727721645770899,1.3674941062927246,0.3727721645770899
31,1,Naive Bayes,0,0.65,0.6693205944798302,0.7548839886255256,0.3006460666656494,0.7548839886255256
32,1,KNeighbors Classifier,1,0.65,0.7878787878787878,0.2734868075799518,11.025981664657593,0.2734868075799518
33,1,SVC Classifier,1,0.65,0.7682083997873471,0.6177320829257733,16.872103214263916,0.0
34,1,Decision Tree,1,0.65,0.7650186071238703,0.6162174035687353,0.08673620223999023,0.0
35,1,RandomForest,1,0.65,0.748006379585327,0.9726571217443227,0.5483932495117188,0.0
36,1,AdaBoost (Discrete),1,0.65,0.7713981924508241,0.6192357015520555,57.15028476715088,0.0
37,1,AdaBoost (Real),1,0.65,0.7804359383306751,0.9822786963053242,71.81863284111023,0.0
38,1,Logistic Regression (Penalty = L2),1,0.65,0.7666135034556087,0.6169761377004175,1.3102529048919678,0.0
39,1,Naive Bayes,1,0.65,0.8543328017012227,0.9341766402374898,0.239030122756958,0.9341766402374898
40,1,KNeighbors Classifier,2,0.65,0.3815859499733901,0.28377168586112905,7.968549489974976,0.28377168586112905
41,1,SVC Classifier,2,0.65,0.3602980308674827,0.34887734178065816,6.540953636169434,0.0
42,1,Decision Tree,2,0.65,0.3751995742416179,0.42312802783190057,0.08216214179992676,0.0
43,1,RandomForest,2,0.65,0.30175625332623734,0.18999722543518244,0.3970966339111328,0.0
44,1,AdaBoost (Discrete),2,0.65,0.37360298030867484,0.33542325328309514,47.40787482261658,0.0
45,1,AdaBoost (Real),2,0.65,0.3677488025545503,0.784611766697512,63.37023878097534,0.0
46,1,Logistic Regression (Penalty = L2),2,0.65,0.3778605641298563,0.3715923199515945,1.128279209136963,0.0
47,1,Naive Bayes,2,0.65,0.39648749334752525,0.3716162081238925,0.25857973098754883,0.3716162081238925
48,2,KNeighbors Classifier,0,0.65,0.7356687898089171,0.849652410283033,9.438340902328491,0.0
49,2,SVC Classifier,0,0.65,0.692144373673036,0.6735857567000605,15.110188484191895,0.0
50,2,Decision Tree,0,0.65,0.732484076433121,0.8320250390366374,0.1761641502380371,0.0
51,2,RandomForest,0,0.65,0.5886411889596603,0.6696171270018364,0.6049127578735352,0.0
52,2,AdaBoost (Discrete),0,0.65,0.7399150743099787,0.8487488988097288,51.84189701080322,0.0
53,2,AdaBoost (Real),0,0.65,0.3657112526539278,0.5508630399831544,67.82763171195984,0.0
54,2,Logistic Regression (Penalty = L2),0,0.65,0.7367303609341825,0.3727721645770899,1.2711234092712402,0.3727721645770899
55,2,Naive Bayes,0,0.65,0.6932059447983014,0.7639500107085624,0.3137352466583252,0.7639500107085624
56,2,KNeighbors Classifier,1,0.65,0.7809675704412546,0.5618808838496128,9.943464279174805,0.0
57,2,SVC Classifier,1,0.65,0.7682083997873471,0.6177320829257733,15.512272834777832,0.0
58,2,Decision Tree,1,0.65,0.7586390217969166,0.678646428955944,0.15713882446289062,0.0
59,2,RandomForest,1,0.65,0.7549175970228602,0.9806273417094291,0.43756866455078125,0.0
60,2,AdaBoost (Discrete),1,0.65,0.8718766613503456,0.7576228151020329,53.159589767456055,0.0
61,2,AdaBoost (Real),1,0.65,0.7804359383306751,0.9822786963053242,66.90067291259766,0.0
62,2,Logistic Regression (Penalty = L2),1,0.65,0.7676767676767676,0.617423414240383,1.1869945526123047,0.0
63,2,Naive Bayes,1,0.65,0.873471557682084,0.9425946301834182,0.2275233268737793,0.9425946301834182
64,2,KNeighbors Classifier,2,0.65,0.38105375199574243,0.2638105016523069,8.894020557403564,0.2638105016523069
65,2,SVC Classifier,2,0.65,0.3602980308674827,0.3472039434372915,7.680728435516357,0.0
66,2,Decision Tree,2,0.65,0.39010111761575306,0.33477583112596176,0.1195669174194336,0.0
67,2,RandomForest,2,0.65,0.31293241085683876,0.1932103462688725,0.43587398529052734,0.0
68,2,AdaBoost (Discrete),2,0.65,0.4912187333688132,0.35594662831055107,48.55274271965027,0.35594662831055107
69,2,AdaBoost (Real),2,0.65,0.3677488025545503,0.784611766697512,55.669442892074585,0.0
70,2,Logistic Regression (Penalty = L2),2,0.65,0.3751995742416179,0.3691947498960924,0.8279242515563965,0.0
71,2,Naive Bayes,2,0.65,0.36934539648749337,0.3878285976996639,0.19689011573791504,0.3878285976996639
72,3,KNeighbors Classifier,0,0.65,0.7425690021231423,0.4924327237674089,5.59317946434021,0.4924327237674089
73,3,SVC Classifier,0,0.65,0.7330148619957537,0.8200160468857968,11.357599020004272,0.0
74,3,Decision Tree,0,0.65,0.7361995753715499,0.8615105106215699,0.07027029991149902,0.0
75,3,RandomForest,0,0.65,0.6035031847133758,0.60093262151258,0.3919084072113037,0.0
76,3,AdaBoost (Discrete),0,0.65,0.7489384288747346,0.8602964204264256,41.467101097106934,0.0
77,3,AdaBoost (Real),0,0.65,0.3211252653927813,0.31169803187753203,49.360520362854004,0.0
78,3,Logistic Regression (Penalty = L2),0,0.65,0.7383227176220807,0.44776615284759064,0.9718663692474365,0.44776615284759064
79,3,Naive Bayes,0,0.65,0.7048832271762208,0.7681934867237953,0.20477056503295898,0.7681934867237953
80,3,KNeighbors Classifier,1,0.65,0.8112706007442849,0.503130457688617,4.288281202316284,0.503130457688617
81,3,SVC Classifier,1,0.65,0.7682083997873471,0.6177320829257733,10.00367784500122,0.0
82,3,Decision Tree,1,0.65,0.7660818713450293,0.6166653730147104,0.087890625,0.0
83,3,RandomForest,1,0.65,0.7501329080276449,0.9756358042955093,0.3359260559082031,0.0
84,3,AdaBoost (Discrete),1,0.65,0.7985114300903775,0.7188289768948042,38.53030824661255,0.0
85,3,AdaBoost (Real),1,0.65,0.7804359383306751,0.9822786963053242,48.76494574546814,0.0
86,3,Logistic Regression (Penalty = L2),1,0.65,0.7671451355661882,0.6171710441021402,0.9668219089508057,0.0
87,3,Naive Bayes,1,0.65,0.7177033492822966,0.8591748230173847,0.1936018466949463,0.8591748230173847
88,3,KNeighbors Classifier,2,0.65,0.3938265034592869,0.29777119772002025,5.3267600536346436,0.29777119772002025
89,3,SVC Classifier,2,0.65,0.3602980308674827,0.3477743522647595,4.849847078323364,0.0
90,3,Decision Tree,2,0.65,0.3773283661522086,0.3673948655464233,0.08196139335632324,0.0
91,3,RandomForest,2,0.65,0.320915380521554,0.31165895250759823,0.361041784286499,0.0
92,3,AdaBoost (Discrete),2,0.65,0.4246939861628526,0.409611356884257,35.53778409957886,0.0
93,3,AdaBoost (Real),2,0.65,0.3677488025545503,0.784611766697512,47.25018048286438,0.0
94,3,Logistic Regression (Penalty = L2),2,0.65,0.3746673762639702,0.36809366911334873,0.6446230411529541,0.0
95,3,Naive Bayes,2,0.65,0.3943587014369345,0.3709630981785441,0.19254398345947266,0.3709630981785441
96,4,KNeighbors Classifier,0,0.65,0.7404458598726115,0.4428841986266727,2.822707414627075,0.4428841986266727
97,4,SVC Classifier,0,0.65,0.692144373673036,0.6735857567000605,7.523270845413208,0.0
98,4,Decision Tree,0,0.65,0.7361995753715499,0.873942562614331,0.0575106143951416,0.0
99,4,RandomForest,0,0.65,0.5981953290870489,0.6909553927994988,0.2595231533050537,0.0
100,4,AdaBoost (Discrete),0,0.65,0.7409766454352441,0.8484120656552605,29.883472442626953,0.0
101,4,AdaBoost (Real),0,0.65,0.31475583864118895,0.36003689309827996,40.535680532455444,0.0
102,4,Logistic Regression (Penalty = L2),0,0.65,0.7367303609341825,0.8741540685835897,0.9312291145324707,0.0
103,4,Naive Bayes,0,0.65,0.7032908704883227,0.7676217005470146,0.18721270561218262,0.7676217005470146
104,4,KNeighbors Classifier,1,0.65,0.8288144603934078,0.6284328996881465,3.0320606231689453,0.6284328996881465
105,4,SVC Classifier,1,0.65,0.7682083997873471,0.6177320829257733,8.128318548202515,0.0
106,4,Decision Tree,1,0.65,0.7660818713450293,0.6166653730147104,0.05825328826904297,0.0
107,4,RandomForest,1,0.65,0.7644869750132908,0.991557271937277,0.27814316749572754,0.0
108,4,AdaBoost (Discrete),1,0.65,0.9043062200956937,0.8479099529974525,30.055804014205933,0.8479099529974525
109,4,AdaBoost (Real),1,0.65,0.7804359383306751,0.9822786963053242,36.111189126968384,0.0
110,4,Logistic Regression (Penalty = L2),1,0.65,0.7682083997873471,0.6253918159827379,0.6755020618438721,0.0
111,4,Naive Bayes,1,0.65,0.8793195108984583,0.9450934259848028,0.13948726654052734,0.9450934259848028
112,4,KNeighbors Classifier,2,0.65,0.41564662054284196,0.3600197076662039,2.8595175743103027,0.3600197076662039
113,4,SVC Classifier,2,0.65,0.34379989356040447,0.3181720219996804,3.215236186981201,0.0
114,4,Decision Tree,2,0.65,0.4161788185204896,0.5020549499456795,0.08088827133178711,0.0
115,4,RandomForest,2,0.65,0.30175625332623734,0.18999722543518244,0.3324284553527832,0.0
116,4,AdaBoost (Discrete),2,0.65,0.44385311335816924,0.3560241007053497,28.76985239982605,0.0
117,4,AdaBoost (Real),2,0.65,0.3677488025545503,0.784611766697512,37.2865469455719,0.0
118,4,Logistic Regression (Penalty = L2),2,0.65,0.3778605641298563,0.36918866219451113,0.6330628395080566,0.0
119,4,Naive Bayes,2,0.65,0.368281000532198,0.3624539126363047,0.18114113807678223,0.3624539126363047
120,5,KNeighbors Classifier,0,0.65,0.7388535031847133,0.8545780977930196,3.4384093284606934,0.0
121,5,SVC Classifier,0,0.65,0.692144373673036,0.6735857567000605,8.04153823852539,0.0
122,5,Decision Tree,0,0.65,0.6910828025477707,0.8485976328961661,0.08382892608642578,0.0
123,5,RandomForest,0,0.65,0.5881104033970276,0.5184310488443483,0.33591794967651367,0.0
124,5,AdaBoost (Discrete),0,0.65,0.7802547770700637,0.7849608055509713,27.159509658813477,0.0
125,5,AdaBoost (Real),0,0.65,0.31475583864118895,0.36003689309827996,35.10461473464966,0.0
126,5,Logistic Regression (Penalty = L2),0,0.65,0.7367303609341825,0.8741540685835897,0.5718955993652344,0.0
127,5,Naive Bayes,0,0.65,0.6926751592356688,0.7637543016892311,0.15630269050598145,0.7637543016892311
128,5,KNeighbors Classifier,1,0.65,0.8282828282828283,0.6008951521942902,3.4231200218200684,0.6008951521942902
129,5,SVC Classifier,1,0.65,0.7682083997873471,0.6177320829257733,7.497655153274536,0.0
130,5,Decision Tree,1,0.65,0.7644869750132908,0.2927466828571932,0.07000207901000977,0.0
131,5,RandomForest,1,0.65,0.7501329080276449,0.9756358042955093,0.2408277988433838,0.0
132,5,AdaBoost (Discrete),1,0.65,0.8335991493886231,0.8574110648738131,29.534557104110718,0.0
133,5,AdaBoost (Real),1,0.65,0.7804359383306751,0.9822786963053242,34.98773455619812,0.0
134,5,Logistic Regression (Penalty = L2),1,0.65,0.7682083997873471,0.6253918159827379,0.6810925006866455,0.0
135,5,Naive Bayes,1,0.65,0.8649654439128124,0.9388998258529409,0.14557409286499023,0.9388998258529409
136,5,KNeighbors Classifier,2,0.65,0.42203299627461416,0.3930390291091837,3.5207760334014893,0.3930390291091837
137,5,SVC Classifier,2,0.65,0.3602980308674827,0.3466206166444903,3.130154609680176,0.0
138,5,Decision Tree,2,0.65,0.3927621075039915,0.49166023817072274,0.04722428321838379,0.0
139,5,RandomForest,2,0.65,0.30175625332623734,0.18999722543518244,0.26885986328125,0.0
140,5,AdaBoost (Discrete),2,0.65,0.4635444385311336,0.40081868520958497,25.418551921844482,0.40081868520958497
141,5,AdaBoost (Real),2,0.65,0.3677488025545503,0.784611766697512,33.84064483642578,0.0
142,5,Logistic Regression (Penalty = L2),2,0.65,0.3778605641298563,0.36918866219451113,0.5415546894073486,0.0
143,5,Naive Bayes,2,0.65,0.3645556146886642,0.4047081410813267,0.11483192443847656,0.4047081410813267
144,6,KNeighbors Classifier,0,0.65,0.7425690021231423,0.4388132805830689,2.8945891857147217,0.4388132805830689
145,6,SVC Classifier,0,0.65,0.692144373673036,0.6735857567000605,6.633769989013672,0.0
146,6,Decision Tree,0,0.65,0.7361995753715499,0.873942562614331,0.052042484283447266,0.0
147,6,RandomForest,0,0.65,0.6963906581740976,0.8516654476994193,0.2430257797241211,0.0
148,6,AdaBoost (Discrete),0,0.65,0.8572186836518046,0.7448379828089507,25.340636014938354,0.0
149,6,AdaBoost (Real),0,0.65,0.3858811040339703,0.27862407792065225,33.37435793876648,0.0
150,6,Logistic Regression (Penalty = L2),0,0.65,0.7367303609341825,0.8741540685835897,0.6012184619903564,0.0
151,6,Naive Bayes,0,0.65,0.7032908704883227,0.7676217005470146,0.13398170471191406,0.7676217005470146
152,6,KNeighbors Classifier,1,0.65,0.8442317916002127,0.6871623805483323,3.2022531032562256,0.6871623805483323
153,6,SVC Classifier,1,0.65,0.7682083997873471,0.6177320829257733,7.049695253372192,0.0
154,6,Decision Tree,1,0.65,0.7660818713450293,0.6166653730147104,0.0704500675201416,0.0
155,6,RandomForest,1,0.65,0.7698032961190856,0.9975777114203086,0.2580246925354004,0.0
156,6,AdaBoost (Discrete),1,0.65,0.845826687931951,0.9442525182981301,25.536108016967773,0.0
157,6,AdaBoost (Real),1,0.65,0.7804359383306751,0.9822786963053242,34.303433656692505,0.0
158,6,Logistic Regression (Penalty = L2),1,0.65,0.7676767676767676,0.6251361887819947,0.6720247268676758,0.0
159,6,Naive Bayes,1,0.65,0.8793195108984583,0.9450934259848028,0.14706826210021973,0.9450934259848028
160,6,KNeighbors Classifier,2,0.65,0.42150079829696646,0.42745492926027917,3.4068779945373535,0.42745492926027917
161,6,SVC Classifier,2,0.65,0.3602980308674827,0.3466206166444903,3.0605318546295166,0.0
162,6,Decision Tree,2,0.65,0.37360298030867484,0.33760707631782105,0.05254364013671875,0.0
163,6,RandomForest,2,0.65,0.30175625332623734,0.18999722543518244,0.2562277317047119,0.0
164,6,AdaBoost (Discrete),2,0.65,0.40606705694518364,0.30745698380447123,24.383395671844482,0.30745698380447123
165,6,AdaBoost (Real),2,0.65,0.3677488025545503,0.784611766697512,32.97114849090576,0.0
166,6,Logistic Regression (Penalty = L2),2,0.65,0.3778605641298563,0.36918866219451113,0.47348880767822266,0.0
167,6,Naive Bayes,2,0.65,0.368281000532198,0.3624539126363047,0.13132309913635254,0.3624539126363047
168,7,KNeighbors Classifier,0,0.65,0.7404458598726115,0.41135050952675,4.023061037063599,0.41135050952675
169,7,SVC Classifier,0,0.65,0.692144373673036,0.6735857567000605,6.830430746078491,0.0
170,7,Decision Tree,0,0.65,0.685244161358811,0.8434813112756231,0.06290197372436523,0.0
171,7,RandomForest,0,0.65,0.5981953290870489,0.6909553927994988,0.26682615280151367,0.0
172,7,AdaBoost (Discrete),0,0.65,0.7462845010615711,0.8449824999990125,27.419713020324707,0.0
173,7,AdaBoost (Real),0,0.65,0.31475583864118895,0.36003689309827996,32.945398569107056,0.0
174,7,Logistic Regression (Penalty = L2),0,0.65,0.7367303609341825,0.3727721645770899,0.7757766246795654,0.3727721645770899
175,7,Naive Bayes,0,0.65,0.6926751592356688,0.7637543016892311,0.17099809646606445,0.7637543016892311
176,7,KNeighbors Classifier,1,0.65,0.7894736842105263,0.27250594222454116,3.4591715335845947,0.27250594222454116
177,7,SVC Classifier,1,0.65,0.7682083997873471,0.6177320829257733,6.290195941925049,0.0
178,7,Decision Tree,1,0.65,0.7650186071238703,0.6162174035687353,0.050771474838256836,0.0
179,7,RandomForest,1,0.65,0.7432216905901117,0.9671007994868753,0.26192259788513184,0.0
180,7,AdaBoost (Discrete),1,0.65,0.7713981924508241,0.6192357015520555,25.49557638168335,0.0
181,7,AdaBoost (Real),1,0.65,0.7804359383306751,0.9822786963053242,32.63957667350769,0.0
182,7,Logistic Regression (Penalty = L2),1,0.65,0.7671451355661882,0.6172284281386226,0.6865622997283936,0.0
183,7,Naive Bayes,1,0.65,0.8649654439128124,0.9388998258529409,0.14164113998413086,0.9388998258529409
184,7,KNeighbors Classifier,2,0.65,0.3879723257051623,0.3227247432956896,3.56602144241333,0.3227247432956896
185,7,SVC Classifier,2,0.65,0.3602980308674827,0.3466206166444903,3.237529993057251,0.0
186,7,Decision Tree,2,0.65,0.3922299095263438,0.37121070865940453,0.052709341049194336,0.0
187,7,RandomForest,2,0.65,0.290580095795636,0.25380499579058524,0.2618601322174072,0.0
188,7,AdaBoost (Discrete),2,0.65,0.38903672166045766,0.39180547254128234,25.25963807106018,0.0
189,7,AdaBoost (Real),2,0.65,0.3677488025545503,0.784611766697512,30.237988233566284,0.0
190,7,Logistic Regression (Penalty = L2),2,0.65,0.3778605641298563,0.3715923199515945,0.5166420936584473,0.0
191,7,Naive Bayes,2,0.65,0.35923363491218735,0.35925312105676244,0.1340494155883789,0.35925312105676244
192,8,KNeighbors Classifier,0,0.65,0.7425690021231423,0.4924327237674089,2.989525556564331,0.4924327237674089
193,8,SVC Classifier,0,0.65,0.7361995753715499,0.873942562614331,6.040531873703003,0.0
194,8,Decision Tree,0,0.65,0.7234607218683652,0.8486383558392148,0.0599980354309082,0.0
195,8,RandomForest,0,0.65,0.5981953290870489,0.6909553927994988,0.2639760971069336,0.0
196,8,AdaBoost (Discrete),0,0.65,0.7733545647558386,0.8077841385995154,25.08729600906372,0.0
197,8,AdaBoost (Real),0,0.65,0.3619957537154989,0.35011387244385067,29.635465383529663,0.35011387244385067
198,8,Logistic Regression (Penalty = L2),0,0.65,0.7383227176220807,0.44776615284759064,0.5184507369995117,0.44776615284759064
199,8,Naive Bayes,0,0.65,0.7048832271762208,0.7681934867237953,0.1323840618133545,0.7681934867237953
200,8,KNeighbors Classifier,1,0.65,0.8048910154173312,0.4786255477997253,2.395310640335083,0.4786255477997253
201,8,SVC Classifier,1,0.65,0.7682083997873471,0.6177320829257733,6.453369617462158,0.0
202,8,Decision Tree,1,0.65,0.7660818713450293,0.6166653730147104,0.04931211471557617,0.0
203,8,RandomForest,1,0.65,0.7698032961190856,0.9975777114203086,0.2654914855957031,0.0
204,8,AdaBoost (Discrete),1,0.65,0.7963849016480595,0.5887696062585238,24.02546739578247,0.0
205,8,AdaBoost (Real),1,0.65,0.7804359383306751,0.9822786963053242,30.39725089073181,0.0
206,8,Logistic Regression (Penalty = L2),1,0.65,0.7671451355661882,0.6171710441021402,0.5917942523956299,0.0
207,8,Naive Bayes,1,0.65,0.6953748006379585,0.8431845024934158,0.15073227882385254,0.8431845024934158
208,8,KNeighbors Classifier,2,0.65,0.3938265034592869,0.29777119772002025,2.9937164783477783,0.29777119772002025
209,8,SVC Classifier,2,0.65,0.3602980308674827,0.34887734178065816,2.7665786743164062,0.0
210,8,Decision Tree,2,0.65,0.41138903672166044,0.4977355456156767,0.04168987274169922,0.0
211,8,RandomForest,2,0.65,0.30175625332623734,0.1920633718646669,0.2234046459197998,0.0
212,8,AdaBoost (Discrete),2,0.65,0.4246939861628526,0.409611356884257,23.05332064628601,0.0
213,8,AdaBoost (Real),2,0.65,0.3677488025545503,0.784611766697512,30.190755605697632,0.0
214,8,Logistic Regression (Penalty = L2),2,0.65,0.3746673762639702,0.36809366911334873,0.5096545219421387,0.0
215,8,Naive Bayes,2,0.65,0.3943587014369345,0.3709630981785441,0.12878751754760742,0.3709630981785441
216,9,KNeighbors Classifier,0,0.65,0.7425690021231423,0.5167559880553118,2.5700106620788574,0.5167559880553118
217,9,SVC Classifier,0,0.65,0.692144373673036,0.6735857567000605,5.157337188720703,0.0
218,9,Decision Tree,0,0.65,0.685244161358811,0.8404834049472594,0.053431034088134766,0.0
219,9,RandomForest,0,0.65,0.5127388535031847,0.5740547341308462,0.22095346450805664,0.0
220,9,AdaBoost (Discrete),0,0.65,0.8630573248407644,0.790255975149212,20.264613151550293,0.0
221,9,AdaBoost (Real),0,0.65,0.3858811040339703,0.27862407792065225,27.527139902114868,0.0
222,9,Logistic Regression (Penalty = L2),0,0.65,0.7383227176220807,0.44776615284759064,0.5321025848388672,0.44776615284759064
223,9,Naive Bayes,0,0.65,0.6926751592356688,0.7637543016892311,0.15435194969177246,0.7637543016892311
224,9,KNeighbors Classifier,1,0.65,0.8070175438596491,0.4900945987190099,2.1602437496185303,0.4900945987190099
225,9,SVC Classifier,1,0.65,0.7682083997873471,0.6177320829257733,5.750075578689575,0.0
226,9,Decision Tree,1,0.65,0.7660818713450293,0.6166653730147104,0.03491616249084473,0.0
227,9,RandomForest,1,0.65,0.7187666135034556,0.937812484314116,0.15892982482910156,0.0
228,9,AdaBoost (Discrete),1,0.65,0.7740563530037214,0.7366728429454744,18.67874526977539,0.0
229,9,AdaBoost (Real),1,0.65,0.7804359383306751,0.9822786963053242,27.704452753067017,0.0
230,9,Logistic Regression (Penalty = L2),1,0.65,0.7671451355661882,0.6171710441021402,0.4937717914581299,0.0
231,9,Naive Bayes,1,0.65,0.8649654439128124,0.9388998258529409,0.09662008285522461,0.9388998258529409
232,9,KNeighbors Classifier,2,0.65,0.39808408728046835,0.3359747351038894,2.1418704986572266,0.3359747351038894
233,9,SVC Classifier,2,0.65,0.3602980308674827,0.3466206166444903,2.1026909351348877,0.0
234,9,Decision Tree,2,0.65,0.3773283661522086,0.3699320393453559,0.023205041885375977,0.0
235,9,RandomForest,2,0.65,0.320915380521554,0.19544160984574718,0.16073083877563477,0.0
236,9,AdaBoost (Discrete),2,0.65,0.3863757317722193,0.39708939132276344,17.066783666610718,0.0
237,9,AdaBoost (Real),2,0.65,0.3677488025545503,0.784611766697512,25.73351287841797,0.0
238,9,Logistic Regression (Penalty = L2),2,0.65,0.3746673762639702,0.36870768388569314,0.3762805461883545,0.0
239,9,Naive Bayes,2,0.65,0.35923363491218735,0.35925312105676244,0.07977437973022461,0.35925312105676244
240,10,KNeighbors Classifier,0,0.65,0.7377919320594479,0.43882557636456093,4.019845962524414,0.43882557636456093
241,10,SVC Classifier,0,0.65,0.7070063694267515,0.7407773123652129,6.132281541824341,0.0
242,10,Decision Tree,0,0.65,0.7340764331210191,0.8341178618883842,0.058300018310546875,0.0
243,10,RandomForest,0,0.65,0.5780254777070064,0.6484956149685502,0.15758204460144043,0.0
244,10,AdaBoost (Discrete),0,0.65,0.7239915074309978,0.60871232306992,23.428141832351685,0.60871232306992
245,10,AdaBoost (Real),0,0.65,0.3211252653927813,0.31169803187753203,27.998222827911377,0.0
246,10,Logistic Regression (Penalty = L2),0,0.65,0.7367303609341825,0.3727721645770899,0.5705187320709229,0.3727721645770899
247,10,Naive Bayes,0,0.65,0.6242038216560509,0.736107196793278,0.1494290828704834,0.736107196793278
248,10,KNeighbors Classifier,1,0.65,0.7841573631047315,0.32290169668959473,4.57832145690918,0.32290169668959473
249,10,SVC Classifier,1,0.65,0.7682083997873471,0.6177320829257733,7.681673288345337,0.0
250,10,Decision Tree,1,0.65,0.7623604465709729,0.6569741015296567,0.06561112403869629,0.0
251,10,RandomForest,1,0.65,0.7432216905901117,0.9671007994868753,0.20697522163391113,0.0
252,10,AdaBoost (Discrete),1,0.65,0.8341307814992025,0.6040359458433461,23.87775468826294,0.6040359458433461
253,10,AdaBoost (Real),1,0.65,0.7804359383306751,0.9822786963053242,25.37819218635559,0.0
254,10,Logistic Regression (Penalty = L2),1,0.65,0.7666135034556087,0.6169761377004175,0.40910959243774414,0.0
255,10,Naive Bayes,1,0.65,0.8272195640616693,0.9215609141296949,0.12438678741455078,0.9215609141296949
256,10,KNeighbors Classifier,2,0.65,0.38690792974986693,0.31733699604383014,3.2806665897369385,0.31733699604383014
257,10,SVC Classifier,2,0.65,0.35923363491218735,0.3474284795242624,2.673207998275757,0.0
258,10,Decision Tree,2,0.65,0.37307078233102714,0.33192507312998454,0.03305864334106445,0.0
259,10,RandomForest,2,0.65,0.30175625332623734,0.18999722543518244,0.12814831733703613,0.0
260,10,AdaBoost (Discrete),2,0.65,0.3874401277275146,0.38741533164580694,17.954782962799072,0.0
261,10,AdaBoost (Real),2,0.65,0.3677488025545503,0.784611766697512,22.388649225234985,0.0
262,10,Logistic Regression (Penalty = L2),2,0.65,0.37573177221926557,0.3696792591096666,0.42357826232910156,0.0
263,10,Naive Bayes,2,0.65,0.3996806812134114,0.417783161618669,0.09660887718200684,0.417783161618669
264,11,KNeighbors Classifier,0,0.65,0.7367303609341825,0.8564711322638023,4.791393041610718,0.0
265,11,SVC Classifier,0,0.65,0.7160297239915074,0.7937149983329698,7.467109203338623,0.0
266,11,Decision Tree,0,0.65,0.6884288747346072,0.7715657944494498,0.08214759826660156,0.0
267,11,RandomForest,0,0.65,0.5636942675159236,0.6103938443016036,0.23807764053344727,0.0
268,11,AdaBoost (Discrete),0,0.65,0.8004246284501062,0.6723477940906949,24.95958924293518,0.0
269,11,AdaBoost (Real),0,0.65,0.3211252653927813,0.31169803187753203,29.08779287338257,0.0
270,11,Logistic Regression (Penalty = L2),0,0.65,0.7367303609341825,0.37182262850934894,0.4894905090332031,0.37182262850934894
271,11,Naive Bayes,0,0.65,0.7107218683651805,0.7702720277511412,0.18500399589538574,0.7702720277511412
272,11,KNeighbors Classifier,1,0.65,0.7745879851143009,0.5133190853264129,5.352684497833252,0.0
273,11,SVC Classifier,1,0.65,0.7676767676767676,0.6174804095865509,7.193609237670898,0.0
274,11,Decision Tree,1,0.65,0.7533227006911217,0.658389115679958,0.03647494316101074,0.0
275,11,RandomForest,1,0.65,0.7698032961190856,0.9975777114203086,0.15518975257873535,0.0
276,11,AdaBoost (Discrete),1,0.65,0.8341307814992025,0.6040359458433461,19.599693059921265,0.6040359458433461
277,11,AdaBoost (Real),1,0.65,0.7804359383306751,0.9822786963053242,27.51450753211975,0.0
278,11,Logistic Regression (Penalty = L2),1,0.65,0.7666135034556087,0.6169183639901882,0.49702000617980957,0.0
279,11,Naive Bayes,1,0.65,0.8543328017012227,0.9341766402374898,0.1421217918395996,0.9341766402374898
280,11,KNeighbors Classifier,2,0.65,0.3815859499733901,0.24113833184322783,4.1735687255859375,0.24113833184322783
281,11,SVC Classifier,2,0.65,0.3571048430015966,0.3455925591338455,3.059675455093384,0.0
282,11,Decision Tree,2,0.65,0.39010111761575306,0.33618638511192744,0.03522682189941406,0.0
283,11,RandomForest,2,0.65,0.30175625332623734,0.18999722543518244,0.16086363792419434,0.0
284,11,AdaBoost (Discrete),2,0.65,0.4624800425758382,0.3183169504735452,19.081441164016724,0.0
285,11,AdaBoost (Real),2,0.65,0.3677488025545503,0.784611766697512,23.310504913330078,0.0
286,11,Logistic Regression (Penalty = L2),2,0.65,0.37573177221926557,0.3696792591096666,0.3828766345977783,0.0
287,11,Naive Bayes,2,0.65,0.39861628525811604,0.39795049660148546,0.14431548118591309,0.39795049660148546
288,12,KNeighbors Classifier,0,0.65,0.7505307855626328,0.5741651924629163,1.0412476062774658,0.5741651924629163
289,12,SVC Classifier,0,0.65,0.692144373673036,0.6735857567000605,3.6797871589660645,0.0
290,12,Decision Tree,0,0.65,0.7361995753715499,0.873942562614331,0.03267979621887207,0.0
291,12,RandomForest,0,0.65,0.6390658174097664,0.7626296185110979,0.19308233261108398,0.0
292,12,AdaBoost (Discrete),0,0.65,0.8572186836518046,0.7448379828089507,12.80436372756958,0.0
293,12,AdaBoost (Real),0,0.65,0.3858811040339703,0.27862407792065225,19.432042121887207,0.0
294,12,Logistic Regression (Penalty = L2),0,0.65,0.7367303609341825,0.8741540685835897,0.3612813949584961,0.0
295,12,Naive Bayes,0,0.65,0.6926751592356688,0.7637543016892311,0.05687737464904785,0.7637543016892311
296,12,KNeighbors Classifier,1,0.65,0.8314726209463051,0.630559938829786,1.1944761276245117,0.630559938829786
297,12,SVC Classifier,1,0.65,0.7682083997873471,0.6177320829257733,3.7343928813934326,0.0
298,12,Decision Tree,1,0.65,0.7660818713450293,0.6166653730147104,0.024569272994995117,0.0
299,12,RandomForest,1,0.65,0.7416267942583732,0.9652415844392986,0.14123082160949707,0.0
300,12,AdaBoost (Discrete),1,0.65,0.8500797448165869,0.9079728657365319,14.218423128128052,0.0
301,12,AdaBoost (Real),1,0.65,0.7804359383306751,0.9822786963053242,18.592278242111206,0.0
302,12,Logistic Regression (Penalty = L2),1,0.65,0.7671451355661882,0.6171710441021402,0.34505796432495117,0.0
303,12,Naive Bayes,1,0.65,0.8649654439128124,0.9388998258529409,0.1044013500213623,0.9388998258529409
304,12,KNeighbors Classifier,2,0.65,0.4167110164981373,0.387502222816455,1.2216546535491943,0.387502222816455
305,12,SVC Classifier,2,0.65,0.3602980308674827,0.3466206166444903,1.4199762344360352,0.0
306,12,Decision Tree,2,0.65,0.37360298030867484,0.33542325328309514,0.030754566192626953,0.0
307,12,RandomForest,2,0.65,0.30175625332623734,0.18999722543518244,0.1623976230621338,0.0
308,12,AdaBoost (Discrete),2,0.65,0.40606705694518364,0.30745698380447123,13.325580358505249,0.30745698380447123
309,12,AdaBoost (Real),2,0.65,0.3677488025545503,0.784611766697512,18.587979793548584,0.0
310,12,Logistic Regression (Penalty = L2),2,0.65,0.3778605641298563,0.36918866219451113,0.24792742729187012,0.0
311,12,Naive Bayes,2,0.65,0.35923363491218735,0.35925312105676244,0.07893824577331543,0.35925312105676244
