,feat_set_id,classifier,fold_id,feat_th,score,geo_score,exec_t,geo_score_woz
0,0,KNeighbors Classifier,0,0.9,0.23237962316817865,0.3241026179339113,2.4834001064300537,0.0
1,0,SVC Classifier,0,0.9,0.19260293091416608,0.4324505806527439,24.88377285003662,0.0
2,0,Decision Tree,0,0.9,0.22609909281228194,0.32204168197240335,0.5775299072265625,0.0
3,0,RandomForest,0,0.9,0.22679692951849267,0.3116691526474305,1.8359324932098389,0.0
4,0,AdaBoost (Discrete),0,0.9,0.18911374738311235,0.2054154969105776,159.2852282524109,0.0
5,0,AdaBoost (Real),0,0.9,0.13677599441730634,0.18127731505521055,495.2509331703186,0.0
6,0,Logistic Regression (Penalty = L2),0,0.9,0.25889741800418703,0.27772327005977837,8.302224159240723,0.0
7,0,Naive Bayes,0,0.9,0.11025819958129798,0.42008104590613526,0.6860020160675049,0.0
8,0,KNeighbors Classifier,1,0.9,0.24261603375527427,0.3187636254231058,1.6412506103515625,0.0
9,0,SVC Classifier,1,0.9,0.2060478199718706,0.466216964029047,19.36422348022461,0.0
10,0,Decision Tree,1,0.9,0.22573839662447256,0.3207090910435684,0.37624526023864746,0.0
11,0,RandomForest,1,0.9,0.26230661040787623,0.37890879466712757,1.15427827835083,0.0
12,0,AdaBoost (Discrete),1,0.9,0.1940928270042194,0.2184405275050952,103.77923703193665,0.0
13,0,AdaBoost (Real),1,0.9,0.18706047819971872,0.2825988319995138,262.7959334850311,0.0
14,0,Logistic Regression (Penalty = L2),1,0.9,0.2609001406469761,0.25962104752645065,9.147229671478271,0.0
15,0,Naive Bayes,1,0.9,0.12517580872011252,0.3316600157502106,0.7146890163421631,0.0
16,0,KNeighbors Classifier,2,0.9,0.24575070821529746,0.3608246619939236,2.014707326889038,0.0
17,0,SVC Classifier,2,0.9,0.21104815864022664,0.45238108842369323,22.23396897315979,0.0
18,0,Decision Tree,2,0.9,0.23158640226628896,0.3105242467557784,0.48993396759033203,0.0
19,0,RandomForest,2,0.9,0.25920679886685555,0.27417944019604146,1.4760863780975342,0.0
20,0,AdaBoost (Discrete),2,0.9,0.22025495750708216,0.2753421952173761,132.03344678878784,0.0
21,0,AdaBoost (Real),2,0.9,0.19688385269121814,0.21131882956920686,271.0367751121521,0.0
22,0,Logistic Regression (Penalty = L2),2,0.9,0.26770538243626063,0.2445419811901919,8.542616128921509,0.0
23,0,Naive Bayes,2,0.9,0.12677053824362605,0.4824974367033395,0.7661786079406738,0.0
24,1,KNeighbors Classifier,0,0.9,0.2226099092812282,0.3631516100807486,1.7109370231628418,0.0
25,1,SVC Classifier,0,0.9,0.19190509420795535,0.4314236531036202,20.583050966262817,0.0
26,1,Decision Tree,0,0.9,0.20725750174459176,0.30953365951407635,0.4879124164581299,0.0
27,1,RandomForest,0,0.9,0.23796231681786462,0.338745384824693,1.5267300605773926,0.0
28,1,AdaBoost (Discrete),0,0.9,0.2016748080949058,0.23448391324346876,134.81460428237915,0.0
29,1,AdaBoost (Real),0,0.9,0.18422889043963714,0.1720553017869783,301.27047967910767,0.0
30,1,Logistic Regression (Penalty = L2),0,0.9,0.25471039776692256,0.27397259112827593,12.29641580581665,0.0
31,1,Naive Bayes,0,0.9,0.12281926029309141,0.3639976606048019,0.977769136428833,0.0
32,1,KNeighbors Classifier,1,0.9,0.22855133614627285,0.32605017545439047,2.321624994277954,0.0
33,1,SVC Classifier,1,0.9,0.20464135021097046,0.46317963374296567,27.294602632522583,0.0
34,1,Decision Tree,1,0.9,0.21026722925457103,0.3079426565180035,0.6594765186309814,0.0
35,1,RandomForest,1,0.9,0.26230661040787623,0.23792184775078604,2.3177683353424072,0.0
36,1,AdaBoost (Discrete),1,0.9,0.20745428973277075,0.27621266214260154,195.0122034549713,0.0
37,1,AdaBoost (Real),1,0.9,0.2489451476793249,0.360912763985535,331.29096126556396,0.0
38,1,Logistic Regression (Penalty = L2),1,0.9,0.2580872011251758,0.2848023381644904,11.291763544082642,0.0
39,1,Naive Bayes,1,0.9,0.1518987341772152,0.31650560499463226,0.9101138114929199,0.0
40,1,KNeighbors Classifier,2,0.9,0.22804532577903683,0.32932183898240547,1.9083738327026367,0.0
41,1,SVC Classifier,2,0.9,0.20892351274787535,0.38738149794949894,23.930583238601685,0.0
42,1,Decision Tree,2,0.9,0.22804532577903683,0.3958812550740346,0.6099774837493896,0.0
43,1,RandomForest,2,0.9,0.2514164305949009,0.2879151733578421,1.9395341873168945,0.0
44,1,AdaBoost (Discrete),2,0.9,0.19688385269121814,0.21025322797474846,164.30493068695068,0.0
45,1,AdaBoost (Real),2,0.9,0.23441926345609065,0.34396545582060123,359.25871086120605,0.0
46,1,Logistic Regression (Penalty = L2),2,0.9,0.26628895184135976,0.3285098038623923,13.147292852401733,0.0
47,1,Naive Bayes,2,0.9,0.14022662889518414,0.5098105645008425,0.8860619068145752,0.0
48,2,KNeighbors Classifier,0,0.9,0.2226099092812282,0.3631516100807486,2.5342180728912354,0.0
49,2,SVC Classifier,0,0.9,0.19399860432658758,0.1548372960493099,27.796475648880005,0.0
50,2,Decision Tree,0,0.9,0.20655966503838102,0.27360289699540535,0.5100078582763672,0.0
51,2,RandomForest,0,0.9,0.23796231681786462,0.338745384824693,1.9482812881469727,0.0
52,2,AdaBoost (Discrete),0,0.9,0.2044661549197488,0.22617501764731365,195.35534143447876,0.0
53,2,AdaBoost (Real),0,0.9,0.18422889043963714,0.1720553017869783,369.30416464805603,0.0
54,2,Logistic Regression (Penalty = L2),0,0.9,0.2595952547103978,0.30050913075215585,13.911221981048584,0.0
55,2,Naive Bayes,0,0.9,0.12002791346824843,0.36560886753031746,1.0337605476379395,0.0
56,2,KNeighbors Classifier,1,0.9,0.22855133614627285,0.32605017545439047,3.1019561290740967,0.0
57,2,SVC Classifier,1,0.9,0.19971870604781997,0.42670469190975346,29.644207239151,0.0
58,2,Decision Tree,1,0.9,0.22855133614627285,0.37935898854854466,0.7756795883178711,0.0
59,2,RandomForest,1,0.9,0.26230661040787623,0.23792184775078604,2.0120491981506348,0.0
60,2,AdaBoost (Discrete),1,0.9,0.2222222222222222,0.2987769897474662,155.35446310043335,0.0
61,2,AdaBoost (Real),1,0.9,0.2489451476793249,0.360912763985535,351.09243607521057,0.0
62,2,Logistic Regression (Penalty = L2),1,0.9,0.25949367088607594,0.3758328567909213,12.686785697937012,0.0
63,2,Naive Bayes,1,0.9,0.13853727144866385,0.29212298381175855,0.9721095561981201,0.0
64,2,KNeighbors Classifier,2,0.9,0.22804532577903683,0.32932183898240547,2.540501117706299,0.0
65,2,SVC Classifier,2,0.9,0.20325779036827196,0.40507692906022097,27.1578426361084,0.0
66,2,Decision Tree,2,0.9,0.22804532577903683,0.35497938977699744,0.48996663093566895,0.0
67,2,RandomForest,2,0.9,0.2514164305949009,0.2879151733578421,1.9779486656188965,0.0
68,2,AdaBoost (Discrete),2,0.9,0.18342776203966005,0.20942347814361364,178.35539531707764,0.0
69,2,AdaBoost (Real),2,0.9,0.23441926345609065,0.34396545582060123,300.1048128604889,0.0
70,2,Logistic Regression (Penalty = L2),2,0.9,0.2754957507082153,0.2818517547535095,10.309403896331787,0.0
71,2,Naive Bayes,2,0.9,0.1281869688385269,0.4764460326316816,0.6982567310333252,0.0
72,3,KNeighbors Classifier,0,0.9,0.23237962316817865,0.3241026179339113,1.8159847259521484,0.0
73,3,SVC Classifier,0,0.9,0.19190509420795535,0.4314236531036202,22.672537803649902,0.0
74,3,Decision Tree,0,0.9,0.21702721563154223,0.3091465901121562,0.4071834087371826,0.0
75,3,RandomForest,0,0.9,0.24284717376133985,0.3476025472416254,1.6851108074188232,0.0
76,3,AdaBoost (Discrete),0,0.9,0.21144452198185626,0.2291975843266518,158.43645334243774,0.0
77,3,AdaBoost (Real),0,0.9,0.13189113747383113,0.16527856187702072,339.9685609340668,0.0
78,3,Logistic Regression (Penalty = L2),0,0.9,0.2575017445917655,0.28905606774301795,9.680588245391846,0.0
79,3,Naive Bayes,0,0.9,0.1151430565247732,0.4063528158147496,0.8786356449127197,0.0
80,3,KNeighbors Classifier,1,0.9,0.24261603375527427,0.3187636254231058,2.1939144134521484,0.0
81,3,SVC Classifier,1,0.9,0.19971870604781997,0.45182066369223506,26.478065252304077,0.0
82,3,Decision Tree,1,0.9,0.23417721518987342,0.3548969391825539,0.4998598098754883,0.0
83,3,RandomForest,1,0.9,0.270042194092827,0.39986149360362055,1.8009228706359863,0.0
84,3,AdaBoost (Discrete),1,0.9,0.18846694796061886,0.20944858975748404,160.58946990966797,0.0
85,3,AdaBoost (Real),1,0.9,0.18635724331926865,0.27014981041451236,347.27154779434204,0.0
86,3,Logistic Regression (Penalty = L2),1,0.9,0.25246132208157523,0.253222248009778,11.545472145080566,0.0
87,3,Naive Bayes,1,0.9,0.13642756680731363,0.38243509407980336,0.6157422065734863,0.0
88,3,KNeighbors Classifier,2,0.9,0.24575070821529746,0.3608246619939236,1.8933334350585938,0.0
89,3,SVC Classifier,2,0.9,0.2096317280453258,0.3881970403523826,23.510896921157837,0.0
90,3,Decision Tree,2,0.9,0.23087818696883852,0.3309871572009877,0.4513733386993408,0.0
91,3,RandomForest,2,0.9,0.26416430594900847,0.32224728604955916,1.8633174896240234,0.0
92,3,AdaBoost (Discrete),2,0.9,0.1954674220963173,0.23144631989347564,164.77974271774292,0.0
93,3,AdaBoost (Real),2,0.9,0.19688385269121814,0.21131882956920686,299.88978457450867,0.0
94,3,Logistic Regression (Penalty = L2),2,0.9,0.2719546742209632,0.27066986949908683,9.311423540115356,0.0
95,3,Naive Bayes,2,0.9,0.14093484419263455,0.5168424873442508,0.7587015628814697,0.0
96,4,KNeighbors Classifier,0,0.9,0.23237962316817865,0.3241026179339113,1.748791217803955,0.0
97,4,SVC Classifier,0,0.9,0.19330076762037685,0.15428919082585568,20.79525899887085,0.0
98,4,Decision Tree,0,0.9,0.21772505233775297,0.3288924341658538,0.44385671615600586,0.0
99,4,RandomForest,0,0.9,0.24284717376133985,0.3476025472416254,1.492262840270996,0.0
100,4,AdaBoost (Discrete),0,0.9,0.21912072575017447,0.2045982825396136,137.4432771205902,0.0
101,4,AdaBoost (Real),0,0.9,0.15631542219120725,0.15811141475794696,308.716677904129,0.0
102,4,Logistic Regression (Penalty = L2),0,0.9,0.26099092812281927,0.30070091878416155,10.51330828666687,0.0
103,4,Naive Bayes,0,0.9,0.10816468946266573,0.31673763340970557,0.9545943737030029,0.0
104,4,KNeighbors Classifier,1,0.9,0.24261603375527427,0.3187636254231058,2.0309083461761475,0.0
105,4,SVC Classifier,1,0.9,0.20182841068917018,0.42366236652194333,23.54880952835083,0.0
106,4,Decision Tree,1,0.9,0.22081575246132207,0.29442799445989787,0.4271407127380371,0.0
107,4,RandomForest,1,0.9,0.270042194092827,0.39986149360362055,1.5488903522491455,0.0
108,4,AdaBoost (Discrete),1,0.9,0.21308016877637131,0.2775702177073804,149.71594953536987,0.0
109,4,AdaBoost (Real),1,0.9,0.1849507735583685,0.3686381278780973,297.72446751594543,0.0
110,4,Logistic Regression (Penalty = L2),1,0.9,0.25246132208157523,0.2531371231526231,9.113165616989136,0.0
111,4,Naive Bayes,1,0.9,0.12517580872011252,0.35602185204186376,0.703040361404419,0.0
112,4,KNeighbors Classifier,2,0.9,0.24575070821529746,0.3608246619939236,1.578587532043457,0.0
113,4,SVC Classifier,2,0.9,0.20254957507082152,0.40175647701927175,22.115415573120117,0.0
114,4,Decision Tree,2,0.9,0.23229461756373937,0.2965121209128527,0.400545597076416,0.0
115,4,RandomForest,2,0.9,0.26416430594900847,0.32224728604955916,1.5006697177886963,0.0
116,4,AdaBoost (Discrete),2,0.9,0.2075070821529745,0.32353567311565445,167.03350734710693,0.0
117,4,AdaBoost (Real),2,0.9,0.19688385269121814,0.21131882956920686,1303.4579672813416,0.0
118,4,Logistic Regression (Penalty = L2),2,0.9,0.2769121813031161,0.295524133009239,7.248202323913574,0.0
119,4,Naive Bayes,2,0.9,0.13314447592067988,0.5015957487959387,0.606245756149292,0.0
120,5,KNeighbors Classifier,0,0.9,0.2184228890439637,0.3181775380611094,1.2506580352783203,0.0
121,5,SVC Classifier,0,0.9,0.19190509420795535,0.39303848426646787,14.780031442642212,0.0
122,5,Decision Tree,0,0.9,0.2107466852756455,0.3065397736495326,0.36976194381713867,0.0
123,5,RandomForest,0,0.9,0.22609909281228194,0.317925363463434,0.9241108894348145,0.0
124,5,AdaBoost (Discrete),0,0.9,0.19469644103279832,0.18576544443336873,111.67740631103516,0.0
125,5,AdaBoost (Real),0,0.9,0.18422889043963714,0.1720553017869783,221.03110814094543,0.0
126,5,Logistic Regression (Penalty = L2),0,0.9,0.25819958129797627,0.3209722389905132,6.791566848754883,0.0
127,5,Naive Bayes,0,0.9,0.12281926029309141,0.3580055979679453,0.5391685962677002,0.0
128,5,KNeighbors Classifier,1,0.9,0.23769338959212377,0.3646090443558148,1.217843770980835,0.0
129,5,SVC Classifier,1,0.9,0.19760900140646975,0.4089189766284999,15.031214714050293,0.0
130,5,Decision Tree,1,0.9,0.20182841068917018,0.3065418513535482,0.30692219734191895,0.0
131,5,RandomForest,1,0.9,0.2630098452883263,0.3066775961163903,1.255979299545288,0.0
132,5,AdaBoost (Discrete),1,0.9,0.2011251758087201,0.2675937735675945,102.79635620117188,0.0
133,5,AdaBoost (Real),1,0.9,0.2489451476793249,0.360912763985535,209.59924221038818,0.0
134,5,Logistic Regression (Penalty = L2),1,0.9,0.2609001406469761,0.31848259307549626,6.048601150512695,0.0
135,5,Naive Bayes,1,0.9,0.1469760900140647,0.32243399701963005,0.47356605529785156,0.0
136,5,KNeighbors Classifier,2,0.9,0.23158640226628896,0.31965292648847476,1.260988473892212,0.0
137,5,SVC Classifier,2,0.9,0.20113314447592068,0.2769728339712204,13.809505939483643,0.0
138,5,Decision Tree,2,0.9,0.22096317280453256,0.3218678923159844,0.38143467903137207,0.0
139,5,RandomForest,2,0.9,0.26345609065155806,0.32403607223057607,1.0539932250976562,0.0
140,5,AdaBoost (Discrete),2,0.9,0.20254957507082152,0.24244830999282563,99.33416676521301,0.0
141,5,AdaBoost (Real),2,0.9,0.23441926345609065,0.34396545582060123,207.16254663467407,0.0
142,5,Logistic Regression (Penalty = L2),2,0.9,0.26841359773371104,0.2763823351610961,5.9471330642700195,0.0
143,5,Naive Bayes,2,0.9,0.14730878186968838,0.5208827329742904,0.5272114276885986,0.0
144,6,KNeighbors Classifier,0,0.9,0.2226099092812282,0.3631516100807486,1.2808454036712646,0.0
145,6,SVC Classifier,0,0.9,0.19330076762037685,0.43374535059637953,15.354003667831421,0.0
146,6,Decision Tree,0,0.9,0.19888346127006282,0.2830566470040067,0.2714252471923828,0.0
147,6,RandomForest,0,0.9,0.24982554082344732,0.3505014716300752,1.1002848148345947,0.0
148,6,AdaBoost (Discrete),0,0.9,0.18143754361479414,0.2259050340650982,99.62010216712952,0.0
149,6,AdaBoost (Real),0,0.9,0.18422889043963714,0.1720553017869783,194.0328540802002,0.0
150,6,Logistic Regression (Penalty = L2),0,0.9,0.26238660153524074,0.2785500010128073,5.980973482131958,0.0
151,6,Naive Bayes,0,0.9,0.11793440334961619,0.36400916640364633,0.5472228527069092,0.0
152,6,KNeighbors Classifier,1,0.9,0.22855133614627285,0.32605017545439047,1.1870365142822266,0.0
153,6,SVC Classifier,1,0.9,0.20675105485232068,0.46640548688179284,13.163854837417603,0.0
154,6,Decision Tree,1,0.9,0.22925457102672292,0.3386449775336693,0.2534341812133789,0.0
155,6,RandomForest,1,0.9,0.2510548523206751,0.2315734078860657,0.9904367923736572,0.0
156,6,AdaBoost (Discrete),1,0.9,0.21870604781997188,0.2649153167940288,96.60558104515076,0.0
157,6,AdaBoost (Real),1,0.9,0.2489451476793249,0.360912763985535,198.3203103542328,0.0
158,6,Logistic Regression (Penalty = L2),1,0.9,0.25668073136427566,0.37878550656642507,6.474404335021973,0.0
159,6,Naive Bayes,1,0.9,0.13853727144866385,0.29608488936827176,0.5304794311523438,0.0
160,6,KNeighbors Classifier,2,0.9,0.22804532577903683,0.32932183898240547,1.5766634941101074,0.0
161,6,SVC Classifier,2,0.9,0.21104815864022664,0.45368823166620964,15.873080253601074,0.0
162,6,Decision Tree,2,0.9,0.22875354107648727,0.32754763306932383,0.24765634536743164,0.0
163,6,RandomForest,2,0.9,0.26487252124645894,0.31656346706255484,1.092081069946289,0.0
164,6,AdaBoost (Discrete),2,0.9,0.18909348441926346,0.19398972378049192,93.96133375167847,0.0
165,6,AdaBoost (Real),2,0.9,0.23441926345609065,0.34396545582060123,175.43205976486206,0.0
166,6,Logistic Regression (Penalty = L2),2,0.9,0.26628895184135976,0.2526326450785386,5.058425664901733,0.0
167,6,Naive Bayes,2,0.9,0.12677053824362605,0.4911428114748987,0.4359745979309082,0.0
168,7,KNeighbors Classifier,0,0.9,0.2226099092812282,0.3631516100807486,0.9083425998687744,0.0
169,7,SVC Classifier,0,0.9,0.19330076762037685,0.43374535059637953,11.561521530151367,0.0
170,7,Decision Tree,0,0.9,0.21144452198185626,0.3185066037051472,0.21889710426330566,0.0
171,7,RandomForest,0,0.9,0.24982554082344732,0.3505014716300752,0.7212424278259277,0.0
172,7,AdaBoost (Discrete),0,0.9,0.18143754361479414,0.2259050340650982,81.77516317367554,0.0
173,7,AdaBoost (Real),0,0.9,0.18422889043963714,0.1720553017869783,159.67437934875488,0.0
174,7,Logistic Regression (Penalty = L2),0,0.9,0.26238660153524074,0.2785500010128073,4.999131202697754,0.0
175,7,Naive Bayes,0,0.9,0.11793440334961619,0.36400916640364633,0.47116756439208984,0.0
176,7,KNeighbors Classifier,1,0.9,0.22855133614627285,0.32605017545439047,1.1924045085906982,0.0
177,7,SVC Classifier,1,0.9,0.20675105485232068,0.46640548688179284,12.509098052978516,0.0
178,7,Decision Tree,1,0.9,0.20464135021097046,0.3487641269103188,0.23531198501586914,0.0
179,7,RandomForest,1,0.9,0.2510548523206751,0.2315734078860657,0.9665088653564453,0.0
180,7,AdaBoost (Discrete),1,0.9,0.2180028129395218,0.28510827773804975,82.43047022819519,0.0
181,7,AdaBoost (Real),1,0.9,0.2489451476793249,0.360912763985535,157.8707127571106,0.0
182,7,Logistic Regression (Penalty = L2),1,0.9,0.25668073136427566,0.37878550656642507,5.120031356811523,0.0
183,7,Naive Bayes,1,0.9,0.13853727144866385,0.29608488936827176,0.4824035167694092,0.0
184,7,KNeighbors Classifier,2,0.9,0.22804532577903683,0.32932183898240547,0.9283623695373535,0.0
185,7,SVC Classifier,2,0.9,0.21104815864022664,0.45368823166620964,11.87040638923645,0.0
186,7,Decision Tree,2,0.9,0.21813031161473087,0.2974479752383228,0.22668051719665527,0.0
187,7,RandomForest,2,0.9,0.26487252124645894,0.31656346706255484,0.769479513168335,0.0
188,7,AdaBoost (Discrete),2,0.9,0.18909348441926346,0.19398972378049192,78.18869471549988,0.0
189,7,AdaBoost (Real),2,0.9,0.23441926345609065,0.34396545582060123,164.92290115356445,0.0
190,7,Logistic Regression (Penalty = L2),2,0.9,0.26628895184135976,0.2526326450785386,5.470193386077881,0.0
191,7,Naive Bayes,2,0.9,0.12677053824362605,0.4911428114748987,0.4751574993133545,0.0
192,8,KNeighbors Classifier,0,0.9,0.23098394975575715,0.28438467217109864,0.8936879634857178,0.0
193,8,SVC Classifier,0,0.9,0.19190509420795535,0.39303848426646787,11.108985900878906,0.0
194,8,Decision Tree,0,0.9,0.22191207257501744,0.28423875253560144,0.15699243545532227,0.0
195,8,RandomForest,0,0.9,0.2477320307048151,0.3241070009245024,0.8021421432495117,0.0
196,8,AdaBoost (Discrete),0,0.9,0.212142358688067,0.23014316107902272,77.88295674324036,0.0
197,8,AdaBoost (Real),0,0.9,0.159804605722261,0.1710934878169199,161.23070740699768,0.0
198,8,Logistic Regression (Penalty = L2),0,0.9,0.26378227494766227,0.2785947197797679,4.295899868011475,0.0
199,8,Naive Bayes,0,0.9,0.1137473831123517,0.32412580075067815,0.32772350311279297,0.0
200,8,KNeighbors Classifier,1,0.9,0.25246132208157523,0.35040592301830276,0.7582204341888428,0.0
201,8,SVC Classifier,1,0.9,0.19549929676511954,0.38936724461271216,10.147584438323975,0.0
202,8,Decision Tree,1,0.9,0.21378340365682139,0.3132430920658748,0.22950077056884766,0.0
203,8,RandomForest,1,0.9,0.26652601969057665,0.2983362911071126,0.8167624473571777,0.0
204,8,AdaBoost (Discrete),1,0.9,0.1877637130801688,0.22067460816724999,75.95729732513428,0.0
205,8,AdaBoost (Real),1,0.9,0.18706047819971872,0.2825988319995138,150.87077975273132,0.0
206,8,Logistic Regression (Penalty = L2),1,0.9,0.26441631504922647,0.31205774080568244,4.277677536010742,0.0
207,8,Naive Bayes,1,0.9,0.14135021097046413,0.39172712902430207,0.3838918209075928,0.0
208,8,KNeighbors Classifier,2,0.9,0.24362606232294617,0.3433067263453845,0.7447865009307861,0.0
209,8,SVC Classifier,2,0.9,0.20113314447592068,0.2769728339712204,10.521625518798828,0.0
210,8,Decision Tree,2,0.9,0.21458923512747877,0.308271385080285,0.2323436737060547,0.0
211,8,RandomForest,2,0.9,0.26203966005665724,0.29853878025837627,0.6861248016357422,0.0
212,8,AdaBoost (Discrete),2,0.9,0.2245042492917847,0.22028265370903471,74.3203399181366,0.0
213,8,AdaBoost (Real),2,0.9,0.19688385269121814,0.21131882956920686,155.9678566455841,0.0
214,8,Logistic Regression (Penalty = L2),2,0.9,0.2719546742209632,0.2789361645546864,4.876940488815308,0.0
215,8,Naive Bayes,2,0.9,0.14660056657223797,0.5135415486338903,0.5054061412811279,0.0
