,feat_set_id,classifier,fold_id,feat_th,score,geo_score,exec_t,geo_score_woz
0,0,KNeighbors Classifier,0,0.7,0.6094674556213018,0.6865963427206895,5.53053879737854,0.6865963427206895
1,0,SVC Classifier,0,0.7,0.6094674556213018,0.43836710608902335,5.792514324188232,0.43836710608902335
2,0,Decision Tree,0,0.7,0.5029585798816568,0.6037804777773466,0.2856740951538086,0.6037804777773466
3,0,RandomForest,0,0.7,0.5976331360946746,0.2438093199376099,1.602595567703247,0.2438093199376099
4,0,AdaBoost (Discrete),0,0.7,0.5621301775147929,0.4645323017712207,132.68666648864746,0.4645323017712207
5,0,AdaBoost (Real),0,0.7,0.6449704142011834,0.6929423248381497,136.37847447395325,0.6929423248381497
6,0,Logistic Regression (Penalty = L2),0,0.7,0.5857988165680473,0.681866975476474,1.4332499504089355,0.681866975476474
7,0,Naive Bayes,0,0.7,0.47337278106508873,0.525271256626669,0.4709811210632324,0.525271256626669
8,0,KNeighbors Classifier,1,0.7,0.5833333333333334,0.6755972550746026,5.866870880126953,0.6755972550746026
9,0,SVC Classifier,1,0.7,0.5892857142857143,0.9947780321927768,5.820434808731079,0.0
10,0,Decision Tree,1,0.7,0.5297619047619048,0.5965694755053284,0.2763974666595459,0.5965694755053284
11,0,RandomForest,1,0.7,0.5952380952380952,1.0,1.247596263885498,0.0
12,0,AdaBoost (Discrete),1,0.7,0.47023809523809523,0.5863522299844699,123.65466499328613,0.5863522299844699
13,0,AdaBoost (Real),1,0.7,0.5416666666666666,0.6325234519700399,126.06640028953552,0.6325234519700399
14,0,Logistic Regression (Penalty = L2),1,0.7,0.5833333333333334,0.6566096690099397,0.6571786403656006,0.6566096690099397
15,0,Naive Bayes,1,0.7,0.5059523809523809,0.5717329581629295,0.5381937026977539,0.5717329581629295
16,0,KNeighbors Classifier,2,0.7,0.5389221556886228,0.6398408860731518,5.968920469284058,0.6398408860731518
17,0,SVC Classifier,2,0.7,0.6107784431137725,0.46206375934610827,5.402880668640137,0.46206375934610827
18,0,Decision Tree,2,0.7,0.5748502994011976,0.665259491025205,0.2789905071258545,0.665259491025205
19,0,RandomForest,2,0.7,0.592814371257485,1.0,1.1257944107055664,0.0
20,0,AdaBoost (Discrete),2,0.7,0.4311377245508982,0.5135200123124198,113.11543917655945,0.5135200123124198
21,0,AdaBoost (Real),2,0.7,0.5568862275449101,0.6387163830770992,112.16098356246948,0.6387163830770992
22,0,Logistic Regression (Penalty = L2),2,0.7,0.5449101796407185,0.6399655870870427,0.5562200546264648,0.6399655870870427
23,0,Naive Bayes,2,0.7,0.5029940119760479,0.5836666096061082,0.47500038146972656,0.5836666096061082
24,1,KNeighbors Classifier,0,0.7,0.621301775147929,0.7168415455428754,3.7528231143951416,0.7168415455428754
25,1,SVC Classifier,0,0.7,0.6094674556213018,0.4790016600325024,4.293781280517578,0.4790016600325024
26,1,Decision Tree,0,0.7,0.6449704142011834,0.7270752453398629,0.15286493301391602,0.7270752453398629
27,1,RandomForest,0,0.7,0.591715976331361,1.0,1.086864948272705,0.0
28,1,AdaBoost (Discrete),0,0.7,0.4319526627218935,0.5039937794115199,98.64690923690796,0.5039937794115199
29,1,AdaBoost (Real),0,0.7,0.5798816568047337,0.6690734264093232,105.69302248954773,0.6690734264093232
30,1,Logistic Regression (Penalty = L2),0,0.7,0.6449704142011834,0.7211247851537042,0.43766260147094727,0.7211247851537042
31,1,Naive Bayes,0,0.7,0.48520710059171596,0.4926459905662744,0.4422309398651123,0.4926459905662744
32,1,KNeighbors Classifier,1,0.7,0.6011904761904762,0.7085339911425566,4.309040784835815,0.7085339911425566
33,1,SVC Classifier,1,0.7,0.5952380952380952,1.0,4.19655704498291,0.0
34,1,Decision Tree,1,0.7,0.5892857142857143,0.6723372508717325,0.14948272705078125,0.6723372508717325
35,1,RandomForest,1,0.7,0.5952380952380952,1.0,1.1403555870056152,0.0
36,1,AdaBoost (Discrete),1,0.7,0.48214285714285715,0.5131324498917512,95.71462941169739,0.5131324498917512
37,1,AdaBoost (Real),1,0.7,0.5,0.6210866594767364,104.30178117752075,0.6210866594767364
38,1,Logistic Regression (Penalty = L2),1,0.7,0.6369047619047619,0.7353738475635089,0.5222859382629395,0.7353738475635089
39,1,Naive Bayes,1,0.7,0.47023809523809523,0.49794911558783184,0.4554722309112549,0.49794911558783184
40,1,KNeighbors Classifier,2,0.7,0.5688622754491018,0.6541130301896597,4.473767280578613,0.6541130301896597
41,1,SVC Classifier,2,0.7,0.6107784431137725,0.48133829047370646,4.1940600872039795,0.48133829047370646
42,1,Decision Tree,2,0.7,0.5449101796407185,0.6318846680049235,0.2981529235839844,0.6318846680049235
43,1,RandomForest,2,0.7,0.592814371257485,1.0,1.2638707160949707,0.0
44,1,AdaBoost (Discrete),2,0.7,0.40119760479041916,0.5024390629888897,105.47475504875183,0.5024390629888897
45,1,AdaBoost (Real),2,0.7,0.5029940119760479,0.6192279024801866,110.48345446586609,0.6192279024801866
46,1,Logistic Regression (Penalty = L2),2,0.7,0.6167664670658682,0.7226924526638673,0.4504878520965576,0.7226924526638673
47,1,Naive Bayes,2,0.7,0.46107784431137727,0.5137135743406683,0.404022216796875,0.5137135743406683
48,2,KNeighbors Classifier,0,0.7,0.6331360946745562,0.6958644053539709,5.970976829528809,0.6958644053539709
49,2,SVC Classifier,0,0.7,0.6094674556213018,0.43836710608902335,6.025399446487427,0.43836710608902335
50,2,Decision Tree,0,0.7,0.5502958579881657,0.6227779385788268,0.3037905693054199,0.6227779385788268
51,2,RandomForest,0,0.7,0.591715976331361,1.0,1.210813045501709,0.0
52,2,AdaBoost (Discrete),0,0.7,0.47337278106508873,0.5169322055188552,149.48603343963623,0.5169322055188552
53,2,AdaBoost (Real),0,0.7,0.621301775147929,0.6933612743506347,129.53392910957336,0.6933612743506347
54,2,Logistic Regression (Penalty = L2),0,0.7,0.6094674556213018,0.6742049002196551,0.7144782543182373,0.6742049002196551
55,2,Naive Bayes,0,0.7,0.4556213017751479,0.5163666337264373,0.6381552219390869,0.5163666337264373
56,2,KNeighbors Classifier,1,0.7,0.5892857142857143,0.6877935871362589,8.540700674057007,0.6877935871362589
57,2,SVC Classifier,1,0.7,0.5892857142857143,0.9947780321927768,8.446701288223267,0.0
58,2,Decision Tree,1,0.7,0.5416666666666666,0.6582636046344142,0.38947200775146484,0.6582636046344142
59,2,RandomForest,1,0.7,0.5892857142857143,0.9947780321927768,1.841475248336792,0.0
60,2,AdaBoost (Discrete),1,0.7,0.5059523809523809,0.6309881948359818,136.36342239379883,0.6309881948359818
61,2,AdaBoost (Real),1,0.7,0.5773809523809523,0.6575557937609745,113.1295268535614,0.6575557937609745
62,2,Logistic Regression (Penalty = L2),1,0.7,0.5773809523809523,0.6615467691941467,0.11781716346740723,0.6615467691941467
63,2,Naive Bayes,1,0.7,0.44642857142857145,0.5267316437316311,0.12755346298217773,0.5267316437316311
64,2,KNeighbors Classifier,2,0.7,0.5508982035928144,0.6435609748144865,4.691464900970459,0.6435609748144865
65,2,SVC Classifier,2,0.7,0.6107784431137725,0.46206375934610827,6.233258962631226,0.46206375934610827
66,2,Decision Tree,2,0.7,0.6167664670658682,0.6759327056039406,0.32610368728637695,0.6759327056039406
67,2,RandomForest,2,0.7,0.592814371257485,1.0,1.1534786224365234,0.0
68,2,AdaBoost (Discrete),2,0.7,0.4311377245508982,0.5135200123124198,120.42405605316162,0.5135200123124198
69,2,AdaBoost (Real),2,0.7,0.5209580838323353,0.6090747909993272,122.72198820114136,0.6090747909993272
70,2,Logistic Regression (Penalty = L2),2,0.7,0.5508982035928144,0.6472385459285428,0.6824464797973633,0.6472385459285428
71,2,Naive Bayes,2,0.7,0.46107784431137727,0.5489690621400171,0.6028275489807129,0.5489690621400171
72,3,KNeighbors Classifier,0,0.7,0.6094674556213018,0.7136940119343756,4.415205240249634,0.7136940119343756
73,3,SVC Classifier,0,0.7,0.6094674556213018,0.4790016600325024,4.125565528869629,0.4790016600325024
74,3,Decision Tree,0,0.7,0.6094674556213018,0.6966947932603809,0.15313148498535156,0.6966947932603809
75,3,RandomForest,0,0.7,0.591715976331361,1.0,1.134812593460083,0.0
76,3,AdaBoost (Discrete),0,0.7,0.4437869822485207,0.5024038831075965,102.08077645301819,0.5024038831075965
77,3,AdaBoost (Real),0,0.7,0.6035502958579881,0.7048919545997862,104.70955061912537,0.7048919545997862
78,3,Logistic Regression (Penalty = L2),0,0.7,0.6331360946745562,0.7245917845327045,0.3913898468017578,0.7245917845327045
79,3,Naive Bayes,0,0.7,0.4970414201183432,0.4975727773091722,0.2819688320159912,0.4975727773091722
80,3,KNeighbors Classifier,1,0.7,0.6071428571428571,0.7128809341859169,3.9246132373809814,0.7128809341859169
81,3,SVC Classifier,1,0.7,0.5952380952380952,1.0,4.115322113037109,0.0
82,3,Decision Tree,1,0.7,0.5773809523809523,0.6897310440952802,0.1413888931274414,0.6897310440952802
83,3,RandomForest,1,0.7,0.5952380952380952,1.0,1.1366519927978516,0.0
84,3,AdaBoost (Discrete),1,0.7,0.5059523809523809,0.6255550624586929,95.32861685752869,0.6255550624586929
85,3,AdaBoost (Real),1,0.7,0.47619047619047616,0.5997093726840049,99.94367289543152,0.5997093726840049
86,3,Logistic Regression (Penalty = L2),1,0.7,0.6785714285714286,0.7668655352247103,0.402834415435791,0.7668655352247103
87,3,Naive Bayes,1,0.7,0.5119047619047619,0.5263632998046983,0.2782909870147705,0.5263632998046983
88,3,KNeighbors Classifier,2,0.7,0.5389221556886228,0.6325234519700399,3.709089517593384,0.6325234519700399
89,3,SVC Classifier,2,0.7,0.6107784431137725,0.48133829047370646,4.2509260177612305,0.48133829047370646
90,3,Decision Tree,2,0.7,0.5329341317365269,0.6360770290723415,0.13460898399353027,0.6360770290723415
91,3,RandomForest,2,0.7,0.592814371257485,0.24414499175196025,1.2929306030273438,0.24414499175196025
92,3,AdaBoost (Discrete),2,0.7,0.40119760479041916,0.5024390629888897,103.8208601474762,0.5024390629888897
93,3,AdaBoost (Real),2,0.7,0.5508982035928144,0.6566096690099397,104.10717606544495,0.6566096690099397
94,3,Logistic Regression (Penalty = L2),2,0.7,0.6407185628742516,0.7431289652046819,0.3886752128601074,0.7431289652046819
95,3,Naive Bayes,2,0.7,0.48502994011976047,0.525070018672476,0.37561678886413574,0.525070018672476
96,4,KNeighbors Classifier,0,0.7,0.621301775147929,0.7038777201707385,5.4606709480285645,0.7038777201707385
97,4,SVC Classifier,0,0.7,0.6094674556213018,0.43836710608902335,5.502275228500366,0.43836710608902335
98,4,Decision Tree,0,0.7,0.6035502958579881,0.6614554457847597,0.2866363525390625,0.6614554457847597
99,4,RandomForest,0,0.7,0.591715976331361,1.0,1.084230661392212,0.0
100,4,AdaBoost (Discrete),0,0.7,0.5976331360946746,0.5227053407627217,119.09190249443054,0.5227053407627217
101,4,AdaBoost (Real),0,0.7,0.5857988165680473,0.6520047870628164,123.3476197719574,0.6520047870628164
102,4,Logistic Regression (Penalty = L2),0,0.7,0.5857988165680473,0.681866975476474,0.5902636051177979,0.681866975476474
103,4,Naive Bayes,0,0.7,0.47337278106508873,0.525271256626669,0.6045730113983154,0.525271256626669
104,4,KNeighbors Classifier,1,0.7,0.5892857142857143,0.6851932084829357,5.968575477600098,0.6851932084829357
105,4,SVC Classifier,1,0.7,0.5892857142857143,0.9947780321927768,5.921456336975098,0.0
106,4,Decision Tree,1,0.7,0.6011904761904762,0.7003016573669929,0.29204869270324707,0.7003016573669929
107,4,RandomForest,1,0.7,0.5952380952380952,1.0,1.1870343685150146,0.0
108,4,AdaBoost (Discrete),1,0.7,0.5297619047619048,0.6491829467825109,127.87324380874634,0.6491829467825109
109,4,AdaBoost (Real),1,0.7,0.5595238095238095,0.650874793832672,145.37981176376343,0.650874793832672
110,4,Logistic Regression (Penalty = L2),1,0.7,0.5833333333333334,0.6519577821756906,0.8252463340759277,0.6519577821756906
111,4,Naive Bayes,1,0.7,0.5059523809523809,0.5717329581629295,0.6477212905883789,0.5717329581629295
112,4,KNeighbors Classifier,2,0.7,0.5209580838323353,0.6216156943658048,7.231282711029053,0.6216156943658048
113,4,SVC Classifier,2,0.7,0.6107784431137725,0.46206375934610827,6.619516849517822,0.46206375934610827
114,4,Decision Tree,2,0.7,0.592814371257485,0.7000933582299681,0.3199806213378906,0.7000933582299681
115,4,RandomForest,2,0.7,0.592814371257485,1.0,1.261375904083252,0.0
116,4,AdaBoost (Discrete),2,0.7,0.4311377245508982,0.5135200123124198,128.78614282608032,0.5135200123124198
117,4,AdaBoost (Real),2,0.7,0.592814371257485,0.6860621925574227,138.73171758651733,0.6860621925574227
118,4,Logistic Regression (Penalty = L2),2,0.7,0.5568862275449101,0.654351626975434,0.7571694850921631,0.654351626975434
119,4,Naive Bayes,2,0.7,0.5029940119760479,0.5836666096061082,0.48426294326782227,0.5836666096061082
120,5,KNeighbors Classifier,0,0.7,0.621301775147929,0.7168415455428754,4.063976287841797,0.7168415455428754
121,5,SVC Classifier,0,0.7,0.6094674556213018,0.4790016600325024,4.3539392948150635,0.4790016600325024
122,5,Decision Tree,0,0.7,0.5739644970414202,0.6543637250747706,0.14639973640441895,0.6543637250747706
123,5,RandomForest,0,0.7,0.591715976331361,1.0,1.1005184650421143,0.0
124,5,AdaBoost (Discrete),0,0.7,0.4556213017751479,0.5429108409622277,103.61832427978516,0.5429108409622277
125,5,AdaBoost (Real),0,0.7,0.5502958579881657,0.653422193234664,114.56121397018433,0.653422193234664
126,5,Logistic Regression (Penalty = L2),0,0.7,0.6449704142011834,0.7211247851537042,0.4856274127960205,0.7211247851537042
127,5,Naive Bayes,0,0.7,0.48520710059171596,0.4926459905662744,0.33415961265563965,0.4926459905662744
128,5,KNeighbors Classifier,1,0.7,0.6011904761904762,0.7085339911425566,4.434664964675903,0.7085339911425566
129,5,SVC Classifier,1,0.7,0.5952380952380952,1.0,4.16735577583313,0.0
130,5,Decision Tree,1,0.7,0.5833333333333334,0.6882250763254332,0.2791123390197754,0.6882250763254332
131,5,RandomForest,1,0.7,0.5952380952380952,1.0,1.0752267837524414,0.0
132,5,AdaBoost (Discrete),1,0.7,0.5,0.5474398924859862,100.30575680732727,0.5474398924859862
133,5,AdaBoost (Real),1,0.7,0.44642857142857145,0.5530057443306996,103.44135046005249,0.5530057443306996
134,5,Logistic Regression (Penalty = L2),1,0.7,0.6369047619047619,0.7353738475635089,0.34926748275756836,0.7353738475635089
135,5,Naive Bayes,1,0.7,0.47023809523809523,0.49794911558783184,0.27956366539001465,0.49794911558783184
136,5,KNeighbors Classifier,2,0.7,0.5688622754491018,0.6541130301896597,4.74901008605957,0.6541130301896597
137,5,SVC Classifier,2,0.7,0.6107784431137725,0.48133829047370646,4.609186172485352,0.48133829047370646
138,5,Decision Tree,2,0.7,0.5329341317365269,0.6537548083052067,0.16161680221557617,0.6537548083052067
139,5,RandomForest,2,0.7,0.592814371257485,1.0,1.2930397987365723,0.0
140,5,AdaBoost (Discrete),2,0.7,0.40119760479041916,0.5024390629888897,94.3781259059906,0.5024390629888897
141,5,AdaBoost (Real),2,0.7,0.5149700598802395,0.6343052175850205,112.12380504608154,0.6343052175850205
142,5,Logistic Regression (Penalty = L2),2,0.7,0.6167664670658682,0.7226924526638673,0.3993985652923584,0.7226924526638673
143,5,Naive Bayes,2,0.7,0.46107784431137727,0.5137135743406683,0.47550463676452637,0.5137135743406683
144,6,KNeighbors Classifier,0,0.7,0.6331360946745562,0.6999967136458812,6.378931522369385,0.6999967136458812
145,6,SVC Classifier,0,0.7,0.6094674556213018,0.43836710608902335,6.0276780128479,0.43836710608902335
146,6,Decision Tree,0,0.7,0.5798816568047337,0.6655703599914884,0.30295729637145996,0.6655703599914884
147,6,RandomForest,0,0.7,0.5976331360946746,0.2438093199376099,1.079758882522583,0.2438093199376099
148,6,AdaBoost (Discrete),0,0.7,0.6272189349112426,0.5922422278077494,127.03179264068604,0.5922422278077494
149,6,AdaBoost (Real),0,0.7,0.6094674556213018,0.6786044041487267,124.64527726173401,0.6786044041487267
150,6,Logistic Regression (Penalty = L2),0,0.7,0.6094674556213018,0.6742049002196551,0.625063419342041,0.6742049002196551
151,6,Naive Bayes,0,0.7,0.46153846153846156,0.5193688327767603,0.5256459712982178,0.5193688327767603
152,6,KNeighbors Classifier,1,0.7,0.5952380952380952,0.6916576771312541,5.706755876541138,0.6916576771312541
153,6,SVC Classifier,1,0.7,0.5892857142857143,0.9947780321927768,5.608776092529297,0.0
154,6,Decision Tree,1,0.7,0.5476190476190477,0.6273765725056447,0.2710566520690918,0.6273765725056447
155,6,RandomForest,1,0.7,0.5952380952380952,1.0,0.9407086372375488,0.0
156,6,AdaBoost (Discrete),1,0.7,0.5178571428571429,0.6322680932616379,114.18131446838379,0.6322680932616379
157,6,AdaBoost (Real),1,0.7,0.5476190476190477,0.5609068938801836,120.56014227867126,0.5609068938801836
158,6,Logistic Regression (Penalty = L2),1,0.7,0.5773809523809523,0.6575557937609745,0.5545690059661865,0.6575557937609745
159,6,Naive Bayes,1,0.7,0.4642857142857143,0.5429736008685693,0.5257778167724609,0.5429736008685693
160,6,KNeighbors Classifier,2,0.7,0.5508982035928144,0.6435609748144865,5.670591831207275,0.6435609748144865
161,6,SVC Classifier,2,0.7,0.6107784431137725,0.46206375934610827,5.301392078399658,0.46206375934610827
162,6,Decision Tree,2,0.7,0.5209580838323353,0.5933961735981806,0.27089858055114746,0.5933961735981806
163,6,RandomForest,2,0.7,0.592814371257485,1.0,1.218813419342041,0.0
164,6,AdaBoost (Discrete),2,0.7,0.4311377245508982,0.5135200123124198,116.55510950088501,0.5135200123124198
165,6,AdaBoost (Real),2,0.7,0.6467065868263473,0.7213211164416933,122.04578518867493,0.7213211164416933
166,6,Logistic Regression (Penalty = L2),2,0.7,0.5568862275449101,0.650874793832672,0.6478846073150635,0.650874793832672
167,6,Naive Bayes,2,0.7,0.47305389221556887,0.5613933701811722,0.5394792556762695,0.5613933701811722
168,7,KNeighbors Classifier,0,0.7,0.6094674556213018,0.6786044041487267,5.886993885040283,0.6786044041487267
169,7,SVC Classifier,0,0.7,0.6035502958579881,0.41251924070608303,5.994702577590942,0.41251924070608303
170,7,Decision Tree,0,0.7,0.5502958579881657,0.6322347703937959,0.264432430267334,0.6322347703937959
171,7,RandomForest,0,0.7,0.5798816568047337,0.24124271543573797,1.1247353553771973,0.24124271543573797
172,7,AdaBoost (Discrete),0,0.7,0.5857988165680473,0.5552615191222885,122.29988694190979,0.5552615191222885
173,7,AdaBoost (Real),0,0.7,0.6094674556213018,0.6786044041487267,109.48007345199585,0.6786044041487267
174,7,Logistic Regression (Penalty = L2),0,0.7,0.6094674556213018,0.6742049002196551,0.41138744354248047,0.6742049002196551
175,7,Naive Bayes,0,0.7,0.4556213017751479,0.5163666337264373,0.4979526996612549,0.5163666337264373
176,7,KNeighbors Classifier,1,0.7,0.5773809523809523,0.6748132389880844,5.4884467124938965,0.6748132389880844
177,7,SVC Classifier,1,0.7,0.5892857142857143,0.9947780321927768,5.1989967823028564,0.0
178,7,Decision Tree,1,0.7,0.49404761904761907,0.5869457043065723,0.11007285118103027,0.5869457043065723
179,7,RandomForest,1,0.7,0.5952380952380952,1.0,0.9540402889251709,0.0
180,7,AdaBoost (Discrete),1,0.7,0.5654761904761905,0.5939756624172096,103.66134452819824,0.5939756624172096
181,7,AdaBoost (Real),1,0.7,0.5238095238095238,0.6135835841106647,109.44850420951843,0.6135835841106647
182,7,Logistic Regression (Penalty = L2),1,0.7,0.5773809523809523,0.6615467691941467,0.42649364471435547,0.6615467691941467
183,7,Naive Bayes,1,0.7,0.44642857142857145,0.5267316437316311,0.4362459182739258,0.5267316437316311
184,7,KNeighbors Classifier,2,0.7,0.5389221556886228,0.6325234519700399,4.724692344665527,0.6325234519700399
185,7,SVC Classifier,2,0.7,0.6107784431137725,0.46206375934610827,5.3333470821380615,0.46206375934610827
186,7,Decision Tree,2,0.7,0.437125748502994,0.5448721254092748,0.25056910514831543,0.5448721254092748
187,7,RandomForest,2,0.7,0.5988023952095808,0.24499865251482233,0.9693882465362549,0.24499865251482233
188,7,AdaBoost (Discrete),2,0.7,0.4311377245508982,0.5135200123124198,116.22782373428345,0.5135200123124198
189,7,AdaBoost (Real),2,0.7,0.5688622754491018,0.6299605249474366,1163.4154045581818,0.6299605249474366
190,7,Logistic Regression (Penalty = L2),2,0.7,0.5449101796407185,0.6435609748144865,0.43785810470581055,0.6435609748144865
191,7,Naive Bayes,2,0.7,0.46107784431137727,0.5489690621400171,0.26873183250427246,0.5489690621400171
192,8,KNeighbors Classifier,0,0.7,0.6094674556213018,0.7136940119343756,3.0128676891326904,0.7136940119343756
193,8,SVC Classifier,0,0.7,0.6094674556213018,0.4790016600325024,2.9210572242736816,0.4790016600325024
194,8,Decision Tree,0,0.7,0.5325443786982249,0.6218683930387491,0.10581851005554199,0.6218683930387491
195,8,RandomForest,0,0.7,0.591715976331361,1.0,0.5029215812683105,0.0
196,8,AdaBoost (Discrete),0,0.7,0.4378698224852071,0.5324676475453456,65.65176820755005,0.5324676475453456
197,8,AdaBoost (Real),0,0.7,0.5621301775147929,0.6638620096654761,76.03895974159241,0.6638620096654761
198,8,Logistic Regression (Penalty = L2),0,0.7,0.6331360946745562,0.7245917845327045,0.3622770309448242,0.7245917845327045
199,8,Naive Bayes,0,0.7,0.4970414201183432,0.4975727773091722,0.23277926445007324,0.4975727773091722
200,8,KNeighbors Classifier,1,0.7,0.6071428571428571,0.7128809341859169,2.7604784965515137,0.7128809341859169
201,8,SVC Classifier,1,0.7,0.5952380952380952,1.0,2.78141450881958,0.0
202,8,Decision Tree,1,0.7,0.6130952380952381,0.6727887871060974,0.10571861267089844,0.6727887871060974
203,8,RandomForest,1,0.7,0.5952380952380952,1.0,0.905719518661499,0.0
204,8,AdaBoost (Discrete),1,0.7,0.5238095238095238,0.6135835841106647,70.88936305046082,0.6135835841106647
205,8,AdaBoost (Real),1,0.7,0.5,0.6210866594767364,66.78966236114502,0.6210866594767364
206,8,Logistic Regression (Penalty = L2),1,0.7,0.6785714285714286,0.7668655352247103,0.5020530223846436,0.7668655352247103
207,8,Naive Bayes,1,0.7,0.5119047619047619,0.5263632998046983,0.20633935928344727,0.5263632998046983
208,8,KNeighbors Classifier,2,0.7,0.5389221556886228,0.6325234519700399,2.769338607788086,0.6325234519700399
209,8,SVC Classifier,2,0.7,0.6107784431137725,0.48133829047370646,2.8011510372161865,0.48133829047370646
210,8,Decision Tree,2,0.7,0.5329341317365269,0.632651054041682,0.21402239799499512,0.632651054041682
211,8,RandomForest,2,0.7,0.592814371257485,0.24414499175196025,0.7673015594482422,0.24414499175196025
212,8,AdaBoost (Discrete),2,0.7,0.40119760479041916,0.5024390629888897,60.083014726638794,0.5024390629888897
213,8,AdaBoost (Real),2,0.7,0.562874251497006,0.650633639755825,68.72269797325134,0.650633639755825
214,8,Logistic Regression (Penalty = L2),2,0.7,0.6407185628742516,0.7431289652046819,0.35796666145324707,0.7431289652046819
215,8,Naive Bayes,2,0.7,0.48502994011976047,0.525070018672476,0.3059120178222656,0.525070018672476
