,feat_set_id,classifier,fold_id,feat_th,score,geo_score,exec_t,geo_score_woz
0,0,KNeighbors Classifier,0,0.95,0.6227544910179641,0.7040808008860376,1.7624599933624268,0.7040808008860376
1,0,SVC Classifier,0,0.95,0.592814371257485,0.2902397809308411,1.8084988594055176,0.0
2,0,Decision Tree,0,0.95,0.5149700598802395,0.5639388819380087,0.09521889686584473,0.5639388819380087
3,0,RandomForest,0,0.95,0.592814371257485,0.2438093199376099,0.3568716049194336,0.2438093199376099
4,0,AdaBoost (Discrete),0,0.95,0.437125748502994,0.34329817136034474,35.269164085388184,0.34329817136034474
5,0,AdaBoost (Real),0,0.95,0.6107784431137725,0.6860621925574227,39.464062213897705,0.6860621925574227
6,0,Logistic Regression (Penalty = L2),0,0.95,0.5808383233532934,0.681866975476474,0.2633347511291504,0.681866975476474
7,0,Naive Bayes,0,0.95,0.46706586826347307,0.525271256626669,0.19925785064697266,0.525271256626669
8,0,KNeighbors Classifier,1,0.95,0.5515151515151515,0.654351626975434,1.876574993133545,0.654351626975434
9,0,SVC Classifier,1,0.95,0.5818181818181818,0.9947780321927768,1.9991405010223389,0.0
10,0,Decision Tree,1,0.95,0.5393939393939394,0.6435609748144865,0.09486985206604004,0.6435609748144865
11,0,RandomForest,1,0.95,0.5818181818181818,0.9947780321927768,0.38369321823120117,0.0
12,0,AdaBoost (Discrete),1,0.95,0.5757575757575758,0.623722882326302,34.92471146583557,0.623722882326302
13,0,AdaBoost (Real),1,0.95,0.5454545454545454,0.6435609748144865,39.32763743400574,0.6435609748144865
14,0,Logistic Regression (Penalty = L2),1,0.95,0.5818181818181818,0.6599092704944058,0.22266101837158203,0.6599092704944058
15,0,Naive Bayes,1,0.95,0.49696969696969695,0.5717329581629295,0.18029403686523438,0.5717329581629295
16,0,KNeighbors Classifier,2,0.95,0.5393939393939394,0.6435609748144865,1.7480745315551758,0.6435609748144865
17,0,SVC Classifier,2,0.95,0.6060606060606061,0.46206375934610827,1.6866352558135986,0.46206375934610827
18,0,Decision Tree,2,0.95,0.6060606060606061,0.667788145051214,0.09896087646484375,0.667788145051214
19,0,RandomForest,2,0.95,0.5818181818181818,0.9947780321927768,0.4164462089538574,0.0
20,0,AdaBoost (Discrete),2,0.95,0.43636363636363634,0.5692225725524779,36.556206464767456,0.5692225725524779
21,0,AdaBoost (Real),2,0.95,0.5151515151515151,0.6090747909993272,39.02001714706421,0.6090747909993272
22,0,Logistic Regression (Penalty = L2),2,0.95,0.5393939393939394,0.6399655870870427,0.20788002014160156,0.6399655870870427
23,0,Naive Bayes,2,0.95,0.49696969696969695,0.5836666096061082,0.19080328941345215,0.5836666096061082
24,1,KNeighbors Classifier,0,0.95,0.6047904191616766,0.6695227706857005,1.8940577507019043,0.6695227706857005
25,1,SVC Classifier,0,0.95,0.592814371257485,0.3118047822311618,1.8097364902496338,0.0
26,1,Decision Tree,0,0.95,0.5568862275449101,0.6474751742881626,0.09077286720275879,0.6474751742881626
27,1,RandomForest,0,0.95,0.5868263473053892,0.17025130615174972,0.38024020195007324,0.0
28,1,AdaBoost (Discrete),0,0.95,0.4311377245508982,0.520857003755147,35.57787275314331,0.520857003755147
29,1,AdaBoost (Real),0,0.95,0.6047904191616766,0.6995856761387759,39.397870779037476,0.6995856761387759
30,1,Logistic Regression (Penalty = L2),0,0.95,0.6047904191616766,0.6645464039745458,0.16656970977783203,0.6645464039745458
31,1,Naive Bayes,0,0.95,0.4550898203592814,0.5193688327767603,0.18702101707458496,0.5193688327767603
32,1,KNeighbors Classifier,1,0.95,0.5515151515151515,0.6430674462659999,1.6521379947662354,0.6430674462659999
33,1,SVC Classifier,1,0.95,0.5818181818181818,0.9947780321927768,1.6877079010009766,0.0
34,1,Decision Tree,1,0.95,0.5393939393939394,0.6118153219024022,0.05867290496826172,0.6118153219024022
35,1,RandomForest,1,0.95,0.5818181818181818,1.0,0.3675558567047119,0.0
36,1,AdaBoost (Discrete),1,0.95,0.5575757575757576,0.5127443011431098,34.70491170883179,0.5127443011431098
37,1,AdaBoost (Real),1,0.95,0.5636363636363636,0.6580278368475444,36.630070209503174,0.6580278368475444
38,1,Logistic Regression (Penalty = L2),1,0.95,0.5636363636363636,0.6616634235378085,0.1795973777770996,0.6616634235378085
39,1,Naive Bayes,1,0.95,0.45454545454545453,0.5294779480318617,0.16112589836120605,0.5294779480318617
40,1,KNeighbors Classifier,2,0.95,0.5818181818181818,0.6792690513944867,1.6632132530212402,0.6792690513944867
41,1,SVC Classifier,2,0.95,0.6,0.386191371578543,1.8003010749816895,0.386191371578543
42,1,Decision Tree,2,0.95,0.509090909090909,0.5711074292628525,0.04919576644897461,0.5711074292628525
43,1,RandomForest,2,0.95,0.5878787878787879,1.0,0.3431084156036377,0.0
44,1,AdaBoost (Discrete),2,0.95,0.43636363636363634,0.5692225725524779,34.9077353477478,0.5692225725524779
45,1,AdaBoost (Real),2,0.95,0.4909090909090909,0.5991409274403446,38.487473487854004,0.5991409274403446
46,1,Logistic Regression (Penalty = L2),2,0.95,0.5696969696969697,0.6615467691941467,0.16489672660827637,0.6615467691941467
47,1,Naive Bayes,2,0.95,0.46060606060606063,0.5579701547631802,0.17381739616394043,0.5579701547631802
48,2,KNeighbors Classifier,0,0.95,0.6287425149700598,0.6999967136458812,1.8417901992797852,0.6999967136458812
49,2,SVC Classifier,0,0.95,0.592814371257485,0.2902397809308411,1.819988489151001,0.0
50,2,Decision Tree,0,0.95,0.49700598802395207,0.575108880507365,0.049514055252075195,0.575108880507365
51,2,RandomForest,0,0.95,0.5868263473053892,0.28867513459481287,0.37844204902648926,0.0
52,2,AdaBoost (Discrete),0,0.95,0.437125748502994,0.34329817136034474,37.41074752807617,0.34329817136034474
53,2,AdaBoost (Real),0,0.95,0.6586826347305389,0.7019425813825722,43.191505432128906,0.7019425813825722
54,2,Logistic Regression (Penalty = L2),0,0.95,0.6047904191616766,0.6742049002196551,0.18787002563476562,0.6742049002196551
55,2,Naive Bayes,0,0.95,0.4491017964071856,0.5163666337264373,0.19415497779846191,0.5163666337264373
56,2,KNeighbors Classifier,1,0.95,0.5636363636363636,0.6759327056039406,1.9340806007385254,0.6759327056039406
57,2,SVC Classifier,1,0.95,0.5818181818181818,0.9947780321927768,1.947669267654419,0.0
58,2,Decision Tree,1,0.95,0.5212121212121212,0.6213512895298378,0.0574495792388916,0.6213512895298378
59,2,RandomForest,1,0.95,0.5818181818181818,0.9947780321927768,0.423598051071167,0.0
60,2,AdaBoost (Discrete),1,0.95,0.5818181818181818,0.43409725249516384,37.541521310806274,0.43409725249516384
61,2,AdaBoost (Real),1,0.95,0.5151515151515151,0.6177595833402882,39.76689052581787,0.6177595833402882
62,2,Logistic Regression (Penalty = L2),1,0.95,0.5696969696969697,0.6615467691941467,0.2214069366455078,0.6615467691941467
63,2,Naive Bayes,1,0.95,0.43636363636363634,0.5267316437316311,0.11705517768859863,0.5267316437316311
64,2,KNeighbors Classifier,2,0.95,0.5454545454545454,0.6435609748144865,1.7984650135040283,0.6435609748144865
65,2,SVC Classifier,2,0.95,0.6060606060606061,0.46206375934610827,1.8155937194824219,0.46206375934610827
66,2,Decision Tree,2,0.95,0.5212121212121212,0.6170898521307773,0.09925985336303711,0.6170898521307773
67,2,RandomForest,2,0.95,0.5878787878787879,1.0,0.37403249740600586,0.0
68,2,AdaBoost (Discrete),2,0.95,0.43636363636363634,0.5692225725524779,35.89078211784363,0.5692225725524779
69,2,AdaBoost (Real),2,0.95,0.5878787878787879,0.6794903116874621,37.445821046829224,0.6794903116874621
70,2,Logistic Regression (Penalty = L2),2,0.95,0.5454545454545454,0.6472385459285428,0.23331832885742188,0.6472385459285428
71,2,Naive Bayes,2,0.95,0.45454545454545453,0.5489690621400171,0.15591096878051758,0.5489690621400171
72,3,KNeighbors Classifier,0,0.95,0.6167664670658682,0.680565699460007,1.8250925540924072,0.680565699460007
73,3,SVC Classifier,0,0.95,0.5868263473053892,0.26495145850196566,1.7542409896850586,0.0
74,3,Decision Tree,0,0.95,0.5808383233532934,0.6299605249474366,0.04961991310119629,0.6299605249474366
75,3,RandomForest,0,0.95,0.5868263473053892,1.0,0.3849334716796875,0.0
76,3,AdaBoost (Discrete),0,0.95,0.437125748502994,0.34329817136034474,35.34882712364197,0.34329817136034474
77,3,AdaBoost (Real),0,0.95,0.5748502994011976,0.6487928887309734,37.99021792411804,0.6487928887309734
78,3,Logistic Regression (Penalty = L2),0,0.95,0.6107784431137725,0.6505811912952943,0.17832422256469727,0.6505811912952943
79,3,Naive Bayes,0,0.95,0.4491017964071856,0.5163666337264373,0.16466450691223145,0.5163666337264373
80,3,KNeighbors Classifier,1,0.95,0.5515151515151515,0.650874793832672,1.4885807037353516,0.650874793832672
81,3,SVC Classifier,1,0.95,0.5818181818181818,0.9947780321927768,1.6830646991729736,0.0
82,3,Decision Tree,1,0.95,0.5151515151515151,0.5989986474712237,0.04692530632019043,0.5989986474712237
83,3,RandomForest,1,0.95,0.5878787878787879,1.0,0.3548774719238281,0.0
84,3,AdaBoost (Discrete),1,0.95,0.6242424242424243,0.7139844668053338,31.835963010787964,0.7139844668053338
85,3,AdaBoost (Real),1,0.95,0.5818181818181818,0.6792690513944867,36.24895429611206,0.6792690513944867
86,3,Logistic Regression (Penalty = L2),1,0.95,0.5515151515151515,0.6430674462659999,0.20215606689453125,0.6430674462659999
87,3,Naive Bayes,1,0.95,0.43636363636363634,0.5267316437316311,0.17435503005981445,0.5267316437316311
88,3,KNeighbors Classifier,2,0.95,0.5454545454545454,0.6395913381203551,1.7922117710113525,0.6395913381203551
89,3,SVC Classifier,2,0.95,0.6060606060606061,0.46206375934610827,1.7895822525024414,0.46206375934610827
90,3,Decision Tree,2,0.95,0.5333333333333333,0.5898952297379465,0.12126564979553223,0.5898952297379465
91,3,RandomForest,2,0.95,0.5818181818181818,0.9947780321927768,0.35622119903564453,0.0
92,3,AdaBoost (Discrete),2,0.95,0.43636363636363634,0.5692225725524779,31.529120206832886,0.5692225725524779
93,3,AdaBoost (Real),2,0.95,0.5696969696969697,0.6687029244757281,30.603731870651245,0.6687029244757281
94,3,Logistic Regression (Penalty = L2),2,0.95,0.5272727272727272,0.6249019454015914,0.1728370189666748,0.6249019454015914
95,3,Naive Bayes,2,0.95,0.46060606060606063,0.5523370547494352,0.18704795837402344,0.5523370547494352
96,4,KNeighbors Classifier,0,0.95,0.6407185628742516,0.7178195024792923,1.4019079208374023,0.7178195024792923
97,4,SVC Classifier,0,0.95,0.592814371257485,0.3118047822311618,1.4685592651367188,0.0
98,4,Decision Tree,0,0.95,0.5988023952095808,0.6867030730725907,0.0847468376159668,0.6867030730725907
99,4,RandomForest,0,0.95,0.5748502994011976,0.11975720203651022,0.26457881927490234,0.0
100,4,AdaBoost (Discrete),0,0.95,0.41916167664670656,0.5008038599049766,28.24787211418152,0.5008038599049766
101,4,AdaBoost (Real),0,0.95,0.6586826347305389,0.7432750019969852,29.776925325393677,0.7432750019969852
102,4,Logistic Regression (Penalty = L2),0,0.95,0.5688622754491018,0.676631705797589,0.16884922981262207,0.676631705797589
103,4,Naive Bayes,0,0.95,0.46706586826347307,0.525271256626669,0.1305983066558838,0.525271256626669
104,4,KNeighbors Classifier,1,0.95,0.5393939393939394,0.6468726676448499,1.547297716140747,0.6468726676448499
105,4,SVC Classifier,1,0.95,0.5818181818181818,0.9947780321927768,1.797696828842163,0.0
106,4,Decision Tree,1,0.95,0.5333333333333333,0.5898952297379465,0.09451007843017578,0.5898952297379465
107,4,RandomForest,1,0.95,0.5878787878787879,1.0,0.3377819061279297,0.0
108,4,AdaBoost (Discrete),1,0.95,0.4666666666666667,0.5278335959890004,28.784805059432983,0.5278335959890004
109,4,AdaBoost (Real),1,0.95,0.5454545454545454,0.5806533054881762,31.805089473724365,0.5806533054881762
110,4,Logistic Regression (Penalty = L2),1,0.95,0.5393939393939394,0.6173579189986083,0.17616486549377441,0.6173579189986083
111,4,Naive Bayes,1,0.95,0.49696969696969695,0.5579701547631802,0.14394354820251465,0.5579701547631802
112,4,KNeighbors Classifier,2,0.95,0.5575757575757576,0.6580278368475444,1.577049970626831,0.6580278368475444
113,4,SVC Classifier,2,0.95,0.6,0.386191371578543,1.4116380214691162,0.386191371578543
114,4,Decision Tree,2,0.95,0.5212121212121212,0.6380899444807125,0.07833528518676758,0.6380899444807125
115,4,RandomForest,2,0.95,0.5818181818181818,0.9947780321927768,0.3109447956085205,0.0
116,4,AdaBoost (Discrete),2,0.95,0.43636363636363634,0.5692225725524779,31.944997549057007,0.5692225725524779
117,4,AdaBoost (Real),2,0.95,0.5212121212121212,0.6124966312870558,34.294618129730225,0.6124966312870558
118,4,Logistic Regression (Penalty = L2),2,0.95,0.5151515151515151,0.625163355992802,0.1560049057006836,0.625163355992802
119,4,Naive Bayes,2,0.95,0.49696969696969695,0.5836666096061082,0.21427464485168457,0.5836666096061082
120,5,KNeighbors Classifier,0,0.95,0.6347305389221557,0.7176241242708175,1.5199885368347168,0.7176241242708175
121,5,SVC Classifier,0,0.95,0.592814371257485,0.2902397809308411,1.434037208557129,0.0
122,5,Decision Tree,0,0.95,0.6107784431137725,0.6622595778930926,0.04099082946777344,0.6622595778930926
123,5,RandomForest,0,0.95,0.5868263473053892,1.0,0.3197665214538574,0.0
124,5,AdaBoost (Discrete),0,0.95,0.437125748502994,0.34329817136034474,29.974361658096313,0.34329817136034474
125,5,AdaBoost (Real),0,0.95,0.5748502994011976,0.6723176050998465,35.03782033920288,0.6723176050998465
126,5,Logistic Regression (Penalty = L2),0,0.95,0.5808383233532934,0.681866975476474,0.2247607707977295,0.681866975476474
127,5,Naive Bayes,0,0.95,0.46706586826347307,0.525271256626669,0.18673419952392578,0.525271256626669
128,5,KNeighbors Classifier,1,0.95,0.5636363636363636,0.6709789900999482,1.6561081409454346,0.6709789900999482
129,5,SVC Classifier,1,0.95,0.5818181818181818,0.9947780321927768,1.6984684467315674,0.0
130,5,Decision Tree,1,0.95,0.5696969696969697,0.6208218037262931,0.08760190010070801,0.6208218037262931
131,5,RandomForest,1,0.95,0.5878787878787879,1.0,0.3111000061035156,0.0
132,5,AdaBoost (Discrete),1,0.95,0.5878787878787879,0.4759896445368892,32.099982261657715,0.4759896445368892
133,5,AdaBoost (Real),1,0.95,0.48484848484848486,0.5278335959890004,33.03477239608765,0.5278335959890004
134,5,Logistic Regression (Penalty = L2),1,0.95,0.5757575757575758,0.6519577821756906,0.17968249320983887,0.6519577821756906
135,5,Naive Bayes,1,0.95,0.49696969696969695,0.5717329581629295,0.15626835823059082,0.5717329581629295
136,5,KNeighbors Classifier,2,0.95,0.5151515151515151,0.625163355992802,1.6083567142486572,0.625163355992802
137,5,SVC Classifier,2,0.95,0.6060606060606061,0.46206375934610827,1.4897246360778809,0.46206375934610827
138,5,Decision Tree,2,0.95,0.503030303030303,0.5748402635226993,0.04106712341308594,0.5748402635226993
139,5,RandomForest,2,0.95,0.5818181818181818,1.0,0.3014652729034424,0.0
140,5,AdaBoost (Discrete),2,0.95,0.43636363636363634,0.5692225725524779,35.27925944328308,0.5692225725524779
141,5,AdaBoost (Real),2,0.95,0.5212121212121212,0.6075569272759603,38.75565314292908,0.6075569272759603
142,5,Logistic Regression (Penalty = L2),2,0.95,0.5454545454545454,0.6472385459285428,0.19424057006835938,0.6472385459285428
143,5,Naive Bayes,2,0.95,0.49696969696969695,0.5836666096061082,0.18448543548583984,0.5836666096061082
144,6,KNeighbors Classifier,0,0.95,0.6047904191616766,0.6827317411152338,1.6035232543945312,0.6827317411152338
145,6,SVC Classifier,0,0.95,0.5868263473053892,0.26495145850196566,1.6243822574615479,0.0
146,6,Decision Tree,0,0.95,0.6047904191616766,0.6695227706857005,0.05360603332519531,0.6695227706857005
147,6,RandomForest,0,0.95,0.5868263473053892,1.0,0.4218287467956543,0.0
148,6,AdaBoost (Discrete),0,0.95,0.437125748502994,0.34329817136034474,35.136393308639526,0.34329817136034474
149,6,AdaBoost (Real),0,0.95,0.592814371257485,0.647715157695715,37.962157011032104,0.647715157695715
150,6,Logistic Regression (Penalty = L2),0,0.95,0.5988023952095808,0.6867030730725907,0.1961383819580078,0.6867030730725907
151,6,Naive Bayes,0,0.95,0.46706586826347307,0.525271256626669,0.1667642593383789,0.525271256626669
152,6,KNeighbors Classifier,1,0.95,0.5636363636363636,0.6616634235378085,1.8317043781280518,0.6616634235378085
153,6,SVC Classifier,1,0.95,0.5818181818181818,0.9947780321927768,1.888904094696045,0.0
154,6,Decision Tree,1,0.95,0.503030303030303,0.6174918651774695,0.14446091651916504,0.6174918651774695
155,6,RandomForest,1,0.95,0.5878787878787879,1.0,0.36772847175598145,0.0
156,6,AdaBoost (Discrete),1,0.95,0.6484848484848484,0.623722882326302,38.61703014373779,0.623722882326302
157,6,AdaBoost (Real),1,0.95,0.6,0.6826825210342389,41.58858323097229,0.6826825210342389
158,6,Logistic Regression (Penalty = L2),1,0.95,0.5696969696969697,0.6330335517491583,0.22381973266601562,0.6330335517491583
159,6,Naive Bayes,1,0.95,0.49696969696969695,0.5717329581629295,0.22881412506103516,0.5717329581629295
160,6,KNeighbors Classifier,2,0.95,0.5515151515151515,0.654351626975434,1.9128515720367432,0.654351626975434
161,6,SVC Classifier,2,0.95,0.6060606060606061,0.46206375934610827,1.9977374076843262,0.46206375934610827
162,6,Decision Tree,2,0.95,0.5818181818181818,0.6759327056039406,0.11104202270507812,0.6759327056039406
163,6,RandomForest,2,0.95,0.5878787878787879,1.0,0.39048075675964355,0.0
164,6,AdaBoost (Discrete),2,0.95,0.43636363636363634,0.5692225725524779,38.69561219215393,0.5692225725524779
165,6,AdaBoost (Real),2,0.95,0.5575757575757576,0.6420781101709964,38.94786500930786,0.6420781101709964
166,6,Logistic Regression (Penalty = L2),2,0.95,0.5151515151515151,0.6216156943658048,0.16484689712524414,0.6216156943658048
167,6,Naive Bayes,2,0.95,0.49696969696969695,0.5836666096061082,0.13036870956420898,0.5836666096061082
168,7,KNeighbors Classifier,0,0.95,0.592814371257485,0.6631762013160654,1.670182466506958,0.6631762013160654
169,7,SVC Classifier,0,0.95,0.592814371257485,0.3118047822311618,1.7328951358795166,0.0
170,7,Decision Tree,0,0.95,0.5988023952095808,0.6709789900999482,0.04967522621154785,0.6709789900999482
171,7,RandomForest,0,0.95,0.5868263473053892,1.0,0.29050326347351074,0.0
172,7,AdaBoost (Discrete),0,0.95,0.41916167664670656,0.4850656159250321,32.43134021759033,0.4850656159250321
173,7,AdaBoost (Real),0,0.95,0.5988023952095808,0.6614554457847597,34.68718123435974,0.6614554457847597
174,7,Logistic Regression (Penalty = L2),0,0.95,0.6047904191616766,0.6645464039745458,0.19425535202026367,0.6645464039745458
175,7,Naive Bayes,0,0.95,0.4550898203592814,0.5193688327767603,0.17265105247497559,0.5193688327767603
176,7,KNeighbors Classifier,1,0.95,0.5454545454545454,0.6149368826809706,1.778223991394043,0.6149368826809706
177,7,SVC Classifier,1,0.95,0.5818181818181818,0.9947780321927768,1.781475305557251,0.0
178,7,Decision Tree,1,0.95,0.5757575757575758,0.6882250763254332,0.05309319496154785,0.6882250763254332
179,7,RandomForest,1,0.95,0.5878787878787879,1.0,0.36121606826782227,0.0
180,7,AdaBoost (Discrete),1,0.95,0.5333333333333333,0.5827658880984057,34.92208743095398,0.5827658880984057
181,7,AdaBoost (Real),1,0.95,0.5393939393939394,0.5414103284912233,35.933364152908325,0.5414103284912233
182,7,Logistic Regression (Penalty = L2),1,0.95,0.5454545454545454,0.6258159278193961,0.18052339553833008,0.6258159278193961
183,7,Naive Bayes,1,0.95,0.45454545454545453,0.5294779480318617,0.17221689224243164,0.5294779480318617
184,7,KNeighbors Classifier,2,0.95,0.5272727272727272,0.6360770290723415,1.6178350448608398,0.6360770290723415
185,7,SVC Classifier,2,0.95,0.6,0.386191371578543,1.4635827541351318,0.386191371578543
186,7,Decision Tree,2,0.95,0.5272727272727272,0.593541151901921,0.0866401195526123,0.593541151901921
187,7,RandomForest,2,0.95,0.5818181818181818,0.1697027389520957,0.2638108730316162,0.0
188,7,AdaBoost (Discrete),2,0.95,0.43636363636363634,0.5692225725524779,33.127076148986816,0.5692225725524779
189,7,AdaBoost (Real),2,0.95,0.5333333333333333,0.6460173382238398,37.28164005279541,0.6460173382238398
190,7,Logistic Regression (Penalty = L2),2,0.95,0.5757575757575758,0.6650286584282477,0.18811869621276855,0.6650286584282477
191,7,Naive Bayes,2,0.95,0.46060606060606063,0.5579701547631802,0.1750626564025879,0.5579701547631802
192,8,KNeighbors Classifier,0,0.95,0.6107784431137725,0.6726514272029115,1.6688096523284912,0.6726514272029115
193,8,SVC Classifier,0,0.95,0.592814371257485,0.3118047822311618,1.6336569786071777,0.0
194,8,Decision Tree,0,0.95,0.5269461077844312,0.6078935506225702,0.09867238998413086,0.6078935506225702
195,8,RandomForest,0,0.95,0.5868263473053892,1.0,0.3860642910003662,0.0
196,8,AdaBoost (Discrete),0,0.95,0.4311377245508982,0.5324676475453456,33.82699108123779,0.5324676475453456
197,8,AdaBoost (Real),0,0.95,0.5988023952095808,0.6899953899145445,35.652578830718994,0.6899953899145445
198,8,Logistic Regression (Penalty = L2),0,0.95,0.6467065868263473,0.695968312239994,0.18534040451049805,0.695968312239994
199,8,Naive Bayes,0,0.95,0.4550898203592814,0.5193688327767603,0.13685917854309082,0.5193688327767603
200,8,KNeighbors Classifier,1,0.95,0.5696969696969697,0.6532765676017526,1.5292890071868896,0.6532765676017526
201,8,SVC Classifier,1,0.95,0.5818181818181818,0.9947780321927768,1.6455271244049072,0.0
202,8,Decision Tree,1,0.95,0.5818181818181818,0.6447914959270326,0.09728479385375977,0.6447914959270326
203,8,RandomForest,1,0.95,0.5878787878787879,1.0,0.2869141101837158,0.0
204,8,AdaBoost (Discrete),1,0.95,0.5878787878787879,0.4759896445368892,32.03173065185547,0.4759896445368892
205,8,AdaBoost (Real),1,0.95,0.5454545454545454,0.5723571212766659,35.20835614204407,0.5723571212766659
206,8,Logistic Regression (Penalty = L2),1,0.95,0.5272727272727272,0.6158806592503815,0.16893672943115234,0.6158806592503815
207,8,Naive Bayes,1,0.95,0.45454545454545453,0.5294779480318617,0.13381338119506836,0.5294779480318617
208,8,KNeighbors Classifier,2,0.95,0.5757575757575758,0.6723372508717325,1.51645827293396,0.6723372508717325
209,8,SVC Classifier,2,0.95,0.6,0.386191371578543,1.4107704162597656,0.386191371578543
210,8,Decision Tree,2,0.95,0.503030303030303,0.568117283222883,0.04563140869140625,0.568117283222883
211,8,RandomForest,2,0.95,0.5878787878787879,1.0,0.30686306953430176,0.0
212,8,AdaBoost (Discrete),2,0.95,0.43636363636363634,0.5692225725524779,33.38121008872986,0.5692225725524779
213,8,AdaBoost (Real),2,0.95,0.5696969696969697,0.6486979387971237,35.89655566215515,0.6486979387971237
214,8,Logistic Regression (Penalty = L2),2,0.95,0.5818181818181818,0.6792690513944867,0.1596977710723877,0.6792690513944867
215,8,Naive Bayes,2,0.95,0.4666666666666667,0.5613933701811722,0.14475655555725098,0.5613933701811722
216,9,KNeighbors Classifier,0,0.95,0.6347305389221557,0.6946150949374807,1.6255037784576416,0.6946150949374807
217,9,SVC Classifier,0,0.95,0.592814371257485,0.2902397809308411,1.5545587539672852,0.0
218,9,Decision Tree,0,0.95,0.5149700598802395,0.610604976114519,0.04569268226623535,0.610604976114519
219,9,RandomForest,0,0.95,0.5868263473053892,1.0,0.3104531764984131,0.0
220,9,AdaBoost (Discrete),0,0.95,0.437125748502994,0.34329817136034474,34.11025953292847,0.34329817136034474
221,9,AdaBoost (Real),0,0.95,0.6287425149700598,0.7075153957312956,37.13542723655701,0.7075153957312956
222,9,Logistic Regression (Penalty = L2),0,0.95,0.6107784431137725,0.6505811912952943,0.17773866653442383,0.6505811912952943
223,9,Naive Bayes,0,0.95,0.4491017964071856,0.5163666337264373,0.11736226081848145,0.5163666337264373
224,9,KNeighbors Classifier,1,0.95,0.5333333333333333,0.6430674462659999,1.5440380573272705,0.6430674462659999
225,9,SVC Classifier,1,0.95,0.5818181818181818,0.9947780321927768,1.696854591369629,0.0
226,9,Decision Tree,1,0.95,0.5272727272727272,0.6158806592503815,0.042012929916381836,0.6158806592503815
227,9,RandomForest,1,0.95,0.5878787878787879,1.0,0.2702062129974365,0.0
228,9,AdaBoost (Discrete),1,0.95,0.4303030303030303,0.4841865123266473,33.000983476638794,0.4841865123266473
229,9,AdaBoost (Real),1,0.95,0.593939393939394,0.6864958603041045,35.55800223350525,0.6864958603041045
230,9,Logistic Regression (Penalty = L2),1,0.95,0.5515151515151515,0.6430674462659999,0.1718132495880127,0.6430674462659999
231,9,Naive Bayes,1,0.95,0.43636363636363634,0.5267316437316311,0.1236577033996582,0.5267316437316311
232,9,KNeighbors Classifier,2,0.95,0.5696969696969697,0.665259491025205,1.476104497909546,0.665259491025205
233,9,SVC Classifier,2,0.95,0.6060606060606061,0.46206375934610827,1.4525744915008545,0.46206375934610827
234,9,Decision Tree,2,0.95,0.48484848484848486,0.5954194592067895,0.07163071632385254,0.5954194592067895
235,9,RandomForest,2,0.95,0.6,0.30867895949930413,0.3460564613342285,0.30867895949930413
236,9,AdaBoost (Discrete),2,0.95,0.43636363636363634,0.5692225725524779,32.74968099594116,0.5692225725524779
237,9,AdaBoost (Real),2,0.95,0.503030303030303,0.6141256193608322,33.74493861198425,0.6141256193608322
238,9,Logistic Regression (Penalty = L2),2,0.95,0.5272727272727272,0.628929491149009,0.15642094612121582,0.628929491149009
239,9,Naive Bayes,2,0.95,0.46060606060606063,0.5523370547494352,0.13315248489379883,0.5523370547494352
240,10,KNeighbors Classifier,0,0.95,0.6287425149700598,0.6999967136458812,1.753458023071289,0.6999967136458812
241,10,SVC Classifier,0,0.95,0.5868263473053892,0.26495145850196566,1.7630140781402588,0.0
242,10,Decision Tree,0,0.95,0.5269461077844312,0.6329892278761841,0.0795128345489502,0.6329892278761841
243,10,RandomForest,0,0.95,0.5748502994011976,0.24124271543573797,0.3357431888580322,0.24124271543573797
244,10,AdaBoost (Discrete),0,0.95,0.437125748502994,0.34329817136034474,36.01780033111572,0.34329817136034474
245,10,AdaBoost (Real),0,0.95,0.5808383233532934,0.6652293915096891,36.1099066734314,0.6652293915096891
246,10,Logistic Regression (Penalty = L2),0,0.95,0.6047904191616766,0.6742049002196551,0.17702102661132812,0.6742049002196551
247,10,Naive Bayes,0,0.95,0.4491017964071856,0.5163666337264373,0.23106598854064941,0.5163666337264373
248,10,KNeighbors Classifier,1,0.95,0.5454545454545454,0.6566096690099397,1.7767860889434814,0.6566096690099397
249,10,SVC Classifier,1,0.95,0.5818181818181818,0.9947780321927768,1.512216329574585,0.0
250,10,Decision Tree,1,0.95,0.6242424242424243,0.7039270078762543,0.07973575592041016,0.7039270078762543
251,10,RandomForest,1,0.95,0.5878787878787879,1.0,0.2789640426635742,0.0
252,10,AdaBoost (Discrete),1,0.95,0.6060606060606061,0.5670076763294473,32.0085346698761,0.5670076763294473
253,10,AdaBoost (Real),1,0.95,0.5454545454545454,0.6205567217966604,35.04765772819519,0.6205567217966604
254,10,Logistic Regression (Penalty = L2),1,0.95,0.5696969696969697,0.6615467691941467,0.23297429084777832,0.6615467691941467
255,10,Naive Bayes,1,0.95,0.43636363636363634,0.5267316437316311,0.16709399223327637,0.5267316437316311
256,10,KNeighbors Classifier,2,0.95,0.5272727272727272,0.6158806592503815,2.042318820953369,0.6158806592503815
257,10,SVC Classifier,2,0.95,0.6060606060606061,0.46206375934610827,1.7182657718658447,0.46206375934610827
258,10,Decision Tree,2,0.95,0.509090909090909,0.6322680932616379,0.0720984935760498,0.6322680932616379
259,10,RandomForest,2,0.95,0.593939393939394,0.24499865251482233,0.3068203926086426,0.24499865251482233
260,10,AdaBoost (Discrete),2,0.95,0.43636363636363634,0.5692225725524779,32.32798790931702,0.5692225725524779
261,10,AdaBoost (Real),2,0.95,0.5757575757575758,0.6882250763254332,33.87195086479187,0.6882250763254332
262,10,Logistic Regression (Penalty = L2),2,0.95,0.5393939393939394,0.6435609748144865,0.15223073959350586,0.6435609748144865
263,10,Naive Bayes,2,0.95,0.45454545454545453,0.5489690621400171,0.19093799591064453,0.5489690621400171
264,11,KNeighbors Classifier,0,0.95,0.6287425149700598,0.6999967136458812,1.5757853984832764,0.6999967136458812
265,11,SVC Classifier,0,0.95,0.5868263473053892,0.26495145850196566,1.738128900527954,0.0
266,11,Decision Tree,0,0.95,0.5868263473053892,0.6761917630820112,0.0803220272064209,0.6761917630820112
267,11,RandomForest,0,0.95,0.5748502994011976,0.24124271543573797,0.3542459011077881,0.24124271543573797
268,11,AdaBoost (Discrete),0,0.95,0.437125748502994,0.34329817136034474,32.08749771118164,0.34329817136034474
269,11,AdaBoost (Real),0,0.95,0.5868263473053892,0.68563427278786,32.73303961753845,0.68563427278786
270,11,Logistic Regression (Penalty = L2),0,0.95,0.6047904191616766,0.6742049002196551,0.16167736053466797,0.6742049002196551
271,11,Naive Bayes,0,0.95,0.4491017964071856,0.5163666337264373,0.1254444122314453,0.5163666337264373
272,11,KNeighbors Classifier,1,0.95,0.5454545454545454,0.6566096690099397,1.4312255382537842,0.6566096690099397
273,11,SVC Classifier,1,0.95,0.5818181818181818,0.9947780321927768,1.4929542541503906,0.0
274,11,Decision Tree,1,0.95,0.5212121212121212,0.6075569272759603,0.07038426399230957,0.6075569272759603
275,11,RandomForest,1,0.95,0.5878787878787879,1.0,0.2553985118865967,0.0
276,11,AdaBoost (Discrete),1,0.95,0.5757575757575758,0.6169557313153966,28.34660243988037,0.6169557313153966
277,11,AdaBoost (Real),1,0.95,0.48484848484848486,0.5714203649031516,29.472999572753906,0.5714203649031516
278,11,Logistic Regression (Penalty = L2),1,0.95,0.5696969696969697,0.6615467691941467,0.12355208396911621,0.6615467691941467
279,11,Naive Bayes,1,0.95,0.43636363636363634,0.5267316437316311,0.15593862533569336,0.5267316437316311
280,11,KNeighbors Classifier,2,0.95,0.5272727272727272,0.6158806592503815,1.283193588256836,0.6158806592503815
281,11,SVC Classifier,2,0.95,0.6060606060606061,0.46206375934610827,1.3217835426330566,0.46206375934610827
282,11,Decision Tree,2,0.95,0.5272727272727272,0.6249019454015914,0.06799125671386719,0.6249019454015914
283,11,RandomForest,2,0.95,0.593939393939394,0.24499865251482233,0.2706897258758545,0.24499865251482233
284,11,AdaBoost (Discrete),2,0.95,0.43636363636363634,0.5692225725524779,25.446693897247314,0.5692225725524779
285,11,AdaBoost (Real),2,0.95,0.5333333333333333,0.6398408860731518,29.61738872528076,0.6398408860731518
286,11,Logistic Regression (Penalty = L2),2,0.95,0.5393939393939394,0.6435609748144865,0.13660478591918945,0.6435609748144865
287,11,Naive Bayes,2,0.95,0.45454545454545453,0.5489690621400171,0.09456205368041992,0.5489690621400171
288,12,KNeighbors Classifier,0,0.95,0.6526946107784432,0.7129027762391871,1.0941052436828613,0.7129027762391871
289,12,SVC Classifier,0,0.95,0.592814371257485,0.3118047822311618,1.0796499252319336,0.0
290,12,Decision Tree,0,0.95,0.5568862275449101,0.6238141766604991,0.033995628356933594,0.6238141766604991
291,12,RandomForest,0,0.95,0.5748502994011976,0.11975720203651022,0.2519843578338623,0.0
292,12,AdaBoost (Discrete),0,0.95,0.41916167664670656,0.4850656159250321,24.951168298721313,0.4850656159250321
293,12,AdaBoost (Real),0,0.95,0.6347305389221557,0.7176241242708175,25.206847190856934,0.7176241242708175
294,12,Logistic Regression (Penalty = L2),0,0.95,0.6407185628742516,0.7270752453398629,0.139235258102417,0.7270752453398629
295,12,Naive Bayes,0,0.95,0.46706586826347307,0.525271256626669,0.1165761947631836,0.525271256626669
296,12,KNeighbors Classifier,1,0.95,0.5575757575757576,0.650633639755825,1.2117013931274414,0.650633639755825
297,12,SVC Classifier,1,0.95,0.5818181818181818,0.9947780321927768,1.1106476783752441,0.0
298,12,Decision Tree,1,0.95,0.5393939393939394,0.6058923794082072,0.03733992576599121,0.6058923794082072
299,12,RandomForest,1,0.95,0.5818181818181818,1.0,0.2219541072845459,0.0
300,12,AdaBoost (Discrete),1,0.95,0.5636363636363636,0.5278335959890004,22.7299063205719,0.5278335959890004
301,12,AdaBoost (Real),1,0.95,0.5333333333333333,0.6086615786669308,24.788530588150024,0.6086615786669308
302,12,Logistic Regression (Penalty = L2),1,0.95,0.5575757575757576,0.6322680932616379,0.16569924354553223,0.6322680932616379
303,12,Naive Bayes,1,0.95,0.49696969696969695,0.5579701547631802,0.08238005638122559,0.5579701547631802
304,12,KNeighbors Classifier,2,0.95,0.503030303030303,0.6104481322689537,1.0623769760131836,0.6104481322689537
305,12,SVC Classifier,2,0.95,0.6,0.386191371578543,1.028947353363037,0.386191371578543
306,12,Decision Tree,2,0.95,0.5515151515151515,0.6340512923306705,0.03445124626159668,0.6340512923306705
307,12,RandomForest,2,0.95,0.593939393939394,0.24499865251482233,0.19446992874145508,0.24499865251482233
308,12,AdaBoost (Discrete),2,0.95,0.43636363636363634,0.5692225725524779,22.31132483482361,0.5692225725524779
309,12,AdaBoost (Real),2,0.95,0.4909090909090909,0.6173579189986083,21.611494779586792,0.6173579189986083
310,12,Logistic Regression (Penalty = L2),2,0.95,0.5333333333333333,0.6430674462659999,0.13690662384033203,0.6430674462659999
311,12,Naive Bayes,2,0.95,0.49696969696969695,0.5836666096061082,0.06000661849975586,0.5836666096061082
