,feat_set_id,classifier,fold_id,feat_th,score,geo_score,exec_t,geo_score_woz
0,0,KNeighbors Classifier,0,0.75,0.8235294117647058,0.7334418672240467,0.29128408432006836,0.0
1,0,SVC Classifier,0,0.75,0.7607843137254902,1.0,0.29338550567626953,0.0
2,0,Decision Tree,0,0.75,0.7764705882352941,0.7013576369895455,0.07919907569885254,0.0
3,0,RandomForest,0,0.75,0.7607843137254902,1.0,0.402667760848999,0.0
4,0,AdaBoost (Discrete),0,0.75,0.7568627450980392,0.40402956183842603,35.51862049102783,0.0
5,0,AdaBoost (Real),0,0.75,0.6549019607843137,0.2989021562811547,38.09594511985779,0.0
6,0,Logistic Regression (Penalty = L2),0,0.75,0.7490196078431373,0.32512333276652117,0.4908609390258789,0.0
7,0,Naive Bayes,0,0.75,0.10980392156862745,0.31419291226453727,0.26601362228393555,0.0
8,0,KNeighbors Classifier,1,0.75,0.82,0.7394067633703107,0.25936365127563477,0.0
9,0,SVC Classifier,1,0.75,0.776,1.0,0.2972118854522705,0.0
10,0,Decision Tree,1,0.75,0.828,0.8254757376263204,0.0945882797241211,0.0
11,0,RandomForest,1,0.75,0.788,0.7745966692414834,0.5218617916107178,0.0
12,0,AdaBoost (Discrete),1,0.75,0.832,0.6862905481199933,34.30315637588501,0.0
13,0,AdaBoost (Real),1,0.75,0.724,0.5986206805330004,34.6346070766449,0.0
14,0,Logistic Regression (Penalty = L2),1,0.75,0.804,0.39738847850165865,0.31067776679992676,0.0
15,0,Naive Bayes,1,0.75,0.076,0.4436202961165585,0.21703338623046875,0.0
16,0,KNeighbors Classifier,2,0.75,0.823045267489712,0.7516084187330146,0.25202488899230957,0.0
17,0,SVC Classifier,2,0.75,0.7983539094650206,1.0,0.29062342643737793,0.0
18,0,Decision Tree,2,0.75,0.7942386831275721,0.8345695575996205,0.07088088989257812,0.0
19,0,RandomForest,2,0.75,0.8065843621399177,0.7071067811865476,0.4352455139160156,0.0
20,0,AdaBoost (Discrete),2,0.75,0.6790123456790124,0.7603932558040768,29.292043447494507,0.0
21,0,AdaBoost (Real),2,0.75,0.6008230452674898,0.5419125188605503,41.679973125457764,0.0
22,0,Logistic Regression (Penalty = L2),2,0.75,0.7942386831275721,0.524604185633681,0.5016868114471436,0.0
23,0,Naive Bayes,2,0.75,0.09465020576131687,0.39123977741177407,0.17518043518066406,0.0
24,1,KNeighbors Classifier,0,0.75,0.803921568627451,0.6483597602146889,0.3266596794128418,0.0
25,1,SVC Classifier,0,0.75,0.7607843137254902,1.0,0.2564094066619873,0.0
26,1,Decision Tree,0,0.75,0.7764705882352941,0.770869055368316,0.0027637481689453125,0.0
27,1,RandomForest,0,0.75,0.7607843137254902,1.0,0.525061845779419,0.0
28,1,AdaBoost (Discrete),0,0.75,0.7490196078431373,0.6201884221913534,32.19826698303223,0.0
29,1,AdaBoost (Real),0,0.75,0.6196078431372549,0.3868062238463365,43.88299822807312,0.0
30,1,Logistic Regression (Penalty = L2),0,0.75,0.7686274509803922,0.2848488475943904,0.375873327255249,0.0
31,1,Naive Bayes,0,0.75,0.10196078431372549,0.35176901577047864,0.24910616874694824,0.0
32,1,KNeighbors Classifier,1,0.75,0.752,0.7544336551735973,0.2537269592285156,0.0
33,1,SVC Classifier,1,0.75,0.776,1.0,0.23700976371765137,0.0
34,1,Decision Tree,1,0.75,0.824,0.9426376701659614,0.002768278121948242,0.0
35,1,RandomForest,1,0.75,0.788,0.7745966692414834,0.4552180767059326,0.0
36,1,AdaBoost (Discrete),1,0.75,0.756,0.6899334495752577,34.37164497375488,0.0
37,1,AdaBoost (Real),1,0.75,0.684,0.5151873823579309,55.02032399177551,0.0
38,1,Logistic Regression (Penalty = L2),1,0.75,0.796,0.4723159616352968,0.5163779258728027,0.0
39,1,Naive Bayes,1,0.75,0.096,0.3725558144718659,0.32511091232299805,0.0
40,1,KNeighbors Classifier,2,0.75,0.8148148148148148,0.6139669738544413,0.3561248779296875,0.0
41,1,SVC Classifier,2,0.75,0.7983539094650206,1.0,0.4194788932800293,0.0
42,1,Decision Tree,2,0.75,0.8436213991769548,0.7260459930168318,0.11471199989318848,0.0
43,1,RandomForest,2,0.75,0.8065843621399177,0.7071067811865476,0.7231416702270508,0.0
44,1,AdaBoost (Discrete),2,0.75,0.6872427983539094,0.5717199197561221,39.48561501502991,0.0
45,1,AdaBoost (Real),2,0.75,0.6172839506172839,0.5519092765483161,53.65320634841919,0.0
46,1,Logistic Regression (Penalty = L2),2,0.75,0.7695473251028807,0.4446462194029551,0.5386686325073242,0.0
47,1,Naive Bayes,2,0.75,0.102880658436214,0.499352745111068,0.199354887008667,0.0
48,2,KNeighbors Classifier,0,0.75,0.7803921568627451,0.6115432113826129,0.31212782859802246,0.0
49,2,SVC Classifier,0,0.75,0.7607843137254902,1.0,0.3160061836242676,0.0
50,2,Decision Tree,0,0.75,0.7843137254901961,0.7024096381703754,0.07082891464233398,0.0
51,2,RandomForest,0,0.75,0.7607843137254902,1.0,0.5353868007659912,0.0
52,2,AdaBoost (Discrete),0,0.75,0.6392156862745098,0.4595723975709855,39.294513463974,0.0
53,2,AdaBoost (Real),0,0.75,0.592156862745098,0.46075479938004726,51.84488368034363,0.0
54,2,Logistic Regression (Penalty = L2),0,0.75,0.7568627450980392,0.3258232818371845,0.44650745391845703,0.0
55,2,Naive Bayes,0,0.75,0.10980392156862745,0.31419291226453727,0.2003176212310791,0.0
56,2,KNeighbors Classifier,1,0.75,0.812,0.6431651081084455,0.30016350746154785,0.0
57,2,SVC Classifier,1,0.75,0.776,1.0,0.410351037979126,0.0
58,2,Decision Tree,1,0.75,0.784,0.6930024115859805,0.08691763877868652,0.0
59,2,RandomForest,1,0.75,0.78,0.408248290463863,0.6455600261688232,0.0
60,2,AdaBoost (Discrete),1,0.75,0.56,0.447117914504779,40.68324899673462,0.0
61,2,AdaBoost (Real),1,0.75,0.448,0.4261312192905554,53.25961470603943,0.0
62,2,Logistic Regression (Penalty = L2),1,0.75,0.8,0.33144540173399867,0.4598884582519531,0.0
63,2,Naive Bayes,1,0.75,0.084,0.279199252841938,0.2353043556213379,0.0
64,2,KNeighbors Classifier,2,0.75,0.7242798353909465,0.5753743144795835,0.3229978084564209,0.0
65,2,SVC Classifier,2,0.75,0.7983539094650206,1.0,0.32517218589782715,0.0
66,2,Decision Tree,2,0.75,0.7983539094650206,0.6778784023011037,0.10635137557983398,0.0
67,2,RandomForest,2,0.75,0.7983539094650206,0.703452458112659,0.7283315658569336,0.0
68,2,AdaBoost (Discrete),2,0.75,0.7160493827160493,0.5560482090974957,41.320683002471924,0.0
69,2,AdaBoost (Real),2,0.75,0.49794238683127573,0.4714424837082543,54.41738200187683,0.0
70,2,Logistic Regression (Penalty = L2),2,0.75,0.7901234567901234,0.5316581699817605,0.39632439613342285,0.0
71,2,Naive Bayes,2,0.75,0.10699588477366255,0.4563925617881304,0.10944819450378418,0.0
72,3,KNeighbors Classifier,0,0.75,0.7725490196078432,0.6766309880861509,0.43477940559387207,0.0
73,3,SVC Classifier,0,0.75,0.7607843137254902,1.0,0.2176501750946045,0.0
74,3,Decision Tree,0,0.75,0.7725490196078432,0.48085989339643187,0.10637235641479492,0.0
75,3,RandomForest,0,0.75,0.7607843137254902,1.0,0.6468014717102051,0.0
76,3,AdaBoost (Discrete),0,0.75,0.6941176470588235,0.4778698388106491,51.205984115600586,0.0
77,3,AdaBoost (Real),0,0.75,0.6431372549019608,0.44906621453428935,60.95562291145325,0.0
78,3,Logistic Regression (Penalty = L2),0,0.75,0.7725490196078432,0.28514649594268227,0.5155107975006104,0.0
79,3,Naive Bayes,0,0.75,0.10196078431372549,0.330562326185227,0.3534548282623291,0.0
80,3,KNeighbors Classifier,1,0.75,0.8,0.599638102579957,0.3157229423522949,0.0
81,3,SVC Classifier,1,0.75,0.776,1.0,0.3410611152648926,0.0
82,3,Decision Tree,1,0.75,0.828,0.5219730158628969,0.10987472534179688,0.0
83,3,RandomForest,1,0.75,0.776,1.0,0.7838983535766602,0.0
84,3,AdaBoost (Discrete),1,0.75,0.716,0.3248544743437644,46.203535318374634,0.0
85,3,AdaBoost (Real),1,0.75,0.672,0.418794636051158,59.03965735435486,0.0
86,3,Logistic Regression (Penalty = L2),1,0.75,0.808,0.39773448577795095,0.5021233558654785,0.0
87,3,Naive Bayes,1,0.75,0.084,0.279199252841938,0.22106027603149414,0.0
88,3,KNeighbors Classifier,2,0.75,0.7983539094650206,0.6989795604918129,0.32589077949523926,0.0
89,3,SVC Classifier,2,0.75,0.7983539094650206,1.0,0.43093347549438477,0.0
90,3,Decision Tree,2,0.75,0.7695473251028807,0.727879774920797,0.002518177032470703,0.0
91,3,RandomForest,2,0.75,0.8065843621399177,0.5773502691896257,0.7355484962463379,0.0
92,3,AdaBoost (Discrete),2,0.75,0.6707818930041153,0.7208137212897424,43.271684408187866,0.0
93,3,AdaBoost (Real),2,0.75,0.5102880658436214,0.5479525759053717,53.45185685157776,0.0
94,3,Logistic Regression (Penalty = L2),2,0.75,0.8065843621399177,0.5262946745583642,0.6890735626220703,0.0
95,3,Naive Bayes,2,0.75,0.102880658436214,0.4362875924479022,0.1620492935180664,0.0
96,4,KNeighbors Classifier,0,0.75,0.7803921568627451,0.6459082605112664,0.38206958770751953,0.0
97,4,SVC Classifier,0,0.75,0.7607843137254902,1.0,0.25763893127441406,0.0
98,4,Decision Tree,0,0.75,0.7490196078431373,0.7211590656090169,0.06771016120910645,0.0
99,4,RandomForest,0,0.75,0.7607843137254902,1.0,1.0094695091247559,0.0
100,4,AdaBoost (Discrete),0,0.75,0.6862745098039216,0.6189037278978523,47.53528165817261,0.0
101,4,AdaBoost (Real),0,0.75,0.5843137254901961,0.38360288604966497,64.70494627952576,0.0
102,4,Logistic Regression (Penalty = L2),0,0.75,0.7686274509803922,0.3115857230292383,0.5774340629577637,0.0
103,4,Naive Bayes,0,0.75,0.10196078431372549,0.35176901577047864,0.27251267433166504,0.0
104,4,KNeighbors Classifier,1,0.75,0.796,0.7600278605265472,0.4064290523529053,0.0
105,4,SVC Classifier,1,0.75,0.776,1.0,0.40351319313049316,0.0
106,4,Decision Tree,1,0.75,0.848,0.9236618366099314,0.13884210586547852,0.0
107,4,RandomForest,1,0.75,0.776,1.0,0.892542839050293,0.0
108,4,AdaBoost (Discrete),1,0.75,0.716,0.6845958542901386,77.98616123199463,0.0
109,4,AdaBoost (Real),1,0.75,0.672,0.4118621095236553,105.29060792922974,0.0
110,4,Logistic Regression (Penalty = L2),1,0.75,0.796,0.5862774913242927,0.7632479667663574,0.0
111,4,Naive Bayes,1,0.75,0.092,0.6866916795539616,0.41483139991760254,0.0
112,4,KNeighbors Classifier,2,0.75,0.8189300411522634,0.6143169132211396,0.6288127899169922,0.0
113,4,SVC Classifier,2,0.75,0.7983539094650206,1.0,0.6205747127532959,0.0
114,4,Decision Tree,2,0.75,0.7654320987654321,0.8752869623448963,0.19380879402160645,0.0
115,4,RandomForest,2,0.75,0.7983539094650206,1.0,1.039217472076416,0.0
116,4,AdaBoost (Discrete),2,0.75,0.6502057613168725,0.6234182575628444,75.87632608413696,0.0
117,4,AdaBoost (Real),2,0.75,0.6378600823045267,0.5566390085577334,110.43480658531189,0.0
118,4,Logistic Regression (Penalty = L2),2,0.75,0.7736625514403292,0.44525574272455803,0.8644657135009766,0.0
119,4,Naive Bayes,2,0.75,0.09053497942386832,0.4199039333109989,0.3281545639038086,0.0
120,5,KNeighbors Classifier,0,0.75,0.7803921568627451,0.5042343216221411,0.5429959297180176,0.0
121,5,SVC Classifier,0,0.75,0.7607843137254902,1.0,0.40907883644104004,0.0
122,5,Decision Tree,0,0.75,0.7764705882352941,0.6634779026970928,0.19864511489868164,0.0
123,5,RandomForest,0,0.75,0.7607843137254902,1.0,1.3545520305633545,0.0
124,5,AdaBoost (Discrete),0,0.75,0.7529411764705882,0.30727599523902643,83.99313139915466,0.0
125,5,AdaBoost (Real),0,0.75,0.6666666666666666,0.3802811487111024,115.80759787559509,0.0
126,5,Logistic Regression (Penalty = L2),0,0.75,0.7568627450980392,0.28394835902750637,0.8646163940429688,0.0
127,5,Naive Bayes,0,0.75,0.10196078431372549,0.29993580680997034,0.2170581817626953,0.0
128,5,KNeighbors Classifier,1,0.75,0.816,0.500678109049936,0.6409149169921875,0.0
129,5,SVC Classifier,1,0.75,0.776,1.0,0.8173136711120605,0.0
130,5,Decision Tree,1,0.75,0.816,0.673138698533935,0.21016526222229004,0.0
131,5,RandomForest,1,0.75,0.776,1.0,1.451627254486084,0.0
132,5,AdaBoost (Discrete),1,0.75,0.748,0.5724882154455372,86.73360681533813,0.0
133,5,AdaBoost (Real),1,0.75,0.664,0.3227903009456869,103.69586157798767,0.0
134,5,Logistic Regression (Penalty = L2),1,0.75,0.78,0.32127586985818757,0.6495413780212402,0.0
135,5,Naive Bayes,1,0.75,0.08,0.45986329782677027,0.25966477394104004,0.0
136,5,KNeighbors Classifier,2,0.75,0.8024691358024691,0.5520989426219582,0.36698484420776367,0.0
137,5,SVC Classifier,2,0.75,0.7983539094650206,1.0,0.24093413352966309,0.0
138,5,Decision Tree,2,0.75,0.7942386831275721,0.6423086348029441,0.10700154304504395,0.0
139,5,RandomForest,2,0.75,0.7901234567901234,0.6997790520224827,0.6991238594055176,0.0
140,5,AdaBoost (Discrete),2,0.75,0.7078189300411523,0.5334826185781301,44.76815581321716,0.0
141,5,AdaBoost (Real),2,0.75,0.6831275720164609,0.460778657532671,60.65095925331116,0.0
142,5,Logistic Regression (Penalty = L2),2,0.75,0.7901234567901234,0.5316581699817605,0.5073699951171875,0.0
143,5,Naive Bayes,2,0.75,0.08641975308641975,0.3622390163464699,0.11477804183959961,0.0
144,6,KNeighbors Classifier,0,0.75,0.7725490196078432,0.6766309880861509,0.24161720275878906,0.0
145,6,SVC Classifier,0,0.75,0.7607843137254902,1.0,0.23801970481872559,0.0
146,6,Decision Tree,0,0.75,0.792156862745098,0.4514318527085044,0.0989389419555664,0.0
147,6,RandomForest,0,0.75,0.7607843137254902,1.0,0.8380286693572998,0.0
148,6,AdaBoost (Discrete),0,0.75,0.6941176470588235,0.4778698388106491,48.10441017150879,0.0
149,6,AdaBoost (Real),0,0.75,0.7019607843137254,0.4132134865416843,63.50588655471802,0.0
150,6,Logistic Regression (Penalty = L2),0,0.75,0.7725490196078432,0.28514649594268227,0.6212401390075684,0.0
151,6,Naive Bayes,0,0.75,0.10196078431372549,0.330562326185227,0.24890565872192383,0.0
152,6,KNeighbors Classifier,1,0.75,0.8,0.599638102579957,0.277573823928833,0.0
153,6,SVC Classifier,1,0.75,0.776,1.0,0.3583869934082031,0.0
154,6,Decision Tree,1,0.75,0.828,0.5726676365819611,0.0025086402893066406,0.0
155,6,RandomForest,1,0.75,0.776,1.0,0.8479559421539307,0.0
156,6,AdaBoost (Discrete),1,0.75,0.728,0.32579747128628916,48.9682559967041,0.0
157,6,AdaBoost (Real),1,0.75,0.632,0.30682783440641737,64.72996354103088,0.0
158,6,Logistic Regression (Penalty = L2),1,0.75,0.808,0.39773448577795095,0.6672084331512451,0.0
159,6,Naive Bayes,1,0.75,0.08,0.45986329782677027,0.2434689998626709,0.0
160,6,KNeighbors Classifier,2,0.75,0.7983539094650206,0.6989795604918129,0.3625328540802002,0.0
161,6,SVC Classifier,2,0.75,0.7983539094650206,1.0,0.2266385555267334,0.0
162,6,Decision Tree,2,0.75,0.7942386831275721,0.7315378308272806,0.1185460090637207,0.0
163,6,RandomForest,2,0.75,0.8106995884773662,0.5493740097051336,0.8403666019439697,0.0
164,6,AdaBoost (Discrete),2,0.75,0.551440329218107,0.8177195430411656,50.16364526748657,0.0
165,6,AdaBoost (Real),2,0.75,0.49794238683127573,0.5450633854458582,64.15431880950928,0.0
166,6,Logistic Regression (Penalty = L2),2,0.75,0.8065843621399177,0.5262946745583642,0.51582932472229,0.0
167,6,Naive Bayes,2,0.75,0.09053497942386832,0.37400491341941794,0.2374410629272461,0.0
168,7,KNeighbors Classifier,0,0.75,0.792156862745098,0.5832771550316272,0.35338282585144043,0.0
169,7,SVC Classifier,0,0.75,0.7607843137254902,1.0,0.3585233688354492,0.0
170,7,Decision Tree,0,0.75,0.7686274509803922,0.5028696528576264,0.11369705200195312,0.0
171,7,RandomForest,0,0.75,0.7607843137254902,1.0,0.8193807601928711,0.0
172,7,AdaBoost (Discrete),0,0.75,0.6352941176470588,0.5138291745023194,46.433895111083984,0.0
173,7,AdaBoost (Real),0,0.75,0.596078431372549,0.3714277030663233,63.392754554748535,0.0
174,7,Logistic Regression (Penalty = L2),0,0.75,0.7647058823529411,0.33848746743589886,0.4872307777404785,0.0
175,7,Naive Bayes,0,0.75,0.08235294117647059,0.2700385865647882,0.3573172092437744,0.0
176,7,KNeighbors Classifier,1,0.75,0.808,0.8291215795448893,0.23851680755615234,0.0
177,7,SVC Classifier,1,0.75,0.776,1.0,0.3451063632965088,0.0
178,7,Decision Tree,1,0.75,0.808,0.5991655739921069,0.1336503028869629,0.0
179,7,RandomForest,1,0.75,0.776,1.0,0.8126506805419922,0.0
180,7,AdaBoost (Discrete),1,0.75,0.732,0.8164960024050156,46.059823751449585,0.0
181,7,AdaBoost (Real),1,0.75,0.644,0.42714928292745274,60.0714955329895,0.0
182,7,Logistic Regression (Penalty = L2),1,0.75,0.78,0.34140655617640037,0.3911781311035156,0.0
183,7,Naive Bayes,1,0.75,0.072,0.2765494425584357,0.33701539039611816,0.0
184,7,KNeighbors Classifier,2,0.75,0.7983539094650206,0.6528076291258673,0.4409668445587158,0.0
185,7,SVC Classifier,2,0.75,0.7983539094650206,1.0,0.3371591567993164,0.0
186,7,Decision Tree,2,0.75,0.7942386831275721,0.7474176867929438,0.0025527477264404297,0.0
187,7,RandomForest,2,0.75,0.8065843621399177,0.7071067811865476,0.6648058891296387,0.0
188,7,AdaBoost (Discrete),2,0.75,0.6954732510288066,0.8000946191658098,43.90489459037781,0.0
189,7,AdaBoost (Real),2,0.75,0.5637860082304527,0.38807238226244156,55.96377444267273,0.0
190,7,Logistic Regression (Penalty = L2),2,0.75,0.7777777777777778,0.4930304499002129,0.5263071060180664,0.0
191,7,Naive Bayes,2,0.75,0.07818930041152264,0.4095609157686178,0.2090764045715332,0.0
192,8,KNeighbors Classifier,0,0.75,0.792156862745098,0.6318838643973012,0.21367692947387695,0.0
193,8,SVC Classifier,0,0.75,0.7607843137254902,1.0,0.23007726669311523,0.0
194,8,Decision Tree,0,0.75,0.7803921568627451,0.5042343216221411,0.10255002975463867,0.0
195,8,RandomForest,0,0.75,0.7607843137254902,1.0,0.8568875789642334,0.0
196,8,AdaBoost (Discrete),0,0.75,0.7490196078431373,0.5014541253502327,41.11752367019653,0.0
197,8,AdaBoost (Real),0,0.75,0.7058823529411765,0.3578141532740179,54.051610231399536,0.0
198,8,Logistic Regression (Penalty = L2),0,0.75,0.7764705882352941,0.28544290666187366,0.48952198028564453,0.0
199,8,Naive Bayes,0,0.75,0.08235294117647059,0.3002106051704353,0.21299338340759277,0.0
200,8,KNeighbors Classifier,1,0.75,0.812,0.6015397415170181,0.20824670791625977,0.0
201,8,SVC Classifier,1,0.75,0.776,1.0,0.24547314643859863,0.0
202,8,Decision Tree,1,0.75,0.816,0.6002288766944873,0.0014770030975341797,0.0
203,8,RandomForest,1,0.75,0.776,1.0,0.6280453205108643,0.0
204,8,AdaBoost (Discrete),1,0.75,0.752,0.6787598334725653,43.70538640022278,0.0
205,8,AdaBoost (Real),1,0.75,0.664,0.4261814680093445,56.46571230888367,0.0
206,8,Logistic Regression (Penalty = L2),1,0.75,0.792,0.3930897370226323,0.3913536071777344,0.0
207,8,Naive Bayes,1,0.75,0.084,0.31328084887132,0.08918237686157227,0.0
208,8,KNeighbors Classifier,2,0.75,0.8065843621399177,0.5364776922009054,0.2945072650909424,0.0
209,8,SVC Classifier,2,0.75,0.7983539094650206,1.0,0.21029233932495117,0.0
210,8,Decision Tree,2,0.75,0.7654320987654321,0.6241264331607532,0.0019757747650146484,0.0
211,8,RandomForest,2,0.75,0.7983539094650206,1.0,0.7320470809936523,0.0
212,8,AdaBoost (Discrete),2,0.75,0.7325102880658436,0.5456720122989613,41.2741482257843,0.0
213,8,AdaBoost (Real),2,0.75,0.6954732510288066,0.5102259945302845,55.87270379066467,0.0
214,8,Logistic Regression (Penalty = L2),2,0.75,0.7860082304526749,0.4470694492780124,0.5178382396697998,0.0
215,8,Naive Bayes,2,0.75,0.0823045267489712,0.4267434818416163,0.2001967430114746,0.0
216,9,KNeighbors Classifier,0,0.75,0.8,0.633208580147794,0.3800530433654785,0.0
217,9,SVC Classifier,0,0.75,0.7607843137254902,1.0,0.31583428382873535,0.0
218,9,Decision Tree,0,0.75,0.7803921568627451,0.5649650069484138,0.0022869110107421875,0.0
219,9,RandomForest,0,0.75,0.7607843137254902,1.0,0.7462549209594727,0.0
220,9,AdaBoost (Discrete),0,0.75,0.6588235294117647,0.37933751139685945,41.442107915878296,0.0
221,9,AdaBoost (Real),0,0.75,0.7137254901960784,0.38575507100161105,56.397247314453125,0.0
222,9,Logistic Regression (Penalty = L2),0,0.75,0.7725490196078432,0.28514649594268227,0.48825550079345703,0.0
223,9,Naive Bayes,0,0.75,0.09803921568627451,0.3054479018783836,0.2079777717590332,0.0
224,9,KNeighbors Classifier,1,0.75,0.816,0.6021683110619066,0.3125166893005371,0.0
225,9,SVC Classifier,1,0.75,0.776,1.0,0.3082559108734131,0.0
226,9,Decision Tree,1,0.75,0.816,0.6002288766944873,0.002461671829223633,0.0
227,9,RandomForest,1,0.75,0.776,1.0,0.6266782283782959,0.0
228,9,AdaBoost (Discrete),1,0.75,0.704,0.45180084174473817,41.4469211101532,0.0
229,9,AdaBoost (Real),1,0.75,0.66,0.3684128945341211,56.66988015174866,0.0
230,9,Logistic Regression (Penalty = L2),1,0.75,0.784,0.2853751021838173,0.41443943977355957,0.0
231,9,Naive Bayes,1,0.75,0.084,0.279199252841938,0.22840237617492676,0.0
232,9,KNeighbors Classifier,2,0.75,0.7983539094650206,0.6528076291258673,0.3248405456542969,0.0
233,9,SVC Classifier,2,0.75,0.7983539094650206,1.0,0.318706750869751,0.0
234,9,Decision Tree,2,0.75,0.7695473251028807,0.6677611055214463,0.11452150344848633,0.0
235,9,RandomForest,2,0.75,0.7983539094650206,0.5465126348554787,0.7506542205810547,0.0
236,9,AdaBoost (Discrete),2,0.75,0.6831275720164609,0.5377310115826172,41.86543321609497,0.0
237,9,AdaBoost (Real),2,0.75,0.6584362139917695,0.4313714323734476,55.6358208656311,0.0
238,9,Logistic Regression (Penalty = L2),2,0.75,0.7901234567901234,0.5316581699817605,0.43589043617248535,0.0
239,9,Naive Bayes,2,0.75,0.09465020576131687,0.4039476491322161,0.10518932342529297,0.0
240,10,KNeighbors Classifier,0,0.75,0.8196078431372549,0.6794911240753443,0.5059711933135986,0.0
241,10,SVC Classifier,0,0.75,0.7607843137254902,1.0,0.4205784797668457,0.0
242,10,Decision Tree,0,0.75,0.803921568627451,0.9283974521824769,0.0029599666595458984,0.0
243,10,RandomForest,0,0.75,0.7607843137254902,1.0,0.8262662887573242,0.0
244,10,AdaBoost (Discrete),0,0.75,0.7725490196078432,0.9840343533044587,46.21975588798523,0.0
245,10,AdaBoost (Real),0,0.75,0.6980392156862745,0.3917854950715044,57.79720139503479,0.0
246,10,Logistic Regression (Penalty = L2),0,0.75,0.7647058823529411,0.3920788795851925,0.8474206924438477,0.0
247,10,Naive Bayes,0,0.75,0.10980392156862745,0.31419291226453727,0.2093496322631836,0.0
248,10,KNeighbors Classifier,1,0.75,0.8,0.7370696708058684,0.3138284683227539,0.0
249,10,SVC Classifier,1,0.75,0.776,1.0,0.5339951515197754,0.0
250,10,Decision Tree,1,0.75,0.824,0.8067864447819076,0.0018939971923828125,0.0
251,10,RandomForest,1,0.75,0.788,0.7745966692414834,0.7248482704162598,0.0
252,10,AdaBoost (Discrete),1,0.75,0.836,0.7311497119186926,45.303277015686035,0.0
253,10,AdaBoost (Real),1,0.75,0.724,0.5986206805330004,58.118308782577515,0.0
254,10,Logistic Regression (Penalty = L2),1,0.75,0.808,0.39773448577795095,0.6504178047180176,0.0
255,10,Naive Bayes,1,0.75,0.08,0.27041586643733656,0.1898820400238037,0.0
256,10,KNeighbors Classifier,2,0.75,0.8353909465020576,0.7530212497613873,0.4577062129974365,0.0
257,10,SVC Classifier,2,0.75,0.7983539094650206,1.0,0.3678109645843506,0.0
258,10,Decision Tree,2,0.75,0.7942386831275721,0.9788181822372916,0.09078288078308105,0.0
259,10,RandomForest,2,0.75,0.7983539094650206,1.0,0.6436820030212402,0.0
260,10,AdaBoost (Discrete),2,0.75,0.7407407407407407,0.6205568408333527,44.90858817100525,0.0
261,10,AdaBoost (Real),2,0.75,0.7037037037037037,0.6780247257222922,58.71083855628967,0.0
262,10,Logistic Regression (Penalty = L2),2,0.75,0.7860082304526749,0.5234649692628083,0.7509021759033203,0.0
263,10,Naive Bayes,2,0.75,0.10699588477366255,0.4563925617881304,0.20550942420959473,0.0
264,11,KNeighbors Classifier,0,0.75,0.8196078431372549,0.6794911240753443,0.4316236972808838,0.0
265,11,SVC Classifier,0,0.75,0.7607843137254902,1.0,0.5463671684265137,0.0
266,11,Decision Tree,0,0.75,0.803921568627451,0.8282270656706371,0.0949711799621582,0.0
267,11,RandomForest,0,0.75,0.7607843137254902,1.0,0.7323503494262695,0.0
268,11,AdaBoost (Discrete),0,0.75,0.792156862745098,0.8846991476935628,47.00929141044617,0.0
269,11,AdaBoost (Real),0,0.75,0.6980392156862745,0.3917854950715044,55.85293626785278,0.0
270,11,Logistic Regression (Penalty = L2),0,0.75,0.7647058823529411,0.3920788795851925,0.7168798446655273,0.0
271,11,Naive Bayes,0,0.75,0.10980392156862745,0.31419291226453727,0.11416888236999512,0.0
272,11,KNeighbors Classifier,1,0.75,0.8,0.7370696708058684,0.31575703620910645,0.0
273,11,SVC Classifier,1,0.75,0.776,1.0,0.4132368564605713,0.0
274,11,Decision Tree,1,0.75,0.836,0.9444609992947434,0.11886334419250488,0.0
275,11,RandomForest,1,0.75,0.788,0.7745966692414834,0.5543298721313477,0.0
276,11,AdaBoost (Discrete),1,0.75,0.84,0.6871244452026302,46.72755765914917,0.0
277,11,AdaBoost (Real),1,0.75,0.724,0.5986206805330004,57.28768229484558,0.0
278,11,Logistic Regression (Penalty = L2),1,0.75,0.808,0.39773448577795095,0.6623654365539551,0.0
279,11,Naive Bayes,1,0.75,0.08,0.27041586643733656,0.2259964942932129,0.0
280,11,KNeighbors Classifier,2,0.75,0.8353909465020576,0.7530212497613873,0.3960709571838379,0.0
281,11,SVC Classifier,2,0.75,0.7983539094650206,1.0,0.4974956512451172,0.0
282,11,Decision Tree,2,0.75,0.7860082304526749,0.8335137946861616,0.09913325309753418,0.0
283,11,RandomForest,2,0.75,0.7983539094650206,1.0,0.7351367473602295,0.0
284,11,AdaBoost (Discrete),2,0.75,0.7407407407407407,0.6205568408333527,42.55827975273132,0.0
285,11,AdaBoost (Real),2,0.75,0.6090534979423868,0.47000106156057164,55.4947669506073,0.0
286,11,Logistic Regression (Penalty = L2),2,0.75,0.7860082304526749,0.5234649692628083,0.6410501003265381,0.0
287,11,Naive Bayes,2,0.75,0.10699588477366255,0.4563925617881304,0.09881734848022461,0.0
288,12,KNeighbors Classifier,0,0.75,0.7764705882352941,0.5361441992210996,0.2990758419036865,0.0
289,12,SVC Classifier,0,0.75,0.7607843137254902,1.0,0.2008066177368164,0.0
290,12,Decision Tree,0,0.75,0.792156862745098,0.4424410227159952,0.10211873054504395,0.0
291,12,RandomForest,0,0.75,0.7607843137254902,1.0,0.6321415901184082,0.0
292,12,AdaBoost (Discrete),0,0.75,0.7803921568627451,0.506818034039017,37.93504285812378,0.0
293,12,AdaBoost (Real),0,0.75,0.7254901960784313,0.5367513864750919,48.15042424201965,0.0
294,12,Logistic Regression (Penalty = L2),0,0.75,0.7647058823529411,0.4040819145799253,0.2829010486602783,0.0
295,12,Naive Bayes,0,0.75,0.07058823529411765,0.26943944845710593,0.18772220611572266,0.0
296,12,KNeighbors Classifier,1,0.75,0.808,0.7725925213516944,0.29088783264160156,0.0
297,12,SVC Classifier,1,0.75,0.776,1.0,0.28867149353027344,0.0
298,12,Decision Tree,1,0.75,0.8,0.5231212624862053,0.09051775932312012,0.0
299,12,RandomForest,1,0.75,0.776,1.0,0.6817750930786133,0.0
300,12,AdaBoost (Discrete),1,0.75,0.8,0.5870433681905574,34.238245248794556,0.0
301,12,AdaBoost (Real),1,0.75,0.756,0.500085888519873,45.70844268798828,0.0
302,12,Logistic Regression (Penalty = L2),1,0.75,0.78,0.4472135954999579,0.25864195823669434,0.0
303,12,Naive Bayes,1,0.75,0.072,0.5634538227695681,0.1763467788696289,0.0
304,12,KNeighbors Classifier,2,0.75,0.7942386831275721,0.8974984626432273,0.2921755313873291,0.0
305,12,SVC Classifier,2,0.75,0.7983539094650206,1.0,0.2250521183013916,0.0
306,12,Decision Tree,2,0.75,0.7942386831275721,0.652096508015566,0.0014009475708007812,0.0
307,12,RandomForest,2,0.75,0.7901234567901234,0.6997790520224827,0.5412561893463135,0.0
308,12,AdaBoost (Discrete),2,0.75,0.7942386831275721,0.7854322108887516,33.22174310684204,0.0
309,12,AdaBoost (Real),2,0.75,0.7448559670781894,0.6217976365975779,39.59268379211426,0.0
310,12,Logistic Regression (Penalty = L2),2,0.75,0.7860082304526749,0.4947912878821037,0.16263222694396973,0.0
311,12,Naive Bayes,2,0.75,0.05761316872427984,0.2938899356942025,0.08331298828125,0.0
