,feat_set_id,classifier,fold_id,feat_th,score,geo_score,exec_t,geo_score_woz
0,0,KNeighbors Classifier,0,0.2,0.3943726937269373,0.17778293549484556,0.7630002498626709,0.0
1,0,SVC Classifier,0,0.2,0.5456642066420664,0.688164205347131,19.40132975578308,0.0
2,0,Decision Tree,0,0.2,0.3773062730627306,0.18361723433292224,0.29659366607666016,0.0
3,0,RandomForest,0,0.2,0.5156826568265682,0.6788130328317797,1.1656455993652344,0.0
4,0,AdaBoost (Discrete),0,0.2,0.20940959409594095,0.20292524550871702,69.48793530464172,0.0
5,0,AdaBoost (Real),0,0.2,0.10239852398523985,0.0876530081036738,175.72731924057007,0.0
6,0,Logistic Regression (Penalty = L2),0,0.2,0.46448339483394835,0.16672775968039744,1.2769215106964111,0.0
7,0,Naive Bayes,0,0.2,0.3145756457564576,0.2922106521791181,0.21240496635437012,0.0
8,0,KNeighbors Classifier,1,0.2,0.4196675900277008,0.15708318889687653,0.5316705703735352,0.0
9,0,SVC Classifier,1,0.2,0.4376731301939058,0.06486581250966159,17.4756863117218,0.0
10,0,Decision Tree,1,0.2,0.4099722991689751,0.15442658187990824,0.19169878959655762,0.0
11,0,RandomForest,1,0.2,0.4773776546629732,0.4646788626346811,0.9411206245422363,0.0
12,0,AdaBoost (Discrete),1,0.2,0.327331486611265,0.3053158480742001,68.87456822395325,0.0
13,0,AdaBoost (Real),1,0.2,0.18744228993536471,0.17122666163225783,96.74251461029053,0.0
14,0,Logistic Regression (Penalty = L2),1,0.2,0.5198522622345337,0.1657049875726875,1.0202488899230957,0.0
15,0,Naive Bayes,1,0.2,0.46537396121883656,0.33864786962444765,0.09395194053649902,0.0
16,0,KNeighbors Classifier,2,0.2,0.4096162736939436,0.16983527403351142,0.46012401580810547,0.0
17,0,SVC Classifier,2,0.2,0.4368932038834951,1.0,14.300729751586914,0.0
18,0,Decision Tree,2,0.2,0.40129449838187703,0.21033446844417855,0.09427499771118164,0.0
19,0,RandomForest,2,0.2,0.4576976421636616,0.07919776654000496,0.8078584671020508,0.0
20,0,AdaBoost (Discrete),2,0.2,0.2838650023116043,0.26925434072669174,58.61430883407593,0.0
21,0,AdaBoost (Real),2,0.2,0.217753120665742,0.2269215707182407,94.22233557701111,0.0
22,0,Logistic Regression (Penalty = L2),2,0.2,0.5071659731853907,0.44509099993388,0.9861397743225098,0.0
23,0,Naive Bayes,2,0.2,0.4137771613499769,0.32778513981930774,0.17537879943847656,0.0
24,1,KNeighbors Classifier,0,0.2,0.3800738007380074,0.1813921081391368,0.458956241607666,0.0
25,1,SVC Classifier,0,0.2,0.5396678966789668,0.6711351489869586,14.475439310073853,0.0
26,1,Decision Tree,0,0.2,0.3768450184501845,0.24374145057228905,0.09822297096252441,0.0
27,1,RandomForest,0,0.2,0.5124538745387454,0.6745845825210648,0.840592622756958,0.0
28,1,AdaBoost (Discrete),0,0.2,0.20018450184501846,0.2324458813648591,57.889812707901,0.0
29,1,AdaBoost (Real),0,0.2,0.06088560885608856,0.0778902722705605,95.39324402809143,0.0
30,1,Logistic Regression (Penalty = L2),0,0.2,0.4783210332103321,0.18412708109082745,1.113063097000122,0.0
31,1,Naive Bayes,0,0.2,0.30904059040590404,0.30028261197564565,0.18346190452575684,0.0
32,1,KNeighbors Classifier,1,0.2,0.3878116343490305,0.11232679422091224,0.3766770362854004,0.0
33,1,SVC Classifier,1,0.2,0.4409048938134811,0.16246284554875157,14.463855028152466,0.0
34,1,Decision Tree,1,0.2,0.36795937211449675,0.21720842391532036,0.1767575740814209,0.0
35,1,RandomForest,1,0.2,0.49584487534626037,0.5611834533938554,0.8219180107116699,0.0
36,1,AdaBoost (Discrete),1,0.2,0.3494921514312096,0.27194032409634805,64.53460359573364,0.0
37,1,AdaBoost (Real),1,0.2,0.20267774699907665,0.21009942028461046,107.51387858390808,0.0
38,1,Logistic Regression (Penalty = L2),1,0.2,0.5244690674053555,0.17885497078278234,1.005732536315918,0.0
39,1,Naive Bayes,1,0.2,0.48153277931671284,0.46897568108262583,0.2459092140197754,0.0
40,1,KNeighbors Classifier,2,0.2,0.4165510864539991,0.176806805683492,0.3332817554473877,0.0
41,1,SVC Classifier,2,0.2,0.4368932038834951,1.0,15.222077369689941,0.0
42,1,Decision Tree,2,0.2,0.391123439667129,0.19658988926900933,0.07474184036254883,0.0
43,1,RandomForest,2,0.2,0.4863615349052242,0.4569886804543119,0.7688114643096924,0.0
44,1,AdaBoost (Discrete),2,0.2,0.3028201571890892,0.290663614068665,65.3285436630249,0.0
45,1,AdaBoost (Real),2,0.2,0.24410540915395285,0.27382700145146677,104.4522955417633,0.0
46,1,Logistic Regression (Penalty = L2),2,0.2,0.5302820157189089,0.45593418715399736,1.0148534774780273,0.0
47,1,Naive Bayes,2,0.2,0.45168747110494684,0.5094120185495947,0.16697931289672852,0.0
48,2,KNeighbors Classifier,0,0.2,0.3371771217712177,0.10628331564290361,0.5899858474731445,0.0
49,2,SVC Classifier,0,0.2,0.43634686346863466,1.0,14.281097412109375,0.0
50,2,Decision Tree,0,0.2,0.3076568265682657,0.1834516535700143,0.16382074356079102,0.0
51,2,RandomForest,0,0.2,0.4469557195571956,0.5760485828905145,0.8311042785644531,0.0
52,2,AdaBoost (Discrete),0,0.2,0.24169741697416974,0.21653431074789786,61.01503586769104,0.0
53,2,AdaBoost (Real),0,0.2,0.07149446494464945,0.1312947165994147,89.3759400844574,0.0
54,2,Logistic Regression (Penalty = L2),0,0.2,0.47186346863468637,0.6088995792243029,0.780301570892334,0.0
55,2,Naive Bayes,0,0.2,0.4077490774907749,0.2587340549470477,0.17410564422607422,0.0
56,2,KNeighbors Classifier,1,0.2,0.3975069252077562,0.15635538631704227,0.3250303268432617,0.0
57,2,SVC Classifier,1,0.2,0.4362880886426593,1.0,12.41637372970581,0.0
58,2,Decision Tree,1,0.2,0.37303785780240073,0.16618745004122448,0.14367151260375977,0.0
59,2,RandomForest,1,0.2,0.438134810710988,0.12374768768870337,0.7782928943634033,0.0
60,2,AdaBoost (Discrete),1,0.2,0.2922437673130194,0.1988482898097399,51.53169345855713,0.0
61,2,AdaBoost (Real),1,0.2,0.16066481994459833,0.13972264183186991,76.48147177696228,0.0
62,2,Logistic Regression (Penalty = L2),1,0.2,0.4662973222530009,0.5317372430512287,0.9420068264007568,0.0
63,2,Naive Bayes,1,0.2,0.4473684210526316,0.5534003924199329,0.11318111419677734,0.0
64,2,KNeighbors Classifier,2,0.2,0.36662043458159965,0.17479811190823766,0.34509921073913574,0.0
65,2,SVC Classifier,2,0.2,0.4368932038834951,1.0,11.59461760520935,0.0
66,2,Decision Tree,2,0.2,0.3643088303282478,0.22358783534822638,0.09113907814025879,0.0
67,2,RandomForest,2,0.2,0.439204808136847,0.10583140062187937,0.5651583671569824,0.0
68,2,AdaBoost (Discrete),2,0.2,0.31715210355987056,0.2551907043566908,45.05115795135498,0.0
69,2,AdaBoost (Real),2,0.2,0.1650485436893204,0.15854989336925648,64.84888935089111,0.0
70,2,Logistic Regression (Penalty = L2),2,0.2,0.4331946370781322,0.16234658124139723,0.6421298980712891,0.0
71,2,Naive Bayes,2,0.2,0.44937586685159503,0.27398195802437325,0.11662626266479492,0.0
72,3,KNeighbors Classifier,0,0.2,0.2744464944649446,0.26569524110508763,0.26450395584106445,0.0
73,3,SVC Classifier,0,0.2,0.525830258302583,0.608592709774094,10.029738187789917,0.0
74,3,Decision Tree,0,0.2,0.3025830258302583,0.20613395180205543,0.1536417007446289,0.0
75,3,RandomForest,0,0.2,0.4801660516605166,0.5639459569474963,0.47048497200012207,0.0
76,3,AdaBoost (Discrete),0,0.2,0.13238007380073802,0.18012532328717953,37.882782220840454,0.0
77,3,AdaBoost (Real),0,0.2,0.09178966789667897,0.1335516908723748,56.38409233093262,0.0
78,3,Logistic Regression (Penalty = L2),0,0.2,0.46079335793357934,0.18204487137766456,0.500035285949707,0.0
79,3,Naive Bayes,0,0.2,0.27260147601476015,0.26315592283016004,0.08886003494262695,0.0
80,3,KNeighbors Classifier,1,0.2,0.4113573407202216,0.14907831949572783,0.23032879829406738,0.0
81,3,SVC Classifier,1,0.2,0.43674976915974145,0.05293468411585582,7.94941782951355,0.0
82,3,Decision Tree,1,0.2,0.41412742382271467,0.17245617935106264,0.08493185043334961,0.0
83,3,RandomForest,1,0.2,0.5060018467220684,0.6342704099436525,0.41361021995544434,0.0
84,3,AdaBoost (Discrete),1,0.2,0.27469990766389657,0.23697352030899105,32.35486650466919,0.0
85,3,AdaBoost (Real),1,0.2,0.14912280701754385,0.22147525312957414,53.40563750267029,0.0
86,3,Logistic Regression (Penalty = L2),1,0.2,0.5096952908587258,0.16720166666008993,0.4469921588897705,0.0
87,3,Naive Bayes,1,0.2,0.49907663896583565,0.28799751260504297,0.09183263778686523,0.0
88,3,KNeighbors Classifier,2,0.2,0.41840036985668055,0.18004559265575878,0.20113611221313477,0.0
89,3,SVC Classifier,2,0.2,0.4368932038834951,1.0,7.534680128097534,0.0
90,3,Decision Tree,2,0.2,0.37447988904299584,0.13111503821508233,0.11800837516784668,0.0
91,3,RandomForest,2,0.2,0.47572815533980584,0.3844906576375997,0.36836719512939453,0.0
92,3,AdaBoost (Discrete),2,0.2,0.34997688395746646,0.2642160350338114,29.220378398895264,0.0
93,3,AdaBoost (Real),2,0.2,0.2422561257512714,0.2626498314375463,49.562873125076294,0.0
94,3,Logistic Regression (Penalty = L2),2,0.2,0.5108645399907535,0.4406210706590739,0.5196380615234375,0.0
95,3,Naive Bayes,2,0.2,0.463245492371706,0.292641574519313,0.08166289329528809,0.0
96,4,KNeighbors Classifier,0,0.2,0.37223247232472323,0.21084771793886192,0.15930628776550293,0.0
97,4,SVC Classifier,0,0.2,0.5345940959409594,0.6535287736346769,7.084294557571411,0.0
98,4,Decision Tree,0,0.2,0.36116236162361626,0.16468653503049593,0.0779578685760498,0.0
99,4,RandomForest,0,0.2,0.48985239852398527,0.6397191962755764,0.39534568786621094,0.0
100,4,AdaBoost (Discrete),0,0.2,0.16190036900369004,0.21107738074571425,24.622201442718506,0.0
101,4,AdaBoost (Real),0,0.2,0.06457564575645756,0.0992858864953082,36.184449672698975,0.0
102,4,Logistic Regression (Penalty = L2),0,0.2,0.4672509225092251,0.19575969672613489,0.2900502681732178,0.0
103,4,Naive Bayes,0,0.2,0.30904059040590404,0.28791723383430773,0.07036805152893066,0.0
104,4,KNeighbors Classifier,1,0.2,0.41735918744228995,0.15667513572463151,0.17158818244934082,0.0
105,4,SVC Classifier,1,0.2,0.4372114496768236,0.0529627141332376,5.2723283767700195,0.0
106,4,Decision Tree,1,0.2,0.420129270544783,0.1368267729505897,0.03743290901184082,0.0
107,4,RandomForest,1,0.2,0.492151431209603,0.6433798881044883,0.29333949089050293,0.0
108,4,AdaBoost (Discrete),1,0.2,0.3347183748845799,0.25739894621663345,21.009429693222046,0.0
109,4,AdaBoost (Real),1,0.2,0.09418282548476455,0.14398680166789193,36.33684754371643,0.0
110,4,Logistic Regression (Penalty = L2),1,0.2,0.518005540166205,0.1654129958001922,0.3640298843383789,0.0
111,4,Naive Bayes,1,0.2,0.5092336103416436,0.37980119634275245,0.1399383544921875,0.0
112,4,KNeighbors Classifier,2,0.2,0.41701340730466946,0.21278712673289318,0.11362600326538086,0.0
113,4,SVC Classifier,2,0.2,0.4368932038834951,1.0,5.350904941558838,0.0
114,4,Decision Tree,2,0.2,0.439204808136847,0.21073919824347231,0.07145977020263672,0.0
115,4,RandomForest,2,0.2,0.5228848821081831,0.559412330610244,0.31970691680908203,0.0
116,4,AdaBoost (Discrete),2,0.2,0.2834026814609339,0.27833475987144723,19.168636322021484,0.0
117,4,AdaBoost (Real),2,0.2,0.2020342117429496,0.2262402516980688,34.62157726287842,0.0
118,4,Logistic Regression (Penalty = L2),2,0.2,0.5108645399907535,0.4379062362508154,0.32112860679626465,0.0
119,4,Naive Bayes,2,0.2,0.47249190938511326,0.442322607682262,0.08070683479309082,0.0
120,6,KNeighbors Classifier,0,0.2,0.37223247232472323,0.21084771793886192,0.12778902053833008,0.0
121,6,SVC Classifier,0,0.2,0.5345940959409594,0.6535287736346769,5.943206071853638,0.0
122,6,Decision Tree,0,0.2,0.35747232472324725,0.18285672681371273,0.059563398361206055,0.0
123,6,RandomForest,0,0.2,0.48985239852398527,0.6397191962755764,0.37305641174316406,0.0
124,6,AdaBoost (Discrete),0,0.2,0.16190036900369004,0.21107738074571425,22.219331979751587,0.0
125,6,AdaBoost (Real),0,0.2,0.06642066420664207,0.10115564195082814,50.46343207359314,0.0
126,6,Logistic Regression (Penalty = L2),0,0.2,0.4672509225092251,0.19575969672613489,0.583686113357544,0.0
127,6,Naive Bayes,0,0.2,0.30904059040590404,0.28791723383430773,0.12069177627563477,0.0
128,6,KNeighbors Classifier,1,0.2,0.41735918744228995,0.15667513572463151,0.2121448516845703,0.0
129,6,SVC Classifier,1,0.2,0.4372114496768236,0.0529627141332376,8.87458062171936,0.0
130,6,Decision Tree,1,0.2,0.433056325023084,0.12143776585721687,0.15296339988708496,0.0
131,6,RandomForest,1,0.2,0.492151431209603,0.6433798881044883,0.5192046165466309,0.0
132,6,AdaBoost (Discrete),1,0.2,0.3347183748845799,0.25739894621663345,32.67403793334961,0.0
133,6,AdaBoost (Real),1,0.2,0.09695290858725762,0.13963366133129304,56.08045530319214,0.0
134,6,Logistic Regression (Penalty = L2),1,0.2,0.518005540166205,0.1654129958001922,0.5049371719360352,0.0
135,6,Naive Bayes,1,0.2,0.5092336103416436,0.37980119634275245,0.11146306991577148,0.0
136,6,KNeighbors Classifier,2,0.2,0.41701340730466946,0.21278712673289318,0.21077919006347656,0.0
137,6,SVC Classifier,2,0.2,0.4368932038834951,1.0,9.72554087638855,0.0
138,6,Decision Tree,2,0.2,0.4364308830328248,0.20294105377329408,0.10367298126220703,0.0
139,6,RandomForest,2,0.2,0.5228848821081831,0.559412330610244,0.5720436573028564,0.0
140,6,AdaBoost (Discrete),2,0.2,0.2834026814609339,0.27833475987144723,32.24867868423462,0.0
141,6,AdaBoost (Real),2,0.2,0.22792417938049006,0.21985137942162944,55.88298773765564,0.0
142,6,Logistic Regression (Penalty = L2),2,0.2,0.5108645399907535,0.4379062362508154,0.5622901916503906,0.0
143,6,Naive Bayes,2,0.2,0.47249190938511326,0.442322607682262,0.1083672046661377,0.0
144,7,KNeighbors Classifier,0,0.2,0.3551660516605166,0.12729475643342866,0.13677978515625,0.0
145,7,SVC Classifier,0,0.2,0.43634686346863466,1.0,8.649913787841797,0.0
146,7,Decision Tree,0,0.2,0.3842250922509225,0.15969294936847378,0.1418929100036621,0.0
147,7,RandomForest,0,0.2,0.4603321033210332,0.5866082582576191,0.5728108882904053,0.0
148,7,AdaBoost (Discrete),0,0.2,0.38699261992619927,0.23962567872701315,32.71394324302673,0.0
149,7,AdaBoost (Real),0,0.2,0.3842250922509225,0.12557102148684843,55.765514850616455,0.0
150,7,Logistic Regression (Penalty = L2),0,0.2,0.4626383763837638,0.610633165234575,0.42791223526000977,0.0
151,7,Naive Bayes,0,0.2,0.4488007380073801,0.5629144663578813,0.08196020126342773,0.0
152,7,KNeighbors Classifier,1,0.2,0.3656509695290859,0.15731194807770954,0.15246343612670898,0.0
153,7,SVC Classifier,1,0.2,0.4362880886426593,1.0,8.235915660858154,0.0
154,7,Decision Tree,1,0.2,0.4053554939981533,0.2739992210830719,0.0895540714263916,0.0
155,7,RandomForest,1,0.2,0.4515235457063712,0.5658176407801774,0.44209861755371094,0.0
156,7,AdaBoost (Discrete),1,0.2,0.37765466297322253,0.15313226930572496,30.857579469680786,0.0
157,7,AdaBoost (Real),1,0.2,0.3979686057248384,0.3217510703902878,52.93271589279175,0.0
158,7,Logistic Regression (Penalty = L2),1,0.2,0.45106186518928904,0.5011174316377258,0.45543742179870605,0.0
159,7,Naive Bayes,1,0.2,0.45706371191135736,0.5698284549252314,0.10133838653564453,0.0
160,7,KNeighbors Classifier,2,0.2,0.34489135460009246,0.11311891103806498,0.13698172569274902,0.0
161,7,SVC Classifier,2,0.2,0.4368932038834951,1.0,7.03886079788208,0.0
162,7,Decision Tree,2,0.2,0.37725381414701803,0.15660035176956488,0.08532547950744629,0.0
163,7,RandomForest,2,0.2,0.4373555247341655,0.45586335692337904,0.4039449691772461,0.0
164,7,AdaBoost (Discrete),2,0.2,0.40360610263522884,0.3984079739876839,29.472275257110596,0.0
165,7,AdaBoost (Real),2,0.2,0.4128525196486362,0.14810941524973645,50.88274359703064,0.0
166,7,Logistic Regression (Penalty = L2),2,0.2,0.45030050855293574,0.17243047419142393,0.430462121963501,0.0
167,7,Naive Bayes,2,0.2,0.4646324549237171,0.2916545213595547,0.04473304748535156,0.0
168,8,KNeighbors Classifier,0,0.2,0.37223247232472323,0.21084771793886192,0.21529483795166016,0.0
169,8,SVC Classifier,0,0.2,0.5345940959409594,0.6535287736346769,8.3761465549469,0.0
170,8,Decision Tree,0,0.2,0.345479704797048,0.1504658712571515,0.04761862754821777,0.0
171,8,RandomForest,0,0.2,0.48985239852398527,0.6397191962755764,0.4917471408843994,0.0
172,8,AdaBoost (Discrete),0,0.2,0.16190036900369004,0.21107738074571425,28.908227920532227,0.0
173,8,AdaBoost (Real),0,0.2,0.14990774907749077,0.16155328065872418,50.20634913444519,0.0
174,8,Logistic Regression (Penalty = L2),0,0.2,0.4672509225092251,0.19575969672613489,0.48771047592163086,0.0
175,8,Naive Bayes,0,0.2,0.30904059040590404,0.28791723383430773,0.12013053894042969,0.0
176,8,KNeighbors Classifier,1,0.2,0.41735918744228995,0.15667513572463151,0.21528172492980957,0.0
177,8,SVC Classifier,1,0.2,0.4372114496768236,0.0529627141332376,7.5639941692352295,0.0
178,8,Decision Tree,1,0.2,0.42382271468144045,0.13222097367519306,0.08826947212219238,0.0
179,8,RandomForest,1,0.2,0.492151431209603,0.6433798881044883,0.44093894958496094,0.0
180,8,AdaBoost (Discrete),1,0.2,0.3347183748845799,0.25739894621663345,29.535661935806274,0.0
181,8,AdaBoost (Real),1,0.2,0.09187442289935364,0.1393901446574397,49.371734619140625,0.0
182,8,Logistic Regression (Penalty = L2),1,0.2,0.518005540166205,0.1654129958001922,0.40145039558410645,0.0
183,8,Naive Bayes,1,0.2,0.5092336103416436,0.37980119634275245,0.1215050220489502,0.0
184,8,KNeighbors Classifier,2,0.2,0.41701340730466946,0.21278712673289318,0.12165546417236328,0.0
185,8,SVC Classifier,2,0.2,0.4368932038834951,1.0,7.482405662536621,0.0
186,8,Decision Tree,2,0.2,0.42533518261673603,0.16201422482662067,0.08011364936828613,0.0
187,8,RandomForest,2,0.2,0.5228848821081831,0.559412330610244,0.39347410202026367,0.0
188,8,AdaBoost (Discrete),2,0.2,0.2834026814609339,0.27833475987144723,28.87275719642639,0.0
189,8,AdaBoost (Real),2,0.2,0.25335182616736013,0.19237651804998485,50.50804305076599,0.0
190,8,Logistic Regression (Penalty = L2),2,0.2,0.5108645399907535,0.4379062362508154,0.3727233409881592,0.0
191,8,Naive Bayes,2,0.2,0.47249190938511326,0.442322607682262,0.08367371559143066,0.0
192,10,KNeighbors Classifier,0,0.2,0.3800738007380074,0.1813921081391368,0.2901608943939209,0.0
193,10,SVC Classifier,0,0.2,0.5396678966789668,0.6711351489869586,8.239689111709595,0.0
194,10,Decision Tree,0,0.2,0.3464022140221402,0.17136461629352373,0.08104276657104492,0.0
195,10,RandomForest,0,0.2,0.49677121771217714,0.6513950913671919,0.4436490535736084,0.0
196,10,AdaBoost (Discrete),0,0.2,0.20018450184501846,0.2324458813648591,32.33253335952759,0.0
197,10,AdaBoost (Real),0,0.2,0.06273062730627306,0.08058007864855066,50.216142892837524,0.0
198,10,Logistic Regression (Penalty = L2),0,0.2,0.4783210332103321,0.18412708109082745,0.5385384559631348,0.0
199,10,Naive Bayes,0,0.2,0.30904059040590404,0.30028261197564565,0.08870673179626465,0.0
200,10,KNeighbors Classifier,1,0.2,0.3878116343490305,0.11232679422091224,0.19988298416137695,0.0
201,10,SVC Classifier,1,0.2,0.4409048938134811,0.16246284554875157,7.867604732513428,0.0
202,10,Decision Tree,1,0.2,0.38688827331486614,0.19524765638322875,0.08106017112731934,0.0
203,10,RandomForest,1,0.2,0.5009233610341643,0.6027608512715077,0.400876522064209,0.0
204,10,AdaBoost (Discrete),1,0.2,0.3494921514312096,0.27194032409634805,31.044997692108154,0.0
205,10,AdaBoost (Real),1,0.2,0.21098799630655588,0.22915049131769663,50.53806972503662,0.0
206,10,Logistic Regression (Penalty = L2),1,0.2,0.5244690674053555,0.17885497078278234,0.5187442302703857,0.0
207,10,Naive Bayes,1,0.2,0.48153277931671284,0.46897568108262583,0.10598015785217285,0.0
208,10,KNeighbors Classifier,2,0.2,0.4165510864539991,0.176806805683492,0.23803138732910156,0.0
209,10,SVC Classifier,2,0.2,0.4368932038834951,1.0,7.617791175842285,0.0
210,10,Decision Tree,2,0.2,0.4114655570966251,0.2660966851472817,0.07994318008422852,0.0
211,10,RandomForest,2,0.2,0.483587609801202,0.4261808362955927,0.40379834175109863,0.0
212,10,AdaBoost (Discrete),2,0.2,0.3028201571890892,0.290663614068665,30.129892349243164,0.0
213,10,AdaBoost (Real),2,0.2,0.30235783633841884,0.284967938132831,50.54616665840149,0.0
214,10,Logistic Regression (Penalty = L2),2,0.2,0.5302820157189089,0.45593418715399736,0.512291669845581,0.0
215,10,Naive Bayes,2,0.2,0.45168747110494684,0.5094120185495947,0.12195897102355957,0.0
216,11,KNeighbors Classifier,0,0.2,0.31503690036900367,0.15192094235656098,1.197880744934082,0.0
217,11,SVC Classifier,0,0.2,0.5465867158671587,0.6847647762715567,10.122963666915894,0.0
218,11,Decision Tree,0,0.2,0.386070110701107,0.19474295378412543,0.15752744674682617,0.0
219,11,RandomForest,0,0.2,0.4833948339483395,0.6375172061008916,0.48468995094299316,0.0
220,11,AdaBoost (Discrete),0,0.2,0.19695571955719557,0.17666797498770836,40.346423387527466,0.0
221,11,AdaBoost (Real),0,0.2,0.12961254612546125,0.19173175066021617,56.89078402519226,0.0
222,11,Logistic Regression (Penalty = L2),0,0.2,0.4663284132841328,0.13232843043867298,0.6915085315704346,0.0
223,11,Naive Bayes,0,0.2,0.21079335793357934,0.18229450926844715,0.12050366401672363,0.0
224,11,KNeighbors Classifier,1,0.2,0.41458910433979684,0.15233948378097126,0.8648011684417725,0.0
225,11,SVC Classifier,1,0.2,0.44967682363804246,0.2464376979936482,8.33648157119751,0.0
226,11,Decision Tree,1,0.2,0.4182825484764543,0.2037318368079317,0.13690638542175293,0.0
227,11,RandomForest,1,0.2,0.4773776546629732,0.6052671442077724,0.4486117362976074,0.0
228,11,AdaBoost (Discrete),1,0.2,0.3702677746999077,0.3250051161291395,40.39118695259094,0.0
229,11,AdaBoost (Real),1,0.2,0.1809787626962142,0.19607087779845836,61.137845039367676,0.0
230,11,Logistic Regression (Penalty = L2),1,0.2,0.5212373037857803,0.25083255781640423,0.7718856334686279,0.0
231,11,Naive Bayes,1,0.2,0.46537396121883656,0.3195707207062796,0.10354900360107422,0.0
232,11,KNeighbors Classifier,2,0.2,0.4086916319926029,0.290428679117966,0.6802670955657959,0.0
233,11,SVC Classifier,2,0.2,0.4368932038834951,1.0,8.351637363433838,0.0
234,11,Decision Tree,2,0.2,0.4026814609338881,0.2876556520297884,0.1297769546508789,0.0
235,11,RandomForest,2,0.2,0.47665279704114655,0.46968943820462616,0.3881080150604248,0.0
236,11,AdaBoost (Discrete),2,0.2,0.3300970873786408,0.3157531984338667,40.09604215621948,0.0
237,11,AdaBoost (Real),2,0.2,0.34997688395746646,0.17030771605082567,58.807578802108765,0.0
238,11,Logistic Regression (Penalty = L2),2,0.2,0.5242718446601942,0.4464917407459926,0.7300071716308594,0.0
239,11,Naive Bayes,2,0.2,0.36754507628294036,0.283516187445508,0.15492963790893555,0.0
