,feat_set_id,classifier,fold_id,feat_th,score,geo_score,exec_t,geo_score_woz
0,0,KNeighbors Classifier,0,0.95,0.9,0.9053945554302176,0.09016299247741699,0.9053945554302176
1,0,SVC Classifier,0,0.95,0.45,0.3872983346207417,0.04425525665283203,0.0
2,0,Decision Tree,0,0.95,0.8333333333333334,0.831802746039737,0.0021855831146240234,0.831802746039737
3,0,RandomForest,0,0.95,0.8333333333333334,0.8367911876027119,0.3526794910430908,0.8367911876027119
4,0,AdaBoost (Discrete),0,0.95,0.9166666666666666,0.9210078746600967,17.11365246772766,0.9210078746600967
5,0,AdaBoost (Real),0,0.95,0.9,0.900068581879409,17.758923053741455,0.900068581879409
6,0,Logistic Regression (Penalty = L2),0,0.95,0.9333333333333333,0.9410360288810286,0.08986973762512207,0.9410360288810286
7,0,Naive Bayes,0,0.95,0.95,0.9564655913861946,0.002985239028930664,0.9564655913861946
8,0,KNeighbors Classifier,1,0.95,0.9666666666666667,0.9714127805419094,0.03914284706115723,0.9714127805419094
9,0,SVC Classifier,1,0.95,0.4,1.0,0.038787841796875,0.0
10,0,Decision Tree,1,0.95,0.7833333333333333,0.7555149039386845,0.03780722618103027,0.7555149039386845
11,0,RandomForest,1,0.95,0.9833333333333333,0.9859136166167861,0.2775382995605469,0.9859136166167861
12,0,AdaBoost (Discrete),1,0.95,0.8833333333333333,0.8662391053409028,14.585055112838745,0.8662391053409028
13,0,AdaBoost (Real),1,0.95,0.8333333333333334,0.8067143230122719,16.85438823699951,0.8067143230122719
14,0,Logistic Regression (Penalty = L2),1,0.95,0.95,0.9518891309816516,0.047228097915649414,0.9518891309816516
15,0,Naive Bayes,1,0.95,0.9666666666666667,0.9654893846056297,0.002011537551879883,0.9654893846056297
16,0,KNeighbors Classifier,2,0.95,0.9655172413793104,0.9701312318500641,0.002453327178955078,0.9701312318500641
17,0,SVC Classifier,2,0.95,0.39655172413793105,1.0,0.002610921859741211,0.0
18,0,Decision Tree,2,0.95,0.8103448275862069,0.7979908824452692,0.04202532768249512,0.7979908824452692
19,0,RandomForest,2,0.95,0.9827586206896551,0.9821390252341226,0.30594348907470703,0.9821390252341226
20,0,AdaBoost (Discrete),2,0.95,0.9655172413793104,0.967693705920519,17.781490564346313,0.967693705920519
21,0,AdaBoost (Real),2,0.95,0.8793103448275862,0.8858189155864656,19.910911321640015,0.8858189155864656
22,0,Logistic Regression (Penalty = L2),2,0.95,0.9655172413793104,0.9701312318500641,0.043367862701416016,0.9701312318500641
23,0,Naive Bayes,2,0.95,0.9655172413793104,0.967693705920519,0.04341626167297363,0.967693705920519
24,1,KNeighbors Classifier,0,0.95,0.9,0.9053945554302176,0.0436406135559082,0.9053945554302176
25,1,SVC Classifier,0,0.95,0.45,0.3872983346207417,0.0028569698333740234,0.0
26,1,Decision Tree,0,0.95,0.65,0.632574498976312,0.0018239021301269531,0.632574498976312
27,1,RandomForest,0,0.95,0.9,0.9053945554302176,0.3552861213684082,0.9053945554302176
28,1,AdaBoost (Discrete),0,0.95,0.9,0.900068581879409,16.737877368927002,0.900068581879409
29,1,AdaBoost (Real),0,0.95,0.9333333333333333,0.9410360288810286,18.40650725364685,0.9410360288810286
30,1,Logistic Regression (Penalty = L2),0,0.95,1.0,1.0,0.042627573013305664,1.0
31,1,Naive Bayes,0,0.95,0.9666666666666667,0.9714127805419094,0.0032219886779785156,0.9714127805419094
32,1,KNeighbors Classifier,1,0.95,0.95,0.9564655913861946,0.04413270950317383,0.9564655913861946
33,1,SVC Classifier,1,0.95,0.4,1.0,0.0018849372863769531,0.0
34,1,Decision Tree,1,0.95,0.8833333333333333,0.8554033906184945,0.0017006397247314453,0.8554033906184945
35,1,RandomForest,1,0.95,0.9666666666666667,0.9564655913861946,0.3159220218658447,0.9564655913861946
36,1,AdaBoost (Discrete),1,0.95,0.9166666666666666,0.9085602964160698,17.995027780532837,0.9085602964160698
37,1,AdaBoost (Real),1,0.95,0.8166666666666667,0.7836526036203351,20.469985008239746,0.7836526036203351
38,1,Logistic Regression (Penalty = L2),1,0.95,0.95,0.9518891309816516,0.04238438606262207,0.9518891309816516
39,1,Naive Bayes,1,0.95,0.95,0.9518891309816516,0.04348611831665039,0.9518891309816516
40,1,KNeighbors Classifier,2,0.95,0.9655172413793104,0.9701312318500641,0.04387068748474121,0.9701312318500641
41,1,SVC Classifier,2,0.95,0.39655172413793105,1.0,0.04320192337036133,0.0
42,1,Decision Tree,2,0.95,0.8793103448275862,0.8682168270581369,0.0019207000732421875,0.8682168270581369
43,1,RandomForest,2,0.95,0.9827586206896551,0.9821390252341226,0.3124561309814453,0.9821390252341226
44,1,AdaBoost (Discrete),2,0.95,0.9655172413793104,0.967693705920519,17.015140295028687,0.967693705920519
45,1,AdaBoost (Real),2,0.95,0.9655172413793104,0.967693705920519,21.08764386177063,0.967693705920519
46,1,Logistic Regression (Penalty = L2),2,0.95,1.0,1.0,0.04732012748718262,1.0
47,1,Naive Bayes,2,0.95,0.9827586206896551,0.9821390252341226,0.04619312286376953,0.9821390252341226
48,2,KNeighbors Classifier,0,0.95,0.8833333333333333,0.8914135402065606,0.0424654483795166,0.8914135402065606
49,2,SVC Classifier,0,0.95,0.45,0.3872983346207417,0.047127485275268555,0.0
50,2,Decision Tree,0,0.95,0.65,0.6277655227432221,0.0012214183807373047,0.6277655227432221
51,2,RandomForest,0,0.95,0.8333333333333334,0.8367911876027119,0.2983543872833252,0.8367911876027119
52,2,AdaBoost (Discrete),0,0.95,0.9333333333333333,0.9361090484023133,19.340360403060913,0.9361090484023133
53,2,AdaBoost (Real),0,0.95,0.9333333333333333,0.9410360288810286,25.637598276138306,0.9410360288810286
54,2,Logistic Regression (Penalty = L2),0,0.95,0.9333333333333333,0.9410360288810286,0.0670766830444336,0.9410360288810286
55,2,Naive Bayes,0,0.95,0.95,0.9564655913861946,0.06701135635375977,0.9564655913861946
56,2,KNeighbors Classifier,1,0.95,0.9333333333333333,0.9402511777839014,0.06685185432434082,0.9402511777839014
57,2,SVC Classifier,1,0.95,0.4,1.0,0.06686091423034668,0.0
58,2,Decision Tree,1,0.95,0.8833333333333333,0.8867463680938388,0.0012013912200927734,0.8867463680938388
59,2,RandomForest,1,0.95,0.9833333333333333,0.9859136166167861,0.47243213653564453,0.9859136166167861
60,2,AdaBoost (Discrete),1,0.95,0.9166666666666666,0.9085602964160698,27.058854818344116,0.9085602964160698
61,2,AdaBoost (Real),1,0.95,0.8,0.7645314458836486,30.04668140411377,0.7645314458836486
62,2,Logistic Regression (Penalty = L2),1,0.95,0.9833333333333333,0.9830475724915585,0.07148027420043945,0.9830475724915585
63,2,Naive Bayes,1,0.95,0.9666666666666667,0.9654893846056297,0.06742334365844727,0.9654893846056297
64,2,KNeighbors Classifier,2,0.95,0.9655172413793104,0.9701312318500641,0.0022826194763183594,0.9701312318500641
65,2,SVC Classifier,2,0.95,0.39655172413793105,1.0,0.002694845199584961,0.0
66,2,Decision Tree,2,0.95,1.0,1.0,0.07007002830505371,1.0
67,2,RandomForest,2,0.95,0.9827586206896551,0.9821390252341226,0.49581480026245117,0.9821390252341226
68,2,AdaBoost (Discrete),2,0.95,0.9655172413793104,0.967693705920519,29.849118947982788,0.967693705920519
69,2,AdaBoost (Real),2,0.95,0.9482758620689655,0.9470981939677545,35.95314311981201,0.9470981939677545
70,2,Logistic Regression (Penalty = L2),2,0.95,1.0,1.0,0.07930469512939453,1.0
71,2,Naive Bayes,2,0.95,1.0,1.0,0.07938361167907715,1.0
72,3,KNeighbors Classifier,0,0.95,0.8833333333333333,0.8892233261225158,0.08014774322509766,0.8892233261225158
73,3,SVC Classifier,0,0.95,0.45,0.3872983346207417,0.002831697463989258,0.0
74,3,Decision Tree,0,0.95,0.9166666666666666,0.9148264275057428,0.0012104511260986328,0.9148264275057428
75,3,RandomForest,0,0.95,0.9333333333333333,0.9361090484023133,0.5609323978424072,0.9361090484023133
76,3,AdaBoost (Discrete),0,0.95,0.9166666666666666,0.9210078746600967,33.34821939468384,0.9210078746600967
77,3,AdaBoost (Real),0,0.95,0.9333333333333333,0.9410360288810286,39.59562039375305,0.9410360288810286
78,3,Logistic Regression (Penalty = L2),0,0.95,0.9666666666666667,0.9714127805419094,0.10301375389099121,0.9714127805419094
79,3,Naive Bayes,0,0.95,0.95,0.9564655913861946,0.10333251953125,0.9564655913861946
80,3,KNeighbors Classifier,1,0.95,0.95,0.9549449757989991,0.10430264472961426,0.9549449757989991
81,3,SVC Classifier,1,0.95,0.4,1.0,0.10310482978820801,0.0
82,3,Decision Tree,1,0.95,0.8333333333333334,0.8067143230122719,0.10557675361633301,0.8067143230122719
83,3,RandomForest,1,0.95,0.9,0.8957619677539866,0.7182936668395996,0.8957619677539866
84,3,AdaBoost (Discrete),1,0.95,0.9166666666666666,0.9085602964160698,55.713874101638794,0.9085602964160698
85,3,AdaBoost (Real),1,0.95,0.8333333333333334,0.8067143230122719,45.29087567329407,0.8067143230122719
86,3,Logistic Regression (Penalty = L2),1,0.95,0.9333333333333333,0.9339246536301676,0.09951424598693848,0.9339246536301676
87,3,Naive Bayes,1,0.95,0.9666666666666667,0.9654893846056297,0.1116635799407959,0.9654893846056297
88,3,KNeighbors Classifier,2,0.95,0.9655172413793104,0.9701312318500641,0.10403752326965332,0.9701312318500641
89,3,SVC Classifier,2,0.95,0.39655172413793105,1.0,0.10300278663635254,0.0
90,3,Decision Tree,2,0.95,1.0,1.0,0.09395933151245117,1.0
91,3,RandomForest,2,0.95,0.9482758620689655,0.9470981939677545,0.6937100887298584,0.9470981939677545
92,3,AdaBoost (Discrete),2,0.95,0.9655172413793104,0.967693705920519,40.07274103164673,0.967693705920519
93,3,AdaBoost (Real),2,0.95,0.8793103448275862,0.8858189155864656,41.82207202911377,0.8858189155864656
94,3,Logistic Regression (Penalty = L2),2,0.95,0.9827586206896551,0.9852919811325488,0.14322924613952637,0.9852919811325488
95,3,Naive Bayes,2,0.95,0.9655172413793104,0.967693705920519,0.0913703441619873,0.967693705920519
96,4,KNeighbors Classifier,0,0.95,0.9,0.9085602964160698,0.0036971569061279297,0.9085602964160698
97,4,SVC Classifier,0,0.95,0.45,0.3872983346207417,0.09498929977416992,0.0
98,4,Decision Tree,0,0.95,0.8,0.8013432295169303,0.09362983703613281,0.8013432295169303
99,4,RandomForest,0,0.95,0.8833333333333333,0.8690066612216124,0.5734260082244873,0.8690066612216124
100,4,AdaBoost (Discrete),0,0.95,0.9333333333333333,0.9361090484023133,41.623329639434814,0.9361090484023133
101,4,AdaBoost (Real),0,0.95,0.9333333333333333,0.9410360288810286,48.283427715301514,0.9410360288810286
102,4,Logistic Regression (Penalty = L2),0,0.95,0.9333333333333333,0.9410360288810286,0.10698342323303223,0.9410360288810286
103,4,Naive Bayes,0,0.95,0.9333333333333333,0.9410360288810286,0.001970529556274414,0.9410360288810286
104,4,KNeighbors Classifier,1,0.95,0.9333333333333333,0.9402511777839014,0.15238046646118164,0.9402511777839014
105,4,SVC Classifier,1,0.95,0.4,1.0,0.10704612731933594,0.0
106,4,Decision Tree,1,0.95,0.8333333333333334,0.8077799970689432,0.10554671287536621,0.8077799970689432
107,4,RandomForest,1,0.95,0.9166666666666666,0.915241126759053,0.7583248615264893,0.915241126759053
108,4,AdaBoost (Discrete),1,0.95,0.9166666666666666,0.9085602964160698,44.36142325401306,0.9085602964160698
109,4,AdaBoost (Real),1,0.95,0.85,0.8358603846235818,48.357720375061035,0.8358603846235818
110,4,Logistic Regression (Penalty = L2),1,0.95,0.9166666666666666,0.915241126759053,0.10633134841918945,0.915241126759053
111,4,Naive Bayes,1,0.95,0.9666666666666667,0.9654893846056297,0.10280156135559082,0.9654893846056297
112,4,KNeighbors Classifier,2,0.95,0.9827586206896551,0.9852919811325488,0.0924081802368164,0.9852919811325488
113,4,SVC Classifier,2,0.95,0.39655172413793105,1.0,0.1069185733795166,0.0
114,4,Decision Tree,2,0.95,0.9482758620689655,0.9494838418142761,0.0018727779388427734,0.9494838418142761
115,4,RandomForest,2,0.95,0.9482758620689655,0.9528037423984005,0.7489218711853027,0.9528037423984005
116,4,AdaBoost (Discrete),2,0.95,0.9655172413793104,0.967693705920519,45.852458238601685,0.967693705920519
117,4,AdaBoost (Real),2,0.95,0.8793103448275862,0.8858189155864656,50.1032829284668,0.8858189155864656
118,4,Logistic Regression (Penalty = L2),2,0.95,1.0,1.0,0.11559605598449707,1.0
119,4,Naive Bayes,2,0.95,1.0,1.0,0.11143946647644043,1.0
120,5,KNeighbors Classifier,0,0.95,0.9166666666666666,0.9250831838185912,0.10796356201171875,0.9250831838185912
121,5,SVC Classifier,0,0.95,0.45,0.3872983346207417,0.12652254104614258,0.0
122,5,Decision Tree,0,0.95,0.75,0.7374453341331588,0.001558065414428711,0.7374453341331588
123,5,RandomForest,0,0.95,0.9333333333333333,0.9361090484023133,0.7552518844604492,0.9361090484023133
124,5,AdaBoost (Discrete),0,0.95,0.9166666666666666,0.9210078746600967,48.36729621887207,0.9210078746600967
125,5,AdaBoost (Real),0,0.95,0.9333333333333333,0.9410360288810286,51.566577434539795,0.9410360288810286
126,5,Logistic Regression (Penalty = L2),0,0.95,0.9833333333333333,0.9859136166167861,0.11517500877380371,0.9859136166167861
127,5,Naive Bayes,0,0.95,0.95,0.9564655913861946,0.11132550239562988,0.9564655913861946
128,5,KNeighbors Classifier,1,0.95,0.9333333333333333,0.9402511777839014,0.15299630165100098,0.9402511777839014
129,5,SVC Classifier,1,0.95,0.4,1.0,0.11472678184509277,0.0
130,5,Decision Tree,1,0.95,0.8333333333333334,0.8083117812890779,0.11757540702819824,0.8083117812890779
131,5,RandomForest,1,0.95,0.9166666666666666,0.9085602964160698,0.8016340732574463,0.9085602964160698
132,5,AdaBoost (Discrete),1,0.95,0.9166666666666666,0.9085602964160698,46.02851438522339,0.9085602964160698
133,5,AdaBoost (Real),1,0.95,0.8666666666666667,0.8478028607535417,51.42144274711609,0.8478028607535417
134,5,Logistic Regression (Penalty = L2),1,0.95,0.9833333333333333,0.9830475724915585,0.0026454925537109375,0.9830475724915585
135,5,Naive Bayes,1,0.95,0.9666666666666667,0.9654893846056297,0.11526322364807129,0.9654893846056297
136,5,KNeighbors Classifier,2,0.95,0.9827586206896551,0.9852919811325488,0.11564469337463379,0.9852919811325488
137,5,SVC Classifier,2,0.95,0.39655172413793105,1.0,0.002034902572631836,0.0
138,5,Decision Tree,2,0.95,0.9827586206896551,0.9821390252341226,0.0017998218536376953,0.9821390252341226
139,5,RandomForest,2,0.95,0.9482758620689655,0.9470981939677545,0.8232519626617432,0.9470981939677545
140,5,AdaBoost (Discrete),2,0.95,0.9655172413793104,0.967693705920519,42.18160533905029,0.967693705920519
141,5,AdaBoost (Real),2,0.95,0.9482758620689655,0.9470981939677545,52.2769832611084,0.9470981939677545
142,5,Logistic Regression (Penalty = L2),2,0.95,1.0,1.0,0.11118817329406738,1.0
143,5,Naive Bayes,2,0.95,1.0,1.0,0.10958695411682129,1.0
144,6,KNeighbors Classifier,0,0.95,0.9166666666666666,0.9210078746600967,0.11591410636901855,0.9210078746600967
145,6,SVC Classifier,0,0.95,0.45,0.3872983346207417,0.11508488655090332,0.0
146,6,Decision Tree,0,0.95,0.9,0.8993178988106453,0.11791872978210449,0.8993178988106453
147,6,RandomForest,0,0.95,0.85,0.8549879733383485,0.8160781860351562,0.8549879733383485
148,6,AdaBoost (Discrete),0,0.95,0.9333333333333333,0.9361090484023133,48.4741005897522,0.9361090484023133
149,6,AdaBoost (Real),0,0.95,0.9333333333333333,0.9410360288810286,59.61994934082031,0.9410360288810286
150,6,Logistic Regression (Penalty = L2),0,0.95,0.9333333333333333,0.9410360288810286,0.1228034496307373,0.9410360288810286
151,6,Naive Bayes,0,0.95,0.95,0.9564655913861946,0.1240990161895752,0.9564655913861946
152,6,KNeighbors Classifier,1,0.95,0.95,0.9564655913861946,0.11234521865844727,0.9564655913861946
153,6,SVC Classifier,1,0.95,0.4,1.0,0.0031070709228515625,0.0
154,6,Decision Tree,1,0.95,0.7833333333333333,0.7537619628284087,0.0018839836120605469,0.7537619628284087
155,6,RandomForest,1,0.95,0.85,0.8414757379333423,0.8876848220825195,0.8414757379333423
156,6,AdaBoost (Discrete),1,0.95,0.8833333333333333,0.8662391053409028,50.385194063186646,0.8662391053409028
157,6,AdaBoost (Real),1,0.95,0.85,0.8358603846235818,59.449050426483154,0.8358603846235818
158,6,Logistic Regression (Penalty = L2),1,0.95,0.95,0.9518891309816516,0.002102375030517578,0.9518891309816516
159,6,Naive Bayes,1,0.95,0.9666666666666667,0.9654893846056297,0.13863611221313477,0.9654893846056297
160,6,KNeighbors Classifier,2,0.95,0.9655172413793104,0.9701312318500641,0.0025932788848876953,0.9701312318500641
161,6,SVC Classifier,2,0.95,0.39655172413793105,1.0,0.10745096206665039,0.0
162,6,Decision Tree,2,0.95,0.9827586206896551,0.9821390252341226,0.0017046928405761719,0.9821390252341226
163,6,RandomForest,2,0.95,0.9827586206896551,0.9852919811325488,0.9708263874053955,0.9852919811325488
164,6,AdaBoost (Discrete),2,0.95,0.9655172413793104,0.967693705920519,54.06111121177673,0.967693705920519
165,6,AdaBoost (Real),2,0.95,0.9482758620689655,0.9470981939677545,57.64647817611694,0.9470981939677545
166,6,Logistic Regression (Penalty = L2),2,0.95,1.0,1.0,0.002969980239868164,1.0
167,6,Naive Bayes,2,0.95,0.9655172413793104,0.967693705920519,0.09578847885131836,0.967693705920519
168,7,KNeighbors Classifier,0,0.95,0.9166666666666666,0.9210078746600967,0.12398672103881836,0.9210078746600967
169,7,SVC Classifier,0,0.95,0.45,0.3872983346207417,0.14638376235961914,0.0
170,7,Decision Tree,0,0.95,0.7833333333333333,0.7621478561475696,0.12600350379943848,0.7621478561475696
171,7,RandomForest,0,0.95,0.85,0.8549879733383485,0.8890502452850342,0.8549879733383485
172,7,AdaBoost (Discrete),0,0.95,0.9166666666666666,0.9210078746600967,51.32884335517883,0.9210078746600967
173,7,AdaBoost (Real),0,0.95,0.9333333333333333,0.9410360288810286,59.724040031433105,0.9410360288810286
174,7,Logistic Regression (Penalty = L2),0,0.95,0.9333333333333333,0.9410360288810286,0.1273479461669922,0.9410360288810286
175,7,Naive Bayes,0,0.95,0.95,0.9564655913861946,0.13801884651184082,0.9564655913861946
176,7,KNeighbors Classifier,1,0.95,0.95,0.9564655913861946,0.12016797065734863,0.9564655913861946
177,7,SVC Classifier,1,0.95,0.4,1.0,0.130784273147583,0.0
178,7,Decision Tree,1,0.95,0.7833333333333333,0.7329486044391188,0.0016970634460449219,0.7329486044391188
179,7,RandomForest,1,0.95,0.85,0.8414757379333423,0.9526095390319824,0.8414757379333423
180,7,AdaBoost (Discrete),1,0.95,0.8833333333333333,0.8662391053409028,51.94797086715698,0.8662391053409028
181,7,AdaBoost (Real),1,0.95,0.85,0.8254818122236567,56.895808696746826,0.8254818122236567
182,7,Logistic Regression (Penalty = L2),1,0.95,0.95,0.9518891309816516,0.11473369598388672,0.9518891309816516
183,7,Naive Bayes,1,0.95,0.9666666666666667,0.9654893846056297,0.1270442008972168,0.9654893846056297
184,7,KNeighbors Classifier,2,0.95,0.9655172413793104,0.9701312318500641,0.12712478637695312,0.9701312318500641
185,7,SVC Classifier,2,0.95,0.39655172413793105,1.0,0.11539721488952637,0.0
186,7,Decision Tree,2,0.95,0.9137931034482759,0.9215414830498454,0.0011920928955078125,0.9215414830498454
187,7,RandomForest,2,0.95,0.9827586206896551,0.9852919811325488,1.0736255645751953,0.9852919811325488
188,7,AdaBoost (Discrete),2,0.95,0.9655172413793104,0.967693705920519,54.37364196777344,0.967693705920519
189,7,AdaBoost (Real),2,0.95,0.9655172413793104,0.967693705920519,60.50916051864624,0.967693705920519
190,7,Logistic Regression (Penalty = L2),2,0.95,1.0,1.0,0.158980131149292,1.0
191,7,Naive Bayes,2,0.95,0.9655172413793104,0.967693705920519,0.13152503967285156,0.967693705920519
192,8,KNeighbors Classifier,0,0.95,0.8833333333333333,0.8892233261225158,0.13075661659240723,0.8892233261225158
193,8,SVC Classifier,0,0.95,0.45,0.3872983346207417,0.11495208740234375,0.0
194,8,Decision Tree,0,0.95,0.8,0.799174495693515,0.12978816032409668,0.799174495693515
195,8,RandomForest,0,0.95,0.8666666666666667,0.8724415058636109,0.9453587532043457,0.8724415058636109
196,8,AdaBoost (Discrete),0,0.95,0.9333333333333333,0.9361090484023133,59.96946835517883,0.9361090484023133
197,8,AdaBoost (Real),0,0.95,0.9333333333333333,0.9410360288810286,62.7639901638031,0.9410360288810286
198,8,Logistic Regression (Penalty = L2),0,0.95,0.9666666666666667,0.9714127805419094,0.13901877403259277,0.9714127805419094
199,8,Naive Bayes,0,0.95,0.95,0.9564655913861946,0.003142118453979492,0.9564655913861946
200,8,KNeighbors Classifier,1,0.95,0.95,0.9549449757989991,0.14005088806152344,0.9549449757989991
201,8,SVC Classifier,1,0.95,0.4,1.0,0.13492989540100098,0.0
202,8,Decision Tree,1,0.95,0.8333333333333334,0.8018835824989566,0.0019638538360595703,0.8018835824989566
203,8,RandomForest,1,0.95,0.9,0.8957619677539866,1.0230700969696045,0.8957619677539866
204,8,AdaBoost (Discrete),1,0.95,0.9,0.8892233261225158,59.55394172668457,0.8892233261225158
205,8,AdaBoost (Real),1,0.95,0.8333333333333334,0.8067143230122719,47.944891691207886,0.8067143230122719
206,8,Logistic Regression (Penalty = L2),1,0.95,0.9166666666666666,0.915241126759053,0.1229407787322998,0.915241126759053
207,8,Naive Bayes,1,0.95,0.9666666666666667,0.9654893846056297,0.1148526668548584,0.9654893846056297
208,8,KNeighbors Classifier,2,0.95,0.9827586206896551,0.9852919811325488,0.11218118667602539,0.9852919811325488
209,8,SVC Classifier,2,0.95,0.39655172413793105,1.0,0.11878442764282227,0.0
210,8,Decision Tree,2,0.95,0.9655172413793104,0.967693705920519,0.0018317699432373047,0.967693705920519
211,8,RandomForest,2,0.95,1.0,1.0,0.82358717918396,1.0
212,8,AdaBoost (Discrete),2,0.95,0.9827586206896551,0.9821390252341226,41.52364754676819,0.9821390252341226
213,8,AdaBoost (Real),2,0.95,0.8793103448275862,0.8858189155864656,55.69549918174744,0.8858189155864656
214,8,Logistic Regression (Penalty = L2),2,0.95,1.0,1.0,0.0027875900268554688,1.0
215,8,Naive Bayes,2,0.95,1.0,1.0,0.15850520133972168,1.0
