,feat_set_id,classifier,fold_id,feat_th,score,geo_score,exec_t,geo_score_woz
0,0,KNeighbors Classifier,0,0.3,0.9373134328358209,0.9368097346405272,1.3800506591796875,0.9368097346405272
1,0,SVC Classifier,0,0.3,0.8895522388059701,0.8881015446926108,1.5490434169769287,0.8881015446926108
2,0,Decision Tree,0,0.3,0.8029850746268656,0.7984660469142443,0.08100390434265137,0.7984660469142443
3,0,RandomForest,0,0.3,0.6701492537313433,0.720522633997371,0.2843747138977051,0.0
4,0,AdaBoost (Discrete),0,0.3,0.8940298507462686,0.8901596807876125,47.61911058425903,0.8901596807876125
5,0,AdaBoost (Real),0,0.3,0.7940298507462686,0.7777740440407288,47.40525674819946,0.7777740440407288
6,0,Logistic Regression (Penalty = L2),0,0.3,0.9522388059701492,0.9518199490313143,1.3052537441253662,0.9518199490313143
7,0,Naive Bayes,0,0.3,0.8626865671641791,0.8611700055575894,0.14416074752807617,0.8611700055575894
8,0,KNeighbors Classifier,1,0.3,0.926865671641791,0.9257551006354401,1.4453644752502441,0.9257551006354401
9,0,SVC Classifier,1,0.3,0.9014925373134328,0.9003226305087372,1.5438833236694336,0.9003226305087372
10,0,Decision Tree,1,0.3,0.8149253731343283,0.8123452119965998,0.05642127990722656,0.8123452119965998
11,0,RandomForest,1,0.3,0.6985074626865672,0.5328854178710833,0.27706027030944824,0.5328854178710833
12,0,AdaBoost (Discrete),1,0.3,0.9194029850746268,0.9186827400780055,49.558314085006714,0.9186827400780055
13,0,AdaBoost (Real),1,0.3,0.5253731343283582,0.40205023650928357,47.88372993469238,0.40205023650928357
14,0,Logistic Regression (Penalty = L2),1,0.3,0.9507462686567164,0.9506040150341047,1.3969709873199463,0.9506040150341047
15,0,Naive Bayes,1,0.3,0.8776119402985074,0.8768271508465637,0.1482703685760498,0.8768271508465637
16,0,KNeighbors Classifier,2,0.3,0.9393939393939394,0.9388526493893469,1.2881112098693848,0.9388526493893469
17,0,SVC Classifier,2,0.3,0.8984848484848484,0.8977425274454134,1.631570816040039,0.8977425274454134
18,0,Decision Tree,2,0.3,0.806060606060606,0.8031799334015433,0.07662487030029297,0.8031799334015433
19,0,RandomForest,2,0.3,0.7181818181818181,0.6108533331861343,0.2758328914642334,0.6108533331861343
20,0,AdaBoost (Discrete),2,0.3,0.9181818181818182,0.9172902718169917,49.4988157749176,0.9172902718169917
21,0,AdaBoost (Real),2,0.3,0.8090909090909091,0.7951176208155195,48.96847653388977,0.7951176208155195
22,0,Logistic Regression (Penalty = L2),2,0.3,0.9590909090909091,0.9588513293928821,1.4910664558410645,0.9588513293928821
23,0,Naive Bayes,2,0.3,0.8757575757575757,0.8749544563295527,0.13750076293945312,0.8749544563295527
24,1,KNeighbors Classifier,0,0.3,0.9611940298507463,0.9606761139359424,1.3143861293792725,0.9606761139359424
25,1,SVC Classifier,0,0.3,0.8462686567164179,0.8160783558880559,1.705761194229126,0.8160783558880559
26,1,Decision Tree,0,0.3,0.8537313432835821,0.850879258606723,0.08437752723693848,0.850879258606723
27,1,RandomForest,0,0.3,0.6,0.5247428420109377,0.314373254776001,0.0
28,1,AdaBoost (Discrete),0,0.3,0.9223880597014925,0.921304726226705,65.59808015823364,0.921304726226705
29,1,AdaBoost (Real),0,0.3,0.8835820895522388,0.8810403298177887,61.795347929000854,0.8810403298177887
30,1,Logistic Regression (Penalty = L2),0,0.3,0.9746268656716418,0.9743505455585739,1.2870965003967285,0.9743505455585739
31,1,Naive Bayes,0,0.3,0.8388059701492537,0.826217387539762,0.10781097412109375,0.826217387539762
32,1,KNeighbors Classifier,1,0.3,0.935820895522388,0.9355325360528931,1.2368950843811035,0.9355325360528931
33,1,SVC Classifier,1,0.3,0.8567164179104477,0.839979419668712,1.8303642272949219,0.839979419668712
34,1,Decision Tree,1,0.3,0.8194029850746268,0.8174553671859597,0.08247065544128418,0.8174553671859597
35,1,RandomForest,1,0.3,0.5716417910447761,0.5010448115222017,0.28009581565856934,0.0
36,1,AdaBoost (Discrete),1,0.3,0.8970149253731343,0.8956953477854206,63.17079257965088,0.8956953477854206
37,1,AdaBoost (Real),1,0.3,0.7104477611940299,0.6961419417867235,60.10816979408264,0.6961419417867235
38,1,Logistic Regression (Penalty = L2),1,0.3,0.9582089552238806,0.9580010038366048,1.2371819019317627,0.9580010038366048
39,1,Naive Bayes,1,0.3,0.8731343283582089,0.8697452495072845,0.14206480979919434,0.8697452495072845
40,1,KNeighbors Classifier,2,0.3,0.9378787878787879,0.9371609262591423,1.2474312782287598,0.9371609262591423
41,1,SVC Classifier,2,0.3,0.8575757575757575,0.831383731227668,1.7191553115844727,0.831383731227668
42,1,Decision Tree,2,0.3,0.8560606060606061,0.8549301693708505,0.10540890693664551,0.8549301693708505
43,1,RandomForest,2,0.3,0.6090909090909091,0.43902192848960125,0.30800628662109375,0.43902192848960125
44,1,AdaBoost (Discrete),2,0.3,0.9121212121212121,0.9110160992047192,57.80632305145264,0.9110160992047192
45,1,AdaBoost (Real),2,0.3,0.7621212121212121,0.7547262320807966,54.638020277023315,0.7547262320807966
46,1,Logistic Regression (Penalty = L2),2,0.3,0.9727272727272728,0.9725414737701334,1.1064469814300537,0.9725414737701334
47,1,Naive Bayes,2,0.3,0.8545454545454545,0.8515202287098688,0.15482592582702637,0.8515202287098688
48,2,KNeighbors Classifier,0,0.3,0.9626865671641791,0.9619308038924308,1.1533942222595215,0.9619308038924308
49,2,SVC Classifier,0,0.3,0.9074626865671642,0.9050634943684294,1.3408775329589844,0.9050634943684294
50,2,Decision Tree,0,0.3,0.8552238805970149,0.8505466192482071,0.04924488067626953,0.8505466192482071
51,2,RandomForest,0,0.3,0.6343283582089553,0.4592375951877264,0.19435763359069824,0.4592375951877264
52,2,AdaBoost (Discrete),0,0.3,0.9238805970149254,0.9221844253356143,48.16712188720703,0.9221844253356143
53,2,AdaBoost (Real),0,0.3,0.7626865671641792,0.7405018636393431,45.08001232147217,0.7405018636393431
54,2,Logistic Regression (Penalty = L2),0,0.3,0.9671641791044776,0.9668207194279973,1.052582025527954,0.9668207194279973
55,2,Naive Bayes,0,0.3,0.9059701492537313,0.9029905771629552,0.15030479431152344,0.9029905771629552
56,2,KNeighbors Classifier,1,0.3,0.9462686567164179,0.9456342749261047,1.0808517932891846,0.9456342749261047
57,2,SVC Classifier,1,0.3,0.9238805970149254,0.9220099215950028,1.3251380920410156,0.9220099215950028
58,2,Decision Tree,1,0.3,0.8686567164179104,0.8632717529796725,0.04966902732849121,0.8632717529796725
59,2,RandomForest,1,0.3,0.5701492537313433,0.3988300917993707,0.22238969802856445,0.0
60,2,AdaBoost (Discrete),1,0.3,0.926865671641791,0.9262972494593827,47.82127618789673,0.9262972494593827
61,2,AdaBoost (Real),1,0.3,0.3895522388059702,0.19063337021184587,47.36814045906067,0.19063337021184587
62,2,Logistic Regression (Penalty = L2),1,0.3,0.9686567164179104,0.9684377069044336,1.097642183303833,0.9684377069044336
63,2,Naive Bayes,1,0.3,0.9194029850746268,0.9177744961752359,0.14641618728637695,0.9177744961752359
64,2,KNeighbors Classifier,2,0.3,0.9575757575757575,0.9567672252679108,0.9408185482025146,0.9567672252679108
65,2,SVC Classifier,2,0.3,0.9242424242424242,0.9220073894672893,1.3949580192565918,0.9220073894672893
66,2,Decision Tree,2,0.3,0.8393939393939394,0.838230598909358,0.04898643493652344,0.838230598909358
67,2,RandomForest,2,0.3,0.6863636363636364,0.5866811673275103,0.2569305896759033,0.5866811673275103
68,2,AdaBoost (Discrete),2,0.3,0.9287878787878788,0.9282129574435333,48.376569509506226,0.9282129574435333
69,2,AdaBoost (Real),2,0.3,0.7681818181818182,0.7584810682932212,47.36492133140564,0.7584810682932212
70,2,Logistic Regression (Penalty = L2),2,0.3,0.9696969696969697,0.9691934928322575,0.9819321632385254,0.9691934928322575
71,2,Naive Bayes,2,0.3,0.9257575757575758,0.9249120451396409,0.1066586971282959,0.9249120451396409
72,3,KNeighbors Classifier,0,0.3,0.9611940298507463,0.9608653942660274,0.8786110877990723,0.9608653942660274
73,3,SVC Classifier,0,0.3,0.8791044776119403,0.8742364199172437,1.1682918071746826,0.8742364199172437
74,3,Decision Tree,0,0.3,0.8283582089552238,0.8254084930213824,0.06313896179199219,0.8254084930213824
75,3,RandomForest,0,0.3,0.7402985074626866,0.7148541293584026,0.21240687370300293,0.7148541293584026
76,3,AdaBoost (Discrete),0,0.3,0.9343283582089552,0.9335050986517637,43.244733572006226,0.9335050986517637
77,3,AdaBoost (Real),0,0.3,0.8402985074626865,0.836397548997717,49.05628442764282,0.836397548997717
78,3,Logistic Regression (Penalty = L2),0,0.3,0.9656716417910448,0.965203479757802,0.8728365898132324,0.965203479757802
79,3,Naive Bayes,0,0.3,0.8701492537313433,0.8665336849255159,0.13206815719604492,0.8665336849255159
80,3,KNeighbors Classifier,1,0.3,0.9522388059701492,0.9518628808101763,0.9901776313781738,0.9518628808101763
81,3,SVC Classifier,1,0.3,0.9164179104477612,0.9146693980982981,1.192441701889038,0.9146693980982981
82,3,Decision Tree,1,0.3,0.8432835820895522,0.8405256526815237,0.060480356216430664,0.8405256526815237
83,3,RandomForest,1,0.3,0.6955223880597015,0.5804051673190068,0.18701934814453125,0.5804051673190068
84,3,AdaBoost (Discrete),1,0.3,0.9343283582089552,0.9339874433924785,45.102776288986206,0.9339874433924785
85,3,AdaBoost (Real),1,0.3,0.6044776119402985,0.545010615247956,40.453126192092896,0.545010615247956
86,3,Logistic Regression (Penalty = L2),1,0.3,0.9686567164179104,0.9684850354938194,0.8427181243896484,0.9684850354938194
87,3,Naive Bayes,1,0.3,0.9104477611940298,0.90935715204194,0.07801294326782227,0.90935715204194
88,3,KNeighbors Classifier,2,0.3,0.9484848484848485,0.9481201759792668,0.9149603843688965,0.9481201759792668
89,3,SVC Classifier,2,0.3,0.8848484848484849,0.8811845390438203,1.194523572921753,0.8811845390438203
90,3,Decision Tree,2,0.3,0.8151515151515152,0.8120262381948357,0.04024910926818848,0.8120262381948357
91,3,RandomForest,2,0.3,0.7833333333333333,0.7636048722517454,0.2203981876373291,0.7636048722517454
92,3,AdaBoost (Discrete),2,0.3,0.8984848484848484,0.8972522393520945,40.97127819061279,0.8972522393520945
93,3,AdaBoost (Real),2,0.3,0.38181818181818183,0.24203865718803497,44.519219398498535,0.0
94,3,Logistic Regression (Penalty = L2),2,0.3,0.9636363636363636,0.9634179660410203,0.8984105587005615,0.9634179660410203
95,3,Naive Bayes,2,0.3,0.8848484848484849,0.8833703531480805,0.17471623420715332,0.8833703531480805
96,4,KNeighbors Classifier,0,0.3,0.8432835820895522,0.8399287654246186,0.10913515090942383,0.8399287654246186
97,4,SVC Classifier,0,0.3,0.6716417910447762,0.5228485345887096,0.5151107311248779,0.5228485345887096
98,4,Decision Tree,0,0.3,0.755223880597015,0.749546204224268,0.02199101448059082,0.749546204224268
99,4,RandomForest,0,0.3,0.5298507462686567,0.3729604553368271,0.18071722984313965,0.3729604553368271
100,4,AdaBoost (Discrete),0,0.3,0.7611940298507462,0.7551372401358849,15.714728832244873,0.7551372401358849
101,4,AdaBoost (Real),0,0.3,0.6940298507462687,0.6779995650262044,19.39222502708435,0.6779995650262044
102,4,Logistic Regression (Penalty = L2),0,0.3,0.8164179104477612,0.8086831973840695,0.4688742160797119,0.8086831973840695
103,4,Naive Bayes,0,0.3,0.7074626865671642,0.676880803347667,0.07823991775512695,0.676880803347667
104,4,KNeighbors Classifier,1,0.3,0.8552238805970149,0.8509103919085013,0.18669748306274414,0.8509103919085013
105,4,SVC Classifier,1,0.3,0.6880597014925374,0.5458696045236228,0.6046535968780518,0.5458696045236228
106,4,Decision Tree,1,0.3,0.7492537313432835,0.7432605074917005,0.02274608612060547,0.7432605074917005
107,4,RandomForest,1,0.3,0.6343283582089553,0.5284167336338076,0.1411750316619873,0.5284167336338076
108,4,AdaBoost (Discrete),1,0.3,0.7835820895522388,0.7712362765903119,17.99766755104065,0.7712362765903119
109,4,AdaBoost (Real),1,0.3,0.4014925373134328,0.3070946597518912,19.99348545074463,0.0
110,4,Logistic Regression (Penalty = L2),1,0.3,0.8343283582089552,0.8302273914009985,0.3926658630371094,0.8302273914009985
111,4,Naive Bayes,1,0.3,0.7507462686567165,0.7357010262859229,0.05137777328491211,0.7357010262859229
112,4,KNeighbors Classifier,2,0.3,0.8621212121212121,0.8588932923337128,0.11105132102966309,0.8588932923337128
113,4,SVC Classifier,2,0.3,0.6878787878787879,0.49986124400092347,0.6053674221038818,0.49986124400092347
114,4,Decision Tree,2,0.3,0.7393939393939394,0.7324410117346599,0.02132391929626465,0.7324410117346599
115,4,RandomForest,2,0.3,0.6,0.724313863750914,0.18020081520080566,0.0
116,4,AdaBoost (Discrete),2,0.3,0.7803030303030303,0.7723314023827396,16.570249319076538,0.7723314023827396
117,4,AdaBoost (Real),2,0.3,0.7439393939393939,0.7276653744415753,19.756402492523193,0.7276653744415753
118,4,Logistic Regression (Penalty = L2),2,0.3,0.8469696969696969,0.8450896874509729,0.4042525291442871,0.8450896874509729
119,4,Naive Bayes,2,0.3,0.7287878787878788,0.698982882932893,0.0657646656036377,0.698982882932893
120,5,KNeighbors Classifier,0,0.3,0.9074626865671642,0.9053856167634109,0.3815956115722656,0.9053856167634109
121,5,SVC Classifier,0,0.3,0.7746268656716417,0.715534890775047,0.6467239856719971,0.715534890775047
122,5,Decision Tree,0,0.3,0.8059701492537313,0.7988188984296265,0.04035162925720215,0.7988188984296265
123,5,RandomForest,0,0.3,0.5835820895522388,0.5507648217244189,0.17390084266662598,0.0
124,5,AdaBoost (Discrete),0,0.3,0.8402985074626865,0.8304071826781584,20.156206607818604,0.8304071826781584
125,5,AdaBoost (Real),0,0.3,0.7373134328358208,0.7149992755082736,22.19771695137024,0.7149992755082736
126,5,Logistic Regression (Penalty = L2),0,0.3,0.9208955223880597,0.9198641665283984,0.47972702980041504,0.9198641665283984
127,5,Naive Bayes,0,0.3,0.8343283582089552,0.8265477553297147,0.0842900276184082,0.8265477553297147
128,5,KNeighbors Classifier,1,0.3,0.9238805970149254,0.9227655646852677,0.346027135848999,0.9227655646852677
129,5,SVC Classifier,1,0.3,0.7970149253731343,0.7693543504963225,0.6771249771118164,0.7693543504963225
130,5,Decision Tree,1,0.3,0.7791044776119403,0.7743024284272103,0.03954172134399414,0.7743024284272103
131,5,RandomForest,1,0.3,0.6164179104477612,0.6331569266835961,0.16088128089904785,0.0
132,5,AdaBoost (Discrete),1,0.3,0.8805970149253731,0.8787129335564836,19.608731269836426,0.8787129335564836
133,5,AdaBoost (Real),1,0.3,0.573134328358209,0.5173991728921783,23.001673698425293,0.5173991728921783
134,5,Logistic Regression (Penalty = L2),1,0.3,0.926865671641791,0.9262827280680325,0.5285403728485107,0.9262827280680325
135,5,Naive Bayes,1,0.3,0.8552238805970149,0.8517320437008857,0.070037841796875,0.8517320437008857
136,5,KNeighbors Classifier,2,0.3,0.9151515151515152,0.9139391696644226,0.2615971565246582,0.9139391696644226
137,5,SVC Classifier,2,0.3,0.7757575757575758,0.72600910289798,0.6867702007293701,0.72600910289798
138,5,Decision Tree,2,0.3,0.8015151515151515,0.7997414242012096,0.026964426040649414,0.7997414242012096
139,5,RandomForest,2,0.3,0.5969696969696969,0.5729722355503459,0.16167187690734863,0.0
140,5,AdaBoost (Discrete),2,0.3,0.8787878787878788,0.8773961611403442,19.80225419998169,0.8773961611403442
141,5,AdaBoost (Real),2,0.3,0.5045454545454545,0.4720702911613584,22.250999927520752,0.4720702911613584
142,5,Logistic Regression (Penalty = L2),2,0.3,0.9393939393939394,0.9388827833791948,0.4471433162689209,0.9388827833791948
143,5,Naive Bayes,2,0.3,0.8575757575757575,0.853699550450001,0.11241459846496582,0.853699550450001
144,6,KNeighbors Classifier,0,0.3,0.891044776119403,0.8892302635695793,0.09830069541931152,0.8892302635695793
145,6,SVC Classifier,0,0.3,0.7059701492537314,0.7690998876960291,0.4387669563293457,0.0
146,6,Decision Tree,0,0.3,0.7656716417910447,0.7604108196811994,0.01775527000427246,0.7604108196811994
147,6,RandomForest,0,0.3,0.6104477611940299,0.7457985145558119,0.14148664474487305,0.0
148,6,AdaBoost (Discrete),0,0.3,0.8507462686567164,0.8434828518674851,17.08021116256714,0.8434828518674851
149,6,AdaBoost (Real),0,0.3,0.7,0.6872069156720372,20.727030754089355,0.6872069156720372
150,6,Logistic Regression (Penalty = L2),0,0.3,0.908955223880597,0.9079652728138816,0.3937232494354248,0.9079652728138816
151,6,Naive Bayes,0,0.3,0.755223880597015,0.7225723851203756,0.07172632217407227,0.7225723851203756
152,6,KNeighbors Classifier,1,0.3,0.891044776119403,0.8893956766558457,0.20346593856811523,0.8893956766558457
153,6,SVC Classifier,1,0.3,0.7298507462686568,0.6180585695143662,0.6148526668548584,0.6180585695143662
154,6,Decision Tree,1,0.3,0.7835820895522388,0.778957935758589,0.02027440071105957,0.778957935758589
155,6,RandomForest,1,0.3,0.6134328358208955,0.44751559534462676,0.15970444679260254,0.44751559534462676
156,6,AdaBoost (Discrete),1,0.3,0.8507462686567164,0.8381958663121712,16.93355941772461,0.8381958663121712
157,6,AdaBoost (Real),1,0.3,0.6119402985074627,0.5460788376292229,20.36339044570923,0.5460788376292229
158,6,Logistic Regression (Penalty = L2),1,0.3,0.9104477611940298,0.9101319249176768,0.43718600273132324,0.9101319249176768
159,6,Naive Bayes,1,0.3,0.7850746268656716,0.7746733960180262,0.05331707000732422,0.7746733960180262
160,6,KNeighbors Classifier,2,0.3,0.8924242424242425,0.8899779627691606,0.19548583030700684,0.8899779627691606
161,6,SVC Classifier,2,0.3,0.706060606060606,0.7700671225612943,0.6767063140869141,0.0
162,6,Decision Tree,2,0.3,0.7681818181818182,0.76268407946773,0.04263186454772949,0.76268407946773
163,6,RandomForest,2,0.3,0.5863636363636363,0.4735864585937183,0.14969205856323242,0.4735864585937183
164,6,AdaBoost (Discrete),2,0.3,0.8287878787878787,0.8085885165258906,15.927558422088623,0.8085885165258906
165,6,AdaBoost (Real),2,0.3,0.7696969696969697,0.7616395800560332,19.52064847946167,0.7616395800560332
166,6,Logistic Regression (Penalty = L2),2,0.3,0.9075757575757576,0.9066052717815413,0.4178893566131592,0.9066052717815413
167,6,Naive Bayes,2,0.3,0.7651515151515151,0.735253094187065,0.1041114330291748,0.735253094187065
168,7,KNeighbors Classifier,0,0.3,0.908955223880597,0.9065373939229294,0.19794678688049316,0.9065373939229294
169,7,SVC Classifier,0,0.3,0.7223880597014926,0.6525174497522612,0.6660635471343994,0.6525174497522612
170,7,Decision Tree,0,0.3,0.7522388059701492,0.7455783330178745,0.03157639503479004,0.7455783330178745
171,7,RandomForest,0,0.3,0.491044776119403,0.33791933491921955,0.158203125,0.0
172,7,AdaBoost (Discrete),0,0.3,0.8462686567164179,0.8436634372688835,17.800207138061523,0.8436634372688835
173,7,AdaBoost (Real),0,0.3,0.7268656716417911,0.7089787897760327,19.580053329467773,0.7089787897760327
174,7,Logistic Regression (Penalty = L2),0,0.3,0.8880597014925373,0.8855287848570482,0.39806628227233887,0.8855287848570482
175,7,Naive Bayes,0,0.3,0.8253731343283582,0.8205066415935928,0.08707785606384277,0.8205066415935928
176,7,KNeighbors Classifier,1,0.3,0.9134328358208955,0.9126415172171635,0.11526846885681152,0.9126415172171635
177,7,SVC Classifier,1,0.3,0.7373134328358208,0.7010234185150975,0.4573843479156494,0.7010234185150975
178,7,Decision Tree,1,0.3,0.7656716417910447,0.7582271925654945,0.005282402038574219,0.7582271925654945
179,7,RandomForest,1,0.3,0.48059701492537316,0.3596436015490719,0.15313339233398438,0.0
180,7,AdaBoost (Discrete),1,0.3,0.8522388059701492,0.8515641352407203,17.438588619232178,0.8515641352407203
181,7,AdaBoost (Real),1,0.3,0.7343283582089553,0.7164469884853207,19.488125324249268,0.7164469884853207
182,7,Logistic Regression (Penalty = L2),1,0.3,0.891044776119403,0.8891187585171542,0.3228940963745117,0.8891187585171542
183,7,Naive Bayes,1,0.3,0.8373134328358209,0.8353277849504724,0.0673370361328125,0.8353277849504724
184,7,KNeighbors Classifier,2,0.3,0.9136363636363637,0.9126699077785458,0.20913076400756836,0.9126699077785458
185,7,SVC Classifier,2,0.3,0.7378787878787879,0.6697093693147488,0.5904436111450195,0.6697093693147488
186,7,Decision Tree,2,0.3,0.7666666666666667,0.7601111848436428,0.05137896537780762,0.7601111848436428
187,7,RandomForest,2,0.3,0.543939393939394,0.4902727266539784,0.14632773399353027,0.0
188,7,AdaBoost (Discrete),2,0.3,0.8469696969696969,0.8452901015851658,17.956360578536987,0.8452901015851658
189,7,AdaBoost (Real),2,0.3,0.7833333333333333,0.7769445725808709,19.43172597885132,0.7769445725808709
190,7,Logistic Regression (Penalty = L2),2,0.3,0.8954545454545455,0.8941740291858908,0.39885783195495605,0.8941740291858908
191,7,Naive Bayes,2,0.3,0.8378787878787879,0.8352643509888531,0.04357552528381348,0.8352643509888531
192,8,KNeighbors Classifier,0,0.3,0.9447761194029851,0.9441132539619898,0.29718685150146484,0.9441132539619898
193,8,SVC Classifier,0,0.3,0.7611940298507462,0.6534476108821243,0.6656091213226318,0.6534476108821243
194,8,Decision Tree,0,0.3,0.7985074626865671,0.7901768360433358,0.040496110916137695,0.7901768360433358
195,8,RandomForest,0,0.3,0.691044776119403,0.7469145856388864,0.21214580535888672,0.0
196,8,AdaBoost (Discrete),0,0.3,0.9134328358208955,0.9128555240312735,22.54302144050598,0.9128555240312735
197,8,AdaBoost (Real),0,0.3,0.8925373134328358,0.8917828944610524,24.636600255966187,0.8917828944610524
198,8,Logistic Regression (Penalty = L2),0,0.3,0.9507462686567164,0.9498867910051741,0.431687593460083,0.9498867910051741
199,8,Naive Bayes,0,0.3,0.8253731343283582,0.8073006994321837,0.11144900321960449,0.8073006994321837
200,8,KNeighbors Classifier,1,0.3,0.9298507462686567,0.9292455375327845,0.17572951316833496,0.9292455375327845
201,8,SVC Classifier,1,0.3,0.7970149253731343,0.7565299756783259,0.36572694778442383,0.7565299756783259
202,8,Decision Tree,1,0.3,0.7776119402985074,0.7731141683760426,0.0057904720306396484,0.7731141683760426
203,8,RandomForest,1,0.3,0.7044776119402985,0.5680380476196101,0.15542125701904297,0.5680380476196101
204,8,AdaBoost (Discrete),1,0.3,0.9059701492537313,0.9054087940706426,21.9569034576416,0.9054087940706426
205,8,AdaBoost (Real),1,0.3,0.4343283582089552,0.28946888552645317,26.03037428855896,0.0
206,8,Logistic Regression (Penalty = L2),1,0.3,0.935820895522388,0.9351294840979423,0.4697115421295166,0.9351294840979423
207,8,Naive Bayes,1,0.3,0.8492537313432836,0.8460839266422906,0.04878115653991699,0.8460839266422906
208,8,KNeighbors Classifier,2,0.3,0.9151515151515152,0.9139957098405329,0.1710188388824463,0.9139957098405329
209,8,SVC Classifier,2,0.3,0.7636363636363637,0.69678746243729,0.48995375633239746,0.69678746243729
210,8,Decision Tree,2,0.3,0.796969696969697,0.7950952018697844,0.03427910804748535,0.7950952018697844
211,8,RandomForest,2,0.3,0.6787878787878788,0.5617570112393242,0.19565796852111816,0.5617570112393242
212,8,AdaBoost (Discrete),2,0.3,0.8939393939393939,0.8931263397247136,22.3137309551239,0.8931263397247136
213,8,AdaBoost (Real),2,0.3,0.8560606060606061,0.8546532977891732,22.670560598373413,0.8546532977891732
214,8,Logistic Regression (Penalty = L2),2,0.3,0.9424242424242424,0.9420891560107897,0.45130324363708496,0.9420891560107897
215,8,Naive Bayes,2,0.3,0.8227272727272728,0.8158563399712774,0.07391119003295898,0.8158563399712774
216,9,KNeighbors Classifier,0,0.3,0.9313432835820895,0.9300775660925372,0.165327787399292,0.9300775660925372
217,9,SVC Classifier,0,0.3,0.7611940298507462,0.722379775911558,0.5642037391662598,0.722379775911558
218,9,Decision Tree,0,0.3,0.7910447761194029,0.7874205687332941,0.021915435791015625,0.7874205687332941
219,9,RandomForest,0,0.3,0.5417910447761194,0.35688334263441945,0.18082427978515625,0.35688334263441945
220,9,AdaBoost (Discrete),0,0.3,0.8895522388059701,0.8884669360013207,16.24827551841736,0.8884669360013207
221,9,AdaBoost (Real),0,0.3,0.5626865671641791,0.4936992669646307,18.787285804748535,0.4936992669646307
222,9,Logistic Regression (Penalty = L2),0,0.3,0.9373134328358209,0.9365333110971297,0.3150801658630371,0.9365333110971297
223,9,Naive Bayes,0,0.3,0.8611940298507462,0.8575905425260113,0.07751822471618652,0.8575905425260113
224,9,KNeighbors Classifier,1,0.3,0.9208955223880597,0.9192456861535359,0.2180769443511963,0.9192456861535359
225,9,SVC Classifier,1,0.3,0.7925373134328358,0.766494541901236,0.5417490005493164,0.766494541901236
226,9,Decision Tree,1,0.3,0.8029850746268656,0.8001442198576253,0.02092719078063965,0.8001442198576253
227,9,RandomForest,1,0.3,0.4164179104477612,0.3153748541787961,0.13639020919799805,0.0
228,9,AdaBoost (Discrete),1,0.3,0.8940298507462686,0.8935916883724162,15.711182594299316,0.8935916883724162
229,9,AdaBoost (Real),1,0.3,0.6656716417910448,0.6416012948463098,17.995781183242798,0.6416012948463098
230,9,Logistic Regression (Penalty = L2),1,0.3,0.9462686567164179,0.9455984263790107,0.24262666702270508,0.9455984263790107
231,9,Naive Bayes,1,0.3,0.8731343283582089,0.8695322984814521,0.062401771545410156,0.8695322984814521
232,9,KNeighbors Classifier,2,0.3,0.9393939393939394,0.9386783884954365,0.2302839756011963,0.9386783884954365
233,9,SVC Classifier,2,0.3,0.746969696969697,0.7065956814932655,0.5805850028991699,0.7065956814932655
234,9,Decision Tree,2,0.3,0.7924242424242425,0.7905606546320094,0.03127455711364746,0.7905606546320094
235,9,RandomForest,2,0.3,0.4484848484848485,0.29228362459113966,0.12958550453186035,0.0
236,9,AdaBoost (Discrete),2,0.3,0.8787878787878788,0.8777958191093554,15.689120531082153,0.8777958191093554
237,9,AdaBoost (Real),2,0.3,0.603030303030303,0.5710243705336804,17.866060256958008,0.5710243705336804
238,9,Logistic Regression (Penalty = L2),2,0.3,0.9348484848484848,0.9341514199860714,0.28269481658935547,0.9341514199860714
239,9,Naive Bayes,2,0.3,0.8409090909090909,0.8345180365505889,0.03242063522338867,0.8345180365505889
240,10,KNeighbors Classifier,0,0.3,0.9552238805970149,0.9544771806364729,0.8983039855957031,0.9544771806364729
241,10,SVC Classifier,0,0.3,0.8820895522388059,0.8760515477118777,0.9953904151916504,0.8760515477118777
242,10,Decision Tree,0,0.3,0.8298507462686567,0.8259512912813503,0.035642385482788086,0.8259512912813503
243,10,RandomForest,0,0.3,0.6194029850746269,0.4773585089430884,0.12768220901489258,0.4773585089430884
244,10,AdaBoost (Discrete),0,0.3,0.926865671641791,0.925588762647019,36.22969031333923,0.925588762647019
245,10,AdaBoost (Real),0,0.3,0.8029850746268656,0.7909153977990327,31.655161142349243,0.7909153977990327
246,10,Logistic Regression (Penalty = L2),0,0.3,0.9686567164179104,0.9683703825226533,0.7822115421295166,0.9683703825226533
247,10,Naive Bayes,0,0.3,0.8746268656716418,0.8703439467123533,0.12514400482177734,0.8703439467123533
248,10,KNeighbors Classifier,1,0.3,0.9462686567164179,0.9456862731376184,0.8504350185394287,0.9456862731376184
249,10,SVC Classifier,1,0.3,0.9059701492537313,0.9041414660775078,0.9486441612243652,0.9041414660775078
250,10,Decision Tree,1,0.3,0.8611940298507462,0.859683218267618,0.03716158866882324,0.859683218267618
251,10,RandomForest,1,0.3,0.5313432835820896,0.3054230572988322,0.1322801113128662,0.3054230572988322
252,10,AdaBoost (Discrete),1,0.3,0.9283582089552239,0.9278836927945473,33.90997791290283,0.9278836927945473
253,10,AdaBoost (Real),1,0.3,0.835820895522388,0.8303935279221858,32.32054114341736,0.8303935279221858
254,10,Logistic Regression (Penalty = L2),1,0.3,0.9626865671641791,0.9625415578416114,0.8542344570159912,0.9625415578416114
255,10,Naive Bayes,1,0.3,0.9074626865671642,0.906486446616365,0.07725143432617188,0.906486446616365
256,10,KNeighbors Classifier,2,0.3,0.9484848484848485,0.9477185681293478,0.8710753917694092,0.9477185681293478
257,10,SVC Classifier,2,0.3,0.8954545454545455,0.8911032364411313,0.9448385238647461,0.8911032364411313
258,10,Decision Tree,2,0.3,0.8606060606060606,0.8594688100037173,0.046158790588378906,0.8594688100037173
259,10,RandomForest,2,0.3,0.5666666666666667,0.445515512157377,0.13727116584777832,0.0
260,10,AdaBoost (Discrete),2,0.3,0.9151515151515152,0.9137113474513295,36.224374771118164,0.9137113474513295
261,10,AdaBoost (Real),2,0.3,0.8272727272727273,0.8253735534696239,31.960466146469116,0.8253735534696239
262,10,Logistic Regression (Penalty = L2),2,0.3,0.9787878787878788,0.9786655453141702,0.695084810256958,0.9786655453141702
263,10,Naive Bayes,2,0.3,0.9045454545454545,0.9027921269040096,0.06811666488647461,0.9027921269040096
264,11,KNeighbors Classifier,0,0.3,0.9656716417910448,0.9653236582688737,2.0465426445007324,0.9653236582688737
265,11,SVC Classifier,0,0.3,0.9537313432835821,0.9531502759342232,1.4117140769958496,0.9531502759342232
266,11,Decision Tree,0,0.3,0.8492537313432836,0.8464690181316818,0.03047490119934082,0.8464690181316818
267,11,RandomForest,0,0.3,0.7611940298507462,0.7134296280087092,0.13764142990112305,0.7134296280087092
268,11,AdaBoost (Discrete),0,0.3,0.9447761194029851,0.9437097547299517,65.69906425476074,0.9437097547299517
269,11,AdaBoost (Real),0,0.3,0.746268656716418,0.7290270211633636,55.81923532485962,0.7290270211633636
270,11,Logistic Regression (Penalty = L2),0,0.3,0.9761194029850746,0.9758616737174248,1.5571987628936768,0.9758616737174248
271,11,Naive Bayes,0,0.3,0.9104477611940298,0.909086054149343,0.11265802383422852,0.909086054149343
272,11,KNeighbors Classifier,1,0.3,0.9567164179104478,0.9562602731630615,1.844315767288208,0.9562602731630615
273,11,SVC Classifier,1,0.3,0.9477611940298507,0.94740547244613,1.4967617988586426,0.94740547244613
274,11,Decision Tree,1,0.3,0.8582089552238806,0.8562091792211753,0.08094596862792969,0.8562091792211753
275,11,RandomForest,1,0.3,0.6462686567164179,0.5176837233206687,0.19572782516479492,0.5176837233206687
276,11,AdaBoost (Discrete),1,0.3,0.9388059701492537,0.9385844501728207,62.3860764503479,0.9385844501728207
277,11,AdaBoost (Real),1,0.3,0.282089552238806,0.15572385107347458,54.68672037124634,0.0
278,11,Logistic Regression (Penalty = L2),1,0.3,0.9716417910447761,0.9715632520762846,1.344649314880371,0.9715632520762846
279,11,Naive Bayes,1,0.3,0.9283582089552239,0.9277026873187992,0.13894152641296387,0.9277026873187992
280,11,KNeighbors Classifier,2,0.3,0.9651515151515152,0.9648170099674166,1.8503663539886475,0.9648170099674166
281,11,SVC Classifier,2,0.3,0.95,0.9497319812077909,1.2488949298858643,0.9497319812077909
282,11,Decision Tree,2,0.3,0.8454545454545455,0.8440400866487147,0.06343746185302734,0.8440400866487147
283,11,RandomForest,2,0.3,0.7439393939393939,0.6734030011890136,0.19295692443847656,0.6734030011890136
284,11,AdaBoost (Discrete),2,0.3,0.9454545454545454,0.9447091977698007,56.659443855285645,0.9447091977698007
285,11,AdaBoost (Real),2,0.3,0.8212121212121212,0.8174963376152269,50.52818822860718,0.8174963376152269
286,11,Logistic Regression (Penalty = L2),2,0.3,0.9772727272727273,0.9771493796465622,1.3129808902740479,0.9771493796465622
287,11,Naive Bayes,2,0.3,0.9212121212121213,0.9206652989547393,0.13848042488098145,0.9206652989547393
288,12,KNeighbors Classifier,0,0.3,0.6805970149253732,0.668392529195852,0.026752233505249023,0.668392529195852
289,12,SVC Classifier,0,0.3,0.4626865671641791,0.34090264468449977,0.1771383285522461,0.34090264468449977
290,12,Decision Tree,0,0.3,0.6119402985074627,0.5971236789901359,0.012891530990600586,0.5971236789901359
291,12,RandomForest,0,0.3,0.508955223880597,0.3336838928910163,0.0958712100982666,0.0
292,12,AdaBoost (Discrete),0,0.3,0.5492537313432836,0.5070835625565807,7.062767505645752,0.5070835625565807
293,12,AdaBoost (Real),0,0.3,0.45223880597014926,0.35484977358433045,9.476910591125488,0.35484977358433045
294,12,Logistic Regression (Penalty = L2),0,0.3,0.6656716417910448,0.6395418219666081,0.11053466796875,0.6395418219666081
295,12,Naive Bayes,0,0.3,0.6074626865671642,0.5633978490407786,0.028756380081176758,0.5633978490407786
296,12,KNeighbors Classifier,1,0.3,0.6925373134328359,0.6746679121519544,0.07397055625915527,0.6746679121519544
297,12,SVC Classifier,1,0.3,0.4746268656716418,0.3691335324779514,0.3013627529144287,0.3691335324779514
298,12,Decision Tree,1,0.3,0.6149253731343284,0.5956325047542533,0.019924402236938477,0.5956325047542533
299,12,RandomForest,1,0.3,0.48059701492537316,0.7922684254017768,0.09657001495361328,0.0
300,12,AdaBoost (Discrete),1,0.3,0.6014925373134329,0.5788629940996999,6.681232929229736,0.5788629940996999
301,12,AdaBoost (Real),1,0.3,0.39552238805970147,0.3632672878410939,10.141534566879272,0.0
302,12,Logistic Regression (Penalty = L2),1,0.3,0.6955223880597015,0.6654850501656044,0.0907602310180664,0.6654850501656044
303,12,Naive Bayes,1,0.3,0.608955223880597,0.5674429586387807,0.03738713264465332,0.5674429586387807
304,12,KNeighbors Classifier,2,0.3,0.6984848484848485,0.6851606979353759,0.03167152404785156,0.6851606979353759
305,12,SVC Classifier,2,0.3,0.45,0.3380751291711708,0.20525813102722168,0.3380751291711708
306,12,Decision Tree,2,0.3,0.6227272727272727,0.6056743700842012,0.004966020584106445,0.6056743700842012
307,12,RandomForest,2,0.3,0.49393939393939396,0.6865435553916386,0.07158851623535156,0.0
308,12,AdaBoost (Discrete),2,0.3,0.593939393939394,0.5565810200196394,6.450265407562256,0.5565810200196394
309,12,AdaBoost (Real),2,0.3,0.45606060606060606,0.3200037437926361,8.606759786605835,0.3200037437926361
310,12,Logistic Regression (Penalty = L2),2,0.3,0.6621212121212121,0.6456456982837627,0.11024141311645508,0.6456456982837627
311,12,Naive Bayes,2,0.3,0.5984848484848485,0.5564980154267424,0.032430171966552734,0.5564980154267424
