,feat_set_id,classifier,fold_id,feat_th,score,geo_score,exec_t,geo_score_woz
0,0,KNeighbors Classifier,0,0.05,0.5911270983213429,0.5828635275497966,0.08153939247131348,0.5828635275497966
1,0,SVC Classifier,0,0.05,0.6396882494004796,0.4965754013090553,2.4449281692504883,0.4965754013090553
2,0,Decision Tree,0,0.05,0.5479616306954437,0.5453041722995492,0.07819938659667969,0.5453041722995492
3,0,RandomForest,0,0.05,0.6510791366906474,0.5851715699616512,0.27478599548339844,0.5851715699616512
4,0,AdaBoost (Discrete),0,0.05,0.6121103117505995,0.5715363127174109,19.491989374160767,0.5715363127174109
5,0,AdaBoost (Real),0,0.05,0.5269784172661871,0.5251993586555225,29.004109382629395,0.5251993586555225
6,0,Logistic Regression (Penalty = L2),0,0.05,0.657673860911271,0.633060440218152,0.12366700172424316,0.633060440218152
7,0,Naive Bayes,0,0.05,0.6486810551558753,0.5688915834594666,0.03282332420349121,0.5688915834594666
8,0,KNeighbors Classifier,1,0.05,0.592436974789916,0.5807856932686615,0.08445858955383301,0.5807856932686615
9,0,SVC Classifier,1,0.05,0.6308523409363745,0.4883503017335535,2.605632781982422,0.4883503017335535
10,0,Decision Tree,1,0.05,0.5486194477791116,0.5425588063100165,0.05999469757080078,0.5425588063100165
11,0,RandomForest,1,0.05,0.6422569027611045,0.5931353630528001,0.25286006927490234,0.5931353630528001
12,0,AdaBoost (Discrete),1,0.05,0.6038415366146459,0.5796347744656456,18.113224029541016,0.5796347744656456
13,0,AdaBoost (Real),1,0.05,0.5234093637454982,0.5193816790266956,32.46859335899353,0.5193816790266956
14,0,Logistic Regression (Penalty = L2),1,0.05,0.6458583433373349,0.6285537462242038,0.1590409278869629,0.6285537462242038
15,0,Naive Bayes,1,0.05,0.6398559423769508,0.565641567279681,0.040062665939331055,0.565641567279681
16,0,KNeighbors Classifier,2,0.05,0.5984393757503002,0.5891383533381073,0.12042450904846191,0.5891383533381073
17,0,SVC Classifier,2,0.05,0.6434573829531812,0.47186830066707763,3.646531581878662,0.47186830066707763
18,0,Decision Tree,2,0.05,0.5660264105642256,0.5587585818069665,0.07556319236755371,0.5587585818069665
19,0,RandomForest,2,0.05,0.6482593037214885,0.5790345929434491,0.4019293785095215,0.5790345929434491
20,0,AdaBoost (Discrete),2,0.05,0.6086434573829532,0.6015612715900532,26.579368352890015,0.6015612715900532
21,0,AdaBoost (Real),2,0.05,0.5576230492196879,0.5461441626987156,34.86352324485779,0.5461441626987156
22,0,Logistic Regression (Penalty = L2),2,0.05,0.6554621848739496,0.6295122265369427,0.13176774978637695,0.6295122265369427
23,0,Naive Bayes,2,0.05,0.6608643457382953,0.5676673221227653,0.03376460075378418,0.5676673221227653
24,1,KNeighbors Classifier,0,0.05,0.6139088729016786,0.6119141950717932,0.11284494400024414,0.6119141950717932
25,1,SVC Classifier,0,0.05,0.6660671462829736,0.6271791887170818,3.2065389156341553,0.6271791887170818
26,1,Decision Tree,0,0.05,0.5533573141486811,0.553099078133628,0.07178544998168945,0.553099078133628
27,1,RandomForest,0,0.05,0.6534772182254197,0.622344326050149,0.32277727127075195,0.622344326050149
28,1,AdaBoost (Discrete),0,0.05,0.6276978417266187,0.6233188310850569,26.67093586921692,0.6233188310850569
29,1,AdaBoost (Real),0,0.05,0.5515587529976019,0.5501208511789925,31.038506269454956,0.5501208511789925
30,1,Logistic Regression (Penalty = L2),0,0.05,0.670863309352518,0.6673306624890215,0.10928463935852051,0.6673306624890215
31,1,Naive Bayes,0,0.05,0.670263788968825,0.6490384650901132,0.0383915901184082,0.6490384650901132
32,1,KNeighbors Classifier,1,0.05,0.6068427370948379,0.6029441196663695,0.10857415199279785,0.6029441196663695
33,1,SVC Classifier,1,0.05,0.6608643457382953,0.6205312428502937,3.5162482261657715,0.6205312428502937
34,1,Decision Tree,1,0.05,0.5546218487394958,0.5528795685597785,0.07140707969665527,0.5528795685597785
35,1,RandomForest,1,0.05,0.65906362545018,0.6350986700347095,0.36760830879211426,0.6350986700347095
36,1,AdaBoost (Discrete),1,0.05,0.617046818727491,0.6107899973545184,24.034697771072388,0.6107899973545184
37,1,AdaBoost (Real),1,0.05,0.5840336134453782,0.5631404445050004,31.37373185157776,0.5631404445050004
38,1,Logistic Regression (Penalty = L2),1,0.05,0.6638655462184874,0.6587885401135637,0.10540175437927246,0.6587885401135637
39,1,Naive Bayes,1,0.05,0.6686674669867947,0.6471858181031345,0.029244184494018555,0.6471858181031345
40,1,KNeighbors Classifier,2,0.05,0.5990396158463386,0.5929450220845852,0.10961389541625977,0.5929450220845852
41,1,SVC Classifier,2,0.05,0.6554621848739496,0.611726510880775,3.2186505794525146,0.611726510880775
42,1,Decision Tree,2,0.05,0.5384153661464586,0.5361046144692562,0.10546994209289551,0.5361046144692562
43,1,RandomForest,2,0.05,0.641656662665066,0.614092140126002,0.3605959415435791,0.614092140126002
44,1,AdaBoost (Discrete),2,0.05,0.5846338535414166,0.5813001917238473,23.50467538833618,0.5813001917238473
45,1,AdaBoost (Real),2,0.05,0.5540216086434574,0.5444283292154571,31.04316544532776,0.5444283292154571
46,1,Logistic Regression (Penalty = L2),2,0.05,0.6728691476590636,0.6672050931458331,0.054390668869018555,0.6672050931458331
47,1,Naive Bayes,2,0.05,0.6626650660264105,0.6395481485252967,0.036531686782836914,0.6395481485252967
48,2,KNeighbors Classifier,0,0.05,0.49640287769784175,0.47137485683240904,0.06742095947265625,0.47137485683240904
49,2,SVC Classifier,0,0.05,0.5323741007194245,0.27836933114478624,2.709951162338257,0.27836933114478624
50,2,Decision Tree,0,0.05,0.4394484412470024,0.4347403584919796,0.02137470245361328,0.4347403584919796
51,2,RandomForest,0,0.05,0.5545563549160671,0.5211322895803869,0.08174848556518555,0.5211322895803869
52,2,AdaBoost (Discrete),0,0.05,0.511990407673861,0.4814234053527083,21.198248863220215,0.4814234053527083
53,2,AdaBoost (Real),0,0.05,0.4556354916067146,0.4496890996179696,30.496197938919067,0.4496890996179696
54,2,Logistic Regression (Penalty = L2),0,0.05,0.5419664268585132,0.5181913158722992,0.09949350357055664,0.5181913158722992
55,2,Naive Bayes,0,0.05,0.5509592326139089,0.5171174670331723,0.03797507286071777,0.5171174670331723
56,2,KNeighbors Classifier,1,0.05,0.5024009603841537,0.47534133993010474,0.10770511627197266,0.47534133993010474
57,2,SVC Classifier,1,0.05,0.531812725090036,0.26466304003942237,3.9914979934692383,0.26466304003942237
58,2,Decision Tree,1,0.05,0.4597839135654262,0.45568062293157124,0.10949182510375977,0.45568062293157124
59,2,RandomForest,1,0.05,0.556422569027611,0.5252050993561775,0.3591129779815674,0.5252050993561775
60,2,AdaBoost (Discrete),1,0.05,0.5486194477791116,0.5152573987896646,23.263507604599,0.5152573987896646
61,2,AdaBoost (Real),1,0.05,0.46758703481392555,0.4205142711487966,30.777438640594482,0.4205142711487966
62,2,Logistic Regression (Penalty = L2),1,0.05,0.5624249699879952,0.539722126469251,0.11439037322998047,0.539722126469251
63,2,Naive Bayes,1,0.05,0.56062424969988,0.5295239186459124,0.06986093521118164,0.5295239186459124
64,2,KNeighbors Classifier,2,0.05,0.47959183673469385,0.44930188357916273,0.10993099212646484,0.44930188357916273
65,2,SVC Classifier,2,0.05,0.536014405762305,0.21646394079207726,3.847801923751831,0.21646394079207726
66,2,Decision Tree,2,0.05,0.47839135654261705,0.47375226756352484,0.1062164306640625,0.47375226756352484
67,2,RandomForest,2,0.05,0.5600240096038416,0.5176949779459817,0.32691431045532227,0.5176949779459817
68,2,AdaBoost (Discrete),2,0.05,0.5264105642256903,0.49628995427330425,23.5555100440979,0.49628995427330425
69,2,AdaBoost (Real),2,0.05,0.4699879951980792,0.46486901709770945,30.89203667640686,0.46486901709770945
70,2,Logistic Regression (Penalty = L2),2,0.05,0.578031212484994,0.5584362706015041,0.11059284210205078,0.5584362706015041
71,2,Naive Bayes,2,0.05,0.5732292917166867,0.5453047591623291,0.04113054275512695,0.5453047591623291
72,3,KNeighbors Classifier,0,0.05,0.632494004796163,0.6302008509466048,0.0833749771118164,0.6302008509466048
73,3,SVC Classifier,0,0.05,0.6912470023980816,0.6737205114411857,3.149855375289917,0.6737205114411857
74,3,Decision Tree,0,0.05,0.5851318944844125,0.5851625285134341,0.0721902847290039,0.5851625285134341
75,3,RandomForest,0,0.05,0.6774580335731415,0.6658340722997673,0.3501319885253906,0.6658340722997673
76,3,AdaBoost (Discrete),0,0.05,0.6336930455635491,0.6168473428866735,23.600817441940308,0.6168473428866735
77,3,AdaBoost (Real),0,0.05,0.5869304556354916,0.5786301723858802,31.270755290985107,0.5786301723858802
78,3,Logistic Regression (Penalty = L2),0,0.05,0.697841726618705,0.695426558470332,0.11685585975646973,0.695426558470332
79,3,Naive Bayes,0,0.05,0.6966426858513189,0.6839798939101975,0.03579902648925781,0.6839798939101975
80,3,KNeighbors Classifier,1,0.05,0.6368547418967587,0.6351949739870126,0.12073230743408203,0.6351949739870126
81,3,SVC Classifier,1,0.05,0.6890756302521008,0.6748902743333239,3.1930365562438965,0.6748902743333239
82,3,Decision Tree,1,0.05,0.5918367346938775,0.5908333646026168,0.07265448570251465,0.5908333646026168
83,3,RandomForest,1,0.05,0.6584633853541416,0.6476142143488177,0.3901078701019287,0.6476142143488177
84,3,AdaBoost (Discrete),1,0.05,0.631452581032413,0.6287308331174426,23.88331890106201,0.6287308331174426
85,3,AdaBoost (Real),1,0.05,0.5786314525810324,0.5678467647820422,31.25451397895813,0.5678467647820422
86,3,Logistic Regression (Penalty = L2),1,0.05,0.6986794717887155,0.697187062935979,0.10767793655395508,0.697187062935979
87,3,Naive Bayes,1,0.05,0.6938775510204082,0.6851202651495819,0.06978106498718262,0.6851202651495819
88,3,KNeighbors Classifier,2,0.05,0.6242496998799519,0.622211837340214,0.15621709823608398,0.622211837340214
89,3,SVC Classifier,2,0.05,0.6860744297719088,0.6639571041107692,3.2131896018981934,0.6639571041107692
90,3,Decision Tree,2,0.05,0.5828331332533013,0.5814441877063239,0.09759211540222168,0.5814441877063239
91,3,RandomForest,2,0.05,0.6812725090036015,0.6627366900903526,0.3203105926513672,0.6627366900903526
92,3,AdaBoost (Discrete),2,0.05,0.6446578631452581,0.6423863098861464,23.536991596221924,0.6423863098861464
93,3,AdaBoost (Real),2,0.05,0.6044417767106842,0.5978640352516541,31.640886306762695,0.5978640352516541
94,3,Logistic Regression (Penalty = L2),2,0.05,0.7064825930372148,0.7030490418849231,0.1419661045074463,0.7030490418849231
95,3,Naive Bayes,2,0.05,0.6908763505402161,0.6783835522348852,0.06542706489562988,0.6783835522348852
96,6,KNeighbors Classifier,0,0.05,0.4934052757793765,0.4784578315538848,0.07527780532836914,0.4784578315538848
97,6,SVC Classifier,0,0.05,0.5335731414868106,0.2282866146784906,3.563261032104492,0.2282866146784906
98,6,Decision Tree,0,0.05,0.49640287769784175,0.48386824858162814,0.03728318214416504,0.48386824858162814
99,6,RandomForest,0,0.05,0.5575539568345323,0.8318113502977599,0.2906162738800049,0.0
100,6,AdaBoost (Discrete),0,0.05,0.5431654676258992,0.4395274245424783,23.260770320892334,0.4395274245424783
101,6,AdaBoost (Real),0,0.05,0.5185851318944844,0.47183393194030415,37.90484356880188,0.47183393194030415
102,6,Logistic Regression (Penalty = L2),0,0.05,0.5497601918465228,0.4276216972309869,0.34278035163879395,0.4276216972309869
103,6,Naive Bayes,0,0.05,0.5479616306954437,0.39394725309539674,0.09254956245422363,0.39394725309539674
104,6,KNeighbors Classifier,1,0.05,0.4849939975990396,0.47447630160822507,0.1298680305480957,0.47447630160822507
105,6,SVC Classifier,1,0.05,0.5168067226890757,0.12699656235827986,4.987068176269531,0.12699656235827986
106,6,Decision Tree,1,0.05,0.49339735894357745,0.4798566291102616,0.09573078155517578,0.4798566291102616
107,6,RandomForest,1,0.05,0.5516206482593037,0.8235613519645829,0.4782378673553467,0.0
108,6,AdaBoost (Discrete),1,0.05,0.5444177671068428,0.4508102245556847,28.242858409881592,0.4508102245556847
109,6,AdaBoost (Real),1,0.05,0.5234093637454982,0.47548747473259917,37.42857313156128,0.47548747473259917
110,6,Logistic Regression (Penalty = L2),1,0.05,0.5444177671068428,0.43284335691163467,0.26584792137145996,0.43284335691163467
111,6,Naive Bayes,1,0.05,0.5522208883553421,0.3918191923560974,0.10449361801147461,0.3918191923560974
112,6,KNeighbors Classifier,2,0.05,0.4837935174069628,0.4701668749027799,0.14202404022216797,0.4701668749027799
113,6,SVC Classifier,2,0.05,0.5060024009603842,0.7316433825613841,5.664371967315674,0.0
114,6,Decision Tree,2,0.05,0.48139255702280914,0.4642085048331944,0.08992290496826172,0.4642085048331944
115,6,RandomForest,2,0.05,0.5618247298919568,0.8382104970538404,0.4238932132720947,0.0
116,6,AdaBoost (Discrete),2,0.05,0.5666266506602641,0.45693605643856944,28.08862018585205,0.45693605643856944
117,6,AdaBoost (Real),2,0.05,0.524609843937575,0.46518878283533754,38.719918966293335,0.46518878283533754
118,6,Logistic Regression (Penalty = L2),2,0.05,0.5630252100840336,0.45338789878569297,0.18966197967529297,0.45338789878569297
119,6,Naive Bayes,2,0.05,0.556422569027611,0.33301358200140463,0.07380914688110352,0.33301358200140463
120,7,KNeighbors Classifier,0,0.05,0.4826139088729017,0.45425961994075775,0.10196971893310547,0.45425961994075775
121,7,SVC Classifier,0,0.05,0.5167865707434053,0.7589427487030355,5.25557804107666,0.0
122,7,Decision Tree,0,0.05,0.4844124700239808,0.4559627110416573,0.10290026664733887,0.4559627110416573
123,7,RandomForest,0,0.05,0.5245803357314148,0.44671705458451894,0.4651966094970703,0.44671705458451894
124,7,AdaBoost (Discrete),0,0.05,0.5227817745803357,0.4716437729961861,30.064854621887207,0.4716437729961861
125,7,AdaBoost (Real),0,0.05,0.4766187050359712,0.4556013800272951,39.08777379989624,0.4556013800272951
126,7,Logistic Regression (Penalty = L2),0,0.05,0.5173860911270983,0.35681756460567565,0.16941475868225098,0.35681756460567565
127,7,Naive Bayes,0,0.05,0.5251798561151079,0.4761715429564123,0.09318161010742188,0.4761715429564123
128,7,KNeighbors Classifier,1,0.05,0.4897959183673469,0.45346637781037535,0.10721230506896973,0.45346637781037535
129,7,SVC Classifier,1,0.05,0.5186074429771909,0.7627333847662722,4.834126234054565,0.0
130,7,Decision Tree,1,0.05,0.4963985594237695,0.4591794111092517,0.0534672737121582,0.4591794111092517
131,7,RandomForest,1,0.05,0.5192076830732293,0.375355843491531,0.4758927822113037,0.375355843491531
132,7,AdaBoost (Discrete),1,0.05,0.5264105642256903,0.48531259451354225,27.661945819854736,0.48531259451354225
133,7,AdaBoost (Real),1,0.05,0.4963985594237695,0.449797099408295,39.11052680015564,0.449797099408295
134,7,Logistic Regression (Penalty = L2),1,0.05,0.5048019207683073,0.38323473850372086,0.15764641761779785,0.38323473850372086
135,7,Naive Bayes,1,0.05,0.514405762304922,0.7631368406975629,0.09550166130065918,0.0
136,7,KNeighbors Classifier,2,0.05,0.47418967587034816,0.45206226715207426,0.15969252586364746,0.45206226715207426
137,7,SVC Classifier,2,0.05,0.5192076830732293,0.7631830564033252,5.626368284225464,0.0
138,7,Decision Tree,2,0.05,0.49459783913565425,0.4651058588258725,0.10524821281433105,0.4651058588258725
139,7,RandomForest,2,0.05,0.5132052821128451,0.767116570984179,0.46819376945495605,0.0
140,7,AdaBoost (Discrete),2,0.05,0.5210084033613446,0.4652484201747655,30.3216552734375,0.4652484201747655
141,7,AdaBoost (Real),2,0.05,0.4639855942376951,0.4440711359427012,41.12314438819885,0.4440711359427012
142,7,Logistic Regression (Penalty = L2),2,0.05,0.5186074429771909,0.4711958544777449,0.18031692504882812,0.4711958544777449
143,7,Naive Bayes,2,0.05,0.5210084033613446,0.4181905928142238,0.08392763137817383,0.4181905928142238
144,8,KNeighbors Classifier,0,0.05,0.4826139088729017,0.45425961994075775,0.14418530464172363,0.45425961994075775
145,8,SVC Classifier,0,0.05,0.5167865707434053,0.7589427487030355,4.736538887023926,0.0
146,8,Decision Tree,0,0.05,0.4844124700239808,0.4559627110416573,0.09544086456298828,0.4559627110416573
147,8,RandomForest,0,0.05,0.5245803357314148,0.44671705458451894,0.4276309013366699,0.44671705458451894
148,8,AdaBoost (Discrete),0,0.05,0.5227817745803357,0.4716437729961861,27.645975589752197,0.4716437729961861
149,8,AdaBoost (Real),0,0.05,0.4766187050359712,0.4556013800272951,38.738091468811035,0.4556013800272951
150,8,Logistic Regression (Penalty = L2),0,0.05,0.5173860911270983,0.35681756460567565,0.1916337013244629,0.35681756460567565
151,8,Naive Bayes,0,0.05,0.5251798561151079,0.4761715429564123,0.04890298843383789,0.4761715429564123
152,8,KNeighbors Classifier,1,0.05,0.4897959183673469,0.45346637781037535,0.13872551918029785,0.45346637781037535
153,8,SVC Classifier,1,0.05,0.5186074429771909,0.7627333847662722,5.333126783370972,0.0
154,8,Decision Tree,1,0.05,0.4963985594237695,0.4591794111092517,0.0999455451965332,0.4591794111092517
155,8,RandomForest,1,0.05,0.5192076830732293,0.375355843491531,0.4182882308959961,0.375355843491531
156,8,AdaBoost (Discrete),1,0.05,0.5264105642256903,0.48531259451354225,27.70239567756653,0.48531259451354225
157,8,AdaBoost (Real),1,0.05,0.4963985594237695,0.449797099408295,39.017566442489624,0.449797099408295
158,8,Logistic Regression (Penalty = L2),1,0.05,0.5048019207683073,0.38323473850372086,0.3529701232910156,0.38323473850372086
159,8,Naive Bayes,1,0.05,0.514405762304922,0.7631368406975629,0.05107927322387695,0.0
160,8,KNeighbors Classifier,2,0.05,0.47418967587034816,0.45206226715207426,0.10913825035095215,0.45206226715207426
161,8,SVC Classifier,2,0.05,0.5192076830732293,0.7631830564033252,5.987907648086548,0.0
162,8,Decision Tree,2,0.05,0.49459783913565425,0.4651058588258725,0.055765628814697266,0.4651058588258725
163,8,RandomForest,2,0.05,0.5132052821128451,0.767116570984179,0.47112011909484863,0.0
164,8,AdaBoost (Discrete),2,0.05,0.5210084033613446,0.4652484201747655,30.284980058670044,0.4652484201747655
165,8,AdaBoost (Real),2,0.05,0.4639855942376951,0.4440711359427012,41.22483730316162,0.4440711359427012
166,8,Logistic Regression (Penalty = L2),2,0.05,0.5186074429771909,0.4711958544777449,0.17374610900878906,0.4711958544777449
167,8,Naive Bayes,2,0.05,0.5210084033613446,0.4181905928142238,0.10176682472229004,0.4181905928142238
168,9,KNeighbors Classifier,0,0.05,0.4826139088729017,0.45425961994075775,0.15074729919433594,0.45425961994075775
169,9,SVC Classifier,0,0.05,0.5167865707434053,0.7589427487030355,5.229485988616943,0.0
170,9,Decision Tree,0,0.05,0.4844124700239808,0.4559627110416573,0.053656578063964844,0.4559627110416573
171,9,RandomForest,0,0.05,0.5245803357314148,0.44671705458451894,0.48046445846557617,0.44671705458451894
172,9,AdaBoost (Discrete),0,0.05,0.5227817745803357,0.4716437729961861,29.881712198257446,0.4716437729961861
173,9,AdaBoost (Real),0,0.05,0.4766187050359712,0.4556013800272951,51.77018404006958,0.4556013800272951
174,9,Logistic Regression (Penalty = L2),0,0.05,0.5173860911270983,0.35681756460567565,0.21796083450317383,0.35681756460567565
175,9,Naive Bayes,0,0.05,0.5251798561151079,0.4761715429564123,0.06832361221313477,0.4761715429564123
176,9,KNeighbors Classifier,1,0.05,0.4897959183673469,0.45346637781037535,0.1392228603363037,0.45346637781037535
177,9,SVC Classifier,1,0.05,0.5186074429771909,0.7627333847662722,6.414831876754761,0.0
178,9,Decision Tree,1,0.05,0.4963985594237695,0.4591794111092517,0.134688138961792,0.4591794111092517
179,9,RandomForest,1,0.05,0.5192076830732293,0.375355843491531,0.54166579246521,0.375355843491531
180,9,AdaBoost (Discrete),1,0.05,0.5264105642256903,0.48531259451354225,39.39048624038696,0.48531259451354225
181,9,AdaBoost (Real),1,0.05,0.4963985594237695,0.449797099408295,53.61955499649048,0.449797099408295
182,9,Logistic Regression (Penalty = L2),1,0.05,0.5048019207683073,0.38323473850372086,0.19780468940734863,0.38323473850372086
183,9,Naive Bayes,1,0.05,0.514405762304922,0.7631368406975629,0.06433987617492676,0.0
184,9,KNeighbors Classifier,2,0.05,0.47418967587034816,0.45206226715207426,0.199998140335083,0.45206226715207426
185,9,SVC Classifier,2,0.05,0.5192076830732293,0.7631830564033252,7.3180108070373535,0.0
186,9,Decision Tree,2,0.05,0.49459783913565425,0.4651058588258725,0.1320798397064209,0.4651058588258725
187,9,RandomForest,2,0.05,0.5132052821128451,0.767116570984179,0.6853070259094238,0.0
188,9,AdaBoost (Discrete),2,0.05,0.5210084033613446,0.4652484201747655,38.712599992752075,0.4652484201747655
189,9,AdaBoost (Real),2,0.05,0.4639855942376951,0.4440711359427012,50.99096655845642,0.4440711359427012
190,9,Logistic Regression (Penalty = L2),2,0.05,0.5186074429771909,0.4711958544777449,0.2544221878051758,0.4711958544777449
191,9,Naive Bayes,2,0.05,0.5210084033613446,0.4181905928142238,0.059121131896972656,0.4181905928142238
192,10,KNeighbors Classifier,0,0.05,0.632494004796163,0.6302008509466048,0.1980745792388916,0.6302008509466048
193,10,SVC Classifier,0,0.05,0.6912470023980816,0.6737205114411857,5.381087303161621,0.6737205114411857
194,10,Decision Tree,0,0.05,0.605515587529976,0.6042628589169707,0.07099056243896484,0.6042628589169707
195,10,RandomForest,0,0.05,0.6792565947242206,0.6636891530544541,0.5862064361572266,0.6636891530544541
196,10,AdaBoost (Discrete),0,0.05,0.6336930455635491,0.6168473428866735,42.069960832595825,0.6168473428866735
197,10,AdaBoost (Real),0,0.05,0.5869304556354916,0.5786301723858802,56.396395444869995,0.5786301723858802
198,10,Logistic Regression (Penalty = L2),0,0.05,0.697841726618705,0.695426558470332,0.17886066436767578,0.695426558470332
199,10,Naive Bayes,0,0.05,0.6966426858513189,0.6839798939101975,0.12720131874084473,0.6839798939101975
200,10,KNeighbors Classifier,1,0.05,0.6368547418967587,0.6351949739870126,0.2545158863067627,0.6351949739870126
201,10,SVC Classifier,1,0.05,0.6890756302521008,0.6748902743333239,5.693209648132324,0.6748902743333239
202,10,Decision Tree,1,0.05,0.6050420168067226,0.604142513134639,0.12665891647338867,0.604142513134639
203,10,RandomForest,1,0.05,0.6698679471788715,0.6579181765769448,0.6745197772979736,0.6579181765769448
204,10,AdaBoost (Discrete),1,0.05,0.631452581032413,0.6287308331174426,42.1249635219574,0.6287308331174426
205,10,AdaBoost (Real),1,0.05,0.5768307322929171,0.5659142597335758,55.622174978256226,0.5659142597335758
206,10,Logistic Regression (Penalty = L2),1,0.05,0.6986794717887155,0.697187062935979,0.19249534606933594,0.697187062935979
207,10,Naive Bayes,1,0.05,0.6938775510204082,0.6851202651495819,0.06862926483154297,0.6851202651495819
208,10,KNeighbors Classifier,2,0.05,0.6242496998799519,0.622211837340214,0.25454187393188477,0.622211837340214
209,10,SVC Classifier,2,0.05,0.6860744297719088,0.6639571041107692,5.710249662399292,0.6639571041107692
210,10,Decision Tree,2,0.05,0.6008403361344538,0.5991530446057097,0.18548870086669922,0.5991530446057097
211,10,RandomForest,2,0.05,0.6578631452581032,0.6357961409200241,0.704463005065918,0.6357961409200241
212,10,AdaBoost (Discrete),2,0.05,0.6446578631452581,0.6423863098861464,42.10532546043396,0.6423863098861464
213,10,AdaBoost (Real),2,0.05,0.6050420168067226,0.5983812189310515,55.607216358184814,0.5983812189310515
214,10,Logistic Regression (Penalty = L2),2,0.05,0.7064825930372148,0.7030490418849231,0.18866610527038574,0.7030490418849231
215,10,Naive Bayes,2,0.05,0.6908763505402161,0.6783835522348852,0.11011052131652832,0.6783835522348852
216,11,KNeighbors Classifier,0,0.05,0.7284172661870504,0.7270535554535618,0.5755124092102051,0.7270535554535618
217,11,SVC Classifier,0,0.05,0.7553956834532374,0.7363345817297827,5.923261880874634,0.7363345817297827
218,11,Decision Tree,0,0.05,0.6906474820143885,0.6894484017790377,0.19869351387023926,0.6894484017790377
219,11,RandomForest,0,0.05,0.685251798561151,0.6069996203112465,0.6977436542510986,0.6069996203112465
220,11,AdaBoost (Discrete),0,0.05,0.7092326139088729,0.7052501992898365,58.25224995613098,0.7052501992898365
221,11,AdaBoost (Real),0,0.05,0.7074340527577938,0.7058338766517139,70.63500666618347,0.7058338766517139
222,11,Logistic Regression (Penalty = L2),0,0.05,0.7745803357314148,0.7725751905011169,0.3463730812072754,0.7725751905011169
223,11,Naive Bayes,0,0.05,0.7559952038369304,0.7442460067842225,0.16274690628051758,0.7442460067842225
224,11,KNeighbors Classifier,1,0.05,0.7256902761104442,0.7230378182681503,0.6465530395507812,0.7230378182681503
225,11,SVC Classifier,1,0.05,0.7388955582232893,0.7202079510078983,5.90539813041687,0.7202079510078983
226,11,Decision Tree,1,0.05,0.6800720288115246,0.6791452960965161,0.1876051425933838,0.6791452960965161
227,11,RandomForest,1,0.05,0.6836734693877551,0.6271216837105535,0.6857583522796631,0.6271216837105535
228,11,AdaBoost (Discrete),1,0.05,0.698079231692677,0.692390944313458,58.0077919960022,0.692390944313458
229,11,AdaBoost (Real),1,0.05,0.7040816326530612,0.699887623790289,71.98155164718628,0.699887623790289
230,11,Logistic Regression (Penalty = L2),1,0.05,0.7623049219687875,0.7608782977100202,0.30709171295166016,0.7608782977100202
231,11,Naive Bayes,1,0.05,0.748499399759904,0.738619984698444,0.057993412017822266,0.738619984698444
232,11,KNeighbors Classifier,2,0.05,0.7154861944777912,0.7129971555328494,0.6524052619934082,0.7129971555328494
233,11,SVC Classifier,2,0.05,0.7400960384153662,0.7174721056162872,5.972609758377075,0.7174721056162872
234,11,Decision Tree,2,0.05,0.6764705882352942,0.6743185891501109,0.19524025917053223,0.6743185891501109
235,11,RandomForest,2,0.05,0.695078031212485,0.6252364537233249,0.643580436706543,0.6252364537233249
236,11,AdaBoost (Discrete),2,0.05,0.7028811524609844,0.699326433904344,57.79954671859741,0.699326433904344
237,11,AdaBoost (Real),2,0.05,0.6974789915966386,0.6913425252612565,68.27010369300842,0.6913425252612565
238,11,Logistic Regression (Penalty = L2),2,0.05,0.7797118847539015,0.7765477211179059,0.32044315338134766,0.7765477211179059
239,11,Naive Bayes,2,0.05,0.7509003601440576,0.7380919797864429,0.07448053359985352,0.7380919797864429
