,feat_set_id,classifier,fold_id,feat_th,score,geo_score,exec_t,geo_score_woz
0,0,KNeighbors Classifier,0,0.25,0.2002791346824843,0.24725841186399117,1.0265519618988037,0.0
1,0,SVC Classifier,0,0.25,0.1779483600837404,0.5558097562348633,18.463908433914185,0.0
2,0,Decision Tree,0,0.25,0.22051639916259597,0.3357870296740702,0.10603809356689453,0.0
3,0,RandomForest,0,0.25,0.2463363572923936,0.291997416880675,1.5439348220825195,0.0
4,0,AdaBoost (Discrete),0,0.25,0.18632240055826937,0.25501631996929014,97.13911056518555,0.0
5,0,AdaBoost (Real),0,0.25,0.1137473831123517,0.1370842745496556,462.20226979255676,0.0
6,0,Logistic Regression (Penalty = L2),0,0.25,0.23656664340544312,0.28155817924476495,8.159456491470337,0.0
7,0,Naive Bayes,0,0.25,0.06001395673412421,0.3245221995092096,0.975879430770874,0.0
8,0,KNeighbors Classifier,1,0.25,0.22433192686357242,0.28321223403739904,1.3640332221984863,0.0
9,0,SVC Classifier,1,0.25,0.1828410689170183,0.5991328754445572,18.244226217269897,0.0
10,0,Decision Tree,1,0.25,0.229957805907173,0.3389049529391865,0.2120976448059082,0.0
11,0,RandomForest,1,0.25,0.23277074542897327,0.30881320121035,1.0418829917907715,0.0
12,0,AdaBoost (Discrete),1,0.25,0.19549929676511954,0.11644682004892236,81.90891718864441,0.0
13,0,AdaBoost (Real),1,0.25,0.17580872011251758,0.1980801382623598,200.92064952850342,0.0
14,0,Logistic Regression (Penalty = L2),1,0.25,0.23417721518987342,0.2336760003945304,4.519416093826294,0.0
15,0,Naive Bayes,1,0.25,0.09634317862165963,0.40281277081998074,0.5824949741363525,0.0
16,0,KNeighbors Classifier,2,0.25,0.20538243626062322,0.35913154163067085,0.7487533092498779,0.0
17,0,SVC Classifier,2,0.25,0.19475920679886685,0.6422002450787708,15.159372329711914,0.0
18,0,Decision Tree,2,0.25,0.2245042492917847,0.33228434247834815,0.2358999252319336,0.0
19,0,RandomForest,2,0.25,0.25,0.3415874010310467,1.1675777435302734,0.0
20,0,AdaBoost (Discrete),2,0.25,0.14305949008498584,0.16731725523186688,86.20847225189209,0.0
21,0,AdaBoost (Real),2,0.25,0.10339943342776203,0.11283769976541708,238.92735481262207,0.0
22,0,Logistic Regression (Penalty = L2),2,0.25,0.24787535410764872,0.3621398489037245,4.556246519088745,0.0
23,0,Naive Bayes,2,0.25,0.08781869688385269,0.3708673146235978,0.5102202892303467,0.0
24,1,KNeighbors Classifier,0,0.25,0.21423586880669923,0.28138092669547143,0.5140056610107422,0.0
25,1,SVC Classifier,0,0.25,0.16050244242847173,1.0,17.00354766845703,0.0
26,1,Decision Tree,0,0.25,0.22051639916259597,0.3100784591477746,0.37180638313293457,0.0
27,1,RandomForest,0,0.25,0.23656664340544312,0.34194258476592393,1.35384202003479,0.0
28,1,AdaBoost (Discrete),0,0.25,0.20516399162595952,0.1952375357731136,104.32858467102051,0.0
29,1,AdaBoost (Real),0,0.25,0.20237264480111655,0.28376515074970676,239.77234530448914,0.0
30,1,Logistic Regression (Penalty = L2),0,0.25,0.23307745987438938,0.19606962715356901,4.923937797546387,0.0
31,1,Naive Bayes,0,0.25,0.20097697138869505,0.3824835408629704,0.5036046504974365,0.0
32,1,KNeighbors Classifier,1,0.25,0.24331926863572434,0.29413117060311655,0.6117844581604004,0.0
33,1,SVC Classifier,1,0.25,0.1617440225035162,1.0,16.460234880447388,0.0
34,1,Decision Tree,1,0.25,0.22292545710267228,0.3110106263558233,0.370267391204834,0.0
35,1,RandomForest,1,0.25,0.2510548523206751,0.29327129587409484,1.2622854709625244,0.0
36,1,AdaBoost (Discrete),1,0.25,0.1990154711673699,0.21933436197739664,121.50187587738037,0.0
37,1,AdaBoost (Real),1,0.25,0.1940928270042194,0.22792344630607195,286.7544615268707,0.0
38,1,Logistic Regression (Penalty = L2),1,0.25,0.24542897327707455,0.3166650872058335,5.990304946899414,0.0
39,1,Naive Bayes,1,0.25,0.2587904360056259,0.5773465115491684,0.6874241828918457,0.0
40,1,KNeighbors Classifier,2,0.25,0.2415014164305949,0.37397660312213576,0.8327820301055908,0.0
41,1,SVC Classifier,2,0.25,0.1621813031161473,1.0,19.792049646377563,0.0
42,1,Decision Tree,2,0.25,0.22521246458923513,0.32805766680596676,0.5493912696838379,0.0
43,1,RandomForest,2,0.25,0.2698300283286119,0.34023167093542317,1.7801742553710938,0.0
44,1,AdaBoost (Discrete),2,0.25,0.18342776203966005,0.16666903072683853,135.27882480621338,0.0
45,1,AdaBoost (Real),2,0.25,0.1565155807365439,0.23883861488690822,277.9589364528656,0.0
46,1,Logistic Regression (Penalty = L2),2,0.25,0.23796033994334279,0.24240845518489376,5.102161407470703,0.0
47,1,Naive Bayes,2,0.25,0.2719546742209632,0.5516141563781837,0.4989771842956543,0.0
48,2,KNeighbors Classifier,0,0.25,0.2044661549197488,0.314584197405077,0.6613922119140625,0.0
49,2,SVC Classifier,0,0.25,0.16050244242847173,1.0,17.519582509994507,0.0
50,2,Decision Tree,0,0.25,0.20237264480111655,0.2788188181081209,0.3777749538421631,0.0
51,2,RandomForest,0,0.25,0.21702721563154223,0.36111874783816533,1.2685770988464355,0.0
52,2,AdaBoost (Discrete),0,0.25,0.18353105373342637,0.17362137261547983,111.60538911819458,0.0
53,2,AdaBoost (Real),0,0.25,0.1479413817166783,0.19185957033174697,276.62352299690247,0.0
54,2,Logistic Regression (Penalty = L2),0,0.25,0.23726448011165388,0.2314061606071021,5.033374786376953,0.0
55,2,Naive Bayes,0,0.25,0.22191207257501744,0.3742649731478032,0.6987693309783936,0.0
56,2,KNeighbors Classifier,1,0.25,0.21448663853727146,0.3300842524361982,0.5528109073638916,0.0
57,2,SVC Classifier,1,0.25,0.1617440225035162,1.0,18.068806648254395,0.0
58,2,Decision Tree,1,0.25,0.19338959212376933,0.2671745258877831,0.5524725914001465,0.0
59,2,RandomForest,1,0.25,0.2616033755274262,0.2910706828620095,1.4333486557006836,0.0
60,2,AdaBoost (Discrete),1,0.25,0.17088607594936708,0.14442414001620488,119.88451480865479,0.0
61,2,AdaBoost (Real),1,0.25,0.2630098452883263,0.1870210248496086,303.3521776199341,0.0
62,2,Logistic Regression (Penalty = L2),1,0.25,0.23769338959212377,0.15382482714041204,6.040416717529297,0.0
63,2,Naive Bayes,1,0.25,0.27918424753867793,0.547184870803009,0.807318925857544,0.0
64,2,KNeighbors Classifier,2,0.25,0.23087818696883852,0.4070556783718847,0.8047828674316406,0.0
65,2,SVC Classifier,2,0.25,0.1621813031161473,1.0,22.20597505569458,0.0
66,2,Decision Tree,2,0.25,0.2103399433427762,0.3105299813326808,0.49149084091186523,0.0
67,2,RandomForest,2,0.25,0.26274787535410765,0.3082612059766299,1.616905927658081,0.0
68,2,AdaBoost (Discrete),2,0.25,0.18696883852691218,0.19070770176947982,143.1536717414856,0.0
69,2,AdaBoost (Real),2,0.25,0.24645892351274787,0.23268221862025942,266.18386125564575,0.0
70,2,Logistic Regression (Penalty = L2),2,0.25,0.24575070821529746,0.3724809899509621,6.495615482330322,0.0
71,2,Naive Bayes,2,0.25,0.26912181303116145,0.4552500397985456,0.669722318649292,0.0
72,3,KNeighbors Classifier,0,0.25,0.21423586880669923,0.29185429485599906,0.4941527843475342,0.0
73,3,SVC Classifier,0,0.25,0.16050244242847173,1.0,19.57033658027649,0.0
74,3,Decision Tree,0,0.25,0.2198185624563852,0.34765790303008515,0.32367610931396484,0.0
75,3,RandomForest,0,0.25,0.23447313328681088,0.27895610607479004,1.94631028175354,0.0
76,3,AdaBoost (Discrete),0,0.25,0.1688764829030007,0.20492884217791482,85.82827591896057,0.0
77,3,AdaBoost (Real),0,0.25,0.15701325889741802,0.1679521937782571,268.50961470603943,0.0
78,3,Logistic Regression (Penalty = L2),0,0.25,0.2274947662247034,0.2435869884677564,3.961026668548584,0.0
79,3,Naive Bayes,0,0.25,0.2449406838799721,0.39425783055700653,0.01094961166381836,0.0
80,3,KNeighbors Classifier,1,0.25,0.21378340365682139,0.2621346894449708,0.011574268341064453,0.0
81,3,SVC Classifier,1,0.25,0.1617440225035162,1.0,2.181544303894043,0.0
82,3,Decision Tree,1,0.25,0.24472573839662448,0.2891820304215893,0.06093931198120117,0.0
83,3,RandomForest,1,0.25,0.24331926863572434,0.213922202885528,1.0788524150848389,0.0
84,3,AdaBoost (Discrete),1,0.25,0.2060478199718706,0.1288554306798215,92.28427481651306,0.0
85,3,AdaBoost (Real),1,0.25,0.22925457102672292,0.2236480626605215,248.65864300727844,0.0
86,3,Logistic Regression (Penalty = L2),1,0.25,0.23417721518987342,0.22162512864590636,3.6228253841400146,0.0
87,3,Naive Bayes,1,0.25,0.2805907172995781,0.5105831687665247,0.5068709850311279,0.0
88,3,KNeighbors Classifier,2,0.25,0.22096317280453256,0.3029558721793172,0.599651575088501,0.0
89,3,SVC Classifier,2,0.25,0.1621813031161473,1.0,17.23264193534851,0.0
90,3,Decision Tree,2,0.25,0.21600566572237961,0.2813182068625159,0.1575944423675537,0.0
91,3,RandomForest,2,0.25,0.25991501416430596,0.4444884031336144,1.439605951309204,0.0
92,3,AdaBoost (Discrete),2,0.25,0.21246458923512748,0.28803174226478734,104.16630387306213,0.0
93,3,AdaBoost (Real),2,0.25,0.20042492917847027,0.21596777015230664,268.68646812438965,0.0
94,3,Logistic Regression (Penalty = L2),2,0.25,0.23725212464589235,0.30159776382289627,3.66403865814209,0.0
95,3,Naive Bayes,2,0.25,0.29674220963172804,0.5425511427483857,0.4587066173553467,0.0
96,4,KNeighbors Classifier,0,0.25,0.21423586880669923,0.29185429485599906,0.5999979972839355,0.0
97,4,SVC Classifier,0,0.25,0.16050244242847173,1.0,16.405513286590576,0.0
98,4,Decision Tree,0,0.25,0.2198185624563852,0.34765790303008515,0.2588682174682617,0.0
99,4,RandomForest,0,0.25,0.23447313328681088,0.27895610607479004,1.5159404277801514,0.0
100,4,AdaBoost (Discrete),0,0.25,0.1688764829030007,0.20492884217791482,105.56598496437073,0.0
101,4,AdaBoost (Real),0,0.25,0.15701325889741802,0.1679521937782571,269.2853579521179,0.0
102,4,Logistic Regression (Penalty = L2),0,0.25,0.2274947662247034,0.2435869884677564,4.314037084579468,0.0
103,4,Naive Bayes,0,0.25,0.2449406838799721,0.39425783055700653,0.6595566272735596,0.0
104,4,KNeighbors Classifier,1,0.25,0.21378340365682139,0.2621346894449708,0.3262317180633545,0.0
105,4,SVC Classifier,1,0.25,0.1617440225035162,1.0,18.605510234832764,0.0
106,4,Decision Tree,1,0.25,0.24472573839662448,0.2891820304215893,0.2995021343231201,0.0
107,4,RandomForest,1,0.25,0.24331926863572434,0.213922202885528,1.7564446926116943,0.0
108,4,AdaBoost (Discrete),1,0.25,0.2060478199718706,0.1288554306798215,103.48377394676208,0.0
109,4,AdaBoost (Real),1,0.25,0.22925457102672292,0.2236480626605215,278.48132157325745,0.0
110,4,Logistic Regression (Penalty = L2),1,0.25,0.23417721518987342,0.22162512864590636,3.9477736949920654,0.0
111,4,Naive Bayes,1,0.25,0.2805907172995781,0.5105831687665247,0.5085785388946533,0.0
112,4,KNeighbors Classifier,2,0.25,0.22096317280453256,0.3029558721793172,0.47538328170776367,0.0
113,4,SVC Classifier,2,0.25,0.1621813031161473,1.0,18.623998880386353,0.0
114,4,Decision Tree,2,0.25,0.21600566572237961,0.2813182068625159,0.2631340026855469,0.0
115,4,RandomForest,2,0.25,0.25991501416430596,0.4444884031336144,1.5941123962402344,0.0
116,4,AdaBoost (Discrete),2,0.25,0.21246458923512748,0.28803174226478734,109.66802024841309,0.0
117,4,AdaBoost (Real),2,0.25,0.20042492917847027,0.21596777015230664,282.8082664012909,0.0
118,4,Logistic Regression (Penalty = L2),2,0.25,0.23725212464589235,0.30159776382289627,3.903998851776123,0.0
119,4,Naive Bayes,2,0.25,0.29674220963172804,0.5425511427483857,0.45400333404541016,0.0
120,5,KNeighbors Classifier,0,0.25,0.21423586880669923,0.29185429485599906,0.5340831279754639,0.0
121,5,SVC Classifier,0,0.25,0.16050244242847173,1.0,19.460859298706055,0.0
122,5,Decision Tree,0,0.25,0.2198185624563852,0.34765790303008515,0.295640230178833,0.0
123,5,RandomForest,0,0.25,0.23447313328681088,0.27895610607479004,1.8241627216339111,0.0
124,5,AdaBoost (Discrete),0,0.25,0.1688764829030007,0.20492884217791482,102.68394637107849,0.0
125,5,AdaBoost (Real),0,0.25,0.15701325889741802,0.1679521937782571,268.7884531021118,0.0
126,5,Logistic Regression (Penalty = L2),0,0.25,0.2274947662247034,0.2435869884677564,3.5188300609588623,0.0
127,5,Naive Bayes,0,0.25,0.2449406838799721,0.39425783055700653,0.40548157691955566,0.0
128,5,KNeighbors Classifier,1,0.25,0.21378340365682139,0.2621346894449708,0.5584540367126465,0.0
129,5,SVC Classifier,1,0.25,0.1617440225035162,1.0,17.309977531433105,0.0
130,5,Decision Tree,1,0.25,0.24472573839662448,0.2891820304215893,0.2500169277191162,0.0
131,5,RandomForest,1,0.25,0.24331926863572434,0.213922202885528,1.5748322010040283,0.0
132,5,AdaBoost (Discrete),1,0.25,0.2060478199718706,0.1288554306798215,97.74631023406982,0.0
133,5,AdaBoost (Real),1,0.25,0.22925457102672292,0.2236480626605215,256.67209029197693,0.0
134,5,Logistic Regression (Penalty = L2),1,0.25,0.23417721518987342,0.22162512864590636,3.2039425373077393,0.0
135,5,Naive Bayes,1,0.25,0.2805907172995781,0.5105831687665247,0.545100212097168,0.0
136,5,KNeighbors Classifier,2,0.25,0.22096317280453256,0.3029558721793172,0.29047250747680664,0.0
137,5,SVC Classifier,2,0.25,0.1621813031161473,1.0,13.998713254928589,0.0
138,5,Decision Tree,2,0.25,0.21600566572237961,0.2813182068625159,0.12098312377929688,0.0
139,5,RandomForest,2,0.25,0.25991501416430596,0.4444884031336144,1.1239683628082275,0.0
140,5,AdaBoost (Discrete),2,0.25,0.21246458923512748,0.28803174226478734,85.28183579444885,0.0
141,5,AdaBoost (Real),2,0.25,0.20042492917847027,0.21596777015230664,236.83731079101562,0.0
142,5,Logistic Regression (Penalty = L2),2,0.25,0.23725212464589235,0.30159776382289627,3.103400945663452,0.0
143,5,Naive Bayes,2,0.25,0.29674220963172804,0.5425511427483857,0.36439967155456543,0.0
144,6,KNeighbors Classifier,0,0.25,0.21423586880669923,0.29185429485599906,0.4620068073272705,0.0
145,6,SVC Classifier,0,0.25,0.16050244242847173,1.0,15.247345924377441,0.0
146,6,Decision Tree,0,0.25,0.2198185624563852,0.34765790303008515,0.15938043594360352,0.0
147,6,RandomForest,0,0.25,0.23447313328681088,0.27895610607479004,1.7142701148986816,0.0
148,6,AdaBoost (Discrete),0,0.25,0.1688764829030007,0.20492884217791482,86.99911522865295,0.0
149,6,AdaBoost (Real),0,0.25,0.15701325889741802,0.1679521937782571,1298.2541661262512,0.0
150,6,Logistic Regression (Penalty = L2),0,0.25,0.2274947662247034,0.2435869884677564,1.5100126266479492,0.0
151,6,Naive Bayes,0,0.25,0.2449406838799721,0.39425783055700653,0.16257977485656738,0.0
152,6,KNeighbors Classifier,1,0.25,0.21378340365682139,0.2621346894449708,0.12212347984313965,0.0
153,6,SVC Classifier,1,0.25,0.1617440225035162,1.0,10.114124298095703,0.0
154,6,Decision Tree,1,0.25,0.24472573839662448,0.2891820304215893,0.21077346801757812,0.0
155,6,RandomForest,1,0.25,0.24331926863572434,0.213922202885528,1.2034533023834229,0.0
156,6,AdaBoost (Discrete),1,0.25,0.2060478199718706,0.1288554306798215,79.52838659286499,0.0
157,6,AdaBoost (Real),1,0.25,0.22925457102672292,0.2236480626605215,198.01174211502075,0.0
158,6,Logistic Regression (Penalty = L2),1,0.25,0.23417721518987342,0.22162512864590636,2.829606771469116,0.0
159,6,Naive Bayes,1,0.25,0.2805907172995781,0.5105831687665247,0.3172261714935303,0.0
160,6,KNeighbors Classifier,2,0.25,0.22096317280453256,0.3029558721793172,0.2703676223754883,0.0
161,6,SVC Classifier,2,0.25,0.1621813031161473,1.0,13.105779647827148,0.0
162,6,Decision Tree,2,0.25,0.21600566572237961,0.2813182068625159,0.10963129997253418,0.0
163,6,RandomForest,2,0.25,0.25991501416430596,0.4444884031336144,1.1380915641784668,0.0
164,6,AdaBoost (Discrete),2,0.25,0.21246458923512748,0.28803174226478734,75.47488069534302,0.0
165,6,AdaBoost (Real),2,0.25,0.20042492917847027,0.21596777015230664,186.76632928848267,0.0
166,6,Logistic Regression (Penalty = L2),2,0.25,0.23725212464589235,0.30159776382289627,2.563197135925293,0.0
167,6,Naive Bayes,2,0.25,0.29674220963172804,0.5425511427483857,0.38350605964660645,0.0
168,7,KNeighbors Classifier,0,0.25,0.21004884856943476,0.3076635320003892,1.2152256965637207,0.0
169,7,SVC Classifier,0,0.25,0.1884159106769016,0.3832961993491341,15.455709218978882,0.0
170,7,Decision Tree,0,0.25,0.22051639916259597,0.31041045343407475,0.32200026512145996,0.0
171,7,RandomForest,0,0.25,0.23307745987438938,0.31193776202979584,1.047386884689331,0.0
172,7,AdaBoost (Discrete),0,0.25,0.18911374738311235,0.23341859489128247,98.76078963279724,0.0
173,7,AdaBoost (Real),0,0.25,0.19539427773900908,0.16570069352344083,205.10829639434814,0.0
174,7,Logistic Regression (Penalty = L2),0,0.25,0.24075366364270762,0.22412645812621393,5.567931413650513,0.0
175,7,Naive Bayes,0,0.25,0.09351011863224006,0.39286735532461226,0.3858833312988281,0.0
176,7,KNeighbors Classifier,1,0.25,0.22292545710267228,0.3531045651440139,0.9357192516326904,0.0
177,7,SVC Classifier,1,0.25,0.19690576652601968,0.3696370416487819,14.330808401107788,0.0
178,7,Decision Tree,1,0.25,0.22292545710267228,0.3269491451034328,0.2923319339752197,0.0
179,7,RandomForest,1,0.25,0.270042194092827,0.3155322060717759,1.0417628288269043,0.0
180,7,AdaBoost (Discrete),1,0.25,0.19127988748241911,0.24371239984116025,91.85068368911743,0.0
181,7,AdaBoost (Real),1,0.25,0.24824191279887484,0.2739889163044151,202.76305532455444,0.0
182,7,Logistic Regression (Penalty = L2),1,0.25,0.24824191279887484,0.21203460057269588,5.8931803703308105,0.0
183,7,Naive Bayes,1,0.25,0.11954992967651196,0.3460439215212986,0.5333559513092041,0.0
184,7,KNeighbors Classifier,2,0.25,0.2415014164305949,0.3471840695710379,1.0992274284362793,0.0
185,7,SVC Classifier,2,0.25,0.20184135977337112,0.3170166173901011,13.340912103652954,0.0
186,7,Decision Tree,2,0.25,0.21813031161473087,0.3494546147757002,0.27259016036987305,0.0
187,7,RandomForest,2,0.25,0.26558073654390935,0.2991527816566136,0.9217362403869629,0.0
188,7,AdaBoost (Discrete),2,0.25,0.2358356940509915,0.25678640479440573,93.71624159812927,0.0
189,7,AdaBoost (Real),2,0.25,0.23796033994334279,0.3687361373187293,187.45466566085815,0.0
190,7,Logistic Regression (Penalty = L2),2,0.25,0.2415014164305949,0.18327167883265122,5.688119649887085,0.0
191,7,Naive Bayes,2,0.25,0.10410764872521247,0.43901869175435054,0.5452909469604492,0.0
192,8,KNeighbors Classifier,0,0.25,0.21423586880669923,0.29185429485599906,0.30463504791259766,0.0
193,8,SVC Classifier,0,0.25,0.16050244242847173,1.0,10.985677480697632,0.0
194,8,Decision Tree,0,0.25,0.2198185624563852,0.34765790303008515,0.17941522598266602,0.0
195,8,RandomForest,0,0.25,0.23447313328681088,0.27895610607479004,0.922771692276001,0.0
196,8,AdaBoost (Discrete),0,0.25,0.1688764829030007,0.20492884217791482,59.93839478492737,0.0
197,8,AdaBoost (Real),0,0.25,0.15701325889741802,0.1679521937782571,154.390878200531,0.0
198,8,Logistic Regression (Penalty = L2),0,0.25,0.2274947662247034,0.2435869884677564,2.4448962211608887,0.0
199,8,Naive Bayes,0,0.25,0.2449406838799721,0.39425783055700653,0.3533482551574707,0.0
200,8,KNeighbors Classifier,1,0.25,0.21378340365682139,0.2621346894449708,0.3464834690093994,0.0
201,8,SVC Classifier,1,0.25,0.1617440225035162,1.0,10.35940933227539,0.0
202,8,Decision Tree,1,0.25,0.24472573839662448,0.2891820304215893,0.08973813056945801,0.0
203,8,RandomForest,1,0.25,0.24331926863572434,0.213922202885528,0.8868992328643799,0.0
204,8,AdaBoost (Discrete),1,0.25,0.2060478199718706,0.1288554306798215,62.108771324157715,0.0
205,8,AdaBoost (Real),1,0.25,0.22925457102672292,0.2236480626605215,159.75335693359375,0.0
206,8,Logistic Regression (Penalty = L2),1,0.25,0.23417721518987342,0.22162512864590636,2.1848292350769043,0.0
207,8,Naive Bayes,1,0.25,0.2805907172995781,0.5105831687665247,0.24084234237670898,0.0
208,8,KNeighbors Classifier,2,0.25,0.22096317280453256,0.3029558721793172,0.24694466590881348,0.0
209,8,SVC Classifier,2,0.25,0.1621813031161473,1.0,9.627212285995483,0.0
210,8,Decision Tree,2,0.25,0.21600566572237961,0.2813182068625159,0.2329552173614502,0.0
211,8,RandomForest,2,0.25,0.25991501416430596,0.4444884031336144,0.7192456722259521,0.0
212,8,AdaBoost (Discrete),2,0.25,0.21246458923512748,0.28803174226478734,55.323631286621094,0.0
213,8,AdaBoost (Real),2,0.25,0.20042492917847027,0.21596777015230664,136.51968050003052,0.0
214,8,Logistic Regression (Penalty = L2),2,0.25,0.23725212464589235,0.30159776382289627,1.923631191253662,0.0
215,8,Naive Bayes,2,0.25,0.29674220963172804,0.5425511427483857,0.254044771194458,0.0
