,feat_set_id,classifier,fold_id,feat_th,score,geo_score,exec_t,geo_score_woz
0,0,KNeighbors Classifier,0,0.5,0.5464557468962755,0.5396339273185488,2.7146947383880615,0.5396339273185488
1,0,SVC Classifier,0,0.5,0.55126151381658,1.0,51.83160924911499,0.0
2,0,Decision Tree,0,0.5,0.5306367641169403,0.533442227385586,0.28191614151000977,0.533442227385586
3,0,RandomForest,0,0.5,0.5714857829395275,0.5502892395811022,0.7051222324371338,0.5502892395811022
4,0,AdaBoost (Discrete),0,0.5,0.5250300360432519,0.4927265038300941,81.75443196296692,0.4927265038300941
5,0,AdaBoost (Real),0,0.5,0.5728874649579495,0.5594676436288684,124.45015239715576,0.5594676436288684
6,0,Logistic Regression (Penalty = L2),0,0.5,0.5196235482579095,0.45855010937828783,0.47098636627197266,0.45855010937828783
7,0,Naive Bayes,0,0.5,0.4525430516619944,0.08307563982562723,0.19971132278442383,0.08307563982562723
8,0,KNeighbors Classifier,1,0.5,0.4726617264169838,0.4729729778561734,4.846294641494751,0.4729729778561734
9,0,SVC Classifier,1,0.5,0.5509713599038654,0.9996366279069767,56.373958110809326,0.0
10,0,Decision Tree,1,0.5,0.4880833166433006,0.49011309243224055,0.2869272232055664,0.49011309243224055
11,0,RandomForest,1,0.5,0.45063088323653117,0.44542500250082334,0.676055908203125,0.44542500250082334
12,0,AdaBoost (Discrete),1,0.5,0.5071099539355097,0.5095193655427642,80.47021102905273,0.5095193655427642
13,0,AdaBoost (Real),1,0.5,0.509313038253555,0.5120011297397784,122.927481174469,0.5120011297397784
14,0,Logistic Regression (Penalty = L2),1,0.5,0.5351492088924494,0.48824676410574863,0.2734231948852539,0.48824676410574863
15,0,Naive Bayes,1,0.5,0.466052473462848,0.1767766952966369,0.13122773170471191,0.1767766952966369
16,0,KNeighbors Classifier,2,0.5,0.4764670538754256,0.4485092925396669,2.959688663482666,0.4485092925396669
17,0,SVC Classifier,2,0.5,0.551171640296415,1.0,58.32782745361328,0.0
18,0,Decision Tree,2,0.5,0.5587822952132986,0.5471300700224995,0.30341506004333496,0.5471300700224995
19,0,RandomForest,2,0.5,0.5874223913478871,0.34705834992318446,0.6977846622467041,0.34705834992318446
20,0,AdaBoost (Discrete),2,0.5,0.5417584618465853,0.5123689951329025,78.8922803401947,0.5123689951329025
21,0,AdaBoost (Real),2,0.5,0.5665932305227318,0.5316614754066504,90.0235526561737,0.5316614754066504
22,0,Logistic Regression (Penalty = L2),2,0.5,0.5269377127979171,0.31561823100019526,0.3635714054107666,0.31561823100019526
23,0,Naive Bayes,2,0.5,0.40737031844582416,0.06526941044097768,0.11918234825134277,0.06526941044097768
24,1,KNeighbors Classifier,0,0.5,0.5602723267921506,0.5529655047751709,1.7654061317443848,0.5529655047751709
25,1,SVC Classifier,0,0.5,0.55126151381658,1.0,60.104828119277954,0.0
26,1,Decision Tree,0,0.5,0.5314377252703244,0.5333053237225164,0.260847806930542,0.5333053237225164
27,1,RandomForest,0,0.5,0.6013215859030837,0.5963051265753263,0.6256551742553711,0.5963051265753263
28,1,AdaBoost (Discrete),0,0.5,0.5010012014417301,0.489353623731125,71.47214770317078,0.489353623731125
29,1,AdaBoost (Real),0,0.5,0.5460552663195835,0.547142238988684,82.50936794281006,0.547142238988684
30,1,Logistic Regression (Penalty = L2),0,0.5,0.55126151381658,1.0,0.1684718132019043,0.0
31,1,Naive Bayes,0,0.5,0.46395674809771725,0.20753187941884332,0.13129544258117676,0.20753187941884332
32,1,KNeighbors Classifier,1,0.5,0.4456238734227919,0.447829109881173,2.1352827548980713,0.447829109881173
33,1,SVC Classifier,1,0.5,0.551171640296415,1.0,56.16037178039551,0.0
34,1,Decision Tree,1,0.5,0.4782695774083717,0.4799906675215856,0.17792439460754395,0.4799906675215856
35,1,RandomForest,1,0.5,0.4614460244342079,0.45309367932838746,0.5442600250244141,0.45309367932838746
36,1,AdaBoost (Discrete),1,0.5,0.4696575205287402,0.4714437313253657,66.0456154346466,0.4714437313253657
37,1,AdaBoost (Real),1,0.5,0.46825555778089323,0.4707162576125058,80.91117906570435,0.4707162576125058
38,1,Logistic Regression (Penalty = L2),1,0.5,0.551171640296415,1.0,0.13312554359436035,0.0
39,1,Naive Bayes,1,0.5,0.5509713599038654,0.9996366279069767,0.04708695411682129,0.0
40,1,KNeighbors Classifier,2,0.5,0.549769677548568,0.5076662501419226,2.428802251815796,0.5076662501419226
41,1,SVC Classifier,2,0.5,0.551171640296415,1.0,38.55783724784851,0.0
42,1,Decision Tree,2,0.5,0.5281393951532145,0.4901898404897784,0.21589112281799316,0.4901898404897784
43,1,RandomForest,2,0.5,0.5934308031243741,0.4454308269152112,0.5746407508850098,0.4454308269152112
44,1,AdaBoost (Discrete),2,0.5,0.5067093931504105,0.4369953381831988,61.73532819747925,0.4369953381831988
45,1,AdaBoost (Real),2,0.5,0.5231323853394753,0.46457827125618734,77.44617009162903,0.46457827125618734
46,1,Logistic Regression (Penalty = L2),2,0.5,0.5738033246545163,0.3409391526752615,0.22130227088928223,0.3409391526752615
47,1,Naive Bayes,2,0.5,0.409773683156419,0.0887056031966386,0.14434480667114258,0.0887056031966386
48,2,KNeighbors Classifier,0,0.5,0.5210252302763316,0.5232644842916663,2.6723484992980957,0.5232644842916663
49,2,SVC Classifier,0,0.5,0.55126151381658,1.0,40.53619909286499,0.0
50,2,Decision Tree,0,0.5,0.513416099319183,0.5082673308042785,0.19464492797851562,0.5082673308042785
51,2,RandomForest,0,0.5,0.49899879855826995,0.4897229709504167,0.49394989013671875,0.4897229709504167
52,2,AdaBoost (Discrete),0,0.5,0.4955947136563877,0.49697303515288593,72.2838921546936,0.49697303515288593
53,2,AdaBoost (Real),0,0.5,0.513416099319183,0.509297144171394,100.82962822914124,0.509297144171394
54,2,Logistic Regression (Penalty = L2),0,0.5,0.513416099319183,0.4951317616701776,0.3562018871307373,0.4951317616701776
55,2,Naive Bayes,0,0.5,0.47577092511013214,0.25376546337240774,0.13207793235778809,0.25376546337240774
56,2,KNeighbors Classifier,1,0.5,0.4456238734227919,0.4425581546947611,4.145761489868164,0.4425581546947611
57,2,SVC Classifier,1,0.5,0.551171640296415,1.0,55.293415546417236,0.0
58,2,Decision Tree,1,0.5,0.4718606048467855,0.4740639623087682,0.33260178565979004,0.4740639623087682
59,2,RandomForest,1,0.5,0.5239335069096736,0.3628905467124315,0.6196691989898682,0.3628905467124315
60,2,AdaBoost (Discrete),1,0.5,0.5035049068696175,0.5042208766959997,80.51678919792175,0.5042208766959997
61,2,AdaBoost (Real),1,0.5,0.4902864009613459,0.48763481639865514,98.99069213867188,0.48763481639865514
62,2,Logistic Regression (Penalty = L2),1,0.5,0.5035049068696175,0.479715777575925,0.3248598575592041,0.479715777575925
63,2,Naive Bayes,1,0.5,0.4710594832765872,0.20083401685367297,0.14954829216003418,0.20083401685367297
64,2,KNeighbors Classifier,2,0.5,0.4562387342279191,0.4309228351406869,2.3484184741973877,0.4309228351406869
65,2,SVC Classifier,2,0.5,0.551171640296415,1.0,55.8857102394104,0.0
66,2,Decision Tree,2,0.5,0.4764670538754256,0.46699037181506553,0.33341073989868164,0.46699037181506553
67,2,RandomForest,2,0.5,0.5491688363709193,0.4626625622228052,0.635056734085083,0.4626625622228052
68,2,AdaBoost (Discrete),2,0.5,0.4045663929501302,0.39455489650802344,82.48028826713562,0.39455489650802344
69,2,AdaBoost (Real),2,0.5,0.42639695573803327,0.4180264850359425,104.81486535072327,0.4180264850359425
70,2,Logistic Regression (Penalty = L2),2,0.5,0.5369517324253955,0.26524162172997734,0.30016136169433594,0.26524162172997734
71,2,Naive Bayes,2,0.5,0.40196274784698577,0.14092020359966895,0.14801502227783203,0.14092020359966895
72,3,KNeighbors Classifier,0,0.5,0.5602723267921506,0.5529655047751709,2.2556028366088867,0.5529655047751709
73,3,SVC Classifier,0,0.5,0.55126151381658,1.0,71.15174984931946,0.0
74,3,Decision Tree,0,0.5,0.5358430116139368,0.5355961517332116,0.2524075508117676,0.5355961517332116
75,3,RandomForest,0,0.5,0.6013215859030837,0.5963051265753263,0.6121785640716553,0.5963051265753263
76,3,AdaBoost (Discrete),0,0.5,0.5010012014417301,0.489353623731125,76.31828618049622,0.489353623731125
77,3,AdaBoost (Real),0,0.5,0.5454545454545454,0.5465526891664976,94.29129886627197,0.5465526891664976
78,3,Logistic Regression (Penalty = L2),0,0.5,0.55126151381658,1.0,0.16101622581481934,0.0
79,3,Naive Bayes,0,0.5,0.46395674809771725,0.20753187941884332,0.18346738815307617,0.20753187941884332
80,3,KNeighbors Classifier,1,0.5,0.4456238734227919,0.447829109881173,2.45334792137146,0.447829109881173
81,3,SVC Classifier,1,0.5,0.551171640296415,1.0,65.09327864646912,0.0
82,3,Decision Tree,1,0.5,0.5007009813739235,0.5031891575948712,0.30619215965270996,0.5031891575948712
83,3,RandomForest,1,0.5,0.4614460244342079,0.45309367932838746,0.6431882381439209,0.45309367932838746
84,3,AdaBoost (Discrete),1,0.5,0.4696575205287402,0.4714437313253657,73.99063301086426,0.4714437313253657
85,3,AdaBoost (Real),1,0.5,0.46825555778089323,0.4707162576125058,91.29195618629456,0.4707162576125058
86,3,Logistic Regression (Penalty = L2),1,0.5,0.551171640296415,1.0,0.14455795288085938,0.0
87,3,Naive Bayes,1,0.5,0.5509713599038654,0.9996366279069767,0.1453099250793457,0.0
88,3,KNeighbors Classifier,2,0.5,0.549769677548568,0.5076662501419226,2.777059316635132,0.5076662501419226
89,3,SVC Classifier,2,0.5,0.551171640296415,1.0,45.26707911491394,0.0
90,3,Decision Tree,2,0.5,0.5293410775085119,0.4918314224896048,0.23311710357666016,0.4918314224896048
91,3,RandomForest,2,0.5,0.5934308031243741,0.4454308269152112,0.5727736949920654,0.4454308269152112
92,3,AdaBoost (Discrete),2,0.5,0.5067093931504105,0.4369953381831988,75.23393893241882,0.4369953381831988
93,3,AdaBoost (Real),2,0.5,0.5231323853394753,0.46457827125618734,96.70472979545593,0.46457827125618734
94,3,Logistic Regression (Penalty = L2),2,0.5,0.5738033246545163,0.3409391526752615,0.2721991539001465,0.3409391526752615
95,3,Naive Bayes,2,0.5,0.409773683156419,0.0887056031966386,0.10933327674865723,0.0887056031966386
96,4,KNeighbors Classifier,0,0.5,0.6189427312775331,0.617820075874497,0.9230246543884277,0.617820075874497
97,4,SVC Classifier,0,0.5,0.55126151381658,1.0,63.02475380897522,0.0
98,4,Decision Tree,0,0.5,0.5552663195835001,0.5520424142922545,0.2603285312652588,0.5520424142922545
99,4,RandomForest,0,0.5,0.6037244693632359,0.6062956741166383,0.7320539951324463,0.6062956741166383
100,4,AdaBoost (Discrete),0,0.5,0.5692831397677213,0.5459319226557076,65.38438487052917,0.5459319226557076
101,4,AdaBoost (Real),0,0.5,0.5742891469763717,0.5745733362966357,95.12891626358032,0.5745733362966357
102,4,Logistic Regression (Penalty = L2),0,0.5,0.55126151381658,1.0,0.17472004890441895,0.0
103,4,Naive Bayes,0,0.5,0.45034040849018825,0.053906593415442496,0.0970766544342041,0.053906593415442496
104,4,KNeighbors Classifier,1,0.5,0.4454235930302423,0.44776012946300936,1.3319671154022217,0.44776012946300936
105,4,SVC Classifier,1,0.5,0.551171640296415,1.0,68.42793822288513,0.0
106,4,Decision Tree,1,0.5,0.4698578009212898,0.47195866885606863,0.24161863327026367,0.47195866885606863
107,4,RandomForest,1,0.5,0.43240536751452036,0.432016232296993,0.671926736831665,0.432016232296993
108,4,AdaBoost (Discrete),1,0.5,0.48387742839975967,0.4852820631030885,60.60053896903992,0.4852820631030885
109,4,AdaBoost (Real),1,0.5,0.4880833166433006,0.4901686698120892,81.54293894767761,0.4901686698120892
110,4,Logistic Regression (Penalty = L2),1,0.5,0.551171640296415,1.0,0.1603715419769287,0.0
111,4,Naive Bayes,1,0.5,0.46485079110755056,0.17049858486761837,0.15332388877868652,0.17049858486761837
112,4,KNeighbors Classifier,2,0.5,0.5387542559583417,0.5040619911939896,1.003904104232788,0.5040619911939896
113,4,SVC Classifier,2,0.5,0.551171640296415,1.0,47.09124135971069,0.0
114,4,Decision Tree,2,0.5,0.5165231323853394,0.4896006896863662,0.2948312759399414,0.4896006896863662
115,4,RandomForest,2,0.5,0.5459643500901262,0.4652667274292562,0.7208490371704102,0.4652667274292562
116,4,AdaBoost (Discrete),2,0.5,0.5591828559983978,0.5226438364771965,61.150612354278564,0.5226438364771965
117,4,AdaBoost (Real),2,0.5,0.5539755657921089,0.5118354723755859,81.12724018096924,0.5118354723755859
118,4,Logistic Regression (Penalty = L2),2,0.5,0.551171640296415,1.0,0.09885740280151367,0.0
119,4,Naive Bayes,2,0.5,0.40797115962347286,0.02568928764291585,0.15011215209960938,0.02568928764291585
120,5,KNeighbors Classifier,0,0.5,0.5468562274729676,0.5399669319335912,2.1267082691192627,0.5399669319335912
121,5,SVC Classifier,0,0.5,0.55126151381658,1.0,48.8518283367157,0.0
122,5,Decision Tree,0,0.5,0.5178213856627953,0.5153243144422325,0.3243389129638672,0.5153243144422325
123,5,RandomForest,0,0.5,0.5172206647977573,0.5075488109562634,0.7892520427703857,0.5075488109562634
124,5,AdaBoost (Discrete),0,0.5,0.539247096515819,0.5378422656165577,69.04779434204102,0.5378422656165577
125,5,AdaBoost (Real),0,0.5,0.5352422907488987,0.5321098360987325,86.51758098602295,0.5321098360987325
126,5,Logistic Regression (Penalty = L2),0,0.5,0.5568682418902683,0.43228998665925744,0.22035551071166992,0.43228998665925744
127,5,Naive Bayes,0,0.5,0.47436924309171,0.2494671135012551,0.09881186485290527,0.2494671135012551
128,5,KNeighbors Classifier,1,0.5,0.45864209893851393,0.44198053594401376,1.9730501174926758,0.44198053594401376
129,5,SVC Classifier,1,0.5,0.551171640296415,1.0,47.627899408340454,0.0
130,5,Decision Tree,1,0.5,0.506509112757861,0.5065055104887758,0.3038012981414795,0.5065055104887758
131,5,RandomForest,1,0.5,0.5317444422191068,0.4303352508581294,0.7372705936431885,0.4303352508581294
132,5,AdaBoost (Discrete),1,0.5,0.5185259363108352,0.514781746436188,64.32417297363281,0.514781746436188
133,5,AdaBoost (Real),1,0.5,0.5131183657119968,0.5098153979463435,81.90302181243896,0.5098153979463435
134,5,Logistic Regression (Penalty = L2),1,0.5,0.5275385539755658,0.4887766759775791,0.26105713844299316,0.4887766759775791
135,5,Naive Bayes,1,0.5,0.4672541558181454,0.18283936271530682,0.09295225143432617,0.18283936271530682
136,5,KNeighbors Classifier,2,0.5,0.4764670538754256,0.4485092925396669,1.2758724689483643,0.4485092925396669
137,5,SVC Classifier,2,0.5,0.551171640296415,1.0,47.369205474853516,0.0
138,5,Decision Tree,2,0.5,0.4690566793510915,0.4581502177144996,0.2783784866333008,0.4581502177144996
139,5,RandomForest,2,0.5,0.5493691167634689,0.4640768073130047,0.6431379318237305,0.4640768073130047
140,5,AdaBoost (Discrete),2,0.5,0.43220508712197075,0.42148320532315153,60.232205390930176,0.42148320532315153
141,5,AdaBoost (Real),2,0.5,0.4468255557780893,0.4356766762469917,73.98610424995422,0.4356766762469917
142,5,Logistic Regression (Penalty = L2),2,0.5,0.5247346284798718,0.2932014527278793,0.24454903602600098,0.2932014527278793
143,5,Naive Bayes,2,0.5,0.40256358902463446,0.12727911971673958,0.10896420478820801,0.12727911971673958
144,6,KNeighbors Classifier,0,0.5,0.6189427312775331,0.617820075874497,0.7247986793518066,0.617820075874497
145,6,SVC Classifier,0,0.5,0.55126151381658,1.0,48.814717292785645,0.0
146,6,Decision Tree,0,0.5,0.5766920304365238,0.5796125747403432,0.22232532501220703,0.5796125747403432
147,6,RandomForest,0,0.5,0.6037244693632359,0.6062956741166383,0.5013985633850098,0.6062956741166383
148,6,AdaBoost (Discrete),0,0.5,0.5692831397677213,0.5459319226557076,46.08357572555542,0.5459319226557076
149,6,AdaBoost (Real),0,0.5,0.5742891469763717,0.5745733362966357,57.562482595443726,0.5745733362966357
150,6,Logistic Regression (Penalty = L2),0,0.5,0.55126151381658,1.0,0.10263872146606445,0.0
151,6,Naive Bayes,0,0.5,0.45034040849018825,0.053906593415442496,0.07242035865783691,0.053906593415442496
152,6,KNeighbors Classifier,1,0.5,0.4454235930302423,0.44776012946300936,0.768120527267456,0.44776012946300936
153,6,SVC Classifier,1,0.5,0.551171640296415,1.0,44.62810158729553,0.0
154,6,Decision Tree,1,0.5,0.4786701381934709,0.4807233324116469,0.19547820091247559,0.4807233324116469
155,6,RandomForest,1,0.5,0.43240536751452036,0.432016232296993,0.4812355041503906,0.432016232296993
156,6,AdaBoost (Discrete),1,0.5,0.48387742839975967,0.4852820631030885,38.89467525482178,0.4852820631030885
157,6,AdaBoost (Real),1,0.5,0.4880833166433006,0.4901686698120892,50.68949508666992,0.4901686698120892
158,6,Logistic Regression (Penalty = L2),1,0.5,0.551171640296415,1.0,0.09874844551086426,0.0
159,6,Naive Bayes,1,0.5,0.46485079110755056,0.17049858486761837,0.07232046127319336,0.17049858486761837
160,6,KNeighbors Classifier,2,0.5,0.5387542559583417,0.5040619911939896,0.6540825366973877,0.5040619911939896
161,6,SVC Classifier,2,0.5,0.551171640296415,1.0,27.843318462371826,0.0
162,6,Decision Tree,2,0.5,0.522331263769277,0.4983249691957903,0.14215445518493652,0.4983249691957903
163,6,RandomForest,2,0.5,0.5459643500901262,0.4652667274292562,0.4419257640838623,0.4652667274292562
164,6,AdaBoost (Discrete),2,0.5,0.5591828559983978,0.5226438364771965,42.411640882492065,0.5226438364771965
165,6,AdaBoost (Real),2,0.5,0.5539755657921089,0.5118354723755859,56.7490599155426,0.5118354723755859
166,6,Logistic Regression (Penalty = L2),2,0.5,0.551171640296415,1.0,0.12939810752868652,0.0
167,6,Naive Bayes,2,0.5,0.40797115962347286,0.02568928764291585,0.06681013107299805,0.02568928764291585
168,7,KNeighbors Classifier,0,0.5,0.5776932318782539,0.5668722437546326,0.2274482250213623,0.5668722437546326
169,7,SVC Classifier,0,0.5,0.55126151381658,1.0,36.08474159240723,0.0
170,7,Decision Tree,0,0.5,0.5366439727673208,0.5324973170335809,0.12813401222229004,0.5324973170335809
171,7,RandomForest,0,0.5,0.5726872246696035,0.5753253517711837,0.4134483337402344,0.5753253517711837
172,7,AdaBoost (Discrete),0,0.5,0.5828994793752503,0.5852994547617653,30.704200744628906,0.5852994547617653
173,7,AdaBoost (Real),0,0.5,0.5642771325590709,0.5624085291184514,48.854544162750244,0.5624085291184514
174,7,Logistic Regression (Penalty = L2),0,0.5,0.55126151381658,1.0,0.08383464813232422,0.0
175,7,Naive Bayes,0,0.5,0.46796155386463756,0.2284318677968793,0.08176040649414062,0.2284318677968793
176,7,KNeighbors Classifier,1,0.5,0.5321450030042059,0.5327120161898562,0.2245473861694336,0.5327120161898562
177,7,SVC Classifier,1,0.5,0.551171640296415,1.0,27.60448956489563,0.0
178,7,Decision Tree,1,0.5,0.5221309833767274,0.5154937447112434,0.1407768726348877,0.5154937447112434
179,7,RandomForest,1,0.5,0.5433607049869817,0.4999387045645283,0.39369821548461914,0.4999387045645283
180,7,AdaBoost (Discrete),1,0.5,0.5762066893651111,0.5790718244297026,28.658087015151978,0.5790718244297026
181,7,AdaBoost (Real),1,0.5,0.5611856599238935,0.5616763011935968,43.14890766143799,0.5616763011935968
182,7,Logistic Regression (Penalty = L2),1,0.5,0.551171640296415,1.0,0.057901859283447266,0.0
183,7,Naive Bayes,1,0.5,0.46685359503304624,0.18084105831390454,0.056299448013305664,0.18084105831390454
184,7,KNeighbors Classifier,2,0.5,0.5101141598237533,0.4765251973518037,0.22703289985656738,0.4765251973518037
185,7,SVC Classifier,2,0.5,0.551171640296415,1.0,25.928521633148193,0.0
186,7,Decision Tree,2,0.5,0.5113158421790507,0.4635664062224637,0.14147615432739258,0.4635664062224637
187,7,RandomForest,2,0.5,0.5467654716603244,0.47066510114247345,0.44926881790161133,0.47066510114247345
188,7,AdaBoost (Discrete),2,0.5,0.5527738834368116,0.4918963652876941,27.058064699172974,0.4918963652876941
189,7,AdaBoost (Real),2,0.5,0.5369517324253955,0.49216889968059946,36.24265933036804,0.49216889968059946
190,7,Logistic Regression (Penalty = L2),2,0.5,0.551171640296415,1.0,0.05787515640258789,0.0
191,7,Naive Bayes,2,0.5,0.4077708792309233,0.07460148578792397,0.08227682113647461,0.07460148578792397
192,8,KNeighbors Classifier,0,0.5,0.5602723267921506,0.5529655047751709,1.0836820602416992,0.5529655047751709
193,8,SVC Classifier,0,0.5,0.55126151381658,1.0,40.06395745277405,0.0
194,8,Decision Tree,0,0.5,0.5386463756507809,0.5312859774900093,0.1674814224243164,0.5312859774900093
195,8,RandomForest,0,0.5,0.6013215859030837,0.5963051265753263,0.40745973587036133,0.5963051265753263
196,8,AdaBoost (Discrete),0,0.5,0.5010012014417301,0.489353623731125,48.39610767364502,0.489353623731125
197,8,AdaBoost (Real),0,0.5,0.5460552663195835,0.547142238988684,56.054462909698486,0.547142238988684
198,8,Logistic Regression (Penalty = L2),0,0.5,0.55126151381658,1.0,0.1994633674621582,0.0
199,8,Naive Bayes,0,0.5,0.46395674809771725,0.20753187941884332,0.09859228134155273,0.20753187941884332
200,8,KNeighbors Classifier,1,0.5,0.4456238734227919,0.447829109881173,1.4357635974884033,0.447829109881173
201,8,SVC Classifier,1,0.5,0.551171640296415,1.0,39.95102071762085,0.0
202,8,Decision Tree,1,0.5,0.49949929901862605,0.5020505258936668,0.1476116180419922,0.5020505258936668
203,8,RandomForest,1,0.5,0.4614460244342079,0.45309367932838746,0.3808135986328125,0.45309367932838746
204,8,AdaBoost (Discrete),1,0.5,0.4696575205287402,0.4714437313253657,45.90454292297363,0.4714437313253657
205,8,AdaBoost (Real),1,0.5,0.46825555778089323,0.4707162576125058,56.455065965652466,0.4707162576125058
206,8,Logistic Regression (Penalty = L2),1,0.5,0.551171640296415,1.0,0.1148672103881836,0.0
207,8,Naive Bayes,1,0.5,0.5509713599038654,0.9996366279069767,0.09924840927124023,0.0
208,8,KNeighbors Classifier,2,0.5,0.549769677548568,0.5076662501419226,1.5761816501617432,0.5076662501419226
209,8,SVC Classifier,2,0.5,0.551171640296415,1.0,27.74033212661743,0.0
210,8,Decision Tree,2,0.5,0.5071099539355097,0.4671217752063726,0.16814017295837402,0.4671217752063726
211,8,RandomForest,2,0.5,0.5934308031243741,0.4454308269152112,0.3590202331542969,0.4454308269152112
212,8,AdaBoost (Discrete),2,0.5,0.5067093931504105,0.4369953381831988,45.59017372131348,0.4369953381831988
213,8,AdaBoost (Real),2,0.5,0.5235329461245743,0.4650340428516701,55.670210123062134,0.4650340428516701
214,8,Logistic Regression (Penalty = L2),2,0.5,0.5738033246545163,0.3409391526752615,0.16605067253112793,0.3409391526752615
215,8,Naive Bayes,2,0.5,0.409773683156419,0.0887056031966386,0.06264853477478027,0.0887056031966386
216,9,KNeighbors Classifier,0,0.5,0.5776932318782539,0.5668722437546326,0.2194690704345703,0.5668722437546326
217,9,SVC Classifier,0,0.5,0.55126151381658,1.0,31.275381326675415,0.0
218,9,Decision Tree,0,0.5,0.5382458950740889,0.5344511311101402,0.09613609313964844,0.5344511311101402
219,9,RandomForest,0,0.5,0.5726872246696035,0.5753253517711837,0.40259885787963867,0.5753253517711837
220,9,AdaBoost (Discrete),0,0.5,0.5828994793752503,0.5852994547617653,24.05016303062439,0.5852994547617653
221,9,AdaBoost (Real),0,0.5,0.5642771325590709,0.5624085291184514,34.78459072113037,0.5624085291184514
222,9,Logistic Regression (Penalty = L2),0,0.5,0.55126151381658,1.0,0.049025774002075195,0.0
223,9,Naive Bayes,0,0.5,0.46796155386463756,0.2284318677968793,0.0698690414428711,0.2284318677968793
224,9,KNeighbors Classifier,1,0.5,0.5321450030042059,0.5327120161898562,0.22082209587097168,0.5327120161898562
225,9,SVC Classifier,1,0.5,0.551171640296415,1.0,22.89357018470764,0.0
226,9,Decision Tree,1,0.5,0.5213298618065292,0.5133115129815436,0.14086556434631348,0.5133115129815436
227,9,RandomForest,1,0.5,0.5433607049869817,0.4999387045645283,0.35819363594055176,0.4999387045645283
228,9,AdaBoost (Discrete),1,0.5,0.5762066893651111,0.5790718244297026,23.172043323516846,0.5790718244297026
229,9,AdaBoost (Real),1,0.5,0.5611856599238935,0.5616763011935968,37.80601406097412,0.5616763011935968
230,9,Logistic Regression (Penalty = L2),1,0.5,0.551171640296415,1.0,0.049352169036865234,0.0
231,9,Naive Bayes,1,0.5,0.46685359503304624,0.18084105831390454,0.04879498481750488,0.18084105831390454
232,9,KNeighbors Classifier,2,0.5,0.5101141598237533,0.4765251973518037,0.23810267448425293,0.4765251973518037
233,9,SVC Classifier,2,0.5,0.551171640296415,1.0,22.339425802230835,0.0
234,9,Decision Tree,2,0.5,0.5071099539355097,0.4558003741117824,0.09792256355285645,0.4558003741117824
235,9,RandomForest,2,0.5,0.5467654716603244,0.47066510114247345,0.3224616050720215,0.47066510114247345
236,9,AdaBoost (Discrete),2,0.5,0.5527738834368116,0.4918963652876941,24.53515625,0.4918963652876941
237,9,AdaBoost (Real),2,0.5,0.5369517324253955,0.49216889968059946,33.088603258132935,0.49216889968059946
238,9,Logistic Regression (Penalty = L2),2,0.5,0.551171640296415,1.0,0.06781172752380371,0.0
239,9,Naive Bayes,2,0.5,0.4077708792309233,0.07460148578792397,0.047714948654174805,0.07460148578792397
240,10,KNeighbors Classifier,0,0.5,0.5462555066079295,0.5392360943345897,2.555773973464966,0.5392360943345897
241,10,SVC Classifier,0,0.5,0.55126151381658,1.0,32.25245499610901,0.0
242,10,Decision Tree,0,0.5,0.5242290748898678,0.5254036771477655,0.1831662654876709,0.5254036771477655
243,10,RandomForest,0,0.5,0.5909090909090909,0.5926597339082067,0.3572998046875,0.5926597339082067
244,10,AdaBoost (Discrete),0,0.5,0.47597116539847817,0.4519271956839303,50.052276372909546,0.4519271956839303
245,10,AdaBoost (Real),0,0.5,0.5362434921906287,0.5286636908422212,50.202194690704346,0.5286636908422212
246,10,Logistic Regression (Penalty = L2),0,0.5,0.5186223468161795,0.45729300116465227,0.15936970710754395,0.45729300116465227
247,10,Naive Bayes,0,0.5,0.4711653984781738,0.24054250293673068,0.05685830116271973,0.24054250293673068
248,10,KNeighbors Classifier,1,0.5,0.4718606048467855,0.4721639028224682,2.2506542205810547,0.4721639028224682
249,10,SVC Classifier,1,0.5,0.5509713599038654,0.9996366279069767,23.824580669403076,0.0
250,10,Decision Tree,1,0.5,0.4758662126977769,0.4776167247920507,0.14797449111938477,0.4776167247920507
251,10,RandomForest,1,0.5,0.4582415381534148,0.3961144992974336,0.2864358425140381,0.3961144992974336
252,10,AdaBoost (Discrete),1,0.5,0.4992990186260765,0.5017639696559292,41.36473751068115,0.5017639696559292
253,10,AdaBoost (Real),1,0.5,0.4770678950530743,0.4791800753555468,50.064085721969604,0.4791800753555468
254,10,Logistic Regression (Penalty = L2),1,0.5,0.5347486481073503,0.4862982579263836,0.14365005493164062,0.4862982579263836
255,10,Naive Bayes,1,0.5,0.5501702383336672,0.04714911923461674,0.08306884765625,0.04714911923461674
256,10,KNeighbors Classifier,2,0.5,0.4402163028239535,0.39388137041516696,2.425760507583618,0.39388137041516696
257,10,SVC Classifier,2,0.5,0.5513719206889646,0.021124141684149264,28.45776891708374,0.021124141684149264
258,10,Decision Tree,2,0.5,0.510715001001402,0.4878881292315705,0.1598806381225586,0.4878881292315705
259,10,RandomForest,2,0.5,0.5493691167634689,0.4752778357982659,0.30292248725891113,0.4752778357982659
260,10,AdaBoost (Discrete),2,0.5,0.5143200480672943,0.4760524978054978,41.198294162750244,0.4760524978054978
261,10,AdaBoost (Real),2,0.5,0.5245343480873222,0.4612696428171939,46.070165395736694,0.4612696428171939
262,10,Logistic Regression (Penalty = L2),2,0.5,0.5359503304626477,0.30673277672269295,0.19443058967590332,0.30673277672269295
263,10,Naive Bayes,2,0.5,0.40957340276386944,0.11542387329781269,0.07538318634033203,0.11542387329781269
264,11,KNeighbors Classifier,0,0.5,0.5214257108530236,0.5236309614231948,2.8148715496063232,0.5236309614231948
265,11,SVC Classifier,0,0.5,0.55126151381658,1.0,24.13610577583313,0.0
266,11,Decision Tree,0,0.5,0.45594713656387664,0.45824743040424887,0.12626290321350098,0.45824743040424887
267,11,RandomForest,0,0.5,0.4969963956748098,0.4941670617539058,0.26047682762145996,0.4941670617539058
268,11,AdaBoost (Discrete),0,0.5,0.4643572286744093,0.4377885719668739,43.67212915420532,0.4377885719668739
269,11,AdaBoost (Real),0,0.5,0.4819783740488586,0.4662465319751723,50.716286182403564,0.4662465319751723
270,11,Logistic Regression (Penalty = L2),0,0.5,0.5186223468161795,0.5052013904948605,0.16395235061645508,0.5052013904948605
271,11,Naive Bayes,0,0.5,0.47196635963155786,0.24414817802906397,0.05476832389831543,0.24414817802906397
272,11,KNeighbors Classifier,1,0.5,0.42439415181253753,0.42651076335156507,3.6771368980407715,0.42651076335156507
273,11,SVC Classifier,1,0.5,0.5509713599038654,0.9996366279069767,23.27005124092102,0.0
274,11,Decision Tree,1,0.5,0.4438213498898458,0.44574523227503954,0.15430808067321777,0.44574523227503954
275,11,RandomForest,1,0.5,0.5025035049068696,0.48299439597427285,0.2895925045013428,0.48299439597427285
276,11,AdaBoost (Discrete),1,0.5,0.4854796715401562,0.4880183911760762,42.10163760185242,0.4880183911760762
277,11,AdaBoost (Real),1,0.5,0.4780692970158221,0.48057051186448835,46.558095932006836,0.48057051186448835
278,11,Logistic Regression (Penalty = L2),1,0.5,0.5021029441217705,0.4900346779102695,0.17488813400268555,0.4900346779102695
279,11,Naive Bayes,1,0.5,0.5173242539555377,0.41403742224325424,0.04405713081359863,0.41403742224325424
280,11,KNeighbors Classifier,2,0.5,0.43100340476667337,0.39111493861618474,2.390312671661377,0.39111493861618474
281,11,SVC Classifier,2,0.5,0.5513719206889646,0.021124141684149264,23.036832571029663,0.021124141684149264
282,11,Decision Tree,2,0.5,0.5145203284598437,0.49131949171353057,0.16306567192077637,0.49131949171353057
283,11,RandomForest,2,0.5,0.5535750050070098,0.4458607132610479,0.23485326766967773,0.4458607132610479
284,11,AdaBoost (Discrete),2,0.5,0.49829761666332867,0.45242845294945894,38.921268701553345,0.45242845294945894
285,11,AdaBoost (Real),2,0.5,0.4974964950931304,0.44308690082323937,44.28339982032776,0.44308690082323937
286,11,Logistic Regression (Penalty = L2),2,0.5,0.5443621069497296,0.3075934957897839,0.1153874397277832,0.3075934957897839
287,11,Naive Bayes,2,0.5,0.40817144001602246,0.12317977768287787,0.04907107353210449,0.12317977768287787
288,12,KNeighbors Classifier,0,0.5,0.5776932318782539,0.5668722437546326,0.1090993881225586,0.5668722437546326
289,12,SVC Classifier,0,0.5,0.55126151381658,1.0,17.12730050086975,0.0
290,12,Decision Tree,0,0.5,0.5498598317981578,0.5393256623960206,0.051816463470458984,0.5393256623960206
291,12,RandomForest,0,0.5,0.5726872246696035,0.5753253517711837,0.24948954582214355,0.5753253517711837
292,12,AdaBoost (Discrete),0,0.5,0.5828994793752503,0.5852994547617653,14.612130641937256,0.5852994547617653
293,12,AdaBoost (Real),0,0.5,0.5642771325590709,0.5624085291184514,19.92046284675598,0.5624085291184514
294,12,Logistic Regression (Penalty = L2),0,0.5,0.55126151381658,1.0,0.059098243713378906,0.0
295,12,Naive Bayes,0,0.5,0.46796155386463756,0.2284318677968793,0.0336153507232666,0.2284318677968793
296,12,KNeighbors Classifier,1,0.5,0.5321450030042059,0.5327120161898562,0.1662898063659668,0.5327120161898562
297,12,SVC Classifier,1,0.5,0.551171640296415,1.0,12.790188550949097,0.0
298,12,Decision Tree,1,0.5,0.5163228519927899,0.5082966686464684,0.04757094383239746,0.5082966686464684
299,12,RandomForest,1,0.5,0.5433607049869817,0.4999387045645283,0.1866142749786377,0.4999387045645283
300,12,AdaBoost (Discrete),1,0.5,0.5762066893651111,0.5790718244297026,13.402773141860962,0.5790718244297026
301,12,AdaBoost (Real),1,0.5,0.5611856599238935,0.5616763011935968,19.951648950576782,0.5616763011935968
302,12,Logistic Regression (Penalty = L2),1,0.5,0.551171640296415,1.0,0.0250551700592041,0.0
303,12,Naive Bayes,1,0.5,0.46685359503304624,0.18084105831390454,0.022820234298706055,0.18084105831390454
304,12,KNeighbors Classifier,2,0.5,0.5101141598237533,0.4765251973518037,0.10972905158996582,0.4765251973518037
305,12,SVC Classifier,2,0.5,0.551171640296415,1.0,11.911659240722656,0.0
306,12,Decision Tree,2,0.5,0.5169236931704386,0.4616445664327964,0.0478518009185791,0.4616445664327964
307,12,RandomForest,2,0.5,0.5467654716603244,0.47066510114247345,0.17732501029968262,0.47066510114247345
308,12,AdaBoost (Discrete),2,0.5,0.5527738834368116,0.4918963652876941,12.641439437866211,0.4918963652876941
309,12,AdaBoost (Real),2,0.5,0.5369517324253955,0.49216889968059946,18.713798761367798,0.49216889968059946
310,12,Logistic Regression (Penalty = L2),2,0.5,0.551171640296415,1.0,0.04503798484802246,0.0
311,12,Naive Bayes,2,0.5,0.4077708792309233,0.07460148578792397,0.024121999740600586,0.07460148578792397
