,feat_set_id,classifier,fold_id,feat_th,score,geo_score,exec_t,geo_score_woz
0,0,KNeighbors Classifier,0,0.8,0.814748201438849,0.8142812070069015,12.319596290588379,0.8142812070069015
1,0,SVC Classifier,0,0.8,0.8489208633093526,0.8370680042809691,16.64556622505188,0.8370680042809691
2,0,Decision Tree,0,0.8,0.7248201438848921,0.7236724955225335,0.6761713027954102,0.7236724955225335
3,0,RandomForest,0,0.8,0.7392086330935251,0.7218721587449527,1.7906255722045898,0.7218721587449527
4,0,AdaBoost (Discrete),0,0.8,0.8447242206235012,0.8447238738640466,255.17068910598755,0.8447238738640466
5,0,AdaBoost (Real),0,0.8,0.8375299760191847,0.8369988803887267,300.62945222854614,0.8369988803887267
6,0,Logistic Regression (Penalty = L2),0,0.8,0.8741007194244604,0.8735993608360885,1.3898937702178955,0.8735993608360885
7,0,Naive Bayes,0,0.8,0.8105515587529976,0.7798322818099436,0.3203864097595215,0.7798322818099436
8,0,KNeighbors Classifier,1,0.8,0.7869147659063626,0.7853879041172531,12.987738847732544,0.7853879041172531
9,0,SVC Classifier,1,0.8,0.8451380552220888,0.8335574730456604,16.436020135879517,0.8335574730456604
10,0,Decision Tree,1,0.8,0.723889555822329,0.7228050076340462,0.6450831890106201,0.7228050076340462
11,0,RandomForest,1,0.8,0.7310924369747899,0.7208596617746772,1.6065285205841064,0.7208596617746772
12,0,AdaBoost (Discrete),1,0.8,0.8337334933973589,0.8335352088024661,254.57364797592163,0.8335352088024661
13,0,AdaBoost (Real),1,0.8,0.8349339735894358,0.8348956758646365,252.38940286636353,0.8348956758646365
14,0,Logistic Regression (Penalty = L2),1,0.8,0.8649459783913566,0.8644700056649184,1.1309776306152344,0.8644700056649184
15,0,Naive Bayes,1,0.8,0.8067226890756303,0.7783525822882925,0.25660037994384766,0.7783525822882925
16,0,KNeighbors Classifier,2,0.8,0.8187274909963985,0.8174700106085069,12.073996543884277,0.8174700106085069
17,0,SVC Classifier,2,0.8,0.8451380552220888,0.8301460461279765,15.381881713867188,0.8301460461279765
18,0,Decision Tree,2,0.8,0.7310924369747899,0.7306967832504062,0.6595726013183594,0.7306967832504062
19,0,RandomForest,2,0.8,0.748499399759904,0.7359812811322981,1.5694119930267334,0.7359812811322981
20,0,AdaBoost (Discrete),2,0.8,0.8457382953181273,0.8457002724571432,230.58494663238525,0.8457002724571432
21,0,AdaBoost (Real),2,0.8,0.8547418967587035,0.8547317448931462,273.0090401172638,0.8547317448931462
22,0,Logistic Regression (Penalty = L2),2,0.8,0.8679471788715486,0.8667736758612635,1.1440443992614746,0.8667736758612635
23,0,Naive Bayes,2,0.8,0.8145258103241296,0.7864645253694804,0.40523576736450195,0.7864645253694804
24,1,KNeighbors Classifier,0,0.8,0.814748201438849,0.8142812070069015,12.724964380264282,0.8142812070069015
25,1,SVC Classifier,0,0.8,0.8489208633093526,0.8370680042809691,16.12068486213684,0.8370680042809691
26,1,Decision Tree,0,0.8,0.7470023980815348,0.7463099991511799,0.7313830852508545,0.7463099991511799
27,1,RandomForest,0,0.8,0.7392086330935251,0.7218721587449527,1.476059913635254,0.7218721587449527
28,1,AdaBoost (Discrete),0,0.8,0.8447242206235012,0.8447238738640466,286.4076647758484,0.8447238738640466
29,1,AdaBoost (Real),0,0.8,0.8393285371702638,0.8386264918462485,302.7076246738434,0.8386264918462485
30,1,Logistic Regression (Penalty = L2),0,0.8,0.8741007194244604,0.8735993608360885,1.2429697513580322,0.8735993608360885
31,1,Naive Bayes,0,0.8,0.8105515587529976,0.7798322818099436,0.27878904342651367,0.7798322818099436
32,1,KNeighbors Classifier,1,0.8,0.7869147659063626,0.7853879041172531,14.301934957504272,0.7853879041172531
33,1,SVC Classifier,1,0.8,0.8451380552220888,0.8335574730456604,18.011306762695312,0.8335574730456604
34,1,Decision Tree,1,0.8,0.7400960384153662,0.7397655667797968,0.7030141353607178,0.7397655667797968
35,1,RandomForest,1,0.8,0.7310924369747899,0.7208596617746772,1.8752236366271973,0.7208596617746772
36,1,AdaBoost (Discrete),1,0.8,0.8337334933973589,0.8335352088024661,261.66110730171204,0.8335352088024661
37,1,AdaBoost (Real),1,0.8,0.8331332533013205,0.8330253667882187,277.8837687969208,0.8330253667882187
38,1,Logistic Regression (Penalty = L2),1,0.8,0.8649459783913566,0.8644700056649184,0.948026180267334,0.8644700056649184
39,1,Naive Bayes,1,0.8,0.8067226890756303,0.7783525822882925,0.19272875785827637,0.7783525822882925
40,1,KNeighbors Classifier,2,0.8,0.8187274909963985,0.8174700106085069,9.692980766296387,0.8174700106085069
41,1,SVC Classifier,2,0.8,0.8451380552220888,0.8301460461279765,12.715459823608398,0.8301460461279765
42,1,Decision Tree,2,0.8,0.741296518607443,0.7403619933460234,0.40134572982788086,0.7403619933460234
43,1,RandomForest,2,0.8,0.748499399759904,0.7359812811322981,1.5801973342895508,0.7359812811322981
44,1,AdaBoost (Discrete),2,0.8,0.8457382953181273,0.8457002724571432,193.71834421157837,0.8457002724571432
45,1,AdaBoost (Real),2,0.8,0.8469387755102041,0.8467889958426912,246.26091122627258,0.8467889958426912
46,1,Logistic Regression (Penalty = L2),2,0.8,0.8679471788715486,0.8667736758612635,0.7978298664093018,0.8667736758612635
47,1,Naive Bayes,2,0.8,0.8145258103241296,0.7864645253694804,0.2517406940460205,0.7864645253694804
48,2,KNeighbors Classifier,0,0.8,0.8165467625899281,0.8149221651285747,12.225109577178955,0.8149221651285747
49,2,SVC Classifier,0,0.8,0.842326139088729,0.8284677107280296,14.943005084991455,0.8284677107280296
50,2,Decision Tree,0,0.8,0.7428057553956835,0.7416748703306307,0.5973920822143555,0.7416748703306307
51,2,RandomForest,0,0.8,0.7392086330935251,0.7218721587449527,1.4210450649261475,0.7218721587449527
52,2,AdaBoost (Discrete),0,0.8,0.8363309352517986,0.8363979857196362,220.436674118042,0.8363979857196362
53,2,AdaBoost (Real),0,0.8,0.829136690647482,0.8290165704457102,241.63876914978027,0.8290165704457102
54,2,Logistic Regression (Penalty = L2),0,0.8,0.8705035971223022,0.869830722979536,1.0705764293670654,0.869830722979536
55,2,Naive Bayes,0,0.8,0.8075539568345323,0.7786582665407756,0.23274469375610352,0.7786582665407756
56,2,KNeighbors Classifier,1,0.8,0.7833133253301321,0.7821665486009328,13.163256645202637,0.7821665486009328
57,2,SVC Classifier,1,0.8,0.82953181272509,0.8205211387342379,15.435868501663208,0.8205211387342379
58,2,Decision Tree,1,0.8,0.7160864345738295,0.7149159257226094,0.5861458778381348,0.7149159257226094
59,2,RandomForest,1,0.8,0.7310924369747899,0.7208596617746772,1.6137895584106445,0.7208596617746772
60,2,AdaBoost (Discrete),1,0.8,0.8157262905162065,0.8157685492000605,275.5721573829651,0.8157685492000605
61,2,AdaBoost (Real),1,0.8,0.8235294117647058,0.8235079593209623,310.88956212997437,0.8235079593209623
62,2,Logistic Regression (Penalty = L2),1,0.8,0.8433373349339736,0.8429647108062378,1.1503539085388184,0.8429647108062378
63,2,Naive Bayes,1,0.8,0.7965186074429772,0.7684739439684787,0.27718067169189453,0.7684739439684787
64,2,KNeighbors Classifier,2,0.8,0.8079231692677071,0.8052611819089003,15.875546932220459,0.8052611819089003
65,2,SVC Classifier,2,0.8,0.8361344537815126,0.8201999404965455,18.78647518157959,0.8201999404965455
66,2,Decision Tree,2,0.8,0.7490996398559424,0.7488108273031001,0.5626182556152344,0.7488108273031001
67,2,RandomForest,2,0.8,0.748499399759904,0.7359812811322981,1.9856412410736084,0.7359812811322981
68,2,AdaBoost (Discrete),2,0.8,0.8427370948379351,0.8427018906708864,284.7491235733032,0.8427018906708864
69,2,AdaBoost (Real),2,0.8,0.8373349339735895,0.8373846293505903,279.93574357032776,0.8373846293505903
70,2,Logistic Regression (Penalty = L2),2,0.8,0.8631452581032413,0.8619265587652923,1.1098661422729492,0.8619265587652923
71,2,Naive Bayes,2,0.8,0.8163265306122449,0.7875717288895827,0.26068115234375,0.7875717288895827
72,3,KNeighbors Classifier,0,0.8,0.814748201438849,0.8142812070069015,13.208610534667969,0.8142812070069015
73,3,SVC Classifier,0,0.8,0.8489208633093526,0.8370680042809691,16.26120686531067,0.8370680042809691
74,3,Decision Tree,0,0.8,0.7691846522781774,0.7689924582193466,0.55946946144104,0.7689924582193466
75,3,RandomForest,0,0.8,0.7392086330935251,0.7218721587449527,1.6019163131713867,0.7218721587449527
76,3,AdaBoost (Discrete),0,0.8,0.8447242206235012,0.8447238738640466,296.3581368923187,0.8447238738640466
77,3,AdaBoost (Real),0,0.8,0.8387290167865707,0.8384621281066261,323.61259961128235,0.8384621281066261
78,3,Logistic Regression (Penalty = L2),0,0.8,0.8741007194244604,0.8735993608360885,2.330901861190796,0.8735993608360885
79,3,Naive Bayes,0,0.8,0.8105515587529976,0.7798322818099436,0.4444589614868164,0.7798322818099436
80,3,KNeighbors Classifier,1,0.8,0.7869147659063626,0.7853879041172531,17.751282453536987,0.7853879041172531
81,3,SVC Classifier,1,0.8,0.8451380552220888,0.8335574730456604,24.178102254867554,0.8335574730456604
82,3,Decision Tree,1,0.8,0.7328931572629052,0.7324699065489421,0.8342552185058594,0.7324699065489421
83,3,RandomForest,1,0.8,0.7310924369747899,0.7208596617746772,1.9141149520874023,0.7208596617746772
84,3,AdaBoost (Discrete),1,0.8,0.8337334933973589,0.8335352088024661,327.29023599624634,0.8335352088024661
85,3,AdaBoost (Real),1,0.8,0.8361344537815126,0.8360417690297006,307.33618426322937,0.8360417690297006
86,3,Logistic Regression (Penalty = L2),1,0.8,0.8649459783913566,0.8644700056649184,1.037184476852417,0.8644700056649184
87,3,Naive Bayes,1,0.8,0.8067226890756303,0.7783525822882925,0.27953529357910156,0.7783525822882925
88,3,KNeighbors Classifier,2,0.8,0.8187274909963985,0.8174700106085069,12.589634656906128,0.8174700106085069
89,3,SVC Classifier,2,0.8,0.8451380552220888,0.8301460461279765,18.127338647842407,0.8301460461279765
90,3,Decision Tree,2,0.8,0.7436974789915967,0.7426366899773432,0.5842831134796143,0.7426366899773432
91,3,RandomForest,2,0.8,0.748499399759904,0.7359812811322981,1.703160285949707,0.7359812811322981
92,3,AdaBoost (Discrete),2,0.8,0.8457382953181273,0.8457002724571432,254.35491561889648,0.8457002724571432
93,3,AdaBoost (Real),2,0.8,0.8421368547418968,0.8419082510330639,316.3797335624695,0.8419082510330639
94,3,Logistic Regression (Penalty = L2),2,0.8,0.8679471788715486,0.8667736758612635,1.4221062660217285,0.8667736758612635
95,3,Naive Bayes,2,0.8,0.8145258103241296,0.7864645253694804,0.3630244731903076,0.7864645253694804
96,4,KNeighbors Classifier,0,0.8,0.8129496402877698,0.8123468557722008,10.243957757949829,0.8123468557722008
97,4,SVC Classifier,0,0.8,0.8441247002398081,0.8300554602717474,16.352675199508667,0.8300554602717474
98,4,Decision Tree,0,0.8,0.7685851318944844,0.7682205939432817,0.5610780715942383,0.7682205939432817
99,4,RandomForest,0,0.8,0.7673860911270983,0.7427910988334798,1.85764741897583,0.7427910988334798
100,4,AdaBoost (Discrete),0,0.8,0.842925659472422,0.8428367914997088,247.13580465316772,0.8428367914997088
101,4,AdaBoost (Real),0,0.8,0.8327338129496403,0.8323820326137313,297.0416829586029,0.8323820326137313
102,4,Logistic Regression (Penalty = L2),0,0.8,0.8687050359712231,0.8681150760738997,1.0592200756072998,0.8681150760738997
103,4,Naive Bayes,0,0.8,0.8057553956834532,0.777184450111764,0.25588369369506836,0.777184450111764
104,4,KNeighbors Classifier,1,0.8,0.8037214885954381,0.8028329964143595,10.323060512542725,0.8028329964143595
105,4,SVC Classifier,1,0.8,0.8301320528211285,0.820445903777974,17.29861092567444,0.820445903777974
106,4,Decision Tree,1,0.8,0.7274909963985594,0.7270160622174994,0.5005538463592529,0.7270160622174994
107,4,RandomForest,1,0.8,0.7689075630252101,0.7478814633285703,1.9217357635498047,0.7478814633285703
108,4,AdaBoost (Discrete),1,0.8,0.8211284513805522,0.8210638582512096,248.75342440605164,0.8210638582512096
109,4,AdaBoost (Real),1,0.8,0.8271308523409364,0.8267812742040049,294.18517684936523,0.8267812742040049
110,4,Logistic Regression (Penalty = L2),1,0.8,0.8469387755102041,0.8465991753934167,0.9536693096160889,0.8465991753934167
111,4,Naive Bayes,1,0.8,0.7971188475390156,0.7705360588201597,0.2801647186279297,0.7705360588201597
112,4,KNeighbors Classifier,2,0.8,0.8073229291716687,0.8061645597309036,10.948902130126953,0.8061645597309036
113,4,SVC Classifier,2,0.8,0.8391356542617047,0.8236661315632703,16.540040731430054,0.8236661315632703
114,4,Decision Tree,2,0.8,0.7286914765906363,0.7279986247678686,0.5074715614318848,0.7279986247678686
115,4,RandomForest,2,0.8,0.7857142857142857,0.7580085582270358,1.408489465713501,0.7580085582270358
116,4,AdaBoost (Discrete),2,0.8,0.8421368547418968,0.8420869730525725,259.8861343860626,0.8420869730525725
117,4,AdaBoost (Real),2,0.8,0.843937575030012,0.8439747139071982,279.46983432769775,0.8439747139071982
118,4,Logistic Regression (Penalty = L2),2,0.8,0.8649459783913566,0.8636920369076319,0.988778829574585,0.8636920369076319
119,4,Naive Bayes,2,0.8,0.8151260504201681,0.7857675443286437,0.16349053382873535,0.7857675443286437
120,5,KNeighbors Classifier,0,0.8,0.8129496402877698,0.8123468557722008,10.210627794265747,0.8123468557722008
121,5,SVC Classifier,0,0.8,0.8441247002398081,0.8300554602717474,16.233806371688843,0.8300554602717474
122,5,Decision Tree,0,0.8,0.7428057553956835,0.7416461603912278,0.5227317810058594,0.7416461603912278
123,5,RandomForest,0,0.8,0.7673860911270983,0.7427910988334798,1.577157735824585,0.7427910988334798
124,5,AdaBoost (Discrete),0,0.8,0.842326139088729,0.8422424071054594,236.23095226287842,0.8422424071054594
125,5,AdaBoost (Real),0,0.8,0.8327338129496403,0.832472776656795,259.49416303634644,0.832472776656795
126,5,Logistic Regression (Penalty = L2),0,0.8,0.8687050359712231,0.8681150760738997,0.917553186416626,0.8681150760738997
127,5,Naive Bayes,0,0.8,0.8057553956834532,0.777184450111764,0.24004912376403809,0.777184450111764
128,5,KNeighbors Classifier,1,0.8,0.8037214885954381,0.8028329964143595,9.142640113830566,0.8028329964143595
129,5,SVC Classifier,1,0.8,0.8301320528211285,0.820445903777974,15.67153811454773,0.820445903777974
130,5,Decision Tree,1,0.8,0.7178871548619448,0.7173981431430984,0.46866297721862793,0.7173981431430984
131,5,RandomForest,1,0.8,0.7689075630252101,0.7478814633285703,1.9101049900054932,0.7478814633285703
132,5,AdaBoost (Discrete),1,0.8,0.8211284513805522,0.8210638582512096,230.72305607795715,0.8210638582512096
133,5,AdaBoost (Real),1,0.8,0.8247298919567827,0.8246260020200634,277.94824719429016,0.8246260020200634
134,5,Logistic Regression (Penalty = L2),1,0.8,0.8469387755102041,0.8465991753934167,1.5168185234069824,0.8465991753934167
135,5,Naive Bayes,1,0.8,0.7971188475390156,0.7705360588201597,0.45418262481689453,0.7705360588201597
136,5,KNeighbors Classifier,2,0.8,0.8073229291716687,0.8061645597309036,10.628639698028564,0.8061645597309036
137,5,SVC Classifier,2,0.8,0.8391356542617047,0.8236661315632703,1066.839980840683,0.8236661315632703
138,5,Decision Tree,2,0.8,0.7454981992797118,0.7448218602709756,0.34978318214416504,0.7448218602709756
139,5,RandomForest,2,0.8,0.7857142857142857,0.7580085582270358,1.5730881690979004,0.7580085582270358
140,5,AdaBoost (Discrete),2,0.8,0.8421368547418968,0.8420869730525725,186.08837723731995,0.8420869730525725
141,5,AdaBoost (Real),2,0.8,0.8403361344537815,0.8401492454772878,198.58298254013062,0.8401492454772878
142,5,Logistic Regression (Penalty = L2),2,0.8,0.8649459783913566,0.8636920369076319,0.9157149791717529,0.8636920369076319
143,5,Naive Bayes,2,0.8,0.8151260504201681,0.7857675443286437,0.19960737228393555,0.7857675443286437
144,6,KNeighbors Classifier,0,0.8,0.814748201438849,0.8142812070069015,10.637603998184204,0.8142812070069015
145,6,SVC Classifier,0,0.8,0.8489208633093526,0.8370680042809691,13.458277225494385,0.8370680042809691
146,6,Decision Tree,0,0.8,0.736810551558753,0.7356395132035163,0.4468657970428467,0.7356395132035163
147,6,RandomForest,0,0.8,0.7392086330935251,0.7218721587449527,1.4016497135162354,0.7218721587449527
148,6,AdaBoost (Discrete),0,0.8,0.8447242206235012,0.8447238738640466,208.39273023605347,0.8447238738640466
149,6,AdaBoost (Real),0,0.8,0.8375299760191847,0.836450412990791,221.51078867912292,0.836450412990791
150,6,Logistic Regression (Penalty = L2),0,0.8,0.8741007194244604,0.8735993608360885,0.8266160488128662,0.8735993608360885
151,6,Naive Bayes,0,0.8,0.8105515587529976,0.7798322818099436,0.22720885276794434,0.7798322818099436
152,6,KNeighbors Classifier,1,0.8,0.7869147659063626,0.7853879041172531,10.148739576339722,0.7853879041172531
153,6,SVC Classifier,1,0.8,0.8451380552220888,0.8335574730456604,13.398762464523315,0.8335574730456604
154,6,Decision Tree,1,0.8,0.7490996398559424,0.7486030006302282,0.5049018859863281,0.7486030006302282
155,6,RandomForest,1,0.8,0.7310924369747899,0.7208596617746772,1.3054420948028564,0.7208596617746772
156,6,AdaBoost (Discrete),1,0.8,0.8337334933973589,0.8335352088024661,187.29389715194702,0.8335352088024661
157,6,AdaBoost (Real),1,0.8,0.8385354141656662,0.8383877290571402,194.3023326396942,0.8383877290571402
158,6,Logistic Regression (Penalty = L2),1,0.8,0.8649459783913566,0.8644700056649184,1.0262768268585205,0.8644700056649184
159,6,Naive Bayes,1,0.8,0.8067226890756303,0.7783525822882925,0.1804947853088379,0.7783525822882925
160,6,KNeighbors Classifier,2,0.8,0.8187274909963985,0.8174700106085069,9.084216594696045,0.8174700106085069
161,6,SVC Classifier,2,0.8,0.8451380552220888,0.8301460461279765,12.224671840667725,0.8301460461279765
162,6,Decision Tree,2,0.8,0.7394957983193278,0.7393061264908616,0.4370415210723877,0.7393061264908616
163,6,RandomForest,2,0.8,0.748499399759904,0.7359812811322981,1.1357040405273438,0.7359812811322981
164,6,AdaBoost (Discrete),2,0.8,0.8457382953181273,0.8457002724571432,181.54040837287903,0.8457002724571432
165,6,AdaBoost (Real),2,0.8,0.8517406962785115,0.8515268673947651,190.05523228645325,0.8515268673947651
166,6,Logistic Regression (Penalty = L2),2,0.8,0.8679471788715486,0.8667736758612635,0.7238004207611084,0.8667736758612635
167,6,Naive Bayes,2,0.8,0.8145258103241296,0.7864645253694804,0.2077476978302002,0.7864645253694804
168,7,KNeighbors Classifier,0,0.8,0.8051558752997602,0.8044383405942875,11.8825843334198,0.8044383405942875
169,7,SVC Classifier,0,0.8,0.8489208633093526,0.8366021566130785,12.186188459396362,0.8366021566130785
170,7,Decision Tree,0,0.8,0.7476019184652278,0.7471431045971908,0.34503173828125,0.7471431045971908
171,7,RandomForest,0,0.8,0.7817745803357314,0.7677782907309113,1.0758171081542969,0.7677782907309113
172,7,AdaBoost (Discrete),0,0.8,0.8465227817745803,0.8464968608937052,199.01094794273376,0.8464968608937052
173,7,AdaBoost (Real),0,0.8,0.8255395683453237,0.8243698110855323,204.58794045448303,0.8243698110855323
174,7,Logistic Regression (Penalty = L2),0,0.8,0.8752997601918465,0.874718749961572,0.8896458148956299,0.874718749961572
175,7,Naive Bayes,0,0.8,0.8093525179856115,0.778854520589206,0.20429611206054688,0.778854520589206
176,7,KNeighbors Classifier,1,0.8,0.7839135654261705,0.782241003780589,11.164708375930786,0.782241003780589
177,7,SVC Classifier,1,0.8,0.8391356542617047,0.8275229927010589,11.15373682975769,0.8275229927010589
178,7,Decision Tree,1,0.8,0.7569027611044418,0.7569554488189274,0.3450353145599365,0.7569554488189274
179,7,RandomForest,1,0.8,0.7689075630252101,0.7532659296063376,1.0607922077178955,0.7532659296063376
180,7,AdaBoost (Discrete),1,0.8,0.8271308523409364,0.8270682514135151,161.48852825164795,0.8270682514135151
181,7,AdaBoost (Real),1,0.8,0.8397358943577431,0.8397572118980384,185.50190687179565,0.8397572118980384
182,7,Logistic Regression (Penalty = L2),1,0.8,0.8631452581032413,0.8626680259218077,0.7687392234802246,0.8626680259218077
183,7,Naive Bayes,1,0.8,0.804921968787515,0.7772368817095535,0.22792720794677734,0.7772368817095535
184,7,KNeighbors Classifier,2,0.8,0.8097238895558223,0.8070599457285577,9.984012603759766,0.8070599457285577
185,7,SVC Classifier,2,0.8,0.8475390156062425,0.8338251672607434,10.116405725479126,0.8338251672607434
186,7,Decision Tree,2,0.8,0.7496998799519808,0.749028025631625,0.39996981620788574,0.749028025631625
187,7,RandomForest,2,0.8,0.7617046818727491,0.7482683921508059,0.9171886444091797,0.7482683921508059
188,7,AdaBoost (Discrete),2,0.8,0.8517406962785115,0.8513723523293824,154.07408833503723,0.8513723523293824
189,7,AdaBoost (Real),2,0.8,0.8565426170468188,0.8564951590800685,166.30002188682556,0.8564951590800685
190,7,Logistic Regression (Penalty = L2),2,0.8,0.868547418967587,0.8673790793790689,0.6487183570861816,0.8673790793790689
191,7,Naive Bayes,2,0.8,0.8163265306122449,0.7879263587061585,0.1490612030029297,0.7879263587061585
192,8,KNeighbors Classifier,0,0.8,0.8129496402877698,0.8123468557722008,5.037199020385742,0.8123468557722008
193,8,SVC Classifier,0,0.8,0.8441247002398081,0.8300554602717474,8.364131689071655,0.8300554602717474
194,8,Decision Tree,0,0.8,0.7535971223021583,0.7532644501612852,0.2183690071105957,0.7532644501612852
195,8,RandomForest,0,0.8,0.7673860911270983,0.7427910988334798,0.8613576889038086,0.7427910988334798
196,8,AdaBoost (Discrete),0,0.8,0.842925659472422,0.8428367914997088,127.9638319015503,0.8428367914997088
197,8,AdaBoost (Real),0,0.8,0.829736211031175,0.8296013527888906,147.4560248851776,0.8296013527888906
198,8,Logistic Regression (Penalty = L2),0,0.8,0.8687050359712231,0.8681150760738997,0.5524289608001709,0.8681150760738997
199,8,Naive Bayes,0,0.8,0.8057553956834532,0.777184450111764,0.2180159091949463,0.777184450111764
200,8,KNeighbors Classifier,1,0.8,0.8037214885954381,0.8028329964143595,5.524226665496826,0.8028329964143595
201,8,SVC Classifier,1,0.8,0.8301320528211285,0.820445903777974,9.429944038391113,0.820445903777974
202,8,Decision Tree,1,0.8,0.7388955582232893,0.7386141788227422,0.4016551971435547,0.7386141788227422
203,8,RandomForest,1,0.8,0.7689075630252101,0.7478814633285703,1.0204527378082275,0.7478814633285703
204,8,AdaBoost (Discrete),1,0.8,0.8211284513805522,0.8210638582512096,128.99331283569336,0.8210638582512096
205,8,AdaBoost (Real),1,0.8,0.8217286914765907,0.8217592457732444,148.3008964061737,0.8217592457732444
206,8,Logistic Regression (Penalty = L2),1,0.8,0.8469387755102041,0.8465991753934167,0.6313860416412354,0.8465991753934167
207,8,Naive Bayes,1,0.8,0.7971188475390156,0.7705360588201597,0.16378378868103027,0.7705360588201597
208,8,KNeighbors Classifier,2,0.8,0.8073229291716687,0.8061645597309036,5.654472589492798,0.8061645597309036
209,8,SVC Classifier,2,0.8,0.8391356542617047,0.8236661315632703,8.979357481002808,0.8236661315632703
210,8,Decision Tree,2,0.8,0.7274909963985594,0.7275283208006853,0.21776914596557617,0.7275283208006853
211,8,RandomForest,2,0.8,0.7857142857142857,0.7580085582270358,0.8068270683288574,0.7580085582270358
212,8,AdaBoost (Discrete),2,0.8,0.8421368547418968,0.8420869730525725,125.34466814994812,0.8420869730525725
213,8,AdaBoost (Real),2,0.8,0.8391356542617047,0.8390827846243155,145.38242530822754,0.8390827846243155
214,8,Logistic Regression (Penalty = L2),2,0.8,0.8649459783913566,0.8636920369076319,0.5280301570892334,0.8636920369076319
215,8,Naive Bayes,2,0.8,0.8151260504201681,0.7857675443286437,0.13949894905090332,0.7857675443286437
