,feat_set_id,classifier,fold_id,feat_th,score,geo_score,exec_t,geo_score_woz
0,0,KNeighbors Classifier,0,0.9,0.9845070422535211,0.982159326625035,2.3817477226257324,0.982159326625035
1,0,SVC Classifier,0,0.9,0.9098591549295775,0.4530153324120529,1.1859855651855469,0.4530153324120529
2,0,Decision Tree,0,0.9,0.7464788732394366,0.595401569517518,0.0763099193572998,0.595401569517518
3,0,RandomForest,0,0.9,0.8915492957746479,0.3749912810974161,0.6895887851715088,0.3749912810974161
4,0,AdaBoost (Discrete),0,0.9,0.9084507042253521,0.9084952919219376,70.82826519012451,0.9084952919219376
5,0,AdaBoost (Real),0,0.9,0.9225352112676056,0.9549831003988399,77.52782821655273,0.9549831003988399
6,0,Logistic Regression (Penalty = L2),0,0.9,0.9690140845070423,0.97267806264422,0.6260743141174316,0.97267806264422
7,0,Naive Bayes,0,0.9,0.9507042253521126,0.9702867514474461,0.21714568138122559,0.9702867514474461
8,0,KNeighbors Classifier,1,0.9,0.9830747531734838,0.9556298780069972,1.6334569454193115,0.9556298780069972
9,0,SVC Classifier,1,0.9,0.9760225669957687,0.9369604361556937,1.1364319324493408,0.9369604361556937
10,0,Decision Tree,1,0.9,0.9365303244005642,0.8383847237413684,0.09979796409606934,0.8383847237413684
11,0,RandomForest,1,0.9,0.9069111424541608,0.7036020988556314,0.6278214454650879,0.7036020988556314
12,0,AdaBoost (Discrete),1,0.9,0.9647390691114246,0.896062730767775,63.08257579803467,0.896062730767775
13,0,AdaBoost (Real),1,0.9,0.9703808180535967,0.9464991596806728,72.19975590705872,0.9464991596806728
14,0,Logistic Regression (Penalty = L2),1,0.9,0.9732016925246827,0.9576354655560266,0.4710826873779297,0.9576354655560266
15,0,Naive Bayes,1,0.9,0.9449929478138223,0.9572389865467684,0.1745140552520752,0.9572389865467684
16,0,KNeighbors Classifier,2,0.9,0.9632248939179632,0.9165181743727414,1.5106587409973145,0.9165181743727414
17,0,SVC Classifier,2,0.9,0.9858557284299858,0.9647590595276887,1.0497488975524902,0.9647590595276887
18,0,Decision Tree,2,0.9,0.7595473833097596,0.812544108560507,0.09148120880126953,0.812544108560507
19,0,RandomForest,2,0.9,0.7779349363507779,0.7669056613788154,0.6083605289459229,0.7669056613788154
20,0,AdaBoost (Discrete),2,0.9,0.9236209335219236,0.9263480050091923,61.03848195075989,0.9263480050091923
21,0,AdaBoost (Real),2,0.9,0.8783592644978784,0.9153408479547385,71.86035895347595,0.9153408479547385
22,0,Logistic Regression (Penalty = L2),2,0.9,0.9632248939179632,0.9233601839295728,0.5424594879150391,0.9233601839295728
23,0,Naive Bayes,2,0.9,0.925035360678925,0.9504885650651899,0.09331107139587402,0.9504885650651899
24,1,KNeighbors Classifier,0,0.9,0.9802816901408451,0.9775023353024564,1.9890110492706299,0.9775023353024564
25,1,SVC Classifier,0,0.9,0.9098591549295775,0.4530153324120529,1.1584463119506836,0.4530153324120529
26,1,Decision Tree,0,0.9,0.8943661971830986,0.9228038702212523,0.1811518669128418,0.9228038702212523
27,1,RandomForest,0,0.9,0.8859154929577465,0.4178054790383972,0.5673789978027344,0.4178054790383972
28,1,AdaBoost (Discrete),0,0.9,0.8985915492957747,0.9359389158981621,69.40931606292725,0.9359389158981621
29,1,AdaBoost (Real),0,0.9,0.9056338028169014,0.9371661354896692,81.4151394367218,0.9371661354896692
30,1,Logistic Regression (Penalty = L2),0,0.9,0.976056338028169,0.9756988213620513,0.5024957656860352,0.9756988213620513
31,1,Naive Bayes,0,0.9,0.9788732394366197,0.9769019037414889,0.10608267784118652,0.9769019037414889
32,1,KNeighbors Classifier,1,0.9,0.9788434414668548,0.9538955186996372,1.9433934688568115,0.9538955186996372
33,1,SVC Classifier,1,0.9,0.9760225669957687,0.9369604361556937,1.3763456344604492,0.9369604361556937
34,1,Decision Tree,1,0.9,0.9337094499294781,0.8087192569417494,0.09728264808654785,0.8087192569417494
35,1,RandomForest,1,0.9,0.8617771509167842,0.520214083969102,0.5891213417053223,0.520214083969102
36,1,AdaBoost (Discrete),1,0.9,0.9703808180535967,0.9184735248681712,66.74602508544922,0.9184735248681712
37,1,AdaBoost (Real),1,0.9,0.9590973201692524,0.9447528473012373,85.93652820587158,0.9447528473012373
38,1,Logistic Regression (Penalty = L2),1,0.9,0.9746121297602257,0.9490713616260787,0.6775283813476562,0.9490713616260787
39,1,Naive Bayes,1,0.9,0.9703808180535967,0.94733313179832,0.2030036449432373,0.94733313179832
40,1,KNeighbors Classifier,2,0.9,0.9618104667609618,0.908960200834328,2.0011982917785645,0.908960200834328
41,1,SVC Classifier,2,0.9,0.9858557284299858,0.9647590595276887,1.2032780647277832,0.9647590595276887
42,1,Decision Tree,2,0.9,0.9094766619519095,0.8052608944036866,0.16974377632141113,0.8052608944036866
43,1,RandomForest,2,0.9,0.925035360678925,0.7977364724453543,0.8434064388275146,0.7977364724453543
44,1,AdaBoost (Discrete),2,0.9,0.8896746817538896,0.928973453621324,75.57712864875793,0.928973453621324
45,1,AdaBoost (Real),2,0.9,0.8741159830268741,0.9190611601997947,84.81509137153625,0.9190611601997947
46,1,Logistic Regression (Penalty = L2),2,0.9,0.9646393210749646,0.9272894235345064,0.5568392276763916,0.9272894235345064
47,1,Naive Bayes,2,0.9,0.9264497878359265,0.9511167797656402,0.17424654960632324,0.9511167797656402
48,2,KNeighbors Classifier,0,0.9,0.9816901408450704,0.9781020301371197,2.2027111053466797,0.9781020301371197
49,2,SVC Classifier,0,0.9,0.9098591549295775,0.4530153324120529,1.2773194313049316,0.4530153324120529
50,2,Decision Tree,0,0.9,0.8464788732394366,0.7627846077503113,0.0032880306243896484,0.7627846077503113
51,2,RandomForest,0,0.9,0.8873239436619719,0.39682761430674834,0.7265338897705078,0.39682761430674834
52,2,AdaBoost (Discrete),0,0.9,0.9098591549295775,0.911671874731986,71.93690204620361,0.911671874731986
53,2,AdaBoost (Real),0,0.9,0.9507042253521126,0.9561854725851735,82.63594198226929,0.9561854725851735
54,2,Logistic Regression (Penalty = L2),0,0.9,0.9732394366197183,0.9716260435082653,0.5373044013977051,0.9716260435082653
55,2,Naive Bayes,0,0.9,0.971830985915493,0.976722909042524,0.09308767318725586,0.976722909042524
56,2,KNeighbors Classifier,1,0.9,0.9774330042313117,0.9533159951555966,1.939056158065796,0.9533159951555966
57,2,SVC Classifier,1,0.9,0.9760225669957687,0.9369604361556937,1.3006656169891357,0.9369604361556937
58,2,Decision Tree,1,0.9,0.9421720733427362,0.8630106256275292,0.08985352516174316,0.8630106256275292
59,2,RandomForest,1,0.9,0.8519040902679831,0.20661603808781434,0.7410562038421631,0.20661603808781434
60,2,AdaBoost (Discrete),1,0.9,0.9703808180535967,0.9184735248681712,74.52520036697388,0.9184735248681712
61,2,AdaBoost (Real),1,0.9,0.9689703808180536,0.9459177718441664,89.49117994308472,0.9459177718441664
62,2,Logistic Regression (Penalty = L2),1,0.9,0.9717912552891397,0.9540352982417448,0.5721728801727295,0.9540352982417448
63,2,Naive Bayes,1,0.9,0.9407616361071932,0.9553910302394867,0.10219216346740723,0.9553910302394867
64,2,KNeighbors Classifier,2,0.9,0.9702970297029703,0.9328911153651869,2.1349778175354004,0.9328911153651869
65,2,SVC Classifier,2,0.9,0.9872701555869873,0.9683996942491399,1.2564928531646729,0.9683996942491399
66,2,Decision Tree,2,0.9,0.6732673267326733,0.7169838262916173,0.10139989852905273,0.7169838262916173
67,2,RandomForest,2,0.9,0.9052333804809052,0.6949896663151152,0.688481330871582,0.6949896663151152
68,2,AdaBoost (Discrete),2,0.9,0.917963224893918,0.9081824932931816,77.01096367835999,0.9081824932931816
69,2,AdaBoost (Real),2,0.9,0.9603960396039604,0.954136995783688,84.89713859558105,0.954136995783688
70,2,Logistic Regression (Penalty = L2),2,0.9,0.9561527581329562,0.9102509470933294,0.6455135345458984,0.9102509470933294
71,2,Naive Bayes,2,0.9,0.9165487977369166,0.949483060316506,0.09814190864562988,0.949483060316506
72,3,KNeighbors Classifier,0,0.9,0.9802816901408451,0.9775023353024564,1.9711315631866455,0.9775023353024564
73,3,SVC Classifier,0,0.9,0.9098591549295775,0.4530153324120529,1.2042057514190674,0.4530153324120529
74,3,Decision Tree,0,0.9,0.7915492957746478,0.8079246352901159,0.09295177459716797,0.8079246352901159
75,3,RandomForest,0,0.9,0.8901408450704226,0.4236090741960986,0.7176027297973633,0.4236090741960986
76,3,AdaBoost (Discrete),0,0.9,0.8985915492957747,0.9359389158981621,76.66817808151245,0.9359389158981621
77,3,AdaBoost (Real),0,0.9,0.9112676056338028,0.9498727251179918,90.62635898590088,0.9498727251179918
78,3,Logistic Regression (Penalty = L2),0,0.9,0.9704225352112676,0.9704227902110237,0.48423218727111816,0.9704227902110237
79,3,Naive Bayes,0,0.9,0.956338028169014,0.9727683140489758,0.19112110137939453,0.9727683140489758
80,3,KNeighbors Classifier,1,0.9,0.9774330042313117,0.9439461898203826,1.9928092956542969,0.9439461898203826
81,3,SVC Classifier,1,0.9,0.9760225669957687,0.9369604361556937,1.4033668041229248,0.9369604361556937
82,3,Decision Tree,1,0.9,0.9435825105782792,0.8665720977693282,0.2009122371673584,0.8665720977693282
83,3,RandomForest,1,0.9,0.9125528913963329,0.6917586769933158,0.6140987873077393,0.6917586769933158
84,3,AdaBoost (Discrete),1,0.9,0.9703808180535967,0.9184735248681712,81.7073814868927,0.9184735248681712
85,3,AdaBoost (Real),1,0.9,0.9661495063469676,0.9417817414139021,88.3967695236206,0.9417817414139021
86,3,Logistic Regression (Penalty = L2),1,0.9,0.9746121297602257,0.9612087653242375,0.5684936046600342,0.9612087653242375
87,3,Naive Bayes,1,0.9,0.9788434414668548,0.9659387179965133,0.11309242248535156,0.9659387179965133
88,3,KNeighbors Classifier,2,0.9,0.9632248939179632,0.9130363100692748,1.8527441024780273,0.9130363100692748
89,3,SVC Classifier,2,0.9,0.983026874115983,0.9573941993397243,1.222985029220581,0.9573941993397243
90,3,Decision Tree,2,0.9,0.7991513437057991,0.806743252836849,0.1083071231842041,0.806743252836849
91,3,RandomForest,2,0.9,0.7114568599717115,0.7312473090133281,0.8368721008300781,0.7312473090133281
92,3,AdaBoost (Discrete),2,0.9,0.9123055162659123,0.9090199693905784,75.59616231918335,0.9090199693905784
93,3,AdaBoost (Real),2,0.9,0.8797736916548797,0.9012136036456312,82.55247330665588,0.9012136036456312
94,3,Logistic Regression (Penalty = L2),2,0.9,0.9660537482319661,0.9278562265017649,0.41182780265808105,0.9278562265017649
95,3,Naive Bayes,2,0.9,0.9236209335219236,0.9470322124854477,0.16615533828735352,0.9470322124854477
96,4,KNeighbors Classifier,0,0.9,0.976056338028169,0.9785417640983738,1.7907061576843262,0.9785417640983738
97,4,SVC Classifier,0,0.9,0.9098591549295775,0.4530153324120529,1.2163817882537842,0.4530153324120529
98,4,Decision Tree,0,0.9,0.7845070422535211,0.7879418555082588,0.17012262344360352,0.7879418555082588
99,4,RandomForest,0,0.9,0.8845070422535212,0.41583466917384043,0.7333846092224121,0.41583466917384043
100,4,AdaBoost (Discrete),0,0.9,0.9225352112676056,0.9549831003988399,68.79271650314331,0.9549831003988399
101,4,AdaBoost (Real),0,0.9,0.9225352112676056,0.9467050573639888,79.06224083900452,0.9467050573639888
102,4,Logistic Regression (Penalty = L2),0,0.9,0.976056338028169,0.9756988213620513,0.47586989402770996,0.9756988213620513
103,4,Naive Bayes,0,0.9,0.9788732394366197,0.9769019037414889,0.09790253639221191,0.9769019037414889
104,4,KNeighbors Classifier,1,0.9,0.9802538787023978,0.9544743389379742,1.5845997333526611,0.9544743389379742
105,4,SVC Classifier,1,0.9,0.9760225669957687,0.9369604361556937,1.2143492698669434,0.9369604361556937
106,4,Decision Tree,1,0.9,0.9605077574047954,0.9322024617922124,0.08820247650146484,0.9322024617922124
107,4,RandomForest,1,0.9,0.9069111424541608,0.6996202440643257,0.6977598667144775,0.6996202440643257
108,4,AdaBoost (Discrete),1,0.9,0.9703808180535967,0.9184735248681712,69.92920994758606,0.9184735248681712
109,4,AdaBoost (Real),1,0.9,0.9661495063469676,0.9506008026131746,79.28816413879395,0.9506008026131746
110,4,Logistic Regression (Penalty = L2),1,0.9,0.9802538787023978,0.9513791430198305,0.492936372756958,0.9513791430198305
111,4,Naive Bayes,1,0.9,0.9774330042313117,0.965347568082647,0.17487430572509766,0.965347568082647
112,4,KNeighbors Classifier,2,0.9,0.958981612446959,0.911367135761647,1.6643726825714111,0.911367135761647
113,4,SVC Classifier,2,0.9,0.9858557284299858,0.9647590595276887,1.1131815910339355,0.9647590595276887
114,4,Decision Tree,2,0.9,0.8543140028288543,0.7668756203854215,0.07343316078186035,0.7668756203854215
115,4,RandomForest,2,0.9,0.925035360678925,0.8235899415609882,0.7493793964385986,0.8235899415609882
116,4,AdaBoost (Discrete),2,0.9,0.8274398868458275,0.874609252990128,65.95850205421448,0.874609252990128
117,4,AdaBoost (Real),2,0.9,0.8189533239038189,0.8902889122327047,77.17050909996033,0.8902889122327047
118,4,Logistic Regression (Penalty = L2),2,0.9,0.9660537482319661,0.9278562265017649,0.4357028007507324,0.9278562265017649
119,4,Naive Bayes,2,0.9,0.9264497878359265,0.9511167797656402,0.1782224178314209,0.9511167797656402
120,5,KNeighbors Classifier,0,0.9,0.9830985915492958,0.9815582497756241,1.755117654800415,0.9815582497756241
121,5,SVC Classifier,0,0.9,0.9098591549295775,0.4530153324120529,1.0477111339569092,0.4530153324120529
122,5,Decision Tree,0,0.9,0.9056338028169014,0.744332862988078,0.15024375915527344,0.744332862988078
123,5,RandomForest,0,0.9,0.8788732394366198,0.3856433678528698,0.697840690612793,0.3856433678528698
124,5,AdaBoost (Discrete),0,0.9,0.9380281690140845,0.9369732841955367,64.7658097743988,0.9369732841955367
125,5,AdaBoost (Real),0,0.9,0.9591549295774648,0.9684172155028844,72.23492646217346,0.9684172155028844
126,5,Logistic Regression (Penalty = L2),0,0.9,0.9732394366197183,0.9716260435082653,0.4906449317932129,0.9716260435082653
127,5,Naive Bayes,0,0.9,0.9732394366197183,0.9773299464325066,0.17413878440856934,0.9773299464325066
128,5,KNeighbors Classifier,1,0.9,0.9732016925246827,0.951573183233863,1.5163781642913818,0.951573183233863
129,5,SVC Classifier,1,0.9,0.9760225669957687,0.9369604361556937,1.2550392150878906,0.9369604361556937
130,5,Decision Tree,1,0.9,0.9026798307475318,0.7356946806060302,0.08392930030822754,0.7356946806060302
131,5,RandomForest,1,0.9,0.9337094499294781,0.7927843292491847,0.6734294891357422,0.7927843292491847
132,5,AdaBoost (Discrete),1,0.9,0.9703808180535967,0.9184735248681712,63.32983064651489,0.9184735248681712
133,5,AdaBoost (Real),1,0.9,0.9576868829337094,0.9292317088069745,72.34666013717651,0.9292317088069745
134,5,Logistic Regression (Penalty = L2),1,0.9,0.9717912552891397,0.9540352982417448,0.4506196975708008,0.9540352982417448
135,5,Naive Bayes,1,0.9,0.9421720733427362,0.9560078096427188,0.08625531196594238,0.9560078096427188
136,5,KNeighbors Classifier,2,0.9,0.9745403111739745,0.9444094529352037,1.6886193752288818,0.9444094529352037
137,5,SVC Classifier,2,0.9,0.9872701555869873,0.9683996942491399,1.0174601078033447,0.9683996942491399
138,5,Decision Tree,2,0.9,0.7411598302687411,0.8093032253227074,0.09245657920837402,0.8093032253227074
139,5,RandomForest,2,0.9,0.9306930693069307,0.8000457951581081,0.671198844909668,0.8000457951581081
140,5,AdaBoost (Discrete),2,0.9,0.9165487977369166,0.9352683509098562,60.276437520980835,0.9352683509098562
141,5,AdaBoost (Real),2,0.9,0.8727015558698727,0.8888535638173838,65.53732800483704,0.8888535638173838
142,5,Logistic Regression (Penalty = L2),2,0.9,0.9575671852899575,0.914278658607291,0.4530184268951416,0.914278658607291
143,5,Naive Bayes,2,0.9,0.9165487977369166,0.949483060316506,0.1537022590637207,0.949483060316506
144,6,KNeighbors Classifier,0,0.9,0.9830985915492958,0.9787009905012263,1.6019539833068848,0.9787009905012263
145,6,SVC Classifier,0,0.9,0.9098591549295775,0.4530153324120529,0.9143106937408447,0.4530153324120529
146,6,Decision Tree,0,0.9,0.9028169014084507,0.9172146302868841,0.07712340354919434,0.9172146302868841
147,6,RandomForest,0,0.9,0.8887323943661972,0.3986314009794656,0.5997557640075684,0.3986314009794656
148,6,AdaBoost (Discrete),0,0.9,0.8873239436619719,0.9147000844306636,58.75247669219971,0.9147000844306636
149,6,AdaBoost (Real),0,0.9,0.9309859154929577,0.9587802898460202,61.299556493759155,0.9587802898460202
150,6,Logistic Regression (Penalty = L2),0,0.9,0.9732394366197183,0.9744927647293644,0.37075281143188477,0.9744927647293644
151,6,Naive Bayes,0,0.9,0.9549295774647887,0.9721491106263808,0.06588149070739746,0.9721491106263808
152,6,KNeighbors Classifier,1,0.9,0.9774330042313117,0.9439461898203826,1.1607649326324463,0.9439461898203826
153,6,SVC Classifier,1,0.9,0.9760225669957687,0.9369604361556937,0.8392503261566162,0.9369604361556937
154,6,Decision Tree,1,0.9,0.9097320169252469,0.8074160389492888,0.06471586227416992,0.8074160389492888
155,6,RandomForest,1,0.9,0.9308885754583921,0.7848161082391636,0.5982112884521484,0.7848161082391636
156,6,AdaBoost (Discrete),1,0.9,0.9703808180535967,0.9184735248681712,50.239505767822266,0.9184735248681712
157,6,AdaBoost (Real),1,0.9,0.9703808180535967,0.9494473484695629,52.816017627716064,0.9494473484695629
158,6,Logistic Regression (Penalty = L2),1,0.9,0.9732016925246827,0.9576354655560266,0.3456137180328369,0.9576354655560266
159,6,Naive Bayes,1,0.9,0.9802538787023978,0.9694640730328093,0.061856746673583984,0.9694640730328093
160,6,KNeighbors Classifier,2,0.9,0.9618104667609618,0.9124805970226375,1.0864617824554443,0.9124805970226375
161,6,SVC Classifier,2,0.9,0.983026874115983,0.9573941993397243,0.8252813816070557,0.9573941993397243
162,6,Decision Tree,2,0.9,0.7666195190947667,0.8537299833314582,0.06373381614685059,0.8537299833314582
163,6,RandomForest,2,0.9,0.8826025459688827,0.6322913324668414,0.42192745208740234,0.6322913324668414
164,6,AdaBoost (Discrete),2,0.9,0.9236209335219236,0.9263480050091923,41.69980025291443,0.9263480050091923
165,6,AdaBoost (Real),2,0.9,0.8628005657708628,0.908234880809289,48.78815722465515,0.908234880809289
166,6,Logistic Regression (Penalty = L2),2,0.9,0.9618104667609618,0.922795091876601,0.3136930465698242,0.922795091876601
167,6,Naive Bayes,2,0.9,0.9236209335219236,0.9470322124854477,0.0983726978302002,0.9470322124854477
168,7,KNeighbors Classifier,0,0.9,0.9816901408450704,0.9781020301371197,1.040513515472412,0.9781020301371197
169,7,SVC Classifier,0,0.9,0.9098591549295775,0.4530153324120529,0.6221561431884766,0.4530153324120529
170,7,Decision Tree,0,0.9,0.8619718309859155,0.7154712389612199,0.10194516181945801,0.7154712389612199
171,7,RandomForest,0,0.9,0.8774647887323944,0.35799958999654113,0.4316127300262451,0.35799958999654113
172,7,AdaBoost (Discrete),0,0.9,0.8971830985915493,0.935297861645616,37.857731103897095,0.935297861645616
173,7,AdaBoost (Real),0,0.9,0.9478873239436619,0.9558396760111046,41.11229968070984,0.9558396760111046
174,7,Logistic Regression (Penalty = L2),0,0.9,0.976056338028169,0.9756988213620513,0.29845595359802246,0.9756988213620513
175,7,Naive Bayes,0,0.9,0.9802816901408451,0.9775023353024564,0.054084062576293945,0.9775023353024564
176,7,KNeighbors Classifier,1,0.9,0.9802538787023978,0.9544743389379742,0.84855055809021,0.9544743389379742
177,7,SVC Classifier,1,0.9,0.9760225669957687,0.9369604361556937,0.6514337062835693,0.9369604361556937
178,7,Decision Tree,1,0.9,0.9449929478138223,0.9119070199310163,0.08533954620361328,0.9119070199310163
179,7,RandomForest,1,0.9,0.9153737658674189,0.737781978505854,0.3555612564086914,0.737781978505854
180,7,AdaBoost (Discrete),1,0.9,0.9703808180535967,0.9184735248681712,33.439732789993286,0.9184735248681712
181,7,AdaBoost (Real),1,0.9,0.9520451339915373,0.9558914668910419,37.51060748100281,0.9558914668910419
182,7,Logistic Regression (Penalty = L2),1,0.9,0.9788434414668548,0.9538955186996372,0.23766517639160156,0.9538955186996372
183,7,Naive Bayes,1,0.9,0.9717912552891397,0.9509908249591341,0.10028886795043945,0.9509908249591341
184,7,KNeighbors Classifier,2,0.9,0.9702970297029703,0.9328911153651869,0.8534843921661377,0.9328911153651869
185,7,SVC Classifier,2,0.9,0.9872701555869873,0.9683996942491399,0.4981729984283447,0.9683996942491399
186,7,Decision Tree,2,0.9,0.6888260254596889,0.7841626419068926,0.07745194435119629,0.7841626419068926
187,7,RandomForest,2,0.9,0.9349363507779349,0.8145952605512168,0.3549494743347168,0.8145952605512168
188,7,AdaBoost (Discrete),2,0.9,0.9024045261669024,0.9201998328358166,30.60028600692749,0.9201998328358166
189,7,AdaBoost (Real),2,0.9,0.942008486562942,0.9246399490302454,35.80870199203491,0.9246399490302454
190,7,Logistic Regression (Penalty = L2),2,0.9,0.9646393210749646,0.9272894235345064,0.26633381843566895,0.9272894235345064
191,7,Naive Bayes,2,0.9,0.9151343705799151,0.9488458231718553,0.05348968505859375,0.9488458231718553
192,8,KNeighbors Classifier,0,0.9,0.9802816901408451,0.9775023353024564,0.7677876949310303,0.9775023353024564
193,8,SVC Classifier,0,0.9,0.9098591549295775,0.4530153324120529,0.5660135746002197,0.4530153324120529
194,8,Decision Tree,0,0.9,0.8464788732394366,0.6241821776928115,0.044950008392333984,0.6241821776928115
195,8,RandomForest,0,0.9,0.8760563380281691,0.356209562137551,0.39768099784851074,0.356209562137551
196,8,AdaBoost (Discrete),0,0.9,0.8985915492957747,0.9359389158981621,33.173078775405884,0.9359389158981621
197,8,AdaBoost (Real),0,0.9,0.956338028169014,0.9671929193612767,34.93099761009216,0.9671929193612767
198,8,Logistic Regression (Penalty = L2),0,0.9,0.9732394366197183,0.9744927647293644,0.22159838676452637,0.9744927647293644
199,8,Naive Bayes,0,0.9,0.9788732394366197,0.9769019037414889,0.058141469955444336,0.9769019037414889
200,8,KNeighbors Classifier,1,0.9,0.9732016925246827,0.9422299202348479,0.7334733009338379,0.9422299202348479
201,8,SVC Classifier,1,0.9,0.9760225669957687,0.9369604361556937,0.485121488571167,0.9369604361556937
202,8,Decision Tree,1,0.9,0.8843441466854725,0.7974980613473904,0.06960844993591309,0.7974980613473904
203,8,RandomForest,1,0.9,0.8913963328631875,0.6404617959454333,0.28522586822509766,0.6404617959454333
204,8,AdaBoost (Discrete),1,0.9,0.9703808180535967,0.9184735248681712,29.465179681777954,0.9184735248681712
205,8,AdaBoost (Real),1,0.9,0.9506346967559943,0.941201111339836,33.38810873031616,0.941201111339836
206,8,Logistic Regression (Penalty = L2),1,0.9,0.9816643159379408,0.9550524580005479,0.2568202018737793,0.9550524580005479
207,8,Naive Bayes,1,0.9,0.9717912552891397,0.9509908249591341,0.040367841720581055,0.9509908249591341
208,8,KNeighbors Classifier,2,0.9,0.9618104667609618,0.908960200834328,0.7269093990325928,0.908960200834328
209,8,SVC Classifier,2,0.9,0.983026874115983,0.9573941993397243,0.4844341278076172,0.9573941993397243
210,8,Decision Tree,2,0.9,0.9066478076379066,0.8515081059336334,0.07521700859069824,0.8515081059336334
211,8,RandomForest,2,0.9,0.8854314002828855,0.5982098719161879,0.31255197525024414,0.5982098719161879
212,8,AdaBoost (Discrete),2,0.9,0.8896746817538896,0.928973453621324,28.817115306854248,0.928973453621324
213,8,AdaBoost (Real),2,0.9,0.9137199434229137,0.9127918796891076,29.921382904052734,0.9127918796891076
214,8,Logistic Regression (Penalty = L2),2,0.9,0.9632248939179632,0.9233601839295728,0.1828463077545166,0.9233601839295728
215,8,Naive Bayes,2,0.9,0.9264497878359265,0.9511167797656402,0.0578305721282959,0.9511167797656402
216,9,KNeighbors Classifier,0,0.9,0.9802816901408451,0.9775023353024564,0.6372251510620117,0.9775023353024564
217,9,SVC Classifier,0,0.9,0.9098591549295775,0.4530153324120529,0.40879034996032715,0.4530153324120529
218,9,Decision Tree,0,0.9,0.8014084507042254,0.6855314991250611,0.033689260482788086,0.6855314991250611
219,9,RandomForest,0,0.9,0.8802816901408451,0.409807229497294,0.28244686126708984,0.409807229497294
220,9,AdaBoost (Discrete),0,0.9,0.9098591549295775,0.911671874731986,25.21164608001709,0.911671874731986
221,9,AdaBoost (Real),0,0.9,0.9253521126760563,0.9535161192936115,29.60924792289734,0.9535161192936115
222,9,Logistic Regression (Penalty = L2),0,0.9,0.9732394366197183,0.9716260435082653,0.2540616989135742,0.9716260435082653
223,9,Naive Bayes,0,0.9,0.9802816901408451,0.9775023353024564,0.042047977447509766,0.9775023353024564
224,9,KNeighbors Classifier,1,0.9,0.9675599435825106,0.9399317893528756,0.6224617958068848,0.9399317893528756
225,9,SVC Classifier,1,0.9,0.9760225669957687,0.9369604361556937,0.4798593521118164,0.9369604361556937
226,9,Decision Tree,1,0.9,0.8998589562764457,0.7922136245873087,0.03335285186767578,0.7922136245873087
227,9,RandomForest,1,0.9,0.9167842031029619,0.7423083615433299,0.2826828956604004,0.7423083615433299
228,9,AdaBoost (Discrete),1,0.9,0.9703808180535967,0.9184735248681712,31.207173109054565,0.9184735248681712
229,9,AdaBoost (Real),1,0.9,0.9732016925246827,0.9476597974586187,44.8255410194397,0.9476597974586187
230,9,Logistic Regression (Penalty = L2),1,0.9,0.9732016925246827,0.9576354655560266,0.3502473831176758,0.9576354655560266
231,9,Naive Bayes,1,0.9,0.9788434414668548,0.9659387179965133,0.09495973587036133,0.9659387179965133
232,9,KNeighbors Classifier,2,0.9,0.9632248939179632,0.9165181743727414,1.1036574840545654,0.9165181743727414
233,9,SVC Classifier,2,0.9,0.9872701555869873,0.9683996942491399,0.7283985614776611,0.9683996942491399
234,9,Decision Tree,2,0.9,0.925035360678925,0.904537971597405,0.057050228118896484,0.904537971597405
235,9,RandomForest,2,0.9,0.925035360678925,0.7797826988083085,0.3913450241088867,0.7797826988083085
236,9,AdaBoost (Discrete),2,0.9,0.917963224893918,0.9081824932931816,38.32573318481445,0.9081824932931816
237,9,AdaBoost (Real),2,0.9,0.9236209335219236,0.9201342167608055,44.101943254470825,0.9201342167608055
238,9,Logistic Regression (Penalty = L2),2,0.9,0.9575671852899575,0.914278658607291,0.2513105869293213,0.914278658607291
239,9,Naive Bayes,2,0.9,0.9165487977369166,0.949483060316506,0.11417841911315918,0.949483060316506
240,10,KNeighbors Classifier,0,0.9,0.9802816901408451,0.9775023353024564,1.316640853881836,0.9775023353024564
241,10,SVC Classifier,0,0.9,0.9098591549295775,0.4530153324120529,0.6543517112731934,0.4530153324120529
242,10,Decision Tree,0,0.9,0.8816901408450705,0.9054908125599489,0.04578375816345215,0.9054908125599489
243,10,RandomForest,0,0.9,0.8647887323943662,0.34119311553145876,0.3364131450653076,0.34119311553145876
244,10,AdaBoost (Discrete),0,0.9,0.8985915492957747,0.9359389158981621,40.47837972640991,0.9359389158981621
245,10,AdaBoost (Real),0,0.9,0.928169014084507,0.9602312427864182,44.93512487411499,0.9602312427864182
246,10,Logistic Regression (Penalty = L2),0,0.9,0.9690140845070423,0.97267806264422,0.26825404167175293,0.97267806264422
247,10,Naive Bayes,0,0.9,0.9492957746478873,0.9696643736298215,0.12217307090759277,0.9696643736298215
248,10,KNeighbors Classifier,1,0.9,0.9816643159379408,0.9550524580005479,1.1131088733673096,0.9550524580005479
249,10,SVC Classifier,1,0.9,0.9760225669957687,0.9369604361556937,0.7631316184997559,0.9369604361556937
250,10,Decision Tree,1,0.9,0.9407616361071932,0.8879427088602699,0.04749178886413574,0.8879427088602699
251,10,RandomForest,1,0.9,0.8377997179125529,0.33429141325553335,0.4227919578552246,0.33429141325553335
252,10,AdaBoost (Discrete),1,0.9,0.9703808180535967,0.9184735248681712,39.986257791519165,0.9184735248681712
253,10,AdaBoost (Real),1,0.9,0.9788434414668548,0.9644932777531673,44.848464488983154,0.9644932777531673
254,10,Logistic Regression (Penalty = L2),1,0.9,0.9732016925246827,0.9576354655560266,0.29675936698913574,0.9576354655560266
255,10,Naive Bayes,1,0.9,0.9435825105782792,0.956623794226582,0.04826545715332031,0.956623794226582
256,10,KNeighbors Classifier,2,0.9,0.9632248939179632,0.9130363100692748,1.0588772296905518,0.9130363100692748
257,10,SVC Classifier,2,0.9,0.9858557284299858,0.9647590595276887,0.6637418270111084,0.9647590595276887
258,10,Decision Tree,2,0.9,0.7355021216407355,0.7715392101349896,0.04850625991821289,0.7715392101349896
259,10,RandomForest,2,0.9,0.8811881188118812,0.8114477237796156,0.38639092445373535,0.8114477237796156
260,10,AdaBoost (Discrete),2,0.9,0.8925035360678925,0.9128585555023241,39.41459608078003,0.9128585555023241
261,10,AdaBoost (Real),2,0.9,0.8613861386138614,0.9075833491073452,43.21972179412842,0.9075833491073452
262,10,Logistic Regression (Penalty = L2),2,0.9,0.9632248939179632,0.9233601839295728,0.2546567916870117,0.9233601839295728
263,10,Naive Bayes,2,0.9,0.925035360678925,0.9504885650651899,0.10625123977661133,0.9504885650651899
264,11,KNeighbors Classifier,0,0.9,0.9802816901408451,0.9775023353024564,1.3875877857208252,0.9775023353024564
265,11,SVC Classifier,0,0.9,0.9098591549295775,0.4530153324120529,0.6819345951080322,0.4530153324120529
266,11,Decision Tree,0,0.9,0.7577464788732394,0.8075903071416882,0.09406042098999023,0.8075903071416882
267,11,RandomForest,0,0.9,0.7943661971830986,0.18323535414199785,0.4404282569885254,0.18323535414199785
268,11,AdaBoost (Discrete),0,0.9,0.8985915492957747,0.9359389158981621,37.810094356536865,0.9359389158981621
269,11,AdaBoost (Real),0,0.9,0.9323943661971831,0.9566589110328738,42.74854826927185,0.9566589110328738
270,11,Logistic Regression (Penalty = L2),0,0.9,0.971830985915493,0.976722909042524,0.29320526123046875,0.976722909042524
271,11,Naive Bayes,0,0.9,0.9492957746478873,0.9696643736298215,0.11101031303405762,0.9696643736298215
272,11,KNeighbors Classifier,1,0.9,0.9802538787023978,0.9544743389379742,1.269444227218628,0.9544743389379742
273,11,SVC Classifier,1,0.9,0.9760225669957687,0.9369604361556937,0.8437888622283936,0.9369604361556937
274,11,Decision Tree,1,0.9,0.92524682651622,0.8810668766915336,0.06129741668701172,0.8810668766915336
275,11,RandomForest,1,0.9,0.8547249647390691,0.4773726345225945,0.3402271270751953,0.4773726345225945
276,11,AdaBoost (Discrete),1,0.9,0.9703808180535967,0.9184735248681712,38.01141810417175,0.9184735248681712
277,11,AdaBoost (Real),1,0.9,0.9689703808180536,0.9399317893528756,40.886985063552856,0.9399317893528756
278,11,Logistic Regression (Penalty = L2),1,0.9,0.9732016925246827,0.9576354655560266,0.34725189208984375,0.9576354655560266
279,11,Naive Bayes,1,0.9,0.9478138222849083,0.9584670045533571,0.09402179718017578,0.9584670045533571
280,11,KNeighbors Classifier,2,0.9,0.9632248939179632,0.9130363100692748,1.0141866207122803,0.9130363100692748
281,11,SVC Classifier,2,0.9,0.9844413012729845,0.9610907387064838,0.6735866069793701,0.9610907387064838
282,11,Decision Tree,2,0.9,0.826025459688826,0.6438611743383453,0.003550291061401367,0.6438611743383453
283,11,RandomForest,2,0.9,0.8571428571428571,0.4883038891273956,0.34206509590148926,0.4883038891273956
284,11,AdaBoost (Discrete),2,0.9,0.9490806223479491,0.9307725490478811,36.24442172050476,0.9307725490478811
285,11,AdaBoost (Real),2,0.9,0.9066478076379066,0.9001939754350743,40.32385277748108,0.9001939754350743
286,11,Logistic Regression (Penalty = L2),2,0.9,0.9646393210749646,0.920520487912849,0.23955607414245605,0.920520487912849
287,11,Naive Bayes,2,0.9,0.925035360678925,0.9504885650651899,0.08719229698181152,0.9504885650651899
288,12,KNeighbors Classifier,0,0.9,0.9816901408450704,0.9781020301371197,0.6814477443695068,0.9781020301371197
289,12,SVC Classifier,0,0.9,0.9098591549295775,0.4530153324120529,0.5743625164031982,0.4530153324120529
290,12,Decision Tree,0,0.9,0.923943661971831,0.8514719418515965,0.04503607749938965,0.8514719418515965
291,12,RandomForest,0,0.9,0.8845070422535212,0.41583466917384043,0.3896620273590088,0.41583466917384043
292,12,AdaBoost (Discrete),0,0.9,0.9169014084507042,0.9346450395855028,31.175681591033936,0.9346450395855028
293,12,AdaBoost (Real),0,0.9,0.9422535211267605,0.9582225929772319,36.24031376838684,0.9582225929772319
294,12,Logistic Regression (Penalty = L2),0,0.9,0.9788732394366197,0.9740236498818724,0.20009112358093262,0.9740236498818724
295,12,Naive Bayes,0,0.9,0.9802816901408451,0.9775023353024564,0.04527401924133301,0.9775023353024564
296,12,KNeighbors Classifier,1,0.9,0.9661495063469676,0.9393554974920645,0.6900591850280762,0.9393554974920645
297,12,SVC Classifier,1,0.9,0.9760225669957687,0.9369604361556937,0.6335005760192871,0.9369604361556937
298,12,Decision Tree,1,0.9,0.9337094499294781,0.8431368240026867,0.04532361030578613,0.8431368240026867
299,12,RandomForest,1,0.9,0.918194640338505,0.7467802065264946,0.34447479248046875,0.7467802065264946
300,12,AdaBoost (Discrete),1,0.9,0.9703808180535967,0.9184735248681712,31.83765482902527,0.9184735248681712
301,12,AdaBoost (Real),1,0.9,0.9294781382228491,0.9350340042365776,36.99272799491882,0.9350340042365776
302,12,Logistic Regression (Penalty = L2),1,0.9,0.9830747531734838,0.9556298780069972,0.2028489112854004,0.9556298780069972
303,12,Naive Bayes,1,0.9,0.9760225669957687,0.9617984641011921,0.06101083755493164,0.9617984641011921
304,12,KNeighbors Classifier,2,0.9,0.9646393210749646,0.9170763463586894,0.7391202449798584,0.9170763463586894
305,12,SVC Classifier,2,0.9,0.9872701555869873,0.9683996942491399,0.5286920070648193,0.9683996942491399
306,12,Decision Tree,2,0.9,0.7496463932107497,0.6906615029544804,0.04466986656188965,0.6906615029544804
307,12,RandomForest,2,0.9,0.8543140028288543,0.7477883238659658,0.34387874603271484,0.0
308,12,AdaBoost (Discrete),2,0.9,0.8939179632248939,0.9134803939476943,30.46011519432068,0.9134803939476943
309,12,AdaBoost (Real),2,0.9,0.85997171145686,0.8983160849200743,36.530091762542725,0.8983160849200743
310,12,Logistic Regression (Penalty = L2),2,0.9,0.958981612446959,0.91483956590051,0.1973714828491211,0.91483956590051
311,12,Naive Bayes,2,0.9,0.9151343705799151,0.9488458231718553,0.09419703483581543,0.9488458231718553
