,feat_set_id,classifier,fold_id,feat_th,score,geo_score,exec_t,geo_score_woz
0,0,KNeighbors Classifier,0,0.3,0.7404458598726115,0.8634795796129672,5.768258333206177,0.0
1,0,SVC Classifier,0,0.3,0.6868365180467091,0.7692355080710747,9.72686243057251,0.0
2,0,Decision Tree,0,0.3,0.6847133757961783,0.8447161085211952,0.10340356826782227,0.0
3,0,RandomForest,0,0.3,0.5981953290870489,0.6909553927994988,0.5810532569885254,0.0
4,0,AdaBoost (Discrete),0,0.3,0.7584925690021231,0.865222673015697,40.77707529067993,0.0
5,0,AdaBoost (Real),0,0.3,0.351380042462845,0.4690360820330082,60.517786502838135,0.0
6,0,Logistic Regression (Penalty = L2),0,0.3,0.7346072186836518,0.8486899801791715,1.1008949279785156,0.0
7,0,Naive Bayes,0,0.3,0.5636942675159236,0.6917567592162651,0.22471880912780762,0.6917567592162651
8,0,KNeighbors Classifier,1,0.3,0.797979797979798,0.5942896671882717,6.472792625427246,0.0
9,0,SVC Classifier,1,0.3,0.7809675704412546,0.904308227594528,11.289289712905884,0.0
10,0,Decision Tree,1,0.3,0.7666135034556087,0.6169761377004175,0.11142110824584961,0.0
11,0,RandomForest,1,0.3,0.7395002658160553,0.9597707501592774,0.5067121982574463,0.0
12,0,AdaBoost (Discrete),1,0.3,0.7719298245614035,0.31432325533681865,46.32784366607666,0.0
13,0,AdaBoost (Real),1,0.3,0.37054758107389685,0.43561203273481164,88.27442717552185,0.0
14,0,Logistic Regression (Penalty = L2),1,0.3,0.7666135034556087,0.6169761377004175,1.0867908000946045,0.0
15,0,Naive Bayes,1,0.3,0.7666135034556087,0.8897572798596807,0.20345330238342285,0.8897572798596807
16,0,KNeighbors Classifier,2,0.3,0.5007982969664715,0.5314195311418657,10.358429193496704,0.5314195311418657
17,0,SVC Classifier,2,0.3,0.32783395423097395,0.4117004664029533,5.340550899505615,0.0
18,0,Decision Tree,2,0.3,0.39116551357104845,0.4767335641684754,0.05009770393371582,0.0
19,0,RandomForest,2,0.3,0.32730175625332625,0.25556610923201534,0.5534000396728516,0.0
20,0,AdaBoost (Discrete),2,0.3,0.4422565194252262,0.4940338570045484,41.931984186172485,0.0
21,0,AdaBoost (Real),2,0.3,0.38690792974986693,0.466128884684949,57.9190993309021,0.0
22,0,Logistic Regression (Penalty = L2),2,0.3,0.37998935604044703,0.3734667773700264,0.7979795932769775,0.0
23,0,Naive Bayes,2,0.3,0.33422032996274614,0.43641387294115214,0.1874997615814209,0.43641387294115214
24,1,KNeighbors Classifier,0,0.3,0.7001061571125266,0.8513263334565981,2.7831218242645264,0.0
25,1,SVC Classifier,0,0.3,0.64171974522293,0.6573253194465627,8.77840518951416,0.0
26,1,Decision Tree,0,0.3,0.685244161358811,0.8526120246919198,0.05080842971801758,0.0
27,1,RandomForest,0,0.3,0.6475583864118896,0.653407295370295,0.523643970489502,0.0
28,1,AdaBoost (Discrete),0,0.3,0.7712314225053079,0.7286757921111346,41.16327929496765,0.7286757921111346
29,1,AdaBoost (Real),0,0.3,0.5997876857749469,0.6654970291553576,58.09725856781006,0.0
30,1,Logistic Regression (Penalty = L2),0,0.3,0.7107218683651805,0.8635406788959284,1.0359690189361572,0.0
31,1,Naive Bayes,0,0.3,0.7070063694267515,0.7689525733575879,0.19230866432189941,0.7689525733575879
32,1,KNeighbors Classifier,1,0.3,0.8500797448165869,0.5971573590550638,3.0944876670837402,0.5971573590550638
33,1,SVC Classifier,1,0.3,0.7713981924508241,0.6192357015520555,9.565807819366455,0.0
34,1,Decision Tree,1,0.3,0.7666135034556087,0.6169761377004175,0.09475517272949219,0.0
35,1,RandomForest,1,0.3,0.7698032961190856,0.9975777114203086,0.4548475742340088,0.0
36,1,AdaBoost (Discrete),1,0.3,0.7889420520999468,0.5773135664323986,41.9960412979126,0.0
37,1,AdaBoost (Real),1,0.3,0.4965443912812334,0.5094959321993501,57.7688090801239,0.0
38,1,Logistic Regression (Penalty = L2),1,0.3,0.7666135034556087,0.6169761377004175,1.0208964347839355,0.0
39,1,Naive Bayes,1,0.3,0.8713450292397661,0.94167770680504,0.1847696304321289,0.94167770680504
40,1,KNeighbors Classifier,2,0.3,0.44438531133581693,0.3469995972597474,5.998966217041016,0.3469995972597474
41,1,SVC Classifier,2,0.3,0.31293241085683876,0.29012383650659385,3.642061710357666,0.0
42,1,Decision Tree,2,0.3,0.3778605641298563,0.36918866219451113,0.04466843605041504,0.0
43,1,RandomForest,2,0.3,0.3081426290580096,0.1939698326627545,0.3588845729827881,0.0
44,1,AdaBoost (Discrete),2,0.3,0.4385311335816924,0.361144327958481,37.43606495857239,0.361144327958481
45,1,AdaBoost (Real),2,0.3,0.2985630654603513,0.6167575033112543,59.69532060623169,0.0
46,1,Logistic Regression (Penalty = L2),2,0.3,0.37360298030867484,0.3677257586636381,0.8917367458343506,0.0
47,1,Naive Bayes,2,0.3,0.3640234167110165,0.359308282428902,0.13680315017700195,0.359308282428902
48,2,KNeighbors Classifier,0,0.3,0.7377919320594479,0.8745764674609507,5.6724817752838135,0.0
49,2,SVC Classifier,0,0.3,0.7361995753715499,0.8310216421930452,9.709081172943115,0.0
50,2,Decision Tree,0,0.3,0.7361995753715499,0.873942562614331,0.08713388442993164,0.0
51,2,RandomForest,0,0.3,0.5360934182590233,0.5469790723426526,0.488598108291626,0.0
52,2,AdaBoost (Discrete),0,0.3,0.785031847133758,0.45033873586058243,36.68387746810913,0.0
53,2,AdaBoost (Real),0,0.3,0.7791932059447984,0.9979903482814028,58.54191064834595,0.0
54,2,Logistic Regression (Penalty = L2),0,0.3,0.7361995753715499,0.873942562614331,0.9243896007537842,0.0
55,2,Naive Bayes,0,0.3,0.3752653927813164,0.5013434367572861,0.22658848762512207,0.5013434367572861
56,2,KNeighbors Classifier,1,0.3,0.8437001594896332,0.614316046356246,7.125221252441406,0.614316046356246
57,2,SVC Classifier,1,0.3,0.7814992025518341,0.9154061101596771,11.14499282836914,0.0
58,2,Decision Tree,1,0.3,0.7666135034556087,0.6169761377004175,0.08749008178710938,0.0
59,2,RandomForest,1,0.3,0.7698032961190856,0.9975777114203086,0.48851919174194336,0.0
60,2,AdaBoost (Discrete),1,0.3,0.8171185539606592,0.4053091591601471,34.39727234840393,0.4053091591601471
61,2,AdaBoost (Real),1,0.3,0.49707602339181284,0.408089742125458,48.113287687301636,0.0
62,2,Logistic Regression (Penalty = L2),1,0.3,0.7692716640085061,0.6540828734464382,0.7571711540222168,0.0
63,2,Naive Bayes,1,0.3,0.5374800637958532,0.6188127976150575,0.14266729354858398,0.6188127976150575
64,2,KNeighbors Classifier,2,0.3,0.42309739222990955,0.4496983339129326,7.457762956619263,0.4496983339129326
65,2,SVC Classifier,2,0.3,0.31293241085683876,0.2877798912828133,3.9954562187194824,0.0
66,2,Decision Tree,2,0.3,0.3475252794039383,0.3078179218263563,0.08164048194885254,0.0
67,2,RandomForest,2,0.3,0.2825971261309207,0.18422154731498122,0.36132144927978516,0.0
68,2,AdaBoost (Discrete),2,0.3,0.3288983501862693,0.28863827552483806,31.65427303314209,0.28863827552483806
69,2,AdaBoost (Real),2,0.3,0.3288983501862693,0.2912116907519304,48.81359505653381,0.0
70,2,Logistic Regression (Penalty = L2),2,0.3,0.3288983501862693,0.2912116907519304,0.6077044010162354,0.0
71,2,Naive Bayes,2,0.3,0.22032996274614156,0.29045002043579327,0.19763684272766113,0.29045002043579327
72,3,KNeighbors Classifier,0,0.3,0.64171974522293,0.800905583109786,2.57523250579834,0.0
73,3,SVC Classifier,0,0.3,0.6900212314225053,0.8198225555837182,7.375643968582153,0.0
74,3,Decision Tree,0,0.3,0.6900212314225053,0.8198225555837182,0.07868671417236328,0.0
75,3,RandomForest,0,0.3,0.7701698513800425,1.0,0.44354796409606934,0.0
76,3,AdaBoost (Discrete),0,0.3,0.7590233545647559,0.741823969409919,33.926653146743774,0.0
77,3,AdaBoost (Real),0,0.3,0.4867303609341826,0.522009535604561,49.652923822402954,0.0
78,3,Logistic Regression (Penalty = L2),0,0.3,0.6900212314225053,0.8198225555837182,0.7497081756591797,0.0
79,3,Naive Bayes,0,0.3,0.6480891719745223,0.7246880780842796,0.18456315994262695,0.7246880780842796
80,3,KNeighbors Classifier,1,0.3,0.8229665071770335,0.8320870685535136,2.7530341148376465,0.0
81,3,SVC Classifier,1,0.3,0.7713981924508241,0.6192357015520555,7.119265079498291,0.0
82,3,Decision Tree,1,0.3,0.7713981924508241,0.6192357015520555,0.08253908157348633,0.0
83,3,RandomForest,1,0.3,0.7501329080276449,0.9756358042955093,0.40357327461242676,0.0
84,3,AdaBoost (Discrete),1,0.3,0.8394471026049973,0.794548606131978,32.258809089660645,0.0
85,3,AdaBoost (Real),1,0.3,0.1238702817650186,0.25103150454890366,46.97693681716919,0.0
86,3,Logistic Regression (Penalty = L2),1,0.3,0.7713981924508241,0.6192357015520555,0.7347064018249512,0.0
87,3,Naive Bayes,1,0.3,0.5608718766613503,0.6825032193050203,0.1815025806427002,0.6825032193050203
88,3,KNeighbors Classifier,2,0.3,0.523682810005322,0.3649641857998299,2.2044646739959717,0.0
89,3,SVC Classifier,2,0.3,0.31293241085683876,0.2877798912828133,2.8230044841766357,0.0
90,3,Decision Tree,2,0.3,0.37360298030867484,0.33542325328309514,0.03804469108581543,0.0
91,3,RandomForest,2,0.3,0.30175625332623734,0.18999722543518244,0.3617739677429199,0.0
92,3,AdaBoost (Discrete),2,0.3,0.5002660989888238,0.320159848527593,28.608810424804688,0.0
93,3,AdaBoost (Real),2,0.3,0.37360298030867484,0.3677257586636381,42.86637759208679,0.0
94,3,Logistic Regression (Penalty = L2),2,0.3,0.3778605641298563,0.36918866219451113,0.5780181884765625,0.0
95,3,Naive Bayes,2,0.3,0.38956891963810536,0.3967426420846977,0.1438312530517578,0.3967426420846977
96,4,KNeighbors Classifier,0,0.3,0.7107218683651805,0.8635406788959284,2.128950595855713,0.0
97,4,SVC Classifier,0,0.3,0.6894904458598726,0.7701645391710248,4.480640888214111,0.0
98,4,Decision Tree,0,0.3,0.7361995753715499,0.873942562614331,0.07363605499267578,0.0
99,4,RandomForest,0,0.3,0.5981953290870489,0.6909553927994988,0.3760099411010742,0.0
100,4,AdaBoost (Discrete),0,0.3,0.5700636942675159,1.0,23.797602891921997,0.0
101,4,AdaBoost (Real),0,0.3,0.6597664543524416,0.6677138347450955,33.8939208984375,0.0
102,4,Logistic Regression (Penalty = L2),0,0.3,0.7361995753715499,0.873942562614331,0.49239420890808105,0.0
103,4,Naive Bayes,0,0.3,0.5610403397027601,0.6905848761831844,0.11234569549560547,0.6905848761831844
104,4,KNeighbors Classifier,1,0.3,0.8399787347155768,0.6798193378711445,1.6974873542785645,0.6798193378711445
105,4,SVC Classifier,1,0.3,0.7809675704412546,0.904308227594528,4.098242998123169,0.0
106,4,Decision Tree,1,0.3,0.7666135034556087,0.6169761377004175,0.060891151428222656,0.0
107,4,RandomForest,1,0.3,0.7804359383306751,0.9822786963053242,0.28804898262023926,0.0
108,4,AdaBoost (Discrete),1,0.3,0.35513024986709196,0.16363578998852082,20.829118728637695,0.0
109,4,AdaBoost (Real),1,0.3,0.35513024986709196,0.16363578998852082,32.12276291847229,0.0
110,4,Logistic Regression (Penalty = L2),1,0.3,0.7666135034556087,0.6169761377004175,0.4900186061859131,0.0
111,4,Naive Bayes,1,0.3,0.7522594364699627,0.8813213399335897,0.12284708023071289,0.8813213399335897
112,4,KNeighbors Classifier,2,0.3,0.4481106971793507,0.6709040458356893,2.286982297897339,0.0
113,4,SVC Classifier,2,0.3,0.32730175625332625,0.4067092353226188,1.8894438743591309,0.0
114,4,Decision Tree,2,0.3,0.35125066524747206,0.4226093162152993,0.028433561325073242,0.0
115,4,RandomForest,2,0.3,0.3315593400745077,0.29037916272216424,0.32668542861938477,0.0
116,4,AdaBoost (Discrete),2,0.3,0.34326769558275677,0.40874401222411927,19.7602756023407,0.0
117,4,AdaBoost (Real),2,0.3,0.3219797764768494,0.3851523213190112,35.18918490409851,0.0
118,4,Logistic Regression (Penalty = L2),2,0.3,0.30867482703565724,0.28635519460172354,0.37380290031433105,0.0
119,4,Naive Bayes,2,0.3,0.30228845130388504,0.359588620199148,0.09926295280456543,0.359588620199148
120,5,KNeighbors Classifier,0,0.3,0.6894904458598726,0.8196239551351192,2.4671566486358643,0.0
121,5,SVC Classifier,0,0.3,0.5950106157112527,0.6164508131111136,4.321449518203735,0.0
122,5,Decision Tree,0,0.3,0.6480891719745223,0.6607115058196374,0.031647682189941406,0.0
123,5,RandomForest,0,0.3,0.5705944798301487,0.5941060214069549,0.2818937301635742,0.0
124,5,AdaBoost (Discrete),0,0.3,0.3885350318471338,0.5305955294965976,19.979331016540527,0.0
125,5,AdaBoost (Real),0,0.3,0.6491507430997877,0.6734268171456207,29.75916290283203,0.0
126,5,Logistic Regression (Penalty = L2),0,0.3,0.6491507430997877,0.6734268171456207,0.36698293685913086,0.0
127,5,Naive Bayes,0,0.3,0.30148619957537154,0.7130482340039412,0.09848833084106445,0.0
128,5,KNeighbors Classifier,1,0.3,0.79585326953748,0.6428827344625005,2.541829824447632,0.0
129,5,SVC Classifier,1,0.3,0.722488038277512,0.9288059949425439,5.660067319869995,0.0
130,5,Decision Tree,1,0.3,0.7432216905901117,0.6082111773224333,0.05455350875854492,0.0
131,5,RandomForest,1,0.3,0.4768740031897927,0.3601549382133037,0.29858851432800293,0.0
132,5,AdaBoost (Discrete),1,0.3,0.8203083466241361,0.8496767053750105,19.257821798324585,0.0
133,5,AdaBoost (Real),1,0.3,0.7995746943115364,0.8486874744009434,28.239479780197144,0.0
134,5,Logistic Regression (Penalty = L2),1,0.3,0.7565124933545986,0.9789075095586494,0.3072195053100586,0.0
135,5,Naive Bayes,1,0.3,0.5082402977139819,0.9676511362883462,0.08890557289123535,0.0
136,5,KNeighbors Classifier,2,0.3,0.4582224587546567,0.6533078123378291,2.7282016277313232,0.0
137,5,SVC Classifier,2,0.3,0.28685470995210216,0.27869719554185296,2.6739003658294678,0.0
138,5,Decision Tree,2,0.3,0.292176689728579,0.32601956276584865,0.029352188110351562,0.0
139,5,RandomForest,2,0.3,0.2825971261309207,0.18422154731498122,0.20602011680603027,0.0
140,5,AdaBoost (Discrete),2,0.3,0.3182543906333156,0.36488532229226045,17.737776517868042,0.0
141,5,AdaBoost (Real),2,0.3,0.3044172432144758,0.2540013823566475,31.574246406555176,0.0
142,5,Logistic Regression (Penalty = L2),2,0.3,0.30867482703565724,0.28635519460172354,0.29839134216308594,0.0
143,5,Naive Bayes,2,0.3,0.22086216072378925,0.294905945855687,0.0910944938659668,0.294905945855687
144,6,KNeighbors Classifier,0,0.3,0.6592356687898089,0.8299840782038735,1.728557825088501,0.0
145,6,SVC Classifier,0,0.3,0.6868365180467091,0.7692355080710747,3.8317389488220215,0.0
146,6,Decision Tree,0,0.3,0.6900212314225053,0.8198225555837182,0.05384945869445801,0.0
147,6,RandomForest,0,0.3,0.5610403397027601,0.6085547505032551,0.3111553192138672,0.0
148,6,AdaBoost (Discrete),0,0.3,0.7680467091295117,0.707715308193471,19.094205141067505,0.0
149,6,AdaBoost (Real),0,0.3,0.6475583864118896,0.7799971485451596,31.445313215255737,0.0
150,6,Logistic Regression (Penalty = L2),0,0.3,0.6900212314225053,0.8198225555837182,0.5179393291473389,0.0
151,6,Naive Bayes,0,0.3,0.5636942675159236,0.6917567592162651,0.08823847770690918,0.6917567592162651
152,6,KNeighbors Classifier,1,0.3,0.8750664540138224,0.8365567283592884,1.5968937873840332,0.0
153,6,SVC Classifier,1,0.3,0.7809675704412546,0.904308227594528,4.034428358078003,0.0
154,6,Decision Tree,1,0.3,0.7814992025518341,0.9154061101596771,0.05806541442871094,0.0
155,6,RandomForest,1,0.3,0.7698032961190856,0.9975777114203086,0.2906460762023926,0.0
156,6,AdaBoost (Discrete),1,0.3,0.7745879851143009,0.44616031746444074,21.134885549545288,0.0
157,6,AdaBoost (Real),1,0.3,0.5013290802764487,0.5274928382467838,31.647636890411377,0.0
158,6,Logistic Regression (Penalty = L2),1,0.3,0.7814992025518341,0.9154061101596771,0.5079002380371094,0.0
159,6,Naive Bayes,1,0.3,0.7814992025518341,0.8981027474611979,0.11276674270629883,0.8981027474611979
160,6,KNeighbors Classifier,2,0.3,0.542309739222991,0.4157631593858321,1.914137840270996,0.0
161,6,SVC Classifier,2,0.3,0.32783395423097395,0.4117004664029533,1.8843369483947754,0.0
162,6,Decision Tree,2,0.3,0.3927621075039915,0.49166023817072274,0.03340435028076172,0.0
163,6,RandomForest,2,0.3,0.3315593400745077,0.29037916272216424,0.28768491744995117,0.0
164,6,AdaBoost (Discrete),2,0.3,0.4954763171899947,0.42304723047224513,19.652369499206543,0.0
165,6,AdaBoost (Real),2,0.3,0.513571048430016,0.48424351821617284,28.548574924468994,0.0
166,6,Logistic Regression (Penalty = L2),2,0.3,0.37360298030867484,0.3677257586636381,0.353712797164917,0.0
167,6,Naive Bayes,2,0.3,0.34486428951569986,0.40265089200782334,0.05324363708496094,0.40265089200782334
168,7,KNeighbors Classifier,0,0.3,0.7473460721868365,0.8263507055592668,1.3355209827423096,0.0
169,7,SVC Classifier,0,0.3,0.7356687898089171,0.8210064073177084,3.1801042556762695,0.0
170,7,Decision Tree,0,0.3,0.7361995753715499,0.873942562614331,0.020840883255004883,0.0
171,7,RandomForest,0,0.3,0.6963906581740976,0.8516654476994193,0.19732236862182617,0.0
172,7,AdaBoost (Discrete),0,0.3,0.7080679405520169,0.8865470134525878,15.561494588851929,0.0
173,7,AdaBoost (Real),0,0.3,0.7791932059447984,0.9979903482814028,24.390230894088745,0.0
174,7,Logistic Regression (Penalty = L2),0,0.3,0.6953290870488322,0.7178826128910483,0.33293938636779785,0.0
175,7,Naive Bayes,0,0.3,0.17887473460721867,0.8386747408491846,0.0480799674987793,0.0
176,7,KNeighbors Classifier,1,0.3,0.5252525252525253,0.3628597719812699,1.4047846794128418,0.0
177,7,SVC Classifier,1,0.3,0.7809675704412546,0.904308227594528,3.2242794036865234,0.0
178,7,Decision Tree,1,0.3,0.7713981924508241,0.6192357015520555,0.0033485889434814453,0.0
179,7,RandomForest,1,0.3,0.7698032961190856,0.9975777114203086,0.21804094314575195,0.0
180,7,AdaBoost (Discrete),1,0.3,0.4944178628389155,0.6870496400633144,15.065425634384155,0.0
181,7,AdaBoost (Real),1,0.3,0.7814992025518341,0.9154061101596771,25.53281879425049,0.0
182,7,Logistic Regression (Penalty = L2),1,0.3,0.7713981924508241,0.6192357015520555,0.3360881805419922,0.0
183,7,Naive Bayes,1,0.3,0.22860180754917597,1.0,0.09001302719116211,0.0
184,7,KNeighbors Classifier,2,0.3,0.4348057477381586,0.49217001719781844,1.308842658996582,0.0
185,7,SVC Classifier,2,0.3,0.31293241085683876,0.2877798912828133,1.3587207794189453,0.0
186,7,Decision Tree,2,0.3,0.30867482703565724,0.25526510982958206,0.02645087242126465,0.0
187,7,RandomForest,2,0.3,0.30175625332623734,0.18999722543518244,0.18931078910827637,0.0
188,7,AdaBoost (Discrete),2,0.3,0.2985630654603513,0.17289393612796441,16.17876625061035,0.0
189,7,AdaBoost (Real),2,0.3,0.3847791378392762,0.21522001265081148,27.117637395858765,0.0
190,7,Logistic Regression (Penalty = L2),2,0.3,0.30867482703565724,0.28635519460172354,0.3576221466064453,0.0
191,7,Naive Bayes,2,0.3,0.24481106971793506,0.5296697106629273,0.08397293090820312,0.0
192,8,KNeighbors Classifier,0,0.3,0.64171974522293,0.800905583109786,1.279982566833496,0.0
193,8,SVC Classifier,0,0.3,0.5976645435244161,0.6172929621719077,3.8023173809051514,0.0
194,8,Decision Tree,0,0.3,0.6645435244161358,0.8100648217717894,0.053647756576538086,0.0
195,8,RandomForest,0,0.3,0.6236730360934183,0.6160818214998242,0.3012523651123047,0.0
196,8,AdaBoost (Discrete),0,0.3,0.7006369426751592,0.7718255852450788,20.442164421081543,0.0
197,8,AdaBoost (Real),0,0.3,0.5700636942675159,1.0,25.877461671829224,0.0
198,8,Logistic Regression (Penalty = L2),0,0.3,0.6390658174097664,0.7998129384079453,0.411726713180542,0.0
199,8,Naive Bayes,0,0.3,0.6438428874734607,0.7232007574267431,0.09692120552062988,0.7232007574267431
200,8,KNeighbors Classifier,1,0.3,0.8229665071770335,0.8320870685535136,1.124631404876709,0.0
201,8,SVC Classifier,1,0.3,0.7713981924508241,0.6192357015520555,3.3955602645874023,0.0
202,8,Decision Tree,1,0.3,0.7713981924508241,0.6192357015520555,0.024097681045532227,0.0
203,8,RandomForest,1,0.3,0.7698032961190856,0.9975777114203086,0.2399439811706543,0.0
204,8,AdaBoost (Discrete),1,0.3,0.8958001063264222,0.7426769969268401,16.464946031570435,0.7426769969268401
205,8,AdaBoost (Real),1,0.3,0.5013290802764487,0.5274928382467838,25.496296882629395,0.0
206,8,Logistic Regression (Penalty = L2),1,0.3,0.7713981924508241,0.6192357015520555,0.5417013168334961,0.0
207,8,Naive Bayes,1,0.3,0.835725677830941,0.9256119591366597,0.07674741744995117,0.9256119591366597
208,8,KNeighbors Classifier,2,0.3,0.523682810005322,0.3649641857998299,1.0152137279510498,0.0
209,8,SVC Classifier,2,0.3,0.31293241085683876,0.2877798912828133,1.3436064720153809,0.0
210,8,Decision Tree,2,0.3,0.37360298030867484,0.33542325328309514,0.049675703048706055,0.0
211,8,RandomForest,2,0.3,0.30175625332623734,0.18999722543518244,0.24179482460021973,0.0
212,8,AdaBoost (Discrete),2,0.3,0.4795103778605641,0.31615385237965066,16.431485414505005,0.0
213,8,AdaBoost (Real),2,0.3,0.30867482703565724,0.28635519460172354,25.449522733688354,0.0
214,8,Logistic Regression (Penalty = L2),2,0.3,0.3778605641298563,0.36918866219451113,0.4203488826751709,0.0
215,8,Naive Bayes,2,0.3,0.3400745077168707,0.35057907721810033,0.11751341819763184,0.35057907721810033
216,9,KNeighbors Classifier,0,0.3,0.8099787685774947,0.9712255062516554,1.268571376800537,0.0
217,9,SVC Classifier,0,0.3,0.6809978768577495,0.7812770598843944,2.887726068496704,0.0
218,9,Decision Tree,0,0.3,0.6900212314225053,0.8198225555837182,0.020430564880371094,0.0
219,9,RandomForest,0,0.3,0.7701698513800425,1.0,0.2216637134552002,0.0
220,9,AdaBoost (Discrete),0,0.3,0.7547770700636943,0.9390946510028104,14.802551031112671,0.0
221,9,AdaBoost (Real),0,0.3,0.638004246284501,0.7800991927333698,22.85293984413147,0.0
222,9,Logistic Regression (Penalty = L2),0,0.3,0.6900212314225053,0.8198225555837182,0.30287766456604004,0.0
223,9,Naive Bayes,0,0.3,0.2494692144373673,0.6552373357299573,0.052310943603515625,0.0
224,9,KNeighbors Classifier,1,0.3,0.8011695906432749,0.9255152611699503,1.272315502166748,0.0
225,9,SVC Classifier,1,0.3,0.7708665603402446,0.4276209591000295,2.9062702655792236,0.0
226,9,Decision Tree,1,0.3,0.7814992025518341,0.9154061101596771,0.02507305145263672,0.0
227,9,RandomForest,1,0.3,0.7698032961190856,0.9975777114203086,0.21013116836547852,0.0
228,9,AdaBoost (Discrete),1,0.3,0.34077618288144607,1.0,14.447496891021729,0.0
229,9,AdaBoost (Real),1,0.3,0.7777777777777778,0.9130131055899595,23.271973609924316,0.0
230,9,Logistic Regression (Penalty = L2),1,0.3,0.7814992025518341,0.9154061101596771,0.28873634338378906,0.0
231,9,Naive Bayes,1,0.3,0.45667198298777245,0.9597287693899687,0.06136584281921387,0.0
232,9,KNeighbors Classifier,2,0.3,0.46194784459819055,0.7033839181976804,1.4277780055999756,0.0
233,9,SVC Classifier,2,0.3,0.31293241085683876,0.2877798912828133,1.1151554584503174,0.0
234,9,Decision Tree,2,0.3,0.30867482703565724,0.25526510982958206,0.024038314819335938,0.0
235,9,RandomForest,2,0.3,0.30175625332623734,0.18999722543518244,0.19533658027648926,0.0
236,9,AdaBoost (Discrete),2,0.3,0.2522618414050027,0.17425784484113935,13.851529598236084,0.0
237,9,AdaBoost (Real),2,0.3,0.26343799893560405,0.24074474950153552,24.007636070251465,0.0
238,9,Logistic Regression (Penalty = L2),2,0.3,0.30867482703565724,0.28635519460172354,0.23366189002990723,0.0
239,9,Naive Bayes,2,0.3,0.21287919105907396,0.2693092858021841,0.07959389686584473,0.2693092858021841
240,10,KNeighbors Classifier,0,0.3,0.7372611464968153,0.8743653700510113,2.278036594390869,0.0
241,10,SVC Classifier,0,0.3,0.6459660297239915,0.6318731002306498,4.639347553253174,0.0
242,10,Decision Tree,0,0.3,0.7361995753715499,0.873942562614331,0.025873422622680664,0.0
243,10,RandomForest,0,0.3,0.5955414012738853,0.6888735700719336,0.2429966926574707,0.0
244,10,AdaBoost (Discrete),0,0.3,0.7489384288747346,0.8269486444670607,19.44374418258667,0.0
245,10,AdaBoost (Real),0,0.3,0.3858811040339703,0.27862407792065225,28.40802574157715,0.0
246,10,Logistic Regression (Penalty = L2),0,0.3,0.7361995753715499,0.873942562614331,0.4893982410430908,0.0
247,10,Naive Bayes,0,0.3,0.6464968152866242,0.724132121565252,0.10773611068725586,0.724132121565252
248,10,KNeighbors Classifier,1,0.3,0.809144072301967,0.7482994405283315,3.1955947875976562,0.0
249,10,SVC Classifier,1,0.3,0.7713981924508241,0.6192357015520555,5.1766064167022705,0.0
250,10,Decision Tree,1,0.3,0.7666135034556087,0.6169761377004175,0.048110008239746094,0.0
251,10,RandomForest,1,0.3,0.7501329080276449,0.9756358042955093,0.2451472282409668,0.0
252,10,AdaBoost (Discrete),1,0.3,0.5906432748538012,0.4643171557344144,20.5210599899292,0.0
253,10,AdaBoost (Real),1,0.3,0.5013290802764487,0.5274928382467838,29.09960913658142,0.0
254,10,Logistic Regression (Penalty = L2),1,0.3,0.7666135034556087,0.6169761377004175,0.48212599754333496,0.0
255,10,Naive Bayes,1,0.3,0.8649654439128124,0.9388998258529409,0.12279510498046875,0.9388998258529409
256,10,KNeighbors Classifier,2,0.3,0.48962213943587013,0.5086942537244169,4.104041814804077,0.5086942537244169
257,10,SVC Classifier,2,0.3,0.31293241085683876,0.2877798912828133,2.0448098182678223,0.0
258,10,Decision Tree,2,0.3,0.37360298030867484,0.33542325328309514,0.04667806625366211,0.0
259,10,RandomForest,2,0.3,0.30175625332623734,0.18999722543518244,0.21104741096496582,0.0
260,10,AdaBoost (Discrete),2,0.3,0.36934539648749337,0.3340941445866145,19.414681434631348,0.0
261,10,AdaBoost (Real),2,0.3,0.3677488025545503,0.784611766697512,25.631244659423828,0.0
262,10,Logistic Regression (Penalty = L2),2,0.3,0.3778605641298563,0.36918866219451113,0.38750147819519043,0.0
263,10,Naive Bayes,2,0.3,0.369877594465141,0.4305056987500547,0.10776448249816895,0.4305056987500547
264,11,KNeighbors Classifier,0,0.3,0.7351380042462845,0.8718350358437542,3.6609742641448975,0.0
265,11,SVC Classifier,0,0.3,0.7361995753715499,0.873942562614331,6.4896416664123535,0.0
266,11,Decision Tree,0,0.3,0.7346072186836518,0.8129241402580465,0.04844856262207031,0.0
267,11,RandomForest,0,0.3,0.5981953290870489,0.6842514579911061,0.21781539916992188,0.0
268,11,AdaBoost (Discrete),0,0.3,0.7733545647558386,0.7909769684123927,22.520081758499146,0.7909769684123927
269,11,AdaBoost (Real),0,0.3,0.3211252653927813,0.31169803187753203,30.206090211868286,0.0
270,11,Logistic Regression (Penalty = L2),0,0.3,0.7361995753715499,0.873942562614331,0.525214433670044,0.0
271,11,Naive Bayes,0,0.3,0.5849256900212314,0.7175508728761703,0.1344466209411621,0.7175508728761703
272,11,KNeighbors Classifier,1,0.3,0.8335991493886231,0.5454341316584814,4.465918779373169,0.5454341316584814
273,11,SVC Classifier,1,0.3,0.7713981924508241,0.6192357015520555,7.358072519302368,0.0
274,11,Decision Tree,1,0.3,0.7623604465709729,0.6149465834347903,0.07180500030517578,0.0
275,11,RandomForest,1,0.3,0.6172248803827751,0.7295601856708801,0.2411789894104004,0.0
276,11,AdaBoost (Discrete),1,0.3,0.9005847953216374,0.8423270406679368,26.878397703170776,0.8423270406679368
277,11,AdaBoost (Real),1,0.3,0.7873471557682084,0.7661823442831777,33.84263563156128,0.0
278,11,Logistic Regression (Penalty = L2),1,0.3,0.7671451355661882,0.6172284281386226,0.5647604465484619,0.0
279,11,Naive Bayes,1,0.3,0.7612971823498139,0.8866794922925015,0.1558094024658203,0.8866794922925015
280,11,KNeighbors Classifier,2,0.3,0.4316125598722725,0.42271200398399256,7.383664131164551,0.42271200398399256
281,11,SVC Classifier,2,0.3,0.33315593400745075,0.29427372223472265,2.8188107013702393,0.0
282,11,Decision Tree,2,0.3,0.37360298030867484,0.33760707631782105,0.05818748474121094,0.0
283,11,RandomForest,2,0.3,0.30175625332623734,0.18999722543518244,0.20418477058410645,0.0
284,11,AdaBoost (Discrete),2,0.3,0.3847791378392762,0.3279657037380851,24.897979974746704,0.3279657037380851
285,11,AdaBoost (Real),2,0.3,0.5002660989888238,0.36002806998159675,33.05486989021301,0.0
286,11,Logistic Regression (Penalty = L2),2,0.3,0.37360298030867484,0.3677257586636381,0.520089864730835,0.0
287,11,Naive Bayes,2,0.3,0.4018094731240021,0.41851292035446064,0.14473843574523926,0.41851292035446064
288,12,KNeighbors Classifier,0,0.3,0.3641188959660297,0.48967611691811724,0.7122366428375244,0.0
289,12,SVC Classifier,0,0.3,0.4410828025477707,1.0,2.5060808658599854,0.0
290,12,Decision Tree,0,0.3,0.45010615711252655,0.9969870374422719,0.02394247055053711,0.0
291,12,RandomForest,0,0.3,0.45276008492569003,1.0,0.21569275856018066,0.0
292,12,AdaBoost (Discrete),0,0.3,0.3641188959660297,0.48967611691811724,12.14873480796814,0.0
293,12,AdaBoost (Real),0,0.3,0.45010615711252655,0.9969870374422719,20.37300992012024,0.0
294,12,Logistic Regression (Penalty = L2),0,0.3,0.45010615711252655,0.9969870374422719,0.19100642204284668,0.0
295,12,Naive Bayes,0,0.3,0.17887473460721867,0.8386747408491846,0.061293601989746094,0.0
296,12,KNeighbors Classifier,1,0.3,0.36097820308346623,0.9035660874807749,0.6316320896148682,0.0
297,12,SVC Classifier,1,0.3,0.42211589580010633,0.06786604058221248,2.2106504440307617,0.0
298,12,Decision Tree,1,0.3,0.4332801701222754,0.1663802126293593,0.037290096282958984,0.0
299,12,RandomForest,1,0.3,0.4529505582137161,1.0,0.17663359642028809,0.0
300,12,AdaBoost (Discrete),1,0.3,0.4529505582137161,1.0,10.003947496414185,0.0
301,12,AdaBoost (Real),1,0.3,0.4332801701222754,0.1663802126293593,19.178887367248535,0.0
302,12,Logistic Regression (Penalty = L2),1,0.3,0.4332801701222754,0.1663802126293593,0.14882397651672363,0.0
303,12,Naive Bayes,1,0.3,0.11802232854864433,0.2510651637589085,0.06740903854370117,0.0
304,12,KNeighbors Classifier,2,0.3,0.2687599787120809,0.775433020717935,0.5432686805725098,0.0
305,12,SVC Classifier,2,0.3,0.30282064928153274,0.7236686447641765,1.9093070030212402,0.0
306,12,Decision Tree,2,0.3,0.2575838211814795,0.6681264626635032,0.01972055435180664,0.0
307,12,RandomForest,2,0.3,0.32623736029803085,0.7493476782209801,0.19408917427062988,0.0
308,12,AdaBoost (Discrete),2,0.3,0.2575838211814795,0.6681264626635032,11.741878747940063,0.0
309,12,AdaBoost (Real),2,0.3,0.28100053219797766,0.6979802480789096,20.310468673706055,0.0
310,12,Logistic Regression (Penalty = L2),2,0.3,0.2575838211814795,0.6681264626635032,0.16138935089111328,0.0
311,12,Naive Bayes,2,0.3,0.14209686003193187,0.9237933282920578,0.05744504928588867,0.0
