,feat_set_id,classifier,fold_id,feat_th,score,geo_score,exec_t,geo_score_woz
0,0,KNeighbors Classifier,0,0.9,0.9656716417910448,0.965415097477903,5.366732120513916,0.965415097477903
1,0,SVC Classifier,0,0.9,0.9597014925373134,0.959159786318163,3.0843446254730225,0.959159786318163
2,0,Decision Tree,0,0.9,0.8328358208955224,0.829640295678954,0.1375734806060791,0.829640295678954
3,0,RandomForest,0,0.9,0.6567164179104478,0.5117442536569292,0.33919811248779297,0.0
4,0,AdaBoost (Discrete),0,0.9,0.9552238805970149,0.9547149661539454,151.5502233505249,0.9547149661539454
5,0,AdaBoost (Real),0,0.9,0.8208955223880597,0.8168087409054181,150.953271150589,0.8168087409054181
6,0,Logistic Regression (Penalty = L2),0,0.9,0.9791044776119403,0.9789162603524607,3.796255350112915,0.9789162603524607
7,0,Naive Bayes,0,0.9,0.9149253731343283,0.9137048816954574,0.3293790817260742,0.9137048816954574
8,0,KNeighbors Classifier,1,0.9,0.9492537313432836,0.9487936999166635,4.656368255615234,0.9487936999166635
9,0,SVC Classifier,1,0.9,0.9522388059701492,0.9517184697445837,2.809687852859497,0.9517184697445837
10,0,Decision Tree,1,0.9,0.8149253731343283,0.8083276230716196,0.11210513114929199,0.8083276230716196
11,0,RandomForest,1,0.9,0.6671641791044776,0.5281620328270485,0.3365516662597656,0.5281620328270485
12,0,AdaBoost (Discrete),1,0.9,0.9447761194029851,0.9446339176160256,137.0524718761444,0.9446339176160256
13,0,AdaBoost (Real),1,0.9,0.3447761194029851,0.2042344370790735,131.65881609916687,0.0
14,0,Logistic Regression (Penalty = L2),1,0.9,0.9731343283582089,0.9730253760664747,2.970879316329956,0.9730253760664747
15,0,Naive Bayes,1,0.9,0.926865671641791,0.9260675668350045,0.28868579864501953,0.9260675668350045
16,0,KNeighbors Classifier,2,0.9,0.9651515151515152,0.9648170099674166,3.9414215087890625,0.9648170099674166
17,0,SVC Classifier,2,0.9,0.9575757575757575,0.9573394900214413,2.544448137283325,0.9573394900214413
18,0,Decision Tree,2,0.9,0.8333333333333334,0.8316631325272799,0.09117460250854492,0.8316631325272799
19,0,RandomForest,2,0.9,0.6606060606060606,0.5501286752298435,0.2697641849517822,0.5501286752298435
20,0,AdaBoost (Discrete),2,0.9,0.9424242424242424,0.941942759570037,126.91473078727722,0.941942759570037
21,0,AdaBoost (Real),2,0.9,0.49393939393939396,0.39458246523913343,116.29076099395752,0.0
22,0,Logistic Regression (Penalty = L2),2,0.9,0.9787878787878788,0.9786423791651166,3.221848964691162,0.9786423791651166
23,0,Naive Bayes,2,0.9,0.9242424242424242,0.9237410519220602,0.2611227035522461,0.9237410519220602
24,1,KNeighbors Classifier,0,0.9,0.9686567164179104,0.9681971310256582,4.186793327331543,0.9681971310256582
25,1,SVC Classifier,0,0.9,0.9582089552238806,0.9575000281207416,2.5204787254333496,0.9575000281207416
26,1,Decision Tree,0,0.9,0.844776119402985,0.8413478039247585,0.09645771980285645,0.8413478039247585
27,1,RandomForest,0,0.9,0.7074626865671642,0.6089342133805768,0.2976808547973633,0.6089342133805768
28,1,AdaBoost (Discrete),0,0.9,0.9582089552238806,0.9576315399333539,127.0510504245758,0.9576315399333539
29,1,AdaBoost (Real),0,0.9,0.9074626865671642,0.9056932355470746,102.8373475074768,0.9056932355470746
30,1,Logistic Regression (Penalty = L2),0,0.9,0.9835820895522388,0.983412350757979,2.456096887588501,0.983412350757979
31,1,Naive Bayes,0,0.9,0.9134328358208955,0.9118452500165928,0.17464208602905273,0.9118452500165928
32,1,KNeighbors Classifier,1,0.9,0.9537313432835821,0.9533101990235969,3.2639377117156982,0.9533101990235969
33,1,SVC Classifier,1,0.9,0.9507462686567164,0.9503191961728085,2.073856830596924,0.9503191961728085
34,1,Decision Tree,1,0.9,0.844776119402985,0.8402467414387662,0.09998273849487305,0.8402467414387662
35,1,RandomForest,1,0.9,0.6701492537313433,0.5312967612622236,0.25681447982788086,0.0
36,1,AdaBoost (Discrete),1,0.9,0.9462686567164179,0.9461219574807151,110.19515419006348,0.9461219574807151
37,1,AdaBoost (Real),1,0.9,0.282089552238806,0.23537415985096913,104.11999678611755,0.0
38,1,Logistic Regression (Penalty = L2),1,0.9,0.9716417910447761,0.9714712305453143,2.932788133621216,0.9714712305453143
39,1,Naive Bayes,1,0.9,0.9298507462686567,0.9293296655091705,0.2535851001739502,0.9293296655091705
40,1,KNeighbors Classifier,2,0.9,0.9681818181818181,0.967885046115846,4.269053936004639,0.967885046115846
41,1,SVC Classifier,2,0.9,0.9590909090909091,0.9586751720376023,2.565591335296631,0.9586751720376023
42,1,Decision Tree,2,0.9,0.843939393939394,0.8427556435753719,0.11765480041503906,0.8427556435753719
43,1,RandomForest,2,0.9,0.7196969696969697,0.6079118879311163,0.2925548553466797,0.6079118879311163
44,1,AdaBoost (Discrete),2,0.9,0.9348484848484848,0.9343081668620775,111.23891925811768,0.9343081668620775
45,1,AdaBoost (Real),2,0.9,0.603030303030303,0.4707879770053555,95.67570734024048,0.4707879770053555
46,1,Logistic Regression (Penalty = L2),2,0.9,0.9772727272727273,0.9770539129417997,2.342369794845581,0.9770539129417997
47,1,Naive Bayes,2,0.9,0.9242424242424242,0.9235453127734978,0.16075897216796875,0.9235453127734978
48,2,KNeighbors Classifier,0,0.9,0.9656716417910448,0.9653457548246192,3.1767866611480713,0.9653457548246192
49,2,SVC Classifier,0,0.9,0.9582089552238806,0.9576738393113142,2.0375964641571045,0.9576738393113142
50,2,Decision Tree,0,0.9,0.8552238805970149,0.8517309411970069,0.09155964851379395,0.8517309411970069
51,2,RandomForest,0,0.9,0.7417910447761195,0.6902266710999739,0.19320201873779297,0.6902266710999739
52,2,AdaBoost (Discrete),0,0.9,0.9492537313432836,0.9485455706608045,98.6671187877655,0.9485455706608045
53,2,AdaBoost (Real),0,0.9,0.8985074626865671,0.8965451387990925,79.20180296897888,0.8965451387990925
54,2,Logistic Regression (Penalty = L2),0,0.9,0.9805970149253731,0.9804133885282791,2.1906509399414062,0.9804133885282791
55,2,Naive Bayes,0,0.9,0.9149253731343283,0.913771846767258,0.18868350982666016,0.913771846767258
56,2,KNeighbors Classifier,1,0.9,0.9522388059701492,0.9518883200997988,2.533198118209839,0.9518883200997988
57,2,SVC Classifier,1,0.9,0.9507462686567164,0.9503207175488811,1.8681180477142334,0.9503207175488811
58,2,Decision Tree,1,0.9,0.8388059701492537,0.8338163080638656,0.09227609634399414,0.8338163080638656
59,2,RandomForest,1,0.9,0.6656716417910448,0.5103103216378058,0.2468717098236084,0.5103103216378058
60,2,AdaBoost (Discrete),1,0.9,0.9447761194029851,0.9446324053439966,93.73863697052002,0.9446324053439966
61,2,AdaBoost (Real),1,0.9,0.2865671641791045,0.17750218685961625,84.27467703819275,0.0
62,2,Logistic Regression (Penalty = L2),1,0.9,0.9671641791044776,0.9670311435922238,2.1671648025512695,0.9670311435922238
63,2,Naive Bayes,1,0.9,0.9328358208955224,0.9322400238290689,0.1796584129333496,0.9322400238290689
64,2,KNeighbors Classifier,2,0.9,0.9621212121212122,0.9617821825785713,2.6052167415618896,0.9617821825785713
65,2,SVC Classifier,2,0.9,0.9545454545454546,0.954205531700374,1.9613142013549805,0.954205531700374
66,2,Decision Tree,2,0.9,0.843939393939394,0.8419571400868501,0.05869293212890625,0.8419571400868501
67,2,RandomForest,2,0.9,0.7893939393939394,0.7749280468782029,0.19052815437316895,0.7749280468782029
68,2,AdaBoost (Discrete),2,0.9,0.9424242424242424,0.9413830771553412,87.93679642677307,0.9413830771553412
69,2,AdaBoost (Real),2,0.9,0.6348484848484849,0.5796046141369352,71.92213177680969,0.5796046141369352
70,2,Logistic Regression (Penalty = L2),2,0.9,0.9757575757575757,0.975540244043066,2.1117372512817383,0.975540244043066
71,2,Naive Bayes,2,0.9,0.9212121212121213,0.9206147287759514,0.16091704368591309,0.9206147287759514
72,3,KNeighbors Classifier,0,0.9,0.9671641791044776,0.9668450821067383,2.7594716548919678,0.9668450821067383
73,3,SVC Classifier,0,0.9,0.9567164179104478,0.9560937847733258,1.5929739475250244,0.9560937847733258
74,3,Decision Tree,0,0.9,0.8552238805970149,0.8513986370188468,0.061522483825683594,0.8513986370188468
75,3,RandomForest,0,0.9,0.6716417910447762,0.7054894892650407,0.1969432830810547,0.0
76,3,AdaBoost (Discrete),0,0.9,0.9522388059701492,0.9515570650976007,81.03007555007935,0.9515570650976007
77,3,AdaBoost (Real),0,0.9,0.8194029850746268,0.8123770720731106,70.07784795761108,0.8123770720731106
78,3,Logistic Regression (Penalty = L2),0,0.9,0.9776119402985075,0.9773287741044282,2.095247268676758,0.9773287741044282
79,3,Naive Bayes,0,0.9,0.9104477611940298,0.9090647219754459,0.16156315803527832,0.9090647219754459
80,3,KNeighbors Classifier,1,0.9,0.9522388059701492,0.9517952552963085,2.608929395675659,0.9517952552963085
81,3,SVC Classifier,1,0.9,0.9522388059701492,0.9518424802472935,1.6756243705749512,0.9518424802472935
82,3,Decision Tree,1,0.9,0.8656716417910447,0.8640048740008262,0.04798436164855957,0.8640048740008262
83,3,RandomForest,1,0.9,0.7253731343283583,0.7892497464735023,0.16918706893920898,0.0
84,3,AdaBoost (Discrete),1,0.9,0.9447761194029851,0.9445631786797337,74.97066688537598,0.9445631786797337
85,3,AdaBoost (Real),1,0.9,0.282089552238806,0.23537415985096913,71.26074576377869,0.0
86,3,Logistic Regression (Penalty = L2),1,0.9,0.9686567164179104,0.9685538468246536,1.6099963188171387,0.9685538468246536
87,3,Naive Bayes,1,0.9,0.9283582089552239,0.9276777527609289,0.195756196975708,0.9276777527609289
88,3,KNeighbors Classifier,2,0.9,0.9651515151515152,0.9648656717363329,2.2798471450805664,0.9648656717363329
89,3,SVC Classifier,2,0.9,0.9636363636363636,0.9634392294219457,1.4090087413787842,0.9634392294219457
90,3,Decision Tree,2,0.9,0.8681818181818182,0.8679163371082266,0.055716514587402344,0.8679163371082266
91,3,RandomForest,2,0.9,0.6681818181818182,0.6275945013807657,0.1709580421447754,0.0
92,3,AdaBoost (Discrete),2,0.9,0.9393939393939394,0.9388392119541448,68.81177020072937,0.9388392119541448
93,3,AdaBoost (Real),2,0.9,0.3924242424242424,0.24171110053265418,62.7750883102417,0.0
94,3,Logistic Regression (Penalty = L2),2,0.9,0.9772727272727273,0.9770777700006759,1.6841309070587158,0.9770777700006759
95,3,Naive Bayes,2,0.9,0.9242424242424242,0.9236888498889863,0.1510152816772461,0.9236888498889863
96,4,KNeighbors Classifier,0,0.9,0.9686567164179104,0.9682491027785202,1.7582449913024902,0.9682491027785202
97,4,SVC Classifier,0,0.9,0.9552238805970149,0.95436992048786,1.2346141338348389,0.95436992048786
98,4,Decision Tree,0,0.9,0.8402985074626865,0.8346227277405501,0.06485509872436523,0.8346227277405501
99,4,RandomForest,0,0.9,0.7074626865671642,0.5101006093380738,0.1742382049560547,0.5101006093380738
100,4,AdaBoost (Discrete),0,0.9,0.9567164179104478,0.956193331222415,62.87118601799011,0.956193331222415
101,4,AdaBoost (Real),0,0.9,0.7940298507462686,0.7829563791096614,54.00644326210022,0.7829563791096614
102,4,Logistic Regression (Penalty = L2),0,0.9,0.982089552238806,0.9818888312568994,1.3350245952606201,0.9818888312568994
103,4,Naive Bayes,0,0.9,0.9134328358208955,0.9119350805978617,0.15861010551452637,0.9119350805978617
104,4,KNeighbors Classifier,1,0.9,0.9507462686567164,0.9502658683111996,1.8901379108428955,0.9502658683111996
105,4,SVC Classifier,1,0.9,0.9462686567164179,0.9457160282825289,1.1266522407531738,0.9457160282825289
106,4,Decision Tree,1,0.9,0.8283582089552238,0.825751268542653,0.04865121841430664,0.825751268542653
107,4,RandomForest,1,0.9,0.6537313432835821,0.6814863975895714,0.13990092277526855,0.0
108,4,AdaBoost (Discrete),1,0.9,0.9462686567164179,0.9460056839642695,57.72222423553467,0.9460056839642695
109,4,AdaBoost (Real),1,0.9,0.34328358208955223,0.2034779716521522,55.92784404754639,0.0
110,4,Logistic Regression (Penalty = L2),1,0.9,0.9701492537313433,0.9699410459189111,1.4252357482910156,0.9699410459189111
111,4,Naive Bayes,1,0.9,0.9283582089552239,0.9277026873187992,0.16147780418395996,0.9277026873187992
112,4,KNeighbors Classifier,2,0.9,0.9666666666666667,0.9663619857944711,1.1904759407043457,0.9663619857944711
113,4,SVC Classifier,2,0.9,0.9575757575757575,0.9572647299934698,1.177030324935913,0.9572647299934698
114,4,Decision Tree,2,0.9,0.8272727272727273,0.8241731415846567,0.04899477958679199,0.8241731415846567
115,4,RandomForest,2,0.9,0.7484848484848485,0.700105024986638,0.16553330421447754,0.700105024986638
116,4,AdaBoost (Discrete),2,0.9,0.943939393939394,0.9435025974582179,60.47235035896301,0.9435025974582179
117,4,AdaBoost (Real),2,0.9,0.7818181818181819,0.7734999905459943,51.104411125183105,0.7734999905459943
118,4,Logistic Regression (Penalty = L2),2,0.9,0.9803030303030303,0.9801608614023902,1.2494843006134033,0.9801608614023902
119,4,Naive Bayes,2,0.9,0.9242424242424242,0.923795057656105,0.16434955596923828,0.923795057656105
120,5,KNeighbors Classifier,0,0.9,0.9626865671641791,0.9623783888075929,1.4566373825073242,0.9623783888075929
121,5,SVC Classifier,0,0.9,0.9552238805970149,0.9545419179057462,1.1763758659362793,0.9545419179057462
122,5,Decision Tree,0,0.9,0.8373134328358209,0.8360600761633181,0.049378395080566406,0.8360600761633181
123,5,RandomForest,0,0.9,0.6134328358208955,0.4192956928362191,0.1338825225830078,0.4192956928362191
124,5,AdaBoost (Discrete),0,0.9,0.9552238805970149,0.9547119798993442,54.179277658462524,0.9547119798993442
125,5,AdaBoost (Real),0,0.9,0.8641791044776119,0.8618144883717674,51.619797229766846,0.8618144883717674
126,5,Logistic Regression (Penalty = L2),0,0.9,0.982089552238806,0.9819346187011799,1.5494451522827148,0.9819346187011799
127,5,Naive Bayes,0,0.9,0.9164179104477612,0.9154353754072204,0.13397502899169922,0.9154353754072204
128,5,KNeighbors Classifier,1,0.9,0.9462686567164179,0.945811391407225,1.572791576385498,0.945811391407225
129,5,SVC Classifier,1,0.9,0.9447761194029851,0.9441794943415287,1.0728402137756348,0.9441794943415287
130,5,Decision Tree,1,0.9,0.8373134328358209,0.8356253157701106,0.030020475387573242,0.8356253157701106
131,5,RandomForest,1,0.9,0.6313432835820896,0.42769064799178386,0.1438145637512207,0.42769064799178386
132,5,AdaBoost (Discrete),1,0.9,0.9417910447761194,0.941591357569082,54.58414888381958,0.941591357569082
133,5,AdaBoost (Real),1,0.9,0.3417910447761194,0.23527476985123413,51.89935564994812,0.0
134,5,Logistic Regression (Penalty = L2),1,0.9,0.9686567164179104,0.9685316095905262,1.3684077262878418,0.9685316095905262
135,5,Naive Bayes,1,0.9,0.926865671641791,0.9260435558440023,0.12719440460205078,0.9260435558440023
136,5,KNeighbors Classifier,2,0.9,0.9636363636363636,0.9632729620639299,1.7607922554016113,0.9632729620639299
137,5,SVC Classifier,2,0.9,0.9545454545454546,0.954303353794221,0.8091788291931152,0.954303353794221
138,5,Decision Tree,2,0.9,0.853030303030303,0.8522313918723635,0.05118894577026367,0.8522313918723635
139,5,RandomForest,2,0.9,0.7227272727272728,0.6653128876404211,0.16270875930786133,0.6653128876404211
140,5,AdaBoost (Discrete),2,0.9,0.9378787878787879,0.9373541239738025,52.62668704986572,0.9373541239738025
141,5,AdaBoost (Real),2,0.9,0.6484848484848484,0.5913089629478314,47.353129625320435,0.5913089629478314
142,5,Logistic Regression (Penalty = L2),2,0.9,0.9787878787878788,0.9786423791651166,1.186927318572998,0.9786423791651166
143,5,Naive Bayes,2,0.9,0.9196969696969697,0.9190942738417995,0.12695956230163574,0.9190942738417995
144,6,KNeighbors Classifier,0,0.9,0.9626865671641791,0.9624261388588644,1.64628267288208,0.9624261388588644
145,6,SVC Classifier,0,0.9,0.9567164179104478,0.9560937847733258,1.158759355545044,0.9560937847733258
146,6,Decision Tree,0,0.9,0.8582089552238806,0.856752132227638,0.05017566680908203,0.856752132227638
147,6,RandomForest,0,0.9,0.7820895522388059,0.7243537636965129,0.14597368240356445,0.7243537636965129
148,6,AdaBoost (Discrete),0,0.9,0.9507462686567164,0.9499840562639353,51.58096981048584,0.9499840562639353
149,6,AdaBoost (Real),0,0.9,0.7820895522388059,0.7680978434927185,42.84331917762756,0.7680978434927185
150,6,Logistic Regression (Penalty = L2),0,0.9,0.9791044776119403,0.9789633360830158,1.3963675498962402,0.9789633360830158
151,6,Naive Bayes,0,0.9,0.9104477611940298,0.9089886550774076,0.11593890190124512,0.9089886550774076
152,6,KNeighbors Classifier,1,0.9,0.9552238805970149,0.954744853647582,1.4085745811462402,0.954744853647582
153,6,SVC Classifier,1,0.9,0.9507462686567164,0.950388238296128,1.090742826461792,0.950388238296128
154,6,Decision Tree,1,0.9,0.8477611940298507,0.8453135052015841,0.030859708786010742,0.8453135052015841
155,6,RandomForest,1,0.9,0.7507462686567165,0.7194178131775512,0.09953999519348145,0.7194178131775512
156,6,AdaBoost (Discrete),1,0.9,0.9447761194029851,0.9445639167566015,44.96258544921875,0.9445639167566015
157,6,AdaBoost (Real),1,0.9,0.34626865671641793,0.20468729395083415,43.48394560813904,0.0
158,6,Logistic Regression (Penalty = L2),1,0.9,0.9686567164179104,0.9686004242304727,1.0124988555908203,0.9686004242304727
159,6,Naive Bayes,1,0.9,0.9253731343283582,0.924610543796184,0.12102532386779785,0.924610543796184
160,6,KNeighbors Classifier,2,0.9,0.9636363636363636,0.9633222986913933,1.4782016277313232,0.9633222986913933
161,6,SVC Classifier,2,0.9,0.9575757575757575,0.957364398358882,0.9409267902374268,0.957364398358882
162,6,Decision Tree,2,0.9,0.8545454545454545,0.8529996529136461,0.06212663650512695,0.8529996529136461
163,6,RandomForest,2,0.9,0.7651515151515151,0.7357524326163788,0.14530611038208008,0.7357524326163788
164,6,AdaBoost (Discrete),2,0.9,0.9393939393939394,0.9388628695337256,46.13076901435852,0.9388628695337256
165,6,AdaBoost (Real),2,0.9,0.4318181818181818,0.3470914082811025,40.67793536186218,0.0
166,6,Logistic Regression (Penalty = L2),2,0.9,0.9772727272727273,0.9771262493869095,0.9204018115997314,0.9771262493869095
167,6,Naive Bayes,2,0.9,0.9242424242424242,0.9236383626723124,0.1105499267578125,0.9236383626723124
168,7,KNeighbors Classifier,0,0.9,0.9686567164179104,0.9683193087350676,1.2205586433410645,0.9683193087350676
169,7,SVC Classifier,0,0.9,0.9522388059701492,0.9514123185646887,0.8115453720092773,0.9514123185646887
170,7,Decision Tree,0,0.9,0.8462686567164179,0.8410405703408114,0.03030872344970703,0.8410405703408114
171,7,RandomForest,0,0.9,0.7432835820895523,0.6675053326674426,0.09639525413513184,0.6675053326674426
172,7,AdaBoost (Discrete),0,0.9,0.9447761194029851,0.943780429752782,44.136472940444946,0.943780429752782
173,7,AdaBoost (Real),0,0.9,0.8805970149253731,0.8782798896295653,41.20671558380127,0.8782798896295653
174,7,Logistic Regression (Penalty = L2),0,0.9,0.982089552238806,0.9819346187011799,1.0317392349243164,0.9819346187011799
175,7,Naive Bayes,0,0.9,0.9104477611940298,0.90890371383425,0.06493425369262695,0.90890371383425
176,7,KNeighbors Classifier,1,0.9,0.9507462686567164,0.9503587175899287,1.3272876739501953,0.9503587175899287
177,7,SVC Classifier,1,0.9,0.9477611940298507,0.9472065489974774,0.8972964286804199,0.9472065489974774
178,7,Decision Tree,1,0.9,0.8388059701492537,0.837427542145075,0.038599252700805664,0.837427542145075
179,7,RandomForest,1,0.9,0.7,0.6741001377716068,0.09523463249206543,0.6741001377716068
180,7,AdaBoost (Discrete),1,0.9,0.9402985074626866,0.9401081678694249,43.58606576919556,0.9401081678694249
181,7,AdaBoost (Real),1,0.9,0.282089552238806,0.23537415985096913,42.917840003967285,0.0
182,7,Logistic Regression (Penalty = L2),1,0.9,0.9701492537313433,0.9700114419037252,1.0861546993255615,0.9700114419037252
183,7,Naive Bayes,1,0.9,0.926865671641791,0.9262367712449877,0.09282732009887695,0.9262367712449877
184,7,KNeighbors Classifier,2,0.9,0.9636363636363636,0.9633208277019552,1.4996542930603027,0.9633208277019552
185,7,SVC Classifier,2,0.9,0.956060606060606,0.9557342984474526,1.0250754356384277,0.9557342984474526
186,7,Decision Tree,2,0.9,0.85,0.8492349905933979,0.03745865821838379,0.8492349905933979
187,7,RandomForest,2,0.9,0.696969696969697,0.6323644493880508,0.08123564720153809,0.6323644493880508
188,7,AdaBoost (Discrete),2,0.9,0.9393939393939394,0.9389102222726691,41.34066677093506,0.9389102222726691
189,7,AdaBoost (Real),2,0.9,0.6196969696969697,0.526589991402519,38.287888526916504,0.526589991402519
190,7,Logistic Regression (Penalty = L2),2,0.9,0.9803030303030303,0.9801608614023902,1.1259546279907227,0.9801608614023902
191,7,Naive Bayes,2,0.9,0.9181818181818182,0.9175712224741205,0.10437917709350586,0.9175712224741205
192,8,KNeighbors Classifier,0,0.9,0.9671641791044776,0.9666964624355993,1.795607089996338,0.9666964624355993
193,8,SVC Classifier,0,0.9,0.9567164179104478,0.9560166524401315,1.9945061206817627,0.9560166524401315
194,8,Decision Tree,0,0.9,0.8462686567164179,0.8429890376454058,0.0894310474395752,0.8429890376454058
195,8,RandomForest,0,0.9,0.6925373134328359,0.5687238346947349,0.2491910457611084,0.5687238346947349
196,8,AdaBoost (Discrete),0,0.9,0.9597014925373134,0.9592830745631379,114.91506290435791,0.9592830745631379
197,8,AdaBoost (Real),0,0.9,0.7820895522388059,0.7633105672945906,106.73710060119629,0.7633105672945906
198,8,Logistic Regression (Penalty = L2),0,0.9,0.982089552238806,0.9818888312568994,2.668911933898926,0.9818888312568994
199,8,Naive Bayes,0,0.9,0.9104477611940298,0.9088986545457199,0.20243406295776367,0.9088986545457199
200,8,KNeighbors Classifier,1,0.9,0.9522388059701492,0.9518100736275888,4.071750640869141,0.9518100736275888
201,8,SVC Classifier,1,0.9,0.9507462686567164,0.9501953841306926,2.4934282302856445,0.9501953841306926
202,8,Decision Tree,1,0.9,0.835820895522388,0.8294473238491344,0.10179448127746582,0.8294473238491344
203,8,RandomForest,1,0.9,0.6895522388059702,0.5958195494805092,0.33490920066833496,0.5958195494805092
204,8,AdaBoost (Discrete),1,0.9,0.9492537313432836,0.9490370740900325,120.06517148017883,0.9490370740900325
205,8,AdaBoost (Real),1,0.9,0.282089552238806,0.23537415985096913,112.09056544303894,0.0
206,8,Logistic Regression (Penalty = L2),1,0.9,0.9656716417910448,0.9654836906881544,3.0528202056884766,0.9654836906881544
207,8,Naive Bayes,1,0.9,0.926865671641791,0.9261877782644992,0.2152724266052246,0.9261877782644992
208,8,KNeighbors Classifier,2,0.9,0.9636363636363636,0.9633222986913933,3.826007604598999,0.9633222986913933
209,8,SVC Classifier,2,0.9,0.9545454545454546,0.9542560067488401,2.155998706817627,0.9542560067488401
210,8,Decision Tree,2,0.9,0.8363636363636363,0.8351057296667186,0.0985417366027832,0.8351057296667186
211,8,RandomForest,2,0.9,0.7742424242424243,0.7408627979469815,0.26004886627197266,0.7408627979469815
212,8,AdaBoost (Discrete),2,0.9,0.9409090909090909,0.9406066880064788,114.44014739990234,0.9406066880064788
213,8,AdaBoost (Real),2,0.9,0.3984848484848485,0.24222058251807577,114.20863628387451,0.0
214,8,Logistic Regression (Penalty = L2),2,0.9,0.9787878787878788,0.9786423791651166,3.7690603733062744,0.9786423791651166
215,8,Naive Bayes,2,0.9,0.9212121212121213,0.9206890048482588,0.2254657745361328,0.9206890048482588
216,9,KNeighbors Classifier,0,0.9,0.9671641791044776,0.9669137769180901,4.5879225730896,0.9669137769180901
217,9,SVC Classifier,0,0.9,0.9537313432835821,0.9529862371444747,2.6719014644622803,0.9529862371444747
218,9,Decision Tree,0,0.9,0.8328358208955224,0.8280966943729293,0.12246108055114746,0.8280966943729293
219,9,RandomForest,0,0.9,0.6656716417910448,0.5211818118920655,0.33992552757263184,0.5211818118920655
220,9,AdaBoost (Discrete),0,0.9,0.9522388059701492,0.9517569022009014,114.88811564445496,0.9517569022009014
221,9,AdaBoost (Real),0,0.9,0.826865671641791,0.8103661167986971,96.0720841884613,0.8103661167986971
222,9,Logistic Regression (Penalty = L2),0,0.9,0.9791044776119403,0.9789176871891386,2.5239779949188232,0.9789176871891386
223,9,Naive Bayes,0,0.9,0.9119402985074627,0.9106771882577057,0.1891801357269287,0.9106771882577057
224,9,KNeighbors Classifier,1,0.9,0.9582089552238806,0.9578581358655922,3.364426374435425,0.9578581358655922
225,9,SVC Classifier,1,0.9,0.9522388059701492,0.9518184956059198,2.077148675918579,0.9518184956059198
226,9,Decision Tree,1,0.9,0.8388059701492537,0.8361896029447494,0.09362149238586426,0.8361896029447494
227,9,RandomForest,1,0.9,0.6119402985074627,0.4961238552703188,0.22089934349060059,0.4961238552703188
228,9,AdaBoost (Discrete),1,0.9,0.9522388059701492,0.9521262313809934,103.59412622451782,0.9521262313809934
229,9,AdaBoost (Real),1,0.9,0.282089552238806,0.23537415985096913,100.36787056922913,0.0
230,9,Logistic Regression (Penalty = L2),1,0.9,0.9701492537313433,0.9700114419037252,2.2442688941955566,0.9700114419037252
231,9,Naive Bayes,1,0.9,0.926865671641791,0.9261658543250845,0.19647526741027832,0.9261658543250845
232,9,KNeighbors Classifier,2,0.9,0.9606060606060606,0.9602445287337193,3.4037020206451416,0.9602445287337193
233,9,SVC Classifier,2,0.9,0.956060606060606,0.9558089389524732,2.132495403289795,0.9558089389524732
234,9,Decision Tree,2,0.9,0.8318181818181818,0.8302623632882138,0.08523321151733398,0.8302623632882138
235,9,RandomForest,2,0.9,0.7136363636363636,0.6864372237846295,0.27248311042785645,0.6864372237846295
236,9,AdaBoost (Discrete),2,0.9,0.9393939393939394,0.938685190229851,101.14390397071838,0.938685190229851
237,9,AdaBoost (Real),2,0.9,0.6227272727272727,0.4311403453057627,84.10573291778564,0.4311403453057627
238,9,Logistic Regression (Penalty = L2),2,0.9,0.9787878787878788,0.9786423791651166,2.3727550506591797,0.9786423791651166
239,9,Naive Bayes,2,0.9,0.9227272727272727,0.9221376989941963,0.16596770286560059,0.9221376989941963
240,10,KNeighbors Classifier,0,0.9,0.9656716417910448,0.9652742191416217,3.8439340591430664,0.9652742191416217
241,10,SVC Classifier,0,0.9,0.9611940298507463,0.9606714954229025,2.1636416912078857,0.9606714954229025
242,10,Decision Tree,0,0.9,0.8388059701492537,0.8362959654095543,0.091827392578125,0.8362959654095543
243,10,RandomForest,0,0.9,0.7313432835820896,0.6610096232069733,0.22219562530517578,0.6610096232069733
244,10,AdaBoost (Discrete),0,0.9,0.9567164179104478,0.9560968506530367,108.98960733413696,0.9560968506530367
245,10,AdaBoost (Real),0,0.9,0.7985074626865671,0.7843512485737064,91.3756456375122,0.7843512485737064
246,10,Logistic Regression (Penalty = L2),0,0.9,0.9791044776119403,0.9789633360830158,3.3810415267944336,0.9789633360830158
247,10,Naive Bayes,0,0.9,0.9164179104477612,0.9151896745128952,0.19288158416748047,0.9151896745128952
248,10,KNeighbors Classifier,1,0.9,0.9537313432835821,0.9532735366127436,3.5378119945526123,0.9532735366127436
249,10,SVC Classifier,1,0.9,0.9567164179104478,0.956303405222464,1.8849554061889648,0.956303405222464
250,10,Decision Tree,1,0.9,0.8462686567164179,0.8451502153556611,0.09194827079772949,0.8451502153556611
251,10,RandomForest,1,0.9,0.7014925373134329,0.660142216686619,0.22032403945922852,0.660142216686619
252,10,AdaBoost (Discrete),1,0.9,0.9447761194029851,0.9445586376306804,99.1749267578125,0.9445586376306804
253,10,AdaBoost (Real),1,0.9,0.2865671641791045,0.2742092605526665,89.50561285018921,0.0
254,10,Logistic Regression (Penalty = L2),1,0.9,0.9716417910447761,0.9715632520762846,2.250523328781128,0.9715632520762846
255,10,Naive Bayes,1,0.9,0.9298507462686567,0.9293296655091705,0.19207000732421875,0.9293296655091705
256,10,KNeighbors Classifier,2,0.9,0.9651515151515152,0.9648899851503053,3.4473185539245605,0.9648899851503053
257,10,SVC Classifier,2,0.9,0.9636363636363636,0.9634149525642907,1.7417535781860352,0.9634149525642907
258,10,Decision Tree,2,0.9,0.8636363636363636,0.8621630449109624,0.06429147720336914,0.8621630449109624
259,10,RandomForest,2,0.9,0.759090909090909,0.6838089695730086,0.2475738525390625,0.6838089695730086
260,10,AdaBoost (Discrete),2,0.9,0.9348484848484848,0.9343813699579127,86.9371976852417,0.9343813699579127
261,10,AdaBoost (Real),2,0.9,0.43636363636363634,0.2245319197936806,71.42095303535461,0.2245319197936806
262,10,Logistic Regression (Penalty = L2),2,0.9,0.9757575757575757,0.975540244043066,2.192890167236328,0.975540244043066
263,10,Naive Bayes,2,0.9,0.9272727272727272,0.9266799535419279,0.1796717643737793,0.9266799535419279
264,11,KNeighbors Classifier,0,0.9,0.9656716417910448,0.9652742191416217,2.937298059463501,0.9652742191416217
265,11,SVC Classifier,0,0.9,0.9597014925373134,0.9591356172944304,1.6151914596557617,0.9591356172944304
266,11,Decision Tree,0,0.9,0.8582089552238806,0.8570002156479636,0.09935331344604492,0.8570002156479636
267,11,RandomForest,0,0.9,0.6940298507462687,0.6450096312574963,0.19491147994995117,0.6450096312574963
268,11,AdaBoost (Discrete),0,0.9,0.9537313432835821,0.9531104128393895,79.21387434005737,0.9531104128393895
269,11,AdaBoost (Real),0,0.9,0.6850746268656717,0.6188114214683578,62.482104539871216,0.6188114214683578
270,11,Logistic Regression (Penalty = L2),0,0.9,0.9776119402985075,0.9773287741044282,1.8572914600372314,0.9773287741044282
271,11,Naive Bayes,0,0.9,0.9164179104477612,0.9151624654724116,0.18201422691345215,0.9151624654724116
272,11,KNeighbors Classifier,1,0.9,0.9522388059701492,0.951672704146839,1.9214916229248047,0.951672704146839
273,11,SVC Classifier,1,0.9,0.9537313432835821,0.9533193791939454,1.177976131439209,0.9533193791939454
274,11,Decision Tree,1,0.9,0.8164179104477612,0.8140385349826527,0.048417091369628906,0.8140385349826527
275,11,RandomForest,1,0.9,0.6701492537313433,0.5660672694152222,0.16216421127319336,0.5660672694152222
276,11,AdaBoost (Discrete),1,0.9,0.9477611940298507,0.9475205369352286,66.8725278377533,0.9475205369352286
277,11,AdaBoost (Real),1,0.9,0.2865671641791045,0.17750218685961625,58.01634645462036,0.0
278,11,Logistic Regression (Penalty = L2),1,0.9,0.9716417910447761,0.9715632520762846,1.474332332611084,0.9715632520762846
279,11,Naive Bayes,1,0.9,0.9313432835820895,0.9307496006512112,0.15477728843688965,0.9307496006512112
280,11,KNeighbors Classifier,2,0.9,0.9651515151515152,0.9648899851503053,2.0272955894470215,0.9648899851503053
281,11,SVC Classifier,2,0.9,0.9636363636363636,0.9634149525642907,1.163557529449463,0.9634149525642907
282,11,Decision Tree,2,0.9,0.8348484848484848,0.8338798743080426,0.049460649490356445,0.8338798743080426
283,11,RandomForest,2,0.9,0.6393939393939394,0.5025551311949815,0.15161585807800293,0.5025551311949815
284,11,AdaBoost (Discrete),2,0.9,0.9393939393939394,0.9388827833791948,59.46586775779724,0.9388827833791948
285,11,AdaBoost (Real),2,0.9,0.5666666666666667,0.47753558337160085,51.37653398513794,0.47753558337160085
286,11,Logistic Regression (Penalty = L2),2,0.9,0.9742424242424242,0.9739805944319254,1.6031088829040527,0.9739805944319254
287,11,Naive Bayes,2,0.9,0.9272727272727272,0.9266799535419279,0.17654085159301758,0.9266799535419279
288,12,KNeighbors Classifier,0,0.9,0.9641791044776119,0.9638465578528289,1.2768030166625977,0.9638465578528289
289,12,SVC Classifier,0,0.9,0.9492537313432836,0.9483921494121313,0.9100415706634521,0.9483921494121313
290,12,Decision Tree,0,0.9,0.8492537313432836,0.8438087390089748,0.04894089698791504,0.8438087390089748
291,12,RandomForest,0,0.9,0.6611940298507463,0.5685151207946058,0.09188318252563477,0.5685151207946058
292,12,AdaBoost (Discrete),0,0.9,0.9417910447761194,0.9405348133209607,37.50293016433716,0.9405348133209607
293,12,AdaBoost (Real),0,0.9,0.8194029850746268,0.8079836192425485,31.273045778274536,0.8079836192425485
294,12,Logistic Regression (Penalty = L2),0,0.9,0.982089552238806,0.9819113751693661,0.9188957214355469,0.9819113751693661
295,12,Naive Bayes,0,0.9,0.9044776119402985,0.9028698005129848,0.11976504325866699,0.9028698005129848
296,12,KNeighbors Classifier,1,0.9,0.9537313432835821,0.9532657463311381,1.028263807296753,0.9532657463311381
297,12,SVC Classifier,1,0.9,0.9477611940298507,0.9472507191374195,0.7431049346923828,0.9472507191374195
298,12,Decision Tree,1,0.9,0.8537313432835821,0.8505760241742848,0.057280540466308594,0.8505760241742848
299,12,RandomForest,1,0.9,0.6164179104477612,0.5255084231479609,0.18056011199951172,0.5255084231479609
300,12,AdaBoost (Discrete),1,0.9,0.9477611940298507,0.9476160820210827,32.68034029006958,0.9476160820210827
301,12,AdaBoost (Real),1,0.9,0.34776119402985073,0.2054289534568429,28.690404653549194,0.0
302,12,Logistic Regression (Penalty = L2),1,0.9,0.9686567164179104,0.9684140608077759,0.40720295906066895,0.9684140608077759
303,12,Naive Bayes,1,0.9,0.9253731343283582,0.9245157654020523,0.07333827018737793,0.9245157654020523
304,12,KNeighbors Classifier,2,0.9,0.9621212121212122,0.9617571593009256,0.9635617733001709,0.9617571593009256
305,12,SVC Classifier,2,0.9,0.9515151515151515,0.9512295746567503,0.5956377983093262,0.9512295746567503
306,12,Decision Tree,2,0.9,0.8454545454545455,0.8437420107545849,0.015510082244873047,0.8437420107545849
307,12,RandomForest,2,0.9,0.6893939393939394,0.612832863492612,0.04795360565185547,0.612832863492612
308,12,AdaBoost (Discrete),2,0.9,0.9393939393939394,0.9388628695337256,27.81515860557556,0.9388628695337256
309,12,AdaBoost (Real),2,0.9,0.7287878787878788,0.7174096890470444,24.991328239440918,0.7174096890470444
310,12,Logistic Regression (Penalty = L2),2,0.9,0.9757575757575757,0.9755871574222122,0.6604299545288086,0.9755871574222122
311,12,Naive Bayes,2,0.9,0.9227272727272727,0.9221616914411943,0.1068878173828125,0.9221616914411943
