,feat_set_id,classifier,fold_id,feat_th,score,geo_score,exec_t,geo_score_woz
0,0,KNeighbors Classifier,0,0.95,0.9805970149253731,0.9804823163238391,5.804542541503906,0.9804823163238391
1,0,SVC Classifier,0,0.95,0.9776119402985075,0.9774452843801438,1.9054327011108398,0.9774452843801438
2,0,Decision Tree,0,0.95,0.8597014925373134,0.8564096948746861,0.09898066520690918,0.8564096948746861
3,0,RandomForest,0,0.95,0.5955223880597015,0.5599899122143733,0.2425074577331543,0.0
4,0,AdaBoost (Discrete),0,0.95,0.9402985074626866,0.9392808764417152,53.94965171813965,0.9392808764417152
5,0,AdaBoost (Real),0,0.95,0.8985074626865671,0.8963148008835103,62.504807233810425,0.8963148008835103
6,0,Logistic Regression (Penalty = L2),0,0.95,0.9507462686567164,0.9501064559252392,2.356781482696533,0.9501064559252392
7,0,Naive Bayes,0,0.95,0.9223880597014925,0.921218650016334,0.27103281021118164,0.921218650016334
8,0,KNeighbors Classifier,1,0.95,0.9641791044776119,0.963941590974679,5.862044334411621,0.963941590974679
9,0,SVC Classifier,1,0.95,0.9671641791044776,0.967029734080962,2.030251979827881,0.967029734080962
10,0,Decision Tree,1,0.95,0.8343283582089552,0.8329762400154797,0.06742429733276367,0.8329762400154797
11,0,RandomForest,1,0.95,0.6358208955223881,0.6020219485784492,0.23986458778381348,0.0
12,0,AdaBoost (Discrete),1,0.95,0.9388059701492537,0.9385341782119084,55.77515435218811,0.9385341782119084
13,0,AdaBoost (Real),1,0.95,0.6388059701492538,0.6018746083485988,57.70080614089966,0.6018746083485988
14,0,Logistic Regression (Penalty = L2),1,0.95,0.9492537313432836,0.9486246921410011,2.441544532775879,0.9486246921410011
15,0,Naive Bayes,1,0.95,0.9149253731343283,0.914361641217714,0.23578619956970215,0.914361641217714
16,0,KNeighbors Classifier,2,0.95,0.9787878787878788,0.9786177192166646,6.378115892410278,0.9786177192166646
17,0,SVC Classifier,2,0.95,0.9681818181818181,0.968123779544639,2.0496985912323,0.968123779544639
18,0,Decision Tree,2,0.95,0.843939393939394,0.8424585202014621,0.07145810127258301,0.8424585202014621
19,0,RandomForest,2,0.95,0.7015151515151515,0.7119127255123643,0.26313328742980957,0.0
20,0,AdaBoost (Discrete),2,0.95,0.9318181818181818,0.9301582967932824,57.91074180603027,0.9301582967932824
21,0,AdaBoost (Real),2,0.95,0.8757575757575757,0.8703656237989716,57.09828543663025,0.8703656237989716
22,0,Logistic Regression (Penalty = L2),2,0.95,0.9515151515151515,0.9509778666467729,2.4789669513702393,0.9509778666467729
23,0,Naive Bayes,2,0.95,0.9212121212121213,0.920965829402092,0.2752554416656494,0.920965829402092
24,1,KNeighbors Classifier,0,0.95,0.9835820895522388,0.9834582092470274,6.468582391738892,0.9834582092470274
25,1,SVC Classifier,0,0.95,0.9791044776119403,0.9789619091798016,2.036717653274536,0.9789619091798016
26,1,Decision Tree,0,0.95,0.8402985074626865,0.8375517160839467,0.07511353492736816,0.8375517160839467
27,1,RandomForest,0,0.95,0.6955223880597015,0.746436480920992,0.2522459030151367,0.0
28,1,AdaBoost (Discrete),0,0.95,0.9492537313432836,0.9487827123428112,56.81174325942993,0.9487827123428112
29,1,AdaBoost (Real),0,0.95,0.8880597014925373,0.8867688653131459,59.06132411956787,0.8867688653131459
30,1,Logistic Regression (Penalty = L2),0,0.95,0.9522388059701492,0.9515542251189686,2.363703727722168,0.9515542251189686
31,1,Naive Bayes,0,0.95,0.926865671641791,0.9258453358627169,0.29207873344421387,0.9258453358627169
32,1,KNeighbors Classifier,1,0.95,0.9686567164179104,0.9684621103292463,5.28205132484436,0.9684621103292463
33,1,SVC Classifier,1,0.95,0.9671641791044776,0.967029734080962,1.6721653938293457,0.967029734080962
34,1,Decision Tree,1,0.95,0.8343283582089552,0.8326849977741951,0.07164120674133301,0.8326849977741951
35,1,RandomForest,1,0.95,0.6880597014925374,0.7231841115839771,0.2295999526977539,0.0
36,1,AdaBoost (Discrete),1,0.95,0.9402985074626866,0.9399170225007755,54.13693833351135,0.9399170225007755
37,1,AdaBoost (Real),1,0.95,0.9074626865671642,0.9065403545399152,54.16625165939331,0.9065403545399152
38,1,Logistic Regression (Penalty = L2),1,0.95,0.9492537313432836,0.9484296222205594,2.1255362033843994,0.9484296222205594
39,1,Naive Bayes,1,0.95,0.9149253731343283,0.9142344256647055,0.2958195209503174,0.9142344256647055
40,1,KNeighbors Classifier,2,0.95,0.9757575757575757,0.9756109786668183,5.118592977523804,0.9756109786668183
41,1,SVC Classifier,2,0.95,0.9666666666666667,0.9666239453637299,2.1840603351593018,0.9666239453637299
42,1,Decision Tree,2,0.95,0.8621212121212121,0.8594589647165292,0.07606816291809082,0.8594589647165292
43,1,RandomForest,2,0.95,0.7212121212121212,0.5295511970843882,0.26079678535461426,0.5295511970843882
44,1,AdaBoost (Discrete),2,0.95,0.9454545454545454,0.9447113571882152,58.67672419548035,0.9447113571882152
45,1,AdaBoost (Real),2,0.95,0.8606060606060606,0.8537577901102272,62.46267819404602,0.8537577901102272
46,1,Logistic Regression (Penalty = L2),2,0.95,0.95,0.9493311402491265,2.395596504211426,0.9493311402491265
47,1,Naive Bayes,2,0.95,0.9257575757575758,0.925521722970313,0.2417137622833252,0.925521722970313
48,2,KNeighbors Classifier,0,0.95,0.9776119402985075,0.9774228430056071,7.119975328445435,0.9774228430056071
49,2,SVC Classifier,0,0.95,0.9761194029850746,0.9759541111282376,2.159621238708496,0.9759541111282376
50,2,Decision Tree,0,0.95,0.8313432835820895,0.8288965196016691,0.0741117000579834,0.8288965196016691
51,2,RandomForest,0,0.95,0.6492537313432836,0.6840039197590498,0.31980133056640625,0.0
52,2,AdaBoost (Discrete),0,0.95,0.935820895522388,0.9345321484702631,56.53981971740723,0.9345321484702631
53,2,AdaBoost (Real),0,0.95,0.9194029850746268,0.9185909023786806,57.33875560760498,0.9185909023786806
54,2,Logistic Regression (Penalty = L2),0,0.95,0.9507462686567164,0.9500741084105663,2.1189656257629395,0.9500741084105663
55,2,Naive Bayes,0,0.95,0.9208955223880597,0.92000826671702,0.2428874969482422,0.92000826671702
56,2,KNeighbors Classifier,1,0.95,0.9701492537313433,0.9698484875377087,5.481480836868286,0.9698484875377087
57,2,SVC Classifier,1,0.95,0.9671641791044776,0.967029734080962,1.675619125366211,0.967029734080962
58,2,Decision Tree,1,0.95,0.8313432835820895,0.8277652100389802,0.03715085983276367,0.8277652100389802
59,2,RandomForest,1,0.95,0.7402985074626866,0.6840438110979749,0.20491433143615723,0.6840438110979749
60,2,AdaBoost (Discrete),1,0.95,0.9328358208955224,0.9324987095676034,50.19763445854187,0.9324987095676034
61,2,AdaBoost (Real),1,0.95,0.7805970149253731,0.7722934408847165,48.95405459403992,0.7722934408847165
62,2,Logistic Regression (Penalty = L2),1,0.95,0.9507462686567164,0.9500522954566903,1.904158353805542,0.9500522954566903
63,2,Naive Bayes,1,0.95,0.9164179104477612,0.915825822112405,0.23744678497314453,0.915825822112405
64,2,KNeighbors Classifier,2,0.95,0.9772727272727273,0.9771732390364817,5.531070232391357,0.9771732390364817
65,2,SVC Classifier,2,0.95,0.9666666666666667,0.9666239453637299,1.7604026794433594,0.9666239453637299
66,2,Decision Tree,2,0.95,0.843939393939394,0.8431807361683028,0.09122228622436523,0.8431807361683028
67,2,RandomForest,2,0.95,0.6757575757575758,0.4158002903446757,0.18087172508239746,0.4158002903446757
68,2,AdaBoost (Discrete),2,0.95,0.9424242424242424,0.9419464369671201,48.536500692367554,0.9419464369671201
69,2,AdaBoost (Real),2,0.95,0.8393939393939394,0.8289090528202533,50.89388370513916,0.8289090528202533
70,2,Logistic Regression (Penalty = L2),2,0.95,0.9515151515151515,0.9510778146705287,2.042574405670166,0.9510778146705287
71,2,Naive Bayes,2,0.95,0.9196969696969697,0.9193962433625095,0.23511028289794922,0.9193962433625095
72,3,KNeighbors Classifier,0,0.95,0.982089552238806,0.9818874000895844,5.604145765304565,0.9818874000895844
73,3,SVC Classifier,0,0.95,0.9746268656716418,0.9744652127838919,1.780409574508667,0.9744652127838919
74,3,Decision Tree,0,0.95,0.835820895522388,0.8343405543263871,0.060929298400878906,0.8343405543263871
75,3,RandomForest,0,0.95,0.6850746268656717,0.7315817915114556,0.2187366485595703,0.0
76,3,AdaBoost (Discrete),0,0.95,0.9462686567164179,0.9453887241038773,47.60862970352173,0.9453887241038773
77,3,AdaBoost (Real),0,0.95,0.9283582089552239,0.9275782607112179,48.739985942840576,0.9275782607112179
78,3,Logistic Regression (Penalty = L2),0,0.95,0.9522388059701492,0.951358552785613,1.9907076358795166,0.951358552785613
79,3,Naive Bayes,0,0.95,0.926865671641791,0.9258919967507607,0.2358713150024414,0.9258919967507607
80,3,KNeighbors Classifier,1,0.95,0.9656716417910448,0.965392244982325,5.654340982437134,0.965392244982325
81,3,SVC Classifier,1,0.95,0.9701492537313433,0.9700566754815333,1.7572317123413086,0.9700566754815333
82,3,Decision Tree,1,0.95,0.8432835820895522,0.8426841053294636,0.06889581680297852,0.8426841053294636
83,3,RandomForest,1,0.95,0.6850746268656717,0.521434923568034,0.21239423751831055,0.521434923568034
84,3,AdaBoost (Discrete),1,0.95,0.935820895522388,0.9354594789615557,46.187286138534546,0.9354594789615557
85,3,AdaBoost (Real),1,0.95,0.9,0.8989934397664909,47.17684364318848,0.8989934397664909
86,3,Logistic Regression (Penalty = L2),1,0.95,0.9477611940298507,0.9467815713627952,1.8733224868774414,0.9467815713627952
87,3,Naive Bayes,1,0.95,0.9149253731343283,0.9142648372660149,0.18748116493225098,0.9142648372660149
88,3,KNeighbors Classifier,2,0.95,0.9772727272727273,0.9771732390364817,4.8157267570495605,0.9771732390364817
89,3,SVC Classifier,2,0.95,0.9636363636363636,0.9635841872072517,1.6047651767730713,0.9635841872072517
90,3,Decision Tree,2,0.95,0.8712121212121212,0.8702082264458867,0.03556704521179199,0.8702082264458867
91,3,RandomForest,2,0.95,0.706060606060606,0.6164471925404452,0.15784716606140137,0.6164471925404452
92,3,AdaBoost (Discrete),2,0.95,0.9333333333333333,0.9327539573841828,41.83299136161804,0.9327539573841828
93,3,AdaBoost (Real),2,0.95,0.5136363636363637,0.35604017503593743,43.3016619682312,0.35604017503593743
94,3,Logistic Regression (Penalty = L2),2,0.95,0.9484848484848485,0.9480152403266197,1.7014832496643066,0.9480152403266197
95,3,Naive Bayes,2,0.95,0.9227272727272727,0.9224175021607529,0.21176886558532715,0.9224175021607529
96,4,KNeighbors Classifier,0,0.95,0.9835820895522388,0.983480789192005,4.994611024856567,0.983480789192005
97,4,SVC Classifier,0,0.95,0.9776119402985075,0.9774452843801438,1.365408182144165,0.9774452843801438
98,4,Decision Tree,0,0.95,0.8462686567164179,0.8444048038503066,0.03468608856201172,0.8444048038503066
99,4,RandomForest,0,0.95,0.744776119402985,0.8212933496268264,0.15863823890686035,0.0
100,4,AdaBoost (Discrete),0,0.95,0.9492537313432836,0.9485702501954922,39.93995404243469,0.9485702501954922
101,4,AdaBoost (Real),0,0.95,0.908955223880597,0.9075732398585563,40.83818578720093,0.9075732398585563
102,4,Logistic Regression (Penalty = L2),0,0.95,0.9492537313432836,0.9485200758931944,1.628861427307129,0.9485200758931944
103,4,Naive Bayes,0,0.95,0.9253731343283582,0.924171334463501,0.20118927955627441,0.924171334463501
104,4,KNeighbors Classifier,1,0.95,0.9671641791044776,0.967006843365062,3.9235739707946777,0.967006843365062
105,4,SVC Classifier,1,0.95,0.9686567164179104,0.9685538468246536,1.2917678356170654,0.9685538468246536
106,4,Decision Tree,1,0.95,0.808955223880597,0.8055456619128083,0.060869693756103516,0.8055456619128083
107,4,RandomForest,1,0.95,0.7074626865671642,0.7544202406949294,0.16062235832214355,0.0
108,4,AdaBoost (Discrete),1,0.95,0.9283582089552239,0.9280000581786231,40.271228313446045,0.9280000581786231
109,4,AdaBoost (Real),1,0.95,0.6388059701492538,0.585028877188103,38.253639698028564,0.585028877188103
110,4,Logistic Regression (Penalty = L2),1,0.95,0.9537313432835821,0.9531237962275375,1.5919857025146484,0.9531237962275375
111,4,Naive Bayes,1,0.95,0.9149253731343283,0.9142344256647055,0.1955547332763672,0.9142344256647055
112,4,KNeighbors Classifier,2,0.95,0.9787878787878788,0.9786177192166646,3.960697889328003,0.9786177192166646
113,4,SVC Classifier,2,0.95,0.9681818181818181,0.968123779544639,1.3726489543914795,0.968123779544639
114,4,Decision Tree,2,0.95,0.8606060606060606,0.8584236771649039,0.05997109413146973,0.8584236771649039
115,4,RandomForest,2,0.95,0.759090909090909,0.8415581566146153,0.1422581672668457,0.0
116,4,AdaBoost (Discrete),2,0.95,0.9378787878787879,0.937272174094248,38.509636878967285,0.937272174094248
117,4,AdaBoost (Real),2,0.95,0.7757575757575758,0.7629012288814913,39.461023569107056,0.7629012288814913
118,4,Logistic Regression (Penalty = L2),2,0.95,0.95,0.949504595212044,1.6190907955169678,0.949504595212044
119,4,Naive Bayes,2,0.95,0.9212121212121213,0.9210178775443775,0.20854425430297852,0.9210178775443775
120,5,KNeighbors Classifier,0,0.95,0.982089552238806,0.9819346187011799,4.0370190143585205,0.9819346187011799
121,5,SVC Classifier,0,0.95,0.9761194029850746,0.9759541111282376,1.3871111869812012,0.9759541111282376
122,5,Decision Tree,0,0.95,0.8283582089552238,0.8234718157712483,0.035941123962402344,0.8234718157712483
123,5,RandomForest,0,0.95,0.7164179104477612,0.7855340505500091,0.1572589874267578,0.0
124,5,AdaBoost (Discrete),0,0.95,0.9492537313432836,0.948661551059123,36.310898303985596,0.948661551059123
125,5,AdaBoost (Real),0,0.95,0.8850746268656716,0.8758381850584983,36.30723714828491,0.8758381850584983
126,5,Logistic Regression (Penalty = L2),0,0.95,0.9507462686567164,0.9500298066164624,1.3610849380493164,0.9500298066164624
127,5,Naive Bayes,0,0.95,0.9208955223880597,0.9197458473123484,0.20337557792663574,0.9197458473123484
128,5,KNeighbors Classifier,1,0.95,0.9671641791044776,0.9668177624346405,3.5277328491210938,0.9668177624346405
129,5,SVC Classifier,1,0.95,0.9671641791044776,0.967029734080962,1.2031986713409424,0.967029734080962
130,5,Decision Tree,1,0.95,0.8432835820895522,0.8404240529945788,0.07452154159545898,0.8404240529945788
131,5,RandomForest,1,0.95,0.7283582089552239,0.5895803158910816,0.18606829643249512,0.5895803158910816
132,5,AdaBoost (Discrete),1,0.95,0.9492537313432836,0.9488441132717046,31.075645685195923,0.9488441132717046
133,5,AdaBoost (Real),1,0.95,0.6492537313432836,0.6126183833301251,31.350139617919922,0.6126183833301251
134,5,Logistic Regression (Penalty = L2),1,0.95,0.9477611940298507,0.9470316664806705,1.2704763412475586,0.9470316664806705
135,5,Naive Bayes,1,0.95,0.9164179104477612,0.9159260273657078,0.12651920318603516,0.9159260273657078
136,5,KNeighbors Classifier,2,0.95,0.9772727272727273,0.9771732390364817,3.228292226791382,0.9771732390364817
137,5,SVC Classifier,2,0.95,0.9681818181818181,0.968123779544639,1.2244985103607178,0.968123779544639
138,5,Decision Tree,2,0.95,0.8560606060606061,0.85365690664318,0.06168961524963379,0.85365690664318
139,5,RandomForest,2,0.95,0.753030303030303,0.5553047756154088,0.16492295265197754,0.5553047756154088
140,5,AdaBoost (Discrete),2,0.95,0.9227272727272727,0.9221939931968128,32.439966917037964,0.9221939931968128
141,5,AdaBoost (Real),2,0.95,0.8833333333333333,0.8808944636899985,32.39680790901184,0.8808944636899985
142,5,Logistic Regression (Penalty = L2),2,0.95,0.953030303030303,0.9527016527488672,1.3076996803283691,0.9527016527488672
143,5,Naive Bayes,2,0.95,0.9196969696969697,0.9193945393584481,0.18922686576843262,0.9193945393584481
144,6,KNeighbors Classifier,0,0.95,0.982089552238806,0.9819099439691917,3.227750778198242,0.9819099439691917
145,6,SVC Classifier,0,0.95,0.9761194029850746,0.9759541111282376,1.052631139755249,0.9759541111282376
146,6,Decision Tree,0,0.95,0.8149253731343283,0.8100310042116511,0.045183658599853516,0.8100310042116511
147,6,RandomForest,0,0.95,0.6955223880597015,0.6450034458235449,0.12068819999694824,0.6450034458235449
148,6,AdaBoost (Discrete),0,0.95,0.9223880597014925,0.9187610740240917,29.591532707214355,0.9187610740240917
149,6,AdaBoost (Real),0,0.95,0.9014925373134328,0.8991388389303134,30.589648962020874,0.8991388389303134
150,6,Logistic Regression (Penalty = L2),0,0.95,0.9537313432835821,0.9528441170323262,1.2246615886688232,0.9528441170323262
151,6,Naive Bayes,0,0.95,0.926865671641791,0.9258686660127935,0.1550605297088623,0.9258686660127935
152,6,KNeighbors Classifier,1,0.95,0.9641791044776119,0.9638237424864039,2.9575138092041016,0.9638237424864039
153,6,SVC Classifier,1,0.95,0.9686567164179104,0.9685538468246537,1.0079221725463867,0.9685538468246537
154,6,Decision Tree,1,0.95,0.817910447761194,0.8166485266338271,0.027718305587768555,0.8166485266338271
155,6,RandomForest,1,0.95,0.7074626865671642,0.6748563069567608,0.10589098930358887,0.6748563069567608
156,6,AdaBoost (Discrete),1,0.95,0.9373134328358209,0.9370801847555181,28.55286478996277,0.9370801847555181
157,6,AdaBoost (Real),1,0.95,0.8313432835820895,0.818954936739612,27.912273168563843,0.818954936739612
158,6,Logistic Regression (Penalty = L2),1,0.95,0.9477611940298507,0.9472290367731312,1.3244006633758545,0.9472290367731312
159,6,Naive Bayes,1,0.95,0.9149253731343283,0.9141376351813844,0.16169095039367676,0.9141376351813844
160,6,KNeighbors Classifier,2,0.95,0.9803030303030303,0.9801847943246875,2.916628837585449,0.9801847943246875
161,6,SVC Classifier,2,0.95,0.9651515151515152,0.9651028695058245,1.0044655799865723,0.9651028695058245
162,6,Decision Tree,2,0.95,0.8409090909090909,0.8361678890099606,0.026791810989379883,0.8361678890099606
163,6,RandomForest,2,0.95,0.693939393939394,0.5590788120040265,0.14020872116088867,0.5590788120040265
164,6,AdaBoost (Discrete),2,0.95,0.9242424242424242,0.9228736006173835,26.290961742401123,0.9228736006173835
165,6,AdaBoost (Real),2,0.95,0.9075757575757576,0.905609674577938,25.430004358291626,0.905609674577938
166,6,Logistic Regression (Penalty = L2),2,0.95,0.946969696969697,0.946546558644063,1.2626261711120605,0.946546558644063
167,6,Naive Bayes,2,0.95,0.9212121212121213,0.9209691606155047,0.15930891036987305,0.9209691606155047
168,7,KNeighbors Classifier,0,0.95,0.982089552238806,0.9819331874671267,2.815868377685547,0.9819331874671267
169,7,SVC Classifier,0,0.95,0.9776119402985075,0.9774452843801438,0.8626973628997803,0.9774452843801438
170,7,Decision Tree,0,0.95,0.8164179104477612,0.8133771834680809,0.02383708953857422,0.8133771834680809
171,7,RandomForest,0,0.95,0.746268656716418,0.7160047950140342,0.07219791412353516,0.7160047950140342
172,7,AdaBoost (Discrete),0,0.95,0.9447761194029851,0.9440180620550379,24.574881315231323,0.9440180620550379
173,7,AdaBoost (Real),0,0.95,0.8865671641791045,0.8835223061775463,25.345567226409912,0.8835223061775463
174,7,Logistic Regression (Penalty = L2),0,0.95,0.9492537313432836,0.9485551729050498,1.07175612449646,0.9485551729050498
175,7,Naive Bayes,0,0.95,0.9253731343283582,0.924388429073588,0.16553401947021484,0.924388429073588
176,7,KNeighbors Classifier,1,0.95,0.9716417910447761,0.9714015203446259,2.862208366394043,0.9714015203446259
177,7,SVC Classifier,1,0.95,0.9671641791044776,0.967029734080962,0.9847195148468018,0.967029734080962
178,7,Decision Tree,1,0.95,0.8388059701492537,0.83573366135475,0.0256195068359375,0.83573366135475
179,7,RandomForest,1,0.95,0.6671641791044776,0.6868424669569223,0.12077593803405762,0.0
180,7,AdaBoost (Discrete),1,0.95,0.9432835820895522,0.9428773632142557,22.519659757614136,0.9428773632142557
181,7,AdaBoost (Real),1,0.95,0.8865671641791045,0.8848669440548175,25.457817316055298,0.8848669440548175
182,7,Logistic Regression (Penalty = L2),1,0.95,0.9507462686567164,0.9500522954566903,0.9109616279602051,0.9500522954566903
183,7,Naive Bayes,1,0.95,0.9149253731343283,0.9142344256647055,0.151993989944458,0.9142344256647055
184,7,KNeighbors Classifier,2,0.95,0.9742424242424242,0.9740757608466152,2.216616153717041,0.9740757608466152
185,7,SVC Classifier,2,0.95,0.9666666666666667,0.9666239453637299,0.7371766567230225,0.9666239453637299
186,7,Decision Tree,2,0.95,0.8348484848484848,0.8330342995673536,0.039830684661865234,0.8330342995673536
187,7,RandomForest,2,0.95,0.7318181818181818,0.6759670935914376,0.10927987098693848,0.6759670935914376
188,7,AdaBoost (Discrete),2,0.95,0.9409090909090909,0.9405597978929081,22.943480014801025,0.9405597978929081
189,7,AdaBoost (Real),2,0.95,0.8606060606060606,0.8526883365647059,23.912471532821655,0.8526883365647059
190,7,Logistic Regression (Penalty = L2),2,0.95,0.9545454545454546,0.9537704011021549,1.1147792339324951,0.9537704011021549
191,7,Naive Bayes,2,0.95,0.9227272727272727,0.9224662957032139,0.1552581787109375,0.9224662957032139
192,8,KNeighbors Classifier,0,0.95,0.982089552238806,0.9819331874671267,2.237362861633301,0.9819331874671267
193,8,SVC Classifier,0,0.95,0.9746268656716418,0.9744652127838919,0.7403628826141357,0.9744652127838919
194,8,Decision Tree,0,0.95,0.8298507462686567,0.8260364525299972,0.022918701171875,0.8260364525299972
195,8,RandomForest,0,0.95,0.7029850746268657,0.6528693503253785,0.06902956962585449,0.6528693503253785
196,8,AdaBoost (Discrete),0,0.95,0.9447761194029851,0.944103714380966,21.227803945541382,0.944103714380966
197,8,AdaBoost (Real),0,0.95,0.8865671641791045,0.8845589425257765,23.121886730194092,0.8845589425257765
198,8,Logistic Regression (Penalty = L2),0,0.95,0.9537313432835821,0.9529358292600422,0.8406143188476562,0.9529358292600422
199,8,Naive Bayes,0,0.95,0.926865671641791,0.9258686660127935,0.16744208335876465,0.9258686660127935
200,8,KNeighbors Classifier,1,0.95,0.9626865671641791,0.9623556081944327,2.458209276199341,0.9623556081944327
201,8,SVC Classifier,1,0.95,0.9701492537313433,0.9700566754815333,0.8071749210357666,0.9700566754815333
202,8,Decision Tree,1,0.95,0.8432835820895522,0.8409602235863103,0.02542567253112793,0.8409602235863103
203,8,RandomForest,1,0.95,0.7716417910447761,0.7398843385643893,0.08009672164916992,0.7398843385643893
204,8,AdaBoost (Discrete),1,0.95,0.9462686567164179,0.9458333308571614,20.455503702163696,0.9458333308571614
205,8,AdaBoost (Real),1,0.95,0.7865671641791044,0.7798740178407118,20.86889100074768,0.7798740178407118
206,8,Logistic Regression (Penalty = L2),1,0.95,0.9537313432835821,0.9529496801110235,0.7549440860748291,0.9529496801110235
207,8,Naive Bayes,1,0.95,0.9134328358208955,0.9126761532835892,0.17172503471374512,0.9126761532835892
208,8,KNeighbors Classifier,2,0.95,0.9742424242424242,0.9740757608466152,2.3352200984954834,0.9740757608466152
209,8,SVC Classifier,2,0.95,0.9666666666666667,0.9666003435532253,0.6837112903594971,0.9666003435532253
210,8,Decision Tree,2,0.95,0.8712121212121212,0.8680383536404574,0.027863740921020508,0.8680383536404574
211,8,RandomForest,2,0.95,0.706060606060606,0.5579920032139948,0.126906156539917,0.5579920032139948
212,8,AdaBoost (Discrete),2,0.95,0.9318181818181818,0.9308348853356181,19.30394458770752,0.9308348853356181
213,8,AdaBoost (Real),2,0.95,0.5060606060606061,0.35061611605514553,18.12744140625,0.35061611605514553
214,8,Logistic Regression (Penalty = L2),2,0.95,0.946969696969697,0.9466181519177265,0.7049000263214111,0.9466181519177265
215,8,Naive Bayes,2,0.95,0.9227272727272727,0.9225150918267293,0.131422758102417,0.9225150918267293
216,9,KNeighbors Classifier,0,0.95,0.9791044776119403,0.9789162603524607,2.07981014251709,0.9789162603524607
217,9,SVC Classifier,0,0.95,0.9761194029850746,0.9759541111282376,0.6463963985443115,0.9759541111282376
218,9,Decision Tree,0,0.95,0.8507462686567164,0.8466779469755481,0.009013652801513672,0.8466779469755481
219,9,RandomForest,0,0.95,0.6447761194029851,0.6796683952873035,0.09130096435546875,0.0
220,9,AdaBoost (Discrete),0,0.95,0.9477611940298507,0.9466308942012641,16.91831135749817,0.9466308942012641
221,9,AdaBoost (Real),0,0.95,0.8865671641791045,0.8849602702061343,16.342461347579956,0.8849602702061343
222,9,Logistic Regression (Penalty = L2),0,0.95,0.9522388059701492,0.9514566848280956,0.7114574909210205,0.9514566848280956
223,9,Naive Bayes,0,0.95,0.9253731343283582,0.9244117225114269,0.11150956153869629,0.9244117225114269
224,9,KNeighbors Classifier,1,0.95,0.9671641791044776,0.9669137769180901,1.3724455833435059,0.9669137769180901
225,9,SVC Classifier,1,0.95,0.9701492537313433,0.9700566754815333,0.5956096649169922,0.9700566754815333
226,9,Decision Tree,1,0.95,0.8253731343283582,0.8239724847628449,0.021544694900512695,0.8239724847628449
227,9,RandomForest,1,0.95,0.7119402985074627,0.7724946277797243,0.07129597663879395,0.0
228,9,AdaBoost (Discrete),1,0.95,0.9417910447761194,0.9413033416508259,16.803664922714233,0.9413033416508259
229,9,AdaBoost (Real),1,0.95,0.9119402985074627,0.910844720950514,14.739989995956421,0.910844720950514
230,9,Logistic Regression (Penalty = L2),1,0.95,0.9492537313432836,0.9484296222205594,0.7390525341033936,0.9484296222205594
231,9,Naive Bayes,1,0.95,0.9149253731343283,0.9141376351813844,0.13769865036010742,0.9141376351813844
232,9,KNeighbors Classifier,2,0.95,0.9772727272727273,0.9771493796465623,1.6239583492279053,0.9771493796465623
233,9,SVC Classifier,2,0.95,0.9651515151515152,0.9651028695058245,0.6739060878753662,0.9651028695058245
234,9,Decision Tree,2,0.95,0.8424242424242424,0.8413397641446537,0.021693944931030273,0.8413397641446537
235,9,RandomForest,2,0.95,0.6621212121212121,0.5207245105564857,0.07301735877990723,0.5207245105564857
236,9,AdaBoost (Discrete),2,0.95,0.9424242424242424,0.9418520915995982,13.873512268066406,0.9418520915995982
237,9,AdaBoost (Real),2,0.95,0.4818181818181818,0.34669854669117806,13.944973468780518,0.34669854669117806
238,9,Logistic Regression (Penalty = L2),2,0.95,0.946969696969697,0.9464907384587572,0.7002882957458496,0.9464907384587572
239,9,Naive Bayes,2,0.95,0.9196969696969697,0.9193723228658723,0.0625603199005127,0.9193723228658723
240,10,KNeighbors Classifier,0,0.95,0.9791044776119403,0.9789394329847532,1.7825300693511963,0.9789394329847532
241,10,SVC Classifier,0,0.95,0.9761194029850746,0.9759541111282376,0.5232329368591309,0.9759541111282376
242,10,Decision Tree,0,0.95,0.826865671641791,0.8242113095189822,0.025521039962768555,0.8242113095189822
243,10,RandomForest,0,0.95,0.7074626865671642,0.772142347237939,0.08813691139221191,0.0
244,10,AdaBoost (Discrete),0,0.95,0.9313432835820895,0.9299060539176436,16.14953088760376,0.9299060539176436
245,10,AdaBoost (Real),0,0.95,0.9298507462686567,0.9292113613681064,14.981512069702148,0.9292113613681064
246,10,Logistic Regression (Penalty = L2),0,0.95,0.9507462686567164,0.9501018743710405,0.7651152610778809,0.9501018743710405
247,10,Naive Bayes,0,0.95,0.9253731343283582,0.9244117225114269,0.09127545356750488,0.9244117225114269
248,10,KNeighbors Classifier,1,0.95,0.9671641791044776,0.9669381419417639,1.61582612991333,0.9669381419417639
249,10,SVC Classifier,1,0.95,0.9686567164179104,0.9684850354938194,0.6722979545593262,0.9684850354938194
250,10,Decision Tree,1,0.95,0.8298507462686567,0.8260651037407246,0.025789499282836914,0.8260651037407246
251,10,RandomForest,1,0.95,0.6940298507462687,0.7442368546007276,0.08090043067932129,0.0
252,10,AdaBoost (Discrete),1,0.95,0.9417910447761194,0.9410332533173178,11.286653995513916,0.9410332533173178
253,10,AdaBoost (Real),1,0.95,0.9059701492537313,0.905575488624053,10.832154035568237,0.905575488624053
254,10,Logistic Regression (Penalty = L2),1,0.95,0.9477611940298507,0.9468369241411904,0.511063814163208,0.9468369241411904
255,10,Naive Bayes,1,0.95,0.9134328358208955,0.9127727890226641,0.10431241989135742,0.9127727890226641
256,10,KNeighbors Classifier,2,0.95,0.9757575757575757,0.9756109786668183,1.7211997509002686,0.9756109786668183
257,10,SVC Classifier,2,0.95,0.9666666666666667,0.9666239453637299,0.45488667488098145,0.9666239453637299
258,10,Decision Tree,2,0.95,0.8409090909090909,0.8394605826631372,0.02659773826599121,0.8394605826631372
259,10,RandomForest,2,0.95,0.6984848484848485,0.48914942838530434,0.04397296905517578,0.48914942838530434
260,10,AdaBoost (Discrete),2,0.95,0.9378787878787879,0.936659946822885,10.730554819107056,0.936659946822885
261,10,AdaBoost (Real),2,0.95,0.8909090909090909,0.8856312174558555,12.661926507949829,0.8856312174558555
262,10,Logistic Regression (Penalty = L2),2,0.95,0.953030303030303,0.9526007897198217,0.5151479244232178,0.9526007897198217
263,10,Naive Bayes,2,0.95,0.9242424242424242,0.9239434547016669,0.10219883918762207,0.9239434547016669
264,11,KNeighbors Classifier,0,0.95,0.9791044776119403,0.9789394329847532,1.0754597187042236,0.9789394329847532
265,11,SVC Classifier,0,0.95,0.9761194029850746,0.9759541111282376,0.5230073928833008,0.9759541111282376
266,11,Decision Tree,0,0.95,0.8462686567164179,0.8448604685734615,0.02497720718383789,0.8448604685734615
267,11,RandomForest,0,0.95,0.6880597014925374,0.7461311211476899,0.07876443862915039,0.0
268,11,AdaBoost (Discrete),0,0.95,0.9298507462686567,0.9278820352482705,9.545874118804932,0.9278820352482705
269,11,AdaBoost (Real),0,0.95,0.9044776119402985,0.9027534266586179,9.280961275100708,0.9027534266586179
270,11,Logistic Regression (Penalty = L2),0,0.95,0.9492537313432836,0.9486524157422167,0.3839125633239746,0.9486524157422167
271,11,Naive Bayes,0,0.95,0.926865671641791,0.9258686660127934,0.13006281852722168,0.9258686660127934
272,11,KNeighbors Classifier,1,0.95,0.9671641791044776,0.9669381419417639,1.043092966079712,0.9669381419417639
273,11,SVC Classifier,1,0.95,0.9686567164179104,0.9684850354938194,0.36096858978271484,0.9684850354938194
274,11,Decision Tree,1,0.95,0.8492537313432836,0.8480663601406555,0.012208938598632812,0.8480663601406555
275,11,RandomForest,1,0.95,0.7074626865671642,0.5045868422145746,0.0386505126953125,0.5045868422145746
276,11,AdaBoost (Discrete),1,0.95,0.9417910447761194,0.9410332533173178,9.756479263305664,0.9410332533173178
277,11,AdaBoost (Real),1,0.95,0.8955223880597015,0.8945590449403935,9.816309213638306,0.8945590449403935
278,11,Logistic Regression (Penalty = L2),1,0.95,0.9477611940298507,0.9468369241411904,0.4078102111816406,0.9468369241411904
279,11,Naive Bayes,1,0.95,0.9134328358208955,0.9127727890226641,0.09040498733520508,0.9127727890226641
280,11,KNeighbors Classifier,2,0.95,0.9757575757575757,0.9756109786668183,1.001077651977539,0.9756109786668183
281,11,SVC Classifier,2,0.95,0.9666666666666667,0.9666239453637299,0.34551119804382324,0.9666239453637299
282,11,Decision Tree,2,0.95,0.8545454545454545,0.8522280736664155,0.011410713195800781,0.8522280736664155
283,11,RandomForest,2,0.95,0.7348484848484849,0.5398333026058275,0.03532052040100098,0.5398333026058275
284,11,AdaBoost (Discrete),2,0.95,0.9409090909090909,0.9398517820003452,8.922867059707642,0.9398517820003452
285,11,AdaBoost (Real),2,0.95,0.6075757575757575,0.545379760138507,8.702632904052734,0.545379760138507
286,11,Logistic Regression (Penalty = L2),2,0.95,0.9515151515151515,0.951054592445935,0.36140942573547363,0.951054592445935
287,11,Naive Bayes,2,0.95,0.9242424242424242,0.9239434547016669,0.035787343978881836,0.9239434547016669
288,12,KNeighbors Classifier,0,0.95,0.9805970149253731,0.9804591071697077,0.7302954196929932,0.9804591071697077
289,12,SVC Classifier,0,0.95,0.9776119402985075,0.9774922893719938,0.27637767791748047,0.9774922893719938
290,12,Decision Tree,0,0.95,0.8059701492537313,0.8040334252829786,0.008598566055297852,0.8040334252829786
291,12,RandomForest,0,0.95,0.6985074626865672,0.7045987477124437,0.04174685478210449,0.0
292,12,AdaBoost (Discrete),0,0.95,0.9477611940298507,0.946714403422432,6.832512140274048,0.946714403422432
293,12,AdaBoost (Real),0,0.95,0.9134328358208955,0.9123788112703457,6.58289909362793,0.9123788112703457
294,12,Logistic Regression (Penalty = L2),0,0.95,0.9567164179104478,0.9558507410643051,0.25879454612731934,0.9558507410643051
295,12,Naive Bayes,0,0.95,0.926865671641791,0.925627899094938,0.06470370292663574,0.925627899094938
296,12,KNeighbors Classifier,1,0.95,0.9686567164179104,0.9684155395745732,0.6947436332702637,0.9684155395745732
297,12,SVC Classifier,1,0.95,0.9686567164179104,0.9685538468246536,0.24019694328308105,0.9685538468246536
298,12,Decision Tree,1,0.95,0.8477611940298507,0.8467803027018619,0.008589744567871094,0.8467803027018619
299,12,RandomForest,1,0.95,0.7268656716417911,0.7653227342746484,0.028868436813354492,0.0
300,12,AdaBoost (Discrete),1,0.95,0.9388059701492537,0.9385318684213909,6.490788698196411,0.9385318684213909
301,12,AdaBoost (Real),1,0.95,0.7014925373134329,0.6754609942524806,6.376189231872559,0.6754609942524806
302,12,Logistic Regression (Penalty = L2),1,0.95,0.9432835820895522,0.9423315405599019,0.26761436462402344,0.9423315405599019
303,12,Naive Bayes,1,0.95,0.9164179104477612,0.9157016380762707,0.031242847442626953,0.9157016380762707
304,12,KNeighbors Classifier,2,0.95,0.9742424242424242,0.9741003063433695,0.646367073059082,0.9741003063433695
305,12,SVC Classifier,2,0.95,0.9681818181818181,0.9681001411130655,0.2572007179260254,0.9681001411130655
306,12,Decision Tree,2,0.95,0.8878787878787879,0.8871053122281497,0.009004354476928711,0.8871053122281497
307,12,RandomForest,2,0.95,0.6848484848484848,0.4875736024374123,0.028641939163208008,0.4875736024374123
308,12,AdaBoost (Discrete),2,0.95,0.9393939393939394,0.9389243943944059,6.3927061557769775,0.9389243943944059
309,12,AdaBoost (Real),2,0.95,0.6545454545454545,0.5192135195688612,5.933562755584717,0.5192135195688612
310,12,Logistic Regression (Penalty = L2),2,0.95,0.9484848484848485,0.9481100944484478,0.2865564823150635,0.9481100944484478
311,12,Naive Bayes,2,0.95,0.9212121212121213,0.9209922905159043,0.07926464080810547,0.9209922905159043
