,feat_set_id,classifier,fold_id,feat_th,score,geo_score,exec_t,geo_score_woz
0,0,KNeighbors Classifier,0,0.9,0.33071955719557194,0.15592862065335908,6.913017749786377,0.0
1,0,SVC Classifier,0,0.9,0.5479704797047971,0.6911619929751879,26.663890600204468,0.0
2,0,Decision Tree,0,0.9,0.3233394833948339,0.2024987039796137,0.40396928787231445,0.0
3,0,RandomForest,0,0.9,0.4935424354243542,0.6462950639629857,1.1539463996887207,0.0
4,0,AdaBoost (Discrete),0,0.9,0.17712177121771217,0.15217451576718746,111.4739043712616,0.0
5,0,AdaBoost (Real),0,0.9,0.12961254612546125,0.12589739510425388,210.43245482444763,0.0
6,0,Logistic Regression (Penalty = L2),0,0.9,0.4534132841328413,0.13158012704008862,2.4397411346435547,0.0
7,0,Naive Bayes,0,0.9,0.23293357933579337,0.18447340532495135,0.22059893608093262,0.0
8,0,KNeighbors Classifier,1,0.9,0.425207756232687,0.24519666550426839,4.36252760887146,0.0
9,0,SVC Classifier,1,0.9,0.4390581717451524,0.1121724064455337,20.058359146118164,0.0
10,0,Decision Tree,1,0.9,0.38180978762696216,0.18555814578902757,0.28823423385620117,0.0
11,0,RandomForest,1,0.9,0.49907663896583565,0.6280046988863076,0.9620425701141357,0.0
12,0,AdaBoost (Discrete),1,0.9,0.3878116343490305,0.3610900224492477,100.28970527648926,0.0
13,0,AdaBoost (Real),1,0.9,0.38134810710988,0.17139052312785374,148.27775192260742,0.0
14,0,Logistic Regression (Penalty = L2),1,0.9,0.515697137580794,0.3535531079703077,2.0665359497070312,0.0
15,0,Naive Bayes,1,0.9,0.46768236380424744,0.31692141959345815,0.30060720443725586,0.0
16,0,KNeighbors Classifier,2,0.9,0.4350439204808137,0.22804086651764682,3.7546064853668213,0.0
17,0,SVC Classifier,2,0.9,0.4368932038834951,1.0,24.101361513137817,0.0
18,0,Decision Tree,2,0.9,0.4345815996301433,0.28695464320769437,0.36759042739868164,0.0
19,0,RandomForest,2,0.9,0.517799352750809,0.5434005599912236,1.179457664489746,0.0
20,0,AdaBoost (Discrete),2,0.9,0.33980582524271846,0.27160376701297817,104.2798821926117,0.0
21,0,AdaBoost (Real),2,0.9,0.2991215903837263,0.3361961691305537,143.05036664009094,0.0
22,0,Logistic Regression (Penalty = L2),2,0.9,0.5159500693481276,0.19109715738861943,2.1714515686035156,0.0
23,0,Naive Bayes,2,0.9,0.37078132223763294,0.17171599974807347,0.20088934898376465,0.0
24,1,KNeighbors Classifier,0,0.9,0.2965867158671587,0.16332339808269003,6.074563503265381,0.0
25,1,SVC Classifier,0,0.9,0.5295202952029521,0.6429774915332556,23.328592538833618,0.0
26,1,Decision Tree,0,0.9,0.3634686346863469,0.20436957272087128,0.3286459445953369,0.0
27,1,RandomForest,0,0.9,0.503690036900369,0.6645663665821187,1.1073575019836426,0.0
28,1,AdaBoost (Discrete),0,0.9,0.23108856088560886,0.2415713523649985,99.66703343391418,0.0
29,1,AdaBoost (Real),0,0.9,0.12269372693726938,0.17016845323392701,140.5379228591919,0.0
30,1,Logistic Regression (Penalty = L2),0,0.9,0.4040590405904059,0.12942380377428786,2.0435731410980225,0.0
31,1,Naive Bayes,0,0.9,0.19095940959409594,0.28278772502763133,0.269956111907959,0.0
32,1,KNeighbors Classifier,1,0.9,0.41228070175438597,0.2223821856662412,3.8137829303741455,0.0
33,1,SVC Classifier,1,0.9,0.44367497691597413,0.17509891998996285,21.884170055389404,0.0
34,1,Decision Tree,1,0.9,0.3984302862419206,0.22288006742368027,0.3348205089569092,0.0
35,1,RandomForest,1,0.9,0.487072945521699,0.6256393243839361,0.9950904846191406,0.0
36,1,AdaBoost (Discrete),1,0.9,0.39012003693444136,0.33968662190382554,93.00089883804321,0.0
37,1,AdaBoost (Real),1,0.9,0.37072945521698986,0.10286445929345736,114.8371970653534,0.0
38,1,Logistic Regression (Penalty = L2),1,0.9,0.5032317636195752,0.33498430206623053,1.4916677474975586,0.0
39,1,Naive Bayes,1,0.9,0.4579870729455217,0.30396666438272374,0.17933440208435059,0.0
40,1,KNeighbors Classifier,2,0.9,0.41840036985668055,0.22757781019673853,2.620431423187256,0.0
41,1,SVC Classifier,2,0.9,0.4368932038834951,1.0,16.43085289001465,0.0
42,1,Decision Tree,2,0.9,0.4318076745261211,0.23618199166941167,0.2584378719329834,0.0
43,1,RandomForest,2,0.9,0.5145631067961165,0.5375612692387737,0.6690933704376221,0.0
44,1,AdaBoost (Discrete),2,0.9,0.35182616736014793,0.31661065417218126,73.82706880569458,0.0
45,1,AdaBoost (Real),2,0.9,0.3111419325011558,0.1964574588791982,90.26131272315979,0.0
46,1,Logistic Regression (Penalty = L2),2,0.9,0.5191863153028201,0.1903523091636923,1.4780681133270264,0.0
47,1,Naive Bayes,2,0.9,0.36708275543227,0.2306287472189654,0.12193465232849121,0.0
48,2,KNeighbors Classifier,0,0.9,0.30719557195571956,0.16050505124841732,3.8869500160217285,0.0
49,2,SVC Classifier,0,0.9,0.5276752767527675,0.6408491648977875,14.504520654678345,0.0
50,2,Decision Tree,0,0.9,0.33809963099630996,0.19832749726265442,0.20062470436096191,0.0
51,2,RandomForest,0,0.9,0.503690036900369,0.6645663665821187,0.6921801567077637,0.0
52,2,AdaBoost (Discrete),0,0.9,0.19418819188191883,0.2151904056204961,58.23316431045532,0.0
53,2,AdaBoost (Real),0,0.9,0.1429889298892989,0.17065035343102444,71.70586633682251,0.0
54,2,Logistic Regression (Penalty = L2),0,0.9,0.3837638376383764,0.21174734639899317,0.9877095222473145,0.0
55,2,Naive Bayes,0,0.9,0.20987084870848707,0.282708008627672,0.11981201171875,0.0
56,2,KNeighbors Classifier,1,0.9,0.42382271468144045,0.20721648139591697,2.465730667114258,0.0
57,2,SVC Classifier,1,0.9,0.45013850415512463,0.25184080776564094,11.64870548248291,0.0
58,2,Decision Tree,1,0.9,0.42105263157894735,0.24075944478165245,0.17903661727905273,0.0
59,2,RandomForest,1,0.9,0.487072945521699,0.6256393243839361,0.5459620952606201,0.0
60,2,AdaBoost (Discrete),1,0.9,0.4113573407202216,0.3303963374270876,50.88114857673645,0.0
61,2,AdaBoost (Real),1,0.9,0.2830101569713758,0.19449839459102278,66.75606966018677,0.0
62,2,Logistic Regression (Penalty = L2),1,0.9,0.5013850415512465,0.28741594869254766,0.8727927207946777,0.0
63,2,Naive Bayes,1,0.9,0.45706371191135736,0.34516362018127544,0.10054898262023926,0.0
64,2,KNeighbors Classifier,2,0.9,0.42579750346740636,0.19768573504877526,1.8422596454620361,0.0
65,2,SVC Classifier,2,0.9,0.4368932038834951,1.0,10.245173215866089,0.0
66,2,Decision Tree,2,0.9,0.386037910309755,0.20348017861595996,0.18242597579956055,0.0
67,2,RandomForest,2,0.9,0.5145631067961165,0.5375612692387737,0.4522585868835449,0.0
68,2,AdaBoost (Discrete),2,0.9,0.36662043458159965,0.30151220463354145,44.413498640060425,0.0
69,2,AdaBoost (Real),2,0.9,0.32778548312528893,0.3136240398399933,63.05999517440796,0.0
70,2,Logistic Regression (Penalty = L2),2,0.9,0.5210355987055016,0.45469086578380863,0.7701387405395508,0.0
71,2,Naive Bayes,2,0.9,0.3629218677762367,0.16597806442463559,0.10749483108520508,0.0
72,3,KNeighbors Classifier,0,0.9,0.2965867158671587,0.16332339808269003,2.5616583824157715,0.0
73,3,SVC Classifier,0,0.9,0.5295202952029521,0.6429774915332556,9.796677350997925,0.0
74,3,Decision Tree,0,0.9,0.3334870848708487,0.1743361698934697,0.1439073085784912,0.0
75,3,RandomForest,0,0.9,0.503690036900369,0.6645663665821187,0.40160369873046875,0.0
76,3,AdaBoost (Discrete),0,0.9,0.23108856088560886,0.2415713523649985,40.35630440711975,0.0
77,3,AdaBoost (Real),0,0.9,0.1559040590405904,0.14687856552269252,55.33174467086792,0.0
78,3,Logistic Regression (Penalty = L2),0,0.9,0.4040590405904059,0.12942380377428786,0.8532156944274902,0.0
79,3,Naive Bayes,0,0.9,0.19095940959409594,0.28278772502763133,0.10677623748779297,0.0
80,3,KNeighbors Classifier,1,0.9,0.41228070175438597,0.2223821856662412,1.5859334468841553,0.0
81,3,SVC Classifier,1,0.9,0.44367497691597413,0.17509891998996285,10.389750480651855,0.0
82,3,Decision Tree,1,0.9,0.41043397968605727,0.23758079887555722,0.19805240631103516,0.0
83,3,RandomForest,1,0.9,0.487072945521699,0.6256393243839361,0.5110719203948975,0.0
84,3,AdaBoost (Discrete),1,0.9,0.3896583564173592,0.3394657591540172,58.399142026901245,0.0
85,3,AdaBoost (Real),1,0.9,0.3864265927977839,0.11135704715815607,85.3137435913086,0.0
86,3,Logistic Regression (Penalty = L2),1,0.9,0.5032317636195752,0.33498430206623053,1.1473033428192139,0.0
87,3,Naive Bayes,1,0.9,0.4579870729455217,0.30396666438272374,0.15041542053222656,0.0
88,3,KNeighbors Classifier,2,0.9,0.41840036985668055,0.22757781019673853,2.0956950187683105,0.0
89,3,SVC Classifier,2,0.9,0.4368932038834951,1.0,13.544132232666016,0.0
90,3,Decision Tree,2,0.9,0.37586685159500693,0.2598771382609353,0.15664339065551758,0.0
91,3,RandomForest,2,0.9,0.5145631067961165,0.5375612692387737,0.564577579498291,0.0
92,3,AdaBoost (Discrete),2,0.9,0.35182616736014793,0.31661065417218126,61.13513255119324,0.0
93,3,AdaBoost (Real),2,0.9,0.3116042533518262,0.1970582574355727,78.69249176979065,0.0
94,3,Logistic Regression (Penalty = L2),2,0.9,0.5191863153028201,0.1903523091636923,1.055145263671875,0.0
95,3,Naive Bayes,2,0.9,0.36708275543227,0.2306287472189654,0.10438275337219238,0.0
96,4,KNeighbors Classifier,0,0.9,0.3284132841328413,0.15503114563181022,2.2341527938842773,0.0
97,4,SVC Classifier,0,0.9,0.5479704797047971,0.6911619929751879,12.768874645233154,0.0
98,4,Decision Tree,0,0.9,0.26752767527675275,0.19104880961626902,0.14321231842041016,0.0
99,4,RandomForest,0,0.9,0.5027675276752768,0.6634108689676678,0.4849543571472168,0.0
100,4,AdaBoost (Discrete),0,0.9,0.17297047970479704,0.21431964106972187,52.05700349807739,0.0
101,4,AdaBoost (Real),0,0.9,0.11992619926199262,0.1692241800630011,75.57110738754272,0.0
102,4,Logistic Regression (Penalty = L2),0,0.9,0.45156826568265684,0.08311556681234175,1.0018086433410645,0.0
103,4,Naive Bayes,0,0.9,0.23754612546125461,0.19422396362160152,0.15887689590454102,0.0
104,4,KNeighbors Classifier,1,0.9,0.4168975069252078,0.213150336824156,1.7651021480560303,0.0
105,4,SVC Classifier,1,0.9,0.4390581717451524,0.09903172591931858,12.106886386871338,0.0
106,4,Decision Tree,1,0.9,0.38827331486611266,0.2264001758858182,0.22281408309936523,0.0
107,4,RandomForest,1,0.9,0.4806094182825485,0.48169441034828425,0.5714950561523438,0.0
108,4,AdaBoost (Discrete),1,0.9,0.38411819021237303,0.3556781316416485,49.834893226623535,0.0
109,4,AdaBoost (Real),1,0.9,0.3831948291782087,0.15815492774502202,67.14701271057129,0.0
110,4,Logistic Regression (Penalty = L2),1,0.9,0.515697137580794,0.33228463726400004,0.8811404705047607,0.0
111,4,Naive Bayes,1,0.9,0.474145891043398,0.3031048492558032,0.08811807632446289,0.0
112,4,KNeighbors Classifier,2,0.9,0.4040684234858992,0.21098201818241857,1.5287518501281738,0.0
113,4,SVC Classifier,2,0.9,0.4368932038834951,1.0,11.086300611495972,0.0
114,4,Decision Tree,2,0.9,0.3989828941285252,0.2771690515280484,0.16384339332580566,0.0
115,4,RandomForest,2,0.9,0.47665279704114655,0.3801405877001018,0.4785323143005371,0.0
116,4,AdaBoost (Discrete),2,0.9,0.3550624133148405,0.32979476162883464,47.767746448516846,0.0
117,4,AdaBoost (Real),2,0.9,0.3356449375866852,0.3753901032615249,71.07814478874207,0.0
118,4,Logistic Regression (Penalty = L2),2,0.9,0.5145631067961165,0.19137174225357423,0.9963822364807129,0.0
119,4,Naive Bayes,2,0.9,0.37725381414701803,0.30901123360413013,0.13950634002685547,0.0
120,5,KNeighbors Classifier,0,0.9,0.3316420664206642,0.1537651654631649,2.3133914470672607,0.0
121,5,SVC Classifier,0,0.9,0.5470479704797048,0.690262627606629,11.186110258102417,0.0
122,5,Decision Tree,0,0.9,0.34317343173431736,0.15608993242688854,0.17756342887878418,0.0
123,5,RandomForest,0,0.9,0.5064575645756457,0.6670314061240367,0.532578706741333,0.0
124,5,AdaBoost (Discrete),0,0.9,0.18542435424354242,0.1738663542568511,45.55953907966614,0.0
125,5,AdaBoost (Real),0,0.9,0.11715867158671586,0.16205631508558385,64.54421949386597,0.0
126,5,Logistic Regression (Penalty = L2),0,0.9,0.4626383763837638,0.15802175182827102,0.8486979007720947,0.0
127,5,Naive Bayes,0,0.9,0.2518450184501845,0.18937270606825737,0.1311321258544922,0.0
128,5,KNeighbors Classifier,1,0.9,0.415050784856879,0.24395258793646532,2.000702142715454,0.0
129,5,SVC Classifier,1,0.9,0.44367497691597413,0.17116418833186337,10.918466329574585,0.0
130,5,Decision Tree,1,0.9,0.40581717451523547,0.24989631190421657,0.1749410629272461,0.0
131,5,RandomForest,1,0.9,0.4824561403508772,0.47965037938687505,0.43879199028015137,0.0
132,5,AdaBoost (Discrete),1,0.9,0.4025854108956602,0.35746543651731844,45.93101716041565,0.0
133,5,AdaBoost (Real),1,0.9,0.17266851338873498,0.1367302843523429,63.86213803291321,0.0
134,5,Logistic Regression (Penalty = L2),1,0.9,0.5041551246537396,0.2821229388560147,0.7783799171447754,0.0
135,5,Naive Bayes,1,0.9,0.47183748845798706,0.3196232028668165,0.1470181941986084,0.0
136,5,KNeighbors Classifier,2,0.9,0.42487286176606565,0.19224192475645768,1.457859992980957,0.0
137,5,SVC Classifier,2,0.9,0.4368932038834951,1.0,10.363275289535522,0.0
138,5,Decision Tree,2,0.9,0.4165510864539991,0.20706952202218232,0.12289953231811523,0.0
139,5,RandomForest,2,0.9,0.497457235321313,0.4618493234535052,0.4002265930175781,0.0
140,5,AdaBoost (Discrete),2,0.9,0.34535367545076284,0.3231464573959781,43.44717001914978,0.0
141,5,AdaBoost (Real),2,0.9,0.24780397595931578,0.3817188928612133,61.99103116989136,0.0
142,5,Logistic Regression (Penalty = L2),2,0.9,0.5159500693481276,0.4494993411277552,0.7899675369262695,0.0
143,5,Naive Bayes,2,0.9,0.36893203883495146,0.319818148280171,0.13016819953918457,0.0
144,6,KNeighbors Classifier,0,0.9,0.3284132841328413,0.15503114563181022,1.8989942073822021,0.0
145,6,SVC Classifier,0,0.9,0.5479704797047971,0.6911619929751879,10.35674238204956,0.0
146,6,Decision Tree,0,0.9,0.30904059040590404,0.18654989735337657,0.19408321380615234,0.0
147,6,RandomForest,0,0.9,0.5027675276752768,0.6634108689676678,0.50490403175354,0.0
148,6,AdaBoost (Discrete),0,0.9,0.17297047970479704,0.21431964106972187,44.098875999450684,0.0
149,6,AdaBoost (Real),0,0.9,0.15083025830258304,0.16423629222279532,63.027151107788086,0.0
150,6,Logistic Regression (Penalty = L2),0,0.9,0.45156826568265684,0.08311556681234175,0.820469856262207,0.0
151,6,Naive Bayes,0,0.9,0.23754612546125461,0.19422396362160152,0.13822722434997559,0.0
152,6,KNeighbors Classifier,1,0.9,0.4168975069252078,0.213150336824156,1.351729393005371,0.0
153,6,SVC Classifier,1,0.9,0.4390581717451524,0.09903172591931858,9.895841121673584,0.0
154,6,Decision Tree,1,0.9,0.40766389658356417,0.2655562336403069,0.15755128860473633,0.0
155,6,RandomForest,1,0.9,0.4806094182825485,0.48169441034828425,0.43611979484558105,0.0
156,6,AdaBoost (Discrete),1,0.9,0.38411819021237303,0.3556781316416485,45.124468088150024,0.0
157,6,AdaBoost (Real),1,0.9,0.38873499538319484,0.1719091712889012,62.594417095184326,0.0
158,6,Logistic Regression (Penalty = L2),1,0.9,0.515697137580794,0.33228463726400004,0.7630777359008789,0.0
159,6,Naive Bayes,1,0.9,0.474145891043398,0.3031048492558032,0.10181331634521484,0.0
160,6,KNeighbors Classifier,2,0.9,0.4040684234858992,0.21098201818241857,1.256021499633789,0.0
161,6,SVC Classifier,2,0.9,0.4368932038834951,1.0,9.168534278869629,0.0
162,6,Decision Tree,2,0.9,0.39528432732316227,0.2939230692007257,0.18593692779541016,0.0
163,6,RandomForest,2,0.9,0.47665279704114655,0.3801405877001018,0.43134164810180664,0.0
164,6,AdaBoost (Discrete),2,0.9,0.3550624133148405,0.32979476162883464,44.75902223587036,0.0
165,6,AdaBoost (Real),2,0.9,0.3111419325011558,0.27791230149686474,62.76910066604614,0.0
166,6,Logistic Regression (Penalty = L2),2,0.9,0.5145631067961165,0.19137174225357423,0.8699495792388916,0.0
167,6,Naive Bayes,2,0.9,0.37725381414701803,0.30901123360413013,0.13904547691345215,0.0
168,7,KNeighbors Classifier,0,0.9,0.3025830258302583,0.159963399669019,2.1768062114715576,0.0
169,7,SVC Classifier,0,0.9,0.5272140221402214,0.6399277421855734,9.845818758010864,0.0
170,7,Decision Tree,0,0.9,0.2924354243542435,0.14291283834982096,0.1479480266571045,0.0
171,7,RandomForest,0,0.9,0.5004612546125461,0.6565706694547585,0.45992207527160645,0.0
172,7,AdaBoost (Discrete),0,0.9,0.2154059040590406,0.16472333462724825,51.83567261695862,0.0
173,7,AdaBoost (Real),0,0.9,0.13376383763837638,0.12294971532085662,77.00616502761841,0.0
174,7,Logistic Regression (Penalty = L2),0,0.9,0.4109778597785978,0.22129675300693652,1.0746824741363525,0.0
175,7,Naive Bayes,0,0.9,0.21079335793357934,0.2997424316358845,0.1460433006286621,0.0
176,7,KNeighbors Classifier,1,0.9,0.4196675900277008,0.22872341746606573,1.8422505855560303,0.0
177,7,SVC Classifier,1,0.9,0.45013850415512463,0.25184080776564094,13.22062349319458,0.0
178,7,Decision Tree,1,0.9,0.415050784856879,0.23727892740113857,0.2125866413116455,0.0
179,7,RandomForest,1,0.9,0.4903047091412742,0.5303902074863022,0.6940484046936035,0.0
180,7,AdaBoost (Discrete),1,0.9,0.37257617728531855,0.3341307153479281,56.908599853515625,0.0
181,7,AdaBoost (Real),1,0.9,0.20221606648199447,0.21038549818733288,76.93609571456909,0.0
182,7,Logistic Regression (Penalty = L2),1,0.9,0.5032317636195752,0.29277353381962573,0.9765570163726807,0.0
183,7,Naive Bayes,1,0.9,0.4626038781163435,0.3238676559873277,0.13632869720458984,0.0
184,7,KNeighbors Classifier,2,0.9,0.42579750346740636,0.224101124911471,1.8086323738098145,0.0
185,7,SVC Classifier,2,0.9,0.4368932038834951,1.0,11.985419034957886,0.0
186,7,Decision Tree,2,0.9,0.39713361072584374,0.23583716942539795,0.22472238540649414,0.0
187,7,RandomForest,2,0.9,0.4613962089690245,0.28694780097625405,0.590907096862793,0.0
188,7,AdaBoost (Discrete),2,0.9,0.3083680073971336,0.2936751859777602,54.79130291938782,0.0
189,7,AdaBoost (Real),2,0.9,0.32269995376791494,0.2572707504124817,76.64468574523926,0.0
190,7,Logistic Regression (Penalty = L2),2,0.9,0.5187239944521498,0.45332196005902003,0.9282753467559814,0.0
191,7,Naive Bayes,2,0.9,0.37078132223763294,0.3974847451354053,0.1625065803527832,0.0
192,8,KNeighbors Classifier,0,0.9,0.2965867158671587,0.16332339808269003,3.151660203933716,0.0
193,8,SVC Classifier,0,0.9,0.5295202952029521,0.6429774915332556,12.751453876495361,0.0
194,8,Decision Tree,0,0.9,0.3422509225092251,0.19545381623991673,0.18179082870483398,0.0
195,8,RandomForest,0,0.9,0.503690036900369,0.6645663665821187,0.4738175868988037,0.0
196,8,AdaBoost (Discrete),0,0.9,0.23108856088560886,0.2415713523649985,57.63704037666321,0.0
197,8,AdaBoost (Real),0,0.9,0.125,0.14490905655755196,83.26898741722107,0.0
198,8,Logistic Regression (Penalty = L2),0,0.9,0.4040590405904059,0.12942380377428786,1.0863709449768066,0.0
199,8,Naive Bayes,0,0.9,0.19095940959409594,0.28278772502763133,0.1248464584350586,0.0
200,8,KNeighbors Classifier,1,0.9,0.41228070175438597,0.2223821856662412,2.2022578716278076,0.0
201,8,SVC Classifier,1,0.9,0.44367497691597413,0.17509891998996285,12.72464632987976,0.0
202,8,Decision Tree,1,0.9,0.39242843951985223,0.22532322144972491,0.19285082817077637,0.0
203,8,RandomForest,1,0.9,0.487072945521699,0.6256393243839361,0.522453784942627,0.0
204,8,AdaBoost (Discrete),1,0.9,0.39012003693444136,0.33968662190382554,54.854682207107544,0.0
205,8,AdaBoost (Real),1,0.9,0.37119113573407203,0.11623789950405491,75.58276462554932,0.0
206,8,Logistic Regression (Penalty = L2),1,0.9,0.5032317636195752,0.33498430206623053,0.9194531440734863,0.0
207,8,Naive Bayes,1,0.9,0.4579870729455217,0.30396666438272374,0.13219332695007324,0.0
208,8,KNeighbors Classifier,2,0.9,0.41840036985668055,0.22757781019673853,1.9567289352416992,0.0
209,8,SVC Classifier,2,0.9,0.4368932038834951,1.0,11.682413578033447,0.0
210,8,Decision Tree,2,0.9,0.4096162736939436,0.24866337176326284,0.21895980834960938,0.0
211,8,RandomForest,2,0.9,0.5145631067961165,0.5375612692387737,0.4964470863342285,0.0
212,8,AdaBoost (Discrete),2,0.9,0.35182616736014793,0.31661065417218126,52.99074840545654,0.0
213,8,AdaBoost (Real),2,0.9,0.3111419325011558,0.1964574588791982,74.67038822174072,0.0
214,8,Logistic Regression (Penalty = L2),2,0.9,0.5191863153028201,0.1903523091636923,1.0788075923919678,0.0
215,8,Naive Bayes,2,0.9,0.36708275543227,0.2306287472189654,0.21453571319580078,0.0
216,9,KNeighbors Classifier,0,0.9,0.3025830258302583,0.159963399669019,3.0419061183929443,0.0
217,9,SVC Classifier,0,0.9,0.5272140221402214,0.6399277421855734,11.578565120697021,0.0
218,9,Decision Tree,0,0.9,0.3311808118081181,0.21377291270430512,0.1728060245513916,0.0
219,9,RandomForest,0,0.9,0.5004612546125461,0.6565706694547585,0.5352542400360107,0.0
220,9,AdaBoost (Discrete),0,0.9,0.21494464944649447,0.16459043938927356,51.43542242050171,0.0
221,9,AdaBoost (Real),0,0.9,0.11854243542435425,0.1598187164260786,72.32772612571716,0.0
222,9,Logistic Regression (Penalty = L2),0,0.9,0.4109778597785978,0.22129675300693652,0.8910484313964844,0.0
223,9,Naive Bayes,0,0.9,0.21079335793357934,0.2997424316358845,0.14648222923278809,0.0
224,9,KNeighbors Classifier,1,0.9,0.4196675900277008,0.22872341746606573,1.7387864589691162,0.0
225,9,SVC Classifier,1,0.9,0.45013850415512463,0.25184080776564094,10.67330813407898,0.0
226,9,Decision Tree,1,0.9,0.3984302862419206,0.22286716520829697,0.18019556999206543,0.0
227,9,RandomForest,1,0.9,0.4903047091412742,0.5303902074863022,0.5082976818084717,0.0
228,9,AdaBoost (Discrete),1,0.9,0.37257617728531855,0.3341307153479281,50.12373328208923,0.0
229,9,AdaBoost (Real),1,0.9,0.2765466297322253,0.24861383814814902,69.20449161529541,0.0
230,9,Logistic Regression (Penalty = L2),1,0.9,0.5032317636195752,0.29277353381962573,0.881737232208252,0.0
231,9,Naive Bayes,1,0.9,0.4626038781163435,0.3238676559873277,0.1235799789428711,0.0
232,9,KNeighbors Classifier,2,0.9,0.42579750346740636,0.224101124911471,1.3659441471099854,0.0
233,9,SVC Classifier,2,0.9,0.4368932038834951,1.0,11.468685150146484,0.0
234,9,Decision Tree,2,0.9,0.3878871937124364,0.27105514548546533,0.2072455883026123,0.0
235,9,RandomForest,2,0.9,0.4613962089690245,0.28694780097625405,0.5390119552612305,0.0
236,9,AdaBoost (Discrete),2,0.9,0.3083680073971336,0.2936751859777602,49.091428995132446,0.0
237,9,AdaBoost (Real),2,0.9,0.32269995376791494,0.2572707504124817,67.46220374107361,0.0
238,9,Logistic Regression (Penalty = L2),2,0.9,0.5187239944521498,0.45332196005902003,0.8367555141448975,0.0
239,9,Naive Bayes,2,0.9,0.37078132223763294,0.3974847451354053,0.12267732620239258,0.0
240,10,KNeighbors Classifier,0,0.9,0.3030442804428044,0.16640711774592565,3.571568250656128,0.0
241,10,SVC Classifier,0,0.9,0.5295202952029521,0.643494937720922,14.37356448173523,0.0
242,10,Decision Tree,0,0.9,0.3311808118081181,0.2565319337332152,0.2226407527923584,0.0
243,10,RandomForest,0,0.9,0.49308118081180813,0.6495352090771908,0.5745241641998291,0.0
244,10,AdaBoost (Discrete),0,0.9,0.15359778597785978,0.15417186463180885,65.31309604644775,0.0
245,10,AdaBoost (Real),0,0.9,0.1886531365313653,0.18151425569552102,93.45050168037415,0.0
246,10,Logistic Regression (Penalty = L2),0,0.9,0.38883763837638374,0.19583890174176669,1.1481575965881348,0.0
247,10,Naive Bayes,0,0.9,0.1886531365313653,0.2661727256697766,0.14478802680969238,0.0
248,10,KNeighbors Classifier,1,0.9,0.42705447830101567,0.23432887029827568,3.0935723781585693,0.0
249,10,SVC Classifier,1,0.9,0.44182825484764543,0.14948380152256274,15.432289123535156,0.0
250,10,Decision Tree,1,0.9,0.394275161588181,0.2540837896519639,0.2504734992980957,0.0
251,10,RandomForest,1,0.9,0.4939981532779317,0.5723078121815725,0.5839159488677979,0.0
252,10,AdaBoost (Discrete),1,0.9,0.3878116343490305,0.36808387934753906,69.2638041973114,0.0
253,10,AdaBoost (Real),1,0.9,0.3698060941828255,0.11194822938062186,91.072762966156,0.0
254,10,Logistic Regression (Penalty = L2),1,0.9,0.5036934441366574,0.36044897943126,1.2945177555084229,0.0
255,10,Naive Bayes,1,0.9,0.45244690674053556,0.3466847378324841,0.2084188461303711,0.0
256,10,KNeighbors Classifier,2,0.9,0.4165510864539991,0.20753690679568748,2.943572998046875,0.0
257,10,SVC Classifier,2,0.9,0.4368932038834951,1.0,14.433050155639648,0.0
258,10,Decision Tree,2,0.9,0.391123439667129,0.2175873799143924,0.2037363052368164,0.0
259,10,RandomForest,2,0.9,0.47249190938511326,0.3565984793532948,0.48258495330810547,0.0
260,10,AdaBoost (Discrete),2,0.9,0.36384650947757746,0.3056707964200595,62.08531212806702,0.0
261,10,AdaBoost (Real),2,0.9,0.332871012482663,0.1573839576074769,83.0322482585907,0.0
262,10,Logistic Regression (Penalty = L2),2,0.9,0.5131761442441054,0.188361804594418,1.2564775943756104,0.0
263,10,Naive Bayes,2,0.9,0.3596856218215442,0.16916446081183378,0.1481330394744873,0.0
264,11,KNeighbors Classifier,0,0.9,0.3030442804428044,0.16640711774592565,4.305185079574585,0.0
265,11,SVC Classifier,0,0.9,0.5295202952029521,0.643494937720922,13.695418357849121,0.0
266,11,Decision Tree,0,0.9,0.31780442804428044,0.23060831521310984,0.14726710319519043,0.0
267,11,RandomForest,0,0.9,0.49308118081180813,0.6495352090771908,0.6259362697601318,0.0
268,11,AdaBoost (Discrete),0,0.9,0.15313653136531366,0.15368319144799839,59.230337619781494,0.0
269,11,AdaBoost (Real),0,0.9,0.1738929889298893,0.1388392760629485,77.68369174003601,0.0
270,11,Logistic Regression (Penalty = L2),0,0.9,0.38883763837638374,0.19583890174176669,1.086679220199585,0.0
271,11,Naive Bayes,0,0.9,0.1886531365313653,0.2661727256697766,0.14198732376098633,0.0
272,11,KNeighbors Classifier,1,0.9,0.42705447830101567,0.23432887029827568,2.616314649581909,0.0
273,11,SVC Classifier,1,0.9,0.44182825484764543,0.14948380152256274,12.852612972259521,0.0
274,11,Decision Tree,1,0.9,0.4155124653739612,0.23907635437950442,0.19276666641235352,0.0
275,11,RandomForest,1,0.9,0.4939981532779317,0.5723078121815725,0.5692484378814697,0.0
276,11,AdaBoost (Discrete),1,0.9,0.3878116343490305,0.36808387934753906,59.1564519405365,0.0
277,11,AdaBoost (Real),1,0.9,0.3734995383194829,0.1053517435614084,85.04450631141663,0.0
278,11,Logistic Regression (Penalty = L2),1,0.9,0.5036934441366574,0.36044897943126,1.2346243858337402,0.0
279,11,Naive Bayes,1,0.9,0.45244690674053556,0.3466847378324841,0.14292407035827637,0.0
280,11,KNeighbors Classifier,2,0.9,0.4165510864539991,0.20753690679568748,2.53786563873291,0.0
281,11,SVC Classifier,2,0.9,0.4368932038834951,1.0,13.180631399154663,0.0
282,11,Decision Tree,2,0.9,0.3920480813684697,0.2517795260791758,0.17802882194519043,0.0
283,11,RandomForest,2,0.9,0.47249190938511326,0.3565984793532948,0.44835615158081055,0.0
284,11,AdaBoost (Discrete),2,0.9,0.36384650947757746,0.3056707964200595,57.94026827812195,0.0
285,11,AdaBoost (Real),2,0.9,0.332871012482663,0.1573839576074769,77.24650311470032,0.0
286,11,Logistic Regression (Penalty = L2),2,0.9,0.5131761442441054,0.188361804594418,1.2069525718688965,0.0
287,11,Naive Bayes,2,0.9,0.3596856218215442,0.16916446081183378,0.16856074333190918,0.0
288,12,KNeighbors Classifier,0,0.9,0.32933579335793356,0.15515664436277207,1.9238626956939697,0.0
289,12,SVC Classifier,0,0.9,0.5470479704797048,0.690262627606629,12.40747332572937,0.0
290,12,Decision Tree,0,0.9,0.3081180811808118,0.26222029066873553,0.12485361099243164,0.0
291,12,RandomForest,0,0.9,0.48385608856088563,0.638573298069791,0.4394545555114746,0.0
292,12,AdaBoost (Discrete),0,0.9,0.2172509225092251,0.1843528931107111,44.580365896224976,0.0
293,12,AdaBoost (Real),0,0.9,0.13745387453874539,0.17365322707722244,66.78279256820679,0.0
294,12,Logistic Regression (Penalty = L2),0,0.9,0.4617158671586716,0.11946529520854225,0.7577300071716309,0.0
295,12,Naive Bayes,0,0.9,0.2550738007380074,0.19647645017517912,0.10958456993103027,0.0
296,12,KNeighbors Classifier,1,0.9,0.40120036934441367,0.1940229366468856,1.3738007545471191,0.0
297,12,SVC Classifier,1,0.9,0.44321329639889195,0.1710731193239099,10.542004108428955,0.0
298,12,Decision Tree,1,0.9,0.3878116343490305,0.1892484773236596,0.11902809143066406,0.0
299,12,RandomForest,1,0.9,0.4903047091412742,0.6350853545319568,0.5159091949462891,0.0
300,12,AdaBoost (Discrete),1,0.9,0.3490304709141274,0.32675814449358864,46.4828040599823,0.0
301,12,AdaBoost (Real),1,0.9,0.18975069252077562,0.21841706735273506,64.5754508972168,0.0
302,12,Logistic Regression (Penalty = L2),1,0.9,0.5064635272391506,0.27978052851632523,0.7473077774047852,0.0
303,12,Naive Bayes,1,0.9,0.48107109879963067,0.3027624791512909,0.08422017097473145,0.0
304,12,KNeighbors Classifier,2,0.9,0.406380027739251,0.20313493965556195,1.204087257385254,0.0
305,12,SVC Classifier,2,0.9,0.4368932038834951,1.0,10.183789014816284,0.0
306,12,Decision Tree,2,0.9,0.39019879796578827,0.19430129385391443,0.12037062644958496,0.0
307,12,RandomForest,2,0.9,0.49422098936662046,0.4777275887052849,0.40598297119140625,0.0
308,12,AdaBoost (Discrete),2,0.9,0.3828016643550624,0.3054470505543554,43.25362992286682,0.0
309,12,AdaBoost (Real),2,0.9,0.26583448913546,0.23539927906949956,53.00338006019592,0.0
310,12,Logistic Regression (Penalty = L2),2,0.9,0.5182616736014795,0.4508804497817503,0.6203348636627197,0.0
311,12,Naive Bayes,2,0.9,0.37956541840036984,0.31718992588890815,0.09976649284362793,0.0
