,feat_set_id,classifier,fold_id,feat_th,score,geo_score,exec_t,geo_score_woz
0,0,KNeighbors Classifier,0,0.4,0.8328358208955224,0.8070386494132982,1.743030309677124,0.8070386494132982
1,0,SVC Classifier,0,0.4,0.7686567164179104,0.7416043611855269,2.6007349491119385,0.7416043611855269
2,0,Decision Tree,0,0.4,0.6686567164179105,0.6547425846506774,0.18633747100830078,0.6547425846506774
3,0,RandomForest,0,0.4,0.6134328358208955,0.47376190233223225,0.6061573028564453,0.47376190233223225
4,0,AdaBoost (Discrete),0,0.4,0.7597014925373134,0.7432075464192994,127.83369851112366,0.7432075464192994
5,0,AdaBoost (Real),0,0.4,0.5313432835820896,0.34048298349319206,140.5232801437378,0.34048298349319206
6,0,Logistic Regression (Penalty = L2),0,0.4,0.8074626865671641,0.7932557762942134,1.2164263725280762,0.7932557762942134
7,0,Naive Bayes,0,0.4,0.7820895522388059,0.7599207123855016,0.22695350646972656,0.7599207123855016
8,0,KNeighbors Classifier,1,0.4,0.8402985074626865,0.8147183798428311,1.8933491706848145,0.8147183798428311
9,0,SVC Classifier,1,0.4,0.7805970149253731,0.7459262729922718,2.6851561069488525,0.7459262729922718
10,0,Decision Tree,1,0.4,0.7,0.6766439244369512,0.19993925094604492,0.6766439244369512
11,0,RandomForest,1,0.4,0.6358208955223881,0.5043711566741551,0.6895284652709961,0.5043711566741551
12,0,AdaBoost (Discrete),1,0.4,0.7746268656716417,0.7647222750762805,128.1717565059662,0.7647222750762805
13,0,AdaBoost (Real),1,0.4,0.6865671641791045,0.6636214669000116,130.28002619743347,0.6636214669000116
14,0,Logistic Regression (Penalty = L2),1,0.4,0.8044776119402985,0.7835494128577231,1.1120085716247559,0.7835494128577231
15,0,Naive Bayes,1,0.4,0.7805970149253731,0.7512021821564182,0.140852689743042,0.7512021821564182
16,0,KNeighbors Classifier,2,0.4,0.8333333333333334,0.8067756061314775,1.9082136154174805,0.8067756061314775
17,0,SVC Classifier,2,0.4,0.793939393939394,0.7737576811105562,2.720961332321167,0.7737576811105562
18,0,Decision Tree,2,0.4,0.6727272727272727,0.6563801958273525,0.18639540672302246,0.6563801958273525
19,0,RandomForest,2,0.4,0.6318181818181818,0.5656705256131934,0.6566977500915527,0.5656705256131934
20,0,AdaBoost (Discrete),2,0.4,0.7575757575757576,0.7425358770099121,127.90952968597412,0.7425358770099121
21,0,AdaBoost (Real),2,0.4,0.5227272727272727,0.30312016443632367,129.05901288986206,0.30312016443632367
22,0,Logistic Regression (Penalty = L2),2,0.4,0.8287878787878787,0.8109585038081852,1.1720609664916992,0.8109585038081852
23,0,Naive Bayes,2,0.4,0.7909090909090909,0.7758721976341524,0.19608259201049805,0.7758721976341524
24,1,KNeighbors Classifier,0,0.4,0.8283582089552238,0.8018611374068554,1.8793771266937256,0.8018611374068554
25,1,SVC Classifier,0,0.4,0.7761194029850746,0.7515581299076587,2.7104332447052,0.7515581299076587
26,1,Decision Tree,0,0.4,0.7089552238805971,0.6921068691596702,0.19182157516479492,0.6921068691596702
27,1,RandomForest,0,0.4,0.6074626865671642,0.5119757090619175,0.5225129127502441,0.5119757090619175
28,1,AdaBoost (Discrete),0,0.4,0.7761194029850746,0.7556501637902587,122.40004444122314,0.7556501637902587
29,1,AdaBoost (Real),0,0.4,0.5328358208955224,0.34108615761380573,136.49642658233643,0.34108615761380573
30,1,Logistic Regression (Penalty = L2),0,0.4,0.826865671641791,0.8121791643629466,1.109287977218628,0.8121791643629466
31,1,Naive Bayes,0,0.4,0.7805970149253731,0.758661763022467,0.1859288215637207,0.758661763022467
32,1,KNeighbors Classifier,1,0.4,0.826865671641791,0.7963385669912812,1.8423519134521484,0.7963385669912812
33,1,SVC Classifier,1,0.4,0.7731343283582089,0.7325206469938912,2.8522403240203857,0.7325206469938912
34,1,Decision Tree,1,0.4,0.7104477611940299,0.6936272198195723,0.20256257057189941,0.6936272198195723
35,1,RandomForest,1,0.4,0.6671641791044776,0.6982490051214221,0.6422805786132812,0.0
36,1,AdaBoost (Discrete),1,0.4,0.7701492537313432,0.754364534450064,140.51594996452332,0.754364534450064
37,1,AdaBoost (Real),1,0.4,0.5850746268656717,0.5364321467085253,157.0988907814026,0.5364321467085253
38,1,Logistic Regression (Penalty = L2),1,0.4,0.8134328358208955,0.7943504824180851,1.4075443744659424,0.7943504824180851
39,1,Naive Bayes,1,0.4,0.7791044776119403,0.7606727862538858,0.23431897163391113,0.7606727862538858
40,1,KNeighbors Classifier,2,0.4,0.8393939393939394,0.8172322030414193,2.5123291015625,0.8172322030414193
41,1,SVC Classifier,2,0.4,0.7984848484848485,0.7799571311097158,3.265636920928955,0.7799571311097158
42,1,Decision Tree,2,0.4,0.7136363636363636,0.6910166003579515,0.14651179313659668,0.6910166003579515
43,1,RandomForest,2,0.4,0.6333333333333333,0.5390641628469339,0.7363121509552002,0.5390641628469339
44,1,AdaBoost (Discrete),2,0.4,0.7666666666666667,0.7472276491115677,156.98119640350342,0.7472276491115677
45,1,AdaBoost (Real),2,0.4,0.5848484848484848,0.44424884105997986,159.1373724937439,0.44424884105997986
46,1,Logistic Regression (Penalty = L2),2,0.4,0.8393939393939394,0.8229901996604838,1.3949565887451172,0.8229901996604838
47,1,Naive Bayes,2,0.4,0.7924242424242425,0.775104481285475,0.22038555145263672,0.775104481285475
48,2,KNeighbors Classifier,0,0.4,0.8119402985074626,0.7802045612573834,2.1380085945129395,0.7802045612573834
49,2,SVC Classifier,0,0.4,0.7492537313432835,0.7228902709102197,3.313711643218994,0.7228902709102197
50,2,Decision Tree,0,0.4,0.6686567164179105,0.6490391277438942,0.22709226608276367,0.6490391277438942
51,2,RandomForest,0,0.4,0.664179104477612,0.5878855830091345,0.682560920715332,0.5878855830091345
52,2,AdaBoost (Discrete),0,0.4,0.7522388059701492,0.7327798260650641,152.02600741386414,0.7327798260650641
53,2,AdaBoost (Real),0,0.4,0.5402985074626866,0.36272815554032845,167.18180108070374,0.36272815554032845
54,2,Logistic Regression (Penalty = L2),0,0.4,0.8104477611940298,0.7944787124825957,1.453596591949463,0.7944787124825957
55,2,Naive Bayes,0,0.4,0.7671641791044777,0.7442740045182628,0.1695573329925537,0.7442740045182628
56,2,KNeighbors Classifier,1,0.4,0.8194029850746268,0.7882078583194483,2.3937833309173584,0.7882078583194483
57,2,SVC Classifier,1,0.4,0.7791044776119403,0.7452053622803408,3.4055309295654297,0.7452053622803408
58,2,Decision Tree,1,0.4,0.6656716417910448,0.6454011671557868,0.23782563209533691,0.6454011671557868
59,2,RandomForest,1,0.4,0.6791044776119403,0.4866248132654924,0.8126101493835449,0.4866248132654924
60,2,AdaBoost (Discrete),1,0.4,0.7507462686567165,0.7333766806976496,153.9827117919922,0.7333766806976496
61,2,AdaBoost (Real),1,0.4,0.6582089552238806,0.6305577038116319,151.69271087646484,0.6305577038116319
62,2,Logistic Regression (Penalty = L2),1,0.4,0.808955223880597,0.7915362467955379,1.3339130878448486,0.7915362467955379
63,2,Naive Bayes,1,0.4,0.7925373134328358,0.7654312070437415,0.16553401947021484,0.7654312070437415
64,2,KNeighbors Classifier,2,0.4,0.8166666666666667,0.783688630027307,2.2584009170532227,0.783688630027307
65,2,SVC Classifier,2,0.4,0.7787878787878788,0.7542680115895005,3.2558236122131348,0.7542680115895005
66,2,Decision Tree,2,0.4,0.6878787878787879,0.6675677294996584,0.2197265625,0.6675677294996584
67,2,RandomForest,2,0.4,0.7121212121212122,0.6542067288847676,0.8341090679168701,0.6542067288847676
68,2,AdaBoost (Discrete),2,0.4,0.7818181818181819,0.761140936088326,151.94090175628662,0.761140936088326
69,2,AdaBoost (Real),2,0.4,0.5242424242424243,0.2912228366838131,156.4773325920105,0.2912228366838131
70,2,Logistic Regression (Penalty = L2),2,0.4,0.8045454545454546,0.7768199260023122,1.2242019176483154,0.7768199260023122
71,2,Naive Bayes,2,0.4,0.7696969696969697,0.744055071613572,0.2785191535949707,0.744055071613572
72,3,KNeighbors Classifier,0,0.4,0.8208955223880597,0.792182020780484,2.4149158000946045,0.792182020780484
73,3,SVC Classifier,0,0.4,0.7671641791044777,0.7434224797968639,3.285855531692505,0.7434224797968639
74,3,Decision Tree,0,0.4,0.6985074626865672,0.6830466514230044,0.16586923599243164,0.6830466514230044
75,3,RandomForest,0,0.4,0.6298507462686567,0.5680923846656056,0.7533199787139893,0.5680923846656056
76,3,AdaBoost (Discrete),0,0.4,0.7567164179104477,0.7441260467355606,150.80690002441406,0.7441260467355606
77,3,AdaBoost (Real),0,0.4,0.4955223880597015,0.3713830248030489,153.36952209472656,0.3713830248030489
78,3,Logistic Regression (Penalty = L2),0,0.4,0.8074626865671641,0.7913361700736532,1.409731388092041,0.7913361700736532
79,3,Naive Bayes,0,0.4,0.7731343283582089,0.7526098876353562,0.1600513458251953,0.7526098876353562
80,3,KNeighbors Classifier,1,0.4,0.8343283582089552,0.8100335408193976,2.4833950996398926,0.8100335408193976
81,3,SVC Classifier,1,0.4,0.7686567164179104,0.7380557566854631,3.2796237468719482,0.7380557566854631
82,3,Decision Tree,1,0.4,0.673134328358209,0.6549660989587264,0.1541759967803955,0.6549660989587264
83,3,RandomForest,1,0.4,0.6597014925373135,0.5384498520728237,0.7570827007293701,0.5384498520728237
84,3,AdaBoost (Discrete),1,0.4,0.7029850746268657,0.6807804202078669,151.96402955055237,0.6807804202078669
85,3,AdaBoost (Real),1,0.4,0.5835820895522388,0.5084600941826743,147.08283591270447,0.5084600941826743
86,3,Logistic Regression (Penalty = L2),1,0.4,0.8059701492537313,0.786819345374328,1.3874526023864746,0.786819345374328
87,3,Naive Bayes,1,0.4,0.7671641791044777,0.7438370134008636,0.16579818725585938,0.7438370134008636
88,3,KNeighbors Classifier,2,0.4,0.8287878787878787,0.8066008628189874,2.279905080795288,0.8066008628189874
89,3,SVC Classifier,2,0.4,0.7712121212121212,0.7466313712941667,3.4922688007354736,0.7466313712941667
90,3,Decision Tree,2,0.4,0.6621212121212121,0.6373596810278666,0.23083853721618652,0.6373596810278666
91,3,RandomForest,2,0.4,0.6772727272727272,0.6094003480118281,0.8413121700286865,0.6094003480118281
92,3,AdaBoost (Discrete),2,0.4,0.759090909090909,0.7411096814274072,154.30928945541382,0.7411096814274072
93,3,AdaBoost (Real),2,0.4,0.5333333333333333,0.4003939512071082,156.15098810195923,0.4003939512071082
94,3,Logistic Regression (Penalty = L2),2,0.4,0.8287878787878787,0.8117880743690887,1.3501524925231934,0.8117880743690887
95,3,Naive Bayes,2,0.4,0.7833333333333333,0.7686395652928384,0.21860837936401367,0.7686395652928384
96,4,KNeighbors Classifier,0,0.4,0.8298507462686567,0.8067905709385335,1.4640402793884277,0.8067905709385335
97,4,SVC Classifier,0,0.4,0.7656716417910447,0.7372322313806994,2.6626617908477783,0.7372322313806994
98,4,Decision Tree,0,0.4,0.7059701492537314,0.6920605828343885,0.1460282802581787,0.6920605828343885
99,4,RandomForest,0,0.4,0.5805970149253732,0.5045822406386995,0.6796741485595703,0.5045822406386995
100,4,AdaBoost (Discrete),0,0.4,0.7791044776119403,0.7626709764256917,132.16047596931458,0.7626709764256917
101,4,AdaBoost (Real),0,0.4,0.5328358208955224,0.34108615761380573,144.98224020004272,0.34108615761380573
102,4,Logistic Regression (Penalty = L2),0,0.4,0.8253731343283582,0.8148384323094569,1.2757747173309326,0.8148384323094569
103,4,Naive Bayes,0,0.4,0.7865671641791044,0.7674872903823705,0.22893619537353516,0.7674872903823705
104,4,KNeighbors Classifier,1,0.4,0.835820895522388,0.810562629751469,1.680720567703247,0.810562629751469
105,4,SVC Classifier,1,0.4,0.7731343283582089,0.7190760626534435,2.9749696254730225,0.7190760626534435
106,4,Decision Tree,1,0.4,0.6776119402985075,0.6400242571291438,0.15330290794372559,0.6400242571291438
107,4,RandomForest,1,0.4,0.5865671641791045,0.3888813822485646,0.7635810375213623,0.3888813822485646
108,4,AdaBoost (Discrete),1,0.4,0.7611940298507462,0.7416255656147988,132.2207956314087,0.7416255656147988
109,4,AdaBoost (Real),1,0.4,0.5373134328358209,0.47372359058416874,124.47241640090942,0.47372359058416874
110,4,Logistic Regression (Penalty = L2),1,0.4,0.8253731343283582,0.8101707144499717,1.2296574115753174,0.8101707144499717
111,4,Naive Bayes,1,0.4,0.7835820895522388,0.7575621221272851,0.14201045036315918,0.7575621221272851
112,4,KNeighbors Classifier,2,0.4,0.8454545454545455,0.8237568566887359,1.6490464210510254,0.8237568566887359
113,4,SVC Classifier,2,0.4,0.803030303030303,0.7848106535873852,2.887023687362671,0.7848106535873852
114,4,Decision Tree,2,0.4,0.7257575757575757,0.7083484883097467,0.20959043502807617,0.7083484883097467
115,4,RandomForest,2,0.4,0.5515151515151515,0.4099551483506868,0.7251882553100586,0.4099551483506868
116,4,AdaBoost (Discrete),2,0.4,0.7651515151515151,0.7489425953867183,127.11980271339417,0.7489425953867183
117,4,AdaBoost (Real),2,0.4,0.6181818181818182,0.5114929164450198,130.61938881874084,0.5114929164450198
118,4,Logistic Regression (Penalty = L2),2,0.4,0.8348484848484848,0.8205740873621723,1.1829860210418701,0.8205740873621723
119,4,Naive Bayes,2,0.4,0.7909090909090909,0.7714981312590807,0.2060225009918213,0.7714981312590807
120,5,KNeighbors Classifier,0,0.4,0.8313432835820895,0.8075573434819343,1.098118543624878,0.8075573434819343
121,5,SVC Classifier,0,0.4,0.7686567164179104,0.7297130730490514,2.586963176727295,0.7297130730490514
122,5,Decision Tree,0,0.4,0.7179104477611941,0.699838396808881,0.1484818458557129,0.699838396808881
123,5,RandomForest,0,0.4,0.6223880597014926,0.47762092938269685,0.7713370323181152,0.47762092938269685
124,5,AdaBoost (Discrete),0,0.4,0.7656716417910447,0.749777857400866,103.78094673156738,0.749777857400866
125,5,AdaBoost (Real),0,0.4,0.5402985074626866,0.36272815554032845,108.09907007217407,0.36272815554032845
126,5,Logistic Regression (Penalty = L2),0,0.4,0.8029850746268656,0.787398847656538,1.0531260967254639,0.787398847656538
127,5,Naive Bayes,0,0.4,0.7761194029850746,0.7583354181309783,0.147780179977417,0.7583354181309783
128,5,KNeighbors Classifier,1,0.4,0.8343283582089552,0.8051669174640441,1.0877649784088135,0.8051669174640441
129,5,SVC Classifier,1,0.4,0.7791044776119403,0.7345307310724662,2.163750648498535,0.7345307310724662
130,5,Decision Tree,1,0.4,0.7149253731343284,0.6921872599562562,0.12828350067138672,0.6921872599562562
131,5,RandomForest,1,0.4,0.6283582089552239,0.44715409257837146,0.5734467506408691,0.44715409257837146
132,5,AdaBoost (Discrete),1,0.4,0.7701492537313432,0.7545526204564963,91.40959429740906,0.7545526204564963
133,5,AdaBoost (Real),1,0.4,0.5701492537313433,0.4733040848489641,93.43246722221375,0.4733040848489641
134,5,Logistic Regression (Penalty = L2),1,0.4,0.8044776119402985,0.7865821319648358,0.9752190113067627,0.7865821319648358
135,5,Naive Bayes,1,0.4,0.7955223880597015,0.7706979416417903,0.2532503604888916,0.7706979416417903
136,5,KNeighbors Classifier,2,0.4,0.8272727272727273,0.8008957448031003,1.0056917667388916,0.8008957448031003
137,5,SVC Classifier,2,0.4,0.7909090909090909,0.7576333442465019,2.157313585281372,0.7576333442465019
138,5,Decision Tree,2,0.4,0.7196969696969697,0.6987220793682498,0.12923502922058105,0.6987220793682498
139,5,RandomForest,2,0.4,0.656060606060606,0.47122816644342164,0.5752427577972412,0.47122816644342164
140,5,AdaBoost (Discrete),2,0.4,0.7575757575757576,0.738014802668113,92.86687779426575,0.738014802668113
141,5,AdaBoost (Real),2,0.4,0.5287878787878788,0.29466510220441094,94.68102622032166,0.29466510220441094
142,5,Logistic Regression (Penalty = L2),2,0.4,0.8121212121212121,0.7848403952987066,0.9118223190307617,0.7848403952987066
143,5,Naive Bayes,2,0.4,0.7893939393939394,0.7659978437945376,0.22667527198791504,0.7659978437945376
144,6,KNeighbors Classifier,0,0.4,0.8328358208955224,0.8096184456358896,1.2121224403381348,0.8096184456358896
145,6,SVC Classifier,0,0.4,0.764179104477612,0.7389199849734526,2.234069585800171,0.7389199849734526
146,6,Decision Tree,0,0.4,0.6537313432835821,0.6256013633802027,0.1271367073059082,0.6256013633802027
147,6,RandomForest,0,0.4,0.6238805970149254,0.5547324881578293,0.5882856845855713,0.5547324881578293
148,6,AdaBoost (Discrete),0,0.4,0.764179104477612,0.750498152428228,97.88549995422363,0.750498152428228
149,6,AdaBoost (Real),0,0.4,0.4955223880597015,0.3713830248030489,99.89522504806519,0.3713830248030489
150,6,Logistic Regression (Penalty = L2),0,0.4,0.7925373134328358,0.7766380048017729,0.8606815338134766,0.7766380048017729
151,6,Naive Bayes,0,0.4,0.7791044776119403,0.7606180346780095,0.13672113418579102,0.7606180346780095
152,6,KNeighbors Classifier,1,0.4,0.8283582089552238,0.8059099096238191,1.3228304386138916,0.8059099096238191
153,6,SVC Classifier,1,0.4,0.7671641791044777,0.7337715756371272,2.224787950515747,0.7337715756371272
154,6,Decision Tree,1,0.4,0.6671641791044776,0.6426809454423603,0.1813197135925293,0.6426809454423603
155,6,RandomForest,1,0.4,0.6029850746268657,0.5056669515480203,0.5427689552307129,0.5056669515480203
156,6,AdaBoost (Discrete),1,0.4,0.7477611940298508,0.7361042862391451,95.37606072425842,0.7361042862391451
157,6,AdaBoost (Real),1,0.4,0.5686567164179105,0.5065494267221173,96.15715193748474,0.5065494267221173
158,6,Logistic Regression (Penalty = L2),1,0.4,0.7910447761194029,0.7718576115247783,0.9348526000976562,0.7718576115247783
159,6,Naive Bayes,1,0.4,0.7805970149253731,0.7576802726280669,0.1939835548400879,0.7576802726280669
160,6,KNeighbors Classifier,2,0.4,0.8257575757575758,0.80503659613335,1.3343799114227295,0.80503659613335
161,6,SVC Classifier,2,0.4,0.7651515151515151,0.741629028555081,2.205125331878662,0.741629028555081
162,6,Decision Tree,2,0.4,0.7045454545454546,0.6706957169617872,0.12213611602783203,0.6706957169617872
163,6,RandomForest,2,0.4,0.6424242424242425,0.5255464525089769,0.5369048118591309,0.5255464525089769
164,6,AdaBoost (Discrete),2,0.4,0.7545454545454545,0.7355000797253303,95.17263793945312,0.7355000797253303
165,6,AdaBoost (Real),2,0.4,0.5348484848484848,0.40033763988917187,102.2158932685852,0.40033763988917187
166,6,Logistic Regression (Penalty = L2),2,0.4,0.8045454545454546,0.7880571870827058,0.8885648250579834,0.7880571870827058
167,6,Naive Bayes,2,0.4,0.7924242424242425,0.7777550771449028,0.11299276351928711,0.7777550771449028
168,7,KNeighbors Classifier,0,0.4,0.8462686567164179,0.8280987481498254,0.901665210723877,0.8280987481498254
169,7,SVC Classifier,0,0.4,0.7671641791044777,0.7323889025770588,1.893714189529419,0.7323889025770588
170,7,Decision Tree,0,0.4,0.6671641791044776,0.6501718697608674,0.11254215240478516,0.6501718697608674
171,7,RandomForest,0,0.4,0.5835820895522388,0.5951232143840668,0.5131020545959473,0.0
172,7,AdaBoost (Discrete),0,0.4,0.7522388059701492,0.7336266693993639,83.80077719688416,0.7336266693993639
173,7,AdaBoost (Real),0,0.4,0.5402985074626866,0.36272815554032845,91.62576246261597,0.36272815554032845
174,7,Logistic Regression (Penalty = L2),0,0.4,0.8164179104477612,0.8034408990876274,0.7391078472137451,0.8034408990876274
175,7,Naive Bayes,0,0.4,0.7776119402985074,0.7587653856520137,0.08799076080322266,0.7587653856520137
176,7,KNeighbors Classifier,1,0.4,0.8417910447761194,0.8212051043167716,0.9608511924743652,0.8212051043167716
177,7,SVC Classifier,1,0.4,0.7805970149253731,0.744627347950306,1.9263241291046143,0.744627347950306
178,7,Decision Tree,1,0.4,0.7089552238805971,0.6862974532037132,0.10811328887939453,0.6862974532037132
179,7,RandomForest,1,0.4,0.5985074626865672,0.47648810120505775,0.4455280303955078,0.47648810120505775
180,7,AdaBoost (Discrete),1,0.4,0.755223880597015,0.7374612468672057,83.04947400093079,0.7374612468672057
181,7,AdaBoost (Real),1,0.4,0.6477611940298508,0.6254277679993067,84.84743690490723,0.6254277679993067
182,7,Logistic Regression (Penalty = L2),1,0.4,0.8029850746268656,0.7827119535246744,0.7800157070159912,0.7827119535246744
183,7,Naive Bayes,1,0.4,0.7985074626865671,0.7752503178695537,0.1357877254486084,0.7752503178695537
184,7,KNeighbors Classifier,2,0.4,0.8333333333333334,0.8029887128274829,0.8945245742797852,0.8029887128274829
185,7,SVC Classifier,2,0.4,0.7803030303030303,0.753988481351714,1.9775512218475342,0.753988481351714
186,7,Decision Tree,2,0.4,0.7075757575757575,0.6823692414034777,0.16607356071472168,0.6823692414034777
187,7,RandomForest,2,0.4,0.6409090909090909,0.5470328993794904,0.5047109127044678,0.5470328993794904
188,7,AdaBoost (Discrete),2,0.4,0.7606060606060606,0.7403493470752802,84.0515627861023,0.7403493470752802
189,7,AdaBoost (Real),2,0.4,0.6333333333333333,0.5998321709519147,88.2816686630249,0.5998321709519147
190,7,Logistic Regression (Penalty = L2),2,0.4,0.8136363636363636,0.7933855330604618,0.8468029499053955,0.7933855330604618
191,7,Naive Bayes,2,0.4,0.7909090909090909,0.7709162506039319,0.1818077564239502,0.7709162506039319
192,8,KNeighbors Classifier,0,0.4,0.8417910447761194,0.8237006470810084,1.0003786087036133,0.8237006470810084
193,8,SVC Classifier,0,0.4,0.7611940298507462,0.7382141522994259,1.9374310970306396,0.7382141522994259
194,8,Decision Tree,0,0.4,0.6567164179104478,0.6350443280613081,0.16571879386901855,0.6350443280613081
195,8,RandomForest,0,0.4,0.5313432835820896,0.3728204133995571,0.5609471797943115,0.0
196,8,AdaBoost (Discrete),0,0.4,0.7731343283582089,0.7611746037302635,96.42753601074219,0.7611746037302635
197,8,AdaBoost (Real),0,0.4,0.6134328358208955,0.38982652144641455,96.05182695388794,0.38982652144641455
198,8,Logistic Regression (Penalty = L2),0,0.4,0.808955223880597,0.7961201009197221,0.8276870250701904,0.7961201009197221
199,8,Naive Bayes,0,0.4,0.7791044776119403,0.760057718432319,0.11812281608581543,0.760057718432319
200,8,KNeighbors Classifier,1,0.4,0.8343283582089552,0.8092416016590868,1.1113507747650146,0.8092416016590868
201,8,SVC Classifier,1,0.4,0.7716417910447761,0.7449825436459453,2.15191650390625,0.7449825436459453
202,8,Decision Tree,1,0.4,0.7074626865671642,0.6855363993960004,0.11328768730163574,0.6855363993960004
203,8,RandomForest,1,0.4,0.6119402985074627,0.48075816822781453,0.5207812786102295,0.48075816822781453
204,8,AdaBoost (Discrete),1,0.4,0.7208955223880597,0.697958266238387,86.60239696502686,0.697958266238387
205,8,AdaBoost (Real),1,0.4,0.6014925373134329,0.4943523018060979,87.91260004043579,0.4943523018060979
206,8,Logistic Regression (Penalty = L2),1,0.4,0.8014925373134328,0.7811667459389257,0.7755980491638184,0.7811667459389257
207,8,Naive Bayes,1,0.4,0.7716417910447761,0.7523147683876142,0.11793994903564453,0.7523147683876142
208,8,KNeighbors Classifier,2,0.4,0.8303030303030303,0.8054226879819978,0.9984664916992188,0.8054226879819978
209,8,SVC Classifier,2,0.4,0.7712121212121212,0.7472250249525211,1.9677343368530273,0.7472250249525211
210,8,Decision Tree,2,0.4,0.7015151515151515,0.6813112567030707,0.10574746131896973,0.6813112567030707
211,8,RandomForest,2,0.4,0.6333333333333333,0.5978689412430545,0.46750950813293457,0.0
212,8,AdaBoost (Discrete),2,0.4,0.759090909090909,0.7391672564244917,83.7315924167633,0.7391672564244917
213,8,AdaBoost (Real),2,0.4,0.42727272727272725,0.2353057166741156,85.81416416168213,0.2353057166741156
214,8,Logistic Regression (Penalty = L2),2,0.4,0.8272727272727273,0.812138391828854,0.6923749446868896,0.812138391828854
215,8,Naive Bayes,2,0.4,0.7878787878787878,0.7726483882084226,0.16921234130859375,0.7726483882084226
216,9,KNeighbors Classifier,0,0.4,0.826865671641791,0.8019271362783091,0.5928895473480225,0.8019271362783091
217,9,SVC Classifier,0,0.4,0.7507462686567165,0.7002322295100539,1.512326717376709,0.7002322295100539
218,9,Decision Tree,0,0.4,0.7119402985074627,0.6989641450565915,0.09747505187988281,0.6989641450565915
219,9,RandomForest,0,0.4,0.5298507462686567,0.35254200117754675,0.46482205390930176,0.35254200117754675
220,9,AdaBoost (Discrete),0,0.4,0.7567164179104477,0.7414365970922405,62.776775598526,0.7414365970922405
221,9,AdaBoost (Real),0,0.4,0.591044776119403,0.3768831385420456,71.05216121673584,0.3768831385420456
222,9,Logistic Regression (Penalty = L2),0,0.4,0.808955223880597,0.7948834510089761,0.6061186790466309,0.7948834510089761
223,9,Naive Bayes,0,0.4,0.7805970149253731,0.7639263199843818,0.10354399681091309,0.7639263199843818
224,9,KNeighbors Classifier,1,0.4,0.8402985074626865,0.8172055256636893,0.6243124008178711,0.8172055256636893
225,9,SVC Classifier,1,0.4,0.7761194029850746,0.74248082792162,1.7685472965240479,0.74248082792162
226,9,Decision Tree,1,0.4,0.6805970149253732,0.6581104403185148,0.10808324813842773,0.6581104403185148
227,9,RandomForest,1,0.4,0.5805970149253732,0.3749449749889883,0.41660356521606445,0.3749449749889883
228,9,AdaBoost (Discrete),1,0.4,0.7417910447761195,0.7261191507965069,64.01198148727417,0.7261191507965069
229,9,AdaBoost (Real),1,0.4,0.5746268656716418,0.538534165173778,70.48674750328064,0.538534165173778
230,9,Logistic Regression (Penalty = L2),1,0.4,0.7940298507462686,0.7662932874395398,0.5367269515991211,0.7662932874395398
231,9,Naive Bayes,1,0.4,0.7880597014925373,0.7647101555889955,0.19777178764343262,0.7647101555889955
232,9,KNeighbors Classifier,2,0.4,0.8303030303030303,0.8040593008322912,0.6633789539337158,0.8040593008322912
233,9,SVC Classifier,2,0.4,0.759090909090909,0.7187906747243005,1.4884369373321533,0.7187906747243005
234,9,Decision Tree,2,0.4,0.7136363636363636,0.6953015671711386,0.09704160690307617,0.6953015671711386
235,9,RandomForest,2,0.4,0.5621212121212121,0.3179769227996339,0.4714236259460449,0.3179769227996339
236,9,AdaBoost (Discrete),2,0.4,0.7363636363636363,0.7132577271820915,60.0147180557251,0.7132577271820915
237,9,AdaBoost (Real),2,0.4,0.42727272727272725,0.2353057166741156,71.48670196533203,0.2353057166741156
238,9,Logistic Regression (Penalty = L2),2,0.4,0.7954545454545454,0.7722945740784725,0.5963151454925537,0.7722945740784725
239,9,Naive Bayes,2,0.4,0.7878787878787878,0.7703939792784319,0.14077019691467285,0.7703939792784319
240,10,KNeighbors Classifier,0,0.4,0.8313432835820895,0.8057618811531471,1.6101281642913818,0.8057618811531471
241,10,SVC Classifier,0,0.4,0.7731343283582089,0.7506503391278112,2.348938226699829,0.7506503391278112
242,10,Decision Tree,0,0.4,0.6835820895522388,0.6661724485148758,0.15498638153076172,0.6661724485148758
243,10,RandomForest,0,0.4,0.6373134328358209,0.5595584600745003,0.5228850841522217,0.5595584600745003
244,10,AdaBoost (Discrete),0,0.4,0.7776119402985074,0.7587862868122387,107.03734397888184,0.7587862868122387
245,10,AdaBoost (Real),0,0.4,0.5328358208955224,0.34108615761380573,105.72889351844788,0.34108615761380573
246,10,Logistic Regression (Penalty = L2),0,0.4,0.817910447761194,0.8031404548759531,1.0058388710021973,0.8031404548759531
247,10,Naive Bayes,0,0.4,0.7805970149253731,0.7601965049050164,0.14572477340698242,0.7601965049050164
248,10,KNeighbors Classifier,1,0.4,0.844776119402985,0.8210411633799242,1.6288132667541504,0.8210411633799242
249,10,SVC Classifier,1,0.4,0.7791044776119403,0.7464096897806572,2.241239070892334,0.7464096897806572
250,10,Decision Tree,1,0.4,0.6761194029850747,0.6592438147495728,0.10575652122497559,0.6592438147495728
251,10,RandomForest,1,0.4,0.6104477611940299,0.6255890843141718,0.46646976470947266,0.0
252,10,AdaBoost (Discrete),1,0.4,0.7671641791044777,0.7426390413557532,97.68952870368958,0.7426390413557532
253,10,AdaBoost (Real),1,0.4,0.5626865671641791,0.5142272278789375,97.02807283401489,0.5142272278789375
254,10,Logistic Regression (Penalty = L2),1,0.4,0.8223880597014925,0.8089892895108751,0.9932942390441895,0.8089892895108751
255,10,Naive Bayes,1,0.4,0.7776119402985074,0.7540700101836854,0.1549689769744873,0.7540700101836854
256,10,KNeighbors Classifier,2,0.4,0.8287878787878787,0.8016274524782289,1.4874165058135986,0.8016274524782289
257,10,SVC Classifier,2,0.4,0.793939393939394,0.775787055577328,2.22621488571167,0.775787055577328
258,10,Decision Tree,2,0.4,0.7212121212121212,0.6978496036503896,0.12984657287597656,0.6978496036503896
259,10,RandomForest,2,0.4,0.6393939393939394,0.5960980165868583,0.42612695693969727,0.5960980165868583
260,10,AdaBoost (Discrete),2,0.4,0.7712121212121212,0.7482127319811259,103.24280548095703,0.7482127319811259
261,10,AdaBoost (Real),2,0.4,0.5257575757575758,0.37004960358754896,97.42807245254517,0.0
262,10,Logistic Regression (Penalty = L2),2,0.4,0.8333333333333334,0.8132432857817039,0.9721205234527588,0.8132432857817039
263,10,Naive Bayes,2,0.4,0.7984848484848485,0.783676867845144,0.13817977905273438,0.783676867845144
264,11,KNeighbors Classifier,0,0.4,0.7985074626865671,0.7705238797996063,2.476806402206421,0.7705238797996063
265,11,SVC Classifier,0,0.4,0.7626865671641792,0.7398371501152607,2.818878412246704,0.7398371501152607
266,11,Decision Tree,0,0.4,0.6835820895522388,0.6603833823438607,0.12950396537780762,0.6603833823438607
267,11,RandomForest,0,0.4,0.6104477611940299,0.6209373849363857,0.4822237491607666,0.0
268,11,AdaBoost (Discrete),0,0.4,0.7716417910447761,0.7609911246189864,144.08876132965088,0.7609911246189864
269,11,AdaBoost (Real),0,0.4,0.5313432835820896,0.34048298349319206,152.84915018081665,0.34048298349319206
270,11,Logistic Regression (Penalty = L2),0,0.4,0.826865671641791,0.8126950874976078,1.4507627487182617,0.8126950874976078
271,11,Naive Bayes,0,0.4,0.7656716417910447,0.7453810614856683,0.15752315521240234,0.7453810614856683
272,11,KNeighbors Classifier,1,0.4,0.8149253731343283,0.7869803938035457,2.6534438133239746,0.7869803938035457
273,11,SVC Classifier,1,0.4,0.7746268656716417,0.7492159151193115,3.123417615890503,0.7492159151193115
274,11,Decision Tree,1,0.4,0.6776119402985075,0.6608789345698113,0.18981361389160156,0.6608789345698113
275,11,RandomForest,1,0.4,0.6343283582089553,0.5649981662896206,0.4903526306152344,0.5649981662896206
276,11,AdaBoost (Discrete),1,0.4,0.7507462686567165,0.7228334966083525,137.7318365573883,0.7228334966083525
277,11,AdaBoost (Real),1,0.4,0.6970149253731344,0.670179541104264,122.19858598709106,0.670179541104264
278,11,Logistic Regression (Penalty = L2),1,0.4,0.8059701492537313,0.7863149142356194,1.178135871887207,0.7863149142356194
279,11,Naive Bayes,1,0.4,0.7671641791044777,0.7405223838064374,0.12956571578979492,0.7405223838064374
280,11,KNeighbors Classifier,2,0.4,0.8227272727272728,0.7943397180216305,2.0998587608337402,0.7943397180216305
281,11,SVC Classifier,2,0.4,0.7893939393939394,0.7553417849542309,2.527754306793213,0.7553417849542309
282,11,Decision Tree,2,0.4,0.7287878787878788,0.7042689440039732,0.13207364082336426,0.7042689440039732
283,11,RandomForest,2,0.4,0.6909090909090909,0.6234903745754615,0.4424135684967041,0.6234903745754615
284,11,AdaBoost (Discrete),2,0.4,0.7803030303030303,0.7614259772927536,123.86915493011475,0.7614259772927536
285,11,AdaBoost (Real),2,0.4,0.646969696969697,0.5936030797782871,114.39498209953308,0.5936030797782871
286,11,Logistic Regression (Penalty = L2),2,0.4,0.8196969696969697,0.7990514134844291,1.0772297382354736,0.7990514134844291
287,11,Naive Bayes,2,0.4,0.7863636363636364,0.7693680060640598,0.14253568649291992,0.7693680060640598
288,12,KNeighbors Classifier,0,0.4,0.826865671641791,0.8019271362783091,0.4018421173095703,0.8019271362783091
289,12,SVC Classifier,0,0.4,0.7507462686567165,0.7002322295100539,1.0752065181732178,0.7002322295100539
290,12,Decision Tree,0,0.4,0.7044776119402985,0.6871136535436018,0.039423227310180664,0.6871136535436018
291,12,RandomForest,0,0.4,0.5298507462686567,0.35254200117754675,0.3261101245880127,0.35254200117754675
292,12,AdaBoost (Discrete),0,0.4,0.7567164179104477,0.7414365970922405,44.53207445144653,0.7414365970922405
293,12,AdaBoost (Real),0,0.4,0.591044776119403,0.3768831385420456,49.1540801525116,0.3768831385420456
294,12,Logistic Regression (Penalty = L2),0,0.4,0.808955223880597,0.7948834510089761,0.4109342098236084,0.7948834510089761
295,12,Naive Bayes,0,0.4,0.7805970149253731,0.7639263199843818,0.1139376163482666,0.7639263199843818
296,12,KNeighbors Classifier,1,0.4,0.8402985074626865,0.8172055256636893,0.47188377380371094,0.8172055256636893
297,12,SVC Classifier,1,0.4,0.7761194029850746,0.74248082792162,1.1595299243927002,0.74248082792162
298,12,Decision Tree,1,0.4,0.7014925373134329,0.6811770038928473,0.07282543182373047,0.6811770038928473
299,12,RandomForest,1,0.4,0.5805970149253732,0.3749449749889883,0.39746975898742676,0.3749449749889883
300,12,AdaBoost (Discrete),1,0.4,0.7417910447761195,0.7261191507965069,44.736583948135376,0.7261191507965069
301,12,AdaBoost (Real),1,0.4,0.5880597014925373,0.45765745248564027,46.87769937515259,0.45765745248564027
302,12,Logistic Regression (Penalty = L2),1,0.4,0.7940298507462686,0.7662932874395398,0.39940881729125977,0.7662932874395398
303,12,Naive Bayes,1,0.4,0.7880597014925373,0.7647101555889955,0.08125829696655273,0.7647101555889955
304,12,KNeighbors Classifier,2,0.4,0.8303030303030303,0.8040593008322912,0.46727561950683594,0.8040593008322912
305,12,SVC Classifier,2,0.4,0.759090909090909,0.7187906747243005,1.0445001125335693,0.7187906747243005
306,12,Decision Tree,2,0.4,0.7075757575757575,0.6909134220489266,0.07114958763122559,0.6909134220489266
307,12,RandomForest,2,0.4,0.5621212121212121,0.3179769227996339,0.3404080867767334,0.3179769227996339
308,12,AdaBoost (Discrete),2,0.4,0.7363636363636363,0.7132577271820915,44.802828311920166,0.7132577271820915
309,12,AdaBoost (Real),2,0.4,0.4257575757575758,0.2349038184937926,50.16134810447693,0.2349038184937926
310,12,Logistic Regression (Penalty = L2),2,0.4,0.7954545454545454,0.7722945740784725,0.42648959159851074,0.7722945740784725
311,12,Naive Bayes,2,0.4,0.7878787878787878,0.7703939792784319,0.10990524291992188,0.7703939792784319
