,feat_set_id,classifier,fold_id,feat_th,score,geo_score,exec_t,geo_score_woz
0,0,KNeighbors Classifier,0,0.05,0.6481802426343154,0.680460131160533,0.2208690643310547,0.0
1,0,SVC Classifier,0,0.05,0.7001733102253033,1.0,0.35563039779663086,0.0
2,0,Decision Tree,0,0.05,0.7001733102253033,1.0,0.05459856986999512,0.0
3,0,RandomForest,0,0.05,0.7001733102253033,1.0,0.5077135562896729,0.0
4,0,AdaBoost (Discrete),0,0.05,0.7001733102253033,1.0,28.619784355163574,0.0
5,0,AdaBoost (Real),0,0.05,0.7001733102253033,1.0,54.13534760475159,0.0
6,0,Logistic Regression (Penalty = L2),0,0.05,0.7001733102253033,1.0,0.24181675910949707,0.0
7,0,Naive Bayes,0,0.05,0.5441941074523396,0.850160147988438,0.08066773414611816,0.0
8,0,KNeighbors Classifier,1,0.05,0.6996527777777778,1.0,0.26901721954345703,0.0
9,0,SVC Classifier,1,0.05,0.6996527777777778,1.0,0.5352640151977539,0.0
10,0,Decision Tree,1,0.05,0.6996527777777778,1.0,0.002094268798828125,0.0
11,0,RandomForest,1,0.05,0.6996527777777778,1.0,0.663914680480957,0.0
12,0,AdaBoost (Discrete),1,0.05,0.6996527777777778,1.0,40.220250844955444,0.0
13,0,AdaBoost (Real),1,0.05,0.6996527777777778,1.0,72.21645784378052,0.0
14,0,Logistic Regression (Penalty = L2),1,0.05,0.6996527777777778,1.0,0.0950462818145752,0.0
15,0,Naive Bayes,1,0.05,0.5920138888888888,0.8896984182487025,0.09128952026367188,0.0
16,0,KNeighbors Classifier,2,0.05,0.31130434782608696,0.5880661175073388,0.19160962104797363,0.0
17,0,SVC Classifier,2,0.05,0.7008695652173913,1.0,0.5110688209533691,0.0
18,0,Decision Tree,2,0.05,0.31130434782608696,0.5880661175073388,0.08586621284484863,0.0
19,0,RandomForest,2,0.05,0.31130434782608696,0.5880661175073388,0.8207409381866455,0.0
20,0,AdaBoost (Discrete),2,0.05,0.31130434782608696,0.5880661175073388,44.16759920120239,0.0
21,0,AdaBoost (Real),2,0.05,0.31130434782608696,0.5880661175073388,81.62937307357788,0.0
22,0,Logistic Regression (Penalty = L2),2,0.05,0.31130434782608696,0.5880661175073388,0.11384940147399902,0.0
23,0,Naive Bayes,2,0.05,0.2747826086956522,0.31755000153891877,0.11202788352966309,0.31755000153891877
24,1,KNeighbors Classifier,0,0.05,0.7001733102253033,1.0,0.22701358795166016,0.0
25,1,SVC Classifier,0,0.05,0.7001733102253033,1.0,0.6912930011749268,0.0
26,1,Decision Tree,0,0.05,0.7001733102253033,1.0,0.0023889541625976562,0.0
27,1,RandomForest,0,0.05,0.7001733102253033,1.0,0.7945153713226318,0.0
28,1,AdaBoost (Discrete),0,0.05,0.7001733102253033,1.0,46.22045397758484,0.0
29,1,AdaBoost (Real),0,0.05,0.7001733102253033,1.0,119.82188940048218,0.0
30,1,Logistic Regression (Penalty = L2),0,0.05,0.7001733102253033,1.0,0.23304295539855957,0.0
31,1,Naive Bayes,0,0.05,0.3830155979202773,0.48314266832172753,0.12011313438415527,0.0
32,1,KNeighbors Classifier,1,0.05,0.5920138888888888,0.6664016739677335,0.22584867477416992,0.0
33,1,SVC Classifier,1,0.05,0.6996527777777778,1.0,0.5805950164794922,0.0
34,1,Decision Tree,1,0.05,0.6996527777777778,1.0,0.12135195732116699,0.0
35,1,RandomForest,1,0.05,0.6996527777777778,1.0,0.7808341979980469,0.0
36,1,AdaBoost (Discrete),1,0.05,0.6996527777777778,1.0,50.45739412307739,0.0
37,1,AdaBoost (Real),1,0.05,0.6996527777777778,1.0,93.46525716781616,0.0
38,1,Logistic Regression (Penalty = L2),1,0.05,0.6996527777777778,1.0,0.2554202079772949,0.0
39,1,Naive Bayes,1,0.05,0.4305555555555556,0.5090374832823014,0.1279153823852539,0.0
40,1,KNeighbors Classifier,2,0.05,0.7008695652173913,1.0,0.38483142852783203,0.0
41,1,SVC Classifier,2,0.05,0.7008695652173913,1.0,0.6341264247894287,0.0
42,1,Decision Tree,2,0.05,0.7008695652173913,1.0,0.12662839889526367,0.0
43,1,RandomForest,2,0.05,0.7008695652173913,1.0,0.9716944694519043,0.0
44,1,AdaBoost (Discrete),2,0.05,0.7008695652173913,1.0,54.14165425300598,0.0
45,1,AdaBoost (Real),2,0.05,0.7008695652173913,1.0,138.45507645606995,0.0
46,1,Logistic Regression (Penalty = L2),2,0.05,0.7008695652173913,1.0,0.2309272289276123,0.0
47,1,Naive Bayes,2,0.05,0.48869565217391303,0.5240754477700762,0.1162569522857666,0.0
48,2,KNeighbors Classifier,0,0.05,0.6845753899480069,0.8129520829107402,0.40735960006713867,0.0
49,2,SVC Classifier,0,0.05,0.6845753899480069,0.8129520829107402,0.576906681060791,0.0
50,2,Decision Tree,0,0.05,0.6845753899480069,0.8129520829107402,0.16681766510009766,0.0
51,2,RandomForest,0,0.05,0.6845753899480069,0.8129520829107402,0.9859650135040283,0.0
52,2,AdaBoost (Discrete),0,0.05,0.6845753899480069,0.8129520829107402,49.0571665763855,0.0
53,2,AdaBoost (Real),0,0.05,0.6845753899480069,0.8129520829107402,95.93339681625366,0.0
54,2,Logistic Regression (Penalty = L2),0,0.05,0.6845753899480069,0.8129520829107402,0.22026729583740234,0.0
55,2,Naive Bayes,0,0.05,0.6845753899480069,0.8129520829107402,0.11274480819702148,0.0
56,2,KNeighbors Classifier,1,0.05,0.6996527777777778,1.0,0.34705209732055664,0.0
57,2,SVC Classifier,1,0.05,0.7690972222222222,0.8841027752029671,0.5522980690002441,0.0
58,2,Decision Tree,1,0.05,0.7690972222222222,0.8841027752029671,0.11459898948669434,0.0
59,2,RandomForest,1,0.05,0.7690972222222222,0.8841027752029671,0.9271218776702881,0.0
60,2,AdaBoost (Discrete),1,0.05,0.7690972222222222,0.8841027752029671,53.22683048248291,0.0
61,2,AdaBoost (Real),1,0.05,0.7690972222222222,0.8841027752029671,100.87702012062073,0.0
62,2,Logistic Regression (Penalty = L2),1,0.05,0.7690972222222222,0.8841027752029671,0.25525546073913574,0.0
63,2,Naive Bayes,1,0.05,0.7690972222222222,0.8841027752029671,0.12401723861694336,0.0
64,2,KNeighbors Classifier,2,0.05,0.88,0.9684860662631681,0.3710010051727295,0.0
65,2,SVC Classifier,2,0.05,0.7008695652173913,1.0,0.6523828506469727,0.0
66,2,Decision Tree,2,0.05,0.88,0.9684860662631681,0.12165546417236328,0.0
67,2,RandomForest,2,0.05,0.88,0.9684860662631681,0.9126508235931396,0.0
68,2,AdaBoost (Discrete),2,0.05,0.88,0.9684860662631681,56.939316272735596,0.0
69,2,AdaBoost (Real),2,0.05,0.88,0.9684860662631681,68.54213261604309,0.0
70,2,Logistic Regression (Penalty = L2),2,0.05,0.88,0.9684860662631681,0.2629668712615967,0.0
71,2,Naive Bayes,2,0.05,0.88,0.9684860662631681,0.12874507904052734,0.0
72,5,KNeighbors Classifier,0,0.05,0.7001733102253033,1.0,0.4026460647583008,0.0
73,5,SVC Classifier,0,0.05,0.7001733102253033,1.0,0.6392030715942383,0.0
74,5,Decision Tree,0,0.05,0.7001733102253033,1.0,0.13031601905822754,0.0
75,5,RandomForest,0,0.05,0.7001733102253033,1.0,1.054184913635254,0.0
76,5,AdaBoost (Discrete),0,0.05,0.7001733102253033,1.0,54.726874589920044,0.0
77,5,AdaBoost (Real),0,0.05,0.7001733102253033,1.0,190.55329990386963,0.0
78,5,Logistic Regression (Penalty = L2),0,0.05,0.7001733102253033,1.0,0.449631929397583,0.0
79,5,Naive Bayes,0,0.05,0.5025996533795494,0.6332377902572627,0.1446545124053955,0.0
80,5,KNeighbors Classifier,1,0.05,0.6996527777777778,1.0,0.4183688163757324,0.0
81,5,SVC Classifier,1,0.05,0.6996527777777778,1.0,0.7589881420135498,0.0
82,5,Decision Tree,1,0.05,0.6996527777777778,1.0,0.11854934692382812,0.0
83,5,RandomForest,1,0.05,0.6996527777777778,1.0,0.899681806564331,0.0
84,5,AdaBoost (Discrete),1,0.05,0.6996527777777778,1.0,55.48603367805481,0.0
85,5,AdaBoost (Real),1,0.05,0.6996527777777778,1.0,192.86623811721802,0.0
86,5,Logistic Regression (Penalty = L2),1,0.05,0.6996527777777778,1.0,0.4408879280090332,0.0
87,5,Naive Bayes,1,0.05,0.5503472222222222,0.6848230649393702,0.13587021827697754,0.0
88,5,KNeighbors Classifier,2,0.05,0.7008695652173913,1.0,0.42178845405578613,0.0
89,5,SVC Classifier,2,0.05,0.7008695652173913,1.0,0.6944446563720703,0.0
90,5,Decision Tree,2,0.05,0.7008695652173913,1.0,0.001360177993774414,0.0
91,5,RandomForest,2,0.05,0.7008695652173913,1.0,1.006173849105835,0.0
92,5,AdaBoost (Discrete),2,0.05,0.7008695652173913,1.0,60.68197464942932,0.0
93,5,AdaBoost (Real),2,0.05,0.7008695652173913,1.0,72.06328749656677,0.0
94,5,Logistic Regression (Penalty = L2),2,0.05,0.7008695652173913,1.0,0.24369001388549805,0.0
95,5,Naive Bayes,2,0.05,0.6139130434782609,0.7472032220800768,0.1241750717163086,0.0
96,6,KNeighbors Classifier,0,0.05,0.7001733102253033,1.0,0.35933661460876465,0.0
97,6,SVC Classifier,0,0.05,0.7001733102253033,1.0,0.5993683338165283,0.0
98,6,Decision Tree,0,0.05,0.7001733102253033,1.0,0.11838269233703613,0.0
99,6,RandomForest,0,0.05,0.7001733102253033,1.0,0.7140693664550781,0.0
100,6,AdaBoost (Discrete),0,0.05,0.7001733102253033,1.0,44.96315670013428,0.0
101,6,AdaBoost (Real),0,0.05,0.7001733102253033,1.0,165.83611845970154,0.0
102,6,Logistic Regression (Penalty = L2),0,0.05,0.7001733102253033,1.0,0.23590469360351562,0.0
103,6,Naive Bayes,0,0.05,0.5025996533795494,0.6332377902572627,0.002259969711303711,0.0
104,6,KNeighbors Classifier,1,0.05,0.6996527777777778,1.0,0.3901233673095703,0.0
105,6,SVC Classifier,1,0.05,0.6996527777777778,1.0,0.5106263160705566,0.0
106,6,Decision Tree,1,0.05,0.6996527777777778,1.0,0.1381828784942627,0.0
107,6,RandomForest,1,0.05,0.6996527777777778,1.0,0.8759896755218506,0.0
108,6,AdaBoost (Discrete),1,0.05,0.6996527777777778,1.0,49.85758090019226,0.0
109,6,AdaBoost (Real),1,0.05,0.6996527777777778,1.0,162.28372764587402,0.0
110,6,Logistic Regression (Penalty = L2),1,0.05,0.6996527777777778,1.0,0.3072657585144043,0.0
111,6,Naive Bayes,1,0.05,0.5503472222222222,0.6848230649393702,0.12755823135375977,0.0
112,6,KNeighbors Classifier,2,0.05,0.7008695652173913,1.0,0.369199275970459,0.0
113,6,SVC Classifier,2,0.05,0.7008695652173913,1.0,0.4988980293273926,0.0
114,6,Decision Tree,2,0.05,0.7008695652173913,1.0,0.0015115737915039062,0.0
115,6,RandomForest,2,0.05,0.7008695652173913,1.0,0.8716611862182617,0.0
116,6,AdaBoost (Discrete),2,0.05,0.7008695652173913,1.0,47.3573842048645,0.0
117,6,AdaBoost (Real),2,0.05,0.7008695652173913,1.0,77.73796486854553,0.0
118,6,Logistic Regression (Penalty = L2),2,0.05,0.7008695652173913,1.0,0.5769133567810059,0.0
119,6,Naive Bayes,2,0.05,0.6139130434782609,0.7472032220800768,0.002408266067504883,0.0
120,7,KNeighbors Classifier,0,0.05,0.7417677642980935,0.7407118766149331,0.40030479431152344,0.0
121,7,SVC Classifier,0,0.05,0.6845753899480069,0.8129520829107402,0.7897255420684814,0.0
122,7,Decision Tree,0,0.05,0.7036395147313691,0.8044512804538025,0.0024154186248779297,0.0
123,7,RandomForest,0,0.05,0.7417677642980935,0.7407118766149331,1.033695936203003,0.0
124,7,AdaBoost (Discrete),0,0.05,0.6845753899480069,0.8129520829107402,55.186753273010254,0.0
125,7,AdaBoost (Real),0,0.05,0.6845753899480069,0.8129520829107402,182.2237663269043,0.0
126,7,Logistic Regression (Penalty = L2),0,0.05,0.6845753899480069,0.8129520829107402,0.3945648670196533,0.0
127,7,Naive Bayes,0,0.05,0.5805892547660312,0.6192878878744241,0.13202357292175293,0.0
128,7,KNeighbors Classifier,1,0.05,0.7673611111111112,0.6570858289451206,0.42987966537475586,0.0
129,7,SVC Classifier,1,0.05,0.7690972222222222,0.8841027752029671,1.0729529857635498,0.0
130,7,Decision Tree,1,0.05,0.7430555555555556,0.7741160010790055,0.15428566932678223,0.0
131,7,RandomForest,1,0.05,0.7673611111111112,0.6570858289451206,1.1003050804138184,0.0
132,7,AdaBoost (Discrete),1,0.05,0.7430555555555556,0.7741160010790055,62.82062220573425,0.0
133,7,AdaBoost (Real),1,0.05,0.7690972222222222,0.8841027752029671,137.98483753204346,0.0
134,7,Logistic Regression (Penalty = L2),1,0.05,0.7795138888888888,0.8629082987258412,0.45412230491638184,0.0
135,7,Naive Bayes,1,0.05,0.6475694444444444,0.4748247474479005,0.15633702278137207,0.4748247474479005
136,7,KNeighbors Classifier,2,0.05,0.4591304347826087,0.7733142235452992,0.6293582916259766,0.0
137,7,SVC Classifier,2,0.05,0.7617391304347826,0.5617326583032773,1.018474817276001,0.0
138,7,Decision Tree,2,0.05,0.6591304347826087,0.37790682763994177,0.1586289405822754,0.0
139,7,RandomForest,2,0.05,0.7304347826086957,0.9950248447588356,1.3309893608093262,0.0
140,7,AdaBoost (Discrete),2,0.05,0.5078260869565218,0.5269531596071265,60.90204191207886,0.5269531596071265
141,7,AdaBoost (Real),2,0.05,0.5721739130434783,0.5487734906727578,141.29922032356262,0.0
142,7,Logistic Regression (Penalty = L2),2,0.05,0.7217391304347827,0.3905129124224957,0.2965977191925049,0.0
143,7,Naive Bayes,2,0.05,0.5530434782608695,0.6231768205516174,0.15248942375183105,0.6231768205516174
