,feat_set_id,classifier,fold_id,feat_th,score,geo_score,exec_t,geo_score_woz
0,0,KNeighbors Classifier,0,0.05,0.8605633802816901,1.0,0.7128596305847168,0.0
1,0,SVC Classifier,0,0.05,0.7859154929577464,0.31889640207164033,0.555774450302124,0.0
2,0,Decision Tree,0,0.05,0.8605633802816901,1.0,0.09893298149108887,0.0
3,0,RandomForest,0,0.05,0.8605633802816901,1.0,0.704798698425293,0.0
4,0,AdaBoost (Discrete),0,0.05,0.8605633802816901,1.0,40.56140160560608,0.0
5,0,AdaBoost (Real),0,0.05,0.8605633802816901,1.0,47.81599736213684,0.0
6,0,Logistic Regression (Penalty = L2),0,0.05,0.8605633802816901,1.0,0.2678203582763672,0.0
7,0,Naive Bayes,0,0.05,0.8605633802816901,1.0,0.08919429779052734,0.0
8,0,KNeighbors Classifier,1,0.05,0.22002820874471085,0.9914892069294688,0.567852258682251,0.0
9,0,SVC Classifier,1,0.05,0.8603667136812412,0.9914892069294688,0.5655388832092285,0.0
10,0,Decision Tree,1,0.05,0.8603667136812412,0.9914892069294688,0.0025877952575683594,0.0
11,0,RandomForest,1,0.05,0.8603667136812412,0.9914892069294688,0.7655706405639648,0.0
12,0,AdaBoost (Discrete),1,0.05,0.22002820874471085,0.9914892069294688,39.812398195266724,0.0
13,0,AdaBoost (Real),1,0.05,0.8603667136812412,0.9914892069294688,57.58040142059326,0.0
14,0,Logistic Regression (Penalty = L2),1,0.05,0.8603667136812412,0.9914892069294688,0.16102862358093262,0.0
15,0,Naive Bayes,1,0.05,0.8603667136812412,0.9914892069294688,0.11644721031188965,0.0
16,0,KNeighbors Classifier,2,0.05,0.8613861386138614,1.0,0.810227632522583,0.0
17,0,SVC Classifier,2,0.05,0.8613861386138614,1.0,0.719731330871582,0.0
18,0,Decision Tree,2,0.05,0.8613861386138614,1.0,0.11061668395996094,0.0
19,0,RandomForest,2,0.05,0.8613861386138614,1.0,0.9106781482696533,0.0
20,0,AdaBoost (Discrete),2,0.05,0.8613861386138614,1.0,49.07885146141052,0.0
21,0,AdaBoost (Real),2,0.05,0.8613861386138614,1.0,57.269770860672,0.0
22,0,Logistic Regression (Penalty = L2),2,0.05,0.8613861386138614,1.0,0.22305083274841309,0.0
23,0,Naive Bayes,2,0.05,0.8613861386138614,1.0,0.11246705055236816,0.0
24,1,KNeighbors Classifier,0,0.05,0.7774647887323943,1.0,0.5587549209594727,0.0
25,1,SVC Classifier,0,0.05,0.7774647887323943,1.0,0.6502687931060791,0.0
26,1,Decision Tree,0,0.05,0.7774647887323943,1.0,0.11030268669128418,0.0
27,1,RandomForest,0,0.05,0.7774647887323943,1.0,0.674262523651123,0.0
28,1,AdaBoost (Discrete),0,0.05,0.7774647887323943,1.0,47.105706214904785,0.0
29,1,AdaBoost (Real),0,0.05,0.7774647887323943,1.0,57.0709342956543,0.0
30,1,Logistic Regression (Penalty = L2),0,0.05,0.7774647887323943,1.0,0.11776924133300781,0.0
31,1,Naive Bayes,0,0.05,0.6140845070422535,0.8264206038650983,0.10676813125610352,0.0
32,1,KNeighbors Classifier,1,0.05,0.7785613540197461,1.0,0.41069602966308594,0.0
33,1,SVC Classifier,1,0.05,0.7785613540197461,1.0,0.5302050113677979,0.0
34,1,Decision Tree,1,0.05,0.7785613540197461,1.0,0.10640811920166016,0.0
35,1,RandomForest,1,0.05,0.7785613540197461,1.0,0.7650902271270752,0.0
36,1,AdaBoost (Discrete),1,0.05,0.7785613540197461,1.0,40.611403703689575,0.0
37,1,AdaBoost (Real),1,0.05,0.7785613540197461,1.0,47.47357439994812,0.0
38,1,Logistic Regression (Penalty = L2),1,0.05,0.7785613540197461,1.0,0.22646331787109375,0.0
39,1,Naive Bayes,1,0.05,0.5148095909732017,0.7445453821540743,0.11016225814819336,0.0
40,1,KNeighbors Classifier,2,0.05,0.7793493635077794,1.0,0.43101930618286133,0.0
41,1,SVC Classifier,2,0.05,0.7793493635077794,1.0,0.5591716766357422,0.0
42,1,Decision Tree,2,0.05,0.7793493635077794,1.0,0.09011387825012207,0.0
43,1,RandomForest,2,0.05,0.7793493635077794,1.0,0.6469757556915283,0.0
44,1,AdaBoost (Discrete),2,0.05,0.7793493635077794,1.0,42.126240730285645,0.0
45,1,AdaBoost (Real),2,0.05,0.7793493635077794,1.0,49.677250623703,0.0
46,1,Logistic Regression (Penalty = L2),2,0.05,0.7793493635077794,1.0,0.21457171440124512,0.0
47,1,Naive Bayes,2,0.05,0.4752475247524752,0.7103078241732028,0.22396516799926758,0.0
48,2,KNeighbors Classifier,0,0.05,0.7774647887323943,1.0,1.0869965553283691,0.0
49,2,SVC Classifier,0,0.05,0.7774647887323943,1.0,1.5818605422973633,0.0
50,2,Decision Tree,0,0.05,0.7774647887323943,1.0,0.20605087280273438,0.0
51,2,RandomForest,0,0.05,0.7774647887323943,1.0,0.9424319267272949,0.0
52,2,AdaBoost (Discrete),0,0.05,0.7774647887323943,1.0,47.12740778923035,0.0
53,2,AdaBoost (Real),0,0.05,0.7774647887323943,1.0,55.55811882019043,0.0
54,2,Logistic Regression (Penalty = L2),0,0.05,0.7774647887323943,1.0,0.20820903778076172,0.0
55,2,Naive Bayes,0,0.05,0.5521126760563381,0.728558234768694,0.10871624946594238,0.0
56,2,KNeighbors Classifier,1,0.05,0.4513399153737659,0.6341718324267314,0.6348261833190918,0.0
57,2,SVC Classifier,1,0.05,0.7785613540197461,1.0,0.6441841125488281,0.0
58,2,Decision Tree,1,0.05,0.7785613540197461,1.0,0.10651040077209473,0.0
59,2,RandomForest,1,0.05,0.7785613540197461,1.0,0.7606651782989502,0.0
60,2,AdaBoost (Discrete),1,0.05,0.7785613540197461,1.0,44.8514461517334,0.0
61,2,AdaBoost (Real),1,0.05,0.7785613540197461,1.0,56.21785879135132,0.0
62,2,Logistic Regression (Penalty = L2),1,0.05,0.7785613540197461,1.0,0.21500802040100098,0.0
63,2,Naive Bayes,1,0.05,0.4513399153737659,0.6341718324267314,0.0027587413787841797,0.0
64,2,KNeighbors Classifier,2,0.05,0.4186704384724187,0.5994552881310161,0.6522228717803955,0.0
65,2,SVC Classifier,2,0.05,0.7793493635077794,1.0,0.5522291660308838,0.0
66,2,Decision Tree,2,0.05,0.7793493635077794,1.0,0.1266765594482422,0.0
67,2,RandomForest,2,0.05,0.7793493635077794,1.0,0.8672122955322266,0.0
68,2,AdaBoost (Discrete),2,0.05,0.7793493635077794,1.0,52.671749114990234,0.0
69,2,AdaBoost (Real),2,0.05,0.7793493635077794,1.0,62.77886724472046,0.0
70,2,Logistic Regression (Penalty = L2),2,0.05,0.7793493635077794,1.0,0.11740660667419434,0.0
71,2,Naive Bayes,2,0.05,0.4186704384724187,0.5994552881310161,0.12407588958740234,0.0
72,3,KNeighbors Classifier,0,0.05,0.8605633802816901,1.0,0.8573284149169922,0.0
73,3,SVC Classifier,0,0.05,0.7859154929577464,0.31889640207164033,0.7046964168548584,0.0
74,3,Decision Tree,0,0.05,0.8605633802816901,1.0,0.15463733673095703,0.0
75,3,RandomForest,0,0.05,0.8605633802816901,1.0,1.1115446090698242,0.0
76,3,AdaBoost (Discrete),0,0.05,0.8605633802816901,1.0,41.96343803405762,0.0
77,3,AdaBoost (Real),0,0.05,0.8605633802816901,1.0,44.161537408828735,0.0
78,3,Logistic Regression (Penalty = L2),0,0.05,0.8605633802816901,1.0,0.2908346652984619,0.0
79,3,Naive Bayes,0,0.05,0.8605633802816901,1.0,0.11649775505065918,0.0
80,3,KNeighbors Classifier,1,0.05,0.22002820874471085,0.9914892069294688,0.8011274337768555,0.0
81,3,SVC Classifier,1,0.05,0.8603667136812412,0.9914892069294688,0.6884162425994873,0.0
82,3,Decision Tree,1,0.05,0.8603667136812412,0.9914892069294688,0.0015916824340820312,0.0
83,3,RandomForest,1,0.05,0.8603667136812412,0.9914892069294688,0.8258540630340576,0.0
84,3,AdaBoost (Discrete),1,0.05,0.22002820874471085,0.9914892069294688,77.33207726478577,0.0
85,3,AdaBoost (Real),1,0.05,0.8603667136812412,0.9914892069294688,106.52764821052551,0.0
86,3,Logistic Regression (Penalty = L2),1,0.05,0.8603667136812412,0.9914892069294688,0.20903658866882324,0.0
87,3,Naive Bayes,1,0.05,0.8603667136812412,0.9914892069294688,0.20800065994262695,0.0
88,3,KNeighbors Classifier,2,0.05,0.8613861386138614,1.0,1.4435064792633057,0.0
89,3,SVC Classifier,2,0.05,0.8613861386138614,1.0,0.8627433776855469,0.0
90,3,Decision Tree,2,0.05,0.8613861386138614,1.0,0.0015594959259033203,0.0
91,3,RandomForest,2,0.05,0.8613861386138614,1.0,1.344430685043335,0.0
92,3,AdaBoost (Discrete),2,0.05,0.8613861386138614,1.0,74.87925052642822,0.0
93,3,AdaBoost (Real),2,0.05,0.8613861386138614,1.0,98.20082902908325,0.0
94,3,Logistic Regression (Penalty = L2),2,0.05,0.8613861386138614,1.0,0.22471141815185547,0.0
95,3,Naive Bayes,2,0.05,0.8613861386138614,1.0,0.2307288646697998,0.0
96,6,KNeighbors Classifier,0,0.05,0.8605633802816901,1.0,1.627103328704834,0.0
97,6,SVC Classifier,0,0.05,0.7859154929577464,0.31889640207164033,1.1703660488128662,0.0
98,6,Decision Tree,0,0.05,0.8605633802816901,1.0,0.2223503589630127,0.0
99,6,RandomForest,0,0.05,0.8605633802816901,1.0,1.4561083316802979,0.0
100,6,AdaBoost (Discrete),0,0.05,0.8605633802816901,1.0,83.26389622688293,0.0
101,6,AdaBoost (Real),0,0.05,0.8605633802816901,1.0,108.23549699783325,0.0
102,6,Logistic Regression (Penalty = L2),0,0.05,0.8605633802816901,1.0,0.43511080741882324,0.0
103,6,Naive Bayes,0,0.05,0.8605633802816901,1.0,0.21528840065002441,0.0
104,6,KNeighbors Classifier,1,0.05,0.22002820874471085,0.9914892069294688,1.1189231872558594,0.0
105,6,SVC Classifier,1,0.05,0.8603667136812412,0.9914892069294688,1.37003755569458,0.0
106,6,Decision Tree,1,0.05,0.8603667136812412,0.9914892069294688,0.21799039840698242,0.0
107,6,RandomForest,1,0.05,0.8603667136812412,0.9914892069294688,1.7659237384796143,0.0
108,6,AdaBoost (Discrete),1,0.05,0.22002820874471085,0.9914892069294688,86.5626220703125,0.0
109,6,AdaBoost (Real),1,0.05,0.8603667136812412,0.9914892069294688,110.068119764328,0.0
110,6,Logistic Regression (Penalty = L2),1,0.05,0.8603667136812412,0.9914892069294688,0.4112241268157959,0.0
111,6,Naive Bayes,1,0.05,0.8603667136812412,0.9914892069294688,0.0025985240936279297,0.0
112,6,KNeighbors Classifier,2,0.05,0.8613861386138614,1.0,1.3352127075195312,0.0
113,6,SVC Classifier,2,0.05,0.8613861386138614,1.0,0.8438239097595215,0.0
114,6,Decision Tree,2,0.05,0.8613861386138614,1.0,0.18614578247070312,0.0
115,6,RandomForest,2,0.05,0.8613861386138614,1.0,1.1140658855438232,0.0
116,6,AdaBoost (Discrete),2,0.05,0.8613861386138614,1.0,39.819459199905396,0.0
117,6,AdaBoost (Real),2,0.05,0.8613861386138614,1.0,48.37319350242615,0.0
118,6,Logistic Regression (Penalty = L2),2,0.05,0.8613861386138614,1.0,0.11406946182250977,0.0
119,6,Naive Bayes,2,0.05,0.8613861386138614,1.0,0.10280013084411621,0.0
120,7,KNeighbors Classifier,0,0.05,0.7774647887323943,1.0,0.42966699600219727,0.0
121,7,SVC Classifier,0,0.05,0.7774647887323943,1.0,0.4340171813964844,0.0
122,7,Decision Tree,0,0.05,0.7774647887323943,1.0,0.1062166690826416,0.0
123,7,RandomForest,0,0.05,0.7774647887323943,1.0,0.7290441989898682,0.0
124,7,AdaBoost (Discrete),0,0.05,0.7774647887323943,1.0,39.12652063369751,0.0
125,7,AdaBoost (Real),0,0.05,0.7774647887323943,1.0,53.761099100112915,0.0
126,7,Logistic Regression (Penalty = L2),0,0.05,0.7774647887323943,1.0,0.18782353401184082,0.0
127,7,Naive Bayes,0,0.05,0.44366197183098594,0.6255432421712243,0.10653376579284668,0.0
128,7,KNeighbors Classifier,1,0.05,0.7785613540197461,1.0,0.6110780239105225,0.0
129,7,SVC Classifier,1,0.05,0.7785613540197461,1.0,0.5006344318389893,0.0
130,7,Decision Tree,1,0.05,0.7785613540197461,1.0,0.11853337287902832,0.0
131,7,RandomForest,1,0.05,0.7785613540197461,1.0,0.8020415306091309,0.0
132,7,AdaBoost (Discrete),1,0.05,0.7785613540197461,1.0,41.011958360672,0.0
133,7,AdaBoost (Real),1,0.05,0.7785613540197461,1.0,52.17038106918335,0.0
134,7,Logistic Regression (Penalty = L2),1,0.05,0.7785613540197461,1.0,0.29816174507141113,0.0
135,7,Naive Bayes,1,0.05,0.4019746121297602,0.5820378990598714,0.11170554161071777,0.0
136,7,KNeighbors Classifier,2,0.05,0.7793493635077794,1.0,0.4478490352630615,0.0
137,7,SVC Classifier,2,0.05,0.7793493635077794,1.0,0.44756507873535156,0.0
138,7,Decision Tree,2,0.05,0.7793493635077794,1.0,0.0014371871948242188,0.0
139,7,RandomForest,2,0.05,0.7793493635077794,1.0,0.6432895660400391,0.0
140,7,AdaBoost (Discrete),2,0.05,0.7793493635077794,1.0,41.56141471862793,0.0
141,7,AdaBoost (Real),2,0.05,0.7793493635077794,1.0,47.8095166683197,0.0
142,7,Logistic Regression (Penalty = L2),2,0.05,0.7793493635077794,1.0,0.2914750576019287,0.0
143,7,Naive Bayes,2,0.05,0.38755304101838756,0.5651718656741029,0.002130270004272461,0.0
144,10,KNeighbors Classifier,0,0.05,0.8605633802816901,1.0,0.6358852386474609,0.0
145,10,SVC Classifier,0,0.05,0.7859154929577464,0.31889640207164033,0.7331359386444092,0.0
146,10,Decision Tree,0,0.05,0.8605633802816901,1.0,0.001550436019897461,0.0
147,10,RandomForest,0,0.05,0.8605633802816901,1.0,0.5249581336975098,0.0
148,10,AdaBoost (Discrete),0,0.05,0.8605633802816901,1.0,38.32167840003967,0.0
149,10,AdaBoost (Real),0,0.05,0.8605633802816901,1.0,49.419636249542236,0.0
150,10,Logistic Regression (Penalty = L2),0,0.05,0.8605633802816901,1.0,0.1135091781616211,0.0
151,10,Naive Bayes,0,0.05,0.5253521126760563,0.7289569005739249,0.0025565624237060547,0.7289569005739249
152,10,KNeighbors Classifier,1,0.05,0.8603667136812412,0.9914892069294688,0.6490895748138428,0.0
153,10,SVC Classifier,1,0.05,0.8603667136812412,0.9914892069294688,0.5402765274047852,0.0
154,10,Decision Tree,1,0.05,0.8603667136812412,0.9914892069294688,0.0023691654205322266,0.0
155,10,RandomForest,1,0.05,0.8603667136812412,0.9914892069294688,0.5495762825012207,0.0
156,10,AdaBoost (Discrete),1,0.05,0.4837799717912553,0.6931483124617092,39.3703556060791,0.6931483124617092
157,10,AdaBoost (Real),1,0.05,0.8603667136812412,0.9914892069294688,50.933942556381226,0.0
158,10,Logistic Regression (Penalty = L2),1,0.05,0.8603667136812412,0.9914892069294688,0.10912847518920898,0.0
159,10,Naive Bayes,1,0.05,0.4837799717912553,0.6931483124617092,0.09948396682739258,0.6931483124617092
160,10,KNeighbors Classifier,2,0.05,0.8613861386138614,1.0,0.693082332611084,0.0
161,10,SVC Classifier,2,0.05,0.8613861386138614,1.0,0.5341634750366211,0.0
162,10,Decision Tree,2,0.05,0.8613861386138614,1.0,0.0015232563018798828,0.0
163,10,RandomForest,2,0.05,0.8613861386138614,1.0,0.6251814365386963,0.0
164,10,AdaBoost (Discrete),2,0.05,0.8613861386138614,1.0,38.6631064414978,0.0
165,10,AdaBoost (Real),2,0.05,0.8613861386138614,1.0,50.56401586532593,0.0
166,10,Logistic Regression (Penalty = L2),2,0.05,0.8613861386138614,1.0,0.11013340950012207,0.0
167,10,Naive Bayes,2,0.05,0.4695898161244696,0.6835763408100209,0.10779595375061035,0.6835763408100209
168,11,KNeighbors Classifier,0,0.05,0.8605633802816901,1.0,0.754920482635498,0.0
169,11,SVC Classifier,0,0.05,0.7859154929577464,0.31889640207164033,0.6563189029693604,0.0
170,11,Decision Tree,0,0.05,0.8605633802816901,1.0,0.0016705989837646484,0.0
171,11,RandomForest,0,0.05,0.852112676056338,0.947789578306157,0.8390724658966064,0.0
172,11,AdaBoost (Discrete),0,0.05,0.8605633802816901,1.0,41.770572662353516,0.0
173,11,AdaBoost (Real),0,0.05,0.8605633802816901,1.0,50.44292092323303,0.0
174,11,Logistic Regression (Penalty = L2),0,0.05,0.8605633802816901,1.0,0.22040128707885742,0.0
175,11,Naive Bayes,0,0.05,0.8605633802816901,0.9337613320293694,0.10774445533752441,0.9337613320293694
176,11,KNeighbors Classifier,1,0.05,0.6995768688293371,0.8439414426777585,0.8394742012023926,0.8439414426777585
177,11,SVC Classifier,1,0.05,0.8603667136812412,0.9914892069294688,0.845482349395752,0.0
178,11,Decision Tree,1,0.05,0.8603667136812412,0.9914892069294688,0.0024099349975585938,0.0
179,11,RandomForest,1,0.05,0.7997179125528914,0.5042194840896107,0.6360700130462646,0.0
180,11,AdaBoost (Discrete),1,0.05,0.6544428772919605,0.7509125193005878,42.06103730201721,0.7509125193005878
181,11,AdaBoost (Real),1,0.05,0.8603667136812412,0.9914892069294688,53.98004984855652,0.0
182,11,Logistic Regression (Penalty = L2),1,0.05,0.8603667136812412,0.9914892069294688,0.20619678497314453,0.0
183,11,Naive Bayes,1,0.05,0.6995768688293371,0.8439414426777585,0.10299253463745117,0.8439414426777585
184,11,KNeighbors Classifier,2,0.05,0.6435643564356436,0.8137764260690455,0.8644707202911377,0.8137764260690455
185,11,SVC Classifier,2,0.05,0.8613861386138614,1.0,0.8439834117889404,0.0
186,11,Decision Tree,2,0.05,0.8613861386138614,1.0,0.0017092227935791016,0.0
187,11,RandomForest,2,0.05,0.7793493635077794,1.0,0.6329736709594727,0.0
188,11,AdaBoost (Discrete),2,0.05,0.8613861386138614,1.0,41.59838390350342,0.0
189,11,AdaBoost (Real),2,0.05,0.8613861386138614,1.0,49.01185917854309,0.0
190,11,Logistic Regression (Penalty = L2),2,0.05,0.8613861386138614,1.0,0.1874406337738037,0.0
191,11,Naive Bayes,2,0.05,0.6435643564356436,0.8137764260690455,0.0028150081634521484,0.8137764260690455
