,feat_set_id,classifier,fold_id,feat_th,score,geo_score,exec_t,geo_score_woz
0,0,KNeighbors Classifier,0,0.55,0.792156862745098,0.505580769670668,0.3408010005950928,0.0
1,0,SVC Classifier,0,0.55,0.7607843137254902,1.0,0.32439446449279785,0.0
2,0,Decision Tree,0,0.55,0.7764705882352941,0.6879820706956369,0.003026247024536133,0.0
3,0,RandomForest,0,0.55,0.7607843137254902,1.0,0.8858249187469482,0.0
4,0,AdaBoost (Discrete),0,0.55,0.6862745098039216,0.35943633060991775,47.3266818523407,0.0
5,0,AdaBoost (Real),0,0.55,0.5607843137254902,0.2558112948972851,76.21188926696777,0.0
6,0,Logistic Regression (Penalty = L2),0,0.55,0.7725490196078432,0.28514649594268227,0.6781079769134521,0.0
7,0,Naive Bayes,0,0.55,0.09019607843137255,0.30139632434832064,0.11801934242248535,0.0
8,0,KNeighbors Classifier,1,0.55,0.82,0.6027942669992786,0.4370124340057373,0.0
9,0,SVC Classifier,1,0.55,0.776,1.0,0.31647467613220215,0.0
10,0,Decision Tree,1,0.55,0.824,0.5015481047309814,0.12690401077270508,0.0
11,0,RandomForest,1,0.55,0.776,1.0,0.9164533615112305,0.0
12,0,AdaBoost (Discrete),1,0.55,0.716,0.4165873110458665,46.291508436203,0.0
13,0,AdaBoost (Real),1,0.55,0.752,0.4667158053688232,62.49203276634216,0.0
14,0,Logistic Regression (Penalty = L2),1,0.55,0.796,0.33110299872827026,0.47614288330078125,0.0
15,0,Naive Bayes,1,0.55,0.08,0.45986329782677027,0.27214837074279785,0.0
16,0,KNeighbors Classifier,2,0.55,0.7901234567901234,0.5820285215466404,0.4455723762512207,0.0
17,0,SVC Classifier,2,0.55,0.7983539094650206,1.0,0.4413459300994873,0.0
18,0,Decision Tree,2,0.55,0.7901234567901234,0.6957237435574198,0.0026700496673583984,0.0
19,0,RandomForest,2,0.55,0.7901234567901234,0.6997790520224827,0.5805294513702393,0.0
20,0,AdaBoost (Discrete),2,0.55,0.7407407407407407,0.46654197224748756,49.185068130493164,0.0
21,0,AdaBoost (Real),2,0.55,0.6378600823045267,0.4559261930309984,67.59794402122498,0.0
22,0,Logistic Regression (Penalty = L2),2,0.55,0.7983539094650206,0.4488613467085362,0.577934741973877,0.0
23,0,Naive Bayes,2,0.55,0.06995884773662552,0.7565428747114508,0.12621045112609863,0.0
24,1,KNeighbors Classifier,0,0.55,0.8235294117647058,0.6503474987929083,0.3784215450286865,0.0
25,1,SVC Classifier,0,0.55,0.7607843137254902,1.0,0.23702073097229004,0.0
26,1,Decision Tree,0,0.55,0.8196078431372549,0.8596025978660206,0.002468585968017578,0.0
27,1,RandomForest,0,0.55,0.7607843137254902,1.0,0.904332160949707,0.0
28,1,AdaBoost (Discrete),0,0.55,0.7176470588235294,0.4967315359827907,59.65617084503174,0.0
29,1,AdaBoost (Real),0,0.55,0.6274509803921569,0.4541814727561477,71.64045929908752,0.0
30,1,Logistic Regression (Penalty = L2),0,0.55,0.7725490196078432,0.3265403707549072,0.847308874130249,0.0
31,1,Naive Bayes,0,0.55,0.10196078431372549,0.330562326185227,0.45319461822509766,0.0
32,1,KNeighbors Classifier,1,0.55,0.744,0.7533799631721373,0.30319857597351074,0.0
33,1,SVC Classifier,1,0.55,0.776,1.0,0.44776058197021484,0.0
34,1,Decision Tree,1,0.55,0.788,0.8024099184252322,0.13470053672790527,0.0
35,1,RandomForest,1,0.55,0.776,1.0,0.8087902069091797,0.0
36,1,AdaBoost (Discrete),1,0.55,0.7,0.5006849352530857,54.955323696136475,0.0
37,1,AdaBoost (Real),1,0.55,0.648,0.34548517720937,69.82504439353943,0.0
38,1,Logistic Regression (Penalty = L2),1,0.55,0.788,0.39257956107813935,0.6647458076477051,0.0
39,1,Naive Bayes,1,0.55,0.096,0.3081973874312303,0.25618886947631836,0.0
40,1,KNeighbors Classifier,2,0.55,0.7983539094650206,0.6300571891836706,0.3824148178100586,0.0
41,1,SVC Classifier,2,0.55,0.7983539094650206,1.0,0.3748204708099365,0.0
42,1,Decision Tree,2,0.55,0.8353909465020576,0.9135747340220388,0.13086533546447754,0.0
43,1,RandomForest,2,0.55,0.7983539094650206,1.0,0.89939284324646,0.0
44,1,AdaBoost (Discrete),2,0.55,0.6707818930041153,0.5464162344024247,54.105199337005615,0.0
45,1,AdaBoost (Real),2,0.55,0.39094650205761317,0.41819058825531313,72.30281519889832,0.0
46,1,Logistic Regression (Penalty = L2),2,0.55,0.7818930041152263,0.44646733417548745,0.5822200775146484,0.0
47,1,Naive Bayes,2,0.55,0.102880658436214,0.4746746450380486,0.24776816368103027,0.0
48,2,KNeighbors Classifier,0,0.55,0.7529411764705882,0.2836456415383528,0.37961483001708984,0.0
49,2,SVC Classifier,0,0.55,0.7607843137254902,1.0,0.37395548820495605,0.0
50,2,Decision Tree,0,0.55,0.7725490196078432,0.3754659099412286,0.002340555191040039,0.0
51,2,RandomForest,0,0.55,0.7607843137254902,1.0,0.9984259605407715,0.0
52,2,AdaBoost (Discrete),0,0.55,0.7647058823529411,0.2620113175395233,53.85182309150696,0.0
53,2,AdaBoost (Real),0,0.55,0.7607843137254902,1.0,68.83985137939453,0.0
54,2,Logistic Regression (Penalty = L2),0,0.55,0.7686274509803922,0.27847663515852666,0.35904526710510254,0.0
55,2,Naive Bayes,0,0.55,0.050980392156862744,0.3104250684846592,0.2479546070098877,0.0
56,2,KNeighbors Classifier,1,0.55,0.768,0.3899983589410603,0.5122184753417969,0.0
57,2,SVC Classifier,1,0.55,0.776,1.0,0.25895094871520996,0.0
58,2,Decision Tree,1,0.55,0.8,0.38033746997374945,0.1261000633239746,0.0
59,2,RandomForest,1,0.55,0.776,1.0,0.9257035255432129,0.0
60,2,AdaBoost (Discrete),1,0.55,0.776,0.3207200281427488,53.32745146751404,0.0
61,2,AdaBoost (Real),1,0.55,0.776,0.3207200281427488,68.21846914291382,0.0
62,2,Logistic Regression (Penalty = L2),1,0.55,0.784,0.2853751021838173,0.5131452083587646,0.0
63,2,Naive Bayes,1,0.55,0.044,0.16559340774040096,0.2685880661010742,0.0
64,2,KNeighbors Classifier,2,0.55,0.7942386831275721,0.4691714006711515,0.6646733283996582,0.0
65,2,SVC Classifier,2,0.55,0.7983539094650206,1.0,0.27271151542663574,0.0
66,2,Decision Tree,2,0.55,0.8024691358024691,0.43816831934209105,0.002389669418334961,0.0
67,2,RandomForest,2,0.55,0.7983539094650206,1.0,0.8973548412322998,0.0
68,2,AdaBoost (Discrete),2,0.55,0.7983539094650206,0.5465126348554787,54.713412284851074,0.0
69,2,AdaBoost (Real),2,0.55,0.8065843621399177,0.5054930082353892,71.99958038330078,0.0
70,2,Logistic Regression (Penalty = L2),2,0.55,0.7860082304526749,0.5309421304177872,0.534064769744873,0.0
71,2,Naive Bayes,2,0.55,0.04938271604938271,0.27595463827415806,0.2631042003631592,0.0
72,3,KNeighbors Classifier,0,0.55,0.7607843137254902,1.0,0.2676582336425781,0.0
73,3,SVC Classifier,0,0.55,0.7607843137254902,1.0,0.24057888984680176,0.0
74,3,Decision Tree,0,0.55,0.7647058823529411,0.4040819145799253,0.0021200180053710938,0.0
75,3,RandomForest,0,0.55,0.7607843137254902,1.0,1.0104362964630127,0.0
76,3,AdaBoost (Discrete),0,0.55,0.7607843137254902,0.6291870061116916,53.023595333099365,0.0
77,3,AdaBoost (Real),0,0.55,0.7568627450980392,0.6275463592354678,69.35936069488525,0.0
78,3,Logistic Regression (Penalty = L2),0,0.55,0.7607843137254902,1.0,0.41069746017456055,0.0
79,3,Naive Bayes,0,0.55,0.0392156862745098,0.3195771718380609,0.2599661350250244,0.0
80,3,KNeighbors Classifier,1,0.55,0.788,0.49239345894554554,0.2688915729522705,0.0
81,3,SVC Classifier,1,0.55,0.776,1.0,0.25516510009765625,0.0
82,3,Decision Tree,1,0.55,0.78,0.4472135954999579,0.14111924171447754,0.0
83,3,RandomForest,1,0.55,0.776,1.0,0.9315552711486816,0.0
84,3,AdaBoost (Discrete),1,0.55,0.776,1.0,52.05601215362549,0.0
85,3,AdaBoost (Real),1,0.55,0.776,1.0,66.44867277145386,0.0
86,3,Logistic Regression (Penalty = L2),1,0.55,0.776,1.0,0.45848727226257324,0.0
87,3,Naive Bayes,1,0.55,0.036,0.3935979342530861,0.25847625732421875,0.0
88,3,KNeighbors Classifier,2,0.55,0.7736625514403292,0.36326794144424507,0.3737955093383789,0.0
89,3,SVC Classifier,2,0.55,0.7983539094650206,1.0,0.3881549835205078,0.0
90,3,Decision Tree,2,0.55,0.7818930041152263,0.4939124382737847,0.0018684864044189453,0.0
91,3,RandomForest,2,0.55,0.7983539094650206,1.0,1.0526442527770996,0.0
92,3,AdaBoost (Discrete),2,0.55,0.7901234567901234,0.6997790520224827,53.02803611755371,0.0
93,3,AdaBoost (Real),2,0.55,0.7860082304526749,0.6979350987461912,78.50014448165894,0.0
94,3,Logistic Regression (Penalty = L2),2,0.55,0.7736625514403292,0.4921452945855164,0.2749767303466797,0.0
95,3,Naive Bayes,2,0.55,0.02880658436213992,0.5,0.2839779853820801,0.0
96,4,KNeighbors Classifier,0,0.55,0.7647058823529411,0.2620113175395233,0.44153428077697754,0.0
97,4,SVC Classifier,0,0.55,0.7607843137254902,1.0,0.2869870662689209,0.0
98,4,Decision Tree,0,0.55,0.7686274509803922,0.3115857230292383,0.1423664093017578,0.0
99,4,RandomForest,0,0.55,0.7607843137254902,1.0,1.1381056308746338,0.0
100,4,AdaBoost (Discrete),0,0.55,0.7647058823529411,0.408248290463863,57.07586312294006,0.0
101,4,AdaBoost (Real),0,0.55,0.7607843137254902,0.3769890791947507,62.395623445510864,0.0
102,4,Logistic Regression (Penalty = L2),0,0.55,0.7686274509803922,0.3115857230292383,0.14589595794677734,0.0
103,4,Naive Bayes,0,0.55,0.043137254901960784,0.3670977715849853,0.05567765235900879,0.0
104,4,KNeighbors Classifier,1,0.55,0.788,0.49239345894554554,0.10174036026000977,0.0
105,4,SVC Classifier,1,0.55,0.776,1.0,0.059728145599365234,0.0
106,4,Decision Tree,1,0.55,0.78,0.32127586985818757,0.02993488311767578,0.0
107,4,RandomForest,1,0.55,0.776,1.0,0.24522781372070312,0.0
108,4,AdaBoost (Discrete),1,0.55,0.772,0.9948453608247423,41.511014223098755,0.0
109,4,AdaBoost (Real),1,0.55,0.776,0.4071947447321208,60.60361862182617,0.0
110,4,Logistic Regression (Penalty = L2),1,0.55,0.784,0.3218297948685433,0.24427437782287598,0.0
111,4,Naive Bayes,1,0.55,0.04,0.33144540173399867,0.21537399291992188,0.0
112,4,KNeighbors Classifier,2,0.55,0.7777777777777778,0.36391779603417973,0.3547511100769043,0.0
113,4,SVC Classifier,2,0.55,0.7983539094650206,1.0,0.26436591148376465,0.0
114,4,Decision Tree,2,0.55,0.7860082304526749,0.4470694492780124,0.0023794174194335938,0.0
115,4,RandomForest,2,0.55,0.7901234567901234,0.6997790520224827,0.7111399173736572,0.0
116,4,AdaBoost (Discrete),2,0.55,0.7901234567901234,0.6997790520224827,54.64705777168274,0.0
117,4,AdaBoost (Real),2,0.55,0.7901234567901234,0.49611895813258006,48.97281527519226,0.0
118,4,Logistic Regression (Penalty = L2),2,0.55,0.7860082304526749,0.4470694492780124,0.17317533493041992,0.0
119,4,Naive Bayes,2,0.55,0.03292181069958848,0.6299605249474366,0.13155341148376465,0.0
120,5,KNeighbors Classifier,0,0.55,0.7647058823529411,0.4472135954999579,0.2120194435119629,0.0
121,5,SVC Classifier,0,0.55,0.7607843137254902,1.0,0.13944602012634277,0.0
122,5,Decision Tree,0,0.55,0.7686274509803922,0.3389296466508029,0.10182762145996094,0.0
123,5,RandomForest,0,0.55,0.7607843137254902,1.0,0.5135421752929688,0.0
124,5,AdaBoost (Discrete),0,0.55,0.7607843137254902,0.6291870061116916,46.38049530982971,0.0
125,5,AdaBoost (Real),0,0.55,0.7607843137254902,0.6291870061116916,62.79778814315796,0.0
126,5,Logistic Regression (Penalty = L2),0,0.55,0.7647058823529411,0.4294011091800735,0.22833013534545898,0.0
127,5,Naive Bayes,0,0.55,0.0392156862745098,0.3195771718380609,0.25617480278015137,0.0
128,5,KNeighbors Classifier,1,0.55,0.788,0.49239345894554554,0.3835275173187256,0.0
129,5,SVC Classifier,1,0.55,0.776,1.0,0.2528972625732422,0.0
130,5,Decision Tree,1,0.55,0.784,0.34199518933533946,0.1302807331085205,0.0
131,5,RandomForest,1,0.55,0.776,1.0,0.9080221652984619,0.0
132,5,AdaBoost (Discrete),1,0.55,0.776,1.0,48.8696072101593,0.0
133,5,AdaBoost (Real),1,0.55,0.776,1.0,65.27035403251648,0.0
134,5,Logistic Regression (Penalty = L2),1,0.55,0.78,0.4472135954999579,0.2740478515625,0.0
135,5,Naive Bayes,1,0.55,0.04,0.16537958674047387,0.1340172290802002,0.0
136,5,KNeighbors Classifier,2,0.55,0.7736625514403292,0.36326794144424507,0.3788027763366699,0.0
137,5,SVC Classifier,2,0.55,0.7983539094650206,1.0,0.24451732635498047,0.0
138,5,Decision Tree,2,0.55,0.7818930041152263,0.4939124382737847,0.0014166831970214844,0.0
139,5,RandomForest,2,0.55,0.7983539094650206,1.0,0.8439345359802246,0.0
140,5,AdaBoost (Discrete),2,0.55,0.7901234567901234,0.6997790520224827,47.01519012451172,0.0
141,5,AdaBoost (Real),2,0.55,0.7860082304526749,0.6979350987461912,59.432137966156006,0.0
142,5,Logistic Regression (Penalty = L2),2,0.55,0.7736625514403292,0.4921452945855164,0.2507321834564209,0.0
143,5,Naive Bayes,2,0.55,0.0411522633744856,0.2096801817817821,0.2402195930480957,0.0
144,6,KNeighbors Classifier,0,0.55,0.7647058823529411,0.2620113175395233,0.48609185218811035,0.0
145,6,SVC Classifier,0,0.55,0.7607843137254902,1.0,0.23604226112365723,0.0
146,6,Decision Tree,0,0.55,0.7725490196078432,0.28514649594268227,0.11787867546081543,0.0
147,6,RandomForest,0,0.55,0.7607843137254902,1.0,0.8313248157501221,0.0
148,6,AdaBoost (Discrete),0,0.55,0.7647058823529411,0.408248290463863,52.97549819946289,0.0
149,6,AdaBoost (Real),0,0.55,0.7607843137254902,0.304656525504104,67.04939389228821,0.0
150,6,Logistic Regression (Penalty = L2),0,0.55,0.7725490196078432,0.28514649594268227,0.5050008296966553,0.0
151,6,Naive Bayes,0,0.55,0.043137254901960784,0.3670977715849853,0.2679481506347656,0.0
152,6,KNeighbors Classifier,1,0.55,0.788,0.49239345894554554,0.5280110836029053,0.0
153,6,SVC Classifier,1,0.55,0.776,1.0,0.39534831047058105,0.0
154,6,Decision Tree,1,0.55,0.788,0.28574404296988,0.1224362850189209,0.0
155,6,RandomForest,1,0.55,0.776,1.0,0.7529513835906982,0.0
156,6,AdaBoost (Discrete),1,0.55,0.776,0.4071947447321208,52.27880859375,0.0
157,6,AdaBoost (Real),1,0.55,0.776,0.4071947447321208,72.06659817695618,0.0
158,6,Logistic Regression (Penalty = L2),1,0.55,0.784,0.2853751021838173,0.38797783851623535,0.0
159,6,Naive Bayes,1,0.55,0.044,0.16559340774040096,0.23539018630981445,0.0
160,6,KNeighbors Classifier,2,0.55,0.7777777777777778,0.36391779603417973,0.5289201736450195,0.0
161,6,SVC Classifier,2,0.55,0.7983539094650206,1.0,0.26580047607421875,0.0
162,6,Decision Tree,2,0.55,0.7901234567901234,0.44766914136939523,0.0013446807861328125,0.0
163,6,RandomForest,2,0.55,0.7901234567901234,0.6997790520224827,0.9074850082397461,0.0
164,6,AdaBoost (Discrete),2,0.55,0.7901234567901234,0.6997790520224827,51.23376226425171,0.0
165,6,AdaBoost (Real),2,0.55,0.8024691358024691,0.4352840471927457,73.83251619338989,0.0
166,6,Logistic Regression (Penalty = L2),2,0.55,0.7860082304526749,0.4470694492780124,0.418670654296875,0.0
167,6,Naive Bayes,2,0.55,0.04526748971193416,0.24935316404995922,0.15002703666687012,0.0
168,7,KNeighbors Classifier,0,0.55,0.8156862745098039,0.6790752777955172,0.47591567039489746,0.0
169,7,SVC Classifier,0,0.55,0.7607843137254902,1.0,0.5708310604095459,0.0
170,7,Decision Tree,0,0.55,0.8352941176470589,0.9332368798552484,0.14686083793640137,0.0
171,7,RandomForest,0,0.55,0.7607843137254902,1.0,1.0210890769958496,0.0
172,7,AdaBoost (Discrete),0,0.55,0.796078431372549,0.6213063099870838,65.92224431037903,0.0
173,7,AdaBoost (Real),0,0.55,0.6705882352941176,0.5902995919424497,72.50654292106628,0.0
174,7,Logistic Regression (Penalty = L2),0,0.55,0.7490196078431373,0.32512333276652117,0.7069089412689209,0.0
175,7,Naive Bayes,0,0.55,0.10980392156862745,0.31419291226453727,0.1802842617034912,0.0
176,7,KNeighbors Classifier,1,0.55,0.76,0.7322095256944477,0.44855427742004395,0.0
177,7,SVC Classifier,1,0.55,0.776,1.0,0.5887331962585449,0.0
178,7,Decision Tree,1,0.55,0.808,0.9401618170359693,0.11541509628295898,0.0
179,7,RandomForest,1,0.55,0.788,0.7745966692414834,0.8258335590362549,0.0
180,7,AdaBoost (Discrete),1,0.55,0.82,0.7017839324350483,58.849302768707275,0.0
181,7,AdaBoost (Real),1,0.55,0.712,0.4756741908962433,74.44521260261536,0.0
182,7,Logistic Regression (Penalty = L2),1,0.55,0.808,0.39773448577795095,0.8323280811309814,0.0
183,7,Naive Bayes,1,0.55,0.084,0.279199252841938,0.34516191482543945,0.0
184,7,KNeighbors Classifier,2,0.55,0.8024691358024691,0.7492054145179102,0.6561808586120605,0.0
185,7,SVC Classifier,2,0.55,0.7983539094650206,1.0,0.6139988899230957,0.0
186,7,Decision Tree,2,0.55,0.823045267489712,0.7703535474862303,0.1310586929321289,0.0
187,7,RandomForest,2,0.55,0.7983539094650206,1.0,0.8650054931640625,0.0
188,7,AdaBoost (Discrete),2,0.55,0.7695473251028807,0.7176142779406567,59.53197741508484,0.0
189,7,AdaBoost (Real),2,0.55,0.7037037037037037,0.5710157099195491,77.24786067008972,0.0
190,7,Logistic Regression (Penalty = L2),2,0.55,0.7901234567901234,0.5240358157334922,1.057274341583252,0.0
191,7,Naive Bayes,2,0.55,0.10699588477366255,0.4563925617881304,0.30106210708618164,0.0
192,8,KNeighbors Classifier,0,0.55,0.7607843137254902,1.0,0.2976114749908447,0.0
193,8,SVC Classifier,0,0.55,0.7607843137254902,1.0,0.29051756858825684,0.0
194,8,Decision Tree,0,0.55,0.7647058823529411,0.4040819145799253,0.14558768272399902,0.0
195,8,RandomForest,0,0.55,0.7607843137254902,1.0,1.0630338191986084,0.0
196,8,AdaBoost (Discrete),0,0.55,0.7607843137254902,0.6291870061116916,56.119667530059814,0.0
197,8,AdaBoost (Real),0,0.55,0.7607843137254902,0.6291870061116916,73.63407397270203,0.0
198,8,Logistic Regression (Penalty = L2),0,0.55,0.7607843137254902,1.0,0.2645230293273926,0.0
199,8,Naive Bayes,0,0.55,0.0392156862745098,0.3195771718380609,0.27939605712890625,0.0
200,8,KNeighbors Classifier,1,0.55,0.788,0.49239345894554554,0.281890869140625,0.0
201,8,SVC Classifier,1,0.55,0.776,1.0,0.28751540184020996,0.0
202,8,Decision Tree,1,0.55,0.78,0.4472135954999579,0.13822555541992188,0.0
203,8,RandomForest,1,0.55,0.776,1.0,0.9768290519714355,0.0
204,8,AdaBoost (Discrete),1,0.55,0.776,1.0,56.568676233291626,0.0
205,8,AdaBoost (Real),1,0.55,0.776,1.0,69.45654821395874,0.0
206,8,Logistic Regression (Penalty = L2),1,0.55,0.776,1.0,0.26484131813049316,0.0
207,8,Naive Bayes,1,0.55,0.036,0.3935979342530861,0.26030540466308594,0.0
208,8,KNeighbors Classifier,2,0.55,0.7736625514403292,0.36326794144424507,0.13041400909423828,0.0
209,8,SVC Classifier,2,0.55,0.7983539094650206,1.0,0.37714147567749023,0.0
210,8,Decision Tree,2,0.55,0.7818930041152263,0.4939124382737847,0.12216615676879883,0.0
211,8,RandomForest,2,0.55,0.7983539094650206,1.0,0.8990800380706787,0.0
212,8,AdaBoost (Discrete),2,0.55,0.7901234567901234,0.6997790520224827,54.62087059020996,0.0
213,8,AdaBoost (Real),2,0.55,0.7860082304526749,0.6979350987461912,86.10542011260986,0.0
214,8,Logistic Regression (Penalty = L2),2,0.55,0.7736625514403292,0.4921452945855164,0.2973439693450928,0.0
215,8,Naive Bayes,2,0.55,0.02880658436213992,0.5,0.2857699394226074,0.0
