,feat_set_id,classifier,fold_id,feat_th,score,geo_score,exec_t,geo_score_woz
0,0,KNeighbors Classifier,0,0.1,0.6916666666666667,0.9931736624740629,0.2044374942779541,0.0
1,0,SVC Classifier,0,0.1,0.5083333333333333,1.0,0.20977163314819336,0.0
2,0,Decision Tree,0,0.1,0.6833333333333333,0.9556271872321935,0.10567092895507812,0.0
3,0,RandomForest,0,0.1,0.675,0.8694417438899827,0.6762278079986572,0.0
4,0,AdaBoost (Discrete),0,0.1,0.6166666666666667,0.8133256605240852,42.52422904968262,0.0
5,0,AdaBoost (Real),0,0.1,0.6416666666666667,0.8307018474412792,46.384897232055664,0.0
6,0,Logistic Regression (Penalty = L2),0,0.1,0.7,1.0,0.20951318740844727,0.0
7,0,Naive Bayes,0,0.1,0.65,0.9567313221610931,0.10426139831542969,0.0
8,0,KNeighbors Classifier,1,0.1,0.6833333333333333,0.9671682101338347,0.10359930992126465,0.0
9,0,SVC Classifier,1,0.1,0.5,0.9789450103725609,0.20548224449157715,0.0
10,0,Decision Tree,1,0.1,0.6916666666666667,0.9894164999496223,0.1021413803100586,0.0
11,0,RandomForest,1,0.1,0.6916666666666667,0.9839948356327152,0.6885926723480225,0.0
12,0,AdaBoost (Discrete),1,0.1,0.6833333333333333,0.978482042633557,36.714529037475586,0.0
13,0,AdaBoost (Real),1,0.1,0.7,1.0,39.317272901535034,0.0
14,0,Logistic Regression (Penalty = L2),1,0.1,0.6916666666666667,0.9894164999496223,0.10259819030761719,0.0
15,0,Naive Bayes,1,0.1,0.525,1.0,0.1049962043762207,0.0
16,0,KNeighbors Classifier,2,0.1,0.6949152542372882,1.0,0.003395557403564453,0.0
17,0,SVC Classifier,2,0.1,0.5084745762711864,1.0,0.20536136627197266,0.0
18,0,Decision Tree,2,0.1,0.6949152542372882,1.0,0.10165047645568848,0.0
19,0,RandomForest,2,0.1,0.6949152542372882,1.0,0.7209010124206543,0.0
20,0,AdaBoost (Discrete),2,0.1,0.6949152542372882,1.0,35.14542269706726,0.0
21,0,AdaBoost (Real),2,0.1,0.6949152542372882,1.0,40.7762188911438,0.0
22,0,Logistic Regression (Penalty = L2),2,0.1,0.6949152542372882,1.0,0.09868431091308594,0.0
23,0,Naive Bayes,2,0.1,0.5169491525423728,1.0,0.10277748107910156,0.0
24,1,KNeighbors Classifier,0,0.1,0.625,0.8468395158473866,0.00307464599609375,0.0
25,1,SVC Classifier,0,0.1,0.30833333333333335,1.0,0.10396933555603027,0.0
26,1,Decision Tree,0,0.1,0.8,0.8478396180515569,0.07854986190795898,0.0
27,1,RandomForest,0,0.1,0.8,0.8471762059571417,0.62847900390625,0.0
28,1,AdaBoost (Discrete),0,0.1,0.7,0.7141164912655598,35.393054723739624,0.0
29,1,AdaBoost (Real),0,0.1,0.75,0.7717732292659845,41.71439480781555,0.0
30,1,Logistic Regression (Penalty = L2),0,0.1,0.825,0.9306743530922932,0.10808229446411133,0.0
31,1,Naive Bayes,0,0.1,0.7416666666666667,0.9004489606971755,0.10678315162658691,0.0
32,1,KNeighbors Classifier,1,0.1,0.7166666666666667,0.8277157627849838,0.14458537101745605,0.0
33,1,SVC Classifier,1,0.1,0.30833333333333335,1.0,0.1236567497253418,0.0
34,1,Decision Tree,1,0.1,0.725,0.8331617311428053,0.0011429786682128906,0.0
35,1,RandomForest,1,0.1,0.7416666666666667,0.8436450504098126,0.5810518264770508,0.0
36,1,AdaBoost (Discrete),1,0.1,0.5333333333333333,0.30913496048855005,34.931002616882324,0.30913496048855005
37,1,AdaBoost (Real),1,0.1,0.6333333333333333,0.7106938905276431,43.2887065410614,0.0
38,1,Logistic Regression (Penalty = L2),1,0.1,0.725,0.8331617311428053,0.10332703590393066,0.0
39,1,Naive Bayes,1,0.1,0.6,0.3454596784441751,0.1124272346496582,0.3454596784441751
40,1,KNeighbors Classifier,2,0.1,0.6694915254237288,1.0,0.21296143531799316,0.0
41,1,SVC Classifier,2,0.1,0.3135593220338983,1.0,0.10918450355529785,0.0
42,1,Decision Tree,2,0.1,0.8220338983050848,0.944087511294902,0.1055598258972168,0.0
43,1,RandomForest,2,0.1,0.6440677966101694,1.0,0.5221114158630371,0.0
44,1,AdaBoost (Discrete),2,0.1,0.8220338983050848,0.944087511294902,36.15769958496094,0.0
45,1,AdaBoost (Real),2,0.1,0.711864406779661,0.757858283255199,47.26109576225281,0.0
46,1,Logistic Regression (Penalty = L2),2,0.1,0.8220338983050848,0.944087511294902,0.12793707847595215,0.0
47,1,Naive Bayes,2,0.1,0.7033898305084746,0.8325532074018731,0.1293320655822754,0.0
48,2,KNeighbors Classifier,0,0.1,0.3333333333333333,0.8219949365267865,0.13259577751159668,0.0
49,2,SVC Classifier,0,0.1,0.30833333333333335,1.0,0.24579954147338867,0.0
50,2,Decision Tree,0,0.1,0.325,0.33341911134363883,0.001110076904296875,0.0
51,2,RandomForest,0,0.1,0.3416666666666667,0.9004503377814963,0.8544948101043701,0.0
52,2,AdaBoost (Discrete),0,0.1,0.3416666666666667,0.340225454223128,39.44416904449463,0.0
53,2,AdaBoost (Real),0,0.1,0.325,0.33341911134363883,44.381473541259766,0.0
54,2,Logistic Regression (Penalty = L2),0,0.1,0.325,0.33341911134363883,0.10768699645996094,0.0
55,2,Naive Bayes,0,0.1,0.25833333333333336,0.3290185032381231,0.0918889045715332,0.0
56,2,KNeighbors Classifier,1,0.1,0.19166666666666668,0.31795194988449793,0.21376967430114746,0.0
57,2,SVC Classifier,1,0.1,0.30833333333333335,1.0,0.10791826248168945,0.0
58,2,Decision Tree,1,0.1,0.3416666666666667,0.32632292248662254,0.0010943412780761719,0.0
59,2,RandomForest,1,0.1,0.3416666666666667,0.7559289460184544,0.756507158279419,0.0
60,2,AdaBoost (Discrete),1,0.1,0.35833333333333334,0.2158766602717626,38.66370224952698,0.0
61,2,AdaBoost (Real),1,0.1,0.3416666666666667,0.20273072491938493,51.382856607437134,0.0
62,2,Logistic Regression (Penalty = L2),1,0.1,0.36666666666666664,0.39324233362709327,0.14003849029541016,0.0
63,2,Naive Bayes,1,0.1,0.075,0.15749013123685915,0.0026276111602783203,0.0
64,2,KNeighbors Classifier,2,0.1,0.3305084745762712,0.944400281603035,0.1082618236541748,0.0
65,2,SVC Classifier,2,0.1,0.3135593220338983,1.0,0.0035855770111083984,0.0
66,2,Decision Tree,2,0.1,0.3305084745762712,0.944400281603035,0.10610532760620117,0.0
67,2,RandomForest,2,0.1,0.3644067796610169,1.0,0.7495865821838379,0.0
68,2,AdaBoost (Discrete),2,0.1,0.3305084745762712,0.944400281603035,41.640238523483276,0.0
69,2,AdaBoost (Real),2,0.1,0.3305084745762712,0.944400281603035,49.58537268638611,0.0
70,2,Logistic Regression (Penalty = L2),2,0.1,0.3305084745762712,0.944400281603035,0.1191108226776123,0.0
71,2,Naive Bayes,2,0.1,0.2457627118644068,0.29568618927514184,0.24493789672851562,0.0
72,3,KNeighbors Classifier,0,0.1,0.8416666666666667,0.7913140708005084,0.22948622703552246,0.7913140708005084
73,3,SVC Classifier,0,0.1,0.5,0.48610385885280644,0.23402762413024902,0.0
74,3,Decision Tree,0,0.1,0.8083333333333333,0.6551853485522242,0.0019423961639404297,0.6551853485522242
75,3,RandomForest,0,0.1,0.775,0.6538773475378148,0.8343465328216553,0.0
76,3,AdaBoost (Discrete),0,0.1,0.7333333333333333,0.5785468650343589,34.34664583206177,0.5785468650343589
77,3,AdaBoost (Real),0,0.1,0.49166666666666664,0.4125155981236127,52.648762941360474,0.0
78,3,Logistic Regression (Penalty = L2),0,0.1,0.875,0.8505123716464729,0.1084139347076416,0.8505123716464729
79,3,Naive Bayes,0,0.1,0.825,0.8064091538578251,0.10462236404418945,0.8064091538578251
80,3,KNeighbors Classifier,1,0.1,0.8416666666666667,0.8190037991624199,0.11571097373962402,0.8190037991624199
81,3,SVC Classifier,1,0.1,0.5333333333333333,0.6242332940780775,0.20923590660095215,0.0
82,3,Decision Tree,1,0.1,0.8583333333333333,0.8447008995831519,0.10574889183044434,0.8447008995831519
83,3,RandomForest,1,0.1,0.7,0.7825422900366437,0.7454462051391602,0.0
84,3,AdaBoost (Discrete),1,0.1,0.8416666666666667,0.8250940251500058,49.507402420043945,0.8250940251500058
85,3,AdaBoost (Real),1,0.1,0.8833333333333333,0.8767073055694247,94.20508980751038,0.8767073055694247
86,3,Logistic Regression (Penalty = L2),1,0.1,0.8916666666666667,0.865132130867965,0.2211778163909912,0.865132130867965
87,3,Naive Bayes,1,0.1,0.7166666666666667,0.42615354149383194,0.2196214199066162,0.42615354149383194
88,3,KNeighbors Classifier,2,0.1,0.8728813559322034,0.8622184836955661,0.4293673038482666,0.8622184836955661
89,3,SVC Classifier,2,0.1,0.5254237288135594,0.5,0.4378533363342285,0.0
90,3,Decision Tree,2,0.1,0.9152542372881356,0.9072387460057391,0.001201629638671875,0.9072387460057391
91,3,RandomForest,2,0.1,0.7627118644067796,0.9157103753711766,1.3392775058746338,0.0
92,3,AdaBoost (Discrete),2,0.1,0.8898305084745762,0.8846574251850181,79.00012564659119,0.8846574251850181
93,3,AdaBoost (Real),2,0.1,0.5508474576271186,0.9410360288810286,88.30983686447144,0.0
94,3,Logistic Regression (Penalty = L2),2,0.1,0.9322033898305084,0.9253244268106318,0.1934034824371338,0.9253244268106318
95,3,Naive Bayes,2,0.1,0.7966101694915254,0.9625097843123498,0.18746304512023926,0.0
96,4,KNeighbors Classifier,0,0.1,0.475,0.8298265333662435,0.19272184371948242,0.0
97,4,SVC Classifier,0,0.1,0.30833333333333335,1.0,0.19261670112609863,0.0
98,4,Decision Tree,0,0.1,0.475,0.8298265333662435,0.18983697891235352,0.0
99,4,RandomForest,0,0.1,0.475,0.8298265333662435,1.1952705383300781,0.0
100,4,AdaBoost (Discrete),0,0.1,0.3333333333333333,0.8298265333662435,72.28816056251526,0.0
101,4,AdaBoost (Real),0,0.1,0.44166666666666665,0.3576892211540484,92.15678930282593,0.0
102,4,Logistic Regression (Penalty = L2),0,0.1,0.5,1.0,0.23964738845825195,0.0
103,4,Naive Bayes,0,0.1,0.5,1.0,0.2321629524230957,0.0
104,4,KNeighbors Classifier,1,0.1,0.35833333333333334,1.0,0.2366182804107666,0.0
105,4,SVC Classifier,1,0.1,0.30833333333333335,1.0,0.2284555435180664,0.0
106,4,Decision Tree,1,0.1,0.5,1.0,0.0018205642700195312,0.0
107,4,RandomForest,1,0.1,0.5,1.0,1.6238813400268555,0.0
108,4,AdaBoost (Discrete),1,0.1,0.325,1.0,77.8719494342804,0.0
109,4,AdaBoost (Real),1,0.1,0.44166666666666665,0.37991784282579627,89.85814356803894,0.0
110,4,Logistic Regression (Penalty = L2),1,0.1,0.5,1.0,0.18341422080993652,0.0
111,4,Naive Bayes,1,0.1,0.5,1.0,0.1883530616760254,0.0
112,4,KNeighbors Classifier,2,0.1,0.5,1.0,0.19249510765075684,0.0
113,4,SVC Classifier,2,0.1,0.3135593220338983,1.0,0.1847670078277588,0.0
114,4,Decision Tree,2,0.1,0.5,1.0,0.0010573863983154297,0.0
115,4,RandomForest,2,0.1,0.5,1.0,1.3230605125427246,0.0
116,4,AdaBoost (Discrete),2,0.1,0.2711864406779661,0.8549879733383485,71.27019810676575,0.0
117,4,AdaBoost (Real),2,0.1,0.4491525423728814,0.8549879733383485,78.70239567756653,0.0
118,4,Logistic Regression (Penalty = L2),2,0.1,0.5,1.0,0.11936640739440918,0.0
119,4,Naive Bayes,2,0.1,0.5,1.0,0.09694051742553711,0.0
120,5,KNeighbors Classifier,0,0.1,0.35833333333333334,0.9258200997725514,0.11996793746948242,0.0
121,5,SVC Classifier,0,0.1,0.30833333333333335,1.0,0.11121678352355957,0.0
122,5,Decision Tree,0,0.1,0.35833333333333334,0.9258200997725514,0.11797976493835449,0.0
123,5,RandomForest,0,0.1,0.35833333333333334,0.9258200997725514,0.7045576572418213,0.0
124,5,AdaBoost (Discrete),0,0.1,0.24166666666666667,0.9063269671749657,39.43224883079529,0.0
125,5,AdaBoost (Real),0,0.1,0.35833333333333334,0.9258200997725514,43.84278845787048,0.0
126,5,Logistic Regression (Penalty = L2),0,0.1,0.35833333333333334,0.9258200997725514,0.10699748992919922,0.0
127,5,Naive Bayes,0,0.1,0.35833333333333334,0.9258200997725514,0.002256631851196289,0.0
128,5,KNeighbors Classifier,1,0.1,0.2,0.7559289460184544,0.10698437690734863,0.0
129,5,SVC Classifier,1,0.1,0.30833333333333335,1.0,0.1075892448425293,0.0
130,5,Decision Tree,1,0.1,0.36666666666666664,1.0,0.0014586448669433594,0.0
131,5,RandomForest,1,0.1,0.36666666666666664,1.0,0.6436893939971924,0.0
132,5,AdaBoost (Discrete),1,0.1,0.36666666666666664,1.0,41.723801612854004,0.0
133,5,AdaBoost (Real),1,0.1,0.36666666666666664,1.0,53.233808755874634,0.0
134,5,Logistic Regression (Penalty = L2),1,0.1,0.36666666666666664,1.0,0.11952638626098633,0.0
135,5,Naive Bayes,1,0.1,0.36666666666666664,1.0,0.11885309219360352,0.0
136,5,KNeighbors Classifier,2,0.1,0.3559322033898305,0.9128709291752769,0.14418411254882812,0.0
137,5,SVC Classifier,2,0.1,0.3135593220338983,1.0,0.002508401870727539,0.0
138,5,Decision Tree,2,0.1,0.3644067796610169,1.0,0.0014677047729492188,0.0
139,5,RandomForest,2,0.1,0.3644067796610169,1.0,0.7192277908325195,0.0
140,5,AdaBoost (Discrete),2,0.1,0.3644067796610169,1.0,41.74214696884155,0.0
141,5,AdaBoost (Real),2,0.1,0.3644067796610169,1.0,53.886757135391235,0.0
142,5,Logistic Regression (Penalty = L2),2,0.1,0.3644067796610169,1.0,0.12669682502746582,0.0
143,5,Naive Bayes,2,0.1,0.3644067796610169,1.0,0.1168985366821289,0.0
144,6,KNeighbors Classifier,0,0.1,0.48333333333333334,0.9412781894755781,0.12474441528320312,0.0
145,6,SVC Classifier,0,0.1,0.30833333333333335,1.0,0.12078261375427246,0.0
146,6,Decision Tree,0,0.1,0.475,0.8298265333662435,0.0010921955108642578,0.0
147,6,RandomForest,0,0.1,0.4666666666666667,0.9235139665572625,0.838247537612915,0.0
148,6,AdaBoost (Discrete),0,0.1,0.3,0.3608975173964652,42.39994955062866,0.0
149,6,AdaBoost (Real),0,0.1,0.475,0.8298265333662435,49.19077658653259,0.0
150,6,Logistic Regression (Penalty = L2),0,0.1,0.49166666666666664,0.9909085876931146,0.0725090503692627,0.0
151,6,Naive Bayes,0,0.1,0.45,0.9071940382700084,0.11867570877075195,0.0
152,6,KNeighbors Classifier,1,0.1,0.35,0.9787169102922159,0.13921618461608887,0.0
153,6,SVC Classifier,1,0.1,0.30833333333333335,1.0,0.11507773399353027,0.0
154,6,Decision Tree,1,0.1,0.5,1.0,0.0010924339294433594,0.0
155,6,RandomForest,1,0.1,0.5,1.0,0.7185251712799072,0.0
156,6,AdaBoost (Discrete),1,0.1,0.2916666666666667,0.4114010210203452,42.65921449661255,0.0
157,6,AdaBoost (Real),1,0.1,0.5,1.0,49.47456097602844,0.0
158,6,Logistic Regression (Penalty = L2),1,0.1,0.5,1.0,0.11971926689147949,0.0
159,6,Naive Bayes,1,0.1,0.30833333333333335,0.9564655913861946,0.11085867881774902,0.0
160,6,KNeighbors Classifier,2,0.1,0.3559322033898305,1.0,0.0026531219482421875,0.0
161,6,SVC Classifier,2,0.1,0.3135593220338983,1.0,0.1122589111328125,0.0
162,6,Decision Tree,2,0.1,0.5,1.0,0.0017704963684082031,0.0
163,6,RandomForest,2,0.1,0.5,1.0,0.6957542896270752,0.0
164,6,AdaBoost (Discrete),2,0.1,0.3220338983050847,1.0,40.43144226074219,0.0
165,6,AdaBoost (Real),2,0.1,0.5,1.0,48.91196417808533,0.0
166,6,Logistic Regression (Penalty = L2),2,0.1,0.5,1.0,0.11573147773742676,0.0
167,6,Naive Bayes,2,0.1,0.3135593220338983,0.9787169102922159,0.11527514457702637,0.0
168,8,KNeighbors Classifier,0,0.1,0.625,0.8468395158473866,0.22463703155517578,0.0
169,8,SVC Classifier,0,0.1,0.30833333333333335,1.0,0.11720442771911621,0.0
170,8,Decision Tree,0,0.1,0.7916666666666666,0.8369662809050498,0.11400318145751953,0.0
171,8,RandomForest,0,0.1,0.7833333333333333,0.737509723307063,0.8023030757904053,0.0
172,8,AdaBoost (Discrete),0,0.1,0.625,0.6052916375537973,40.87128567695618,0.0
173,8,AdaBoost (Real),0,0.1,0.75,0.7717732292659845,47.06386089324951,0.0
174,8,Logistic Regression (Penalty = L2),0,0.1,0.825,0.9306743530922932,0.002567291259765625,0.0
175,8,Naive Bayes,0,0.1,0.7416666666666667,0.9004489606971755,0.003779172897338867,0.0
176,8,KNeighbors Classifier,1,0.1,0.7166666666666667,0.8277157627849838,0.22088623046875,0.0
177,8,SVC Classifier,1,0.1,0.30833333333333335,1.0,0.11231780052185059,0.0
178,8,Decision Tree,1,0.1,0.7,0.8163729029555465,0.10978913307189941,0.0
179,8,RandomForest,1,0.1,0.7416666666666667,0.8436450504098126,0.6749615669250488,0.0
180,8,AdaBoost (Discrete),1,0.1,0.5916666666666667,0.7221281100527692,39.79524517059326,0.0
181,8,AdaBoost (Real),1,0.1,0.6333333333333333,0.7106938905276431,44.19585680961609,0.0
182,8,Logistic Regression (Penalty = L2),1,0.1,0.725,0.8331617311428053,0.10399889945983887,0.0
183,8,Naive Bayes,1,0.1,0.6416666666666667,0.3550504078510283,0.2051534652709961,0.3550504078510283
184,8,KNeighbors Classifier,2,0.1,0.6694915254237288,1.0,0.1049809455871582,0.0
185,8,SVC Classifier,2,0.1,0.3135593220338983,1.0,0.2051067352294922,0.0
186,8,Decision Tree,2,0.1,0.8220338983050848,0.944087511294902,0.10201287269592285,0.0
187,8,RandomForest,2,0.1,0.8220338983050848,0.944087511294902,0.6391112804412842,0.0
188,8,AdaBoost (Discrete),2,0.1,0.7711864406779662,0.8593859637937393,38.43414521217346,0.0
189,8,AdaBoost (Real),2,0.1,0.711864406779661,0.757858283255199,43.79280185699463,0.0
190,8,Logistic Regression (Penalty = L2),2,0.1,0.8220338983050848,0.944087511294902,0.10436344146728516,0.0
191,8,Naive Bayes,2,0.1,0.7033898305084746,0.8325532074018731,0.20461225509643555,0.0
192,10,KNeighbors Classifier,0,0.1,0.6416666666666667,0.9601845894041878,0.10865426063537598,0.0
193,10,SVC Classifier,0,0.1,0.30833333333333335,1.0,0.21285414695739746,0.0
194,10,Decision Tree,0,0.1,0.7833333333333333,0.8295583340474227,0.11005640029907227,0.0
195,10,RandomForest,0,0.1,0.8166666666666667,0.9224370007559375,0.6255936622619629,0.0
196,10,AdaBoost (Discrete),0,0.1,0.6166666666666667,0.5975289193380467,36.9392774105072,0.0
197,10,AdaBoost (Real),0,0.1,0.75,0.7717732292659845,43.89175009727478,0.0
198,10,Logistic Regression (Penalty = L2),0,0.1,0.8333333333333334,0.9598140523184039,0.11242461204528809,0.0
199,10,Naive Bayes,0,0.1,0.75,0.928642293623991,0.10858440399169922,0.0
200,10,KNeighbors Classifier,1,0.1,0.5916666666666667,0.9326937720397194,0.12306356430053711,0.0
201,10,SVC Classifier,1,0.1,0.30833333333333335,1.0,0.10950827598571777,0.0
202,10,Decision Tree,1,0.1,0.725,0.8331617311428053,0.0011165142059326172,0.0
203,10,RandomForest,1,0.1,0.7416666666666667,0.8436450504098126,0.6803112030029297,0.0
204,10,AdaBoost (Discrete),1,0.1,0.6166666666666667,0.7696172452138045,38.715622663497925,0.0
205,10,AdaBoost (Real),1,0.1,0.7,0.8163729029555465,43.02846169471741,0.0
206,10,Logistic Regression (Penalty = L2),1,0.1,0.7166666666666667,0.8224766343303885,0.10279393196105957,0.0
207,10,Naive Bayes,1,0.1,0.65,0.5419302281973313,0.10746955871582031,0.0
208,10,KNeighbors Classifier,2,0.1,0.6694915254237288,1.0,0.20523357391357422,0.0
209,10,SVC Classifier,2,0.1,0.3135593220338983,1.0,0.20125579833984375,0.0
210,10,Decision Tree,2,0.1,0.8220338983050848,0.944087511294902,0.0018787384033203125,0.0
211,10,RandomForest,2,0.1,0.8220338983050848,0.944087511294902,0.629035234451294,0.0
212,10,AdaBoost (Discrete),2,0.1,0.7796610169491526,0.6069622310029172,37.535765409469604,0.6069622310029172
213,10,AdaBoost (Real),2,0.1,0.7203389830508474,0.7724431723144727,43.615829944610596,0.0
214,10,Logistic Regression (Penalty = L2),2,0.1,0.8220338983050848,0.944087511294902,0.11660075187683105,0.0
215,10,Naive Bayes,2,0.1,0.6271186440677966,0.9839948356327152,0.10832595825195312,0.0
216,11,KNeighbors Classifier,0,0.1,0.95,0.9250953860699915,0.11008191108703613,0.9250953860699915
217,11,SVC Classifier,0,0.1,0.6833333333333333,0.5870274429720093,0.2148425579071045,0.0
218,11,Decision Tree,0,0.1,0.875,0.7722197981873515,0.0021643638610839844,0.7722197981873515
219,11,RandomForest,0,0.1,0.875,0.8964408684636348,0.6545231342315674,0.0
220,11,AdaBoost (Discrete),0,0.1,0.8166666666666667,0.7414480027335842,38.548553705215454,0.7414480027335842
221,11,AdaBoost (Real),0,0.1,0.75,0.8266849803046352,44.49352550506592,0.0
222,11,Logistic Regression (Penalty = L2),0,0.1,0.975,0.9696654978825953,0.10936665534973145,0.9696654978825953
223,11,Naive Bayes,0,0.1,0.9166666666666666,0.8981727690217912,0.10901641845703125,0.8981727690217912
224,11,KNeighbors Classifier,1,0.1,0.95,0.9416721128364367,0.10945510864257812,0.9416721128364367
225,11,SVC Classifier,1,0.1,0.7,0.7022798316312892,0.21086525917053223,0.0
226,11,Decision Tree,1,0.1,0.8583333333333333,0.8611905152490237,0.001252889633178711,0.8611905152490237
227,11,RandomForest,1,0.1,0.8,0.49407314508800204,0.7537767887115479,0.49407314508800204
228,11,AdaBoost (Discrete),1,0.1,0.325,1.0,39.440314292907715,0.0
229,11,AdaBoost (Real),1,0.1,0.8333333333333334,0.9748970527428702,43.955113649368286,0.0
230,11,Logistic Regression (Penalty = L2),1,0.1,0.9333333333333333,0.923485670457099,0.21764898300170898,0.923485670457099
231,11,Naive Bayes,1,0.1,0.8083333333333333,0.7038851425101664,0.11338567733764648,0.7038851425101664
232,11,KNeighbors Classifier,2,0.1,0.9491525423728814,0.9429863870292697,0.10945677757263184,0.9429863870292697
233,11,SVC Classifier,2,0.1,0.6949152542372882,0.5946035575013605,0.21937012672424316,0.0
234,11,Decision Tree,2,0.1,0.940677966101695,0.9147629133293019,0.10994529724121094,0.9147629133293019
235,11,RandomForest,2,0.1,0.923728813559322,0.9593225958126531,0.6906075477600098,0.0
236,11,AdaBoost (Discrete),2,0.1,0.9491525423728814,0.9429863870292697,41.081467628479004,0.9429863870292697
237,11,AdaBoost (Real),2,0.1,0.864406779661017,1.0,46.84284448623657,0.0
238,11,Logistic Regression (Penalty = L2),2,0.1,0.9491525423728814,0.9429863870292697,0.10979342460632324,0.9429863870292697
239,11,Naive Bayes,2,0.1,0.8305084745762712,0.6004684775880014,0.1078023910522461,0.6004684775880014
