,feat_set_id,classifier,fold_id,feat_th,score,geo_score,exec_t,geo_score_woz
0,0,KNeighbors Classifier,0,0.1,0.8671641791044776,0.8661857363726453,0.19707894325256348,0.8661857363726453
1,0,SVC Classifier,0,0.1,0.7194029850746269,0.6580032232001123,0.8908860683441162,0.6580032232001123
2,0,Decision Tree,0,0.1,0.7582089552238805,0.7556282500691527,0.030714035034179688,0.7556282500691527
3,0,RandomForest,0,0.1,0.5850746268656717,0.5760689110625641,0.19872689247131348,0.0
4,0,AdaBoost (Discrete),0,0.1,0.8029850746268656,0.7984291184012974,21.498204946517944,0.7984291184012974
5,0,AdaBoost (Real),0,0.1,0.4716417910447761,0.32710815907740326,26.873618841171265,0.32710815907740326
6,0,Logistic Regression (Penalty = L2),0,0.1,0.8671641791044776,0.8647904007688587,0.6569304466247559,0.8647904007688587
7,0,Naive Bayes,0,0.1,0.7582089552238805,0.7513409241478314,0.12226247787475586,0.7513409241478314
8,0,KNeighbors Classifier,1,0.1,0.8686567164179104,0.8668190851879319,0.33251523971557617,0.8668190851879319
9,0,SVC Classifier,1,0.1,0.7253731343283583,0.6584434103748802,0.8656439781188965,0.6584434103748802
10,0,Decision Tree,1,0.1,0.7611940298507462,0.7577936754915724,0.028415203094482422,0.7577936754915724
11,0,RandomForest,1,0.1,0.5880597014925373,0.37384140315098613,0.1928880214691162,0.37384140315098613
12,0,AdaBoost (Discrete),1,0.1,0.8462686567164179,0.844331704020711,21.33069348335266,0.844331704020711
13,0,AdaBoost (Real),1,0.1,0.6313432835820896,0.6112090904824163,26.527037143707275,0.6112090904824163
14,0,Logistic Regression (Penalty = L2),1,0.1,0.8731343283582089,0.8708391109656739,0.6167011260986328,0.8708391109656739
15,0,Naive Bayes,1,0.1,0.746268656716418,0.733334756908019,0.05866694450378418,0.733334756908019
16,0,KNeighbors Classifier,2,0.1,0.8621212121212121,0.8601428713090467,0.2581455707550049,0.8601428713090467
17,0,SVC Classifier,2,0.1,0.7272727272727273,0.6434250190274374,0.8879473209381104,0.6434250190274374
18,0,Decision Tree,2,0.1,0.7545454545454545,0.75278175972857,0.028513193130493164,0.75278175972857
19,0,RandomForest,2,0.1,0.5924242424242424,0.7304630889088782,0.2235395908355713,0.0
20,0,AdaBoost (Discrete),2,0.1,0.8227272727272728,0.8183485442912412,21.38554096221924,0.8183485442912412
21,0,AdaBoost (Real),2,0.1,0.37424242424242427,0.283484650031527,27.271020889282227,0.0
22,0,Logistic Regression (Penalty = L2),2,0.1,0.8878787878787879,0.8861770555053933,0.5988960266113281,0.8861770555053933
23,0,Naive Bayes,2,0.1,0.7818181818181819,0.7735432648937318,0.05023002624511719,0.7735432648937318
24,1,KNeighbors Classifier,0,0.1,0.8029850746268656,0.7929671274423419,0.252565860748291,0.7929671274423419
25,1,SVC Classifier,0,0.1,0.6388059701492538,0.5739520119642485,0.9724102020263672,0.5739520119642485
26,1,Decision Tree,0,0.1,0.7223880597014926,0.7127430887424105,0.03071427345275879,0.7127430887424105
27,1,RandomForest,0,0.1,0.5582089552238806,0.47206544550833424,0.27315211296081543,0.0
28,1,AdaBoost (Discrete),0,0.1,0.7791044776119403,0.7652189185998068,31.037148237228394,0.7652189185998068
29,1,AdaBoost (Real),0,0.1,0.682089552238806,0.6451410153811787,35.27082633972168,0.6451410153811787
30,1,Logistic Regression (Penalty = L2),0,0.1,0.8895522388059701,0.8832426677797958,0.5927021503448486,0.8832426677797958
31,1,Naive Bayes,0,0.1,0.6985074626865672,0.6650845711428851,0.057514190673828125,0.6650845711428851
32,1,KNeighbors Classifier,1,0.1,0.808955223880597,0.801733476596702,0.25261759757995605,0.801733476596702
33,1,SVC Classifier,1,0.1,0.6402985074626866,0.575516890893926,1.0362462997436523,0.575516890893926
34,1,Decision Tree,1,0.1,0.682089552238806,0.675656180411322,0.030198097229003906,0.675656180411322
35,1,RandomForest,1,0.1,0.5208955223880597,0.587354170403942,0.2517528533935547,0.0
36,1,AdaBoost (Discrete),1,0.1,0.7716417910447761,0.7579406121384563,31.304787397384644,0.7579406121384563
37,1,AdaBoost (Real),1,0.1,0.5597014925373134,0.5203598494239918,35.27902054786682,0.5203598494239918
38,1,Logistic Regression (Penalty = L2),1,0.1,0.8611940298507462,0.8558706941741246,0.6184554100036621,0.8558706941741246
39,1,Naive Bayes,1,0.1,0.7194029850746269,0.7096667926757194,0.08965706825256348,0.7096667926757194
40,1,KNeighbors Classifier,2,0.1,0.7878787878787878,0.782282165118094,0.21682405471801758,0.782282165118094
41,1,SVC Classifier,2,0.1,0.6409090909090909,0.5729904631133461,1.012829065322876,0.5729904631133461
42,1,Decision Tree,2,0.1,0.6621212121212121,0.6530718968100385,0.05668830871582031,0.6530718968100385
43,1,RandomForest,2,0.1,0.5621212121212121,0.4548426275619445,0.2524688243865967,0.0
44,1,AdaBoost (Discrete),2,0.1,0.7575757575757576,0.7470890124116495,31.43812608718872,0.7470890124116495
45,1,AdaBoost (Real),2,0.1,0.6696969696969697,0.6382229088865801,32.25309133529663,0.6382229088865801
46,1,Logistic Regression (Penalty = L2),2,0.1,0.8833333333333333,0.8806015423379919,0.5436029434204102,0.8806015423379919
47,1,Naive Bayes,2,0.1,0.6863636363636364,0.6685530564722654,0.05485081672668457,0.6685530564722654
48,2,KNeighbors Classifier,0,0.1,0.935820895522388,0.9322846465686037,0.3652350902557373,0.9322846465686037
49,2,SVC Classifier,0,0.1,0.7955223880597015,0.765599183953296,0.7641627788543701,0.765599183953296
50,2,Decision Tree,0,0.1,0.8029850746268656,0.7923324192312761,0.021712779998779297,0.7923324192312761
51,2,RandomForest,0,0.1,0.6,0.5102255913867562,0.19020724296569824,0.0
52,2,AdaBoost (Discrete),0,0.1,0.8895522388059701,0.8840510541230336,26.109834909439087,0.8840510541230336
53,2,AdaBoost (Real),0,0.1,0.34776119402985073,0.24531678677733745,30.93540906906128,0.0
54,2,Logistic Regression (Penalty = L2),0,0.1,0.9388059701492537,0.9378022210466379,0.5003490447998047,0.9378022210466379
55,2,Naive Bayes,0,0.1,0.8865671641791045,0.8815995565042666,0.11087322235107422,0.8815995565042666
56,2,KNeighbors Classifier,1,0.1,0.9238805970149254,0.9205571757183801,0.3825807571411133,0.9205571757183801
57,2,SVC Classifier,1,0.1,0.7970149253731343,0.7726183978304713,0.8859219551086426,0.7726183978304713
58,2,Decision Tree,1,0.1,0.8059701492537313,0.7986939589339479,0.054778337478637695,0.7986939589339479
59,2,RandomForest,1,0.1,0.5432835820895522,0.44162639555003963,0.1951134204864502,0.0
60,2,AdaBoost (Discrete),1,0.1,0.8805970149253731,0.8766602068740355,27.813335180282593,0.8766602068740355
61,2,AdaBoost (Real),1,0.1,0.4761194029850746,0.39867146445632506,29.631621599197388,0.0
62,2,Logistic Regression (Penalty = L2),1,0.1,0.9343283582089552,0.9330181546176061,0.4783923625946045,0.9330181546176061
63,2,Naive Bayes,1,0.1,0.8776119402985074,0.8736863561913771,0.05900454521179199,0.8736863561913771
64,2,KNeighbors Classifier,2,0.1,0.9287878787878788,0.9264766264952878,0.3093407154083252,0.9264766264952878
65,2,SVC Classifier,2,0.1,0.7909090909090909,0.767474610908131,0.979722261428833,0.767474610908131
66,2,Decision Tree,2,0.1,0.7696969696969697,0.7617674694204176,0.05536007881164551,0.7617674694204176
67,2,RandomForest,2,0.1,0.556060606060606,0.7407303084366428,0.22625160217285156,0.0
68,2,AdaBoost (Discrete),2,0.1,0.8909090909090909,0.8895236501999579,25.003955125808716,0.8895236501999579
69,2,AdaBoost (Real),2,0.1,0.6530303030303031,0.6111312604222555,27.165961027145386,0.6111312604222555
70,2,Logistic Regression (Penalty = L2),2,0.1,0.9227272727272727,0.9205163962794511,0.4428071975708008,0.9205163962794511
71,2,Naive Bayes,2,0.1,0.8984848484848484,0.8953603070283481,0.062345027923583984,0.8953603070283481
72,3,KNeighbors Classifier,0,0.1,0.9014925373134328,0.8986673846171837,0.28789782524108887,0.8986673846171837
73,3,SVC Classifier,0,0.1,0.7029850746268657,0.6547494106830634,0.8491146564483643,0.6547494106830634
74,3,Decision Tree,0,0.1,0.7567164179104477,0.749546072424465,0.02640843391418457,0.749546072424465
75,3,RandomForest,0,0.1,0.6522388059701493,0.6905565313521232,0.2139270305633545,0.0
76,3,AdaBoost (Discrete),0,0.1,0.835820895522388,0.8301242321729383,25.730797052383423,0.8301242321729383
77,3,AdaBoost (Real),0,0.1,0.7895522388059701,0.7847666735964571,29.020334005355835,0.7847666735964571
78,3,Logistic Regression (Penalty = L2),0,0.1,0.9447761194029851,0.9437681033076979,0.42624473571777344,0.9437681033076979
79,3,Naive Bayes,0,0.1,0.7716417910447761,0.7577409796996217,0.08413910865783691,0.7577409796996217
80,3,KNeighbors Classifier,1,0.1,0.8791044776119403,0.8774922214810994,0.40254759788513184,0.8774922214810994
81,3,SVC Classifier,1,0.1,0.7179104477611941,0.6746348329980677,0.9105172157287598,0.6746348329980677
82,3,Decision Tree,1,0.1,0.7044776119402985,0.6870300022197626,0.04646611213684082,0.6870300022197626
83,3,RandomForest,1,0.1,0.5895522388059702,0.5682626070269655,0.2157132625579834,0.0
84,3,AdaBoost (Discrete),1,0.1,0.8328358208955224,0.8288919465182603,25.906702518463135,0.8288919465182603
85,3,AdaBoost (Real),1,0.1,0.5029850746268657,0.4829718079240602,32.579286098480225,0.0
86,3,Logistic Regression (Penalty = L2),1,0.1,0.9373134328358209,0.9368704082180136,0.5111367702484131,0.9368704082180136
87,3,Naive Bayes,1,0.1,0.7985074626865671,0.7913204031639588,0.08283019065856934,0.7913204031639588
88,3,KNeighbors Classifier,2,0.1,0.8939393939393939,0.8889140484072895,0.37271642684936523,0.8889140484072895
89,3,SVC Classifier,2,0.1,0.7166666666666667,0.638699725580931,0.8822906017303467,0.638699725580931
90,3,Decision Tree,2,0.1,0.7196969696969697,0.7148147582023465,0.05528116226196289,0.7148147582023465
91,3,RandomForest,2,0.1,0.6393939393939394,0.6664529246188569,0.21408557891845703,0.0
92,3,AdaBoost (Discrete),2,0.1,0.8454545454545455,0.8421960896334676,27.142744541168213,0.8421960896334676
93,3,AdaBoost (Real),2,0.1,0.7696969696969697,0.763779450906796,31.762877941131592,0.763779450906796
94,3,Logistic Regression (Penalty = L2),2,0.1,0.946969696969697,0.9465058161623177,0.5372376441955566,0.9465058161623177
95,3,Naive Bayes,2,0.1,0.7954545454545454,0.7809823255437247,0.061682939529418945,0.7809823255437247
96,5,KNeighbors Classifier,0,0.1,0.2716417910447761,0.22073775260122933,0.05166363716125488,0.22073775260122933
97,5,SVC Classifier,0,0.1,0.3402985074626866,0.4880514044581213,0.42847371101379395,0.0
98,5,Decision Tree,0,0.1,0.24925373134328357,0.19679905727744462,0.02391982078552246,0.19679905727744462
99,5,RandomForest,0,0.1,0.3208955223880597,0.5526964203992065,0.16939902305603027,0.0
100,5,AdaBoost (Discrete),0,0.1,0.3074626865671642,0.18442584699827552,11.223931312561035,0.18442584699827552
101,5,AdaBoost (Real),0,0.1,0.25671641791044775,0.2383469567390399,16.69449758529663,0.0
102,5,Logistic Regression (Penalty = L2),0,0.1,0.3373134328358209,0.22394779233590573,0.1040804386138916,0.22394779233590573
103,5,Naive Bayes,0,0.1,0.3537313432835821,0.3140005941368877,0.048355817794799805,0.0
104,5,KNeighbors Classifier,1,0.1,0.29402985074626864,0.23747851272494225,0.06348800659179688,0.23747851272494225
105,5,SVC Classifier,1,0.1,0.3776119402985075,0.5003429426911844,0.48030734062194824,0.0
106,5,Decision Tree,1,0.1,0.27761194029850744,0.23195462093503527,0.018770933151245117,0.23195462093503527
107,5,RandomForest,1,0.1,0.30895522388059704,0.747936134246094,0.15286970138549805,0.0
108,5,AdaBoost (Discrete),1,0.1,0.29253731343283584,0.200338546644643,11.068413972854614,0.200338546644643
109,5,AdaBoost (Real),1,0.1,0.2835820895522388,0.29094861090950913,16.638485193252563,0.0
110,5,Logistic Regression (Penalty = L2),1,0.1,0.34776119402985073,0.23633691878263235,0.11887693405151367,0.23633691878263235
111,5,Naive Bayes,1,0.1,0.38656716417910447,0.3513509557113114,0.03291726112365723,0.0
112,5,KNeighbors Classifier,2,0.1,0.27575757575757576,0.21761400723678154,0.06711053848266602,0.21761400723678154
113,5,SVC Classifier,2,0.1,0.3393939393939394,0.3548376649447609,0.48004674911499023,0.0
114,5,Decision Tree,2,0.1,0.2772727272727273,0.24114041788317042,0.0025568008422851562,0.24114041788317042
115,5,RandomForest,2,0.1,0.3181818181818182,0.35354495339094005,0.1658790111541748,0.0
116,5,AdaBoost (Discrete),2,0.1,0.3015151515151515,0.2408324958525504,11.29122018814087,0.2408324958525504
117,5,AdaBoost (Real),2,0.1,0.14393939393939395,0.12175954076631607,16.794503450393677,0.0
118,5,Logistic Regression (Penalty = L2),2,0.1,0.34545454545454546,0.2323172785247585,0.11052656173706055,0.2323172785247585
119,5,Naive Bayes,2,0.1,0.3696969696969697,0.4462222761229299,0.05006551742553711,0.0
120,6,KNeighbors Classifier,0,0.1,0.18955223880597014,0.17710381348153956,0.03415656089782715,0.0
121,6,SVC Classifier,0,0.1,0.2626865671641791,0.40358768102490644,0.44732165336608887,0.0
122,6,Decision Tree,0,0.1,0.2835820895522388,0.21677937753174495,0.00252532958984375,0.0
123,6,RandomForest,0,0.1,0.29253731343283584,0.37083377366465003,0.1979842185974121,0.0
124,6,AdaBoost (Discrete),0,0.1,0.2746268656716418,0.19874676438611105,10.302476167678833,0.19874676438611105
125,6,AdaBoost (Real),0,0.1,0.2746268656716418,0.2272058684448572,16.54418110847473,0.0
126,6,Logistic Regression (Penalty = L2),0,0.1,0.2656716417910448,0.1712999611154294,0.11840248107910156,0.0
127,6,Naive Bayes,0,0.1,0.26865671641791045,0.3970534230074568,0.046237945556640625,0.0
128,6,KNeighbors Classifier,1,0.1,0.22686567164179106,0.21590755128419492,0.06985259056091309,0.0
129,6,SVC Classifier,1,0.1,0.22686567164179106,0.19345494622113016,0.5067527294158936,0.0
130,6,Decision Tree,1,0.1,0.3074626865671642,0.25168654764159254,0.022680282592773438,0.0
131,6,RandomForest,1,0.1,0.282089552238806,0.3802614098514027,0.1457066535949707,0.0
132,6,AdaBoost (Discrete),1,0.1,0.2880597014925373,0.26675605411253794,10.35920763015747,0.0
133,6,AdaBoost (Real),1,0.1,0.27313432835820894,0.2336530902353967,16.80817151069641,0.0
134,6,Logistic Regression (Penalty = L2),1,0.1,0.23432835820895523,0.17264432390614287,0.08387875556945801,0.0
135,6,Naive Bayes,1,0.1,0.25671641791044775,0.36115435447971445,0.02651071548461914,0.0
136,6,KNeighbors Classifier,2,0.1,0.20454545454545456,0.18743073479768035,0.044036149978637695,0.0
137,6,SVC Classifier,2,0.1,0.22272727272727272,0.22462649849761965,0.461871862411499,0.0
138,6,Decision Tree,2,0.1,0.29848484848484846,0.26827393382252346,0.02203059196472168,0.0
139,6,RandomForest,2,0.1,0.2545454545454545,0.6276459144608478,0.16849136352539062,0.0
140,6,AdaBoost (Discrete),2,0.1,0.296969696969697,0.2114101928185395,10.594770908355713,0.2114101928185395
141,6,AdaBoost (Real),2,0.1,0.23030303030303031,0.3043188750616585,16.580642461776733,0.0
142,6,Logistic Regression (Penalty = L2),2,0.1,0.2409090909090909,0.20901902120633573,0.10247349739074707,0.0
143,6,Naive Bayes,2,0.1,0.2590909090909091,0.35003075893382635,0.05087590217590332,0.0
144,7,KNeighbors Classifier,0,0.1,0.44776119402985076,0.35382415463160527,0.06680107116699219,0.35382415463160527
145,7,SVC Classifier,0,0.1,0.3746268656716418,0.5643808626638307,0.514747142791748,0.0
146,7,Decision Tree,0,0.1,0.4253731343283582,0.35799031722867775,0.023795127868652344,0.35799031722867775
147,7,RandomForest,0,0.1,0.3,0.3940519676063004,0.1940596103668213,0.0
148,7,AdaBoost (Discrete),0,0.1,0.38656716417910447,0.3152562127445168,12.469130754470825,0.3152562127445168
149,7,AdaBoost (Real),0,0.1,0.29850746268656714,0.22303890034656887,18.077306270599365,0.22303890034656887
150,7,Logistic Regression (Penalty = L2),0,0.1,0.46567164179104475,0.24247188678016682,0.15353965759277344,0.24247188678016682
151,7,Naive Bayes,0,0.1,0.3850746268656716,0.306122079323589,0.026935100555419922,0.0
152,7,KNeighbors Classifier,1,0.1,0.4955223880597015,0.43089206514267164,0.04901599884033203,0.43089206514267164
153,7,SVC Classifier,1,0.1,0.3492537313432836,0.5305186409166557,0.549475908279419,0.0
154,7,Decision Tree,1,0.1,0.42388059701492536,0.3510823862736356,0.02448129653930664,0.3510823862736356
155,7,RandomForest,1,0.1,0.33134328358208953,0.49724312151742894,0.17116141319274902,0.0
156,7,AdaBoost (Discrete),1,0.1,0.40298507462686567,0.34019983224836436,12.589151859283447,0.34019983224836436
157,7,AdaBoost (Real),1,0.1,0.23283582089552238,0.2041792622434608,17.63053822517395,0.2041792622434608
158,7,Logistic Regression (Penalty = L2),1,0.1,0.4597014925373134,0.2656800390977218,0.11498641967773438,0.2656800390977218
159,7,Naive Bayes,1,0.1,0.373134328358209,0.1964824992056906,0.03948378562927246,0.1964824992056906
160,7,KNeighbors Classifier,2,0.1,0.44242424242424244,0.3520659667483326,0.03472781181335449,0.3520659667483326
161,7,SVC Classifier,2,0.1,0.33484848484848484,0.3750181691545582,0.45258164405822754,0.0
162,7,Decision Tree,2,0.1,0.4,0.33781590229113445,0.03673672676086426,0.33781590229113445
163,7,RandomForest,2,0.1,0.27575757575757576,0.11097788314809581,0.15149927139282227,0.0
164,7,AdaBoost (Discrete),2,0.1,0.3924242424242424,0.3319659127709889,10.50552749633789,0.3319659127709889
165,7,AdaBoost (Real),2,0.1,0.3,0.2167689910687826,15.591546297073364,0.2167689910687826
166,7,Logistic Regression (Penalty = L2),2,0.1,0.4621212121212121,0.2444862878322553,0.14290356636047363,0.2444862878322553
167,7,Naive Bayes,2,0.1,0.3606060606060606,0.15750278841667256,0.04163408279418945,0.15750278841667256
168,8,KNeighbors Classifier,0,0.1,0.6149253731343284,0.5790087002776113,0.07409000396728516,0.5790087002776113
169,8,SVC Classifier,0,0.1,0.40746268656716417,0.264013288345877,0.5964012145996094,0.264013288345877
170,8,Decision Tree,0,0.1,0.5417910447761194,0.5204970344388418,0.024567127227783203,0.5204970344388418
171,8,RandomForest,0,0.1,0.4298507462686567,0.33380790522526593,0.19782042503356934,0.0
172,8,AdaBoost (Discrete),0,0.1,0.5611940298507463,0.5296440748472363,16.16169261932373,0.5296440748472363
173,8,AdaBoost (Real),0,0.1,0.48507462686567165,0.41074477223964556,21.393116235733032,0.41074477223964556
174,8,Logistic Regression (Penalty = L2),0,0.1,0.7194029850746269,0.6742823210005278,0.2842285633087158,0.6742823210005278
175,8,Naive Bayes,0,0.1,0.49701492537313435,0.4163152797708058,0.05972766876220703,0.4163152797708058
176,8,KNeighbors Classifier,1,0.1,0.6194029850746269,0.594850779438737,0.06926727294921875,0.594850779438737
177,8,SVC Classifier,1,0.1,0.44328358208955226,0.3632577295662491,0.6260480880737305,0.3632577295662491
178,8,Decision Tree,1,0.1,0.5149253731343284,0.49224717885497776,0.04578423500061035,0.49224717885497776
179,8,RandomForest,1,0.1,0.48656716417910445,0.556807978173185,0.24588632583618164,0.0
180,8,AdaBoost (Discrete),1,0.1,0.5447761194029851,0.5094734644156829,15.987706184387207,0.5094734644156829
181,8,AdaBoost (Real),1,0.1,0.48955223880597015,0.3714209889347895,20.565216779708862,0.3714209889347895
182,8,Logistic Regression (Penalty = L2),1,0.1,0.6970149253731344,0.6657120623297584,0.22076177597045898,0.6657120623297584
183,8,Naive Bayes,1,0.1,0.48955223880597015,0.45202529919080686,0.05183148384094238,0.45202529919080686
184,8,KNeighbors Classifier,2,0.1,0.6060606060606061,0.5765045433934913,0.07448697090148926,0.5765045433934913
185,8,SVC Classifier,2,0.1,0.41515151515151516,0.34012497455182383,0.5395781993865967,0.34012497455182383
186,8,Decision Tree,2,0.1,0.5363636363636364,0.5155029348233308,0.021867752075195312,0.5155029348233308
187,8,RandomForest,2,0.1,0.47575757575757577,0.539314665824969,0.14072084426879883,0.0
188,8,AdaBoost (Discrete),2,0.1,0.5424242424242425,0.5005875959410494,13.39929986000061,0.5005875959410494
189,8,AdaBoost (Real),2,0.1,0.43787878787878787,0.32080338403769953,18.351474285125732,0.32080338403769953
190,8,Logistic Regression (Penalty = L2),2,0.1,0.7,0.6642507494919402,0.21092915534973145,0.6642507494919402
191,8,Naive Bayes,2,0.1,0.4803030303030303,0.4186161919992062,0.022605419158935547,0.4186161919992062
192,9,KNeighbors Classifier,0,0.1,0.3074626865671642,0.25116548951449663,0.051142215728759766,0.25116548951449663
193,9,SVC Classifier,0,0.1,0.37910447761194027,0.497764286217388,0.42299866676330566,0.0
194,9,Decision Tree,0,0.1,0.28955223880597014,0.2549893782732727,0.019707202911376953,0.2549893782732727
195,9,RandomForest,0,0.1,0.2865671641791045,0.49491631713810225,0.17269444465637207,0.0
196,9,AdaBoost (Discrete),0,0.1,0.31343283582089554,0.21552417869445425,10.797555446624756,0.21552417869445425
197,9,AdaBoost (Real),0,0.1,0.30895522388059704,0.26574441332162224,14.59634804725647,0.0
198,9,Logistic Regression (Penalty = L2),0,0.1,0.31791044776119404,0.18138559843047364,0.10097765922546387,0.18138559843047364
199,9,Naive Bayes,0,0.1,0.39552238805970147,0.2963657908636315,0.044870853424072266,0.0
200,9,KNeighbors Classifier,1,0.1,0.32238805970149254,0.24492846312188568,0.04782295227050781,0.24492846312188568
201,9,SVC Classifier,1,0.1,0.3597014925373134,0.3998655900307991,0.5334422588348389,0.0
202,9,Decision Tree,1,0.1,0.31492537313432833,0.27045961001830426,0.024848222732543945,0.27045961001830426
203,9,RandomForest,1,0.1,0.3074626865671642,0.30039461937916856,0.19060087203979492,0.0
204,9,AdaBoost (Discrete),1,0.1,0.3402985074626866,0.2595098043421813,11.282780170440674,0.2595098043421813
205,9,AdaBoost (Real),1,0.1,0.30149253731343284,0.19308984126577225,14.715615034103394,0.19308984126577225
206,9,Logistic Regression (Penalty = L2),1,0.1,0.3701492537313433,0.24484614113089959,0.062174081802368164,0.24484614113089959
207,9,Naive Bayes,1,0.1,0.3970149253731343,0.2145413307338286,0.03876209259033203,0.2145413307338286
208,9,KNeighbors Classifier,2,0.1,0.33636363636363636,0.2604016348409369,0.021254301071166992,0.2604016348409369
209,9,SVC Classifier,2,0.1,0.35454545454545455,0.420980530695862,0.4219348430633545,0.0
210,9,Decision Tree,2,0.1,0.3015151515151515,0.26988398092099714,0.019771337509155273,0.26988398092099714
211,9,RandomForest,2,0.1,0.34393939393939393,0.3159157823174683,0.1344468593597412,0.0
212,9,AdaBoost (Discrete),2,0.1,0.29393939393939394,0.20228313950878876,9.698593854904175,0.20228313950878876
213,9,AdaBoost (Real),2,0.1,0.28484848484848485,0.17533283664717736,14.889416933059692,0.17533283664717736
214,9,Logistic Regression (Penalty = L2),2,0.1,0.3393939393939394,0.23586713799510964,0.10144281387329102,0.23586713799510964
215,9,Naive Bayes,2,0.1,0.36515151515151517,0.3321507502896384,0.006429910659790039,0.0
216,10,KNeighbors Classifier,0,0.1,0.7940298507462686,0.7784289533869381,0.12352347373962402,0.7784289533869381
217,10,SVC Classifier,0,0.1,0.6059701492537314,0.4402258307587741,0.5808255672454834,0.4402258307587741
218,10,Decision Tree,0,0.1,0.6582089552238806,0.6344406139439135,0.026561737060546875,0.6344406139439135
219,10,RandomForest,0,0.1,0.5477611940298508,0.5683406209989219,0.16553235054016113,0.0
220,10,AdaBoost (Discrete),0,0.1,0.7298507462686568,0.7103009636452826,17.583888053894043,0.7103009636452826
221,10,AdaBoost (Real),0,0.1,0.5208955223880597,0.47158682012364816,21.700308322906494,0.47158682012364816
222,10,Logistic Regression (Penalty = L2),0,0.1,0.8283582089552238,0.8127628619816689,0.2995588779449463,0.8127628619816689
223,10,Naive Bayes,0,0.1,0.7029850746268657,0.6631325367687118,0.052945613861083984,0.6631325367687118
224,10,KNeighbors Classifier,1,0.1,0.7835820895522388,0.7698430096775396,0.15629076957702637,0.7698430096775396
225,10,SVC Classifier,1,0.1,0.6,0.4606037894843092,0.655026912689209,0.4606037894843092
226,10,Decision Tree,1,0.1,0.6805970149253732,0.6525318252297889,0.04971051216125488,0.6525318252297889
227,10,RandomForest,1,0.1,0.5388059701492537,0.4889408061681481,0.17386412620544434,0.0
228,10,AdaBoost (Discrete),1,0.1,0.7417910447761195,0.7194159368037876,18.350632429122925,0.7194159368037876
229,10,AdaBoost (Real),1,0.1,0.4791044776119403,0.2804460222145513,20.92963409423828,0.2804460222145513
230,10,Logistic Regression (Penalty = L2),1,0.1,0.8313432835820895,0.8165933630551866,0.32026219367980957,0.8165933630551866
231,10,Naive Bayes,1,0.1,0.7134328358208956,0.6848842534124231,0.06938648223876953,0.6848842534124231
232,10,KNeighbors Classifier,2,0.1,0.7924242424242425,0.7773192210166086,0.12427115440368652,0.7773192210166086
233,10,SVC Classifier,2,0.1,0.5909090909090909,0.4121297349961201,0.6215953826904297,0.4121297349961201
234,10,Decision Tree,2,0.1,0.6439393939393939,0.6197024598022157,0.03911161422729492,0.6197024598022157
235,10,RandomForest,2,0.1,0.5151515151515151,0.28791711531544445,0.20804166793823242,0.0
236,10,AdaBoost (Discrete),2,0.1,0.7454545454545455,0.7305438209921354,19.608657360076904,0.7305438209921354
237,10,AdaBoost (Real),2,0.1,0.5848484848484848,0.5256672588637343,23.264051914215088,0.5256672588637343
238,10,Logistic Regression (Penalty = L2),2,0.1,0.8424242424242424,0.8254744833252424,0.33583736419677734,0.8254744833252424
239,10,Naive Bayes,2,0.1,0.703030303030303,0.6735740273962032,0.05134320259094238,0.6735740273962032
240,11,KNeighbors Classifier,0,0.1,0.9522388059701492,0.9510498220277667,1.0182669162750244,0.9510498220277667
241,11,SVC Classifier,0,0.1,0.8895522388059701,0.8837207607918963,1.3267364501953125,0.8837207607918963
242,11,Decision Tree,0,0.1,0.8462686567164179,0.8437195167789574,0.058502197265625,0.8437195167789574
243,11,RandomForest,0,0.1,0.6656716417910448,0.6884241647298585,0.19327712059020996,0.0
244,11,AdaBoost (Discrete),0,0.1,0.9373134328358209,0.9360302009188312,47.45547127723694,0.9360302009188312
245,11,AdaBoost (Real),0,0.1,0.5044776119402985,0.38043965556756393,47.66529989242554,0.0
246,11,Logistic Regression (Penalty = L2),0,0.1,0.9701492537313433,0.9697795842285598,1.0856714248657227,0.9697795842285598
247,11,Naive Bayes,0,0.1,0.8940298507462686,0.8905244485511179,0.12185978889465332,0.8905244485511179
248,11,KNeighbors Classifier,1,0.1,0.9492537313432836,0.9481573532306455,1.0467174053192139,0.9481573532306455
249,11,SVC Classifier,1,0.1,0.9044776119402985,0.9013240610739829,1.4320416450500488,0.9013240610739829
250,11,Decision Tree,1,0.1,0.8343283582089552,0.8299925123398529,0.06790351867675781,0.8299925123398529
251,11,RandomForest,1,0.1,0.5761194029850746,0.3664159965407698,0.2666599750518799,0.3664159965407698
252,11,AdaBoost (Discrete),1,0.1,0.9283582089552239,0.927557928372921,48.75782322883606,0.927557928372921
253,11,AdaBoost (Real),1,0.1,0.4164179104477612,0.3476301467635487,47.81740093231201,0.0
254,11,Logistic Regression (Penalty = L2),1,0.1,0.9641791044776119,0.9638951706757626,1.023160696029663,0.9638951706757626
255,11,Naive Bayes,1,0.1,0.9059701492537313,0.9052584921688831,0.07415413856506348,0.9052584921688831
256,11,KNeighbors Classifier,2,0.1,0.953030303030303,0.9523898826006787,1.119236707687378,0.9523898826006787
257,11,SVC Classifier,2,0.1,0.9,0.8970193392541058,1.3529682159423828,0.8970193392541058
258,11,Decision Tree,2,0.1,0.8181818181818182,0.8159009518490756,0.05951189994812012,0.8159009518490756
259,11,RandomForest,2,0.1,0.7,0.5929756311433716,0.2202310562133789,0.5929756311433716
260,11,AdaBoost (Discrete),2,0.1,0.9272727272727272,0.9261929338465497,47.873581886291504,0.9261929338465497
261,11,AdaBoost (Real),2,0.1,0.706060606060606,0.6631302704938701,45.30490732192993,0.6631302704938701
262,11,Logistic Regression (Penalty = L2),2,0.1,0.9818181818181818,0.9816584622039267,0.9846904277801514,0.9816584622039267
263,11,Naive Bayes,2,0.1,0.896969696969697,0.8951521881910334,0.1008448600769043,0.8951521881910334
