,feat_set_id,classifier,fold_id,feat_th,score,geo_score,exec_t,geo_score_woz
0,0,KNeighbors Classifier,0,0.7,0.792156862745098,0.6765364416301051,0.2877039909362793,0.0
1,0,SVC Classifier,0,0.7,0.7607843137254902,1.0,0.3117678165435791,0.0
2,0,Decision Tree,0,0.7,0.7647058823529411,0.7320237101796069,0.08313727378845215,0.0
3,0,RandomForest,0,0.7,0.7607843137254902,1.0,0.48708152770996094,0.0
4,0,AdaBoost (Discrete),0,0.7,0.7019607843137254,0.4446088997958548,33.591630697250366,0.0
5,0,AdaBoost (Real),0,0.7,0.6392156862745098,0.7061245260146154,48.68169856071472,0.0
6,0,Logistic Regression (Penalty = L2),0,0.7,0.7411764705882353,0.32441730366232524,0.5521488189697266,0.0
7,0,Naive Bayes,0,0.7,0.10980392156862745,0.31419291226453727,0.16417241096496582,0.0
8,0,KNeighbors Classifier,1,0.7,0.804,0.7375840810717964,0.08399128913879395,0.0
9,0,SVC Classifier,1,0.7,0.776,1.0,0.16355013847351074,0.0
10,0,Decision Tree,1,0.7,0.744,0.7967513840625234,0.0018341541290283203,0.0
11,0,RandomForest,1,0.7,0.788,0.7745966692414834,0.307863712310791,0.0
12,0,AdaBoost (Discrete),1,0.7,0.78,0.5425614550805287,26.045711994171143,0.0
13,0,AdaBoost (Real),1,0.7,0.78,0.7705935588815227,35.366534948349,0.0
14,0,Logistic Regression (Penalty = L2),1,0.7,0.804,0.39738847850165865,0.35224103927612305,0.0
15,0,Naive Bayes,1,0.7,0.08,0.45986329782677027,0.13362383842468262,0.0
16,0,KNeighbors Classifier,2,0.7,0.8148148148148148,0.6958952284471353,0.2062366008758545,0.0
17,0,SVC Classifier,2,0.7,0.7983539094650206,1.0,0.21199750900268555,0.0
18,0,Decision Tree,2,0.7,0.7448559670781894,0.7227939723674013,0.0659341812133789,0.0
19,0,RandomForest,2,0.7,0.7901234567901234,0.6997790520224827,0.3634979724884033,0.0
20,0,AdaBoost (Discrete),2,0.7,0.5802469135802469,0.6434243313946734,29.4235622882843,0.0
21,0,AdaBoost (Real),2,0.7,0.5637860082304527,0.5226486283698583,40.850989818573,0.0
22,0,Logistic Regression (Penalty = L2),2,0.7,0.8024691358024691,0.5257335915396673,0.38832640647888184,0.0
23,0,Naive Bayes,2,0.7,0.09465020576131687,0.39123977741177407,0.16900253295898438,0.0
24,1,KNeighbors Classifier,0,0.7,0.8196078431372549,0.6499538250108549,0.18793773651123047,0.0
25,1,SVC Classifier,0,0.7,0.7607843137254902,1.0,0.1937110424041748,0.0
26,1,Decision Tree,0,0.7,0.807843137254902,0.8789076407513011,0.0017817020416259766,0.0
27,1,RandomForest,0,0.7,0.7607843137254902,1.0,0.42168521881103516,0.0
28,1,AdaBoost (Discrete),0,0.7,0.6823529411764706,0.49252815761255914,32.16458582878113,0.0
29,1,AdaBoost (Real),0,0.7,0.6509803921568628,0.5120573534568842,44.1739559173584,0.0
30,1,Logistic Regression (Penalty = L2),0,0.7,0.7725490196078432,0.28514649594268227,0.4416470527648926,0.0
31,1,Naive Bayes,0,0.7,0.10588235294117647,0.3214563589573323,0.20628070831298828,0.0
32,1,KNeighbors Classifier,1,0.7,0.76,0.7554757038530746,0.2681548595428467,0.0
33,1,SVC Classifier,1,0.7,0.776,1.0,0.24500274658203125,0.0
34,1,Decision Tree,1,0.7,0.76,0.932404371529582,0.0017278194427490234,0.0
35,1,RandomForest,1,0.7,0.776,1.0,0.4812788963317871,0.0
36,1,AdaBoost (Discrete),1,0.7,0.748,0.5314418973342356,35.18931031227112,0.0
37,1,AdaBoost (Real),1,0.7,0.664,0.4834772395810222,55.138871908187866,0.0
38,1,Logistic Regression (Penalty = L2),1,0.7,0.796,0.4723159616352968,0.6264638900756836,0.0
39,1,Naive Bayes,1,0.7,0.092,0.31544796096128963,0.2127211093902588,0.0
40,1,KNeighbors Classifier,2,0.7,0.8148148148148148,0.6139669738544413,0.41578030586242676,0.0
41,1,SVC Classifier,2,0.7,0.7983539094650206,1.0,0.3126537799835205,0.0
42,1,Decision Tree,2,0.7,0.823045267489712,0.9117903629454556,0.10269331932067871,0.0
43,1,RandomForest,2,0.7,0.7983539094650206,1.0,0.8212845325469971,0.0
44,1,AdaBoost (Discrete),2,0.7,0.6707818930041153,0.5365432745353016,39.39079308509827,0.0
45,1,AdaBoost (Real),2,0.7,0.6049382716049383,0.5490120149313374,53.416247606277466,0.0
46,1,Logistic Regression (Penalty = L2),2,0.7,0.7736625514403292,0.44525574272455803,0.5563368797302246,0.0
47,1,Naive Bayes,2,0.7,0.09876543209876543,0.4746746450380486,0.21171116828918457,0.0
48,2,KNeighbors Classifier,0,0.7,0.7843137254901961,0.5046851356558187,0.32216954231262207,0.0
49,2,SVC Classifier,0,0.7,0.7607843137254902,1.0,0.3070030212402344,0.0
50,2,Decision Tree,0,0.7,0.7450980392156863,0.6387891194979095,0.10618042945861816,0.0
51,2,RandomForest,0,0.7,0.7607843137254902,1.0,0.5165529251098633,0.0
52,2,AdaBoost (Discrete),0,0.7,0.7098039215686275,0.45851097124531076,38.17510533332825,0.0
53,2,AdaBoost (Real),0,0.7,0.6666666666666666,0.577647642591943,51.207334995269775,0.0
54,2,Logistic Regression (Penalty = L2),0,0.7,0.7568627450980392,0.3258232818371845,0.4839742183685303,0.0
55,2,Naive Bayes,0,0.7,0.08627450980392157,0.2779199351730994,0.20294570922851562,0.0
56,2,KNeighbors Classifier,1,0.7,0.816,0.500678109049936,0.3127720355987549,0.0
57,2,SVC Classifier,1,0.7,0.776,1.0,0.30640268325805664,0.0
58,2,Decision Tree,1,0.7,0.82,0.6737341343889284,0.10245704650878906,0.0
59,2,RandomForest,1,0.7,0.776,1.0,0.7346103191375732,0.0
60,2,AdaBoost (Discrete),1,0.7,0.728,0.43645827542247423,39.00496172904968,0.0
61,2,AdaBoost (Real),1,0.7,0.716,0.511009522561841,52.87880277633667,0.0
62,2,Logistic Regression (Penalty = L2),1,0.7,0.796,0.33110299872827026,0.5244450569152832,0.0
63,2,Naive Bayes,1,0.7,0.068,0.23804196860365237,0.21736884117126465,0.0
64,2,KNeighbors Classifier,2,0.7,0.8024691358024691,0.6010859277972174,0.4292900562286377,0.0
65,2,SVC Classifier,2,0.7,0.7983539094650206,1.0,0.3148496150970459,0.0
66,2,Decision Tree,2,0.7,0.7983539094650206,0.6728399902644729,0.0016171932220458984,0.0
67,2,RandomForest,2,0.7,0.7983539094650206,1.0,0.7625958919525146,0.0
68,2,AdaBoost (Discrete),2,0.7,0.7242798353909465,0.6108526226905386,39.57402491569519,0.0
69,2,AdaBoost (Real),2,0.7,0.5390946502057613,0.4623772155948323,54.47670888900757,0.0
70,2,Logistic Regression (Penalty = L2),2,0.7,0.7860082304526749,0.4470694492780124,0.3354184627532959,0.0
71,2,Naive Bayes,2,0.7,0.0823045267489712,0.4267434818416163,0.10204100608825684,0.0
72,3,KNeighbors Classifier,0,0.7,0.7647058823529411,0.6753791143584819,0.31658291816711426,0.0
73,3,SVC Classifier,0,0.7,0.7607843137254902,1.0,0.3368866443634033,0.0
74,3,Decision Tree,0,0.7,0.8,0.5520347433344459,0.10614943504333496,0.0
75,3,RandomForest,0,0.7,0.7607843137254902,1.0,0.6486890316009521,0.0
76,3,AdaBoost (Discrete),0,0.7,0.7137254901960784,0.4281917729366297,48.34749794006348,0.0
77,3,AdaBoost (Real),0,0.7,0.5803921568627451,0.4220635927341983,61.16286039352417,0.0
78,3,Logistic Regression (Penalty = L2),0,0.7,0.7764705882352941,0.28544290666187366,0.5866026878356934,0.0
79,3,Naive Bayes,0,0.7,0.10588235294117647,0.3214563589573323,0.22414422035217285,0.0
80,3,KNeighbors Classifier,1,0.7,0.808,0.6009085336818761,0.34134483337402344,0.0
81,3,SVC Classifier,1,0.7,0.776,1.0,0.4219393730163574,0.0
82,3,Decision Tree,1,0.7,0.836,0.5225936792790916,0.11062049865722656,0.0
83,3,RandomForest,1,0.7,0.78,0.408248290463863,0.7981283664703369,0.0
84,3,AdaBoost (Discrete),1,0.7,0.524,0.381883306671179,45.2821786403656,0.0
85,3,AdaBoost (Real),1,0.7,0.448,0.427746832332692,59.48908233642578,0.0
86,3,Logistic Regression (Penalty = L2),1,0.7,0.796,0.33110299872827026,0.4675872325897217,0.0
87,3,Naive Bayes,1,0.7,0.084,0.279199252841938,0.22818708419799805,0.0
88,3,KNeighbors Classifier,2,0.7,0.7942386831275721,0.6983344462344285,0.32384681701660156,0.0
89,3,SVC Classifier,2,0.7,0.7983539094650206,1.0,0.32344794273376465,0.0
90,3,Decision Tree,2,0.7,0.8024691358024691,0.7327331668357298,0.10655522346496582,0.0
91,3,RandomForest,2,0.7,0.7942386831275721,0.7016181591415044,0.7466878890991211,0.0
92,3,AdaBoost (Discrete),2,0.7,0.6707818930041153,0.7208137212897424,48.669498443603516,0.0
93,3,AdaBoost (Real),2,0.7,0.49794238683127573,0.5450633854458582,67.08577632904053,0.0
94,3,Logistic Regression (Penalty = L2),2,0.7,0.7942386831275721,0.4482664330796787,0.5891356468200684,0.0
95,3,Naive Bayes,2,0.7,0.102880658436214,0.4362875924479022,0.23261642456054688,0.0
96,4,KNeighbors Classifier,0,0.7,0.7137254901960784,0.6301051750850638,0.3516523838043213,0.0
97,4,SVC Classifier,0,0.7,0.7607843137254902,1.0,0.2704613208770752,0.0
98,4,Decision Tree,0,0.7,0.7254901960784313,0.4657127067712066,0.0026082992553710938,0.0
99,4,RandomForest,0,0.7,0.7607843137254902,1.0,0.8876993656158447,0.0
100,4,AdaBoost (Discrete),0,0.7,0.7176470588235294,0.53667911371032,49.319562673568726,0.0
101,4,AdaBoost (Real),0,0.7,0.6313725490196078,0.40397285012036194,74.47967433929443,0.0
102,4,Logistic Regression (Penalty = L2),0,0.7,0.7686274509803922,0.4047822312576163,1.0614738464355469,0.0
103,4,Naive Bayes,0,0.7,0.09411764705882353,0.2798440143654267,0.45786499977111816,0.0
104,4,KNeighbors Classifier,1,0.7,0.792,0.5983568128703958,0.4652416706085205,0.0
105,4,SVC Classifier,1,0.7,0.776,1.0,0.6832776069641113,0.0
106,4,Decision Tree,1,0.7,0.772,0.5671242297188988,0.002359151840209961,0.0
107,4,RandomForest,1,0.7,0.788,0.7745966692414834,1.4140582084655762,0.0
108,4,AdaBoost (Discrete),1,0.7,0.696,0.6052820211322956,86.99387431144714,0.0
109,4,AdaBoost (Real),1,0.7,0.712,0.38995109394653976,115.76057195663452,0.0
110,4,Logistic Regression (Penalty = L2),1,0.7,0.796,0.5862774913242927,0.9779739379882812,0.0
111,4,Naive Bayes,1,0.7,0.076,0.4436202961165585,0.4768531322479248,0.0
112,4,KNeighbors Classifier,2,0.7,0.7860082304526749,0.5340334541760487,0.6510217189788818,0.0
113,4,SVC Classifier,2,0.7,0.7983539094650206,1.0,0.7461814880371094,0.0
114,4,Decision Tree,2,0.7,0.7283950617283951,0.8072049477353819,0.22658967971801758,0.0
115,4,RandomForest,2,0.7,0.8065843621399177,0.7071067811865476,1.2802271842956543,0.0
116,4,AdaBoost (Discrete),2,0.7,0.522633744855967,0.40574356599022265,84.71462512016296,0.0
117,4,AdaBoost (Real),2,0.7,0.5390946502057613,0.6083448537971224,105.84566402435303,0.0
118,4,Logistic Regression (Penalty = L2),2,0.7,0.7860082304526749,0.4470694492780124,0.8121998310089111,0.0
119,4,Naive Bayes,2,0.7,0.06995884773662552,0.3500727661004813,0.37639307975769043,0.0
120,5,KNeighbors Classifier,0,0.7,0.7686274509803922,0.47043685725002576,0.6119406223297119,0.0
121,5,SVC Classifier,0,0.7,0.7607843137254902,1.0,0.365123987197876,0.0
122,5,Decision Tree,0,0.7,0.788235294117647,0.5554778671780096,0.001428842544555664,0.0
123,5,RandomForest,0,0.7,0.7607843137254902,1.0,1.1674833297729492,0.0
124,5,AdaBoost (Discrete),0,0.7,0.7803921568627451,0.4509812785574812,77.5723979473114,0.0
125,5,AdaBoost (Real),0,0.7,0.7333333333333333,0.3879470023088032,101.23138785362244,0.0
126,5,Logistic Regression (Penalty = L2),0,0.7,0.7529411764705882,0.3099500459459013,1.1086909770965576,0.0
127,5,Naive Bayes,0,0.7,0.0784313725490196,0.27670268692065597,0.4240736961364746,0.0
128,5,KNeighbors Classifier,1,0.7,0.812,0.47723850939380635,0.6246519088745117,0.0
129,5,SVC Classifier,1,0.7,0.776,1.0,0.6514506340026855,0.0
130,5,Decision Tree,1,0.7,0.808,0.6410551529649915,0.23836517333984375,0.0
131,5,RandomForest,1,0.7,0.776,1.0,1.4795935153961182,0.0
132,5,AdaBoost (Discrete),1,0.7,0.812,0.5247628886878963,75.20305275917053,0.0
133,5,AdaBoost (Real),1,0.7,0.756,0.4712218975014483,87.82396388053894,0.0
134,5,Logistic Regression (Penalty = L2),1,0.7,0.78,0.32127586985818757,0.4522519111633301,0.0
135,5,Naive Bayes,1,0.7,0.06,0.447213595499958,0.23349690437316895,0.0
136,5,KNeighbors Classifier,2,0.7,0.8065843621399177,0.6016321225947898,0.45418882369995117,0.0
137,5,SVC Classifier,2,0.7,0.7983539094650206,1.0,0.23973631858825684,0.0
138,5,Decision Tree,2,0.7,0.8106995884773662,0.6746961417252045,0.12262177467346191,0.0
139,5,RandomForest,2,0.7,0.7901234567901234,0.6997790520224827,0.8265588283538818,0.0
140,5,AdaBoost (Discrete),2,0.7,0.8189300411522634,0.5793915037672752,43.811211824417114,0.0
141,5,AdaBoost (Real),2,0.7,0.7613168724279835,0.5705897105641187,57.217488050460815,0.0
142,5,Logistic Regression (Penalty = L2),2,0.7,0.7860082304526749,0.4470694492780124,0.5065481662750244,0.0
143,5,Naive Bayes,2,0.7,0.06584362139917696,0.3298802991968245,0.23196959495544434,0.0
144,6,KNeighbors Classifier,0,0.7,0.7647058823529411,0.6753791143584819,0.3604469299316406,0.0
145,6,SVC Classifier,0,0.7,0.7607843137254902,1.0,0.24164867401123047,0.0
146,6,Decision Tree,0,0.7,0.7803921568627451,0.5036543726553341,0.0025053024291992188,0.0
147,6,RandomForest,0,0.7,0.7607843137254902,1.0,0.7655947208404541,0.0
148,6,AdaBoost (Discrete),0,0.7,0.7137254901960784,0.4281917729366297,48.2171368598938,0.0
149,6,AdaBoost (Real),0,0.7,0.6196078431372549,0.44553445580651685,62.882360219955444,0.0
150,6,Logistic Regression (Penalty = L2),0,0.7,0.7764705882352941,0.28544290666187366,0.5448784828186035,0.0
151,6,Naive Bayes,0,0.7,0.10588235294117647,0.3214563589573323,0.373030424118042,0.0
152,6,KNeighbors Classifier,1,0.7,0.808,0.6009085336818761,0.34346556663513184,0.0
153,6,SVC Classifier,1,0.7,0.776,1.0,0.36110353469848633,0.0
154,6,Decision Tree,1,0.7,0.84,0.5229018130586566,0.0026798248291015625,0.0
155,6,RandomForest,1,0.7,0.776,1.0,0.8813059329986572,0.0
156,6,AdaBoost (Discrete),1,0.7,0.68,0.3623139504614777,47.888161182403564,0.0
157,6,AdaBoost (Real),1,0.7,0.372,0.41948821287290555,63.40702533721924,0.0
158,6,Logistic Regression (Penalty = L2),1,0.7,0.796,0.33110299872827026,0.5562500953674316,0.0
159,6,Naive Bayes,1,0.7,0.08,0.45986329782677027,0.23171567916870117,0.0
160,6,KNeighbors Classifier,2,0.7,0.7942386831275721,0.6983344462344285,0.22922897338867188,0.0
161,6,SVC Classifier,2,0.7,0.7983539094650206,1.0,0.36010169982910156,0.0
162,6,Decision Tree,2,0.7,0.7448559670781894,0.7241079709988164,0.11013531684875488,0.0
163,6,RandomForest,2,0.7,0.7860082304526749,0.6979350987461912,0.9044723510742188,0.0
164,6,AdaBoost (Discrete),2,0.7,0.6707818930041153,0.7208137212897424,48.5211820602417,0.0
165,6,AdaBoost (Real),2,0.7,0.5185185185185185,0.5498453760088443,64.89663743972778,0.0
166,6,Logistic Regression (Penalty = L2),2,0.7,0.7942386831275721,0.4482664330796787,0.5068206787109375,0.0
167,6,Naive Bayes,2,0.7,0.09053497942386832,0.37400491341941794,0.23277950286865234,0.0
168,7,KNeighbors Classifier,0,0.7,0.792156862745098,0.5832771550316272,0.3473474979400635,0.0
169,7,SVC Classifier,0,0.7,0.7607843137254902,1.0,0.23333263397216797,0.0
170,7,Decision Tree,0,0.7,0.796078431372549,0.5060256283691614,0.11384963989257812,0.0
171,7,RandomForest,0,0.7,0.7607843137254902,1.0,0.926825761795044,0.0
172,7,AdaBoost (Discrete),0,0.7,0.7215686274509804,0.6821217382775556,45.101120471954346,0.0
173,7,AdaBoost (Real),0,0.7,0.6509803921568628,0.4619348437525514,62.63363575935364,0.0
174,7,Logistic Regression (Penalty = L2),0,0.7,0.7686274509803922,0.3389296466508029,0.37990474700927734,0.0
175,7,Naive Bayes,0,0.7,0.0784313725490196,0.2723619736035663,0.2404186725616455,0.0
176,7,KNeighbors Classifier,1,0.7,0.816,0.6021683110619066,0.2341747283935547,0.0
177,7,SVC Classifier,1,0.7,0.776,1.0,0.235062837600708,0.0
178,7,Decision Tree,1,0.7,0.816,0.6002288766944873,0.0025196075439453125,0.0
179,7,RandomForest,1,0.7,0.776,1.0,0.604403018951416,0.0
180,7,AdaBoost (Discrete),1,0.7,0.752,0.577647642591943,46.28176760673523,0.0
181,7,AdaBoost (Real),1,0.7,0.736,0.9632419486019034,58.939953088760376,0.0
182,7,Logistic Regression (Penalty = L2),1,0.7,0.78,0.34140655617640037,0.3954741954803467,0.0
183,7,Naive Bayes,1,0.7,0.068,0.23804196860365237,0.2317192554473877,0.0
184,7,KNeighbors Classifier,2,0.7,0.7860082304526749,0.6506648882550834,0.2139129638671875,0.0
185,7,SVC Classifier,2,0.7,0.7983539094650206,1.0,0.3344118595123291,0.0
186,7,Decision Tree,2,0.7,0.7983539094650206,0.7482417435767362,0.002129077911376953,0.0
187,7,RandomForest,2,0.7,0.8065843621399177,0.7071067811865476,0.7836174964904785,0.0
188,7,AdaBoost (Discrete),2,0.7,0.7736625514403292,0.6861262850917655,44.571802377700806,0.0
189,7,AdaBoost (Real),2,0.7,0.6337448559670782,0.7268612460680712,55.37110638618469,0.0
190,7,Logistic Regression (Penalty = L2),2,0.7,0.7777777777777778,0.4930304499002129,0.3089137077331543,0.0
191,7,Naive Bayes,2,0.7,0.07407407407407407,0.3865116700743267,0.2089240550994873,0.0
192,8,KNeighbors Classifier,0,0.7,0.792156862745098,0.6318838643973012,0.30997419357299805,0.0
193,8,SVC Classifier,0,0.7,0.7607843137254902,1.0,0.33248472213745117,0.0
194,8,Decision Tree,0,0.7,0.796078431372549,0.5060256283691614,0.09390664100646973,0.0
195,8,RandomForest,0,0.7,0.7607843137254902,1.0,0.7759861946105957,0.0
196,8,AdaBoost (Discrete),0,0.7,0.6039215686274509,0.46269898154004424,41.602120876312256,0.0
197,8,AdaBoost (Real),0,0.7,0.6862745098039216,0.3017976330972348,55.35163736343384,0.0
198,8,Logistic Regression (Penalty = L2),0,0.7,0.7725490196078432,0.3393701019616241,0.3565239906311035,0.0
199,8,Naive Bayes,0,0.7,0.08627450980392157,0.29416720209446096,0.10643911361694336,0.0
200,8,KNeighbors Classifier,1,0.7,0.824,0.6034176336545163,0.20951008796691895,0.0
201,8,SVC Classifier,1,0.7,0.776,1.0,0.21825051307678223,0.0
202,8,Decision Tree,1,0.7,0.812,0.5996984036545391,0.10225844383239746,0.0
203,8,RandomForest,1,0.7,0.776,1.0,0.6366672515869141,0.0
204,8,AdaBoost (Discrete),1,0.7,0.772,0.4431236883193759,43.12943983078003,0.0
205,8,AdaBoost (Real),1,0.7,0.68,0.6036511498015895,56.95505690574646,0.0
206,8,Logistic Regression (Penalty = L2),1,0.7,0.792,0.3930897370226323,0.4062173366546631,0.0
207,8,Naive Bayes,1,0.7,0.084,0.31328084887132,0.21967196464538574,0.0
208,8,KNeighbors Classifier,2,0.7,0.8106995884773662,0.5369599204758755,0.21341562271118164,0.0
209,8,SVC Classifier,2,0.7,0.7983539094650206,1.0,0.20481133460998535,0.0
210,8,Decision Tree,2,0.7,0.7777777777777778,0.6259277075441735,0.10237860679626465,0.0
211,8,RandomForest,2,0.7,0.8065843621399177,0.7071067811865476,0.7266364097595215,0.0
212,8,AdaBoost (Discrete),2,0.7,0.720164609053498,0.5432769054278167,41.61034178733826,0.0
213,8,AdaBoost (Real),2,0.7,0.6831275720164609,0.5083101982535092,55.731534242630005,0.0
214,8,Logistic Regression (Penalty = L2),2,0.7,0.7860082304526749,0.4470694492780124,0.5013022422790527,0.0
215,8,Naive Bayes,2,0.7,0.07407407407407407,0.4238626334726355,0.10534191131591797,0.0
216,9,KNeighbors Classifier,0,0.7,0.788235294117647,0.6312173187524104,0.43019747734069824,0.0
217,9,SVC Classifier,0,0.7,0.7607843137254902,1.0,0.2073373794555664,0.0
218,9,Decision Tree,0,0.7,0.792156862745098,0.505580769670668,0.0016739368438720703,0.0
219,9,RandomForest,0,0.7,0.7607843137254902,1.0,0.6197402477264404,0.0
220,9,AdaBoost (Discrete),0,0.7,0.7725490196078432,0.3921878680248799,40.358001708984375,0.0
221,9,AdaBoost (Real),0,0.7,0.7176470588235294,0.2811097128407012,53.373334646224976,0.0
222,9,Logistic Regression (Penalty = L2),0,0.7,0.7725490196078432,0.28514649594268227,0.3794372081756592,0.0
223,9,Naive Bayes,0,0.7,0.07450980392156863,0.2807434106945623,0.10681867599487305,0.0
224,9,KNeighbors Classifier,1,0.7,0.8,0.4558818758158635,0.4142162799835205,0.0
225,9,SVC Classifier,1,0.7,0.776,1.0,0.2087240219116211,0.0
226,9,Decision Tree,1,0.7,0.808,0.6009085336818761,0.10222387313842773,0.0
227,9,RandomForest,1,0.7,0.776,1.0,0.6410326957702637,0.0
228,9,AdaBoost (Discrete),1,0.7,0.796,0.4554035097295456,40.52225971221924,0.0
229,9,AdaBoost (Real),1,0.7,0.732,0.4518737365578663,54.45832085609436,0.0
230,9,Logistic Regression (Penalty = L2),1,0.7,0.784,0.2853751021838173,0.42769718170166016,0.0
231,9,Naive Bayes,1,0.7,0.068,0.2504773744641672,0.10756897926330566,0.0
232,9,KNeighbors Classifier,2,0.7,0.7901234567901234,0.6513822713524018,0.4429013729095459,0.0
233,9,SVC Classifier,2,0.7,0.7983539094650206,1.0,0.30769896507263184,0.0
234,9,Decision Tree,2,0.7,0.7901234567901234,0.7465899796821458,0.09099602699279785,0.0
235,9,RandomForest,2,0.7,0.7901234567901234,0.6997790520224827,0.7580468654632568,0.0
236,9,AdaBoost (Discrete),2,0.7,0.7983539094650206,0.5251701030079454,40.59704375267029,0.0
237,9,AdaBoost (Real),2,0.7,0.7407407407407407,0.5228674036281351,54.182064056396484,0.0
238,9,Logistic Regression (Penalty = L2),2,0.7,0.7860082304526749,0.4470694492780124,0.4750847816467285,0.0
239,9,Naive Bayes,2,0.7,0.06584362139917696,0.37814460251036086,0.2254185676574707,0.0
240,10,KNeighbors Classifier,0,0.7,0.8117647058823529,0.67865738426151,0.4165079593658447,0.0
241,10,SVC Classifier,0,0.7,0.7607843137254902,1.0,0.41309237480163574,0.0
242,10,Decision Tree,0,0.7,0.7647058823529411,0.8087147413164699,0.09873104095458984,0.0
243,10,RandomForest,0,0.7,0.7607843137254902,1.0,0.7277696132659912,0.0
244,10,AdaBoost (Discrete),0,0.7,0.7647058823529411,0.5055141531691423,45.55518651008606,0.0
245,10,AdaBoost (Real),0,0.7,0.6941176470588235,0.461968496437613,56.601611375808716,0.0
246,10,Logistic Regression (Penalty = L2),0,0.7,0.7568627450980392,0.39136922776748306,0.6125192642211914,0.0
247,10,Naive Bayes,0,0.7,0.10980392156862745,0.31419291226453727,0.192138671875,0.0
248,10,KNeighbors Classifier,1,0.7,0.78,0.7346717470487842,0.33306312561035156,0.0
249,10,SVC Classifier,1,0.7,0.776,1.0,0.4125053882598877,0.0
250,10,Decision Tree,1,0.7,0.844,0.9456610897126322,0.10258984565734863,0.0
251,10,RandomForest,1,0.7,0.776,1.0,0.6202921867370605,0.0
252,10,AdaBoost (Discrete),1,0.7,0.808,0.6907757644643079,44.27089977264404,0.0
253,10,AdaBoost (Real),1,0.7,0.752,0.9690721649484536,57.64251232147217,0.0
254,10,Logistic Regression (Penalty = L2),1,0.7,0.808,0.39773448577795095,0.6968393325805664,0.0
255,10,Naive Bayes,1,0.7,0.084,0.279199252841938,0.33740925788879395,0.0
256,10,KNeighbors Classifier,2,0.7,0.823045267489712,0.7516084187330146,0.4228036403656006,0.0
257,10,SVC Classifier,2,0.7,0.7983539094650206,1.0,0.3407719135284424,0.0
258,10,Decision Tree,2,0.7,0.7695473251028807,0.8313654453671874,0.0025010108947753906,0.0
259,10,RandomForest,2,0.7,0.8024691358024691,0.7052819864510728,0.8270294666290283,0.0
260,10,AdaBoost (Discrete),2,0.7,0.7366255144032922,0.7980624819445508,41.39002513885498,0.0
261,10,AdaBoost (Real),2,0.7,0.7037037037037037,0.6780247257222922,48.66371488571167,0.0
262,10,Logistic Regression (Penalty = L2),2,0.7,0.8024691358024691,0.5257335915396673,0.6019160747528076,0.0
263,10,Naive Bayes,2,0.7,0.09876543209876543,0.4225623318356447,0.19882512092590332,0.0
264,11,KNeighbors Classifier,0,0.7,0.8196078431372549,0.6794911240753443,0.2789301872253418,0.0
265,11,SVC Classifier,0,0.7,0.7607843137254902,1.0,0.3688509464263916,0.0
266,11,Decision Tree,0,0.7,0.803921568627451,0.8282270656706371,0.0026268959045410156,0.0
267,11,RandomForest,0,0.7,0.7607843137254902,1.0,0.7231175899505615,0.0
268,11,AdaBoost (Discrete),0,0.7,0.792156862745098,0.8846991476935628,39.78068685531616,0.0
269,11,AdaBoost (Real),0,0.7,0.6980392156862745,0.3917854950715044,55.64988160133362,0.0
270,11,Logistic Regression (Penalty = L2),0,0.7,0.7647058823529411,0.3920788795851925,0.6099886894226074,0.0
271,11,Naive Bayes,0,0.7,0.10980392156862745,0.31419291226453727,0.2154686450958252,0.0
272,11,KNeighbors Classifier,1,0.7,0.8,0.7370696708058684,0.35988640785217285,0.0
273,11,SVC Classifier,1,0.7,0.776,1.0,0.5742537975311279,0.0
274,11,Decision Tree,1,0.7,0.836,0.9444609992947434,0.002758502960205078,0.0
275,11,RandomForest,1,0.7,0.788,0.7745966692414834,0.6866588592529297,0.0
276,11,AdaBoost (Discrete),1,0.7,0.84,0.6871244452026302,42.61359095573425,0.0
277,11,AdaBoost (Real),1,0.7,0.724,0.5986206805330004,59.522310972213745,0.0
278,11,Logistic Regression (Penalty = L2),1,0.7,0.808,0.39773448577795095,0.6730389595031738,0.0
279,11,Naive Bayes,1,0.7,0.08,0.27041586643733656,0.30968475341796875,0.0
280,11,KNeighbors Classifier,2,0.7,0.8353909465020576,0.7530212497613873,0.5035398006439209,0.0
281,11,SVC Classifier,2,0.7,0.7983539094650206,1.0,0.40611767768859863,0.0
282,11,Decision Tree,2,0.7,0.7860082304526749,0.8335137946861616,0.09847784042358398,0.0
283,11,RandomForest,2,0.7,0.7983539094650206,1.0,0.5973577499389648,0.0
284,11,AdaBoost (Discrete),2,0.7,0.7407407407407407,0.6205568408333527,42.592724323272705,0.0
285,11,AdaBoost (Real),2,0.7,0.6090534979423868,0.47000106156057164,56.25811243057251,0.0
286,11,Logistic Regression (Penalty = L2),2,0.7,0.7860082304526749,0.5234649692628083,0.652592658996582,0.0
287,11,Naive Bayes,2,0.7,0.10699588477366255,0.4563925617881304,0.20930218696594238,0.0
288,12,KNeighbors Classifier,0,0.7,0.7843137254901961,0.5372801081349485,0.21210384368896484,0.0
289,12,SVC Classifier,0,0.7,0.7607843137254902,1.0,0.19992518424987793,0.0
290,12,Decision Tree,0,0.7,0.788235294117647,0.4420541035992097,0.002051115036010742,0.0
291,12,RandomForest,0,0.7,0.7607843137254902,1.0,0.5558996200561523,0.0
292,12,AdaBoost (Discrete),0,0.7,0.7568627450980392,0.4026739522425071,37.04064083099365,0.0
293,12,AdaBoost (Real),0,0.7,0.7254901960784313,0.5367513864750919,47.665958881378174,0.0
294,12,Logistic Regression (Penalty = L2),0,0.7,0.7647058823529411,0.4040819145799253,0.20138335227966309,0.0
295,12,Naive Bayes,0,0.7,0.07058823529411765,0.26943944845710593,0.19980382919311523,0.0
296,12,KNeighbors Classifier,1,0.7,0.78,0.9922379162651601,0.2833390235900879,0.0
297,12,SVC Classifier,1,0.7,0.776,1.0,0.22684240341186523,0.0
298,12,Decision Tree,1,0.7,0.792,0.5220152879748006,0.09353327751159668,0.0
299,12,RandomForest,1,0.7,0.776,1.0,0.4988429546356201,0.0
300,12,AdaBoost (Discrete),1,0.7,0.8,0.5870433681905574,36.323296308517456,0.0
301,12,AdaBoost (Real),1,0.7,0.736,0.4966152701932077,45.50723576545715,0.0
302,12,Logistic Regression (Penalty = L2),1,0.7,0.78,0.4472135954999579,0.1822953224182129,0.0
303,12,Naive Bayes,1,0.7,0.064,0.6258269289063796,0.17808938026428223,0.0
304,12,KNeighbors Classifier,2,0.7,0.7860082304526749,0.8942873494567816,0.1766977310180664,0.0
305,12,SVC Classifier,2,0.7,0.7983539094650206,1.0,0.260761022567749,0.0
306,12,Decision Tree,2,0.7,0.7818930041152263,0.6499443273635339,0.08589935302734375,0.0
307,12,RandomForest,2,0.7,0.7983539094650206,1.0,0.5228447914123535,0.0
308,12,AdaBoost (Discrete),2,0.7,0.7942386831275721,0.7854322108887516,31.57745122909546,0.0
309,12,AdaBoost (Real),2,0.7,0.7325102880658436,0.7639614760984682,40.558725357055664,0.0
310,12,Logistic Regression (Penalty = L2),2,0.7,0.7901234567901234,0.49566702650208644,0.25885581970214844,0.0
311,12,Naive Bayes,2,0.7,0.053497942386831275,0.2865800192807217,0.0850064754486084,0.0
