,feat_set_id,classifier,fold_id,feat_th,score,geo_score,exec_t,geo_score_woz
0,0,KNeighbors Classifier,0,0.4,0.5549132947976878,0.6960449802807,0.057544708251953125,0.0
1,0,SVC Classifier,0,0.4,0.49710982658959535,1.0,0.11038494110107422,0.0
2,0,Decision Tree,0,0.4,0.48554913294797686,0.4913457369634863,0.002594470977783203,0.0
3,0,RandomForest,0,0.4,0.49710982658959535,1.0,0.09999322891235352,0.0
4,0,AdaBoost (Discrete),0,0.4,0.5895953757225434,0.5479071227098696,6.966083526611328,0.0
5,0,AdaBoost (Real),0,0.4,0.47398843930635837,0.32524861519359416,8.347919225692749,0.0
6,0,Logistic Regression (Penalty = L2),0,0.4,0.5202312138728323,0.32011247998491643,0.11570858955383301,0.0
7,0,Naive Bayes,0,0.4,0.18497109826589594,0.37084125518344047,0.057734012603759766,0.0
8,0,KNeighbors Classifier,1,0.4,0.5773809523809523,0.45050316490591885,0.18145298957824707,0.0
9,0,SVC Classifier,1,0.4,0.5119047619047619,1.0,0.09849405288696289,0.0
10,0,Decision Tree,1,0.4,0.5,0.5514732950491044,0.0023488998413085938,0.0
11,0,RandomForest,1,0.4,0.5119047619047619,1.0,0.09962749481201172,0.0
12,0,AdaBoost (Discrete),1,0.4,0.5297619047619048,0.5279467446225014,7.126899480819702,0.0
13,0,AdaBoost (Real),1,0.4,0.5416666666666666,0.45668079138181406,8.401347875595093,0.0
14,0,Logistic Regression (Penalty = L2),1,0.4,0.5357142857142857,0.4583034067124108,0.0819251537322998,0.0
15,0,Naive Bayes,1,0.4,0.18452380952380953,0.3150573846820668,0.06216168403625488,0.0
16,0,KNeighbors Classifier,2,0.4,0.5828220858895705,0.6851593164093939,0.15240478515625,0.0
17,0,SVC Classifier,2,0.4,0.5153374233128835,1.0,0.15339422225952148,0.0
18,0,Decision Tree,2,0.4,0.50920245398773,0.7286100212570485,0.0196075439453125,0.0
19,0,RandomForest,2,0.4,0.5153374233128835,1.0,0.10912418365478516,0.0
20,0,AdaBoost (Discrete),2,0.4,0.5828220858895705,0.5759841975470495,7.556666612625122,0.0
21,0,AdaBoost (Real),2,0.4,0.5521472392638037,0.5173582186046756,9.228250741958618,0.0
22,0,Logistic Regression (Penalty = L2),2,0.4,0.5398773006134969,0.4003748113271437,0.08586454391479492,0.0
23,0,Naive Bayes,2,0.4,0.20245398773006135,0.410055320394848,0.06330609321594238,0.0
24,1,KNeighbors Classifier,0,0.4,0.5895953757225434,0.5473400854766869,0.15245819091796875,0.0
25,1,SVC Classifier,0,0.4,0.49710982658959535,1.0,0.12183380126953125,0.0
26,1,Decision Tree,0,0.4,0.6705202312138728,0.6813491892869071,0.027692079544067383,0.0
27,1,RandomForest,0,0.4,0.5086705202312138,0.4833047214503508,0.09912395477294922,0.0
28,1,AdaBoost (Discrete),0,0.4,0.6878612716763006,0.5560918003615519,10.914909839630127,0.0
29,1,AdaBoost (Real),0,0.4,0.630057803468208,0.6959564549560032,11.840506553649902,0.0
30,1,Logistic Regression (Penalty = L2),0,0.4,0.5433526011560693,0.40738839781374325,0.139448881149292,0.0
31,1,Naive Bayes,0,0.4,0.2254335260115607,0.3355323943196243,0.06767749786376953,0.0
32,1,KNeighbors Classifier,1,0.4,0.5654761904761905,0.5498138166217035,0.1237020492553711,0.0
33,1,SVC Classifier,1,0.4,0.5119047619047619,1.0,0.16036200523376465,0.0
34,1,Decision Tree,1,0.4,0.5654761904761905,0.6189867006033505,0.002863645553588867,0.0
35,1,RandomForest,1,0.4,0.5476190476190477,0.48549177170732344,0.12277603149414062,0.0
36,1,AdaBoost (Discrete),1,0.4,0.7202380952380952,0.6751297874305613,10.681210994720459,0.0
37,1,AdaBoost (Real),1,0.4,0.6607142857142857,0.6025367780282287,12.315122604370117,0.0
38,1,Logistic Regression (Penalty = L2),1,0.4,0.5833333333333334,0.42122667617070286,0.15312433242797852,0.0
39,1,Naive Bayes,1,0.4,0.22023809523809523,0.4641127487674628,0.05933094024658203,0.0
40,1,KNeighbors Classifier,2,0.4,0.6012269938650306,0.5193859484718819,0.12610554695129395,0.0
41,1,SVC Classifier,2,0.4,0.5153374233128835,1.0,0.10157155990600586,0.0
42,1,Decision Tree,2,0.4,0.5766871165644172,0.5810649582056104,0.0027856826782226562,0.0
43,1,RandomForest,2,0.4,0.588957055214724,0.7311846378041618,0.11981749534606934,0.0
44,1,AdaBoost (Discrete),2,0.4,0.7116564417177914,0.7827852630001867,10.860900163650513,0.0
45,1,AdaBoost (Real),2,0.4,0.5521472392638037,0.5154040423732591,12.515878677368164,0.0
46,1,Logistic Regression (Penalty = L2),2,0.4,0.588957055214724,0.4308435212941841,0.1887209415435791,0.0
47,1,Naive Bayes,2,0.4,0.2822085889570552,0.49268303390086604,0.071319580078125,0.0
48,2,KNeighbors Classifier,0,0.4,0.6589595375722543,0.5754630381896173,0.17689204216003418,0.0
49,2,SVC Classifier,0,0.4,0.49710982658959535,1.0,0.1527421474456787,0.0
50,2,Decision Tree,0,0.4,0.5895953757225434,0.5561279912976378,0.028842687606811523,0.0
51,2,RandomForest,0,0.4,0.5549132947976878,0.8801117367933934,0.06894326210021973,0.0
52,2,AdaBoost (Discrete),0,0.4,0.7398843930635838,0.5964458248260893,14.110647201538086,0.0
53,2,AdaBoost (Real),0,0.4,0.5375722543352601,0.8259289855571738,15.469624757766724,0.0
54,2,Logistic Regression (Penalty = L2),0,0.4,0.7167630057803468,0.6088015918021599,0.27979135513305664,0.0
55,2,Naive Bayes,0,0.4,0.24855491329479767,0.3884885704781268,0.034503936767578125,0.0
56,2,KNeighbors Classifier,1,0.4,0.6428571428571429,0.5534764441387894,0.14767885208129883,0.0
57,2,SVC Classifier,1,0.4,0.5119047619047619,1.0,0.2001640796661377,0.0
58,2,Decision Tree,1,0.4,0.5714285714285714,0.6259130121466817,0.02075362205505371,0.0
59,2,RandomForest,1,0.4,0.5476190476190477,0.42168460634274996,0.09595608711242676,0.0
60,2,AdaBoost (Discrete),1,0.4,0.7261904761904762,0.6507310542933067,13.425274133682251,0.6507310542933067
61,2,AdaBoost (Real),1,0.4,0.6071428571428571,0.6926885243795937,14.439869403839111,0.0
62,2,Logistic Regression (Penalty = L2),1,0.4,0.7619047619047619,0.6956527708228273,0.23313188552856445,0.0
63,2,Naive Bayes,1,0.4,0.27380952380952384,0.4823548076648672,0.07950663566589355,0.0
64,2,KNeighbors Classifier,2,0.4,0.6748466257668712,0.7975774685067878,0.11312150955200195,0.0
65,2,SVC Classifier,2,0.4,0.5153374233128835,1.0,0.1270904541015625,0.0
66,2,Decision Tree,2,0.4,0.5828220858895705,0.5922217883552139,0.0034093856811523438,0.0
67,2,RandomForest,2,0.4,0.5705521472392638,0.6309573444801932,0.09999251365661621,0.0
68,2,AdaBoost (Discrete),2,0.4,0.754601226993865,0.5966291277095392,13.641088962554932,0.5966291277095392
69,2,AdaBoost (Real),2,0.4,0.5828220858895705,0.810908927640115,14.857511520385742,0.0
70,2,Logistic Regression (Penalty = L2),2,0.4,0.7239263803680982,0.6347565626495696,0.2859170436859131,0.0
71,2,Naive Bayes,2,0.4,0.26380368098159507,0.44687916770698044,0.08494114875793457,0.0
72,3,KNeighbors Classifier,0,0.4,0.6705202312138728,0.5450580430753854,0.1303718090057373,0.0
73,3,SVC Classifier,0,0.4,0.49710982658959535,1.0,0.15336155891418457,0.0
74,3,Decision Tree,0,0.4,0.630057803468208,0.5569233901289105,0.031737327575683594,0.0
75,3,RandomForest,0,0.4,0.5491329479768786,0.5261854746265028,0.07085561752319336,0.0
76,3,AdaBoost (Discrete),0,0.4,0.7052023121387283,0.611247547435046,13.23848295211792,0.0
77,3,AdaBoost (Real),0,0.4,0.6647398843930635,0.7701393616522492,15.329575777053833,0.0
78,3,Logistic Regression (Penalty = L2),0,0.4,0.6994219653179191,0.5502800681827484,0.2588789463043213,0.0
79,3,Naive Bayes,0,0.4,0.2658959537572254,0.4654163578036808,0.062264442443847656,0.0
80,3,KNeighbors Classifier,1,0.4,0.6547619047619048,0.6086519165847261,0.16130328178405762,0.0
81,3,SVC Classifier,1,0.4,0.5119047619047619,1.0,0.18879437446594238,0.0
82,3,Decision Tree,1,0.4,0.6904761904761905,0.6694408846750671,0.016518115997314453,0.0
83,3,RandomForest,1,0.4,0.5654761904761905,0.542660503101091,0.09647846221923828,0.0
84,3,AdaBoost (Discrete),1,0.4,0.6845238095238095,0.6509243263165776,13.902299404144287,0.0
85,3,AdaBoost (Real),1,0.4,0.5952380952380952,0.6306382912220819,15.821306467056274,0.0
86,3,Logistic Regression (Penalty = L2),1,0.4,0.7857142857142857,0.6635357213845186,0.2654087543487549,0.0
87,3,Naive Bayes,1,0.4,0.27976190476190477,0.4694613937924024,0.10355997085571289,0.0
88,3,KNeighbors Classifier,2,0.4,0.6687116564417178,0.6471180639501504,0.1336832046508789,0.0
89,3,SVC Classifier,2,0.4,0.5153374233128835,1.0,0.15613102912902832,0.0
90,3,Decision Tree,2,0.4,0.6073619631901841,0.6214854776025861,0.040083885192871094,0.0
91,3,RandomForest,2,0.4,0.5705521472392638,0.5,0.13569259643554688,0.0
92,3,AdaBoost (Discrete),2,0.4,0.7423312883435583,0.7413988107458558,13.530755758285522,0.0
93,3,AdaBoost (Real),2,0.4,0.5521472392638037,0.593025351230972,14.507062196731567,0.0
94,3,Logistic Regression (Penalty = L2),2,0.4,0.754601226993865,0.7006847019629534,0.21922588348388672,0.0
95,3,Naive Bayes,2,0.4,0.294478527607362,0.46422581607678337,0.07821965217590332,0.0
96,4,KNeighbors Classifier,0,0.4,0.5549132947976878,0.605012556401711,0.08499383926391602,0.0
97,4,SVC Classifier,0,0.4,0.49710982658959535,1.0,0.06587958335876465,0.0
98,4,Decision Tree,0,0.4,0.47398843930635837,0.5300579695690194,0.0027163028717041016,0.0
99,4,RandomForest,0,0.4,0.5317919075144508,0.7066984026307931,0.09791350364685059,0.0
100,4,AdaBoost (Discrete),0,0.4,0.5491329479768786,0.46967249050477033,6.290821075439453,0.0
101,4,AdaBoost (Real),0,0.4,0.5028901734104047,0.5539814092758168,7.41387939453125,0.0
102,4,Logistic Regression (Penalty = L2),0,0.4,0.49710982658959535,1.0,0.07773399353027344,0.0
103,4,Naive Bayes,0,0.4,0.1791907514450867,0.2771016415120211,0.061155080795288086,0.0
104,4,KNeighbors Classifier,1,0.4,0.5714285714285714,0.5152944974900527,0.0938870906829834,0.0
105,4,SVC Classifier,1,0.4,0.5119047619047619,1.0,0.06697392463684082,0.0
106,4,Decision Tree,1,0.4,0.5416666666666666,0.5521454218609637,0.002023935317993164,0.0
107,4,RandomForest,1,0.4,0.5119047619047619,1.0,0.08863186836242676,0.0
108,4,AdaBoost (Discrete),1,0.4,0.5297619047619048,0.5160364748914303,6.235656023025513,0.0
109,4,AdaBoost (Real),1,0.4,0.4642857142857143,0.2917350725630097,8.189374923706055,0.0
110,4,Logistic Regression (Penalty = L2),1,0.4,0.5119047619047619,1.0,0.08847427368164062,0.0
111,4,Naive Bayes,1,0.4,0.16071428571428573,0.3697980329602067,0.06409263610839844,0.0
112,4,KNeighbors Classifier,2,0.4,0.6134969325153374,0.7168243254179488,0.10319828987121582,0.0
113,4,SVC Classifier,2,0.4,0.5153374233128835,1.0,0.06223869323730469,0.0
114,4,Decision Tree,2,0.4,0.5644171779141104,0.5565632104319496,0.0028395652770996094,0.0
115,4,RandomForest,2,0.4,0.5153374233128835,1.0,0.06039857864379883,0.0
116,4,AdaBoost (Discrete),2,0.4,0.558282208588957,0.6375727803775176,6.200389862060547,0.0
117,4,AdaBoost (Real),2,0.4,0.5214723926380368,0.4067717031969955,8.275124073028564,0.0
118,4,Logistic Regression (Penalty = L2),2,0.4,0.5214723926380368,0.3968502629920499,0.11198639869689941,0.0
119,4,Naive Bayes,2,0.4,0.2147239263803681,0.37140528668620554,0.03944087028503418,0.0
120,5,KNeighbors Classifier,0,0.4,0.4508670520231214,0.2977542824840215,0.04590010643005371,0.0
121,5,SVC Classifier,0,0.4,0.49710982658959535,1.0,0.03328824043273926,0.0
122,5,Decision Tree,0,0.4,0.5202312138728323,0.33085791301721496,0.0016181468963623047,0.0
123,5,RandomForest,0,0.4,0.49710982658959535,1.0,0.06382870674133301,0.0
124,5,AdaBoost (Discrete),0,0.4,0.4508670520231214,0.3961459560640755,5.647714614868164,0.0
125,5,AdaBoost (Real),0,0.4,0.47398843930635837,0.5273728519096418,6.868907451629639,0.0
126,5,Logistic Regression (Penalty = L2),0,0.4,0.5144508670520231,0.39165418135068353,0.031494140625,0.0
127,5,Naive Bayes,0,0.4,0.10404624277456648,0.32723376642779795,0.019397735595703125,0.0
128,5,KNeighbors Classifier,1,0.4,0.5416666666666666,0.280224971184455,0.04009079933166504,0.0
129,5,SVC Classifier,1,0.4,0.5119047619047619,1.0,0.028402090072631836,0.0
130,5,Decision Tree,1,0.4,0.5119047619047619,0.3790522905459158,0.001605987548828125,0.0
131,5,RandomForest,1,0.4,0.5119047619047619,1.0,0.08595037460327148,0.0
132,5,AdaBoost (Discrete),1,0.4,0.5238095238095238,0.3810012482874251,5.614621162414551,0.0
133,5,AdaBoost (Real),1,0.4,0.5416666666666666,0.35714489688180434,6.829939126968384,0.0
134,5,Logistic Regression (Penalty = L2),1,0.4,0.5357142857142857,0.4583034067124108,0.03220248222351074,0.0
135,5,Naive Bayes,1,0.4,0.1488095238095238,0.3817438524743224,0.031601667404174805,0.0
136,5,KNeighbors Classifier,2,0.4,0.5398773006134969,0.3350472612028119,0.03222346305847168,0.0
137,5,SVC Classifier,2,0.4,0.5153374233128835,1.0,0.031213045120239258,0.0
138,5,Decision Tree,2,0.4,0.5153374233128835,0.2803014515851317,0.0013725757598876953,0.0
139,5,RandomForest,2,0.4,0.5276073619631901,0.7937005259840998,0.12053918838500977,0.0
140,5,AdaBoost (Discrete),2,0.4,0.4662576687116564,0.5291336839893999,5.787113904953003,0.0
141,5,AdaBoost (Real),2,0.4,0.4601226993865031,0.6712803318663652,7.34651517868042,0.0
142,5,Logistic Regression (Penalty = L2),2,0.4,0.5276073619631901,0.4191444765609785,0.030713796615600586,0.0
143,5,Naive Bayes,2,0.4,0.10429447852760736,0.2919984559108187,0.028759479522705078,0.0
144,6,KNeighbors Classifier,0,0.4,0.5433526011560693,0.548280872622652,0.03796672821044922,0.0
145,6,SVC Classifier,0,0.4,0.49710982658959535,1.0,0.027095317840576172,0.0
146,6,Decision Tree,0,0.4,0.5086705202312138,0.6167543089546705,0.01795029640197754,0.0
147,6,RandomForest,0,0.4,0.5144508670520231,0.5609068938801836,0.09438228607177734,0.0
148,6,AdaBoost (Discrete),0,0.4,0.42196531791907516,0.44952457199775253,5.712201833724976,0.0
149,6,AdaBoost (Real),0,0.4,0.3699421965317919,0.39350306977436034,7.058088302612305,0.0
150,6,Logistic Regression (Penalty = L2),0,0.4,0.5202312138728323,0.32011247998491643,0.07536959648132324,0.0
151,6,Naive Bayes,0,0.4,0.15028901734104047,0.4083987700048726,0.04167461395263672,0.0
152,6,KNeighbors Classifier,1,0.4,0.5535714285714286,0.6070254078142937,0.04907798767089844,0.0
153,6,SVC Classifier,1,0.4,0.5119047619047619,1.0,0.03438973426818848,0.0
154,6,Decision Tree,1,0.4,0.5476190476190477,0.4238233608676524,0.002427339553833008,0.0
155,6,RandomForest,1,0.4,0.5476190476190477,0.7714463585878176,0.029906511306762695,0.0
156,6,AdaBoost (Discrete),1,0.4,0.35714285714285715,0.4219229585301854,5.0165581703186035,0.0
157,6,AdaBoost (Real),1,0.4,0.4880952380952381,0.38794902344426835,6.706765413284302,0.0
158,6,Logistic Regression (Penalty = L2),1,0.4,0.5357142857142857,0.4583034067124108,0.09337735176086426,0.0
159,6,Naive Bayes,1,0.4,0.13095238095238096,0.2768836613634595,0.02860546112060547,0.0
160,6,KNeighbors Classifier,2,0.4,0.6073619631901841,0.5347842186184047,0.0498044490814209,0.0
161,6,SVC Classifier,2,0.4,0.5153374233128835,1.0,0.05213618278503418,0.0
162,6,Decision Tree,2,0.4,0.5644171779141104,0.5830188059397176,0.025902271270751953,0.0
163,6,RandomForest,2,0.4,0.5214723926380368,0.3968502629920499,0.09478235244750977,0.0
164,6,AdaBoost (Discrete),2,0.4,0.4662576687116564,0.511996325513163,5.5493004322052,0.0
165,6,AdaBoost (Real),2,0.4,0.38650306748466257,0.3080246317405236,6.465856313705444,0.0
166,6,Logistic Regression (Penalty = L2),2,0.4,0.5398773006134969,0.4003748113271437,0.058037757873535156,0.0
167,6,Naive Bayes,2,0.4,0.15337423312883436,0.4044130307237591,0.03127145767211914,0.0
168,7,KNeighbors Classifier,0,0.4,0.6069364161849711,0.492372970169237,0.0712590217590332,0.0
169,7,SVC Classifier,0,0.4,0.49710982658959535,1.0,0.027655363082885742,0.0
170,7,Decision Tree,0,0.4,0.48554913294797686,0.5080374915359269,0.002229452133178711,0.0
171,7,RandomForest,0,0.4,0.5317919075144508,0.5253819788848316,0.07287859916687012,0.0
172,7,AdaBoost (Discrete),0,0.4,0.6127167630057804,0.6108291803048828,7.223850965499878,0.0
173,7,AdaBoost (Real),0,0.4,0.5549132947976878,0.5489621579621633,8.484070062637329,0.0
174,7,Logistic Regression (Penalty = L2),0,0.4,0.5086705202312138,0.6586337560083495,0.10315775871276855,0.0
175,7,Naive Bayes,0,0.4,0.2023121387283237,0.4752860940460637,0.06007504463195801,0.0
176,7,KNeighbors Classifier,1,0.4,0.6011904761904762,0.5133130697754771,0.06144070625305176,0.0
177,7,SVC Classifier,1,0.4,0.5119047619047619,1.0,0.03590202331542969,0.0
178,7,Decision Tree,1,0.4,0.5059523809523809,0.5963467561192187,0.026674985885620117,0.0
179,7,RandomForest,1,0.4,0.5476190476190477,0.4055885923038018,0.10669159889221191,0.0
180,7,AdaBoost (Discrete),1,0.4,0.6428571428571429,0.6239475908879053,6.932891368865967,0.0
181,7,AdaBoost (Real),1,0.4,0.5059523809523809,0.47428255855797885,8.220877885818481,0.0
182,7,Logistic Regression (Penalty = L2),1,0.4,0.5238095238095238,0.6933612743506347,0.11353611946105957,0.0
183,7,Naive Bayes,1,0.4,0.23809523809523808,0.460617288098025,0.04688310623168945,0.0
184,7,KNeighbors Classifier,2,0.4,0.6380368098159509,0.5339260033277423,0.060475826263427734,0.0
185,7,SVC Classifier,2,0.4,0.5153374233128835,1.0,0.03556227684020996,0.0
186,7,Decision Tree,2,0.4,0.49693251533742333,0.49452851495715616,0.003009796142578125,0.0
187,7,RandomForest,2,0.4,0.5521472392638037,0.5153701171292969,0.1003718376159668,0.0
188,7,AdaBoost (Discrete),2,0.4,0.656441717791411,0.5487591839512416,7.1939473152160645,0.0
189,7,AdaBoost (Real),2,0.4,0.49079754601226994,0.483569786146853,7.99042534828186,0.0
190,7,Logistic Regression (Penalty = L2),2,0.4,0.5276073619631901,0.790420734331125,0.10762572288513184,0.0
191,7,Naive Bayes,2,0.4,0.2392638036809816,0.5776950621154411,0.03451228141784668,0.0
192,8,KNeighbors Classifier,0,0.4,0.6184971098265896,0.5425499789548421,0.0733792781829834,0.0
193,8,SVC Classifier,0,0.4,0.49710982658959535,1.0,0.09131145477294922,0.0
194,8,Decision Tree,0,0.4,0.6011560693641619,0.6075198527436315,0.0186917781829834,0.0
195,8,RandomForest,0,0.4,0.5144508670520231,0.39165418135068353,0.09717988967895508,0.0
196,8,AdaBoost (Discrete),0,0.4,0.6647398843930635,0.621124979025503,6.4358766078948975,0.0
197,8,AdaBoost (Real),0,0.4,0.5780346820809249,0.6101041364194887,7.765211820602417,0.0
198,8,Logistic Regression (Penalty = L2),0,0.4,0.49710982658959535,1.0,0.07381486892700195,0.0
199,8,Naive Bayes,0,0.4,0.20809248554913296,0.47360737445036993,0.03883075714111328,0.0
200,8,KNeighbors Classifier,1,0.4,0.5952380952380952,0.5531373754856441,0.06777501106262207,0.0
201,8,SVC Classifier,1,0.4,0.5119047619047619,1.0,0.047563791275024414,0.0
202,8,Decision Tree,1,0.4,0.6190476190476191,0.6104538440523669,0.001981019973754883,0.0
203,8,RandomForest,1,0.4,0.5476190476190477,0.7989794494863394,0.09126567840576172,0.0
204,8,AdaBoost (Discrete),1,0.4,0.6607142857142857,0.5463768712433885,6.943949222564697,0.0
205,8,AdaBoost (Real),1,0.4,0.625,0.6463653910806957,7.530581474304199,0.0
206,8,Logistic Regression (Penalty = L2),1,0.4,0.5178571428571429,0.5503212081491045,0.07311558723449707,0.0
207,8,Naive Bayes,1,0.4,0.18452380952380953,0.3568681717731119,0.06315279006958008,0.0
208,8,KNeighbors Classifier,2,0.4,0.6380368098159509,0.5897852314825979,0.09987854957580566,0.0
209,8,SVC Classifier,2,0.4,0.5153374233128835,1.0,0.04645204544067383,0.0
210,8,Decision Tree,2,0.4,0.558282208588957,0.5901797866822696,0.002517223358154297,0.0
211,8,RandomForest,2,0.4,0.5214723926380368,0.5503212081491045,0.07030463218688965,0.0
212,8,AdaBoost (Discrete),2,0.4,0.7055214723926381,0.5999042866544649,6.675718784332275,0.0
213,8,AdaBoost (Real),2,0.4,0.5766871165644172,0.6037896546731552,7.952770471572876,0.0
214,8,Logistic Regression (Penalty = L2),2,0.4,0.5276073619631901,0.3194715521231362,0.11490368843078613,0.0
215,8,Naive Bayes,2,0.4,0.20245398773006135,0.35784620223965147,0.05757308006286621,0.0
216,9,KNeighbors Classifier,0,0.4,0.6820809248554913,0.6143040490655362,0.09449958801269531,0.0
217,9,SVC Classifier,0,0.4,0.49710982658959535,1.0,0.09510922431945801,0.0
218,9,Decision Tree,0,0.4,0.6820809248554913,0.618253598933532,0.0024919509887695312,0.0
219,9,RandomForest,0,0.4,0.5433526011560693,0.5635190098079903,0.0989222526550293,0.0
220,9,AdaBoost (Discrete),0,0.4,0.7052023121387283,0.6254140741207386,9.968957424163818,0.0
221,9,AdaBoost (Real),0,0.4,0.48554913294797686,0.5666905781659987,11.118367910385132,0.0
222,9,Logistic Regression (Penalty = L2),0,0.4,0.7225433526011561,0.6405886088390884,0.11942172050476074,0.0
223,9,Naive Bayes,0,0.4,0.2254335260115607,0.5200788422007236,0.0220639705657959,0.0
224,9,KNeighbors Classifier,1,0.4,0.6488095238095238,0.6057145581867923,0.10880708694458008,0.0
225,9,SVC Classifier,1,0.4,0.5119047619047619,1.0,0.053060054779052734,0.0
226,9,Decision Tree,1,0.4,0.6964285714285714,0.6562008048908757,0.020160913467407227,0.6562008048908757
227,9,RandomForest,1,0.4,0.5357142857142857,0.41412387656655203,0.07178759574890137,0.0
228,9,AdaBoost (Discrete),1,0.4,0.6428571428571429,0.6657074676128163,9.24214243888855,0.0
229,9,AdaBoost (Real),1,0.4,0.5654761904761905,0.7644828057292716,10.795982837677002,0.0
230,9,Logistic Regression (Penalty = L2),1,0.4,0.7916666666666666,0.8196898360977952,0.14531350135803223,0.0
231,9,Naive Bayes,1,0.4,0.27380952380952384,0.4694613937924024,0.03896069526672363,0.0
232,9,KNeighbors Classifier,2,0.4,0.6687116564417178,0.5379204406808569,0.07965540885925293,0.0
233,9,SVC Classifier,2,0.4,0.5153374233128835,1.0,0.06148028373718262,0.0
234,9,Decision Tree,2,0.4,0.5644171779141104,0.612798704908493,0.0029172897338867188,0.0
235,9,RandomForest,2,0.4,0.5644171779141104,0.6223329772884784,0.07425212860107422,0.0
236,9,AdaBoost (Discrete),2,0.4,0.7361963190184049,0.7644274114406352,8.733317375183105,0.0
237,9,AdaBoost (Real),2,0.4,0.5950920245398773,0.738361509265458,10.055113554000854,0.0
238,9,Logistic Regression (Penalty = L2),2,0.4,0.7177914110429447,0.6426272281497,0.22222352027893066,0.0
239,9,Naive Bayes,2,0.4,0.25766871165644173,0.5139842808146773,0.05514669418334961,0.0
240,10,KNeighbors Classifier,0,0.4,0.6878612716763006,0.6149981867921818,0.14701342582702637,0.0
241,10,SVC Classifier,0,0.4,0.49710982658959535,1.0,0.14098906517028809,0.0
242,10,Decision Tree,0,0.4,0.5722543352601156,0.5153324857195613,0.004539012908935547,0.0
243,10,RandomForest,0,0.4,0.5491329479768786,0.6042750794713536,0.07488608360290527,0.0
244,10,AdaBoost (Discrete),0,0.4,0.7109826589595376,0.5159571439980287,11.320323467254639,0.0
245,10,AdaBoost (Real),0,0.4,0.6473988439306358,0.6685331329786829,11.649986028671265,0.0
246,10,Logistic Regression (Penalty = L2),0,0.4,0.7167630057803468,0.6046351328797168,0.18085503578186035,0.0
247,10,Naive Bayes,0,0.4,0.2543352601156069,0.45254764256607427,0.07883477210998535,0.0
248,10,KNeighbors Classifier,1,0.4,0.6547619047619048,0.6064518987195775,0.16864919662475586,0.0
249,10,SVC Classifier,1,0.4,0.5119047619047619,1.0,0.22555947303771973,0.0
250,10,Decision Tree,1,0.4,0.6130952380952381,0.7302027095909988,0.03666496276855469,0.0
251,10,RandomForest,1,0.4,0.5714285714285714,0.7036147891341804,0.12865757942199707,0.0
252,10,AdaBoost (Discrete),1,0.4,0.7202380952380952,0.6914866874952798,12.007231950759888,0.0
253,10,AdaBoost (Real),1,0.4,0.6130952380952381,0.616695678557162,11.097383975982666,0.0
254,10,Logistic Regression (Penalty = L2),1,0.4,0.7857142857142857,0.8187855870852497,0.17154479026794434,0.0
255,10,Naive Bayes,1,0.4,0.25595238095238093,0.5067764615122725,0.048316240310668945,0.0
256,10,KNeighbors Classifier,2,0.4,0.6687116564417178,0.5379204406808569,0.12982892990112305,0.0
257,10,SVC Classifier,2,0.4,0.5153374233128835,1.0,0.12601757049560547,0.0
258,10,Decision Tree,2,0.4,0.6012269938650306,0.614023952230454,0.021008968353271484,0.0
259,10,RandomForest,2,0.4,0.5644171779141104,0.5946035575013605,0.08944559097290039,0.0
260,10,AdaBoost (Discrete),2,0.4,0.7423312883435583,0.7242634408216558,10.035967111587524,0.0
261,10,AdaBoost (Real),2,0.4,0.5337423312883436,0.7397732157306172,11.018146276473999,0.0
262,10,Logistic Regression (Penalty = L2),2,0.4,0.7361963190184049,0.6661711940736671,0.1507549285888672,0.0
263,10,Naive Bayes,2,0.4,0.294478527607362,0.46371627097572204,0.032959699630737305,0.46371627097572204
264,11,KNeighbors Classifier,0,0.4,0.6416184971098265,0.5396865908125352,0.17477202415466309,0.0
265,11,SVC Classifier,0,0.4,0.49710982658959535,1.0,0.12191104888916016,0.0
266,11,Decision Tree,0,0.4,0.630057803468208,0.605546189480736,0.006262063980102539,0.0
267,11,RandomForest,0,0.4,0.5606936416184971,0.7186082239261684,0.07500386238098145,0.0
268,11,AdaBoost (Discrete),0,0.4,0.7398843930635838,0.6048697531482128,13.910757780075073,0.0
269,11,AdaBoost (Real),0,0.4,0.5953757225433526,0.7335231009510449,13.974786043167114,0.0
270,11,Logistic Regression (Penalty = L2),0,0.4,0.6936416184971098,0.5851519990642929,0.3070197105407715,0.0
271,11,Naive Bayes,0,0.4,0.24855491329479767,0.4697810491332156,0.06294822692871094,0.0
272,11,KNeighbors Classifier,1,0.4,0.6369047619047619,0.5106236723975031,0.1904163360595703,0.0
273,11,SVC Classifier,1,0.4,0.5119047619047619,1.0,0.25179147720336914,0.0
274,11,Decision Tree,1,0.4,0.6607142857142857,0.6262304383442163,0.028237104415893555,0.6262304383442163
275,11,RandomForest,1,0.4,0.5714285714285714,0.4966753529735609,0.07212138175964355,0.0
276,11,AdaBoost (Discrete),1,0.4,0.7142857142857143,0.6910851253854141,13.027788162231445,0.0
277,11,AdaBoost (Real),1,0.4,0.6428571428571429,0.6377249697546198,14.47552490234375,0.0
278,11,Logistic Regression (Penalty = L2),1,0.4,0.7678571428571429,0.754201980215964,0.345778226852417,0.0
279,11,Naive Bayes,1,0.4,0.25,0.4181698984778722,0.08150100708007812,0.0
280,11,KNeighbors Classifier,2,0.4,0.6748466257668712,0.7842056825471956,0.1753978729248047,0.0
281,11,SVC Classifier,2,0.4,0.5153374233128835,1.0,0.2161874771118164,0.0
282,11,Decision Tree,2,0.4,0.6871165644171779,0.6638378366765971,0.022341012954711914,0.6638378366765971
283,11,RandomForest,2,0.4,0.5828220858895705,0.6759294760097763,0.07649636268615723,0.0
284,11,AdaBoost (Discrete),2,0.4,0.7423312883435583,0.6728920809522865,14.069732427597046,0.0
285,11,AdaBoost (Real),2,0.4,0.6012269938650306,0.8019137850600888,13.811697959899902,0.0
286,11,Logistic Regression (Penalty = L2),2,0.4,0.7607361963190185,0.7868521845254639,0.28577089309692383,0.0
287,11,Naive Bayes,2,0.4,0.27607361963190186,0.463331307464678,0.06489896774291992,0.0
288,12,KNeighbors Classifier,0,0.4,0.10982658959537572,1.0,0.030457258224487305,0.0
289,12,SVC Classifier,0,0.4,0.47398843930635837,1.0,0.02118992805480957,0.0
290,12,Decision Tree,0,0.4,0.49710982658959535,1.0,0.0012121200561523438,0.0
291,12,RandomForest,0,0.4,0.49710982658959535,1.0,0.07347989082336426,0.0
292,12,AdaBoost (Discrete),0,0.4,0.49710982658959535,1.0,3.5203959941864014,0.0
293,12,AdaBoost (Real),0,0.4,0.49710982658959535,1.0,5.0682854652404785,0.0
294,12,Logistic Regression (Penalty = L2),0,0.4,0.49710982658959535,1.0,0.005835771560668945,0.0
295,12,Naive Bayes,0,0.4,0.12138728323699421,1.0,0.006791830062866211,0.0
296,12,KNeighbors Classifier,1,0.4,0.5119047619047619,1.0,0.0202028751373291,0.0
297,12,SVC Classifier,1,0.4,0.4880952380952381,1.0,0.023482561111450195,0.0
298,12,Decision Tree,1,0.4,0.5,0.9877295966495896,0.001112222671508789,0.0
299,12,RandomForest,1,0.4,0.5119047619047619,1.0,0.08746767044067383,0.0
300,12,AdaBoost (Discrete),1,0.4,0.5,0.9877295966495896,3.7536351680755615,0.0
301,12,AdaBoost (Real),1,0.4,0.5,0.9877295966495896,4.4399542808532715,0.0
302,12,Logistic Regression (Penalty = L2),1,0.4,0.5119047619047619,1.0,0.01822638511657715,0.0
303,12,Naive Bayes,1,0.4,0.125,1.0,0.016514062881469727,0.0
304,12,KNeighbors Classifier,2,0.4,0.50920245398773,0.9938079899999065,0.015930891036987305,0.0
305,12,SVC Classifier,2,0.4,0.49693251533742333,1.0,0.004369497299194336,0.0
306,12,Decision Tree,2,0.4,0.5153374233128835,1.0,0.0016241073608398438,0.0
307,12,RandomForest,2,0.4,0.5030674846625767,0.9875771574795099,0.05199909210205078,0.0
308,12,AdaBoost (Discrete),2,0.4,0.50920245398773,0.9938079899999065,3.1637566089630127,0.0
309,12,AdaBoost (Real),2,0.4,0.5153374233128835,1.0,4.406390905380249,0.0
310,12,Logistic Regression (Penalty = L2),2,0.4,0.5153374233128835,1.0,0.01799464225769043,0.0
311,12,Naive Bayes,2,0.4,0.1165644171779141,1.0,0.016923904418945312,0.0
