,feat_set_id,classifier,fold_id,feat_th,score,geo_score,exec_t,geo_score_woz
0,0,KNeighbors Classifier,0,0.95,0.785242951409718,0.7851985070538184,42.649817943573,0.7851985070538184
1,0,SVC Classifier,0,0.95,0.847630473905219,0.8417834230769768,37.51902985572815,0.8417834230769768
2,0,Decision Tree,0,0.95,0.7162567486502699,0.7157237125069394,1.342876672744751,0.7157237125069394
3,0,RandomForest,0,0.95,0.7666466706658668,0.7572304292339831,2.452692747116089,0.7572304292339831
4,0,AdaBoost (Discrete),0,0.95,0.8344331133773245,0.8343078048604928,535.0203921794891,0.8343078048604928
5,0,AdaBoost (Real),0,0.95,0.826634673065387,0.8263047092333344,542.9295887947083,0.8263047092333344
6,0,Logistic Regression (Penalty = L2),0,0.95,0.8692261547690462,0.8690518560062849,1.5862576961517334,0.8690518560062849
7,0,Naive Bayes,0,0.95,0.8008398320335933,0.7757503066734448,0.38114261627197266,0.7757503066734448
8,0,KNeighbors Classifier,1,0.95,0.7708458308338332,0.7700815992024223,26.390689373016357,0.7700815992024223
9,0,SVC Classifier,1,0.95,0.8470305938812237,0.8420256592322198,23.100295066833496,0.8420256592322198
10,0,Decision Tree,1,0.95,0.7288542291541692,0.7286447898070416,0.7646284103393555,0.7286447898070416
11,0,RandomForest,1,0.95,0.7594481103779244,0.7534554286287859,1.5377745628356934,0.7534554286287859
12,0,AdaBoost (Discrete),1,0.95,0.8194361127774445,0.8193729651592702,415.75317120552063,0.8193729651592702
13,0,AdaBoost (Real),1,0.95,0.8170365926814637,0.8158506305801435,462.1539046764374,0.8158506305801435
14,0,Logistic Regression (Penalty = L2),1,0.95,0.8602279544091181,0.8602373351012057,1.854344129562378,0.8602373351012057
15,0,Naive Bayes,1,0.95,0.7960407918416317,0.7718607264120017,0.3845663070678711,0.7718607264120017
16,0,KNeighbors Classifier,2,0.95,0.78031212484994,0.780132635018967,37.16437602043152,0.780132635018967
17,0,SVC Classifier,2,0.95,0.8613445378151261,0.8557377993230431,28.787166595458984,0.8557377993230431
18,0,Decision Tree,2,0.95,0.7406962785114045,0.7404299123161321,0.7776010036468506,0.7404299123161321
19,0,RandomForest,2,0.95,0.7521008403361344,0.7264387840269526,2.0370476245880127,0.7264387840269526
20,0,AdaBoost (Discrete),2,0.95,0.8547418967587035,0.8536874202572377,526.1956357955933,0.8536874202572377
21,0,AdaBoost (Real),2,0.95,0.8475390156062425,0.8463479612146468,560.1148173809052,0.8463479612146468
22,0,Logistic Regression (Penalty = L2),2,0.95,0.8739495798319328,0.8738782400868799,2.1379945278167725,0.8738782400868799
23,0,Naive Bayes,2,0.95,0.8055222088835534,0.7782881629786348,0.44757604598999023,0.7782881629786348
24,1,KNeighbors Classifier,0,0.95,0.7774445110977805,0.7774201724980417,43.60764288902283,0.7774201724980417
25,1,SVC Classifier,0,0.95,0.8446310737852429,0.8383427859636089,34.30165982246399,0.8383427859636089
26,1,Decision Tree,0,0.95,0.728254349130174,0.7282638076140092,0.8691549301147461,0.7282638076140092
27,1,RandomForest,0,0.95,0.7666466706658668,0.7572304292339831,2.1928234100341797,0.7572304292339831
28,1,AdaBoost (Discrete),0,0.95,0.8362327534493101,0.8357768416724183,556.7372877597809,0.8357768416724183
29,1,AdaBoost (Real),0,0.95,0.8152369526094781,0.8142438110102278,580.657087802887,0.8142438110102278
30,1,Logistic Regression (Penalty = L2),0,0.95,0.8674265146970606,0.867192807850592,2.0993075370788574,0.867192807850592
31,1,Naive Bayes,0,0.95,0.7996400719856028,0.7740109503740417,0.36547088623046875,0.7740109503740417
32,1,KNeighbors Classifier,1,0.95,0.7762447510497901,0.7760347915170294,43.239383935928345,0.7760347915170294
33,1,SVC Classifier,1,0.95,0.8470305938812237,0.8420256592322198,36.75424766540527,0.8420256592322198
34,1,Decision Tree,1,0.95,0.728254349130174,0.728209725940885,1.0643832683563232,0.728209725940885
35,1,RandomForest,1,0.95,0.7600479904019196,0.7539815848253606,2.3290817737579346,0.7539815848253606
36,1,AdaBoost (Discrete),1,0.95,0.8278344331133773,0.8277855606702,525.8435699939728,0.8277855606702
37,1,AdaBoost (Real),1,0.95,0.8224355128974206,0.8216529468274012,555.1361455917358,0.8216529468274012
38,1,Logistic Regression (Penalty = L2),1,0.95,0.8560287942411517,0.85598514772429,2.3760805130004883,0.85598514772429
39,1,Naive Bayes,1,0.95,0.7948410317936413,0.7704960577147406,0.4508528709411621,0.7704960577147406
40,1,KNeighbors Classifier,2,0.95,0.7869147659063626,0.7863133309860519,54.26148176193237,0.7863133309860519
41,1,SVC Classifier,2,0.95,0.8571428571428571,0.850919308674098,42.00485062599182,0.850919308674098
42,1,Decision Tree,2,0.95,0.7172869147659063,0.717074670121087,1.2106447219848633,0.717074670121087
43,1,RandomForest,2,0.95,0.7527010804321729,0.7265419556443369,2.3831238746643066,0.7265419556443369
44,1,AdaBoost (Discrete),2,0.95,0.8469387755102041,0.8461907793815111,534.7518002986908,0.8461907793815111
45,1,AdaBoost (Real),2,0.95,0.8433373349339736,0.8419039729689897,545.9333736896515,0.8419039729689897
46,1,Logistic Regression (Penalty = L2),2,0.95,0.8739495798319328,0.8739228376572293,1.830561637878418,0.8739228376572293
47,1,Naive Bayes,2,0.95,0.8037214885954381,0.776418192424226,0.23997926712036133,0.776418192424226
48,2,KNeighbors Classifier,0,0.95,0.7774445110977805,0.7774092409321349,38.83352255821228,0.7774092409321349
49,2,SVC Classifier,0,0.95,0.8452309538092382,0.8389092339643077,31.41491389274597,0.8389092339643077
50,2,Decision Tree,0,0.95,0.7246550689862028,0.7246458746929929,0.9925587177276611,0.7246458746929929
51,2,RandomForest,0,0.95,0.7666466706658668,0.7572304292339831,1.9695994853973389,0.7572304292339831
52,2,AdaBoost (Discrete),0,0.95,0.8272345530893821,0.827268901404316,510.72765946388245,0.827268901404316
53,2,AdaBoost (Real),0,0.95,0.8362327534493101,0.8354595664772007,523.603024482727,0.8354595664772007
54,2,Logistic Regression (Penalty = L2),0,0.95,0.8668266346730654,0.8666260182489298,2.1424527168273926,0.8666260182489298
55,2,Naive Bayes,0,0.95,0.7996400719856028,0.7740109503740417,0.4109783172607422,0.7740109503740417
56,2,KNeighbors Classifier,1,0.95,0.7684463107378524,0.7677409112100735,47.438379764556885,0.7677409112100735
57,2,SVC Classifier,1,0.95,0.847630473905219,0.8427267633523268,35.18310832977295,0.8427267633523268
58,2,Decision Tree,1,0.95,0.728254349130174,0.7282651265788658,1.0552339553833008,0.7282651265788658
59,2,RandomForest,1,0.95,0.7594481103779244,0.7534554286287859,2.457188606262207,0.7534554286287859
60,2,AdaBoost (Discrete),1,0.95,0.823635272945411,0.8234118081317929,1470.941662788391,0.8234118081317929
61,2,AdaBoost (Real),1,0.95,0.8242351529694061,0.8234297603064075,389.88650012016296,0.8234297603064075
62,2,Logistic Regression (Penalty = L2),1,0.95,0.8572285542891421,0.8571723788609137,1.407315969467163,0.8571723788609137
63,2,Naive Bayes,1,0.95,0.7960407918416317,0.7718607264120017,0.33312106132507324,0.7718607264120017
64,2,KNeighbors Classifier,2,0.95,0.7899159663865546,0.7891998552635963,28.574739694595337,0.7891998552635963
65,2,SVC Classifier,2,0.95,0.8613445378151261,0.8554232546751819,22.928131341934204,0.8554232546751819
66,2,Decision Tree,2,0.95,0.734093637454982,0.733867868156586,0.7737298011779785,0.733867868156586
67,2,RandomForest,2,0.95,0.7521008403361344,0.7264387840269526,1.3247945308685303,0.7264387840269526
68,2,AdaBoost (Discrete),2,0.95,0.8535414165666266,0.8533165566267553,346.7450096607208,0.8533165566267553
69,2,AdaBoost (Real),2,0.95,0.8535414165666266,0.8528329397278798,353.3709557056427,0.8528329397278798
70,2,Logistic Regression (Penalty = L2),2,0.95,0.8775510204081632,0.8774972931167931,1.3243377208709717,0.8774972931167931
71,2,Naive Bayes,2,0.95,0.8067226890756303,0.7792808785482614,0.1916213035583496,0.7792808785482614
72,3,KNeighbors Classifier,0,0.95,0.7738452309538092,0.7738498313374087,23.9494571685791,0.7738498313374087
73,3,SVC Classifier,0,0.95,0.8470305938812237,0.8410438722606857,19.506426095962524,0.8410438722606857
74,3,Decision Tree,0,0.95,0.7168566286742651,0.7167695425768279,0.6029903888702393,0.7167695425768279
75,3,RandomForest,0,0.95,0.7630473905218956,0.7588607913690067,1.3419432640075684,0.7588607913690067
76,3,AdaBoost (Discrete),0,0.95,0.8326334733053389,0.8326071863339982,310.90075397491455,0.8326071863339982
77,3,AdaBoost (Real),0,0.95,0.8254349130173965,0.8249017414331974,306.7285261154175,0.8249017414331974
78,3,Logistic Regression (Penalty = L2),0,0.95,0.8650269946010798,0.8648372209578324,1.068880319595337,0.8648372209578324
79,3,Naive Bayes,0,0.95,0.8014397120575885,0.7766170675136072,0.20716333389282227,0.7766170675136072
80,3,KNeighbors Classifier,1,0.95,0.7900419916016796,0.789526276863268,21.16667366027832,0.789526276863268
81,3,SVC Classifier,1,0.95,0.8494301139772046,0.844677920839355,18.072623014450073,0.844677920839355
82,3,Decision Tree,1,0.95,0.6928614277144571,0.6922705153341113,0.5514805316925049,0.6922705153341113
83,3,RandomForest,1,0.95,0.7510497900419916,0.7299562611012894,1.2037968635559082,0.7299562611012894
84,3,AdaBoost (Discrete),1,0.95,0.8302339532093581,0.8294215563166164,256.27253103256226,0.8294215563166164
85,3,AdaBoost (Real),1,0.95,0.8230353929214157,0.8219893052460042,276.18124079704285,0.8219893052460042
86,3,Logistic Regression (Penalty = L2),1,0.95,0.859628074385123,0.8596331089001539,1.1884753704071045,0.8596331089001539
87,3,Naive Bayes,1,0.95,0.7948410317936413,0.7701300911738364,0.21404194831848145,0.7701300911738364
88,3,KNeighbors Classifier,2,0.95,0.790516206482593,0.7899537700433021,20.89890456199646,0.7899537700433021
89,3,SVC Classifier,2,0.95,0.8589435774309724,0.8530573058736676,16.04906725883484,0.8530573058736676
90,3,Decision Tree,2,0.95,0.7166866746698679,0.7166387593480159,0.5034701824188232,0.7166387593480159
91,3,RandomForest,2,0.95,0.7611044417767107,0.7380773067829784,1.1008760929107666,0.7380773067829784
92,3,AdaBoost (Discrete),2,0.95,0.8457382953181273,0.8452583722776563,258.94646668434143,0.8452583722776563
93,3,AdaBoost (Real),2,0.95,0.8433373349339736,0.8414816431300143,280.11257457733154,0.8414816431300143
94,3,Logistic Regression (Penalty = L2),2,0.95,0.8727490996398559,0.8726899979829166,1.0708444118499756,0.8726899979829166
95,3,Naive Bayes,2,0.95,0.8043217286914766,0.7773004865838282,0.16871953010559082,0.7773004865838282
96,4,KNeighbors Classifier,0,0.95,0.794241151769646,0.7941223705900463,19.18266272544861,0.7941223705900463
97,4,SVC Classifier,0,0.95,0.8464307138572286,0.8403638867864077,17.888946294784546,0.8403638867864077
98,4,Decision Tree,0,0.95,0.7354529094181164,0.7354583806266856,0.4720296859741211,0.7354583806266856
99,4,RandomForest,0,0.95,0.7630473905218956,0.7588607913690067,1.1881904602050781,0.7588607913690067
100,4,AdaBoost (Discrete),0,0.95,0.829634073185363,0.8296638369839693,259.88580417633057,0.8296638369839693
101,4,AdaBoost (Real),0,0.95,0.8242351529694061,0.8240624755897588,284.0010542869568,0.8240624755897588
102,4,Logistic Regression (Penalty = L2),0,0.95,0.8680263947210558,0.8678329230641623,1.1160361766815186,0.8678329230641623
103,4,Naive Bayes,0,0.95,0.7996400719856028,0.7740109503740417,0.1980447769165039,0.7740109503740417
104,4,KNeighbors Classifier,1,0.95,0.7780443911217756,0.7777317343315664,23.233070611953735,0.7777317343315664
105,4,SVC Classifier,1,0.95,0.8464307138572286,0.8413233856293235,18.88081431388855,0.8413233856293235
106,4,Decision Tree,1,0.95,0.7150569886022795,0.7150575567197763,0.4791288375854492,0.7150575567197763
107,4,RandomForest,1,0.95,0.7510497900419916,0.7299562611012894,1.0124585628509521,0.7299562611012894
108,4,AdaBoost (Discrete),1,0.95,0.8164367126574685,0.815918964155477,263.7676091194153,0.815918964155477
109,4,AdaBoost (Real),1,0.95,0.8254349130173965,0.8251392000786889,302.29663252830505,0.8251392000786889
110,4,Logistic Regression (Penalty = L2),1,0.95,0.859628074385123,0.8596293933191352,1.2880675792694092,0.8596293933191352
111,4,Naive Bayes,1,0.95,0.794241151769646,0.769261849072246,0.19472146034240723,0.769261849072246
112,4,KNeighbors Classifier,2,0.95,0.7971188475390156,0.7967100247575365,26.040688276290894,0.7967100247575365
113,4,SVC Classifier,2,0.95,0.8625450180072028,0.8571500034459595,22.32146453857422,0.8571500034459595
114,4,Decision Tree,2,0.95,0.7382953181272509,0.7383385794432569,0.6808054447174072,0.7383385794432569
115,4,RandomForest,2,0.95,0.7617046818727491,0.7385800760758982,1.3036389350891113,0.7385800760758982
116,4,AdaBoost (Discrete),2,0.95,0.8565426170468188,0.8560082718322622,300.23859429359436,0.8560082718322622
117,4,AdaBoost (Real),2,0.95,0.8427370948379351,0.8406825703735313,312.31802225112915,0.8406825703735313
118,4,Logistic Regression (Penalty = L2),2,0.95,0.8769507803121248,0.8768836584459584,1.1787586212158203,0.8768836584459584
119,4,Naive Bayes,2,0.95,0.8061224489795918,0.7787848371166163,0.18306732177734375,0.7787848371166163
120,5,KNeighbors Classifier,0,0.95,0.7678464307138573,0.7678806922668701,24.075286865234375,0.7678806922668701
121,5,SVC Classifier,0,0.95,0.8446310737852429,0.8381952683139045,20.10449743270874,0.8381952683139045
122,5,Decision Tree,0,0.95,0.7324535092981403,0.732490263493914,0.7048935890197754,0.732490263493914
123,5,RandomForest,0,0.95,0.7624475104979004,0.7583128772497276,1.4374775886535645,0.7583128772497276
124,5,AdaBoost (Discrete),0,0.95,0.829634073185363,0.8295072348023632,291.74044966697693,0.8295072348023632
125,5,AdaBoost (Real),0,0.95,0.8290341931613677,0.8287566018987526,310.8442134857178,0.8287566018987526
126,5,Logistic Regression (Penalty = L2),0,0.95,0.8662267546490702,0.8659421748482475,1.150604009628296,0.8659421748482475
127,5,Naive Bayes,0,0.95,0.7978404319136173,0.7717566737780639,0.2795553207397461,0.7717566737780639
128,5,KNeighbors Classifier,1,0.95,0.7924415116976604,0.7915748452715111,23.825995922088623,0.7915748452715111
129,5,SVC Classifier,1,0.95,0.8482303539292142,0.8434190161039898,20.17251753807068,0.8434190161039898
130,5,Decision Tree,1,0.95,0.7006598680263947,0.7004189062978351,0.5169510841369629,0.7004189062978351
131,5,RandomForest,1,0.95,0.7510497900419916,0.7292545423972027,1.341020107269287,0.7292545423972027
132,5,AdaBoost (Discrete),1,0.95,0.8242351529694061,0.824011154850919,275.0866358280182,0.824011154850919
133,5,AdaBoost (Real),1,0.95,0.8224355128974206,0.8216239874923055,287.1270101070404,0.8216239874923055
134,5,Logistic Regression (Penalty = L2),1,0.95,0.8560287942411517,0.8559876193981497,1.1905264854431152,0.8559876193981497
135,5,Naive Bayes,1,0.95,0.7966406718656269,0.7727231413488156,0.26258420944213867,0.7727231413488156
136,5,KNeighbors Classifier,2,0.95,0.7953181272509003,0.7945836082322019,22.191389083862305,0.7945836082322019
137,5,SVC Classifier,2,0.95,0.8607442977190877,0.854383574455587,18.03906011581421,0.854383574455587
138,5,Decision Tree,2,0.95,0.7208883553421368,0.7208711743571286,0.4888901710510254,0.7208711743571286
139,5,RandomForest,2,0.95,0.7611044417767107,0.7380793436674423,1.21848464012146,0.7380793436674423
140,5,AdaBoost (Discrete),2,0.95,0.8547418967587035,0.8538904810450015,271.1486237049103,0.8538904810450015
141,5,AdaBoost (Real),2,0.95,0.8451380552220888,0.8433407734385809,280.8818573951721,0.8433407734385809
142,5,Logistic Regression (Penalty = L2),2,0.95,0.8793517406962785,0.8792748531906396,1.0305390357971191,0.8792748531906396
143,5,Naive Bayes,2,0.95,0.8055222088835534,0.7782881629786348,0.27391648292541504,0.7782881629786348
144,6,KNeighbors Classifier,0,0.95,0.7840431913617276,0.7837489203171676,23.121690273284912,0.7837489203171676
145,6,SVC Classifier,0,0.95,0.8458308338332333,0.8395894872696271,18.784913063049316,0.8395894872696271
146,6,Decision Tree,0,0.95,0.6994601079784043,0.6990985262860808,0.535064697265625,0.6990985262860808
147,6,RandomForest,0,0.95,0.7828434313137372,0.7794595578970417,1.1681187152862549,0.7794595578970417
148,6,AdaBoost (Discrete),0,0.95,0.8392321535692862,0.8392505192319132,263.70453667640686,0.8392505192319132
149,6,AdaBoost (Real),0,0.95,0.8302339532093581,0.8297066872956076,273.28587317466736,0.8297066872956076
150,6,Logistic Regression (Penalty = L2),0,0.95,0.8674265146970606,0.8672644951320224,1.008030652999878,0.8672644951320224
151,6,Naive Bayes,0,0.95,0.8002399520095981,0.7748816045955451,0.2430248260498047,0.7748816045955451
152,6,KNeighbors Classifier,1,0.95,0.7756448710257948,0.7753556022946306,21.369255304336548,0.7753556022946306
153,6,SVC Classifier,1,0.95,0.847630473905219,0.8428739984266588,16.990015268325806,0.8428739984266588
154,6,Decision Tree,1,0.95,0.6988602279544092,0.6985427987162417,0.49254822731018066,0.6985427987162417
155,6,RandomForest,1,0.95,0.7558488302339532,0.7508261666234098,1.0563976764678955,0.7508261666234098
156,6,AdaBoost (Discrete),1,0.95,0.829634073185363,0.8293449797479536,244.44839477539062,0.8293449797479536
157,6,AdaBoost (Real),1,0.95,0.8188362327534493,0.8183010085732035,245.12562704086304,0.8183010085732035
158,6,Logistic Regression (Penalty = L2),1,0.95,0.8554289142171566,0.8553940078212201,0.9106872081756592,0.8553940078212201
159,6,Naive Bayes,1,0.95,0.7960407918416317,0.7722216985465098,0.19245100021362305,0.7722216985465098
160,6,KNeighbors Classifier,2,0.95,0.7881152460984394,0.7878673849869081,18.46496605873108,0.7878673849869081
161,6,SVC Classifier,2,0.95,0.8601440576230492,0.8543187689347056,15.07981562614441,0.8543187689347056
162,6,Decision Tree,2,0.95,0.7232893157262905,0.7230511080328798,0.36211633682250977,0.7230511080328798
163,6,RandomForest,2,0.95,0.7971188475390156,0.7907648114446229,0.7761728763580322,0.7907648114446229
164,6,AdaBoost (Discrete),2,0.95,0.858343337334934,0.8579666129066809,216.6524167060852,0.8579666129066809
165,6,AdaBoost (Real),2,0.95,0.8373349339735895,0.8355825992348509,239.25999665260315,0.8355825992348509
166,6,Logistic Regression (Penalty = L2),2,0.95,0.8739495798319328,0.873930132505624,0.9857845306396484,0.873930132505624
167,6,Naive Bayes,2,0.95,0.8055222088835534,0.7779008581081963,0.1725919246673584,0.7779008581081963
168,7,KNeighbors Classifier,0,0.95,0.7840431913617276,0.7837489203171676,19.138579607009888,0.7837489203171676
169,7,SVC Classifier,0,0.95,0.8458308338332333,0.8395894872696271,15.034162282943726,0.8395894872696271
170,7,Decision Tree,0,0.95,0.6946610677864428,0.694689222682756,0.41526365280151367,0.694689222682756
171,7,RandomForest,0,0.95,0.7828434313137372,0.7794595578970417,0.8328516483306885,0.7794595578970417
172,7,AdaBoost (Discrete),0,0.95,0.8392321535692862,0.8392505192319132,202.49293565750122,0.8392505192319132
173,7,AdaBoost (Real),0,0.95,0.8290341931613677,0.8287293110827385,203.95138573646545,0.8287293110827385
174,7,Logistic Regression (Penalty = L2),0,0.95,0.8674265146970606,0.8672644951320224,0.8511168956756592,0.8672644951320224
175,7,Naive Bayes,0,0.95,0.8002399520095981,0.7748816045955451,0.18727707862854004,0.7748816045955451
176,7,KNeighbors Classifier,1,0.95,0.7756448710257948,0.7753556022946306,14.82384705543518,0.7753556022946306
177,7,SVC Classifier,1,0.95,0.847630473905219,0.8428739984266588,12.018343687057495,0.8428739984266588
178,7,Decision Tree,1,0.95,0.7138572285542891,0.7137582645768636,0.37402987480163574,0.7137582645768636
179,7,RandomForest,1,0.95,0.7558488302339532,0.7508261666234098,0.6799864768981934,0.7508261666234098
180,7,AdaBoost (Discrete),1,0.95,0.8302339532093581,0.8299229206874323,173.8883798122406,0.8299229206874323
181,7,AdaBoost (Real),1,0.95,0.8206358728254349,0.8200174271556883,180.55362105369568,0.8200174271556883
182,7,Logistic Regression (Penalty = L2),1,0.95,0.8554289142171566,0.8553940078212201,0.6828739643096924,0.8553940078212201
183,7,Naive Bayes,1,0.95,0.7960407918416317,0.7722216985465098,0.16310358047485352,0.7722216985465098
184,7,KNeighbors Classifier,2,0.95,0.7881152460984394,0.7878673849869081,14.05241847038269,0.7878673849869081
185,7,SVC Classifier,2,0.95,0.8601440576230492,0.8543187689347056,12.44292426109314,0.8543187689347056
186,7,Decision Tree,2,0.95,0.7160864345738295,0.7156935322372212,0.33562326431274414,0.7156935322372212
187,7,RandomForest,2,0.95,0.7971188475390156,0.7907648114446229,0.6622591018676758,0.7907648114446229
188,7,AdaBoost (Discrete),2,0.95,0.858343337334934,0.8579666129066809,162.0710952281952,0.8579666129066809
189,7,AdaBoost (Real),2,0.95,0.8469387755102041,0.8454241672598407,156.86466431617737,0.8454241672598407
190,7,Logistic Regression (Penalty = L2),2,0.95,0.8739495798319328,0.873930132505624,0.7027573585510254,0.873930132505624
191,7,Naive Bayes,2,0.95,0.8055222088835534,0.7779008581081963,0.13108062744140625,0.7779008581081963
192,8,KNeighbors Classifier,0,0.95,0.7804439112177565,0.7804376042895694,11.583166122436523,0.7804376042895694
193,8,SVC Classifier,0,0.95,0.8458308338332333,0.8396219864175825,8.959495306015015,0.8396219864175825
194,8,Decision Tree,0,0.95,0.7354529094181164,0.7353541268325853,0.26082873344421387,0.7353541268325853
195,8,RandomForest,0,0.95,0.752249550089982,0.7366715661168082,0.554959774017334,0.7366715661168082
196,8,AdaBoost (Discrete),0,0.95,0.8206358728254349,0.8205754369948063,135.39044523239136,0.8205754369948063
197,8,AdaBoost (Real),0,0.95,0.8344331133773245,0.8342878303388382,134.84730458259583,0.8342878303388382
198,8,Logistic Regression (Penalty = L2),0,0.95,0.865626874625075,0.8654514521451079,0.531745433807373,0.8654514521451079
199,8,Naive Bayes,0,0.95,0.8002399520095981,0.7748816045955451,0.14150643348693848,0.7748816045955451
200,8,KNeighbors Classifier,1,0.95,0.7822435512897421,0.7818805907348125,9.311163187026978,0.7818805907348125
201,8,SVC Classifier,1,0.95,0.847630473905219,0.8425767233026276,7.99057149887085,0.8425767233026276
202,8,Decision Tree,1,0.95,0.7216556688662268,0.7211636895651129,0.1703507900238037,0.7211636895651129
203,8,RandomForest,1,0.95,0.7456508698260348,0.7250471686168793,0.48142123222351074,0.7250471686168793
204,8,AdaBoost (Discrete),1,0.95,0.8218356328734253,0.8217078347236245,121.92785501480103,0.8217078347236245
205,8,AdaBoost (Real),1,0.95,0.8278344331133773,0.8276758920145093,121.95492506027222,0.8276758920145093
206,8,Logistic Regression (Penalty = L2),1,0.95,0.8614277144571085,0.8614430590753597,0.5728471279144287,0.8614430590753597
207,8,Naive Bayes,1,0.95,0.7960407918416317,0.7718607264120017,0.15531635284423828,0.7718607264120017
208,8,KNeighbors Classifier,2,0.95,0.7923169267707083,0.7917193497891282,9.098785400390625,0.7917193497891282
209,8,SVC Classifier,2,0.95,0.8619447779111644,0.8559744296051806,7.5525288581848145,0.8559744296051806
210,8,Decision Tree,2,0.95,0.7190876350540216,0.7178790824104367,0.25760674476623535,0.7178790824104367
211,8,RandomForest,2,0.95,0.7695078031212484,0.743396311236231,0.4989798069000244,0.743396311236231
212,8,AdaBoost (Discrete),2,0.95,0.8487394957983193,0.8482571110813937,111.52764225006104,0.8482571110813937
213,8,AdaBoost (Real),2,0.95,0.8457382953181273,0.8440820338512144,102.84775018692017,0.8440820338512144
214,8,Logistic Regression (Penalty = L2),2,0.95,0.8787515006002401,0.8786599754703968,0.3724710941314697,0.8786599754703968
215,8,Naive Bayes,2,0.95,0.8067226890756303,0.7796668139032917,0.10046935081481934,0.7796668139032917
