,feat_set_id,classifier,fold_id,feat_th,score,geo_score,exec_t,geo_score_woz
0,0,KNeighbors Classifier,0,0.1,0.48338005606728074,0.46995920270030717,0.4365653991699219,0.46995920270030717
1,0,SVC Classifier,0,0.1,0.55126151381658,1.0,47.65663504600525,0.0
2,0,Decision Tree,0,0.1,0.4853824589507409,0.46414060802110413,0.21297812461853027,0.46414060802110413
3,0,RandomForest,0,0.1,0.49939927913496196,0.42367968215681223,0.7796041965484619,0.42367968215681223
4,0,AdaBoost (Discrete),0,0.1,0.47817380857028435,0.4582090508594932,53.28528833389282,0.4582090508594932
5,0,AdaBoost (Real),0,0.1,0.4853824589507409,0.4572706701461685,100.7078766822815,0.4572706701461685
6,0,Logistic Regression (Penalty = L2),0,0.1,0.565678814577493,0.4046300676250718,0.36545252799987793,0.4046300676250718
7,0,Naive Bayes,0,0.1,0.4411293552262715,0.2981055345041615,0.15374994277954102,0.2981055345041615
8,0,KNeighbors Classifier,1,0.1,0.4626477067895053,0.45258773070582775,0.41884422302246094,0.45258773070582775
9,0,SVC Classifier,1,0.1,0.551171640296415,1.0,54.33696508407593,0.0
10,0,Decision Tree,1,0.1,0.46685359503304624,0.4464340380754067,0.25457310676574707,0.4464340380754067
11,0,RandomForest,1,0.1,0.5023032245143201,0.1355120131294497,0.7486679553985596,0.1355120131294497
12,0,AdaBoost (Discrete),1,0.1,0.4764670538754256,0.37612491218437616,51.8014018535614,0.37612491218437616
13,0,AdaBoost (Real),1,0.1,0.47526537152012815,0.42365753585724836,73.56229901313782,0.42365753585724836
14,0,Logistic Regression (Penalty = L2),1,0.1,0.5379531343881434,0.45287855016119083,0.23961901664733887,0.45287855016119083
15,0,Naive Bayes,1,0.1,0.5133186461045464,0.38238921789562536,0.14230990409851074,0.38238921789562536
16,0,KNeighbors Classifier,2,0.1,0.47406368916483077,0.4454708677026508,0.3930025100708008,0.4454708677026508
17,0,SVC Classifier,2,0.1,0.551171640296415,1.0,39.62523627281189,0.0
18,0,Decision Tree,2,0.1,0.47666733426797514,0.4352052495881889,0.2610194683074951,0.4352052495881889
19,0,RandomForest,2,0.1,0.5509713599038654,0.9996366279069767,0.6141912937164307,0.0
20,0,AdaBoost (Discrete),2,0.1,0.46044462247146006,0.30644824330419507,45.73119378089905,0.30644824330419507
21,0,AdaBoost (Real),2,0.1,0.4744642499499299,0.3807267701509076,70.46865010261536,0.3807267701509076
22,0,Logistic Regression (Penalty = L2),2,0.1,0.5377528539955938,0.22428826556966294,0.2542698383331299,0.22428826556966294
23,0,Naive Bayes,2,0.1,0.5129180853194473,0.5119558406032795,0.0824582576751709,0.5119558406032795
24,1,KNeighbors Classifier,0,0.1,0.5360432519022827,0.5339055550027826,0.382843017578125,0.5339055550027826
25,1,SVC Classifier,0,0.1,0.55126151381658,1.0,39.128767251968384,0.0
26,1,Decision Tree,0,0.1,0.5420504605526631,0.5290291852497873,0.24929594993591309,0.5290291852497873
27,1,RandomForest,0,0.1,0.5222266720064077,0.5249928996117872,0.6653316020965576,0.5249928996117872
28,1,AdaBoost (Discrete),0,0.1,0.5642771325590709,0.5552897966872468,45.652270793914795,0.5552897966872468
29,1,AdaBoost (Real),0,0.1,0.5328394072887465,0.5225572802643805,62.89353585243225,0.5225572802643805
30,1,Logistic Regression (Penalty = L2),0,0.1,0.55126151381658,1.0,0.1278536319732666,0.0
31,1,Naive Bayes,0,0.1,0.45694833800560675,0.134495595860616,0.04566216468811035,0.134495595860616
32,1,KNeighbors Classifier,1,0.1,0.5057079911876627,0.4976068158657395,0.40009045600891113,0.4976068158657395
33,1,SVC Classifier,1,0.1,0.5509713599038654,0.9996366279069767,55.22732400894165,0.0
34,1,Decision Tree,1,0.1,0.516723412777889,0.5011937626583703,0.17571139335632324,0.5011937626583703
35,1,RandomForest,1,0.1,0.5323452833967555,0.5017786729713821,0.5784149169921875,0.5017786729713821
36,1,AdaBoost (Discrete),1,0.1,0.49128780292409374,0.46030581192360015,44.578040599823,0.46030581192360015
37,1,AdaBoost (Real),1,0.1,0.49829761666332867,0.4755413113234812,65.23586440086365,0.4755413113234812
38,1,Logistic Regression (Penalty = L2),1,0.1,0.551171640296415,1.0,0.11822199821472168,0.0
39,1,Naive Bayes,1,0.1,0.45703985579811734,0.12351039519204195,0.07956743240356445,0.12351039519204195
40,1,KNeighbors Classifier,2,0.1,0.4878830362507511,0.4685457471934178,0.36736273765563965,0.4685457471934178
41,1,SVC Classifier,2,0.1,0.551171640296415,1.0,37.28275156021118,0.0
42,1,Decision Tree,2,0.1,0.4932906068495894,0.46199602228365255,0.2249300479888916,0.46199602228365255
43,1,RandomForest,2,0.1,0.5467654716603244,0.09374637864041992,0.6127192974090576,0.09374637864041992
44,1,AdaBoost (Discrete),2,0.1,0.4404165832165031,0.3643932239715354,44.5858519077301,0.3643932239715354
45,1,AdaBoost (Real),2,0.1,0.4634488283597036,0.41246303465621714,60.517688512802124,0.41246303465621714
46,1,Logistic Regression (Penalty = L2),2,0.1,0.551171640296415,1.0,0.07313418388366699,0.0
47,1,Naive Bayes,2,0.1,0.43440817144001603,0.12716760019304552,0.12103557586669922,0.12716760019304552
48,2,KNeighbors Classifier,0,0.1,0.5776932318782539,0.5668722437546326,0.3579232692718506,0.5668722437546326
49,2,SVC Classifier,0,0.1,0.55126151381658,1.0,49.9115629196167,0.0
50,2,Decision Tree,0,0.1,0.539046856227473,0.5297025048307485,0.19335246086120605,0.5297025048307485
51,2,RandomForest,0,0.1,0.5726872246696035,0.5753253517711837,0.5591444969177246,0.5753253517711837
52,2,AdaBoost (Discrete),0,0.1,0.5828994793752503,0.5852994547617653,38.272942543029785,0.5852994547617653
53,2,AdaBoost (Real),0,0.1,0.5642771325590709,0.5624085291184514,60.97737002372742,0.5624085291184514
54,2,Logistic Regression (Penalty = L2),0,0.1,0.55126151381658,1.0,0.11810779571533203,0.0
55,2,Naive Bayes,0,0.1,0.46796155386463756,0.2284318677968793,0.11773419380187988,0.2284318677968793
56,2,KNeighbors Classifier,1,0.1,0.5321450030042059,0.5327120161898562,0.360231876373291,0.5327120161898562
57,2,SVC Classifier,1,0.1,0.551171640296415,1.0,35.96412944793701,0.0
58,2,Decision Tree,1,0.1,0.5165231323853394,0.5100621458101372,0.17812681198120117,0.5100621458101372
59,2,RandomForest,1,0.1,0.5433607049869817,0.4999387045645283,0.5018157958984375,0.4999387045645283
60,2,AdaBoost (Discrete),1,0.1,0.5762066893651111,0.5790718244297026,40.25381064414978,0.5790718244297026
61,2,AdaBoost (Real),1,0.1,0.5611856599238935,0.5616763011935968,62.19694375991821,0.5616763011935968
62,2,Logistic Regression (Penalty = L2),1,0.1,0.551171640296415,1.0,0.14182400703430176,0.0
63,2,Naive Bayes,1,0.1,0.46685359503304624,0.18084105831390454,0.07283449172973633,0.18084105831390454
64,2,KNeighbors Classifier,2,0.1,0.5101141598237533,0.4765251973518037,0.2902863025665283,0.4765251973518037
65,2,SVC Classifier,2,0.1,0.551171640296415,1.0,38.449190855026245,0.0
66,2,Decision Tree,2,0.1,0.5055077107951131,0.46006374569649927,0.2011101245880127,0.46006374569649927
67,2,RandomForest,2,0.1,0.5467654716603244,0.47066510114247345,0.6462399959564209,0.47066510114247345
68,2,AdaBoost (Discrete),2,0.1,0.5527738834368116,0.4918963652876941,42.470898389816284,0.4918963652876941
69,2,AdaBoost (Real),2,0.1,0.5369517324253955,0.49216889968059946,61.65476417541504,0.49216889968059946
70,2,Logistic Regression (Penalty = L2),2,0.1,0.551171640296415,1.0,0.10809803009033203,0.0
71,2,Naive Bayes,2,0.1,0.4077708792309233,0.07460148578792397,0.07379794120788574,0.07460148578792397
72,3,KNeighbors Classifier,0,0.1,0.5776932318782539,0.5668722437546326,0.2956562042236328,0.5668722437546326
73,3,SVC Classifier,0,0.1,0.55126151381658,1.0,57.399465560913086,0.0
74,3,Decision Tree,0,0.1,0.5422507008410092,0.5388390204615809,0.2397458553314209,0.5388390204615809
75,3,RandomForest,0,0.1,0.5726872246696035,0.5753253517711837,0.7622878551483154,0.5753253517711837
76,3,AdaBoost (Discrete),0,0.1,0.5828994793752503,0.5852994547617653,49.31515312194824,0.5852994547617653
77,3,AdaBoost (Real),0,0.1,0.5642771325590709,0.5624085291184514,71.4229371547699,0.5624085291184514
78,3,Logistic Regression (Penalty = L2),0,0.1,0.55126151381658,1.0,0.09284400939941406,0.0
79,3,Naive Bayes,0,0.1,0.46796155386463756,0.2284318677968793,0.08995461463928223,0.2284318677968793
80,3,KNeighbors Classifier,1,0.1,0.5321450030042059,0.5327120161898562,0.43331241607666016,0.5327120161898562
81,3,SVC Classifier,1,0.1,0.551171640296415,1.0,45.31148314476013,0.0
82,3,Decision Tree,1,0.1,0.5249349088724213,0.5167626405838518,0.24304485321044922,0.5167626405838518
83,3,RandomForest,1,0.1,0.5433607049869817,0.4999387045645283,0.6709911823272705,0.4999387045645283
84,3,AdaBoost (Discrete),1,0.1,0.5762066893651111,0.5790718244297026,49.86865305900574,0.5790718244297026
85,3,AdaBoost (Real),1,0.1,0.5611856599238935,0.5616763011935968,77.33522248268127,0.5616763011935968
86,3,Logistic Regression (Penalty = L2),1,0.1,0.551171640296415,1.0,0.09580445289611816,0.0
87,3,Naive Bayes,1,0.1,0.46685359503304624,0.18084105831390454,0.14192652702331543,0.18084105831390454
88,3,KNeighbors Classifier,2,0.1,0.5101141598237533,0.4765251973518037,0.47490978240966797,0.4765251973518037
89,3,SVC Classifier,2,0.1,0.551171640296415,1.0,43.668763160705566,0.0
90,3,Decision Tree,2,0.1,0.5175245343480873,0.4646848847573765,0.17528319358825684,0.4646848847573765
91,3,RandomForest,2,0.1,0.5467654716603244,0.47066510114247345,0.662773847579956,0.47066510114247345
92,3,AdaBoost (Discrete),2,0.1,0.5527738834368116,0.4918963652876941,48.9597373008728,0.4918963652876941
93,3,AdaBoost (Real),2,0.1,0.5369517324253955,0.49216889968059946,74.84060859680176,0.49216889968059946
94,3,Logistic Regression (Penalty = L2),2,0.1,0.551171640296415,1.0,0.14482617378234863,0.0
95,3,Naive Bayes,2,0.1,0.4077708792309233,0.07460148578792397,0.09819579124450684,0.07460148578792397
96,7,KNeighbors Classifier,0,0.1,0.5302362835402483,0.5059166763345314,0.32929110527038574,0.5059166763345314
97,7,SVC Classifier,0,0.1,0.55126151381658,1.0,42.356579065322876,0.0
98,7,Decision Tree,0,0.1,0.5386463756507809,0.5280415395301711,0.13231539726257324,0.5280415395301711
99,7,RandomForest,0,0.1,0.525830997196636,0.5284784718691681,0.618934154510498,0.5284784718691681
100,7,AdaBoost (Discrete),0,0.1,0.564477372847417,0.5544211563399342,47.717710971832275,0.5544211563399342
101,7,AdaBoost (Real),0,0.1,0.5408490188225871,0.533344225562507,88.82594633102417,0.533344225562507
102,7,Logistic Regression (Penalty = L2),0,0.1,0.55126151381658,1.0,0.1527729034423828,0.0
103,7,Naive Bayes,0,0.1,0.4703644373247898,0.25410536111096343,0.04982280731201172,0.25410536111096343
104,7,KNeighbors Classifier,1,0.1,0.4992990186260765,0.4945870857982388,0.33623456954956055,0.4945870857982388
105,7,SVC Classifier,1,0.1,0.551171640296415,1.0,42.424771308898926,0.0
106,7,Decision Tree,1,0.1,0.5289405167234128,0.48276672918455205,0.14559197425842285,0.48276672918455205
107,7,RandomForest,1,0.1,0.5447626677348287,0.5008573484504124,0.6868672370910645,0.5008573484504124
108,7,AdaBoost (Discrete),1,0.1,0.5347486481073503,0.49145247344904525,45.7526330947876,0.49145247344904525
109,7,AdaBoost (Real),1,0.1,0.5283396755457641,0.4860102542950844,81.60551738739014,0.4860102542950844
110,7,Logistic Regression (Penalty = L2),1,0.1,0.551171640296415,1.0,0.11516237258911133,0.0
111,7,Naive Bayes,1,0.1,0.45703985579811734,0.12351039519204195,0.0868833065032959,0.12351039519204195
112,7,KNeighbors Classifier,2,0.1,0.5393550971359904,0.5238347486888161,0.30525755882263184,0.5238347486888161
113,7,SVC Classifier,2,0.1,0.551171640296415,1.0,40.29811906814575,0.0
114,7,Decision Tree,2,0.1,0.505107150010014,0.43266899554929933,0.13242483139038086,0.43266899554929933
115,7,RandomForest,2,0.1,0.551171640296415,1.0,0.6223785877227783,0.0
116,7,AdaBoost (Discrete),2,0.1,0.5049068696174644,0.47990198330157774,44.37767744064331,0.47990198330157774
117,7,AdaBoost (Real),2,0.1,0.49809733627077907,0.437578796490568,85.09150981903076,0.437578796490568
118,7,Logistic Regression (Penalty = L2),2,0.1,0.551171640296415,1.0,0.16369390487670898,0.0
119,7,Naive Bayes,2,0.1,0.4590426597236131,0.15880929005052905,0.08675742149353027,0.15880929005052905
120,8,KNeighbors Classifier,0,0.1,0.5302362835402483,0.5059166763345314,0.26218676567077637,0.5059166763345314
121,8,SVC Classifier,0,0.1,0.55126151381658,1.0,39.11161422729492,0.0
122,8,Decision Tree,0,0.1,0.5386463756507809,0.5280415395301711,0.13189172744750977,0.5280415395301711
123,8,RandomForest,0,0.1,0.525830997196636,0.5284784718691681,0.6151015758514404,0.5284784718691681
124,8,AdaBoost (Discrete),0,0.1,0.564477372847417,0.5544211563399342,44.08371114730835,0.5544211563399342
125,8,AdaBoost (Real),0,0.1,0.5408490188225871,0.533344225562507,80.27605652809143,0.533344225562507
126,8,Logistic Regression (Penalty = L2),0,0.1,0.55126151381658,1.0,0.108123779296875,0.0
127,8,Naive Bayes,0,0.1,0.4703644373247898,0.25410536111096343,0.04135274887084961,0.25410536111096343
128,8,KNeighbors Classifier,1,0.1,0.4992990186260765,0.4945870857982388,0.28072381019592285,0.4945870857982388
129,8,SVC Classifier,1,0.1,0.551171640296415,1.0,38.08430624008179,0.0
130,8,Decision Tree,1,0.1,0.5289405167234128,0.48276672918455205,0.14095711708068848,0.48276672918455205
131,8,RandomForest,1,0.1,0.5447626677348287,0.5008573484504124,0.6175923347473145,0.5008573484504124
132,8,AdaBoost (Discrete),1,0.1,0.5347486481073503,0.49145247344904525,40.826149463653564,0.49145247344904525
133,8,AdaBoost (Real),1,0.1,0.5283396755457641,0.4860102542950844,101.46713423728943,0.4860102542950844
134,8,Logistic Regression (Penalty = L2),1,0.1,0.551171640296415,1.0,0.12642312049865723,0.0
135,8,Naive Bayes,1,0.1,0.45703985579811734,0.12351039519204195,0.05283498764038086,0.12351039519204195
136,8,KNeighbors Classifier,2,0.1,0.5393550971359904,0.5238347486888161,0.376234769821167,0.5238347486888161
137,8,SVC Classifier,2,0.1,0.551171640296415,1.0,45.7973313331604,0.0
138,8,Decision Tree,2,0.1,0.505107150010014,0.43266899554929933,0.14466404914855957,0.43266899554929933
139,8,RandomForest,2,0.1,0.551171640296415,1.0,0.8295788764953613,0.0
140,8,AdaBoost (Discrete),2,0.1,0.5049068696174644,0.47990198330157774,55.27000141143799,0.47990198330157774
141,8,AdaBoost (Real),2,0.1,0.49809733627077907,0.437578796490568,103.71302533149719,0.437578796490568
142,8,Logistic Regression (Penalty = L2),2,0.1,0.551171640296415,1.0,0.12530755996704102,0.0
143,8,Naive Bayes,2,0.1,0.4590426597236131,0.15880929005052905,0.06807613372802734,0.15880929005052905
144,9,KNeighbors Classifier,0,0.1,0.5776932318782539,0.5668722437546326,0.3743882179260254,0.5668722437546326
145,9,SVC Classifier,0,0.1,0.55126151381658,1.0,66.61219596862793,0.0
146,9,Decision Tree,0,0.1,0.5546655987184621,0.5423246677443863,0.25531625747680664,0.5423246677443863
147,9,RandomForest,0,0.1,0.5726872246696035,0.5753253517711837,0.7614519596099854,0.5753253517711837
148,9,AdaBoost (Discrete),0,0.1,0.5828994793752503,0.5852994547617653,51.28720498085022,0.5852994547617653
149,9,AdaBoost (Real),0,0.1,0.5642771325590709,0.5624085291184514,72.84345769882202,0.5624085291184514
150,9,Logistic Regression (Penalty = L2),0,0.1,0.55126151381658,1.0,0.14664292335510254,0.0
151,9,Naive Bayes,0,0.1,0.46796155386463756,0.2284318677968793,0.09610819816589355,0.2284318677968793
152,9,KNeighbors Classifier,1,0.1,0.5321450030042059,0.5327120161898562,0.48467135429382324,0.5327120161898562
153,9,SVC Classifier,1,0.1,0.551171640296415,1.0,49.01522374153137,0.0
154,9,Decision Tree,1,0.1,0.5201281794512317,0.5116583529110714,0.23760342597961426,0.5116583529110714
155,9,RandomForest,1,0.1,0.5433607049869817,0.4999387045645283,0.716055154800415,0.4999387045645283
156,9,AdaBoost (Discrete),1,0.1,0.5762066893651111,0.5790718244297026,53.386213302612305,0.5790718244297026
157,9,AdaBoost (Real),1,0.1,0.5611856599238935,0.5616763011935968,74.77095484733582,0.5616763011935968
158,9,Logistic Regression (Penalty = L2),1,0.1,0.551171640296415,1.0,0.14407062530517578,0.0
159,9,Naive Bayes,1,0.1,0.46685359503304624,0.18084105831390454,0.09611129760742188,0.18084105831390454
160,9,KNeighbors Classifier,2,0.1,0.5101141598237533,0.4765251973518037,0.4405629634857178,0.4765251973518037
161,9,SVC Classifier,2,0.1,0.551171640296415,1.0,49.34594392776489,0.0
162,9,Decision Tree,2,0.1,0.505107150010014,0.4598077992256765,0.24225068092346191,0.4598077992256765
163,9,RandomForest,2,0.1,0.5467654716603244,0.47066510114247345,0.8450169563293457,0.47066510114247345
164,9,AdaBoost (Discrete),2,0.1,0.5527738834368116,0.4918963652876941,50.71733570098877,0.4918963652876941
165,9,AdaBoost (Real),2,0.1,0.5369517324253955,0.49216889968059946,73.50408148765564,0.49216889968059946
166,9,Logistic Regression (Penalty = L2),2,0.1,0.551171640296415,1.0,0.15126705169677734,0.0
167,9,Naive Bayes,2,0.1,0.4077708792309233,0.07460148578792397,0.09021449089050293,0.07460148578792397
168,10,KNeighbors Classifier,0,0.1,0.5776932318782539,0.5668722437546326,0.44433140754699707,0.5668722437546326
169,10,SVC Classifier,0,0.1,0.55126151381658,1.0,57.006977796554565,0.0
170,10,Decision Tree,0,0.1,0.5366439727673208,0.5324973170335809,0.1891939640045166,0.5324973170335809
171,10,RandomForest,0,0.1,0.5726872246696035,0.5753253517711837,0.5166566371917725,0.5753253517711837
172,10,AdaBoost (Discrete),0,0.1,0.5828994793752503,0.5852994547617653,42.53917145729065,0.5852994547617653
173,10,AdaBoost (Real),0,0.1,0.5642771325590709,0.5624085291184514,68.52756667137146,0.5624085291184514
174,10,Logistic Regression (Penalty = L2),0,0.1,0.55126151381658,1.0,0.11908197402954102,0.0
175,10,Naive Bayes,0,0.1,0.46796155386463756,0.2284318677968793,0.08205008506774902,0.2284318677968793
176,10,KNeighbors Classifier,1,0.1,0.5321450030042059,0.5327120161898562,0.40050435066223145,0.5327120161898562
177,10,SVC Classifier,1,0.1,0.551171640296415,1.0,42.08034706115723,0.0
178,10,Decision Tree,1,0.1,0.5221309833767274,0.5154937447112434,0.20016026496887207,0.5154937447112434
179,10,RandomForest,1,0.1,0.5433607049869817,0.4999387045645283,0.7066452503204346,0.4999387045645283
180,10,AdaBoost (Discrete),1,0.1,0.5762066893651111,0.5790718244297026,47.21355175971985,0.5790718244297026
181,10,AdaBoost (Real),1,0.1,0.5611856599238935,0.5616763011935968,67.6329894065857,0.5616763011935968
182,10,Logistic Regression (Penalty = L2),1,0.1,0.551171640296415,1.0,0.11821722984313965,0.0
183,10,Naive Bayes,1,0.1,0.46685359503304624,0.18084105831390454,0.11807513236999512,0.18084105831390454
184,10,KNeighbors Classifier,2,0.1,0.5101141598237533,0.4765251973518037,0.39894700050354004,0.4765251973518037
185,10,SVC Classifier,2,0.1,0.551171640296415,1.0,42.03055000305176,0.0
186,10,Decision Tree,2,0.1,0.5113158421790507,0.4635664062224637,0.19948816299438477,0.4635664062224637
187,10,RandomForest,2,0.1,0.5467654716603244,0.47066510114247345,0.6007373332977295,0.47066510114247345
188,10,AdaBoost (Discrete),2,0.1,0.5527738834368116,0.4918963652876941,42.5635199546814,0.4918963652876941
189,10,AdaBoost (Real),2,0.1,0.5369517324253955,0.49216889968059946,64.23251557350159,0.49216889968059946
190,10,Logistic Regression (Penalty = L2),2,0.1,0.551171640296415,1.0,0.10709190368652344,0.0
191,10,Naive Bayes,2,0.1,0.4077708792309233,0.07460148578792397,0.1051938533782959,0.07460148578792397
192,11,KNeighbors Classifier,0,0.1,0.564477372847417,0.5599611071590093,1.3765718936920166,0.5599611071590093
193,11,SVC Classifier,0,0.1,0.55126151381658,1.0,39.37450981140137,0.0
194,11,Decision Tree,0,0.1,0.4809771726071286,0.4777541136048381,0.216843843460083,0.4777541136048381
195,11,RandomForest,0,0.1,0.6003203844613536,0.5719949199751364,0.5753333568572998,0.5719949199751364
196,11,AdaBoost (Discrete),0,0.1,0.5432519022827393,0.5446585084010465,53.03752040863037,0.5446585084010465
197,11,AdaBoost (Real),0,0.1,0.5136163396075291,0.5139763344373383,64.957186460495,0.5139763344373383
198,11,Logistic Regression (Penalty = L2),0,0.1,0.5596716059271125,0.46230811168006314,0.1860675811767578,0.46230811168006314
199,11,Naive Bayes,0,0.1,0.4615538646375651,0.16251164680298186,0.11852860450744629,0.16251164680298186
200,11,KNeighbors Classifier,1,0.1,0.5125175245343481,0.4967549554010224,1.5509905815124512,0.4967549554010224
201,11,SVC Classifier,1,0.1,0.5509713599038654,0.9996366279069767,42.4579291343689,0.0
202,11,Decision Tree,1,0.1,0.5225315441618266,0.5249265931029741,0.22444868087768555,0.5249265931029741
203,11,RandomForest,1,0.1,0.5421590226316844,0.3701371291149957,0.5550975799560547,0.3701371291149957
204,11,AdaBoost (Discrete),1,0.1,0.5621870618866412,0.5631023249698174,47.20573663711548,0.5631023249698174
205,11,AdaBoost (Real),1,0.1,0.543761265772081,0.5454686741974106,64.4541130065918,0.5454686741974106
206,11,Logistic Regression (Penalty = L2),1,0.1,0.5265371520128179,0.45811057725976023,0.21319580078125,0.45811057725976023
207,11,Naive Bayes,1,0.1,0.47025836170638896,0.19718218467571652,0.14022183418273926,0.19718218467571652
208,11,KNeighbors Classifier,2,0.1,0.4710594832765872,0.443684276148133,1.3270940780639648,0.443684276148133
209,11,SVC Classifier,2,0.1,0.551171640296415,1.0,32.907710552215576,0.0
210,11,Decision Tree,2,0.1,0.4772681754456239,0.46781636653417275,0.20439887046813965,0.46781636653417275
211,11,RandomForest,2,0.1,0.5501702383336672,0.4395951613200287,0.44930553436279297,0.4395951613200287
212,11,AdaBoost (Discrete),2,0.1,0.45183256559182855,0.4432844693445939,46.21377372741699,0.4432844693445939
213,11,AdaBoost (Real),2,0.1,0.46945724013619067,0.46107345076574013,60.51737856864929,0.46107345076574013
214,11,Logistic Regression (Penalty = L2),2,0.1,0.5337472461446024,0.2504024499543112,0.25556349754333496,0.2504024499543112
215,11,Naive Bayes,2,0.1,0.40937312237131984,0.10973101723173069,0.05526304244995117,0.10973101723173069
