,feat_set_id,classifier,fold_id,feat_th,score,geo_score,exec_t,geo_score_woz
0,0,KNeighbors Classifier,0,0.45,0.9830985915492958,0.9787009905012263,0.9727647304534912,0.9787009905012263
1,0,SVC Classifier,0,0.45,0.9098591549295775,0.4530153324120529,0.9141578674316406,0.4530153324120529
2,0,Decision Tree,0,0.45,0.952112676056338,0.905159323862398,0.09630346298217773,0.905159323862398
3,0,RandomForest,0,0.45,0.8887323943661972,0.3986314009794656,0.7369153499603271,0.3986314009794656
4,0,AdaBoost (Discrete),0,0.45,0.9845070422535211,0.9705393645157323,52.265445709228516,0.9705393645157323
5,0,AdaBoost (Real),0,0.45,0.9802816901408451,0.9775023353024564,69.56380295753479,0.9775023353024564
6,0,Logistic Regression (Penalty = L2),0,0.45,0.9816901408450704,0.9723039854275715,0.5539464950561523,0.9723039854275715
7,0,Naive Bayes,0,0.45,0.9661971830985916,0.9657301250182015,0.09331035614013672,0.9657301250182015
8,0,KNeighbors Classifier,1,0.45,0.9647390691114246,0.9419091297208005,0.801154613494873,0.9419091297208005
9,0,SVC Classifier,1,0.45,0.9760225669957687,0.9369604361556937,0.9935436248779297,0.9369604361556937
10,0,Decision Tree,1,0.45,0.9562764456981664,0.925573278373852,0.09993624687194824,0.925573278373852
11,0,RandomForest,1,0.45,0.8730606488011283,0.8268454930564446,0.8159279823303223,0.0
12,0,AdaBoost (Discrete),1,0.45,0.9703808180535967,0.9184735248681712,57.85760688781738,0.9184735248681712
13,0,AdaBoost (Real),1,0.45,0.9534555712270804,0.9452702187640546,77.3388729095459,0.9452702187640546
14,0,Logistic Regression (Penalty = L2),1,0.45,0.9703808180535967,0.9534492813263334,0.39929986000061035,0.9534492813263334
15,0,Naive Bayes,1,0.45,0.9576868829337094,0.9451276005524802,0.25880861282348633,0.9451276005524802
16,0,KNeighbors Classifier,2,0.45,0.9335219236209336,0.951396477875812,0.8887777328491211,0.951396477875812
17,0,SVC Classifier,2,0.45,0.9674681753889675,0.9146994035624959,1.1104907989501953,0.9146994035624959
18,0,Decision Tree,2,0.45,0.925035360678925,0.9504885650651899,0.12797927856445312,0.9504885650651899
19,0,RandomForest,2,0.45,0.9137199434229137,0.7342480744788177,0.7987947463989258,0.7342480744788177
20,0,AdaBoost (Discrete),2,0.45,0.743988684582744,0.8572724719727692,58.88029360771179,0.8572724719727692
21,0,AdaBoost (Real),2,0.45,0.7821782178217822,0.8797278906928535,73.75108528137207,0.8797278906928535
22,0,Logistic Regression (Penalty = L2),2,0.45,0.8811881188118812,0.930587249760632,0.44768357276916504,0.930587249760632
23,0,Naive Bayes,2,0.45,0.9434229137199435,0.9585914814401648,0.10941171646118164,0.9585914814401648
24,1,KNeighbors Classifier,0,0.45,0.9859154929577465,0.9740815103815855,0.7548582553863525,0.9740815103815855
25,1,SVC Classifier,0,0.45,0.9098591549295775,0.4530153324120529,0.9942586421966553,0.4530153324120529
26,1,Decision Tree,0,0.45,0.9352112676056338,0.9404823297252976,0.11540722846984863,0.9404823297252976
27,1,RandomForest,0,0.45,0.8901408450704226,0.4236090741960986,0.9960296154022217,0.4236090741960986
28,1,AdaBoost (Discrete),0,0.45,0.8901408450704226,0.4236090741960986,54.483413219451904,0.4236090741960986
29,1,AdaBoost (Real),0,0.45,0.923943661971831,0.9473307713976826,64.24919772148132,0.9473307713976826
30,1,Logistic Regression (Penalty = L2),0,0.45,0.9845070422535211,0.973489723170078,0.3332102298736572,0.973489723170078
31,1,Naive Bayes,0,0.45,0.9605633802816902,0.9746212105531656,0.09352684020996094,0.9746212105531656
32,1,KNeighbors Classifier,1,0.45,0.9675599435825106,0.9335532772064422,0.5963761806488037,0.9335532772064422
33,1,SVC Classifier,1,0.45,0.9760225669957687,0.9369604361556937,1.055739402770996,0.9369604361556937
34,1,Decision Tree,1,0.45,0.9407616361071932,0.902042482050305,0.08736419677734375,0.902042482050305
35,1,RandomForest,1,0.45,0.9153737658674189,0.7031359827212937,0.7927217483520508,0.7031359827212937
36,1,AdaBoost (Discrete),1,0.45,0.9788434414668548,0.9408841018475712,53.677064418792725,0.9408841018475712
37,1,AdaBoost (Real),1,0.45,0.7122708039492243,0.81883569846887,70.81238102912903,0.81883569846887
38,1,Logistic Regression (Penalty = L2),1,0.45,0.9760225669957687,0.9369604361556937,0.4575948715209961,0.9369604361556937
39,1,Naive Bayes,1,0.45,0.9379407616361072,0.9624266801283413,0.10477328300476074,0.9624266801283413
40,1,KNeighbors Classifier,2,0.45,0.9264497878359265,0.9454188665802395,0.6437044143676758,0.9454188665802395
41,1,SVC Classifier,2,0.45,0.9915134370579916,0.9791605716903751,0.8646633625030518,0.9791605716903751
42,1,Decision Tree,2,0.45,0.7553041018387553,0.8260267568051036,0.10845160484313965,0.8260267568051036
43,1,RandomForest,2,0.45,0.8345120226308345,0.7697776294059111,0.6506173610687256,0.7697776294059111
44,1,AdaBoost (Discrete),2,0.45,0.7553041018387553,0.8532215079381957,53.19026708602905,0.8532215079381957
45,1,AdaBoost (Real),2,0.45,0.8062234794908062,0.8944439847657734,64.96062588691711,0.8944439847657734
46,1,Logistic Regression (Penalty = L2),2,0.45,0.8769448373408769,0.9231429227018049,0.5066566467285156,0.9231429227018049
47,1,Naive Bayes,2,0.45,0.8458274398868458,0.9190976999002275,0.11682009696960449,0.9190976999002275
48,2,KNeighbors Classifier,0,0.45,0.9830985915492958,0.9758141385621988,0.8440124988555908,0.9758141385621988
49,2,SVC Classifier,0,0.45,0.9014084507042254,0.9561361361937124,1.1720993518829346,0.0
50,2,Decision Tree,0,0.45,0.9352112676056338,0.8557997007794492,0.10668706893920898,0.8557997007794492
51,2,RandomForest,0,0.45,0.895774647887324,0.9257593906743554,0.6709201335906982,0.0
52,2,AdaBoost (Discrete),0,0.45,0.976056338028169,0.97282632396706,57.41119933128357,0.97282632396706
53,2,AdaBoost (Real),0,0.45,0.9830985915492958,0.9758141385621988,79.45911002159119,0.9758141385621988
54,2,Logistic Regression (Penalty = L2),0,0.45,0.9830985915492958,0.9699497292767263,0.43373632431030273,0.9699497292767263
55,2,Naive Bayes,0,0.45,0.9619718309859155,0.9752372797504396,0.11358332633972168,0.9752372797504396
56,2,KNeighbors Classifier,1,0.45,0.9633286318758815,0.9350383046209348,0.7038106918334961,0.9350383046209348
57,2,SVC Classifier,1,0.45,0.9153737658674189,0.5969560271087193,1.0726919174194336,0.5969560271087193
58,2,Decision Tree,1,0.45,0.9167842031029619,0.8423907184037616,0.0025348663330078125,0.8423907184037616
59,2,RandomForest,1,0.45,0.8984485190409027,0.41051336538613176,0.7807140350341797,0.41051336538613176
60,2,AdaBoost (Discrete),1,0.45,0.9139633286318759,0.8357312246874374,65.6521532535553,0.8357312246874374
61,2,AdaBoost (Real),1,0.45,0.9449929478138223,0.8591933543530708,101.88020491600037,0.8591933543530708
62,2,Logistic Regression (Penalty = L2),1,0.45,0.9732016925246827,0.9358274720081465,0.6827771663665771,0.9358274720081465
63,2,Naive Bayes,1,0.45,0.8942172073342737,0.9100260512822764,0.4853847026824951,0.9100260512822764
64,2,KNeighbors Classifier,2,0.45,0.9207920792079208,0.9400427901293131,1.5943803787231445,0.9400427901293131
65,2,SVC Classifier,2,0.45,0.9094766619519095,0.9689042833036098,1.6093862056732178,0.0
66,2,Decision Tree,2,0.45,0.8472418670438473,0.8992267910177307,0.2391343116760254,0.8992267910177307
67,2,RandomForest,2,0.45,0.8712871287128713,0.8144110179279557,1.178699016571045,0.0
68,2,AdaBoost (Discrete),2,0.45,0.7468175388967468,0.8182025730112085,110.52091693878174,0.8182025730112085
69,2,AdaBoost (Real),2,0.45,0.7934936350777935,0.8810898748302365,142.57754397392273,0.8810898748302365
70,2,Logistic Regression (Penalty = L2),2,0.45,0.8811881188118812,0.930587249760632,0.830186128616333,0.930587249760632
71,2,Naive Bayes,2,0.45,0.8472418670438473,0.9197841062045766,0.003260374069213867,0.9197841062045766
72,3,KNeighbors Classifier,0,0.45,0.9845070422535211,0.973489723170078,1.6962816715240479,0.973489723170078
73,3,SVC Classifier,0,0.45,0.9098591549295775,0.4530153324120529,2.044121026992798,0.4530153324120529
74,3,Decision Tree,0,0.45,0.9492957746478873,0.9584550455484472,0.19990849494934082,0.9584550455484472
75,3,RandomForest,0,0.45,0.8887323943661972,0.3986314009794656,1.4315552711486816,0.3986314009794656
76,3,AdaBoost (Discrete),0,0.45,0.9732394366197183,0.965802062171837,110.4863440990448,0.965802062171837
77,3,AdaBoost (Real),0,0.45,0.976056338028169,0.97282632396706,137.98392534255981,0.97282632396706
78,3,Logistic Regression (Penalty = L2),0,0.45,0.9774647887323944,0.9763007331873649,0.7238097190856934,0.9763007331873649
79,3,Naive Bayes,0,0.45,0.9507042253521126,0.9757244497621935,0.19288277626037598,0.9757244497621935
80,3,KNeighbors Classifier,1,0.45,0.9760225669957687,0.9527357661655405,1.7106034755706787,0.9527357661655405
81,3,SVC Classifier,1,0.45,0.9760225669957687,0.9369604361556937,1.9934265613555908,0.9369604361556937
82,3,Decision Tree,1,0.45,0.9633286318758815,0.9295678341424513,0.2085556983947754,0.9295678341424513
83,3,RandomForest,1,0.45,0.92524682651622,0.7540488463006698,1.6638946533203125,0.7540488463006698
84,3,AdaBoost (Discrete),1,0.45,0.921015514809591,0.9091326850365574,106.00534892082214,0.9091326850365574
85,3,AdaBoost (Real),1,0.45,0.9520451339915373,0.9424444431834058,101.14391660690308,0.9424444431834058
86,3,Logistic Regression (Penalty = L2),1,0.45,0.9873060648801129,0.9664902381743126,0.5389609336853027,0.9664902381743126
87,3,Naive Bayes,1,0.45,0.8942172073342737,0.9451615055023421,0.10941362380981445,0.9451615055023421
88,3,KNeighbors Classifier,2,0.45,0.9886845827439887,0.9779744281044379,0.8924591541290283,0.9779744281044379
89,3,SVC Classifier,2,0.45,0.9915134370579916,0.9791605716903751,0.9505219459533691,0.9791605716903751
90,3,Decision Tree,2,0.45,0.9504950495049505,0.9400832568874402,0.002488374710083008,0.9400832568874402
91,3,RandomForest,2,0.45,0.9052333804809052,0.6903391642344415,0.7705521583557129,0.6903391642344415
92,3,AdaBoost (Discrete),2,0.45,0.9717114568599717,0.96490494778933,55.74426221847534,0.96490494778933
93,3,AdaBoost (Real),2,0.45,0.9688826025459689,0.9546520569093742,74.8279914855957,0.9546520569093742
94,3,Logistic Regression (Penalty = L2),2,0.45,0.9915134370579916,0.9821006259290347,0.4353353977203369,0.9821006259290347
95,3,Naive Bayes,2,0.45,0.8458274398868458,0.9190976999002275,0.11334991455078125,0.9190976999002275
96,4,KNeighbors Classifier,0,0.45,0.9859154929577465,0.9740815103815855,0.5997176170349121,0.9740815103815855
97,4,SVC Classifier,0,0.45,0.9098591549295775,0.4530153324120529,0.9568865299224854,0.4530153324120529
98,4,Decision Tree,0,0.45,0.9746478873239437,0.9644127451905545,0.0021216869354248047,0.9644127451905545
99,4,RandomForest,0,0.45,0.8901408450704226,0.4236090741960986,0.8184099197387695,0.4236090741960986
100,4,AdaBoost (Discrete),0,0.45,0.8901408450704226,0.4236090741960986,53.279659271240234,0.4236090741960986
101,4,AdaBoost (Real),0,0.45,0.9830985915492958,0.9728972155841619,67.38002562522888,0.9728972155841619
102,4,Logistic Regression (Penalty = L2),0,0.45,0.9845070422535211,0.9705393645157323,0.3390488624572754,0.9705393645157323
103,4,Naive Bayes,0,0.45,0.9478873239436619,0.9549697236929222,0.13690924644470215,0.9549697236929222
104,4,KNeighbors Classifier,1,0.45,0.9760225669957687,0.9369604361556937,0.4839131832122803,0.9369604361556937
105,4,SVC Classifier,1,0.45,0.9760225669957687,0.9369604361556937,0.7610518932342529,0.9369604361556937
106,4,Decision Tree,1,0.45,0.9548660084626234,0.9378290266482102,0.11888289451599121,0.9378290266482102
107,4,RandomForest,1,0.45,0.9337094499294781,0.7927843292491847,0.7200019359588623,0.7927843292491847
108,4,AdaBoost (Discrete),1,0.45,0.9746121297602257,0.9331360652822656,54.40185499191284,0.9331360652822656
109,4,AdaBoost (Real),1,0.45,0.8631875881523272,0.8922843503058969,66.58799505233765,0.8922843503058969
110,4,Logistic Regression (Penalty = L2),1,0.45,0.9760225669957687,0.9369604361556937,0.4097602367401123,0.9369604361556937
111,4,Naive Bayes,1,0.45,0.9520451339915373,0.927241414845448,0.13716411590576172,0.927241414845448
112,4,KNeighbors Classifier,2,0.45,0.8811881188118812,0.930587249760632,0.47612547874450684,0.930587249760632
113,4,SVC Classifier,2,0.45,0.9561527581329562,0.8809465836111355,0.7012295722961426,0.8809465836111355
114,4,Decision Tree,2,0.45,0.8628005657708628,0.9051185481185512,0.11508846282958984,0.9051185481185512
115,4,RandomForest,2,0.45,0.743988684582744,0.7339992430820979,0.8537204265594482,0.7339992430820979
116,4,AdaBoost (Discrete),2,0.45,0.7652050919377652,0.8757697907628103,53.59369254112244,0.8757697907628103
117,4,AdaBoost (Real),2,0.45,0.7906647807637907,0.8840615955604604,66.9342634677887,0.8840615955604604
118,4,Logistic Regression (Penalty = L2),2,0.45,0.8797736916548797,0.9299309820889741,0.3584926128387451,0.9299309820889741
119,4,Naive Bayes,2,0.45,0.8543140028288543,0.917956289660325,0.12336015701293945,0.917956289660325
120,5,KNeighbors Classifier,0,0.45,0.971830985915493,0.9738886153093352,0.9630677700042725,0.9738886153093352
121,5,SVC Classifier,0,0.45,0.9014084507042254,0.9561361361937124,0.8373687267303467,0.0
122,5,Decision Tree,0,0.45,0.9323943661971831,0.9357635045619515,0.12787485122680664,0.9357635045619515
123,5,RandomForest,0,0.45,0.9014084507042254,0.9561361361937124,0.925767183303833,0.0
124,5,AdaBoost (Discrete),0,0.45,0.956338028169014,0.9150298837134779,58.25493264198303,0.9150298837134779
125,5,AdaBoost (Real),0,0.45,0.9647887323943662,0.9524044514172538,68.23996233940125,0.9524044514172538
126,5,Logistic Regression (Penalty = L2),0,0.45,0.9732394366197183,0.965802062171837,0.3597075939178467,0.965802062171837
127,5,Naive Bayes,0,0.45,0.9323943661971831,0.9510678151057695,0.11747121810913086,0.9510678151057695
128,5,KNeighbors Classifier,1,0.45,0.9717912552891397,0.9217273901525386,0.6725184917449951,0.9217273901525386
129,5,SVC Classifier,1,0.45,0.9153737658674189,0.5969560271087193,0.9042296409606934,0.5969560271087193
130,5,Decision Tree,1,0.45,0.9153737658674189,0.7945985677878262,0.11176252365112305,0.7945985677878262
131,5,RandomForest,1,0.45,0.8871650211565585,0.8864052604279183,0.8018627166748047,0.0
132,5,AdaBoost (Discrete),1,0.45,0.9407616361071932,0.8677739936896719,55.40262985229492,0.8677739936896719
133,5,AdaBoost (Real),1,0.45,0.9322990126939351,0.8493662959207021,62.78210234642029,0.8493662959207021
134,5,Logistic Regression (Penalty = L2),1,0.45,0.9689703808180536,0.9143532551260948,0.4093334674835205,0.9143532551260948
135,5,Naive Bayes,1,0.45,0.9435825105782792,0.8940969313380995,0.003182649612426758,0.8940969313380995
136,5,KNeighbors Classifier,2,0.45,0.9080622347949081,0.9296374774478071,0.6205635070800781,0.9296374774478071
137,5,SVC Classifier,2,0.45,0.8797736916548797,0.8511696634152133,0.8405685424804688,0.0
138,5,Decision Tree,2,0.45,0.7369165487977369,0.8468961410612178,0.00226593017578125,0.8468961410612178
139,5,RandomForest,2,0.45,0.8712871287128713,0.8144110179279557,0.8485138416290283,0.0
140,5,AdaBoost (Discrete),2,0.45,0.7227722772277227,0.7872164250850606,51.306788206100464,0.7872164250850606
141,5,AdaBoost (Real),2,0.45,0.8217821782178217,0.8898486591880503,62.0539653301239,0.8898486591880503
142,5,Logistic Regression (Penalty = L2),2,0.45,0.8783592644978784,0.9292737868297294,0.42601490020751953,0.9292737868297294
143,5,Naive Bayes,2,0.45,0.9504950495049505,0.9616718094276712,0.11634707450866699,0.9616718094276712
144,6,KNeighbors Classifier,0,0.45,0.9859154929577465,0.9770041569835014,0.5618374347686768,0.9770041569835014
145,6,SVC Classifier,0,0.45,0.9098591549295775,0.4530153324120529,0.8044064044952393,0.4530153324120529
146,6,Decision Tree,0,0.45,0.9788732394366197,0.9711153485635676,0.11500692367553711,0.9711153485635676
147,6,RandomForest,0,0.45,0.8816901408450705,0.41183601122357666,0.663583517074585,0.41183601122357666
148,6,AdaBoost (Discrete),0,0.45,0.9845070422535211,0.9705393645157323,48.9077205657959,0.9705393645157323
149,6,AdaBoost (Real),0,0.45,0.9830985915492958,0.9843863813749295,57.28675293922424,0.9843863813749295
150,6,Logistic Regression (Penalty = L2),0,0.45,0.9859154929577465,0.9740815103815855,0.2657656669616699,0.9740815103815855
151,6,Naive Bayes,0,0.45,0.9492957746478873,0.9555779848278876,0.21736812591552734,0.9555779848278876
152,6,KNeighbors Classifier,1,0.45,0.9675599435825106,0.9522750815160373,0.5159239768981934,0.9522750815160373
153,6,SVC Classifier,1,0.45,0.9760225669957687,0.9369604361556937,0.8308966159820557,0.9369604361556937
154,6,Decision Tree,1,0.45,0.9661495063469676,0.9407014413689281,0.09949946403503418,0.9407014413689281
155,6,RandomForest,1,0.45,0.8801128349788434,0.599693657111944,0.8037066459655762,0.599693657111944
156,6,AdaBoost (Discrete),1,0.45,0.9746121297602257,0.9315443588824818,46.73873734474182,0.9315443588824818
157,6,AdaBoost (Real),1,0.45,0.9351198871650211,0.905937977002804,58.39017295837402,0.905937977002804
158,6,Logistic Regression (Penalty = L2),1,0.45,0.9802538787023978,0.9482502021984763,0.2664804458618164,0.9482502021984763
159,6,Naive Bayes,1,0.45,0.9548660084626234,0.934719491132537,0.10755109786987305,0.934719491132537
160,6,KNeighbors Classifier,2,0.45,0.9886845827439887,0.9779744281044379,0.4064037799835205,0.9779744281044379
161,6,SVC Classifier,2,0.45,0.9391796322489392,0.8248573930653896,0.8325166702270508,0.8248573930653896
162,6,Decision Tree,2,0.45,0.9773691654879774,0.9490988593576759,0.0020263195037841797,0.9490988593576759
163,6,RandomForest,2,0.45,0.8981612446958982,0.6580925612239664,0.7296576499938965,0.6580925612239664
164,6,AdaBoost (Discrete),2,0.45,0.9674681753889675,0.9509802819480705,47.3918673992157,0.9509802819480705
165,6,AdaBoost (Real),2,0.45,0.9745403111739745,0.9570034261537267,57.96657705307007,0.9570034261537267
166,6,Logistic Regression (Penalty = L2),2,0.45,0.9915134370579916,0.9791605716903751,0.4309418201446533,0.9791605716903751
167,6,Naive Bayes,2,0.45,0.9391796322489392,0.9623655025725886,0.11301875114440918,0.9623655025725886
168,7,KNeighbors Classifier,0,0.45,0.9859154929577465,0.9740815103815855,0.5411603450775146,0.9740815103815855
169,7,SVC Classifier,0,0.45,0.9014084507042254,0.9561361361937124,0.8686788082122803,0.0
170,7,Decision Tree,0,0.45,0.9774647887323944,0.962675386644056,0.11053466796875,0.962675386644056
171,7,RandomForest,0,0.45,0.8971830985915493,0.940243570046875,0.8941230773925781,0.0
172,7,AdaBoost (Discrete),0,0.45,0.9788732394366197,0.968176508266845,48.63332509994507,0.968176508266845
173,7,AdaBoost (Real),0,0.45,0.9732394366197183,0.9568321656944232,59.965351581573486,0.9568321656944232
174,7,Logistic Regression (Penalty = L2),0,0.45,0.9845070422535211,0.9705393645157323,0.3141453266143799,0.9705393645157323
175,7,Naive Bayes,0,0.45,0.9492957746478873,0.9750961659762587,0.0032491683959960938,0.9750961659762587
176,7,KNeighbors Classifier,1,0.45,0.9760225669957687,0.9369604361556937,0.407137393951416,0.9369604361556937
177,7,SVC Classifier,1,0.45,0.9153737658674189,0.5969560271087193,0.8297035694122314,0.5969560271087193
178,7,Decision Tree,1,0.45,0.9393511988716502,0.8686359340495864,0.10709547996520996,0.8686359340495864
179,7,RandomForest,1,0.45,0.8942172073342737,0.5580793993242377,0.7300469875335693,0.5580793993242377
180,7,AdaBoost (Discrete),1,0.45,0.9280677009873061,0.8671115158650845,48.234147787094116,0.8671115158650845
181,7,AdaBoost (Real),1,0.45,0.9069111424541608,0.8587893947515688,58.66388773918152,0.8587893947515688
182,7,Logistic Regression (Penalty = L2),1,0.45,0.9760225669957687,0.9369604361556937,0.2913243770599365,0.9369604361556937
183,7,Naive Bayes,1,0.45,0.8631875881523272,0.9011137873983701,0.11703014373779297,0.9011137873983701
184,7,KNeighbors Classifier,2,0.45,0.8811881188118812,0.930587249760632,0.512174129486084,0.930587249760632
185,7,SVC Classifier,2,0.45,0.9094766619519095,0.9689042833036098,0.8417799472808838,0.0
186,7,Decision Tree,2,0.45,0.8359264497878359,0.9064878672231422,0.1074223518371582,0.9064878672231422
187,7,RandomForest,2,0.45,0.867043847241867,0.7953949089757174,0.7106790542602539,0.0
188,7,AdaBoost (Discrete),2,0.45,0.8231966053748232,0.9002929957829674,47.52090668678284,0.9002929957829674
189,7,AdaBoost (Real),2,0.45,0.8217821782178217,0.8969830651823697,59.36807894706726,0.8969830651823697
190,7,Logistic Regression (Penalty = L2),2,0.45,0.8797736916548797,0.9299309820889741,0.2726304531097412,0.9299309820889741
191,7,Naive Bayes,2,0.45,0.8458274398868458,0.9190976999002275,0.10340404510498047,0.9190976999002275
192,8,KNeighbors Classifier,0,0.45,0.9830985915492958,0.9728972155841619,0.6214845180511475,0.9728972155841619
193,8,SVC Classifier,0,0.45,0.9098591549295775,0.4530153324120529,0.8293094635009766,0.4530153324120529
194,8,Decision Tree,0,0.45,0.9788732394366197,0.9661888316063441,0.11155462265014648,0.9661888316063441
195,8,RandomForest,0,0.45,0.7859154929577464,0.31889640207164033,0.8326544761657715,0.0
196,8,AdaBoost (Discrete),0,0.45,0.8901408450704226,0.4236090741960986,46.073805809020996,0.4236090741960986
197,8,AdaBoost (Real),0,0.45,0.9253521126760563,0.9479556599505218,59.50064039230347,0.9479556599505218
198,8,Logistic Regression (Penalty = L2),0,0.45,0.9845070422535211,0.9705393645157323,0.310469388961792,0.9705393645157323
199,8,Naive Bayes,0,0.45,0.9492957746478873,0.9750961659762587,0.0031566619873046875,0.9750961659762587
200,8,KNeighbors Classifier,1,0.45,0.9746121297602257,0.9331360652822656,0.5302512645721436,0.9331360652822656
201,8,SVC Classifier,1,0.45,0.9760225669957687,0.9369604361556937,0.6347131729125977,0.9369604361556937
202,8,Decision Tree,1,0.45,0.9633286318758815,0.8775840742752219,0.002209186553955078,0.8775840742752219
203,8,RandomForest,1,0.45,0.7997179125528914,0.5042194840896107,0.7488110065460205,0.0
204,8,AdaBoost (Discrete),1,0.45,0.8998589562764457,0.6621963893509659,49.73618936538696,0.6621963893509659
205,8,AdaBoost (Real),1,0.45,0.765867418899859,0.8693548248005086,58.67876052856445,0.8693548248005086
206,8,Logistic Regression (Penalty = L2),1,0.45,0.9760225669957687,0.9369604361556937,0.3290116786956787,0.9369604361556937
207,8,Naive Bayes,1,0.45,0.8702397743300423,0.9338451038203882,0.20917224884033203,0.9338451038203882
208,8,KNeighbors Classifier,2,0.45,0.9773691654879774,0.9732008344513453,0.6280567646026611,0.9732008344513453
209,8,SVC Classifier,2,0.45,0.9915134370579916,0.9791605716903751,0.9200458526611328,0.9791605716903751
210,8,Decision Tree,2,0.45,0.9731258840169731,0.9684655149140913,0.002812623977661133,0.9684655149140913
211,8,RandomForest,2,0.45,0.8486562942008486,0.7071067811865476,0.6229257583618164,0.0
212,8,AdaBoost (Discrete),2,0.45,0.8458274398868458,0.9190976999002275,47.11251211166382,0.9190976999002275
213,8,AdaBoost (Real),2,0.45,0.9702970297029703,0.9458744702401927,60.46364068984985,0.9458744702401927
214,8,Logistic Regression (Penalty = L2),2,0.45,0.9915134370579916,0.9791605716903751,0.33809828758239746,0.9791605716903751
215,8,Naive Bayes,2,0.45,0.8458274398868458,0.9190976999002275,0.18561959266662598,0.9190976999002275
216,9,KNeighbors Classifier,0,0.45,0.9802816901408451,0.9717100304933081,0.4601786136627197,0.9717100304933081
217,9,SVC Classifier,0,0.45,0.9014084507042254,0.9561361361937124,0.8102080821990967,0.0
218,9,Decision Tree,0,0.45,0.9704225352112676,0.9422910025033814,0.09851241111755371,0.9422910025033814
219,9,RandomForest,0,0.45,0.895774647887324,0.9257593906743554,0.667647123336792,0.0
220,9,AdaBoost (Discrete),0,0.45,0.9661971830985916,0.9686122957256189,45.362977504730225,0.9686122957256189
221,9,AdaBoost (Real),0,0.45,0.9859154929577465,0.9740815103815855,55.1324565410614,0.9740815103815855
222,9,Logistic Regression (Penalty = L2),0,0.45,0.9859154929577465,0.9740815103815855,0.32239365577697754,0.9740815103815855
223,9,Naive Bayes,0,0.45,0.9492957746478873,0.9750961659762587,0.07930135726928711,0.9750961659762587
224,9,KNeighbors Classifier,1,0.45,0.9760225669957687,0.9369604361556937,0.613349199295044,0.9369604361556937
225,9,SVC Classifier,1,0.45,0.9153737658674189,0.5969560271087193,0.7140605449676514,0.5969560271087193
226,9,Decision Tree,1,0.45,0.9548660084626234,0.8686947568258243,0.10941767692565918,0.8686947568258243
227,9,RandomForest,1,0.45,0.8970380818053597,0.563578072628481,0.8823354244232178,0.563578072628481
228,9,AdaBoost (Discrete),1,0.45,0.9492242595204513,0.8750319826590442,44.995635986328125,0.8750319826590442
229,9,AdaBoost (Real),1,0.45,0.9492242595204513,0.872407973635664,53.18568015098572,0.872407973635664
230,9,Logistic Regression (Penalty = L2),1,0.45,0.9760225669957687,0.9369604361556937,0.3368508815765381,0.9369604361556937
231,9,Naive Bayes,1,0.45,0.8631875881523272,0.9011137873983701,0.08864092826843262,0.9011137873983701
232,9,KNeighbors Classifier,2,0.45,0.9787835926449788,0.9767142253361611,0.3548884391784668,0.9767142253361611
233,9,SVC Classifier,2,0.45,0.9094766619519095,0.9689042833036098,0.6535995006561279,0.0
234,9,Decision Tree,2,0.45,0.9787835926449788,0.9648717952399897,0.09537386894226074,0.9648717952399897
235,9,RandomForest,2,0.45,0.8557284299858557,0.7423074889580902,0.6450002193450928,0.0
236,9,AdaBoost (Discrete),2,0.45,0.9787835926449788,0.9658354904106708,41.9699923992157,0.9658354904106708
237,9,AdaBoost (Real),2,0.45,0.9660537482319661,0.9654615703228129,52.25040054321289,0.9654615703228129
238,9,Logistic Regression (Penalty = L2),2,0.45,0.9915134370579916,0.9791605716903751,0.20653915405273438,0.9791605716903751
239,9,Naive Bayes,2,0.45,0.8458274398868458,0.9190976999002275,0.05313467979431152,0.9190976999002275
240,10,KNeighbors Classifier,0,0.45,0.9845070422535211,0.9792992186394924,0.9876260757446289,0.9792992186394924
241,10,SVC Classifier,0,0.45,0.9098591549295775,0.4530153324120529,0.7188003063201904,0.4530153324120529
242,10,Decision Tree,0,0.45,0.9732394366197183,0.9568321656944232,0.08309245109558105,0.9568321656944232
243,10,RandomForest,0,0.45,0.823943661971831,0.28832365613754857,0.7099030017852783,0.28832365613754857
244,10,AdaBoost (Discrete),0,0.45,0.9845070422535211,0.9705393645157323,44.99035120010376,0.9705393645157323
245,10,AdaBoost (Real),0,0.45,0.9788732394366197,0.9711153485635676,49.4533212184906,0.9711153485635676
246,10,Logistic Regression (Penalty = L2),0,0.45,0.9859154929577465,0.9740815103815855,0.24518251419067383,0.9740815103815855
247,10,Naive Bayes,0,0.45,0.9605633802816902,0.9746212105531656,0.141585111618042,0.9746212105531656
248,10,KNeighbors Classifier,1,0.45,0.9619181946403385,0.9376223653311077,0.8464417457580566,0.9376223653311077
249,10,SVC Classifier,1,0.45,0.9760225669957687,0.9369604361556937,0.7937426567077637,0.9369604361556937
250,10,Decision Tree,1,0.45,0.9562764456981664,0.9289713468687711,0.07176518440246582,0.9289713468687711
251,10,RandomForest,1,0.45,0.8913963328631875,0.5426643535239394,0.5100455284118652,0.5426643535239394
252,10,AdaBoost (Discrete),1,0.45,0.9703808180535967,0.9184735248681712,38.86090564727783,0.9184735248681712
253,10,AdaBoost (Real),1,0.45,0.8730606488011283,0.8933176088098207,40.039573431015015,0.8933176088098207
254,10,Logistic Regression (Penalty = L2),1,0.45,0.9689703808180536,0.952862543158879,0.24767732620239258,0.952862543158879
255,10,Naive Bayes,1,0.45,0.9055007052186178,0.9451072564148725,0.08092355728149414,0.9451072564148725
256,10,KNeighbors Classifier,2,0.45,0.9660537482319661,0.9625121172657743,0.6767110824584961,0.9625121172657743
257,10,SVC Classifier,2,0.45,0.9915134370579916,0.9791605716903751,0.4839489459991455,0.9791605716903751
258,10,Decision Tree,2,0.45,0.8401697312588402,0.8744236038422061,0.05937695503234863,0.8744236038422061
259,10,RandomForest,2,0.45,0.8925035360678925,0.6414247741349381,0.4329564571380615,0.6414247741349381
260,10,AdaBoost (Discrete),2,0.45,0.768033946251768,0.8490118293125583,34.240894079208374,0.8490118293125583
261,10,AdaBoost (Real),2,0.45,0.7736916548797736,0.8703436688554287,39.024208307266235,0.8703436688554287
262,10,Logistic Regression (Penalty = L2),2,0.45,0.8783592644978784,0.9292737868297294,0.23484015464782715,0.9292737868297294
263,10,Naive Bayes,2,0.45,0.8514851485148515,0.9218372025394211,0.06028461456298828,0.9218372025394211
264,11,KNeighbors Classifier,0,0.45,0.9859154929577465,0.9770041569835014,0.7793877124786377,0.9770041569835014
265,11,SVC Classifier,0,0.45,0.9098591549295775,0.4530153324120529,0.7725687026977539,0.4530153324120529
266,11,Decision Tree,0,0.45,0.9084507042253521,0.9431596193476586,0.0407564640045166,0.9431596193476586
267,11,RandomForest,0,0.45,0.8225352112676056,0.2848495388819001,0.4187180995941162,0.2848495388819001
268,11,AdaBoost (Discrete),0,0.45,0.9661971830985916,0.9657301250182015,40.9500629901886,0.9657301250182015
269,11,AdaBoost (Real),0,0.45,0.9464788732394366,0.9628832820287979,45.280667781829834,0.9628832820287979
270,11,Logistic Regression (Penalty = L2),0,0.45,0.9704225352112676,0.9704227902110237,0.24808645248413086,0.9704227902110237
271,11,Naive Bayes,0,0.45,0.971830985915493,0.976722909042524,0.06488561630249023,0.976722909042524
272,11,KNeighbors Classifier,1,0.45,0.9506346967559943,0.9298339020039113,0.6455559730529785,0.9298339020039113
273,11,SVC Classifier,1,0.45,0.9760225669957687,0.9369604361556937,0.6955864429473877,0.9369604361556937
274,11,Decision Tree,1,0.45,0.92524682651622,0.847194444014904,0.05714559555053711,0.847194444014904
275,11,RandomForest,1,0.45,0.842031029619182,0.4218297582433938,0.44593262672424316,0.4218297582433938
276,11,AdaBoost (Discrete),1,0.45,0.9647390691114246,0.896062730767775,38.70660328865051,0.896062730767775
277,11,AdaBoost (Real),1,0.45,0.8928067700987306,0.9161799378471548,42.65332055091858,0.9161799378471548
278,11,Logistic Regression (Penalty = L2),1,0.45,0.9732016925246827,0.9576354655560266,0.2303006649017334,0.9576354655560266
279,11,Naive Bayes,1,0.45,0.9322990126939351,0.9516735178174022,0.05771994590759277,0.9516735178174022
280,11,KNeighbors Classifier,2,0.45,0.9816124469589816,0.9720458266428861,0.6353414058685303,0.9720458266428861
281,11,SVC Classifier,2,0.45,0.9915134370579916,0.9791605716903751,0.5847411155700684,0.9791605716903751
282,11,Decision Tree,2,0.45,0.7567185289957568,0.8004122774982766,0.04850029945373535,0.8004122774982766
283,11,RandomForest,2,0.45,0.8939179632248939,0.6776546119093839,0.37465929985046387,0.6776546119093839
284,11,AdaBoost (Discrete),2,0.45,0.8826025459688827,0.9285082690399746,35.082486391067505,0.9285082690399746
285,11,AdaBoost (Real),2,0.45,0.7793493635077794,0.8732351973024286,38.4892144203186,0.8732351973024286
286,11,Logistic Regression (Penalty = L2),2,0.45,0.9519094766619519,0.9651435789225384,0.335219144821167,0.9651435789225384
287,11,Naive Bayes,2,0.45,0.8698727015558698,0.930630017684299,0.04871368408203125,0.930630017684299
288,12,KNeighbors Classifier,0,0.45,0.952112676056338,0.9470537517076242,0.1884474754333496,0.9470537517076242
289,12,SVC Classifier,0,0.45,0.9014084507042254,0.9561361361937124,0.28922343254089355,0.0
290,12,Decision Tree,0,0.45,0.9478873239436619,0.9549697236929222,0.04769635200500488,0.9549697236929222
291,12,RandomForest,0,0.45,0.9014084507042254,0.9561361361937124,0.3397951126098633,0.0
292,12,AdaBoost (Discrete),0,0.45,0.976056338028169,0.9364568572363935,20.47573184967041,0.9364568572363935
293,12,AdaBoost (Real),0,0.45,0.8464788732394366,0.566535339818258,25.59840178489685,0.566535339818258
294,12,Logistic Regression (Penalty = L2),0,0.45,0.9492957746478873,0.9555779848278876,0.08523964881896973,0.9555779848278876
295,12,Naive Bayes,0,0.45,0.9211267605633803,0.9432624631155767,0.03936576843261719,0.9432624631155767
296,12,KNeighbors Classifier,1,0.45,0.9351198871650211,0.8582940470148803,0.21240782737731934,0.8582940470148803
297,12,SVC Classifier,1,0.45,0.9153737658674189,0.5969560271087193,0.2952582836151123,0.5969560271087193
298,12,Decision Tree,1,0.45,0.9337094499294781,0.8577589508368971,0.002746105194091797,0.8577589508368971
299,12,RandomForest,1,0.45,0.8942172073342737,0.9147320339189784,0.31974029541015625,0.0
300,12,AdaBoost (Discrete),1,0.45,0.9294781382228491,0.8561496432090854,19.652441024780273,0.8561496432090854
301,12,AdaBoost (Real),1,0.45,0.9125528913963329,0.8087863193721467,25.233137845993042,0.8087863193721467
302,12,Logistic Regression (Penalty = L2),1,0.45,0.9351198871650211,0.8347278705361357,0.08884239196777344,0.8347278705361357
303,12,Naive Bayes,1,0.45,0.9379407616361072,0.8705570473406798,0.044504642486572266,0.8705570473406798
304,12,KNeighbors Classifier,2,0.45,0.9519094766619519,0.8974933878197581,0.2215869426727295,0.8974933878197581
305,12,SVC Classifier,2,0.45,0.8571428571428571,0.7491491772643939,0.2624847888946533,0.0
306,12,Decision Tree,2,0.45,0.9519094766619519,0.8974933878197581,0.04241752624511719,0.8974933878197581
307,12,RandomForest,2,0.45,0.9094766619519095,0.9689042833036098,0.33764004707336426,0.0
308,12,AdaBoost (Discrete),2,0.45,0.9094766619519095,0.9689042833036098,21.203868865966797,0.0
309,12,AdaBoost (Real),2,0.45,0.9024045261669024,0.7651153830213104,24.542155265808105,0.7651153830213104
310,12,Logistic Regression (Penalty = L2),2,0.45,0.9547383309759547,0.8986103689199537,0.096038818359375,0.8986103689199537
311,12,Naive Bayes,2,0.45,0.8175388967468176,0.9051486875927208,0.04685378074645996,0.9051486875927208
