,feat_set_id,classifier,fold_id,feat_th,score,geo_score,exec_t,geo_score_woz
0,0,KNeighbors Classifier,0,1.0,0.48577235772357724,0.4228854602289914,0.04466414451599121,0.4228854602289914
1,0,SVC Classifier,0,1.0,0.4268292682926829,1.0,0.1317899227142334,0.0
2,0,Decision Tree,0,1.0,0.483739837398374,0.44897550948749093,0.04444289207458496,0.44897550948749093
3,0,RandomForest,0,1.0,0.49390243902439024,0.35924262487992414,0.09273958206176758,0.35924262487992414
4,0,AdaBoost (Discrete),0,1.0,0.5386178861788617,0.4873420114817136,5.749791860580444,0.4873420114817136
5,0,AdaBoost (Real),0,1.0,0.48577235772357724,0.43906834990447113,6.9077231884002686,0.43906834990447113
6,0,Logistic Regression (Penalty = L2),0,1.0,0.5040650406504065,0.4451639245572657,0.06048774719238281,0.4451639245572657
7,0,Naive Bayes,0,1.0,0.4491869918699187,0.4623015062177744,0.02144622802734375,0.4623015062177744
8,0,KNeighbors Classifier,1,1.0,0.45621181262729127,0.42398086068424296,0.05310177803039551,0.42398086068424296
9,0,SVC Classifier,1,1.0,0.42769857433808556,1.0,0.14625334739685059,0.0
10,0,Decision Tree,1,1.0,0.4419551934826884,0.412533739052169,0.019617557525634766,0.412533739052169
11,0,RandomForest,1,1.0,0.5030549898167006,0.5988317290991773,0.11485910415649414,0.0
12,0,AdaBoost (Discrete),1,1.0,0.5417515274949084,0.5145172609061862,6.325192451477051,0.5145172609061862
13,0,AdaBoost (Real),1,1.0,0.5091649694501018,0.470965463715331,6.860795259475708,0.470965463715331
14,0,Logistic Regression (Penalty = L2),1,1.0,0.5234215885947047,0.4704947408915208,0.024852514266967773,0.4704947408915208
15,0,Naive Bayes,1,1.0,0.4847250509164969,0.5006527422555169,0.02036881446838379,0.5006527422555169
16,0,KNeighbors Classifier,2,1.0,0.42857142857142855,0.37856415312782427,0.05078411102294922,0.37856415312782427
17,0,SVC Classifier,2,1.0,0.42653061224489797,1.0,0.1153559684753418,0.0
18,0,Decision Tree,2,1.0,0.42448979591836733,0.406924655342359,0.0036399364471435547,0.406924655342359
19,0,RandomForest,2,1.0,0.5020408163265306,0.3574494095402627,0.09137344360351562,0.3574494095402627
20,0,AdaBoost (Discrete),2,1.0,0.5265306122448979,0.4988211239878325,5.068400859832764,0.4988211239878325
21,0,AdaBoost (Real),2,1.0,0.48367346938775513,0.4698035348230519,6.448582649230957,0.4698035348230519
22,0,Logistic Regression (Penalty = L2),2,1.0,0.5163265306122449,0.4603473901017494,0.025386571884155273,0.4603473901017494
23,0,Naive Bayes,2,1.0,0.4673469387755102,0.48011697645390805,0.019989013671875,0.48011697645390805
24,1,KNeighbors Classifier,0,1.0,0.48577235772357724,0.4228854602289914,0.04966115951538086,0.4228854602289914
25,1,SVC Classifier,0,1.0,0.4268292682926829,1.0,0.11371541023254395,0.0
26,1,Decision Tree,0,1.0,0.4349593495934959,0.39089625527986116,0.019241809844970703,0.39089625527986116
27,1,RandomForest,0,1.0,0.49390243902439024,0.35924262487992414,0.11142444610595703,0.35924262487992414
28,1,AdaBoost (Discrete),0,1.0,0.5386178861788617,0.4873420114817136,5.747500419616699,0.4873420114817136
29,1,AdaBoost (Real),0,1.0,0.48577235772357724,0.43906834990447113,6.973351240158081,0.43906834990447113
30,1,Logistic Regression (Penalty = L2),0,1.0,0.5040650406504065,0.4451639245572657,0.025600910186767578,0.4451639245572657
31,1,Naive Bayes,0,1.0,0.4491869918699187,0.4623015062177744,0.012119054794311523,0.4623015062177744
32,1,KNeighbors Classifier,1,1.0,0.45621181262729127,0.42398086068424296,0.0297086238861084,0.42398086068424296
33,1,SVC Classifier,1,1.0,0.42769857433808556,1.0,0.11943984031677246,0.0
34,1,Decision Tree,1,1.0,0.505091649694501,0.4988474559405196,0.019312143325805664,0.4988474559405196
35,1,RandomForest,1,1.0,0.5030549898167006,0.5988317290991773,0.07262277603149414,0.0
36,1,AdaBoost (Discrete),1,1.0,0.5417515274949084,0.5145172609061862,5.438899517059326,0.5145172609061862
37,1,AdaBoost (Real),1,1.0,0.5091649694501018,0.470965463715331,6.498059272766113,0.470965463715331
38,1,Logistic Regression (Penalty = L2),1,1.0,0.5234215885947047,0.4704947408915208,0.041738271713256836,0.4704947408915208
39,1,Naive Bayes,1,1.0,0.4847250509164969,0.5006527422555169,0.004410743713378906,0.5006527422555169
40,1,KNeighbors Classifier,2,1.0,0.42857142857142855,0.37856415312782427,0.04848623275756836,0.37856415312782427
41,1,SVC Classifier,2,1.0,0.42653061224489797,1.0,0.12075448036193848,0.0
42,1,Decision Tree,2,1.0,0.48367346938775513,0.4555649479319352,0.01911306381225586,0.4555649479319352
43,1,RandomForest,2,1.0,0.5020408163265306,0.3574494095402627,0.07199716567993164,0.3574494095402627
44,1,AdaBoost (Discrete),2,1.0,0.5265306122448979,0.4988211239878325,5.308797359466553,0.4988211239878325
45,1,AdaBoost (Real),2,1.0,0.4816326530612245,0.4684135754134781,6.415654420852661,0.4684135754134781
46,1,Logistic Regression (Penalty = L2),2,1.0,0.5163265306122449,0.4603473901017494,0.005829811096191406,0.4603473901017494
47,1,Naive Bayes,2,1.0,0.4673469387755102,0.48011697645390805,0.01942276954650879,0.48011697645390805
48,2,KNeighbors Classifier,0,1.0,0.48577235772357724,0.4228854602289914,0.05069732666015625,0.4228854602289914
49,2,SVC Classifier,0,1.0,0.4268292682926829,1.0,0.12280130386352539,0.0
50,2,Decision Tree,0,1.0,0.4817073170731707,0.44517363007715455,0.0025053024291992188,0.44517363007715455
51,2,RandomForest,0,1.0,0.49390243902439024,0.35924262487992414,0.06960296630859375,0.35924262487992414
52,2,AdaBoost (Discrete),0,1.0,0.5386178861788617,0.4873420114817136,5.892796993255615,0.4873420114817136
53,2,AdaBoost (Real),0,1.0,0.48577235772357724,0.43906834990447113,7.165020704269409,0.43906834990447113
54,2,Logistic Regression (Penalty = L2),0,1.0,0.5040650406504065,0.4451639245572657,0.0238649845123291,0.4451639245572657
55,2,Naive Bayes,0,1.0,0.4491869918699187,0.4623015062177744,0.004398822784423828,0.4623015062177744
56,2,KNeighbors Classifier,1,1.0,0.45621181262729127,0.42398086068424296,0.048235177993774414,0.42398086068424296
57,2,SVC Classifier,1,1.0,0.42769857433808556,1.0,0.12110590934753418,0.0
58,2,Decision Tree,1,1.0,0.4725050916496945,0.4395517396089599,0.01900172233581543,0.4395517396089599
59,2,RandomForest,1,1.0,0.5030549898167006,0.5988317290991773,0.07779216766357422,0.0
60,2,AdaBoost (Discrete),1,1.0,0.5417515274949084,0.5145172609061862,5.74039363861084,0.5145172609061862
61,2,AdaBoost (Real),1,1.0,0.5091649694501018,0.470965463715331,6.446289539337158,0.470965463715331
62,2,Logistic Regression (Penalty = L2),1,1.0,0.5234215885947047,0.4704947408915208,0.023842334747314453,0.4704947408915208
63,2,Naive Bayes,1,1.0,0.4847250509164969,0.5006527422555169,0.002887248992919922,0.5006527422555169
64,2,KNeighbors Classifier,2,1.0,0.42857142857142855,0.37856415312782427,0.054735660552978516,0.37856415312782427
65,2,SVC Classifier,2,1.0,0.42653061224489797,1.0,0.11983013153076172,0.0
66,2,Decision Tree,2,1.0,0.4775510204081633,0.4522726321114386,0.018985271453857422,0.4522726321114386
67,2,RandomForest,2,1.0,0.5020408163265306,0.3574494095402627,0.09205865859985352,0.3574494095402627
68,2,AdaBoost (Discrete),2,1.0,0.5265306122448979,0.4988211239878325,5.943297863006592,0.4988211239878325
69,2,AdaBoost (Real),2,1.0,0.4816326530612245,0.46776088495995544,7.19009804725647,0.46776088495995544
70,2,Logistic Regression (Penalty = L2),2,1.0,0.5163265306122449,0.4603473901017494,0.02445697784423828,0.4603473901017494
71,2,Naive Bayes,2,1.0,0.4673469387755102,0.48011697645390805,0.019932985305786133,0.48011697645390805
72,3,KNeighbors Classifier,0,1.0,0.48577235772357724,0.4228854602289914,0.05070996284484863,0.4228854602289914
73,3,SVC Classifier,0,1.0,0.4268292682926829,1.0,0.15165042877197266,0.0
74,3,Decision Tree,0,1.0,0.46747967479674796,0.4279844079271636,0.003543853759765625,0.4279844079271636
75,3,RandomForest,0,1.0,0.49390243902439024,0.35924262487992414,0.09528446197509766,0.35924262487992414
76,3,AdaBoost (Discrete),0,1.0,0.5386178861788617,0.4873420114817136,5.583983898162842,0.4873420114817136
77,3,AdaBoost (Real),0,1.0,0.48577235772357724,0.43906834990447113,6.501002073287964,0.43906834990447113
78,3,Logistic Regression (Penalty = L2),0,1.0,0.5040650406504065,0.4451639245572657,0.023607492446899414,0.4451639245572657
79,3,Naive Bayes,0,1.0,0.4491869918699187,0.4623015062177744,0.019997358322143555,0.4623015062177744
80,3,KNeighbors Classifier,1,1.0,0.45621181262729127,0.42398086068424296,0.05097532272338867,0.42398086068424296
81,3,SVC Classifier,1,1.0,0.42769857433808556,1.0,0.12345099449157715,0.0
82,3,Decision Tree,1,1.0,0.4684317718940937,0.44557374463456256,0.0036232471466064453,0.44557374463456256
83,3,RandomForest,1,1.0,0.5030549898167006,0.5988317290991773,0.10170960426330566,0.0
84,3,AdaBoost (Discrete),1,1.0,0.5417515274949084,0.5145172609061862,5.321678876876831,0.5145172609061862
85,3,AdaBoost (Real),1,1.0,0.5091649694501018,0.470965463715331,6.279591083526611,0.470965463715331
86,3,Logistic Regression (Penalty = L2),1,1.0,0.5234215885947047,0.4704947408915208,0.02384185791015625,0.4704947408915208
87,3,Naive Bayes,1,1.0,0.4847250509164969,0.5006527422555169,0.004295825958251953,0.5006527422555169
88,3,KNeighbors Classifier,2,1.0,0.42857142857142855,0.37856415312782427,0.06604146957397461,0.37856415312782427
89,3,SVC Classifier,2,1.0,0.42653061224489797,1.0,0.1230170726776123,0.0
90,3,Decision Tree,2,1.0,0.4387755102040816,0.4127624638833126,0.0027458667755126953,0.4127624638833126
91,3,RandomForest,2,1.0,0.5020408163265306,0.3574494095402627,0.07300305366516113,0.3574494095402627
92,3,AdaBoost (Discrete),2,1.0,0.5265306122448979,0.4988211239878325,5.137854099273682,0.4988211239878325
93,3,AdaBoost (Real),2,1.0,0.47959183673469385,0.46637696892849023,6.072062253952026,0.46637696892849023
94,3,Logistic Regression (Penalty = L2),2,1.0,0.5163265306122449,0.4603473901017494,0.023241519927978516,0.4603473901017494
95,3,Naive Bayes,2,1.0,0.4673469387755102,0.48011697645390805,0.002743959426879883,0.48011697645390805
96,4,KNeighbors Classifier,0,1.0,0.48577235772357724,0.4228854602289914,0.0663602352142334,0.4228854602289914
97,4,SVC Classifier,0,1.0,0.4268292682926829,1.0,0.12400412559509277,0.0
98,4,Decision Tree,0,1.0,0.4573170731707317,0.4160086855025569,0.002375364303588867,0.4160086855025569
99,4,RandomForest,0,1.0,0.49390243902439024,0.35924262487992414,0.07626628875732422,0.35924262487992414
100,4,AdaBoost (Discrete),0,1.0,0.5386178861788617,0.4873420114817136,5.1116862297058105,0.4873420114817136
101,4,AdaBoost (Real),0,1.0,0.48577235772357724,0.43906834990447113,6.039499521255493,0.43906834990447113
102,4,Logistic Regression (Penalty = L2),0,1.0,0.5040650406504065,0.4451639245572657,0.023856401443481445,0.4451639245572657
103,4,Naive Bayes,0,1.0,0.4491869918699187,0.4623015062177744,0.0044519901275634766,0.4623015062177744
104,4,KNeighbors Classifier,1,1.0,0.45621181262729127,0.42398086068424296,0.05037283897399902,0.42398086068424296
105,4,SVC Classifier,1,1.0,0.42769857433808556,1.0,0.12328529357910156,0.0
106,4,Decision Tree,1,1.0,0.45213849287169044,0.4166057800854711,0.019846677780151367,0.4166057800854711
107,4,RandomForest,1,1.0,0.5030549898167006,0.5988317290991773,0.07622647285461426,0.0
108,4,AdaBoost (Discrete),1,1.0,0.5417515274949084,0.5145172609061862,5.14209508895874,0.5145172609061862
109,4,AdaBoost (Real),1,1.0,0.5091649694501018,0.470965463715331,6.826362371444702,0.470965463715331
110,4,Logistic Regression (Penalty = L2),1,1.0,0.5234215885947047,0.4704947408915208,0.01606273651123047,0.4704947408915208
111,4,Naive Bayes,1,1.0,0.4847250509164969,0.5006527422555169,0.020320415496826172,0.5006527422555169
112,4,KNeighbors Classifier,2,1.0,0.42857142857142855,0.37856415312782427,0.049612998962402344,0.37856415312782427
113,4,SVC Classifier,2,1.0,0.42653061224489797,1.0,0.10935568809509277,0.0
114,4,Decision Tree,2,1.0,0.4775510204081633,0.4580760248224804,0.003713846206665039,0.4580760248224804
115,4,RandomForest,2,1.0,0.5020408163265306,0.3574494095402627,0.09182405471801758,0.3574494095402627
116,4,AdaBoost (Discrete),2,1.0,0.5265306122448979,0.4988211239878325,5.3781187534332275,0.4988211239878325
117,4,AdaBoost (Real),2,1.0,0.4816326530612245,0.4684135754134781,6.476232051849365,0.4684135754134781
118,4,Logistic Regression (Penalty = L2),2,1.0,0.5163265306122449,0.4603473901017494,0.023652076721191406,0.4603473901017494
119,4,Naive Bayes,2,1.0,0.4673469387755102,0.48011697645390805,0.003615856170654297,0.48011697645390805
120,5,KNeighbors Classifier,0,1.0,0.48577235772357724,0.4228854602289914,0.04799056053161621,0.4228854602289914
121,5,SVC Classifier,0,1.0,0.4268292682926829,1.0,0.12319326400756836,0.0
122,5,Decision Tree,0,1.0,0.47560975609756095,0.443282354784233,0.003126859664916992,0.443282354784233
123,5,RandomForest,0,1.0,0.49390243902439024,0.35924262487992414,0.09410381317138672,0.35924262487992414
124,5,AdaBoost (Discrete),0,1.0,0.5386178861788617,0.4873420114817136,5.394930839538574,0.4873420114817136
125,5,AdaBoost (Real),0,1.0,0.48577235772357724,0.43906834990447113,6.460574388504028,0.43906834990447113
126,5,Logistic Regression (Penalty = L2),0,1.0,0.5040650406504065,0.4451639245572657,0.02337956428527832,0.4451639245572657
127,5,Naive Bayes,0,1.0,0.4491869918699187,0.4623015062177744,0.0035278797149658203,0.4623015062177744
128,5,KNeighbors Classifier,1,1.0,0.45621181262729127,0.42398086068424296,0.04509568214416504,0.42398086068424296
129,5,SVC Classifier,1,1.0,0.42769857433808556,1.0,0.10364484786987305,0.0
130,5,Decision Tree,1,1.0,0.49490835030549896,0.48093649387751775,0.0037364959716796875,0.48093649387751775
131,5,RandomForest,1,1.0,0.5030549898167006,0.5988317290991773,0.10136842727661133,0.0
132,5,AdaBoost (Discrete),1,1.0,0.5417515274949084,0.5145172609061862,5.322253227233887,0.5145172609061862
133,5,AdaBoost (Real),1,1.0,0.5091649694501018,0.470965463715331,6.2374608516693115,0.470965463715331
134,5,Logistic Regression (Penalty = L2),1,1.0,0.5234215885947047,0.4704947408915208,0.023920297622680664,0.4704947408915208
135,5,Naive Bayes,1,1.0,0.4847250509164969,0.5006527422555169,0.0038366317749023438,0.5006527422555169
136,5,KNeighbors Classifier,2,1.0,0.42857142857142855,0.37856415312782427,0.042467594146728516,0.37856415312782427
137,5,SVC Classifier,2,1.0,0.42653061224489797,1.0,0.12045407295227051,0.0
138,5,Decision Tree,2,1.0,0.45918367346938777,0.4300059004215135,0.003640890121459961,0.4300059004215135
139,5,RandomForest,2,1.0,0.5020408163265306,0.3574494095402627,0.09703350067138672,0.3574494095402627
140,5,AdaBoost (Discrete),2,1.0,0.5265306122448979,0.4988211239878325,5.041453123092651,0.4988211239878325
141,5,AdaBoost (Real),2,1.0,0.48367346938775513,0.4698035348230519,6.194714307785034,0.4698035348230519
142,5,Logistic Regression (Penalty = L2),2,1.0,0.5163265306122449,0.4603473901017494,0.022928714752197266,0.4603473901017494
143,5,Naive Bayes,2,1.0,0.4673469387755102,0.48011697645390805,0.003988742828369141,0.48011697645390805
144,6,KNeighbors Classifier,0,1.0,0.48577235772357724,0.4228854602289914,0.04837346076965332,0.4228854602289914
145,6,SVC Classifier,0,1.0,0.4268292682926829,1.0,0.11305713653564453,0.0
146,6,Decision Tree,0,1.0,0.4735772357723577,0.4366514589685544,0.0023560523986816406,0.4366514589685544
147,6,RandomForest,0,1.0,0.49390243902439024,0.35924262487992414,0.07182860374450684,0.35924262487992414
148,6,AdaBoost (Discrete),0,1.0,0.5386178861788617,0.4873420114817136,5.206674814224243,0.4873420114817136
149,6,AdaBoost (Real),0,1.0,0.48577235772357724,0.43906834990447113,6.249954700469971,0.43906834990447113
150,6,Logistic Regression (Penalty = L2),0,1.0,0.5040650406504065,0.4451639245572657,0.0058591365814208984,0.4451639245572657
151,6,Naive Bayes,0,1.0,0.4491869918699187,0.4623015062177744,0.020180702209472656,0.4623015062177744
152,6,KNeighbors Classifier,1,1.0,0.45621181262729127,0.42398086068424296,0.04816579818725586,0.42398086068424296
153,6,SVC Classifier,1,1.0,0.42769857433808556,1.0,0.10042834281921387,0.0
154,6,Decision Tree,1,1.0,0.4847250509164969,0.44352127081880854,0.0034399032592773438,0.44352127081880854
155,6,RandomForest,1,1.0,0.5030549898167006,0.5988317290991773,0.09671282768249512,0.0
156,6,AdaBoost (Discrete),1,1.0,0.5417515274949084,0.5145172609061862,5.906489133834839,0.5145172609061862
157,6,AdaBoost (Real),1,1.0,0.5091649694501018,0.470965463715331,5.92452073097229,0.470965463715331
158,6,Logistic Regression (Penalty = L2),1,1.0,0.5234215885947047,0.4704947408915208,0.005694389343261719,0.4704947408915208
159,6,Naive Bayes,1,1.0,0.4847250509164969,0.5006527422555169,0.0025000572204589844,0.5006527422555169
160,6,KNeighbors Classifier,2,1.0,0.42857142857142855,0.37856415312782427,0.06710052490234375,0.37856415312782427
161,6,SVC Classifier,2,1.0,0.42653061224489797,1.0,0.09579825401306152,0.0
162,6,Decision Tree,2,1.0,0.4530612244897959,0.43017724483732855,0.002531766891479492,0.43017724483732855
163,6,RandomForest,2,1.0,0.5020408163265306,0.3574494095402627,0.06923079490661621,0.3574494095402627
164,6,AdaBoost (Discrete),2,1.0,0.5265306122448979,0.4988211239878325,5.391401767730713,0.4988211239878325
165,6,AdaBoost (Real),2,1.0,0.48367346938775513,0.4698035348230519,6.095522880554199,0.4698035348230519
166,6,Logistic Regression (Penalty = L2),2,1.0,0.5163265306122449,0.4603473901017494,0.024392366409301758,0.4603473901017494
167,6,Naive Bayes,2,1.0,0.4673469387755102,0.48011697645390805,0.004370450973510742,0.48011697645390805
168,7,KNeighbors Classifier,0,1.0,0.48577235772357724,0.4228854602289914,0.06710433959960938,0.4228854602289914
169,7,SVC Classifier,0,1.0,0.4268292682926829,1.0,0.10012435913085938,0.0
170,7,Decision Tree,0,1.0,0.47560975609756095,0.4266379312281761,0.00342559814453125,0.4266379312281761
171,7,RandomForest,0,1.0,0.49390243902439024,0.35924262487992414,0.09137463569641113,0.35924262487992414
172,7,AdaBoost (Discrete),0,1.0,0.5386178861788617,0.4873420114817136,5.3149354457855225,0.4873420114817136
173,7,AdaBoost (Real),0,1.0,0.48577235772357724,0.43906834990447113,6.809085845947266,0.43906834990447113
174,7,Logistic Regression (Penalty = L2),0,1.0,0.5040650406504065,0.4451639245572657,0.028094053268432617,0.4451639245572657
175,7,Naive Bayes,0,1.0,0.4491869918699187,0.4623015062177744,0.003591299057006836,0.4623015062177744
176,7,KNeighbors Classifier,1,1.0,0.45621181262729127,0.42398086068424296,0.042405128479003906,0.42398086068424296
177,7,SVC Classifier,1,1.0,0.42769857433808556,1.0,0.12324118614196777,0.0
178,7,Decision Tree,1,1.0,0.45621181262729127,0.4381908896004417,0.0035245418548583984,0.4381908896004417
179,7,RandomForest,1,1.0,0.5030549898167006,0.5988317290991773,0.09306716918945312,0.0
180,7,AdaBoost (Discrete),1,1.0,0.5417515274949084,0.5145172609061862,5.1314263343811035,0.5145172609061862
181,7,AdaBoost (Real),1,1.0,0.5091649694501018,0.470965463715331,6.189156532287598,0.470965463715331
182,7,Logistic Regression (Penalty = L2),1,1.0,0.5234215885947047,0.4704947408915208,0.024750947952270508,0.4704947408915208
183,7,Naive Bayes,1,1.0,0.4847250509164969,0.5006527422555169,0.02023935317993164,0.5006527422555169
184,7,KNeighbors Classifier,2,1.0,0.42857142857142855,0.37856415312782427,0.04867100715637207,0.37856415312782427
185,7,SVC Classifier,2,1.0,0.42653061224489797,1.0,0.13828229904174805,0.0
186,7,Decision Tree,2,1.0,0.47551020408163264,0.44478147549814206,0.019362926483154297,0.44478147549814206
187,7,RandomForest,2,1.0,0.5020408163265306,0.3574494095402627,0.09615445137023926,0.3574494095402627
188,7,AdaBoost (Discrete),2,1.0,0.5265306122448979,0.4988211239878325,5.314679861068726,0.4988211239878325
189,7,AdaBoost (Real),2,1.0,0.48367346938775513,0.4698035348230519,6.639512777328491,0.4698035348230519
190,7,Logistic Regression (Penalty = L2),2,1.0,0.5163265306122449,0.4603473901017494,0.02414560317993164,0.4603473901017494
191,7,Naive Bayes,2,1.0,0.4673469387755102,0.48011697645390805,0.02008509635925293,0.48011697645390805
192,8,KNeighbors Classifier,0,1.0,0.48577235772357724,0.4228854602289914,0.050124168395996094,0.4228854602289914
193,8,SVC Classifier,0,1.0,0.4268292682926829,1.0,0.12409234046936035,0.0
194,8,Decision Tree,0,1.0,0.4329268292682927,0.38068887148464237,0.019521236419677734,0.38068887148464237
195,8,RandomForest,0,1.0,0.49390243902439024,0.35924262487992414,0.07726407051086426,0.35924262487992414
196,8,AdaBoost (Discrete),0,1.0,0.5386178861788617,0.4873420114817136,5.543050765991211,0.4873420114817136
197,8,AdaBoost (Real),0,1.0,0.48577235772357724,0.43906834990447113,5.7503674030303955,0.43906834990447113
198,8,Logistic Regression (Penalty = L2),0,1.0,0.5040650406504065,0.4451639245572657,0.006644487380981445,0.4451639245572657
199,8,Naive Bayes,0,1.0,0.4491869918699187,0.4623015062177744,0.0205533504486084,0.4623015062177744
200,8,KNeighbors Classifier,1,1.0,0.45621181262729127,0.42398086068424296,0.06619071960449219,0.42398086068424296
201,8,SVC Classifier,1,1.0,0.42769857433808556,1.0,0.1223440170288086,0.0
202,8,Decision Tree,1,1.0,0.4725050916496945,0.4458862087935127,0.0034372806549072266,0.4458862087935127
203,8,RandomForest,1,1.0,0.5030549898167006,0.5988317290991773,0.09434390068054199,0.0
204,8,AdaBoost (Discrete),1,1.0,0.5417515274949084,0.5145172609061862,4.687759160995483,0.5145172609061862
205,8,AdaBoost (Real),1,1.0,0.5091649694501018,0.470965463715331,5.7297773361206055,0.470965463715331
206,8,Logistic Regression (Penalty = L2),1,1.0,0.5234215885947047,0.4704947408915208,0.022707700729370117,0.4704947408915208
207,8,Naive Bayes,1,1.0,0.4847250509164969,0.5006527422555169,0.002488851547241211,0.5006527422555169
208,8,KNeighbors Classifier,2,1.0,0.42857142857142855,0.37856415312782427,0.04614377021789551,0.37856415312782427
209,8,SVC Classifier,2,1.0,0.42653061224489797,1.0,0.11264467239379883,0.0
210,8,Decision Tree,2,1.0,0.46122448979591835,0.44666486011098316,0.002523183822631836,0.44666486011098316
211,8,RandomForest,2,1.0,0.5020408163265306,0.3574494095402627,0.08128547668457031,0.3574494095402627
212,8,AdaBoost (Discrete),2,1.0,0.5265306122448979,0.4988211239878325,4.78548789024353,0.4988211239878325
213,8,AdaBoost (Real),2,1.0,0.4816326530612245,0.46776088495995544,6.090154409408569,0.46776088495995544
214,8,Logistic Regression (Penalty = L2),2,1.0,0.5163265306122449,0.4603473901017494,0.01851630210876465,0.4603473901017494
215,8,Naive Bayes,2,1.0,0.4673469387755102,0.48011697645390805,0.003705263137817383,0.48011697645390805
216,9,KNeighbors Classifier,0,1.0,0.48577235772357724,0.4228854602289914,0.06320738792419434,0.4228854602289914
217,9,SVC Classifier,0,1.0,0.4268292682926829,1.0,0.17307138442993164,0.0
218,9,Decision Tree,0,1.0,0.4613821138211382,0.4179728254921312,0.011935234069824219,0.4179728254921312
219,9,RandomForest,0,1.0,0.49390243902439024,0.35924262487992414,0.14605450630187988,0.35924262487992414
220,9,AdaBoost (Discrete),0,1.0,0.5386178861788617,0.4873420114817136,6.002125024795532,0.4873420114817136
221,9,AdaBoost (Real),0,1.0,0.48577235772357724,0.43906834990447113,5.312987804412842,0.43906834990447113
222,9,Logistic Regression (Penalty = L2),0,1.0,0.5040650406504065,0.4451639245572657,0.017787933349609375,0.4451639245572657
223,9,Naive Bayes,0,1.0,0.4491869918699187,0.4623015062177744,0.01587390899658203,0.4623015062177744
224,9,KNeighbors Classifier,1,1.0,0.45621181262729127,0.42398086068424296,0.04468822479248047,0.42398086068424296
225,9,SVC Classifier,1,1.0,0.42769857433808556,1.0,0.11507701873779297,0.0
226,9,Decision Tree,1,1.0,0.49287169042769857,0.4838252258518172,0.019389629364013672,0.4838252258518172
227,9,RandomForest,1,1.0,0.5030549898167006,0.5988317290991773,0.06807303428649902,0.0
228,9,AdaBoost (Discrete),1,1.0,0.5417515274949084,0.5145172609061862,4.475912570953369,0.5145172609061862
229,9,AdaBoost (Real),1,1.0,0.5091649694501018,0.470965463715331,5.990744352340698,0.470965463715331
230,9,Logistic Regression (Penalty = L2),1,1.0,0.5234215885947047,0.4704947408915208,0.022116899490356445,0.4704947408915208
231,9,Naive Bayes,1,1.0,0.4847250509164969,0.5006527422555169,0.027542591094970703,0.5006527422555169
232,9,KNeighbors Classifier,2,1.0,0.42857142857142855,0.37856415312782427,0.03079986572265625,0.37856415312782427
233,9,SVC Classifier,2,1.0,0.42653061224489797,1.0,0.12046456336975098,0.0
234,9,Decision Tree,2,1.0,0.463265306122449,0.4475164465017758,0.019097566604614258,0.4475164465017758
235,9,RandomForest,2,1.0,0.5020408163265306,0.3574494095402627,0.07245707511901855,0.3574494095402627
236,9,AdaBoost (Discrete),2,1.0,0.5265306122448979,0.4988211239878325,4.501136541366577,0.4988211239878325
237,9,AdaBoost (Real),2,1.0,0.4816326530612245,0.46776088495995544,15.445188283920288,0.46776088495995544
238,9,Logistic Regression (Penalty = L2),2,1.0,0.5163265306122449,0.4603473901017494,0.029400348663330078,0.4603473901017494
239,9,Naive Bayes,2,1.0,0.4673469387755102,0.48011697645390805,0.03198862075805664,0.48011697645390805
240,10,KNeighbors Classifier,0,1.0,0.48577235772357724,0.4228854602289914,0.13895440101623535,0.4228854602289914
241,10,SVC Classifier,0,1.0,0.4268292682926829,1.0,0.3013317584991455,0.0
242,10,Decision Tree,0,1.0,0.4898373983739837,0.45596269609157736,0.02721118927001953,0.45596269609157736
243,10,RandomForest,0,1.0,0.49390243902439024,0.35924262487992414,0.1879417896270752,0.35924262487992414
244,10,AdaBoost (Discrete),0,1.0,0.5386178861788617,0.4873420114817136,12.477849245071411,0.4873420114817136
245,10,AdaBoost (Real),0,1.0,0.48577235772357724,0.43906834990447113,14.266327619552612,0.43906834990447113
246,10,Logistic Regression (Penalty = L2),0,1.0,0.5040650406504065,0.4451639245572657,0.05533766746520996,0.4451639245572657
247,10,Naive Bayes,0,1.0,0.4491869918699187,0.4623015062177744,0.027976274490356445,0.4623015062177744
248,10,KNeighbors Classifier,1,1.0,0.45621181262729127,0.42398086068424296,0.11334037780761719,0.42398086068424296
249,10,SVC Classifier,1,1.0,0.42769857433808556,1.0,0.2736489772796631,0.0
250,10,Decision Tree,1,1.0,0.439918533604888,0.4154939137555285,0.02697610855102539,0.4154939137555285
251,10,RandomForest,1,1.0,0.5030549898167006,0.5988317290991773,0.1680011749267578,0.0
252,10,AdaBoost (Discrete),1,1.0,0.5417515274949084,0.5145172609061862,11.846378087997437,0.5145172609061862
253,10,AdaBoost (Real),1,1.0,0.5091649694501018,0.470965463715331,14.31601333618164,0.470965463715331
254,10,Logistic Regression (Penalty = L2),1,1.0,0.5234215885947047,0.4704947408915208,0.07660913467407227,0.4704947408915208
255,10,Naive Bayes,1,1.0,0.4847250509164969,0.5006527422555169,0.02811408042907715,0.5006527422555169
256,10,KNeighbors Classifier,2,1.0,0.42857142857142855,0.37856415312782427,0.11146903038024902,0.37856415312782427
257,10,SVC Classifier,2,1.0,0.42653061224489797,1.0,0.30597782135009766,0.0
258,10,Decision Tree,2,1.0,0.44081632653061226,0.4207248950724362,0.02752518653869629,0.4207248950724362
259,10,RandomForest,2,1.0,0.5020408163265306,0.3574494095402627,0.1678028106689453,0.3574494095402627
260,10,AdaBoost (Discrete),2,1.0,0.5265306122448979,0.4988211239878325,15.005371809005737,0.4988211239878325
261,10,AdaBoost (Real),2,1.0,0.4816326530612245,0.46776088495995544,22.272080421447754,0.46776088495995544
262,10,Logistic Regression (Penalty = L2),2,1.0,0.5163265306122449,0.4603473901017494,0.08682942390441895,0.4603473901017494
263,10,Naive Bayes,2,1.0,0.4673469387755102,0.48011697645390805,0.03622150421142578,0.48011697645390805
264,11,KNeighbors Classifier,0,1.0,0.48577235772357724,0.4228854602289914,0.19973993301391602,0.4228854602289914
265,11,SVC Classifier,0,1.0,0.4268292682926829,1.0,0.4201505184173584,0.0
266,11,Decision Tree,0,1.0,0.4491869918699187,0.4139536070730205,0.045995473861694336,0.4139536070730205
267,11,RandomForest,0,1.0,0.49390243902439024,0.35924262487992414,0.3001878261566162,0.35924262487992414
268,11,AdaBoost (Discrete),0,1.0,0.5386178861788617,0.4873420114817136,17.270653009414673,0.4873420114817136
269,11,AdaBoost (Real),0,1.0,0.48577235772357724,0.43906834990447113,21.075833082199097,0.43906834990447113
270,11,Logistic Regression (Penalty = L2),0,1.0,0.5040650406504065,0.4451639245572657,0.054470062255859375,0.4451639245572657
271,11,Naive Bayes,0,1.0,0.4491869918699187,0.4623015062177744,0.0474240779876709,0.4623015062177744
272,11,KNeighbors Classifier,1,1.0,0.45621181262729127,0.42398086068424296,0.20807600021362305,0.42398086068424296
273,11,SVC Classifier,1,1.0,0.42769857433808556,1.0,0.3986232280731201,0.0
274,11,Decision Tree,1,1.0,0.42362525458248473,0.4107416325713575,0.04355120658874512,0.4107416325713575
275,11,RandomForest,1,1.0,0.5030549898167006,0.5988317290991773,0.28046703338623047,0.0
276,11,AdaBoost (Discrete),1,1.0,0.5417515274949084,0.5145172609061862,17.377997159957886,0.5145172609061862
277,11,AdaBoost (Real),1,1.0,0.5091649694501018,0.470965463715331,20.48607635498047,0.470965463715331
278,11,Logistic Regression (Penalty = L2),1,1.0,0.5234215885947047,0.4704947408915208,0.07968997955322266,0.4704947408915208
279,11,Naive Bayes,1,1.0,0.4847250509164969,0.5006527422555169,0.040177345275878906,0.5006527422555169
280,11,KNeighbors Classifier,2,1.0,0.42857142857142855,0.37856415312782427,0.2028210163116455,0.37856415312782427
281,11,SVC Classifier,2,1.0,0.42653061224489797,1.0,0.4011237621307373,0.0
282,11,Decision Tree,2,1.0,0.45918367346938777,0.43299508005521764,0.03836846351623535,0.43299508005521764
283,11,RandomForest,2,1.0,0.5020408163265306,0.3574494095402627,0.2815701961517334,0.3574494095402627
284,11,AdaBoost (Discrete),2,1.0,0.5265306122448979,0.4988211239878325,17.191078186035156,0.4988211239878325
285,11,AdaBoost (Real),2,1.0,0.48367346938775513,0.4698035348230519,22.597968816757202,0.4698035348230519
286,11,Logistic Regression (Penalty = L2),2,1.0,0.5163265306122449,0.4603473901017494,0.09121966361999512,0.4603473901017494
287,11,Naive Bayes,2,1.0,0.4673469387755102,0.48011697645390805,0.04397273063659668,0.48011697645390805
288,12,KNeighbors Classifier,0,1.0,0.48577235772357724,0.4228854602289914,0.17614197731018066,0.4228854602289914
289,12,SVC Classifier,0,1.0,0.4268292682926829,1.0,0.4371607303619385,0.0
290,12,Decision Tree,0,1.0,0.4369918699186992,0.3767975410727699,0.04358792304992676,0.3767975410727699
291,12,RandomForest,0,1.0,0.49390243902439024,0.35924262487992414,0.29216790199279785,0.35924262487992414
292,12,AdaBoost (Discrete),0,1.0,0.5386178861788617,0.4873420114817136,17.573266983032227,0.4873420114817136
293,12,AdaBoost (Real),0,1.0,0.48577235772357724,0.43906834990447113,20.12076425552368,0.43906834990447113
294,12,Logistic Regression (Penalty = L2),0,1.0,0.5040650406504065,0.4451639245572657,0.07238364219665527,0.4451639245572657
295,12,Naive Bayes,0,1.0,0.4491869918699187,0.4623015062177744,0.03615736961364746,0.4623015062177744
296,12,KNeighbors Classifier,1,1.0,0.45621181262729127,0.42398086068424296,0.16197538375854492,0.42398086068424296
297,12,SVC Classifier,1,1.0,0.42769857433808556,1.0,0.3962125778198242,0.0
298,12,Decision Tree,1,1.0,0.46028513238289204,0.4269889458349763,0.03944253921508789,0.4269889458349763
299,12,RandomForest,1,1.0,0.5030549898167006,0.5988317290991773,0.2798435688018799,0.0
300,12,AdaBoost (Discrete),1,1.0,0.5417515274949084,0.5145172609061862,17.082830667495728,0.5145172609061862
301,12,AdaBoost (Real),1,1.0,0.5091649694501018,0.470965463715331,19.16655921936035,0.470965463715331
302,12,Logistic Regression (Penalty = L2),1,1.0,0.5234215885947047,0.4704947408915208,0.08194327354431152,0.4704947408915208
303,12,Naive Bayes,1,1.0,0.4847250509164969,0.5006527422555169,0.03977203369140625,0.5006527422555169
304,12,KNeighbors Classifier,2,1.0,0.42857142857142855,0.37856415312782427,0.1595773696899414,0.37856415312782427
305,12,SVC Classifier,2,1.0,0.42653061224489797,1.0,0.4391286373138428,0.0
306,12,Decision Tree,2,1.0,0.45714285714285713,0.43689985013225496,0.039526939392089844,0.43689985013225496
307,12,RandomForest,2,1.0,0.5020408163265306,0.3574494095402627,0.250016450881958,0.3574494095402627
308,12,AdaBoost (Discrete),2,1.0,0.5265306122448979,0.4988211239878325,16.085455417633057,0.4988211239878325
309,12,AdaBoost (Real),2,1.0,0.48367346938775513,0.4698035348230519,18.78987431526184,0.4698035348230519
310,12,Logistic Regression (Penalty = L2),2,1.0,0.5163265306122449,0.4603473901017494,0.10432910919189453,0.4603473901017494
311,12,Naive Bayes,2,1.0,0.4673469387755102,0.48011697645390805,0.03591299057006836,0.48011697645390805
