,feat_set_id,classifier,fold_id,feat_th,score,geo_score,exec_t,geo_score_woz
0,0,KNeighbors Classifier,0,0.35,0.7937608318890814,0.8733741082267049,0.24030447006225586,0.0
1,0,SVC Classifier,0,0.35,0.6845753899480069,0.8129520829107402,0.5203061103820801,0.0
2,0,Decision Tree,0,0.35,0.7417677642980935,0.8617274844321391,0.0019333362579345703,0.0
3,0,RandomForest,0,0.35,0.7001733102253033,1.0,0.4552180767059326,0.0
4,0,AdaBoost (Discrete),0,0.35,0.7452339688041595,0.7844920354680928,27.313382863998413,0.0
5,0,AdaBoost (Real),0,0.35,0.7452339688041595,0.7844920354680928,37.847968101501465,0.0
6,0,Logistic Regression (Penalty = L2),0,0.35,0.7417677642980935,0.8617274844321391,0.2390129566192627,0.0
7,0,Naive Bayes,0,0.35,0.5805892547660312,0.6192878878744241,0.07939910888671875,0.0
8,0,KNeighbors Classifier,1,0.35,0.7413194444444444,0.6920039139148341,0.3169410228729248,0.0
9,0,SVC Classifier,1,0.35,0.78125,0.7990572919580082,0.5745275020599365,0.0
10,0,Decision Tree,1,0.35,0.71875,0.6234161071707248,0.0027055740356445312,0.0
11,0,RandomForest,1,0.35,0.6996527777777778,1.0,0.44570302963256836,0.0
12,0,AdaBoost (Discrete),1,0.35,0.7361111111111112,0.45621327850879984,32.39529752731323,0.0
13,0,AdaBoost (Real),1,0.35,0.3125,0.4102115633234443,44.80139708518982,0.0
14,0,Logistic Regression (Penalty = L2),1,0.35,0.71875,0.6234161071707248,0.24023938179016113,0.0
15,0,Naive Bayes,1,0.35,0.6840277777777778,0.7034341761336865,0.07908987998962402,0.0
16,0,KNeighbors Classifier,2,0.35,0.7982608695652174,0.6048387456236007,0.2498781681060791,0.6048387456236007
17,0,SVC Classifier,2,0.35,0.7617391304347826,0.5617326583032773,0.697577953338623,0.0
18,0,Decision Tree,2,0.35,0.36695652173913046,0.4927890493669933,0.08652949333190918,0.4927890493669933
19,0,RandomForest,2,0.35,0.7008695652173913,1.0,0.5276896953582764,0.0
20,0,AdaBoost (Discrete),2,0.35,0.3826086956521739,0.4559087061053287,34.10013723373413,0.4559087061053287
21,0,AdaBoost (Real),2,0.35,0.42434782608695654,0.4731429604729496,59.60456871986389,0.4731429604729496
22,0,Logistic Regression (Penalty = L2),2,0.35,0.7791304347826087,0.5744179739510636,0.19286680221557617,0.5744179739510636
23,0,Naive Bayes,2,0.35,0.46608695652173915,0.6897771060056679,0.10977411270141602,0.0
24,1,KNeighbors Classifier,0,0.35,0.6897746967071057,0.5203328124828597,0.20459604263305664,0.0
25,1,SVC Classifier,0,0.35,0.7417677642980935,0.7407118766149331,0.5480914115905762,0.0
26,1,Decision Tree,0,0.35,0.6707105719237435,0.48151041713656495,0.06673121452331543,0.0
27,1,RandomForest,0,0.35,0.7001733102253033,1.0,0.47485852241516113,0.0
28,1,AdaBoost (Discrete),0,0.35,0.24263431542461006,0.3018927548712959,29.039180994033813,0.0
29,1,AdaBoost (Real),0,0.35,0.2391681109185442,0.27115004335578646,48.393065214157104,0.0
30,1,Logistic Regression (Penalty = L2),0,0.35,0.7469670710571924,0.7439161246370787,0.2762272357940674,0.0
31,1,Naive Bayes,0,0.35,0.4610051993067591,0.6356906798026111,0.09240031242370605,0.0
32,1,KNeighbors Classifier,1,0.35,0.5520833333333334,0.3949801561877868,0.45984840393066406,0.0
33,1,SVC Classifier,1,0.35,0.7517361111111112,0.5058589726871897,0.8593201637268066,0.0
34,1,Decision Tree,1,0.35,0.5104166666666666,0.3823824721203815,0.09078526496887207,0.0
35,1,RandomForest,1,0.35,0.7517361111111112,0.5058589726871897,0.6764967441558838,0.0
36,1,AdaBoost (Discrete),1,0.35,0.7534722222222222,0.3931263836162414,38.11132764816284,0.0
37,1,AdaBoost (Real),1,0.35,0.7083333333333334,0.29327451377886216,62.85012221336365,0.0
38,1,Logistic Regression (Penalty = L2),1,0.35,0.5833333333333334,0.34150246310529536,0.2358396053314209,0.0
39,1,Naive Bayes,1,0.35,0.5625,0.5737363779874164,0.1899411678314209,0.0
40,1,KNeighbors Classifier,2,0.35,0.6608695652173913,0.3969608370470871,0.43206000328063965,0.0
41,1,SVC Classifier,2,0.35,0.7234782608695652,0.37266643657948806,0.8898124694824219,0.0
42,1,Decision Tree,2,0.35,0.44869565217391305,0.43683538798021193,0.0016319751739501953,0.0
43,1,RandomForest,2,0.35,0.697391304347826,0.9950372208436724,0.8974413871765137,0.0
44,1,AdaBoost (Discrete),2,0.35,0.5391304347826087,0.4370394654841031,47.601670265197754,0.4370394654841031
45,1,AdaBoost (Real),2,0.35,0.6017391304347826,0.28432086622513153,67.56985974311829,0.28432086622513153
46,1,Logistic Regression (Penalty = L2),2,0.35,0.5756521739130435,0.3596654674975672,0.3299877643585205,0.0
47,1,Naive Bayes,2,0.35,0.2991304347826087,0.5108125823268509,0.11300396919250488,0.0
48,2,KNeighbors Classifier,0,0.35,0.6741767764298093,0.7297961605580298,0.44214296340942383,0.0
49,2,SVC Classifier,0,0.35,0.6845753899480069,0.8129520829107402,0.8974058628082275,0.0
50,2,Decision Tree,0,0.35,0.6551126516464472,0.6528052599874394,0.11465764045715332,0.6528052599874394
51,2,RandomForest,0,0.35,0.7001733102253033,1.0,0.8614547252655029,0.0
52,2,AdaBoost (Discrete),0,0.35,0.6447140381282496,0.5441053224393056,46.25749230384827,0.5441053224393056
53,2,AdaBoost (Real),0,0.35,0.7036395147313691,0.650129273775849,58.532114028930664,0.650129273775849
54,2,Logistic Regression (Penalty = L2),0,0.35,0.682842287694974,0.7475165381080043,0.20540833473205566,0.0
55,2,Naive Bayes,0,0.35,0.6325823223570191,0.7081129360743638,0.11986184120178223,0.7081129360743638
56,2,KNeighbors Classifier,1,0.35,0.7864583333333334,0.6335143739645305,0.5067744255065918,0.6335143739645305
57,2,SVC Classifier,1,0.35,0.7274305555555556,0.7636780043269571,0.8892474174499512,0.0
58,2,Decision Tree,1,0.35,0.7569444444444444,0.7021687922866456,0.11434173583984375,0.7021687922866456
59,2,RandomForest,1,0.35,0.6024305555555556,0.5453247035098121,0.6776304244995117,0.0
60,2,AdaBoost (Discrete),1,0.35,0.8472222222222222,0.5576687380587515,42.408557653427124,0.5576687380587515
61,2,AdaBoost (Real),1,0.35,0.8715277777777778,0.7331272008399923,53.40592098236084,0.7331272008399923
62,2,Logistic Regression (Penalty = L2),1,0.35,0.8038194444444444,0.6652823806993893,0.2903764247894287,0.0
63,2,Naive Bayes,1,0.35,0.8125,0.7204184105774583,0.0991971492767334,0.7204184105774583
64,2,KNeighbors Classifier,2,0.35,0.7565217391304347,0.6694252221915413,0.5973069667816162,0.6694252221915413
65,2,SVC Classifier,2,0.35,0.782608695652174,0.6280786458396762,0.8601639270782471,0.0
66,2,Decision Tree,2,0.35,0.7930434782608695,0.8362741790582419,0.0023496150970458984,0.8362741790582419
67,2,RandomForest,2,0.35,0.7008695652173913,1.0,0.7151792049407959,0.0
68,2,AdaBoost (Discrete),2,0.35,0.44,0.62924173969546,43.98379373550415,0.62924173969546
69,2,AdaBoost (Real),2,0.35,0.5878260869565217,0.7383458939362914,53.5452024936676,0.7383458939362914
70,2,Logistic Regression (Penalty = L2),2,0.35,0.8295652173913044,0.7267468599948267,0.30298495292663574,0.7267468599948267
71,2,Naive Bayes,2,0.35,0.8434782608695652,0.8052963298792027,0.07970929145812988,0.8052963298792027
72,3,KNeighbors Classifier,0,0.35,0.7140381282495667,0.7919868642024986,0.41713595390319824,0.0
73,3,SVC Classifier,0,0.35,0.6845753899480069,0.8129520829107402,0.7023494243621826,0.0
74,3,Decision Tree,0,0.35,0.7417677642980935,0.8617274844321391,0.001544952392578125,0.0
75,3,RandomForest,0,0.35,0.7001733102253033,1.0,0.7831919193267822,0.0
76,3,AdaBoost (Discrete),0,0.35,0.7417677642980935,0.8617274844321391,47.76629900932312,0.0
77,3,AdaBoost (Real),0,0.35,0.7642980935875217,0.8232579868250821,77.99351835250854,0.0
78,3,Logistic Regression (Penalty = L2),0,0.35,0.7105719237435009,0.8354757937727448,0.3824622631072998,0.0
79,3,Naive Bayes,0,0.35,0.5233968804159446,0.7201922951672233,0.22178363800048828,0.0
80,3,KNeighbors Classifier,1,0.35,0.75,0.5890960929527923,0.5169587135314941,0.0
81,3,SVC Classifier,1,0.35,0.7690972222222222,0.8841027752029671,0.6492371559143066,0.0
82,3,Decision Tree,1,0.35,0.7916666666666666,0.8719038629079734,0.10637998580932617,0.0
83,3,RandomForest,1,0.35,0.6996527777777778,1.0,0.6537330150604248,0.0
84,3,AdaBoost (Discrete),1,0.35,0.7777777777777778,0.8515672130620594,42.11186099052429,0.0
85,3,AdaBoost (Real),1,0.35,0.7899305555555556,0.7843409697471,79.4763081073761,0.0
86,3,Logistic Regression (Penalty = L2),1,0.35,0.7899305555555556,0.8412260637442117,0.2087247371673584,0.0
87,3,Naive Bayes,1,0.35,0.6701388888888888,0.5937155022689299,0.06022930145263672,0.5937155022689299
88,3,KNeighbors Classifier,2,0.35,0.7234782608695652,0.34628590678439536,0.30705904960632324,0.0
89,3,SVC Classifier,2,0.35,0.7617391304347826,0.5617326583032773,0.294299840927124,0.0
90,3,Decision Tree,2,0.35,0.8591304347826086,0.8867301295099007,0.001604318618774414,0.0
91,3,RandomForest,2,0.35,0.7008695652173913,1.0,0.17157506942749023,0.0
92,3,AdaBoost (Discrete),2,0.35,0.8626086956521739,0.9101947920930716,42.66286897659302,0.0
93,3,AdaBoost (Real),2,0.35,0.8121739130434783,0.7339842916893046,107.03219532966614,0.0
94,3,Logistic Regression (Penalty = L2),2,0.35,0.8382608695652174,0.8340051055773173,0.1184086799621582,0.0
95,3,Naive Bayes,2,0.35,0.7791304347826087,0.6214035074764954,0.1091921329498291,0.6214035074764954
96,4,KNeighbors Classifier,0,0.35,0.7105719237435009,0.809961285133951,0.32429027557373047,0.0
97,4,SVC Classifier,0,0.35,0.7417677642980935,0.7407118766149331,0.6524899005889893,0.0
98,4,Decision Tree,0,0.35,0.7417677642980935,0.7407118766149331,0.0014925003051757812,0.0
99,4,RandomForest,0,0.35,0.7001733102253033,1.0,0.6461396217346191,0.0
100,4,AdaBoost (Discrete),0,0.35,0.7036395147313691,0.7558686441295325,57.4580180644989,0.0
101,4,AdaBoost (Real),0,0.35,0.7590987868284229,0.793803839680238,139.28768277168274,0.0
102,4,Logistic Regression (Penalty = L2),0,0.35,0.7417677642980935,0.7407118766149331,0.44391751289367676,0.0
103,4,Naive Bayes,0,0.35,0.3986135181975737,0.5242766356244375,0.23676705360412598,0.0
104,4,KNeighbors Classifier,1,0.35,0.7378472222222222,0.42336937219191195,0.863569974899292,0.0
105,4,SVC Classifier,1,0.35,0.6996527777777778,1.0,1.2674221992492676,0.0
106,4,Decision Tree,1,0.35,0.7934027777777778,0.6697965970274694,0.0025124549865722656,0.0
107,4,RandomForest,1,0.35,0.6996527777777778,1.0,1.1320364475250244,0.0
108,4,AdaBoost (Discrete),1,0.35,0.7934027777777778,0.6697965970274694,76.5078673362732,0.0
109,4,AdaBoost (Real),1,0.35,0.6197916666666666,0.7420392692457327,159.58176016807556,0.0
110,4,Logistic Regression (Penalty = L2),1,0.35,0.7934027777777778,0.6697965970274694,0.4131653308868408,0.0
111,4,Naive Bayes,1,0.35,0.4652777777777778,0.5932993620407754,0.2516958713531494,0.0
112,4,KNeighbors Classifier,2,0.35,0.6608695652173913,0.5341432132906365,0.8116471767425537,0.5341432132906365
113,4,SVC Classifier,2,0.35,0.7234782608695652,0.37266643657948806,1.256800651550293,0.0
114,4,Decision Tree,2,0.35,0.5704347826086956,0.2641598154411926,0.0015325546264648438,0.0
115,4,RandomForest,2,0.35,0.7234782608695652,0.37266643657948806,1.396486520767212,0.0
116,4,AdaBoost (Discrete),2,0.35,0.3791304347826087,0.3206820665359413,85.131507396698,0.3206820665359413
117,4,AdaBoost (Real),2,0.35,0.3165217391304348,0.30317642339382095,126.42595386505127,0.30317642339382095
118,4,Logistic Regression (Penalty = L2),2,0.35,0.5460869565217391,0.35702168004077167,0.35674619674682617,0.35702168004077167
119,4,Naive Bayes,2,0.35,0.3165217391304348,0.4464902853385481,0.002725839614868164,0.4464902853385481
120,5,KNeighbors Classifier,0,0.35,0.7417677642980935,0.7407118766149331,0.6101632118225098,0.0
121,5,SVC Classifier,0,0.35,0.6845753899480069,0.8129520829107402,1.197239637374878,0.0
122,5,Decision Tree,0,0.35,0.7417677642980935,0.8617274844321391,0.16709280014038086,0.0
123,5,RandomForest,0,0.35,0.6429809358752167,0.5376812956971576,1.1767492294311523,0.0
124,5,AdaBoost (Discrete),0,0.35,0.7417677642980935,0.8617274844321391,88.28981494903564,0.0
125,5,AdaBoost (Real),0,0.35,0.7417677642980935,0.8617274844321391,173.97919082641602,0.0
126,5,Logistic Regression (Penalty = L2),0,0.35,0.7417677642980935,0.8617274844321391,0.22549152374267578,0.0
127,5,Naive Bayes,0,0.35,0.5233968804159446,0.7201922951672233,0.22106528282165527,0.0
128,5,KNeighbors Classifier,1,0.35,0.7065972222222222,0.753294030738896,0.3393559455871582,0.0
129,5,SVC Classifier,1,0.35,0.78125,0.7990572919580082,0.6900856494903564,0.0
130,5,Decision Tree,1,0.35,0.7916666666666666,0.8719038629079734,0.0025115013122558594,0.0
131,5,RandomForest,1,0.35,0.6649305555555556,0.5533004963001166,0.8074212074279785,0.0
132,5,AdaBoost (Discrete),1,0.35,0.7916666666666666,0.8719038629079734,45.57097411155701,0.0
133,5,AdaBoost (Real),1,0.35,0.7916666666666666,0.8719038629079734,69.91467118263245,0.0
134,5,Logistic Regression (Penalty = L2),1,0.35,0.7916666666666666,0.8719038629079734,0.33446764945983887,0.0
135,5,Naive Bayes,1,0.35,0.6701388888888888,0.5937155022689299,0.10857510566711426,0.5937155022689299
136,5,KNeighbors Classifier,2,0.35,0.7234782608695652,0.37266643657948806,0.3170511722564697,0.0
137,5,SVC Classifier,2,0.35,0.7008695652173913,1.0,0.6515820026397705,0.0
138,5,Decision Tree,2,0.35,0.8382608695652174,0.8340051055773173,0.001547098159790039,0.0
139,5,RandomForest,2,0.35,0.7008695652173913,1.0,0.8708367347717285,0.0
140,5,AdaBoost (Discrete),2,0.35,0.8382608695652174,0.8340051055773173,45.8647985458374,0.0
141,5,AdaBoost (Real),2,0.35,0.8382608695652174,0.8340051055773173,54.295581340789795,0.0
142,5,Logistic Regression (Penalty = L2),2,0.35,0.8382608695652174,0.8340051055773173,0.24565935134887695,0.0
143,5,Naive Bayes,2,0.35,0.7791304347826087,0.6214035074764954,0.12818431854248047,0.6214035074764954
144,6,KNeighbors Classifier,0,0.35,0.7417677642980935,0.8617274844321391,0.45787668228149414,0.0
145,6,SVC Classifier,0,0.35,0.6845753899480069,0.8129520829107402,0.8370978832244873,0.0
146,6,Decision Tree,0,0.35,0.7417677642980935,0.8617274844321391,0.11866140365600586,0.0
147,6,RandomForest,0,0.35,0.7417677642980935,0.7407118766149331,0.949270486831665,0.0
148,6,AdaBoost (Discrete),0,0.35,0.7417677642980935,0.8617274844321391,49.07586073875427,0.0
149,6,AdaBoost (Real),0,0.35,0.7417677642980935,0.8617274844321391,111.75941634178162,0.0
150,6,Logistic Regression (Penalty = L2),0,0.35,0.7417677642980935,0.8617274844321391,0.24814581871032715,0.0
151,6,Naive Bayes,0,0.35,0.5233968804159446,0.7201922951672233,0.1322627067565918,0.0
152,6,KNeighbors Classifier,1,0.35,0.7065972222222222,0.753294030738896,0.34790754318237305,0.0
153,6,SVC Classifier,1,0.35,0.78125,0.7990572919580082,0.788649320602417,0.0
154,6,Decision Tree,1,0.35,0.7916666666666666,0.8719038629079734,0.11035442352294922,0.0
155,6,RandomForest,1,0.35,0.7934027777777778,0.6697965970274694,0.7856009006500244,0.0
156,6,AdaBoost (Discrete),1,0.35,0.7916666666666666,0.8719038629079734,46.9122359752655,0.0
157,6,AdaBoost (Real),1,0.35,0.7916666666666666,0.8719038629079734,123.93887209892273,0.0
158,6,Logistic Regression (Penalty = L2),1,0.35,0.7916666666666666,0.8719038629079734,0.22604012489318848,0.0
159,6,Naive Bayes,1,0.35,0.6701388888888888,0.5937155022689299,0.11207032203674316,0.5937155022689299
160,6,KNeighbors Classifier,2,0.35,0.8382608695652174,0.8340051055773173,0.42772626876831055,0.0
161,6,SVC Classifier,2,0.35,0.7617391304347826,0.5617326583032773,0.7023305892944336,0.0
162,6,Decision Tree,2,0.35,0.8382608695652174,0.8340051055773173,0.11049890518188477,0.0
163,6,RandomForest,2,0.35,0.7234782608695652,0.37266643657948806,0.7998762130737305,0.0
164,6,AdaBoost (Discrete),2,0.35,0.8382608695652174,0.8340051055773173,47.217591524124146,0.0
165,6,AdaBoost (Real),2,0.35,0.8382608695652174,0.8340051055773173,78.25218796730042,0.0
166,6,Logistic Regression (Penalty = L2),2,0.35,0.8382608695652174,0.8340051055773173,0.2836878299713135,0.0
167,6,Naive Bayes,2,0.35,0.7791304347826087,0.6214035074764954,0.1082000732421875,0.6214035074764954
168,7,KNeighbors Classifier,0,0.35,0.5753899480069324,0.8217821782178217,0.32597994804382324,0.0
169,7,SVC Classifier,0,0.35,0.7001733102253033,1.0,0.5220696926116943,0.0
170,7,Decision Tree,0,0.35,0.4506065857885615,0.6435643564356436,0.002362966537475586,0.0
171,7,RandomForest,0,0.35,0.7001733102253033,1.0,0.9326884746551514,0.0
172,7,AdaBoost (Discrete),0,0.35,0.4506065857885615,0.6435643564356436,46.16156578063965,0.0
173,7,AdaBoost (Real),0,0.35,0.4506065857885615,0.6435643564356436,107.82629656791687,0.0
174,7,Logistic Regression (Penalty = L2),0,0.35,0.7001733102253033,1.0,0.28341031074523926,0.0
175,7,Naive Bayes,0,0.35,0.41767764298093585,0.5598055961226205,0.09617376327514648,0.0
176,7,KNeighbors Classifier,1,0.35,0.546875,0.5302569722084589,0.38574719429016113,0.0
177,7,SVC Classifier,1,0.35,0.6996527777777778,1.0,0.5725960731506348,0.0
178,7,Decision Tree,1,0.35,0.6024305555555556,0.5453247035098121,0.0023479461669921875,0.0
179,7,RandomForest,1,0.35,0.6024305555555556,0.5453247035098121,0.7613062858581543,0.0
180,7,AdaBoost (Discrete),1,0.35,0.6024305555555556,0.5453247035098121,39.72169303894043,0.0
181,7,AdaBoost (Real),1,0.35,0.4149305555555556,0.43417515419025193,75.40639972686768,0.0
182,7,Logistic Regression (Penalty = L2),1,0.35,0.5225694444444444,0.5010070503656899,0.20364165306091309,0.0
183,7,Naive Bayes,1,0.35,0.5833333333333334,0.7687577219743259,0.09946060180664062,0.0
184,7,KNeighbors Classifier,2,0.35,0.6226086956521739,0.5847955942863918,0.385728120803833,0.0
185,7,SVC Classifier,2,0.35,0.7008695652173913,1.0,0.5756380558013916,0.0
186,7,Decision Tree,2,0.35,0.6226086956521739,0.5847955942863918,0.09424495697021484,0.0
187,7,RandomForest,2,0.35,0.7008695652173913,1.0,0.6699924468994141,0.0
188,7,AdaBoost (Discrete),2,0.35,0.6226086956521739,0.5847955942863918,37.63070344924927,0.0
189,7,AdaBoost (Real),2,0.35,0.6226086956521739,0.5847955942863918,50.93106818199158,0.0
190,7,Logistic Regression (Penalty = L2),2,0.35,0.6226086956521739,0.5847955942863918,0.18713998794555664,0.0
191,7,Naive Bayes,2,0.35,0.49391304347826087,0.5394982012463508,0.09467744827270508,0.0
192,8,KNeighbors Classifier,0,0.35,0.6759098786828422,0.7584099442678455,0.29152989387512207,0.0
193,8,SVC Classifier,0,0.35,0.7417677642980935,0.7407118766149331,0.4779789447784424,0.0
194,8,Decision Tree,0,0.35,0.7417677642980935,0.7407118766149331,0.002262115478515625,0.0
195,8,RandomForest,0,0.35,0.7417677642980935,0.7407118766149331,0.5787999629974365,0.0
196,8,AdaBoost (Discrete),0,0.35,0.7677642980935875,0.7565974265364535,37.43113446235657,0.0
197,8,AdaBoost (Real),0,0.35,0.7019064124783362,0.7780441650525227,67.63793087005615,0.0
198,8,Logistic Regression (Penalty = L2),0,0.35,0.7417677642980935,0.7407118766149331,0.25720787048339844,0.0
199,8,Naive Bayes,0,0.35,0.341421143847487,0.6097002717247996,0.09260058403015137,0.0
200,8,KNeighbors Classifier,1,0.35,0.7934027777777778,0.6697965970274694,0.2010970115661621,0.0
201,8,SVC Classifier,1,0.35,0.6996527777777778,1.0,0.4753885269165039,0.0
202,8,Decision Tree,1,0.35,0.7934027777777778,0.6697965970274694,0.09764742851257324,0.0
203,8,RandomForest,1,0.35,0.7413194444444444,0.46538025755193646,0.6582701206207275,0.0
204,8,AdaBoost (Discrete),1,0.35,0.7934027777777778,0.6697965970274694,36.46808481216431,0.0
205,8,AdaBoost (Real),1,0.35,0.7934027777777778,0.6697965970274694,70.16468477249146,0.0
206,8,Logistic Regression (Penalty = L2),1,0.35,0.7934027777777778,0.6697965970274694,0.24023008346557617,0.0
207,8,Naive Bayes,1,0.35,0.4513888888888889,0.5225359818630698,0.10476326942443848,0.5225359818630698
208,8,KNeighbors Classifier,2,0.35,0.7234782608695652,0.37266643657948806,0.36167168617248535,0.0
209,8,SVC Classifier,2,0.35,0.7234782608695652,0.37266643657948806,0.5544476509094238,0.0
210,8,Decision Tree,2,0.35,0.7234782608695652,0.37266643657948806,0.0025238990783691406,0.0
211,8,RandomForest,2,0.35,0.7234782608695652,0.37266643657948806,0.6313974857330322,0.0
212,8,AdaBoost (Discrete),2,0.35,0.7234782608695652,0.37266643657948806,37.579819679260254,0.0
213,8,AdaBoost (Real),2,0.35,0.7234782608695652,0.37266643657948806,68.73363018035889,0.0
214,8,Logistic Regression (Penalty = L2),2,0.35,0.7234782608695652,0.37266643657948806,0.1996164321899414,0.0
215,8,Naive Bayes,2,0.35,0.5130434782608696,0.5458161476169989,0.0027081966400146484,0.5458161476169989
216,9,KNeighbors Classifier,0,0.35,0.7417677642980935,0.7407118766149331,0.3855104446411133,0.0
217,9,SVC Classifier,0,0.35,0.6845753899480069,0.8129520829107402,0.5988748073577881,0.0
218,9,Decision Tree,0,0.35,0.7417677642980935,0.8617274844321391,0.09824991226196289,0.0
219,9,RandomForest,0,0.35,0.6429809358752167,0.5376812956971576,0.5880587100982666,0.0
220,9,AdaBoost (Discrete),0,0.35,0.7417677642980935,0.8617274844321391,39.36662840843201,0.0
221,9,AdaBoost (Real),0,0.35,0.7417677642980935,0.8617274844321391,138.02782082557678,0.0
222,9,Logistic Regression (Penalty = L2),0,0.35,0.7417677642980935,0.8617274844321391,0.18279361724853516,0.0
223,9,Naive Bayes,0,0.35,0.5233968804159446,0.7201922951672233,0.1043095588684082,0.0
224,9,KNeighbors Classifier,1,0.35,0.7065972222222222,0.753294030738896,0.2603635787963867,0.0
225,9,SVC Classifier,1,0.35,0.78125,0.7990572919580082,0.6191425323486328,0.0
226,9,Decision Tree,1,0.35,0.7916666666666666,0.8719038629079734,0.002382516860961914,0.0
227,9,RandomForest,1,0.35,0.6649305555555556,0.5533004963001166,0.4546847343444824,0.0
228,9,AdaBoost (Discrete),1,0.35,0.7916666666666666,0.8719038629079734,38.10643482208252,0.0
229,9,AdaBoost (Real),1,0.35,0.7916666666666666,0.8719038629079734,59.31761145591736,0.0
230,9,Logistic Regression (Penalty = L2),1,0.35,0.7916666666666666,0.8719038629079734,0.18032622337341309,0.0
231,9,Naive Bayes,1,0.35,0.6701388888888888,0.5937155022689299,0.18105697631835938,0.5937155022689299
232,9,KNeighbors Classifier,2,0.35,0.7234782608695652,0.37266643657948806,0.26443028450012207,0.0
233,9,SVC Classifier,2,0.35,0.7008695652173913,1.0,0.617872953414917,0.0
234,9,Decision Tree,2,0.35,0.8382608695652174,0.8340051055773173,0.08695793151855469,0.0
235,9,RandomForest,2,0.35,0.7008695652173913,1.0,0.49674296379089355,0.0
236,9,AdaBoost (Discrete),2,0.35,0.8382608695652174,0.8340051055773173,38.02316975593567,0.0
237,9,AdaBoost (Real),2,0.35,0.8382608695652174,0.8340051055773173,51.77777361869812,0.0
238,9,Logistic Regression (Penalty = L2),2,0.35,0.8382608695652174,0.8340051055773173,0.29038095474243164,0.0
239,9,Naive Bayes,2,0.35,0.7791304347826087,0.6214035074764954,0.18529057502746582,0.6214035074764954
240,10,KNeighbors Classifier,0,0.35,0.6759098786828422,0.562385381853539,0.5649404525756836,0.0
241,10,SVC Classifier,0,0.35,0.6845753899480069,0.8129520829107402,0.8485174179077148,0.0
242,10,Decision Tree,0,0.35,0.6152512998266898,0.5183775377196999,0.001798391342163086,0.0
243,10,RandomForest,0,0.35,0.7001733102253033,1.0,0.7625634670257568,0.0
244,10,AdaBoost (Discrete),0,0.35,0.42980935875216636,0.4759647425641533,44.00648212432861,0.0
245,10,AdaBoost (Real),0,0.35,0.2218370883882149,0.2649102639566414,54.56507587432861,0.0
246,10,Logistic Regression (Penalty = L2),0,0.35,0.6395147313691508,0.6832394989103653,0.41356730461120605,0.0
247,10,Naive Bayes,0,0.35,0.6429809358752167,0.7508927762297288,0.22922325134277344,0.0
248,10,KNeighbors Classifier,1,0.35,0.7013888888888888,0.4390407365289393,0.6143844127655029,0.0
249,10,SVC Classifier,1,0.35,0.7274305555555556,0.7636780043269571,0.7803812026977539,0.0
250,10,Decision Tree,1,0.35,0.6909722222222222,0.43230319291249086,0.09482121467590332,0.0
251,10,RandomForest,1,0.35,0.6996527777777778,1.0,0.5777795314788818,0.0
252,10,AdaBoost (Discrete),1,0.35,0.7395833333333334,0.5594679924778646,43.1132607460022,0.0
253,10,AdaBoost (Real),1,0.35,0.3506944444444444,0.38014359549398485,51.77418780326843,0.0
254,10,Logistic Regression (Penalty = L2),1,0.35,0.71875,0.6138900896607005,0.38941073417663574,0.0
255,10,Naive Bayes,1,0.35,0.78125,0.6802396938019404,0.08535218238830566,0.0
256,10,KNeighbors Classifier,2,0.35,0.7391304347826086,0.6688816721433501,0.5420694351196289,0.0
257,10,SVC Classifier,2,0.35,0.8156521739130435,0.7609315011087744,0.8782718181610107,0.0
258,10,Decision Tree,2,0.35,0.2747826086956522,0.35936549615948804,0.002636432647705078,0.0
259,10,RandomForest,2,0.35,0.711304347826087,0.2781178990227415,0.6681554317474365,0.0
260,10,AdaBoost (Discrete),2,0.35,0.24,0.2890326277064515,37.88196635246277,0.2890326277064515
261,10,AdaBoost (Real),2,0.35,0.12,0.22659794822688367,43.20493841171265,0.22659794822688367
262,10,Logistic Regression (Penalty = L2),2,0.35,0.6104347826086957,0.4215862361310502,0.3846702575683594,0.4215862361310502
263,10,Naive Bayes,2,0.35,0.528695652173913,0.7234770261807716,0.09640359878540039,0.0
264,11,KNeighbors Classifier,0,0.35,0.7105719237435009,0.6198191590825773,0.48268914222717285,0.0
265,11,SVC Classifier,0,0.35,0.6845753899480069,0.8129520829107402,0.7621965408325195,0.0
266,11,Decision Tree,0,0.35,0.6984402079722704,0.4381565293259933,0.0749826431274414,0.4381565293259933
267,11,RandomForest,0,0.35,0.7001733102253033,1.0,0.5600366592407227,0.0
268,11,AdaBoost (Discrete),0,0.35,0.729636048526863,0.6300815843286437,36.3143355846405,0.0
269,11,AdaBoost (Real),0,0.35,0.7279029462738301,0.6237343122729011,41.13040089607239,0.0
270,11,Logistic Regression (Penalty = L2),0,0.35,0.6880415944540728,0.7603453162872774,0.2977468967437744,0.0
271,11,Naive Bayes,0,0.35,0.6672443674176777,0.7914018355435688,0.06823110580444336,0.0
272,11,KNeighbors Classifier,1,0.35,0.7447916666666666,0.49934001010328316,0.5097987651824951,0.0
273,11,SVC Classifier,1,0.35,0.7274305555555556,0.7636780043269571,0.6732833385467529,0.0
274,11,Decision Tree,1,0.35,0.859375,0.4926391515399603,0.0017676353454589844,0.4926391515399603
275,11,RandomForest,1,0.35,0.6996527777777778,1.0,0.5728604793548584,0.0
276,11,AdaBoost (Discrete),1,0.35,0.7743055555555556,0.47748159228563797,32.379520654678345,0.0
277,11,AdaBoost (Real),1,0.35,0.7552083333333334,0.6229650334527733,37.58033013343811,0.0
278,11,Logistic Regression (Penalty = L2),1,0.35,0.7638888888888888,0.5874287808097735,0.30812954902648926,0.0
279,11,Naive Bayes,1,0.35,0.7829861111111112,0.6820345298093242,0.06389188766479492,0.0
280,11,KNeighbors Classifier,2,0.35,0.8539130434782609,0.7080204561161934,0.47028303146362305,0.7080204561161934
281,11,SVC Classifier,2,0.35,0.8208695652173913,0.7556138122418227,0.6022791862487793,0.0
282,11,Decision Tree,2,0.35,0.34782608695652173,0.42729235701460405,0.06644201278686523,0.42729235701460405
283,11,RandomForest,2,0.35,0.7165217391304348,0.6898459005389914,0.4838240146636963,0.0
284,11,AdaBoost (Discrete),2,0.35,0.3982608695652174,0.442189535154294,31.422617197036743,0.442189535154294
285,11,AdaBoost (Real),2,0.35,0.41391304347826086,0.4243796027915624,35.66789984703064,0.4243796027915624
286,11,Logistic Regression (Penalty = L2),2,0.35,0.5582608695652174,0.4862376070552159,0.2846415042877197,0.4862376070552159
287,11,Naive Bayes,2,0.35,0.5478260869565217,0.8392974277582299,0.13821101188659668,0.0
288,12,KNeighbors Classifier,0,0.35,0.7001733102253033,1.0,0.2597668170928955,0.0
289,12,SVC Classifier,0,0.35,0.7001733102253033,1.0,0.39150047302246094,0.0
290,12,Decision Tree,0,0.35,0.7001733102253033,1.0,0.05450940132141113,0.0
291,12,RandomForest,0,0.35,0.7001733102253033,1.0,0.5036389827728271,0.0
292,12,AdaBoost (Discrete),0,0.35,0.7001733102253033,1.0,23.961860418319702,0.0
293,12,AdaBoost (Real),0,0.35,0.7001733102253033,1.0,99.85556650161743,0.0
294,12,Logistic Regression (Penalty = L2),0,0.35,0.7001733102253033,1.0,0.10471367835998535,0.0
295,12,Naive Bayes,0,0.35,0.32062391681109187,0.6332377902572627,0.05251264572143555,0.0
296,12,KNeighbors Classifier,1,0.35,0.6996527777777778,1.0,0.1664125919342041,0.0
297,12,SVC Classifier,1,0.35,0.6996527777777778,1.0,0.3044016361236572,0.0
298,12,Decision Tree,1,0.35,0.6996527777777778,1.0,0.0018947124481201172,0.0
299,12,RandomForest,1,0.35,0.6996527777777778,1.0,0.40883803367614746,0.0
300,12,AdaBoost (Discrete),1,0.35,0.6996527777777778,1.0,23.018129587173462,0.0
301,12,AdaBoost (Real),1,0.35,0.6996527777777778,1.0,49.989551305770874,0.0
302,12,Logistic Regression (Penalty = L2),1,0.35,0.6996527777777778,1.0,0.11226153373718262,0.0
303,12,Naive Bayes,1,0.35,0.4305555555555556,0.5090374832823014,0.05577349662780762,0.0
304,12,KNeighbors Classifier,2,0.35,0.6139130434782609,0.6822706033376054,0.11858773231506348,0.0
305,12,SVC Classifier,2,0.35,0.7008695652173913,1.0,0.28398895263671875,0.0
306,12,Decision Tree,2,0.35,0.7008695652173913,1.0,0.0020160675048828125,0.0
307,12,RandomForest,2,0.35,0.7008695652173913,1.0,0.40352582931518555,0.0
308,12,AdaBoost (Discrete),2,0.35,0.7008695652173913,1.0,23.320801496505737,0.0
309,12,AdaBoost (Real),2,0.35,0.7008695652173913,1.0,43.06939387321472,0.0
310,12,Logistic Regression (Penalty = L2),2,0.35,0.7008695652173913,1.0,0.10003304481506348,0.0
311,12,Naive Bayes,2,0.35,0.49391304347826087,0.5394982012463508,0.04803013801574707,0.0
