,feat_set_id,classifier,fold_id,feat_th,score,geo_score,exec_t,geo_score_woz
0,0,KNeighbors Classifier,0,0.65,0.7655,0.561398627353372,136.05254316329956,0.561398627353372
1,0,SVC Classifier,0,0.65,0.7795,0.09014398837291854,1416.4148280620575,0.09014398837291854
2,0,Decision Tree,0,0.65,0.7275,0.5676080538257294,1.7831721305847168,0.5676080538257294
3,0,RandomForest,0,0.65,0.8019,0.4578760176386019,3.1987428665161133,0.4578760176386019
4,0,AdaBoost (Discrete),0,0.65,0.8078,0.5761497504202123,575.197158575058,0.5761497504202123
5,0,AdaBoost (Real),0,0.65,0.7863,0.5574767451414827,662.9571273326874,0.5574767451414827
6,0,Logistic Regression (Penalty = L2),0,0.65,0.8062,0.4788375249331322,2.5981032848358154,0.4788375249331322
7,0,Naive Bayes,0,0.65,0.7033,0.6709000336638434,0.6250030994415283,0.6709000336638434
8,0,KNeighbors Classifier,1,0.65,0.778,0.5954522871528038,67.78803944587708,0.5954522871528038
9,0,SVC Classifier,1,0.65,0.7788,1.0,307.888215303421,0.0
10,0,Decision Tree,1,0.65,0.7261,0.5830050362947051,1.6815619468688965,0.5830050362947051
11,0,RandomForest,1,0.65,0.8055,0.47691146978743754,2.3986642360687256,0.47691146978743754
12,0,AdaBoost (Discrete),1,0.65,0.8233,0.6070000212232718,448.9968206882477,0.6070000212232718
13,0,AdaBoost (Real),1,0.65,0.7968,0.5929358784356787,521.8049433231354,0.5929358784356787
14,0,Logistic Regression (Penalty = L2),1,0.65,0.8106,0.4768043468144358,1.7958498001098633,0.4768043468144358
15,0,Naive Bayes,1,0.65,0.6079,0.6565340576268107,0.5670828819274902,0.6565340576268107
16,0,KNeighbors Classifier,2,0.65,0.7826,0.5599616577527204,58.693007469177246,0.5599616577527204
17,0,SVC Classifier,2,0.65,0.7788,1.0,263.6540446281433,0.0
18,0,Decision Tree,2,0.65,0.7369,0.5648164272631709,1.6478090286254883,0.5648164272631709
19,0,RandomForest,2,0.65,0.8063,0.42923235909681123,2.3973159790039062,0.42923235909681123
20,0,AdaBoost (Discrete),2,0.65,0.8234,0.5708105460694882,419.4700734615326,0.5708105460694882
21,0,AdaBoost (Real),2,0.65,0.7945,0.5484829314148582,498.9191596508026,0.5484829314148582
22,0,Logistic Regression (Penalty = L2),2,0.65,0.81,0.4521298546783378,1.6645355224609375,0.4521298546783378
23,0,Naive Bayes,2,0.65,0.7678,0.6905551735779014,0.5480747222900391,0.6905551735779014
24,1,KNeighbors Classifier,0,0.65,0.7639,0.5502434088317928,51.281349182128906,0.5502434088317928
25,1,SVC Classifier,0,0.65,0.7788,1.0,235.4467489719391,0.0
26,1,Decision Tree,0,0.65,0.7226,0.5729608404534791,2.669066905975342,0.5729608404534791
27,1,RandomForest,0,0.65,0.7861,0.28710966635775714,3.5227644443511963,0.28710966635775714
28,1,AdaBoost (Discrete),0,0.65,0.8086,0.5644612327527183,810.7342028617859,0.5644612327527183
29,1,AdaBoost (Real),0,0.65,0.7825,0.5559850083421511,745.0782217979431,0.5559850083421511
30,1,Logistic Regression (Penalty = L2),0,0.65,0.8078,0.49024775911374346,2.260329008102417,0.49024775911374346
31,1,Naive Bayes,0,0.65,0.4205,0.5046053502724455,0.5162298679351807,0.5046053502724455
32,1,KNeighbors Classifier,1,0.65,0.775,0.5873742542139969,50.917452573776245,0.5873742542139969
33,1,SVC Classifier,1,0.65,0.7788,1.0,200.11058115959167,0.0
34,1,Decision Tree,1,0.65,0.7272,0.5880651402376298,2.014702796936035,0.5880651402376298
35,1,RandomForest,1,0.65,0.7929,0.32992203040629015,2.895414113998413,0.32992203040629015
36,1,AdaBoost (Discrete),1,0.65,0.8206,0.6002548182254293,642.5567119121552,0.6002548182254293
37,1,AdaBoost (Real),1,0.65,0.7941,0.5911976183755265,624.2542040348053,0.5911976183755265
38,1,Logistic Regression (Penalty = L2),1,0.65,0.8115,0.48349377841522817,1.33207368850708,0.48349377841522817
39,1,Naive Bayes,1,0.65,0.3856,0.4642193023680114,0.3942854404449463,0.4642193023680114
40,1,KNeighbors Classifier,2,0.65,0.7842,0.5683552955174029,41.53132200241089,0.5683552955174029
41,1,SVC Classifier,2,0.65,0.7788,1.0,182.5252387523651,0.0
42,1,Decision Tree,2,0.65,0.7366,0.5670148954502963,1.6715469360351562,0.5670148954502963
43,1,RandomForest,2,0.65,0.7802,0.09505064720048456,2.3224434852600098,0.09505064720048456
44,1,AdaBoost (Discrete),2,0.65,0.823,0.5651416121311666,514.1099956035614,0.5651416121311666
45,1,AdaBoost (Real),2,0.65,0.7907,0.5439352230534304,512.6269826889038,0.5439352230534304
46,1,Logistic Regression (Penalty = L2),2,0.65,0.8118,0.4662427444773943,1.4504351615905762,0.4662427444773943
47,1,Naive Bayes,2,0.65,0.4799,0.5622383254651989,0.341625452041626,0.5622383254651989
48,2,KNeighbors Classifier,0,0.65,0.7753,0.5650751519583699,46.153061628341675,0.5650751519583699
49,2,SVC Classifier,0,0.65,0.7795,0.09014398837291854,160.76837396621704,0.09014398837291854
50,2,Decision Tree,0,0.65,0.7291,0.5772779746254698,1.1365773677825928,0.5772779746254698
51,2,RandomForest,0,0.65,0.8025,0.42571734937163197,1.7883687019348145,0.42571734937163197
52,2,AdaBoost (Discrete),0,0.65,0.8077,0.5708264101720723,324.95937061309814,0.5708264101720723
53,2,AdaBoost (Real),0,0.65,0.7853,0.5504101720045707,328.6232237815857,0.5504101720045707
54,2,Logistic Regression (Penalty = L2),0,0.65,0.8063,0.48183338013678456,0.9461233615875244,0.48183338013678456
55,2,Naive Bayes,0,0.65,0.7921,0.5946216150008931,0.29173970222473145,0.5946216150008931
56,2,KNeighbors Classifier,1,0.65,0.7758,0.595377072002584,35.75225639343262,0.595377072002584
57,2,SVC Classifier,1,0.65,0.7788,1.0,126.9898133277893,0.0
58,2,Decision Tree,1,0.65,0.7294,0.5861395506210314,0.8348357677459717,0.5861395506210314
59,2,RandomForest,1,0.65,0.8049,0.4254021187842967,1.2866063117980957,0.4254021187842967
60,2,AdaBoost (Discrete),1,0.65,0.8197,0.610449587313893,276.56131529808044,0.610449587313893
61,2,AdaBoost (Real),1,0.65,0.7996,0.6035116948177773,277.69630789756775,0.6035116948177773
62,2,Logistic Regression (Penalty = L2),1,0.65,0.8141,0.5077417466215596,0.7573628425598145,0.5077417466215596
63,2,Naive Bayes,1,0.65,0.8008,0.6334090554640572,0.23309540748596191,0.6334090554640572
64,2,KNeighbors Classifier,2,0.65,0.784,0.5569044833615691,28.748844385147095,0.5569044833615691
65,2,SVC Classifier,2,0.65,0.7788,1.0,103.68427157402039,0.0
66,2,Decision Tree,2,0.65,0.7327,0.5664690756736427,0.6875462532043457,0.5664690756736427
67,2,RandomForest,2,0.65,0.8031,0.39015288858134145,0.9945368766784668,0.39015288858134145
68,2,AdaBoost (Discrete),2,0.65,0.8218,0.5660743116197589,202.5971643924713,0.5660743116197589
69,2,AdaBoost (Real),2,0.65,0.7984,0.559851917978003,210.39300322532654,0.559851917978003
70,2,Logistic Regression (Penalty = L2),2,0.65,0.8096,0.4450334081467195,0.7296185493469238,0.4450334081467195
71,2,Naive Bayes,2,0.65,0.8103,0.6089400540930737,0.20708870887756348,0.6089400540930737
72,3,KNeighbors Classifier,0,0.65,0.7633,0.5411786229259818,7.961359977722168,0.5411786229259818
73,3,SVC Classifier,0,0.65,0.7788,1.0,62.84863638877869,0.0
74,3,Decision Tree,0,0.65,0.7203,0.5509127928330342,0.4366285800933838,0.5509127928330342
75,3,RandomForest,0,0.65,0.779,0.030069238966213184,0.7235429286956787,0.030069238966213184
76,3,AdaBoost (Discrete),0,0.65,0.8094,0.552359063363273,108.38018131256104,0.552359063363273
77,3,AdaBoost (Real),0,0.65,0.7844,0.5422383052496051,116.2840666770935,0.5422383052496051
78,3,Logistic Regression (Penalty = L2),0,0.65,0.8059,0.49859325405283456,0.29784631729125977,0.49859325405283456
79,3,Naive Bayes,0,0.65,0.4163,0.5000068496434764,0.13798093795776367,0.5000068496434764
80,3,KNeighbors Classifier,1,0.65,0.7799,0.5852490463236419,6.907257080078125,0.5852490463236419
81,3,SVC Classifier,1,0.65,0.7788,1.0,45.53914761543274,0.0
82,3,Decision Tree,1,0.65,0.7222,0.574154226625698,0.3389608860015869,0.574154226625698
83,3,RandomForest,1,0.65,0.7788,1.0,0.6483519077301025,0.0
84,3,AdaBoost (Discrete),1,0.65,0.8221,0.5948204380227147,95.11850547790527,0.5948204380227147
85,3,AdaBoost (Real),1,0.65,0.8008,0.5893294968512295,106.66869401931763,0.5893294968512295
86,3,Logistic Regression (Penalty = L2),1,0.65,0.8148,0.5099634473398957,0.5291829109191895,0.5099634473398957
87,3,Naive Bayes,1,0.65,0.3824,0.460227716688473,0.09501242637634277,0.460227716688473
88,3,KNeighbors Classifier,2,0.65,0.7809,0.5592871722149934,7.291033029556274,0.5592871722149934
89,3,SVC Classifier,2,0.65,0.7788,1.0,43.77697420120239,0.0
90,3,Decision Tree,2,0.65,0.732,0.5559381802364204,0.38080501556396484,0.5559381802364204
91,3,RandomForest,2,0.65,0.7788,1.0,0.5786352157592773,0.0
92,3,AdaBoost (Discrete),2,0.65,0.8225,0.5590056237990942,84.74197173118591,0.5590056237990942
93,3,AdaBoost (Real),2,0.65,0.798,0.5529063188011837,100.5840699672699,0.5529063188011837
94,3,Logistic Regression (Penalty = L2),2,0.65,0.8112,0.46827262858230717,0.3682079315185547,0.46827262858230717
95,3,Naive Bayes,2,0.65,0.4769,0.5601039193999366,0.14296507835388184,0.5601039193999366
96,4,KNeighbors Classifier,0,0.65,0.7843,0.564859384998893,8.111367464065552,0.564859384998893
97,4,SVC Classifier,0,0.65,0.7795,0.09014398837291854,45.82211256027222,0.09014398837291854
98,4,Decision Tree,0,0.65,0.7794,0.5434031286556854,0.15714740753173828,0.5434031286556854
99,4,RandomForest,0,0.65,0.8038,0.5066299639507097,0.4283864498138428,0.5066299639507097
100,4,AdaBoost (Discrete),0,0.65,0.8099,0.5799237497269382,38.839075565338135,0.5799237497269382
101,4,AdaBoost (Real),0,0.65,0.8088,0.569253107535029,61.74976086616516,0.569253107535029
102,4,Logistic Regression (Penalty = L2),0,0.65,0.8062,0.48264378743112635,0.23875093460083008,0.48264378743112635
103,4,Naive Bayes,0,0.65,0.7924,0.5901824698105739,0.1590261459350586,0.5901824698105739
104,4,KNeighbors Classifier,1,0.65,0.7861,0.595977309915284,8.157701969146729,0.595977309915284
105,4,SVC Classifier,1,0.65,0.7788,1.0,47.63552451133728,0.0
106,4,Decision Tree,1,0.65,0.7918,0.5850011292303547,0.19683384895324707,0.5850011292303547
107,4,RandomForest,1,0.65,0.81,0.5067584459467913,0.4110686779022217,0.5067584459467913
108,4,AdaBoost (Discrete),1,0.65,0.8228,0.6042963835154198,38.73721766471863,0.6042963835154198
109,4,AdaBoost (Real),1,0.65,0.8198,0.605557381710865,62.53150653839111,0.605557381710865
110,4,Logistic Regression (Penalty = L2),1,0.65,0.8134,0.4920678313051229,0.2884633541107178,0.4920678313051229
111,4,Naive Bayes,1,0.65,0.8018,0.6321937881767734,0.13940119743347168,0.6321937881767734
112,4,KNeighbors Classifier,2,0.65,0.7888,0.5607704353529218,7.266292572021484,0.5607704353529218
113,4,SVC Classifier,2,0.65,0.7788,1.0,43.34082007408142,0.0
114,4,Decision Tree,2,0.65,0.7917,0.5456968623134701,0.15296673774719238,0.5456968623134701
115,4,RandomForest,2,0.65,0.8075,0.4458266630000269,0.3524174690246582,0.4458266630000269
116,4,AdaBoost (Discrete),2,0.65,0.8236,0.5604722324946355,34.23853063583374,0.5604722324946355
117,4,AdaBoost (Real),2,0.65,0.8174,0.5616413564300992,54.55255746841431,0.5616413564300992
118,4,Logistic Regression (Penalty = L2),2,0.65,0.8101,0.44798762263749936,0.22988533973693848,0.44798762263749936
119,4,Naive Bayes,2,0.65,0.8109,0.6103991870363227,0.09965014457702637,0.6103991870363227
120,5,KNeighbors Classifier,0,0.65,0.7623,0.5447322569168478,5.169973373413086,0.5447322569168478
121,5,SVC Classifier,0,0.65,0.7788,1.0,35.1127450466156,0.0
122,5,Decision Tree,0,0.65,0.7219,0.5551079317773409,0.3851451873779297,0.5551079317773409
123,5,RandomForest,0,0.65,0.8099,0.5375229948394522,0.6013827323913574,0.5375229948394522
124,5,AdaBoost (Discrete),0,0.65,0.8086,0.5485407138159321,84.73798441886902,0.5485407138159321
125,5,AdaBoost (Real),0,0.65,0.7814,0.5359155591437402,97.21153426170349,0.5359155591437402
126,5,Logistic Regression (Penalty = L2),0,0.65,0.8058,0.48544776714875587,0.24713635444641113,0.48544776714875587
127,5,Naive Bayes,0,0.65,0.8081,0.526150454384421,0.11755824089050293,0.526150454384421
128,5,KNeighbors Classifier,1,0.65,0.775,0.5831822888853085,3.938020944595337,0.5831822888853085
129,5,SVC Classifier,1,0.65,0.7788,1.0,29.309096813201904,0.0
130,5,Decision Tree,1,0.65,0.7208,0.5842916189609306,0.30959105491638184,0.5842916189609306
131,5,RandomForest,1,0.65,0.8255,0.5757047586169467,0.510986328125,0.5757047586169467
132,5,AdaBoost (Discrete),1,0.65,0.8236,0.5912254538800914,75.98718070983887,0.5912254538800914
133,5,AdaBoost (Real),1,0.65,0.7957,0.5875416920895856,87.7596116065979,0.5875416920895856
134,5,Logistic Regression (Penalty = L2),1,0.65,0.8138,0.5068439488998149,0.25048112869262695,0.5068439488998149
135,5,Naive Bayes,1,0.65,0.8238,0.5774160704882811,0.14338278770446777,0.5774160704882811
136,5,KNeighbors Classifier,2,0.65,0.7826,0.5619144046158449,4.081177473068237,0.5619144046158449
137,5,SVC Classifier,2,0.65,0.7788,1.0,30.558271169662476,0.0
138,5,Decision Tree,2,0.65,0.7277,0.5668450296653813,0.3394753932952881,0.5668450296653813
139,5,RandomForest,2,0.65,0.823,0.5484599120046387,0.5394220352172852,0.5484599120046387
140,5,AdaBoost (Discrete),2,0.65,0.822,0.5448194183577341,82.24321460723877,0.5448194183577341
141,5,AdaBoost (Real),2,0.65,0.7919,0.534905806913609,93.73280143737793,0.534905806913609
142,5,Logistic Regression (Penalty = L2),2,0.65,0.8123,0.4708123023004117,0.2826976776123047,0.4708123023004117
143,5,Naive Bayes,2,0.65,0.8198,0.5283739059602879,0.12107181549072266,0.5283739059602879
144,6,KNeighbors Classifier,0,0.65,0.774,0.5670720178955535,19.694567441940308,0.5670720178955535
145,6,SVC Classifier,0,0.65,0.7795,0.09014398837291854,59.29774713516235,0.09014398837291854
146,6,Decision Tree,0,0.65,0.7161,0.5531592806854132,0.32924652099609375,0.5531592806854132
147,6,RandomForest,0,0.65,0.8011,0.44441667233906545,0.5323207378387451,0.44441667233906545
148,6,AdaBoost (Discrete),0,0.65,0.809,0.5736572461479682,208.3218731880188,0.5736572461479682
149,6,AdaBoost (Real),0,0.65,0.7804,0.5515187433489266,294.7600417137146,0.5515187433489266
150,6,Logistic Regression (Penalty = L2),0,0.65,0.8061,0.47965499080828145,1.1480391025543213,0.47965499080828145
151,6,Naive Bayes,0,0.65,0.744,0.6708262688273138,0.3224947452545166,0.6708262688273138
152,6,KNeighbors Classifier,1,0.65,0.7768,0.600448489037067,51.59702110290527,0.600448489037067
153,6,SVC Classifier,1,0.65,0.7788,1.0,142.6954779624939,0.0
154,6,Decision Tree,1,0.65,0.735,0.5935488540387814,0.9793665409088135,0.5935488540387814
155,6,RandomForest,1,0.65,0.8044,0.45818575626695657,1.2095253467559814,0.45818575626695657
156,6,AdaBoost (Discrete),1,0.65,0.8241,0.6195907032695979,269.9997525215149,0.6195907032695979
157,6,AdaBoost (Real),1,0.65,0.7952,0.5986449710920289,282.02198672294617,0.5986449710920289
158,6,Logistic Regression (Penalty = L2),1,0.65,0.8133,0.5062771726117387,0.960730791091919,0.5062771726117387
159,6,Naive Bayes,1,0.65,0.7207,0.7031883995077775,0.2540295124053955,0.7031883995077775
160,6,KNeighbors Classifier,2,0.65,0.784,0.5611693960104078,44.40083360671997,0.5611693960104078
161,6,SVC Classifier,2,0.65,0.7788,1.0,116.59242224693298,0.0
162,6,Decision Tree,2,0.65,0.7332,0.5614623177078061,0.6927320957183838,0.5614623177078061
163,6,RandomForest,2,0.65,0.8026,0.3997186603186713,1.0691168308258057,0.3997186603186713
164,6,AdaBoost (Discrete),2,0.65,0.8208,0.5643116860798322,248.98080778121948,0.5643116860798322
165,6,AdaBoost (Real),2,0.65,0.795,0.5602095686930473,273.0378017425537,0.5602095686930473
166,6,Logistic Regression (Penalty = L2),2,0.65,0.8111,0.4570372523236626,0.7581841945648193,0.4570372523236626
167,6,Naive Bayes,2,0.65,0.7765,0.6882198564674047,0.23516178131103516,0.6882198564674047
168,7,KNeighbors Classifier,0,0.65,0.7727,0.5527727586352638,49.397146701812744,0.5527727586352638
169,7,SVC Classifier,0,0.65,0.7795,0.09014398837291854,136.61656999588013,0.09014398837291854
170,7,Decision Tree,0,0.65,0.7178,0.5627346110177027,0.9193220138549805,0.5627346110177027
171,7,RandomForest,0,0.65,0.8043,0.46877106425961906,1.2786242961883545,0.46877106425961906
172,7,AdaBoost (Discrete),0,0.65,0.8084,0.571432322782713,311.43625116348267,0.571432322782713
173,7,AdaBoost (Real),0,0.65,0.7833,0.5608916384701765,276.8692274093628,0.5608916384701765
174,7,Logistic Regression (Penalty = L2),0,0.65,0.8053,0.47855158537113107,1.0970497131347656,0.47855158537113107
175,7,Naive Bayes,0,0.65,0.6999,0.669068178875443,0.2829716205596924,0.669068178875443
176,7,KNeighbors Classifier,1,0.65,0.7742,0.5905844630505642,42.04914355278015,0.5905844630505642
177,7,SVC Classifier,1,0.65,0.7788,1.0,131.4443998336792,0.0
178,7,Decision Tree,1,0.65,0.7161,0.5831498886871994,0.7683162689208984,0.5831498886871994
179,7,RandomForest,1,0.65,0.8139,0.5000328542152023,1.0946567058563232,0.5000328542152023
180,7,AdaBoost (Discrete),1,0.65,0.8216,0.6118545082393085,259.3597164154053,0.6118545082393085
181,7,AdaBoost (Real),1,0.65,0.791,0.6001499797999742,268.61859107017517,0.6001499797999742
182,7,Logistic Regression (Penalty = L2),1,0.65,0.8112,0.4930066682155156,0.8429892063140869,0.4930066682155156
183,7,Naive Bayes,1,0.65,0.6219,0.6654425538269252,0.23957324028015137,0.6654425538269252
184,7,KNeighbors Classifier,2,0.65,0.7812,0.5584271325966685,38.52135419845581,0.5584271325966685
185,7,SVC Classifier,2,0.65,0.7788,1.0,129.71081233024597,0.0
186,7,Decision Tree,2,0.65,0.7306,0.558288498724081,0.7278687953948975,0.558288498724081
187,7,RandomForest,2,0.65,0.8103,0.45083326282351316,0.871624231338501,0.45083326282351316
188,7,AdaBoost (Discrete),2,0.65,0.8222,0.571036262961712,271.68697714805603,0.571036262961712
189,7,AdaBoost (Real),2,0.65,0.7951,0.5595796787673223,284.3583788871765,0.5595796787673223
190,7,Logistic Regression (Penalty = L2),2,0.65,0.8092,0.45418817824310664,0.7948343753814697,0.45418817824310664
191,7,Naive Bayes,2,0.65,0.7555,0.6903668109526303,0.23340606689453125,0.6903668109526303
192,8,KNeighbors Classifier,0,0.65,0.742,0.5604970887925165,2.5185675621032715,0.5604970887925165
193,8,SVC Classifier,0,0.65,0.7788,1.0,43.178475856781006,0.0
194,8,Decision Tree,0,0.65,0.8046,0.529741894704736,0.13738155364990234,0.529741894704736
195,8,RandomForest,0,0.65,0.801,0.45219417268644685,0.48680806159973145,0.45219417268644685
196,8,AdaBoost (Discrete),0,0.65,0.809,0.5415482308770823,35.072994232177734,0.5415482308770823
197,8,AdaBoost (Real),0,0.65,0.8073,0.5343899774963146,62.478275299072266,0.5343899774963146
198,8,Logistic Regression (Penalty = L2),0,0.65,0.8037,0.48057990805855033,0.26604509353637695,0.48057990805855033
199,8,Naive Bayes,0,0.65,0.8089,0.5253056698058886,0.10096526145935059,0.5253056698058886
200,8,KNeighbors Classifier,1,0.65,0.7945,0.5763435646157469,2.5858166217803955,0.5763435646157469
201,8,SVC Classifier,1,0.65,0.7788,1.0,37.55604314804077,0.0
202,8,Decision Tree,1,0.65,0.8198,0.5718183121562708,0.13026690483093262,0.5718183121562708
203,8,RandomForest,1,0.65,0.812,0.4882827827754525,0.48974108695983887,0.4882827827754525
204,8,AdaBoost (Discrete),1,0.65,0.8249,0.5841926599388416,34.90430450439453,0.5841926599388416
205,8,AdaBoost (Real),1,0.65,0.8232,0.5802016505764696,74.23617553710938,0.5802016505764696
206,8,Logistic Regression (Penalty = L2),1,0.65,0.8171,0.5259081220617716,0.27729296684265137,0.5259081220617716
207,8,Naive Bayes,1,0.65,0.8237,0.576028029179889,0.1512889862060547,0.576028029179889
208,8,KNeighbors Classifier,2,0.65,0.7774,0.5195430634020834,2.551074981689453,0.5195430634020834
209,8,SVC Classifier,2,0.65,0.7788,1.0,32.44977378845215,0.0
210,8,Decision Tree,2,0.65,0.8182,0.5481550121158715,0.10909581184387207,0.5481550121158715
211,8,RandomForest,2,0.65,0.8085,0.4493768504141101,0.433011531829834,0.4493768504141101
212,8,AdaBoost (Discrete),2,0.65,0.8241,0.56206433093385,35.44678258895874,0.56206433093385
213,8,AdaBoost (Real),2,0.65,0.8227,0.5555371346138438,76.43418383598328,0.5555371346138438
214,8,Logistic Regression (Penalty = L2),2,0.65,0.8129,0.47362314698782704,0.19416522979736328,0.47362314698782704
215,8,Naive Bayes,2,0.65,0.8222,0.5426909504057342,0.13155531883239746,0.5426909504057342
