,feat_set_id,classifier,fold_id,feat_th,score,geo_score,exec_t,geo_score_woz
0,0,KNeighbors Classifier,0,0.5,0.95,0.9507381151903479,0.070709228515625,0.9507381151903479
1,0,SVC Classifier,0,0.5,0.4,1.0,0.0025892257690429688,0.0
2,0,Decision Tree,0,0.5,0.7166666666666667,0.7150646264958075,0.034566640853881836,0.7150646264958075
3,0,RandomForest,0,0.5,0.9,0.9085602964160698,0.253084659576416,0.9085602964160698
4,0,AdaBoost (Discrete),0,0.5,0.9166666666666666,0.9148264275057428,13.980031490325928,0.9148264275057428
5,0,AdaBoost (Real),0,0.5,0.8666666666666667,0.8698105531335117,15.904711484909058,0.8698105531335117
6,0,Logistic Regression (Penalty = L2),0,0.5,0.9333333333333333,0.9402511777839014,0.07065963745117188,0.9402511777839014
7,0,Naive Bayes,0,0.5,0.8833333333333333,0.8848102344924725,0.04374241828918457,0.8848102344924725
8,0,KNeighbors Classifier,1,0.5,0.9833333333333333,0.9859136166167861,0.04821157455444336,0.9859136166167861
9,0,SVC Classifier,1,0.5,0.4,1.0,0.0024929046630859375,0.0
10,0,Decision Tree,1,0.5,0.8833333333333333,0.8751700349829044,0.0018582344055175781,0.8751700349829044
11,0,RandomForest,1,0.5,0.9166666666666666,0.915241126759053,0.27985715866088867,0.915241126759053
12,0,AdaBoost (Discrete),1,0.5,0.8333333333333334,0.8018835824989566,14.82496190071106,0.8018835824989566
13,0,AdaBoost (Real),1,0.5,0.8166666666666667,0.7870304583157218,16.309953927993774,0.7870304583157218
14,0,Logistic Regression (Penalty = L2),1,0.5,0.9,0.8957619677539866,0.03152942657470703,0.8957619677539866
15,0,Naive Bayes,1,0.5,0.95,0.9518891309816516,0.03484797477722168,0.9518891309816516
16,0,KNeighbors Classifier,2,0.5,0.896551724137931,0.9041497400811772,0.03616976737976074,0.9041497400811772
17,0,SVC Classifier,2,0.5,0.39655172413793105,1.0,0.03511691093444824,0.0
18,0,Decision Tree,2,0.5,0.9482758620689655,0.9544812172391356,0.0012004375457763672,0.9544812172391356
19,0,RandomForest,2,0.5,0.9655172413793104,0.967693705920519,0.21666288375854492,0.967693705920519
20,0,AdaBoost (Discrete),2,0.5,0.9655172413793104,0.967693705920519,16.456900358200073,0.967693705920519
21,0,AdaBoost (Real),2,0.5,0.9482758620689655,0.9470981939677545,19.555837631225586,0.9470981939677545
22,0,Logistic Regression (Penalty = L2),2,0.5,0.9310344827586207,0.9383004435957202,0.04302501678466797,0.9383004435957202
23,0,Naive Bayes,2,0.5,0.9482758620689655,0.9528037423984005,0.0018839836120605469,0.9528037423984005
24,1,KNeighbors Classifier,0,0.5,0.9,0.9085602964160698,0.04389667510986328,0.9085602964160698
25,1,SVC Classifier,0,0.5,0.43333333333333335,0.31622776601683794,0.0027785301208496094,0.0
26,1,Decision Tree,0,0.5,0.8166666666666667,0.8018835824989566,0.0010726451873779297,0.8018835824989566
27,1,RandomForest,0,0.5,0.9166666666666666,0.9250831838185912,0.263974666595459,0.9250831838185912
28,1,AdaBoost (Discrete),0,0.5,0.9166666666666666,0.9210078746600967,17.348336935043335,0.9210078746600967
29,1,AdaBoost (Real),0,0.5,0.9,0.900068581879409,17.717548847198486,0.900068581879409
30,1,Logistic Regression (Penalty = L2),0,0.5,0.9166666666666666,0.9250831838185912,0.0386815071105957,0.9250831838185912
31,1,Naive Bayes,0,0.5,0.9333333333333333,0.9410360288810286,0.03978919982910156,0.9410360288810286
32,1,KNeighbors Classifier,1,0.5,0.95,0.9518891309816516,0.0397489070892334,0.9518891309816516
33,1,SVC Classifier,1,0.5,0.4,1.0,0.038758277893066406,0.0
34,1,Decision Tree,1,0.5,0.7666666666666667,0.7374453341331587,0.0015861988067626953,0.7374453341331587
35,1,RandomForest,1,0.5,0.9,0.8932667961445252,0.3607306480407715,0.8932667961445252
36,1,AdaBoost (Discrete),1,0.5,0.85,0.8193212706006459,16.948610544204712,0.8193212706006459
37,1,AdaBoost (Real),1,0.5,0.8666666666666667,0.8540369292015386,19.736669540405273,0.8540369292015386
38,1,Logistic Regression (Penalty = L2),1,0.5,0.95,0.9518891309816516,0.0019729137420654297,0.9518891309816516
39,1,Naive Bayes,1,0.5,0.95,0.9472682371859096,0.0029594898223876953,0.9472682371859096
40,1,KNeighbors Classifier,2,0.5,1.0,1.0,0.047135353088378906,1.0
41,1,SVC Classifier,2,0.5,0.39655172413793105,1.0,0.04265117645263672,0.0
42,1,Decision Tree,2,0.5,0.9137931034482759,0.9161205253742559,0.041901350021362305,0.9161205253742559
43,1,RandomForest,2,0.5,1.0,1.0,0.3101208209991455,1.0
44,1,AdaBoost (Discrete),2,0.5,0.9827586206896551,0.9821390252341226,17.64873504638672,0.9821390252341226
45,1,AdaBoost (Real),2,0.5,0.9827586206896551,0.9821390252341226,19.053848266601562,0.9821390252341226
46,1,Logistic Regression (Penalty = L2),2,0.5,0.9827586206896551,0.9821390252341226,0.05054283142089844,0.9821390252341226
47,1,Naive Bayes,2,0.5,1.0,1.0,0.04318976402282715,1.0
48,2,KNeighbors Classifier,0,0.5,0.85,0.8549879733383485,0.03651595115661621,0.8549879733383485
49,2,SVC Classifier,0,0.5,0.4,1.0,0.05128669738769531,0.0
50,2,Decision Tree,0,0.5,0.7333333333333333,0.6767141313929711,0.0019261837005615234,0.6767141313929711
51,2,RandomForest,0,0.5,0.8666666666666667,0.8735804647362989,0.301227331161499,0.8735804647362989
52,2,AdaBoost (Discrete),0,0.5,0.8333333333333334,0.831802746039737,18.83645224571228,0.831802746039737
53,2,AdaBoost (Real),0,0.5,0.7666666666666667,0.7591472429689157,21.963325023651123,0.7591472429689157
54,2,Logistic Regression (Penalty = L2),0,0.5,0.85,0.8549879733383485,0.05084061622619629,0.8549879733383485
55,2,Naive Bayes,0,0.5,0.9333333333333333,0.9410360288810286,0.05163002014160156,0.9410360288810286
56,2,KNeighbors Classifier,1,0.5,0.9333333333333333,0.9339246536301676,0.05143332481384277,0.9339246536301676
57,2,SVC Classifier,1,0.5,0.4,1.0,0.05083107948303223,0.0
58,2,Decision Tree,1,0.5,0.85,0.8193212706006459,0.0018737316131591797,0.8193212706006459
59,2,RandomForest,1,0.5,0.9,0.9017797429984135,0.3654940128326416,0.9017797429984135
60,2,AdaBoost (Discrete),1,0.5,0.7666666666666667,0.7231223709405562,26.116008520126343,0.7231223709405562
61,2,AdaBoost (Real),1,0.5,0.8,0.7645314458836486,29.854840993881226,0.7645314458836486
62,2,Logistic Regression (Penalty = L2),1,0.5,0.8333333333333334,0.8077799970689432,0.0585932731628418,0.8077799970689432
63,2,Naive Bayes,1,0.5,0.8833333333333333,0.8662391053409028,0.06228327751159668,0.8662391053409028
64,2,KNeighbors Classifier,2,0.5,0.9655172413793104,0.9701312318500641,0.07577633857727051,0.9701312318500641
65,2,SVC Classifier,2,0.5,0.39655172413793105,1.0,0.0669243335723877,0.0
66,2,Decision Tree,2,0.5,0.8793103448275862,0.8814227195721812,0.001729726791381836,0.8814227195721812
67,2,RandomForest,2,0.5,0.9482758620689655,0.9544812172391356,0.5386698246002197,0.9544812172391356
68,2,AdaBoost (Discrete),2,0.5,0.9827586206896551,0.9852919811325488,27.28934144973755,0.9852919811325488
69,2,AdaBoost (Real),2,0.5,0.9655172413793104,0.967693705920519,34.68644833564758,0.967693705920519
70,2,Logistic Regression (Penalty = L2),2,0.5,0.9310344827586207,0.9383004435957202,0.0789346694946289,0.9383004435957202
71,2,Naive Bayes,2,0.5,0.9827586206896551,0.9852919811325488,0.0796051025390625,0.9852919811325488
72,3,KNeighbors Classifier,0,0.5,0.9166666666666666,0.9250831838185912,0.07077789306640625,0.9250831838185912
73,3,SVC Classifier,0,0.5,0.4,1.0,0.002730846405029297,0.0
74,3,Decision Tree,0,0.5,0.9333333333333333,0.9361090484023133,0.07802796363830566,0.9361090484023133
75,3,RandomForest,0,0.5,0.9,0.9053945554302176,0.5605216026306152,0.9053945554302176
76,3,AdaBoost (Discrete),0,0.5,0.9166666666666666,0.9210078746600967,33.49867510795593,0.9210078746600967
77,3,AdaBoost (Real),0,0.5,0.9,0.900068581879409,37.500876665115356,0.900068581879409
78,3,Logistic Regression (Penalty = L2),0,0.5,0.9166666666666666,0.9250831838185912,0.07891082763671875,0.9250831838185912
79,3,Naive Bayes,0,0.5,0.8666666666666667,0.8724415058636109,0.0018970966339111328,0.8724415058636109
80,3,KNeighbors Classifier,1,0.5,0.9833333333333333,0.9859136166167861,0.08310103416442871,0.9859136166167861
81,3,SVC Classifier,1,0.5,0.4,1.0,0.0017266273498535156,0.0
82,3,Decision Tree,1,0.5,0.8166666666666667,0.8048425893195487,0.0019276142120361328,0.8048425893195487
83,3,RandomForest,1,0.5,0.95,0.9518891309816516,0.5443658828735352,0.9518891309816516
84,3,AdaBoost (Discrete),1,0.5,0.8333333333333334,0.8018835824989566,36.73175239562988,0.8018835824989566
85,3,AdaBoost (Real),1,0.5,0.8333333333333334,0.8018835824989566,46.52239203453064,0.8018835824989566
86,3,Logistic Regression (Penalty = L2),1,0.5,0.95,0.9472682371859096,0.10291314125061035,0.9472682371859096
87,3,Naive Bayes,1,0.5,0.9333333333333333,0.9339246536301676,0.0018777847290039062,0.9339246536301676
88,3,KNeighbors Classifier,2,0.5,0.9827586206896551,0.9852919811325488,0.10361742973327637,0.9852919811325488
89,3,SVC Classifier,2,0.5,0.39655172413793105,1.0,0.10268878936767578,0.0
90,3,Decision Tree,2,0.5,0.9827586206896551,0.9821390252341226,0.0018236637115478516,0.9821390252341226
91,3,RandomForest,2,0.5,0.9827586206896551,0.9821390252341226,0.7354485988616943,0.9821390252341226
92,3,AdaBoost (Discrete),2,0.5,0.9827586206896551,0.9821390252341226,40.31677460670471,0.9821390252341226
93,3,AdaBoost (Real),2,0.5,0.9827586206896551,0.9821390252341226,42.648847818374634,0.9821390252341226
94,3,Logistic Regression (Penalty = L2),2,0.5,0.9655172413793104,0.967693705920519,0.09832763671875,0.967693705920519
95,3,Naive Bayes,2,0.5,0.9827586206896551,0.9852919811325488,0.002694845199584961,0.9852919811325488
96,4,KNeighbors Classifier,0,0.5,0.85,0.8549879733383485,0.09208202362060547,0.8549879733383485
97,4,SVC Classifier,0,0.5,0.4,1.0,0.0016400814056396484,0.0
98,4,Decision Tree,0,0.5,0.8666666666666667,0.8741488321476085,0.08977532386779785,0.8741488321476085
99,4,RandomForest,0,0.5,0.9166666666666666,0.9250831838185912,0.6447298526763916,0.9250831838185912
100,4,AdaBoost (Discrete),0,0.5,0.7833333333333333,0.7621478561475696,37.17595291137695,0.7621478561475696
101,4,AdaBoost (Real),0,0.5,0.6833333333333333,0.6671004121804862,45.55028557777405,0.6671004121804862
102,4,Logistic Regression (Penalty = L2),0,0.5,0.85,0.8549879733383485,0.1028892993927002,0.8549879733383485
103,4,Naive Bayes,0,0.5,0.8666666666666667,0.8632208261467282,0.0019707679748535156,0.8632208261467282
104,4,KNeighbors Classifier,1,0.5,0.9166666666666666,0.9201884722037973,0.0022199153900146484,0.9201884722037973
105,4,SVC Classifier,1,0.5,0.4,1.0,0.10691046714782715,0.0
106,4,Decision Tree,1,0.5,0.7833333333333333,0.7537619628284087,0.0018355846405029297,0.7537619628284087
107,4,RandomForest,1,0.5,0.75,0.7109667449628914,0.8484137058258057,0.7109667449628914
108,4,AdaBoost (Discrete),1,0.5,0.7666666666666667,0.7231223709405562,42.62818932533264,0.7231223709405562
109,4,AdaBoost (Real),1,0.5,0.7833333333333333,0.7870304583157218,48.565330505371094,0.7870304583157218
110,4,Logistic Regression (Penalty = L2),1,0.5,0.8166666666666667,0.7825201560836292,0.10639119148254395,0.7825201560836292
111,4,Naive Bayes,1,0.5,0.8166666666666667,0.7825201560836292,0.1120908260345459,0.7825201560836292
112,4,KNeighbors Classifier,2,0.5,0.8793103448275862,0.886061871966061,0.11166906356811523,0.886061871966061
113,4,SVC Classifier,2,0.5,0.39655172413793105,1.0,0.0016145706176757812,0.0
114,4,Decision Tree,2,0.5,0.9310344827586207,0.927897142393689,0.10927414894104004,0.927897142393689
115,4,RandomForest,2,0.5,0.8448275862068966,0.8474876923747772,0.6526563167572021,0.8474876923747772
116,4,AdaBoost (Discrete),2,0.5,0.9137931034482759,0.9215414830498455,43.59687089920044,0.9215414830498455
117,4,AdaBoost (Real),2,0.5,0.7413793103448276,0.7491727466559999,49.1167049407959,0.7491727466559999
118,4,Logistic Regression (Penalty = L2),2,0.5,0.9137931034482759,0.9215414830498455,0.0026149749755859375,0.9215414830498455
119,4,Naive Bayes,2,0.5,0.9482758620689655,0.9544812172391356,0.11013340950012207,0.9544812172391356
120,5,KNeighbors Classifier,0,0.5,0.8166666666666667,0.8177665775471474,0.1076359748840332,0.8177665775471474
121,5,SVC Classifier,0,0.5,0.4,1.0,0.11074709892272949,0.0
122,5,Decision Tree,0,0.5,0.9166666666666666,0.920239727619277,0.11388778686523438,0.920239727619277
123,5,RandomForest,0,0.5,0.8166666666666667,0.8151622077514581,0.7014777660369873,0.8151622077514581
124,5,AdaBoost (Discrete),0,0.5,0.7666666666666667,0.7469007910928608,43.49808311462402,0.7469007910928608
125,5,AdaBoost (Real),0,0.5,0.8833333333333333,0.8892233261225158,52.937742471694946,0.8892233261225158
126,5,Logistic Regression (Penalty = L2),0,0.5,0.8833333333333333,0.8892233261225158,0.002595186233520508,0.8892233261225158
127,5,Naive Bayes,0,0.5,0.9333333333333333,0.9410360288810286,0.0018672943115234375,0.9410360288810286
128,5,KNeighbors Classifier,1,0.5,0.95,0.9472682371859096,0.21289396286010742,0.9472682371859096
129,5,SVC Classifier,1,0.5,0.4,1.0,0.002544403076171875,0.0
130,5,Decision Tree,1,0.5,0.7833333333333333,0.7484536038601457,0.1252586841583252,0.7484536038601457
131,5,RandomForest,1,0.5,0.85,0.8372867702993152,0.8206992149353027,0.8372867702993152
132,5,AdaBoost (Discrete),1,0.5,0.8,0.7645314458836486,46.32928133010864,0.7645314458836486
133,5,AdaBoost (Real),1,0.5,0.7833333333333333,0.7444027764769138,50.352540493011475,0.7444027764769138
134,5,Logistic Regression (Penalty = L2),1,0.5,0.8833333333333333,0.8753966455665646,0.002683877944946289,0.8753966455665646
135,5,Naive Bayes,1,0.5,0.8666666666666667,0.8434326653017492,0.0027680397033691406,0.8434326653017492
136,5,KNeighbors Classifier,2,0.5,0.9827586206896551,0.9852919811325488,0.11151862144470215,0.9852919811325488
137,5,SVC Classifier,2,0.5,0.39655172413793105,1.0,0.0017859935760498047,0.0
138,5,Decision Tree,2,0.5,0.9655172413793104,0.967693705920519,0.11396050453186035,0.967693705920519
139,5,RandomForest,2,0.5,1.0,1.0,0.9172029495239258,1.0
140,5,AdaBoost (Discrete),2,0.5,1.0,1.0,45.56412172317505,1.0
141,5,AdaBoost (Real),2,0.5,0.8448275862068966,0.8474876923747772,44.55899620056152,0.8474876923747772
142,5,Logistic Regression (Penalty = L2),2,0.5,1.0,1.0,0.10259103775024414,1.0
143,5,Naive Bayes,2,0.5,1.0,1.0,0.10247254371643066,1.0
144,6,KNeighbors Classifier,0,0.5,0.8833333333333333,0.8892233261225158,0.1032869815826416,0.8892233261225158
145,6,SVC Classifier,0,0.5,0.4,1.0,0.10292649269104004,0.0
146,6,Decision Tree,0,0.5,0.8333333333333334,0.8164664695080244,0.0019273757934570312,0.8164664695080244
147,6,RandomForest,0,0.5,0.9333333333333333,0.9410360288810286,0.7746062278747559,0.9410360288810286
148,6,AdaBoost (Discrete),0,0.5,0.9166666666666666,0.9210078746600967,44.65386629104614,0.9210078746600967
149,6,AdaBoost (Real),0,0.5,0.9333333333333333,0.9410360288810286,51.681150913238525,0.9410360288810286
150,6,Logistic Regression (Penalty = L2),0,0.5,0.9833333333333333,0.9859136166167861,0.1188821792602539,0.9859136166167861
151,6,Naive Bayes,0,0.5,0.9333333333333333,0.9410360288810286,0.12337327003479004,0.9410360288810286
152,6,KNeighbors Classifier,1,0.5,1.0,1.0,0.158766508102417,1.0
153,6,SVC Classifier,1,0.5,0.4,1.0,0.1198737621307373,0.0
154,6,Decision Tree,1,0.5,0.7833333333333333,0.7555149039386845,0.12202310562133789,0.7555149039386845
155,6,RandomForest,1,0.5,0.9166666666666666,0.915241126759053,0.7248489856719971,0.915241126759053
156,6,AdaBoost (Discrete),1,0.5,0.8833333333333333,0.8662391053409028,49.863035440444946,0.8662391053409028
157,6,AdaBoost (Real),1,0.5,0.85,0.8254818122236567,56.02598428726196,0.8254818122236567
158,6,Logistic Regression (Penalty = L2),1,0.5,0.9333333333333333,0.9339246536301676,0.0021317005157470703,0.9339246536301676
159,6,Naive Bayes,1,0.5,0.95,0.9472682371859096,0.12717890739440918,0.9472682371859096
160,6,KNeighbors Classifier,2,0.5,1.0,1.0,0.1277623176574707,1.0
161,6,SVC Classifier,2,0.5,0.39655172413793105,1.0,0.002777576446533203,0.0
162,6,Decision Tree,2,0.5,0.9482758620689655,0.9528037423984005,0.1300346851348877,0.9528037423984005
163,6,RandomForest,2,0.5,0.9827586206896551,0.9821390252341226,0.9180448055267334,0.9821390252341226
164,6,AdaBoost (Discrete),2,0.5,0.9827586206896551,0.9852919811325488,51.99910235404968,0.9852919811325488
165,6,AdaBoost (Real),2,0.5,0.9655172413793104,0.967693705920519,58.38501811027527,0.967693705920519
166,6,Logistic Regression (Penalty = L2),2,0.5,1.0,1.0,0.13071298599243164,1.0
167,6,Naive Bayes,2,0.5,0.9655172413793104,0.967693705920519,0.11525416374206543,0.967693705920519
168,7,KNeighbors Classifier,0,0.5,0.9166666666666666,0.9250831838185912,0.13570308685302734,0.9250831838185912
169,7,SVC Classifier,0,0.5,0.45,0.3872983346207417,0.0016703605651855469,0.0
170,7,Decision Tree,0,0.5,0.9,0.9053945554302176,0.12983465194702148,0.9053945554302176
171,7,RandomForest,0,0.5,0.8833333333333333,0.8892233261225158,0.7977335453033447,0.8892233261225158
172,7,AdaBoost (Discrete),0,0.5,0.9166666666666666,0.9210078746600967,51.44434475898743,0.9210078746600967
173,7,AdaBoost (Real),0,0.5,0.9333333333333333,0.9410360288810286,56.183876037597656,0.9410360288810286
174,7,Logistic Regression (Penalty = L2),0,0.5,0.9333333333333333,0.9410360288810286,0.1301255226135254,0.9410360288810286
175,7,Naive Bayes,0,0.5,0.95,0.9564655913861946,0.1309652328491211,0.9564655913861946
176,7,KNeighbors Classifier,1,0.5,0.9666666666666667,0.9691999875015047,0.1276683807373047,0.9691999875015047
177,7,SVC Classifier,1,0.5,0.4,1.0,0.1040182113647461,0.0
178,7,Decision Tree,1,0.5,0.8,0.7759440455456199,0.0017635822296142578,0.7759440455456199
179,7,RandomForest,1,0.5,0.85,0.8441641770867276,0.9070446491241455,0.8441641770867276
180,7,AdaBoost (Discrete),1,0.5,0.8833333333333333,0.8662391053409028,52.832807540893555,0.8662391053409028
181,7,AdaBoost (Real),1,0.5,0.85,0.8358603846235818,58.57626724243164,0.8358603846235818
182,7,Logistic Regression (Penalty = L2),1,0.5,0.95,0.9518891309816516,0.0017042160034179688,0.9518891309816516
183,7,Naive Bayes,1,0.5,0.9666666666666667,0.9654893846056297,0.0019366741180419922,0.9654893846056297
184,7,KNeighbors Classifier,2,0.5,0.9827586206896551,0.9852919811325488,0.11217761039733887,0.9852919811325488
185,7,SVC Classifier,2,0.5,0.39655172413793105,1.0,0.13474583625793457,0.0
186,7,Decision Tree,2,0.5,0.9827586206896551,0.9821390252341226,0.1260519027709961,0.9821390252341226
187,7,RandomForest,2,0.5,1.0,1.0,0.9233031272888184,1.0
188,7,AdaBoost (Discrete),2,0.5,0.9655172413793104,0.967693705920519,50.053614139556885,0.967693705920519
189,7,AdaBoost (Real),2,0.5,0.9482758620689655,0.9470981939677545,58.15229511260986,0.9470981939677545
190,7,Logistic Regression (Penalty = L2),2,0.5,0.9655172413793104,0.9701312318500641,0.14676761627197266,0.9701312318500641
191,7,Naive Bayes,2,0.5,0.9655172413793104,0.967693705920519,0.1347348690032959,0.967693705920519
192,8,KNeighbors Classifier,0,0.5,0.9,0.9053945554302176,0.13529634475708008,0.9053945554302176
193,8,SVC Classifier,0,0.5,0.4,1.0,0.0016667842864990234,0.0
194,8,Decision Tree,0,0.5,0.7166666666666667,0.6962383250419169,0.13382697105407715,0.6962383250419169
195,8,RandomForest,0,0.5,0.7833333333333333,0.7796746031126743,0.970238208770752,0.7796746031126743
196,8,AdaBoost (Discrete),0,0.5,0.7666666666666667,0.7492275998655139,52.05317735671997,0.7492275998655139
197,8,AdaBoost (Real),0,0.5,0.8,0.7978130373574884,61.690213441848755,0.7978130373574884
198,8,Logistic Regression (Penalty = L2),0,0.5,0.9,0.9053945554302176,0.20209717750549316,0.9053945554302176
199,8,Naive Bayes,0,0.5,0.8333333333333334,0.8355496558274308,0.15923309326171875,0.8355496558274308
200,8,KNeighbors Classifier,1,0.5,0.95,0.9518891309816516,0.17279815673828125,0.9518891309816516
201,8,SVC Classifier,1,0.5,0.4,1.0,0.16720318794250488,0.0
202,8,Decision Tree,1,0.5,0.8166666666666667,0.7870304583157217,0.15709447860717773,0.7870304583157217
203,8,RandomForest,1,0.5,0.75,0.712936191990509,1.1336779594421387,0.712936191990509
204,8,AdaBoost (Discrete),1,0.5,0.8,0.7645314458836486,55.70631432533264,0.7645314458836486
205,8,AdaBoost (Real),1,0.5,0.8,0.7759440455456199,60.11682105064392,0.7759440455456199
206,8,Logistic Regression (Penalty = L2),1,0.5,0.8166666666666667,0.7825201560836292,0.1383833885192871,0.7825201560836292
207,8,Naive Bayes,1,0.5,0.8,0.7555149039386845,0.001863718032836914,0.7555149039386845
208,8,KNeighbors Classifier,2,0.5,0.9310344827586207,0.9383004435957202,0.13938379287719727,0.9383004435957202
209,8,SVC Classifier,2,0.5,0.39655172413793105,1.0,0.0015769004821777344,0.0
210,8,Decision Tree,2,0.5,0.9310344827586207,0.9304372210353681,0.1379549503326416,0.9304372210353681
211,8,RandomForest,2,0.5,0.9655172413793104,0.9701312318500641,0.8133273124694824,0.9701312318500641
212,8,AdaBoost (Discrete),2,0.5,0.9482758620689655,0.9528037423984005,59.67761564254761,0.9528037423984005
213,8,AdaBoost (Real),2,0.5,0.8448275862068966,0.8474876923747772,59.11464214324951,0.8474876923747772
214,8,Logistic Regression (Penalty = L2),2,0.5,0.9655172413793104,0.9701312318500641,0.1345529556274414,0.9701312318500641
215,8,Naive Bayes,2,0.5,0.9137931034482759,0.9215414830498455,0.13513422012329102,0.9215414830498455
