,feat_set_id,classifier,fold_id,feat_th,score,geo_score,exec_t,geo_score_woz
0,0,KNeighbors Classifier,0,0.2,0.9059701492537313,0.9045118571766186,0.8203392028808594,0.9045118571766186
1,0,SVC Classifier,0,0.2,0.7805970149253731,0.721019339961934,1.327430248260498,0.721019339961934
2,0,Decision Tree,0,0.2,0.7820895522388059,0.7754211125091592,0.05568361282348633,0.7754211125091592
3,0,RandomForest,0,0.2,0.6104477611940299,0.43844179549583695,0.2666747570037842,0.43844179549583695
4,0,AdaBoost (Discrete),0,0.2,0.8402985074626865,0.8195441952265589,34.461318016052246,0.8195441952265589
5,0,AdaBoost (Real),0,0.2,0.47313432835820896,0.3679267706179194,37.540305376052856,0.3679267706179194
6,0,Logistic Regression (Penalty = L2),0,0.2,0.9313432835820895,0.9301098386163891,1.15635347366333,0.9301098386163891
7,0,Naive Bayes,0,0.2,0.8149253731343283,0.8106486686236875,0.09770441055297852,0.8106486686236875
8,0,KNeighbors Classifier,1,0.2,0.9104477611940298,0.9089572848435327,0.9323022365570068,0.9089572848435327
9,0,SVC Classifier,1,0.2,0.7955223880597015,0.76108046375092,1.2972426414489746,0.76108046375092
10,0,Decision Tree,1,0.2,0.8134328358208955,0.8113751279673073,0.0555720329284668,0.8113751279673073
11,0,RandomForest,1,0.2,0.673134328358209,0.5388274743263091,0.22374534606933594,0.5388274743263091
12,0,AdaBoost (Discrete),1,0.2,0.891044776119403,0.8895893862223261,34.362377882003784,0.8895893862223261
13,0,AdaBoost (Real),1,0.2,0.7059701492537314,0.6826596328300737,37.43545150756836,0.6826596328300737
14,0,Logistic Regression (Penalty = L2),1,0.2,0.9417910447761194,0.941591357569082,0.9952235221862793,0.941591357569082
15,0,Naive Bayes,1,0.2,0.8343283582089552,0.8301641525484227,0.1283891201019287,0.8301641525484227
16,0,KNeighbors Classifier,2,0.2,0.9090909090909091,0.9077749058414957,0.8425850868225098,0.9077749058414957
17,0,SVC Classifier,2,0.2,0.7803030303030303,0.7291556860409573,1.3312265872955322,0.7291556860409573
18,0,Decision Tree,2,0.2,0.7924242424242425,0.785095039460965,0.05273866653442383,0.785095039460965
19,0,RandomForest,2,0.2,0.6696969696969697,0.5546916373868759,0.22470808029174805,0.5546916373868759
20,0,AdaBoost (Discrete),2,0.2,0.853030303030303,0.8391391782333656,34.312394857406616,0.8391391782333656
21,0,AdaBoost (Real),2,0.2,0.6575757575757576,0.6426647217828333,36.87897038459778,0.6426647217828333
22,0,Logistic Regression (Penalty = L2),2,0.2,0.9575757575757575,0.9572942386402364,0.9366588592529297,0.9572942386402364
23,0,Naive Bayes,2,0.2,0.8318181818181818,0.8281350049908324,0.09655928611755371,0.8281350049908324
24,1,KNeighbors Classifier,0,0.2,0.9,0.8958176380955339,0.660872220993042,0.8958176380955339
25,1,SVC Classifier,0,0.2,0.7776119402985074,0.684337320429544,1.4305732250213623,0.684337320429544
26,1,Decision Tree,0,0.2,0.7477611940298508,0.73657391341785,0.05599617958068848,0.73657391341785
27,1,RandomForest,0,0.2,0.6014925373134329,0.4612379640538301,0.2763960361480713,0.4612379640538301
28,1,AdaBoost (Discrete),0,0.2,0.8343283582089552,0.8233796284070971,49.76382112503052,0.8233796284070971
29,1,AdaBoost (Real),0,0.2,0.4208955223880597,0.24870585517261856,51.92205095291138,0.24870585517261856
30,1,Logistic Regression (Penalty = L2),0,0.2,0.9432835820895522,0.9421378608310748,0.98050856590271,0.9421378608310748
31,1,Naive Bayes,0,0.2,0.8044776119402985,0.7836832391691206,0.1120758056640625,0.7836832391691206
32,1,KNeighbors Classifier,1,0.2,0.8895522388059701,0.8865483892029644,0.7825419902801514,0.8865483892029644
33,1,SVC Classifier,1,0.2,0.8059701492537313,0.7843818157993654,1.575979471206665,0.7843818157993654
34,1,Decision Tree,1,0.2,0.7328358208955223,0.7195045177245619,0.08443379402160645,0.7195045177245619
35,1,RandomForest,1,0.2,0.6626865671641791,0.5256859466122593,0.2547647953033447,0.5256859466122593
36,1,AdaBoost (Discrete),1,0.2,0.8597014925373134,0.854688139124958,48.25822067260742,0.854688139124958
37,1,AdaBoost (Real),1,0.2,0.6462686567164179,0.5943313721466301,45.770455837249756,0.5943313721466301
38,1,Logistic Regression (Penalty = L2),1,0.2,0.9462686567164179,0.9459587486015558,0.7866857051849365,0.9459587486015558
39,1,Naive Bayes,1,0.2,0.8149253731343283,0.8069419230943226,0.11745071411132812,0.8069419230943226
40,1,KNeighbors Classifier,2,0.2,0.8984848484848484,0.8956786313995982,0.6665670871734619,0.8956786313995982
41,1,SVC Classifier,2,0.2,0.7893939393939394,0.7364536767252945,1.3525886535644531,0.7364536767252945
42,1,Decision Tree,2,0.2,0.7439393939393939,0.7382477394782231,0.049768686294555664,0.7382477394782231
43,1,RandomForest,2,0.2,0.6530303030303031,0.5368871639502464,0.23924517631530762,0.5368871639502464
44,1,AdaBoost (Discrete),2,0.2,0.85,0.8423564322364728,47.08204126358032,0.8423564322364728
45,1,AdaBoost (Real),2,0.2,0.796969696969697,0.7743985707392587,43.70685410499573,0.7743985707392587
46,1,Logistic Regression (Penalty = L2),2,0.2,0.9515151515151515,0.9507953301051567,0.8060228824615479,0.9507953301051567
47,1,Naive Bayes,2,0.2,0.7848484848484848,0.7743163782931787,0.09932708740234375,0.7743163782931787
48,2,KNeighbors Classifier,0,0.2,0.9611940298507463,0.9603516518018225,0.8006167411804199,0.9603516518018225
49,2,SVC Classifier,0,0.2,0.8895522388059701,0.8841561917865104,1.222275733947754,0.8841561917865104
50,2,Decision Tree,0,0.2,0.8417910447761194,0.8346289748739877,0.06510210037231445,0.8346289748739877
51,2,RandomForest,0,0.2,0.5044776119402985,0.43859955728800804,0.24471783638000488,0.0
52,2,AdaBoost (Discrete),0,0.2,0.9223880597014925,0.9208922984502749,39.604995250701904,0.9208922984502749
53,2,AdaBoost (Real),0,0.2,0.7343283582089553,0.7176955229646742,39.24388265609741,0.7176955229646742
54,2,Logistic Regression (Penalty = L2),0,0.2,0.9656716417910448,0.9654386703478496,0.9557538032531738,0.9654386703478496
55,2,Naive Bayes,0,0.2,0.9,0.896635339662284,0.10949444770812988,0.896635339662284
56,2,KNeighbors Classifier,1,0.2,0.9373134328358209,0.9362368521226045,0.7692272663116455,0.9362368521226045
57,2,SVC Classifier,1,0.2,0.8865671641791045,0.8805577923042327,1.3894860744476318,0.8805577923042327
58,2,Decision Tree,1,0.2,0.8507462686567164,0.8473914509011837,0.06414985656738281,0.8473914509011837
59,2,RandomForest,1,0.2,0.5507462686567164,0.6026834038863147,0.21859145164489746,0.0
60,2,AdaBoost (Discrete),1,0.2,0.9223880597014925,0.9218673354330772,43.24007320404053,0.9218673354330772
61,2,AdaBoost (Real),1,0.2,0.5537313432835821,0.4331390263851294,40.65028095245361,0.4331390263851294
62,2,Logistic Regression (Penalty = L2),1,0.2,0.9671641791044776,0.966891577338677,0.7586929798126221,0.966891577338677
63,2,Naive Bayes,1,0.2,0.9194029850746268,0.9173781343057918,0.09436321258544922,0.9173781343057918
64,2,KNeighbors Classifier,2,0.2,0.9454545454545454,0.9443289943178594,0.7117195129394531,0.9443289943178594
65,2,SVC Classifier,2,0.2,0.8742424242424243,0.8682947105910189,1.1951229572296143,0.8682947105910189
66,2,Decision Tree,2,0.2,0.8409090909090909,0.8354886687793431,0.0688323974609375,0.8354886687793431
67,2,RandomForest,2,0.2,0.5515151515151515,0.47564477311201897,0.21670222282409668,0.0
68,2,AdaBoost (Discrete),2,0.2,0.9272727272727272,0.9268074171520464,37.662981033325195,0.9268074171520464
69,2,AdaBoost (Real),2,0.2,0.6621212121212121,0.636726178235287,41.12852120399475,0.636726178235287
70,2,Logistic Regression (Penalty = L2),2,0.2,0.9636363636363636,0.9631507029493872,0.7470703125,0.9631507029493872
71,2,Naive Bayes,2,0.2,0.9136363636363637,0.9117806640321275,0.05717110633850098,0.9117806640321275
72,3,KNeighbors Classifier,0,0.2,0.9582089552238806,0.9577705544507658,0.9108316898345947,0.9577705544507658
73,3,SVC Classifier,0,0.2,0.8507462686567164,0.8321135077195454,1.5552194118499756,0.8321135077195454
74,3,Decision Tree,0,0.2,0.764179104477612,0.7582695826259346,0.05679726600646973,0.7582695826259346
75,3,RandomForest,0,0.2,0.6537313432835821,0.6866031071381639,0.29691553115844727,0.0
76,3,AdaBoost (Discrete),0,0.2,0.9313432835820895,0.9307449057168957,41.84739327430725,0.9307449057168957
77,3,AdaBoost (Real),0,0.2,0.8776119402985074,0.8758745638317649,42.88793706893921,0.8758745638317649
78,3,Logistic Regression (Penalty = L2),0,0.2,0.9656716417910448,0.9654415517655576,0.7453346252441406,0.9654415517655576
79,3,Naive Bayes,0,0.2,0.8656716417910447,0.8611763431697042,0.1098639965057373,0.8611763431697042
80,3,KNeighbors Classifier,1,0.2,0.9477611940298507,0.9472099463462871,0.7891073226928711,0.9472099463462871
81,3,SVC Classifier,1,0.2,0.8865671641791045,0.8762772391547708,1.2729320526123047,0.8762772391547708
82,3,Decision Tree,1,0.2,0.8223880597014925,0.8196552336551655,0.050240516662597656,0.8196552336551655
83,3,RandomForest,1,0.2,0.6149253731343284,0.5365838172189408,0.23955678939819336,0.5365838172189408
84,3,AdaBoost (Discrete),1,0.2,0.9164179104477612,0.9157483791203082,39.47392463684082,0.9157483791203082
85,3,AdaBoost (Real),1,0.2,0.7686567164179104,0.7542676691015288,33.2440721988678,0.7542676691015288
86,3,Logistic Regression (Penalty = L2),1,0.2,0.9656716417910448,0.9654836906881544,0.6248466968536377,0.9654836906881544
87,3,Naive Bayes,1,0.2,0.9044776119402985,0.9033836926553115,0.09465622901916504,0.9033836926553115
88,3,KNeighbors Classifier,2,0.2,0.9409090909090909,0.9405132858154728,0.7129600048065186,0.9405132858154728
89,3,SVC Classifier,2,0.2,0.8409090909090909,0.8228190533443535,1.3455696105957031,0.8228190533443535
90,3,Decision Tree,2,0.2,0.7727272727272727,0.7664933379775447,0.050260066986083984,0.7664933379775447
91,3,RandomForest,2,0.2,0.6257575757575757,0.5202289824887817,0.23749661445617676,0.5202289824887817
92,3,AdaBoost (Discrete),2,0.2,0.9030303030303031,0.9018230119621963,38.352773904800415,0.9018230119621963
93,3,AdaBoost (Real),2,0.2,0.8515151515151516,0.8453589918127844,41.33682322502136,0.8453589918127844
94,3,Logistic Regression (Penalty = L2),2,0.2,0.9621212121212122,0.961854211057,0.7528059482574463,0.961854211057
95,3,Naive Bayes,2,0.2,0.8803030303030303,0.8781575171995605,0.10071396827697754,0.8781575171995605
96,4,KNeighbors Classifier,0,0.2,0.6059701492537314,0.5861227909132399,0.08197975158691406,0.5861227909132399
97,4,SVC Classifier,0,0.2,0.5059701492537313,0.26951061168673984,0.47896599769592285,0.26951061168673984
98,4,Decision Tree,0,0.2,0.5716417910447761,0.5579439255847645,0.020293712615966797,0.5579439255847645
99,4,RandomForest,0,0.2,0.508955223880597,0.5869866233271076,0.15871644020080566,0.0
100,4,AdaBoost (Discrete),0,0.2,0.564179104477612,0.5487643205115611,10.72769021987915,0.5487643205115611
101,4,AdaBoost (Real),0,0.2,0.4761194029850746,0.4380084322119881,15.074452877044678,0.4380084322119881
102,4,Logistic Regression (Penalty = L2),0,0.2,0.6567164179104478,0.6189865887863882,0.21748733520507812,0.6189865887863882
103,4,Naive Bayes,0,0.2,0.582089552238806,0.5241986698456743,0.0557560920715332,0.5241986698456743
104,4,KNeighbors Classifier,1,0.2,0.6373134328358209,0.6143190620344795,0.08127689361572266,0.6143190620344795
105,4,SVC Classifier,1,0.2,0.48656716417910445,0.37145107317676307,0.4685635566711426,0.0
106,4,Decision Tree,1,0.2,0.5940298507462687,0.576099076001655,0.020468473434448242,0.576099076001655
107,4,RandomForest,1,0.2,0.4955223880597015,0.45074351749795294,0.1387498378753662,0.0
108,4,AdaBoost (Discrete),1,0.2,0.591044776119403,0.5739150328134004,10.585248231887817,0.5739150328134004
109,4,AdaBoost (Real),1,0.2,0.5462686567164179,0.48178770662626025,15.850079536437988,0.48178770662626025
110,4,Logistic Regression (Penalty = L2),1,0.2,0.6656716417910448,0.6450266112559647,0.29590916633605957,0.6450266112559647
111,4,Naive Bayes,1,0.2,0.6119402985074627,0.5610408006207455,0.05986976623535156,0.5610408006207455
112,4,KNeighbors Classifier,2,0.2,0.6272727272727273,0.6123517295438509,0.08198952674865723,0.6123517295438509
113,4,SVC Classifier,2,0.2,0.4863636363636364,0.3652864603774818,0.4843935966491699,0.0
114,4,Decision Tree,2,0.2,0.5772727272727273,0.5643170347216719,0.041390419006347656,0.5643170347216719
115,4,RandomForest,2,0.2,0.46515151515151515,0.5161449910700469,0.15891003608703613,0.0
116,4,AdaBoost (Discrete),2,0.2,0.5545454545454546,0.5185873385965634,12.18221664428711,0.5185873385965634
117,4,AdaBoost (Real),2,0.2,0.3984848484848485,0.3050438265554126,15.32934856414795,0.3050438265554126
118,4,Logistic Regression (Penalty = L2),2,0.2,0.6575757575757576,0.6389517765757746,0.1990814208984375,0.6389517765757746
119,4,Naive Bayes,2,0.2,0.5969696969696969,0.5205922693108276,0.053963661193847656,0.5205922693108276
120,5,KNeighbors Classifier,0,0.2,0.8820895522388059,0.8789949692948726,0.17599940299987793,0.8789949692948726
121,5,SVC Classifier,0,0.2,0.7134328358208956,0.6562682282497514,0.5461642742156982,0.6562682282497514
122,5,Decision Tree,0,0.2,0.7671641791044777,0.7611570757768662,0.03404521942138672,0.7611570757768662
123,5,RandomForest,0,0.2,0.6149253731343284,0.619689144015298,0.14600872993469238,0.0
124,5,AdaBoost (Discrete),0,0.2,0.8119402985074626,0.800419374646811,13.310809850692749,0.800419374646811
125,5,AdaBoost (Real),0,0.2,0.6044776119402985,0.5423170878602126,17.49766778945923,0.5423170878602126
126,5,Logistic Regression (Penalty = L2),0,0.2,0.8805970149253731,0.8769403057961125,0.307574987411499,0.8769403057961125
127,5,Naive Bayes,0,0.2,0.8223880597014925,0.8168242245235883,0.05186724662780762,0.8168242245235883
128,5,KNeighbors Classifier,1,0.2,0.8835820895522388,0.8812384816242146,0.15892362594604492,0.8812384816242146
129,5,SVC Classifier,1,0.2,0.746268656716418,0.7326182902007439,0.5197157859802246,0.7326182902007439
130,5,Decision Tree,1,0.2,0.7522388059701492,0.7393749147449749,0.036992549896240234,0.7393749147449749
131,5,RandomForest,1,0.2,0.6119402985074627,0.510990896873601,0.14455413818359375,0.510990896873601
132,5,AdaBoost (Discrete),1,0.2,0.7985074626865671,0.7734451840953801,13.423494338989258,0.7734451840953801
133,5,AdaBoost (Real),1,0.2,0.5985074626865672,0.5344539714213532,17.33703875541687,0.5344539714213532
134,5,Logistic Regression (Penalty = L2),1,0.2,0.8835820895522388,0.8808837884701546,0.24732732772827148,0.8808837884701546
135,5,Naive Bayes,1,0.2,0.8432835820895522,0.8411307915753863,0.049391746520996094,0.8411307915753863
136,5,KNeighbors Classifier,2,0.2,0.8727272727272727,0.867943558160324,0.176025390625,0.867943558160324
137,5,SVC Classifier,2,0.2,0.7075757575757575,0.6365253725548246,0.5508623123168945,0.6365253725548246
138,5,Decision Tree,2,0.2,0.7575757575757576,0.7527893734105723,0.005461454391479492,0.7527893734105723
139,5,RandomForest,2,0.2,0.6045454545454545,0.6263878377687496,0.2023458480834961,0.0
140,5,AdaBoost (Discrete),2,0.2,0.8,0.787215213153934,13.42173981666565,0.787215213153934
141,5,AdaBoost (Real),2,0.2,0.5909090909090909,0.6038862658910076,16.561355113983154,0.0
142,5,Logistic Regression (Penalty = L2),2,0.2,0.8757575757575757,0.8702516459230426,0.2286360263824463,0.8702516459230426
143,5,Naive Bayes,2,0.2,0.8242424242424242,0.8177934011557101,0.0481114387512207,0.8177934011557101
144,6,KNeighbors Classifier,0,0.2,0.8462686567164179,0.8422539837798857,0.12363362312316895,0.8422539837798857
145,6,SVC Classifier,0,0.2,0.591044776119403,0.4432185143468267,0.5176186561584473,0.4432185143468267
146,6,Decision Tree,0,0.2,0.7253731343283583,0.719644065854058,0.019969940185546875,0.719644065854058
147,6,RandomForest,0,0.2,0.5835820895522388,0.5671847049508584,0.18366384506225586,0.0
148,6,AdaBoost (Discrete),0,0.2,0.7716417910447761,0.7618753149903389,12.510451555252075,0.7618753149903389
149,6,AdaBoost (Real),0,0.2,0.582089552238806,0.5128553029335203,16.06669330596924,0.5128553029335203
150,6,Logistic Regression (Penalty = L2),0,0.2,0.7955223880597015,0.7898560214392769,0.24225068092346191,0.7898560214392769
151,6,Naive Bayes,0,0.2,0.7104477611940299,0.6771404917481625,0.035856008529663086,0.6771404917481625
152,6,KNeighbors Classifier,1,0.2,0.8656716417910447,0.8630328395390373,0.11179709434509277,0.8630328395390373
153,6,SVC Classifier,1,0.2,0.6388059701492538,0.4919631658661139,0.4992849826812744,0.4919631658661139
154,6,Decision Tree,1,0.2,0.7313432835820896,0.722271046926456,0.021566152572631836,0.722271046926456
155,6,RandomForest,1,0.2,0.5462686567164179,0.6416858592229271,0.15944528579711914,0.0
156,6,AdaBoost (Discrete),1,0.2,0.7611940298507462,0.7456957545443443,12.764663219451904,0.7456957545443443
157,6,AdaBoost (Real),1,0.2,0.5880597014925373,0.562388049808249,16.584614038467407,0.562388049808249
158,6,Logistic Regression (Penalty = L2),1,0.2,0.8134328358208955,0.805091645380887,0.21696925163269043,0.805091645380887
159,6,Naive Bayes,1,0.2,0.7373134328358208,0.7166139324125567,0.04013872146606445,0.7166139324125567
160,6,KNeighbors Classifier,2,0.2,0.8454545454545455,0.8414311051114021,0.09980559349060059,0.8414311051114021
161,6,SVC Classifier,2,0.2,0.6,0.4121991833159797,0.5319757461547852,0.4121991833159797
162,6,Decision Tree,2,0.2,0.7287878787878788,0.7228406200301961,0.021825551986694336,0.7228406200301961
163,6,RandomForest,2,0.2,0.4772727272727273,0.6486114131871524,0.14156341552734375,0.0
164,6,AdaBoost (Discrete),2,0.2,0.7651515151515151,0.7586398019292231,12.513331890106201,0.7586398019292231
165,6,AdaBoost (Real),2,0.2,0.45606060606060606,0.17879442385460176,16.16429328918457,0.17879442385460176
166,6,Logistic Regression (Penalty = L2),2,0.2,0.8166666666666667,0.8102375506353885,0.2173750400543213,0.8102375506353885
167,6,Naive Bayes,2,0.2,0.740909090909091,0.7145985352836058,0.032903432846069336,0.7145985352836058
168,7,KNeighbors Classifier,0,0.2,0.7074626865671642,0.6849182016310014,0.11827945709228516,0.6849182016310014
169,7,SVC Classifier,0,0.2,0.5582089552238806,0.49774381287430436,0.5124187469482422,0.49774381287430436
170,7,Decision Tree,0,0.2,0.6537313432835821,0.6352544346546161,0.0213775634765625,0.6352544346546161
171,7,RandomForest,0,0.2,0.4462686567164179,0.33264059149507885,0.14081954956054688,0.0
172,7,AdaBoost (Discrete),0,0.2,0.6701492537313433,0.6380853620228725,11.769725799560547,0.6380853620228725
173,7,AdaBoost (Real),0,0.2,0.6179104477611941,0.5287642858106746,17.066189527511597,0.5287642858106746
174,7,Logistic Regression (Penalty = L2),0,0.2,0.6955223880597015,0.6697588004035561,0.19476890563964844,0.6697588004035561
175,7,Naive Bayes,0,0.2,0.6358208955223881,0.5758768945485082,0.05202054977416992,0.5758768945485082
176,7,KNeighbors Classifier,1,0.2,0.7477611940298508,0.7355852180286296,0.08110690116882324,0.7355852180286296
177,7,SVC Classifier,1,0.2,0.5776119402985075,0.5282276662170853,0.48489809036254883,0.5282276662170853
178,7,Decision Tree,1,0.2,0.6656716417910448,0.6506990496935366,0.036992788314819336,0.6506990496935366
179,7,RandomForest,1,0.2,0.508955223880597,0.6037546043888271,0.16181421279907227,0.0
180,7,AdaBoost (Discrete),1,0.2,0.6522388059701493,0.6175178823380704,12.262515544891357,0.6175178823380704
181,7,AdaBoost (Real),1,0.2,0.48507462686567165,0.3551104438889426,16.47997283935547,0.3551104438889426
182,7,Logistic Regression (Penalty = L2),1,0.2,0.735820895522388,0.7160787846298684,0.20569777488708496,0.7160787846298684
183,7,Naive Bayes,1,0.2,0.6611940298507463,0.6210876373887354,0.05023360252380371,0.6210876373887354
184,7,KNeighbors Classifier,2,0.2,0.7090909090909091,0.6963683496739305,0.1047666072845459,0.6963683496739305
185,7,SVC Classifier,2,0.2,0.5651515151515152,0.45763411654188674,0.4929332733154297,0.45763411654188674
186,7,Decision Tree,2,0.2,0.6212121212121212,0.6037014219428264,0.020751476287841797,0.6037014219428264
187,7,RandomForest,2,0.2,0.5121212121212121,0.3647525408899628,0.17961859703063965,0.0
188,7,AdaBoost (Discrete),2,0.2,0.6727272727272727,0.6586583533827481,12.555194854736328,0.6586583533827481
189,7,AdaBoost (Real),2,0.2,0.5742424242424242,0.49447789165355116,16.445312023162842,0.49447789165355116
190,7,Logistic Regression (Penalty = L2),2,0.2,0.7454545454545455,0.7318022658018593,0.19534015655517578,0.7318022658018593
191,7,Naive Bayes,2,0.2,0.6348484848484849,0.5811388890138987,0.037308454513549805,0.5811388890138987
192,8,KNeighbors Classifier,0,0.2,0.8611940298507462,0.8566691464551486,0.14580297470092773,0.8566691464551486
193,8,SVC Classifier,0,0.2,0.6417910447761194,0.5484317141622135,0.6834650039672852,0.5484317141622135
194,8,Decision Tree,0,0.2,0.7701492537313432,0.7655507192307373,0.038753509521484375,0.7655507192307373
195,8,RandomForest,0,0.2,0.5985074626865672,0.47874614463944226,0.23865175247192383,0.47874614463944226
196,8,AdaBoost (Discrete),0,0.2,0.7776119402985074,0.7608602757397749,19.068702220916748,0.7608602757397749
197,8,AdaBoost (Real),0,0.2,0.7298507462686568,0.6847315123728538,22.01319432258606,0.6847315123728538
198,8,Logistic Regression (Penalty = L2),0,0.2,0.8820895522388059,0.8763867909836621,0.34018611907958984,0.8763867909836621
199,8,Naive Bayes,0,0.2,0.7298507462686568,0.6952294071422017,0.037226200103759766,0.6952294071422017
200,8,KNeighbors Classifier,1,0.2,0.8522388059701492,0.84979912344266,0.1716783046722412,0.84979912344266
201,8,SVC Classifier,1,0.2,0.6447761194029851,0.5812607446458476,0.6916110515594482,0.5812607446458476
202,8,Decision Tree,1,0.2,0.7791044776119403,0.7726421045269519,0.03986692428588867,0.7726421045269519
203,8,RandomForest,1,0.2,0.5955223880597015,0.5067215427992868,0.17875385284423828,0.5067215427992868
204,8,AdaBoost (Discrete),1,0.2,0.8,0.7921078360011343,18.984403371810913,0.7921078360011343
205,8,AdaBoost (Real),1,0.2,0.7044776119402985,0.6821376917366254,21.603700160980225,0.6821376917366254
206,8,Logistic Regression (Penalty = L2),1,0.2,0.8895522388059701,0.8885920149861115,0.3309330940246582,0.8885920149861115
207,8,Naive Bayes,1,0.2,0.7701492537313432,0.761359099186062,0.07043695449829102,0.761359099186062
208,8,KNeighbors Classifier,2,0.2,0.8651515151515151,0.8636393415797701,0.18985223770141602,0.8636393415797701
209,8,SVC Classifier,2,0.2,0.6378787878787879,0.5194254848820898,0.681312084197998,0.5194254848820898
210,8,Decision Tree,2,0.2,0.75,0.7441437958145521,0.03087639808654785,0.7441437958145521
211,8,RandomForest,2,0.2,0.593939393939394,0.5287262739069127,0.18616795539855957,0.5287262739069127
212,8,AdaBoost (Discrete),2,0.2,0.7984848484848485,0.7960277271272462,18.557032585144043,0.7960277271272462
213,8,AdaBoost (Real),2,0.2,0.6909090909090909,0.6660905734226468,21.692904949188232,0.6660905734226468
214,8,Logistic Regression (Penalty = L2),2,0.2,0.8848484848484849,0.8828592351356427,0.3162355422973633,0.8828592351356427
215,8,Naive Bayes,2,0.2,0.7196969696969697,0.7001065069526402,0.08764910697937012,0.7001065069526402
216,9,KNeighbors Classifier,0,0.2,0.9014925373134328,0.8984776056917975,0.16286396980285645,0.8984776056917975
217,9,SVC Classifier,0,0.2,0.7074626865671642,0.657363144030987,0.6506538391113281,0.657363144030987
218,9,Decision Tree,0,0.2,0.7417910447761195,0.7382674016524632,0.02039504051208496,0.7382674016524632
219,9,RandomForest,0,0.2,0.5761194029850746,0.5066313378994797,0.10207390785217285,0.5066313378994797
220,9,AdaBoost (Discrete),0,0.2,0.8402985074626865,0.8362797591676294,15.274091005325317,0.8362797591676294
221,9,AdaBoost (Real),0,0.2,0.5671641791044776,0.489375943086724,18.803415298461914,0.489375943086724
222,9,Logistic Regression (Penalty = L2),0,0.2,0.8850746268656716,0.8829669149709103,0.21235132217407227,0.8829669149709103
223,9,Naive Bayes,0,0.2,0.8432835820895522,0.8390932152272761,0.056140899658203125,0.8390932152272761
224,9,KNeighbors Classifier,1,0.2,0.908955223880597,0.9071721033327362,0.15701889991760254,0.9071721033327362
225,9,SVC Classifier,1,0.2,0.746268656716418,0.7127958768182655,0.5977623462677002,0.7127958768182655
226,9,Decision Tree,1,0.2,0.7746268656716417,0.7677015678226623,0.021624088287353516,0.7677015678226623
227,9,RandomForest,1,0.2,0.6238805970149254,0.5810676725715758,0.16182160377502441,0.5810676725715758
228,9,AdaBoost (Discrete),1,0.2,0.8552238805970149,0.8534365743943195,15.08556604385376,0.8534365743943195
229,9,AdaBoost (Real),1,0.2,0.5567164179104478,0.47241467561100337,18.000970602035522,0.47241467561100337
230,9,Logistic Regression (Penalty = L2),1,0.2,0.9,0.8984999003407286,0.2026832103729248,0.8984999003407286
231,9,Naive Bayes,1,0.2,0.8567164179104477,0.8521015599289963,0.0545806884765625,0.8521015599289963
232,9,KNeighbors Classifier,2,0.2,0.8984848484848484,0.8963969117888695,0.16886162757873535,0.8963969117888695
233,9,SVC Classifier,2,0.2,0.7,0.6440038243955988,0.4964025020599365,0.6440038243955988
234,9,Decision Tree,2,0.2,0.7560606060606061,0.7527486756391546,0.03720498085021973,0.7527486756391546
235,9,RandomForest,2,0.2,0.6045454545454545,0.736073924059148,0.17658495903015137,0.0
236,9,AdaBoost (Discrete),2,0.2,0.8151515151515152,0.8102132301830093,14.17051386833191,0.8102132301830093
237,9,AdaBoost (Real),2,0.2,0.6772727272727272,0.6503869048699589,16.786291360855103,0.6503869048699589
238,9,Logistic Regression (Penalty = L2),2,0.2,0.8575757575757575,0.8538233092602163,0.21993017196655273,0.8538233092602163
239,9,Naive Bayes,2,0.2,0.8242424242424242,0.8135429957624307,0.04931783676147461,0.8135429957624307
240,10,KNeighbors Classifier,0,0.2,0.9492537313432836,0.9481586813263984,0.6285722255706787,0.9481586813263984
241,10,SVC Classifier,0,0.2,0.8522388059701492,0.8327586454954579,0.8222677707672119,0.8327586454954579
242,10,Decision Tree,0,0.2,0.8552238805970149,0.8494838930905055,0.032369136810302734,0.8494838930905055
243,10,RandomForest,0,0.2,0.6477611940298508,0.6388098151361207,0.1574265956878662,0.0
244,10,AdaBoost (Discrete),0,0.2,0.9253731343283582,0.9240685061934795,29.52330780029297,0.9240685061934795
245,10,AdaBoost (Real),0,0.2,0.7417910447761195,0.730507408060158,31.671395301818848,0.730507408060158
246,10,Logistic Regression (Penalty = L2),0,0.2,0.9626865671641791,0.9623577628737174,0.5819664001464844,0.9623577628737174
247,10,Naive Bayes,0,0.2,0.8761194029850746,0.8721581873482372,0.09076523780822754,0.8721581873482372
248,10,KNeighbors Classifier,1,0.2,0.9462686567164179,0.9457398591493217,0.5208234786987305,0.9457398591493217
249,10,SVC Classifier,1,0.2,0.8626865671641791,0.8507943482174172,0.8386895656585693,0.8507943482174172
250,10,Decision Tree,1,0.2,0.8149253731343283,0.8120560739872885,0.03258037567138672,0.8120560739872885
251,10,RandomForest,1,0.2,0.6388059701492538,0.637604292556961,0.13974976539611816,0.0
252,10,AdaBoost (Discrete),1,0.2,0.9104477611940298,0.9084408937787221,30.21349859237671,0.9084408937787221
253,10,AdaBoost (Real),1,0.2,0.5462686567164179,0.3203607988811265,31.660396337509155,0.3203607988811265
254,10,Logistic Regression (Penalty = L2),1,0.2,0.9626865671641791,0.9623989440507007,0.540766716003418,0.9623989440507007
255,10,Naive Bayes,1,0.2,0.9,0.8988393897378615,0.09205913543701172,0.8988393897378615
256,10,KNeighbors Classifier,2,0.2,0.9424242424242424,0.9417821354285769,0.6826303005218506,0.9417821354285769
257,10,SVC Classifier,2,0.2,0.8469696969696969,0.825292026330395,0.9435348510742188,0.825292026330395
258,10,Decision Tree,2,0.2,0.8287878787878787,0.8267048271391934,0.03407001495361328,0.8267048271391934
259,10,RandomForest,2,0.2,0.6393939393939394,0.7681721275872747,0.12789249420166016,0.0
260,10,AdaBoost (Discrete),2,0.2,0.8818181818181818,0.8739986751168425,29.340331315994263,0.8739986751168425
261,10,AdaBoost (Real),2,0.2,0.4893939393939394,0.426873453635544,30.05306339263916,0.426873453635544
262,10,Logistic Regression (Penalty = L2),2,0.2,0.9621212121212122,0.9617048189597391,0.672433614730835,0.9617048189597391
263,10,Naive Bayes,2,0.2,0.8893939393939394,0.8872512658457503,0.07450532913208008,0.8872512658457503
264,11,KNeighbors Classifier,0,0.2,0.9656716417910448,0.9652498960456748,1.668675422668457,0.9652498960456748
265,11,SVC Classifier,0,0.2,0.9343283582089552,0.9330292967152574,1.4215645790100098,0.9330292967152574
266,11,Decision Tree,0,0.2,0.8567164179104477,0.8540079009441706,0.06080770492553711,0.8540079009441706
267,11,RandomForest,0,0.2,0.7686567164179104,0.7409562253736924,0.19017767906188965,0.7409562253736924
268,11,AdaBoost (Discrete),0,0.2,0.9402985074626866,0.9395218104897441,62.68351078033447,0.9395218104897441
269,11,AdaBoost (Real),0,0.2,0.7716417910447761,0.7636632278860778,57.68165183067322,0.7636632278860778
270,11,Logistic Regression (Penalty = L2),0,0.2,0.9791044776119403,0.9789401628849093,1.388763427734375,0.9789401628849093
271,11,Naive Bayes,0,0.2,0.8970149253731343,0.8947581856843861,0.143204927444458,0.8947581856843861
272,11,KNeighbors Classifier,1,0.2,0.9477611940298507,0.9471848676442339,1.3895609378814697,0.9471848676442339
273,11,SVC Classifier,1,0.2,0.9373134328358209,0.9367888925426,1.404768943786621,0.9367888925426
274,11,Decision Tree,1,0.2,0.8641791044776119,0.8621133949409213,0.03595423698425293,0.8621133949409213
275,11,RandomForest,1,0.2,0.6955223880597015,0.5628186247069384,0.18856048583984375,0.5628186247069384
276,11,AdaBoost (Discrete),1,0.2,0.9298507462686567,0.9294108580376896,59.52906274795532,0.9294108580376896
277,11,AdaBoost (Real),1,0.2,0.517910447761194,0.29885249002048997,53.4201021194458,0.29885249002048997
278,11,Logistic Regression (Penalty = L2),1,0.2,0.9686567164179104,0.9686004242304727,1.320251226425171,0.9686004242304727
279,11,Naive Bayes,1,0.2,0.9238805970149254,0.9231478028348469,0.1317613124847412,0.9231478028348469
280,11,KNeighbors Classifier,2,0.2,0.9545454545454546,0.9538435952370491,1.5046875476837158,0.9538435952370491
281,11,SVC Classifier,2,0.2,0.9348484848484848,0.9341315853893681,1.2842512130737305,0.9341315853893681
282,11,Decision Tree,2,0.2,0.8424242424242424,0.8411899510295856,0.0566563606262207,0.8411899510295856
283,11,RandomForest,2,0.2,0.6060606060606061,0.5494972761441207,0.17678451538085938,0.0
284,11,AdaBoost (Discrete),2,0.2,0.9166666666666666,0.9151569118982202,56.95000338554382,0.9151569118982202
285,11,AdaBoost (Real),2,0.2,0.6,0.48287205999346283,53.58189606666565,0.48287205999346283
286,11,Logistic Regression (Penalty = L2),2,0.2,0.9803030303030303,0.9800890310623637,1.3140828609466553,0.9800890310623637
287,11,Naive Bayes,2,0.2,0.9075757575757576,0.9068159761199357,0.10796356201171875,0.9068159761199357
