,feat_set_id,classifier,fold_id,feat_th,score,geo_score,exec_t,geo_score_woz
0,0,KNeighbors Classifier,0,0.45,0.792156862745098,0.505580769670668,0.2803502082824707,0.0
1,0,SVC Classifier,0,0.45,0.7607843137254902,1.0,0.19103217124938965,0.0
2,0,Decision Tree,0,0.45,0.7764705882352941,0.6879820706956369,0.09104728698730469,0.0
3,0,RandomForest,0,0.45,0.7607843137254902,1.0,0.637458324432373,0.0
4,0,AdaBoost (Discrete),0,0.45,0.6588235294117647,0.29954577940109955,38.14743161201477,0.0
5,0,AdaBoost (Real),0,0.45,0.5450980392156862,0.3082264000023885,64.70907402038574,0.0
6,0,Logistic Regression (Penalty = L2),0,0.45,0.7764705882352941,0.3275473108225278,0.5886881351470947,0.0
7,0,Naive Bayes,0,0.45,0.09019607843137255,0.30139632434832064,0.28299403190612793,0.0
8,0,KNeighbors Classifier,1,0.45,0.816,0.6021683110619066,0.20224428176879883,0.0
9,0,SVC Classifier,1,0.45,0.776,1.0,0.1962890625,0.0
10,0,Decision Tree,1,0.45,0.804,0.49935877239005483,0.001584768295288086,0.0
11,0,RandomForest,1,0.45,0.776,1.0,0.5044972896575928,0.0
12,0,AdaBoost (Discrete),1,0.45,0.736,0.31079155631342953,38.73656415939331,0.0
13,0,AdaBoost (Real),1,0.45,0.684,0.3344817581502552,50.01687169075012,0.0
14,0,Logistic Regression (Penalty = L2),1,0.45,0.784,0.2853751021838173,0.4236760139465332,0.0
15,0,Naive Bayes,1,0.45,0.08,0.45986329782677027,0.20262646675109863,0.0
16,0,KNeighbors Classifier,2,0.45,0.8065843621399177,0.5841527956104312,0.27213191986083984,0.0
17,0,SVC Classifier,2,0.45,0.7983539094650206,1.0,0.2873868942260742,0.0
18,0,Decision Tree,2,0.45,0.8024691358024691,0.6976863383908974,0.0015377998352050781,0.0
19,0,RandomForest,2,0.45,0.7901234567901234,0.6997790520224827,0.5755515098571777,0.0
20,0,AdaBoost (Discrete),2,0.45,0.691358024691358,0.4184899763397546,46.823320627212524,0.0
21,0,AdaBoost (Real),2,0.45,0.411522633744856,0.4688866405237673,63.4277126789093,0.0
22,0,Logistic Regression (Penalty = L2),2,0.45,0.8065843621399177,0.534493780778225,0.5616998672485352,0.0
23,0,Naive Bayes,2,0.45,0.06995884773662552,0.7565428747114508,0.24587130546569824,0.0
24,1,KNeighbors Classifier,0,0.45,0.8235294117647058,0.7015616970039255,0.37738561630249023,0.0
25,1,SVC Classifier,0,0.45,0.7607843137254902,1.0,0.21818971633911133,0.0
26,1,Decision Tree,0,0.45,0.8274509803921568,0.8606948619633858,0.09392380714416504,0.0
27,1,RandomForest,0,0.45,0.7607843137254902,1.0,0.8550174236297607,0.0
28,1,AdaBoost (Discrete),0,0.45,0.6901960784313725,0.5359932868117497,47.45228958129883,0.0
29,1,AdaBoost (Real),0,0.45,0.5215686274509804,0.4193603635635642,62.71219491958618,0.0
30,1,Logistic Regression (Penalty = L2),0,0.45,0.7529411764705882,0.9896907216494846,0.3235023021697998,0.0
31,1,Naive Bayes,0,0.45,0.09803921568627451,0.29331077701527647,0.11828923225402832,0.0
32,1,KNeighbors Classifier,1,0.45,0.732,0.7517769786501978,0.22448205947875977,0.0
33,1,SVC Classifier,1,0.45,0.776,1.0,0.3384830951690674,0.0
34,1,Decision Tree,1,0.45,0.76,0.932404371529582,0.11067318916320801,0.0
35,1,RandomForest,1,0.45,0.776,1.0,0.7949512004852295,0.0
36,1,AdaBoost (Discrete),1,0.45,0.716,0.5532438243499739,46.12952423095703,0.0
37,1,AdaBoost (Real),1,0.45,0.492,0.29025254954231905,66.14549398422241,0.0
38,1,Logistic Regression (Penalty = L2),1,0.45,0.772,0.44490239865603887,0.4547462463378906,0.0
39,1,Naive Bayes,1,0.45,0.084,0.26830140923465134,0.24072527885437012,0.0
40,1,KNeighbors Classifier,2,0.45,0.8106995884773662,0.7175868135347769,0.36811184883117676,0.0
41,1,SVC Classifier,2,0.45,0.7983539094650206,1.0,0.24160480499267578,0.0
42,1,Decision Tree,2,0.45,0.8148148148148148,0.9105850741262953,0.0023615360260009766,0.0
43,1,RandomForest,2,0.45,0.7983539094650206,1.0,0.7226512432098389,0.0
44,1,AdaBoost (Discrete),2,0.45,0.6748971193415638,0.5160863043370713,47.39049220085144,0.0
45,1,AdaBoost (Real),2,0.45,0.7283950617283951,0.9123711340206185,61.02674317359924,0.0
46,1,Logistic Regression (Penalty = L2),2,0.45,0.7818930041152263,0.4935146411515345,0.3837010860443115,0.0
47,1,Naive Bayes,2,0.45,0.08641975308641975,0.37942603546347325,0.11739706993103027,0.0
48,2,KNeighbors Classifier,0,0.45,0.7490196078431373,0.3095370536284227,0.23321747779846191,0.0
49,2,SVC Classifier,0,0.45,0.7607843137254902,1.0,0.23143792152404785,0.0
50,2,Decision Tree,0,0.45,0.7686274509803922,0.4394967226043702,0.001981973648071289,0.0
51,2,RandomForest,0,0.45,0.7607843137254902,1.0,0.7286863327026367,0.0
52,2,AdaBoost (Discrete),0,0.45,0.7607843137254902,0.2616694886088574,44.733469009399414,0.0
53,2,AdaBoost (Real),0,0.45,0.7647058823529411,0.2871896358074587,64.93753504753113,0.0
54,2,Logistic Regression (Penalty = L2),0,0.45,0.7607843137254902,0.3439247717704234,0.35597777366638184,0.0
55,2,Naive Bayes,0,0.45,0.043137254901960784,0.30676310548712155,0.2976834774017334,0.0
56,2,KNeighbors Classifier,1,0.45,0.792,0.49324241486609405,0.46299195289611816,0.0
57,2,SVC Classifier,1,0.45,0.776,1.0,0.3478715419769287,0.0
58,2,Decision Tree,1,0.45,0.796,0.44663617196473115,0.11045312881469727,0.0
59,2,RandomForest,1,0.45,0.776,1.0,0.9108078479766846,0.0
60,2,AdaBoost (Discrete),1,0.45,0.768,0.4050794330486773,47.596877574920654,0.0
61,2,AdaBoost (Real),1,0.45,0.78,0.32127586985818757,76.14036130905151,0.0
62,2,Logistic Regression (Penalty = L2),1,0.45,0.776,0.4071947447321208,0.6154711246490479,0.0
63,2,Naive Bayes,1,0.45,0.04,0.15945775785021718,0.2765994071960449,0.0
64,2,KNeighbors Classifier,2,0.45,0.7942386831275721,0.579735671095731,0.4136974811553955,0.0
65,2,SVC Classifier,2,0.45,0.7983539094650206,1.0,0.2765347957611084,0.0
66,2,Decision Tree,2,0.45,0.7983539094650206,0.5041574800327548,0.0014040470123291016,0.0
67,2,RandomForest,2,0.45,0.7901234567901234,0.6997790520224827,0.8298463821411133,0.0
68,2,AdaBoost (Discrete),2,0.45,0.7942386831275721,0.7016181591415044,51.28247928619385,0.0
69,2,AdaBoost (Real),2,0.45,0.7901234567901234,0.5445882786578613,68.2272937297821,0.0
70,2,Logistic Regression (Penalty = L2),2,0.45,0.7901234567901234,0.5445882786578613,0.37499213218688965,0.0
71,2,Naive Bayes,2,0.45,0.04526748971193416,0.23004969224668356,0.29874229431152344,0.0
72,3,KNeighbors Classifier,0,0.45,0.7607843137254902,1.0,0.27921175956726074,0.0
73,3,SVC Classifier,0,0.45,0.7607843137254902,1.0,0.2595784664154053,0.0
74,3,Decision Tree,0,0.45,0.7647058823529411,0.408248290463863,0.001796722412109375,0.0
75,3,RandomForest,0,0.45,0.7607843137254902,1.0,0.959864616394043,0.0
76,3,AdaBoost (Discrete),0,0.45,0.7647058823529411,0.408248290463863,49.929119348526,0.0
77,3,AdaBoost (Real),0,0.45,0.7647058823529411,0.408248290463863,62.7140531539917,0.0
78,3,Logistic Regression (Penalty = L2),0,0.45,0.7607843137254902,1.0,0.38549184799194336,0.0
79,3,Naive Bayes,0,0.45,0.023529411764705882,0.2295748846661433,0.12917089462280273,0.0
80,3,KNeighbors Classifier,1,0.45,0.78,0.4472135954999579,0.2524113655090332,0.0
81,3,SVC Classifier,1,0.45,0.776,1.0,0.25495433807373047,0.0
82,3,Decision Tree,1,0.45,0.78,0.4472135954999579,0.0012595653533935547,0.0
83,3,RandomForest,1,0.45,0.776,1.0,0.8136751651763916,0.0
84,3,AdaBoost (Discrete),1,0.45,0.776,1.0,49.04793977737427,0.0
85,3,AdaBoost (Real),1,0.45,0.776,0.446059493974681,68.23851585388184,0.0
86,3,Logistic Regression (Penalty = L2),1,0.45,0.776,1.0,0.14359283447265625,0.0
87,3,Naive Bayes,1,0.45,0.032,0.3021375397356768,0.2940199375152588,0.0
88,3,KNeighbors Classifier,2,0.45,0.7818930041152263,0.4935146411515345,0.2934999465942383,0.0
89,3,SVC Classifier,2,0.45,0.7983539094650206,1.0,0.27733349800109863,0.0
90,3,Decision Tree,2,0.45,0.7860082304526749,0.4948185130173913,0.0020351409912109375,0.0
91,3,RandomForest,2,0.45,0.7983539094650206,1.0,0.9791343212127686,0.0
92,3,AdaBoost (Discrete),2,0.45,0.7983539094650206,1.0,50.39429450035095,0.0
93,3,AdaBoost (Real),2,0.45,0.7818930041152263,0.4935146411515345,66.68105745315552,0.0
94,3,Logistic Regression (Penalty = L2),2,0.45,0.7901234567901234,0.9896907216494846,0.27802228927612305,0.0
95,3,Naive Bayes,2,0.45,0.0205761316872428,0.5,0.271770715713501,0.0
96,4,KNeighbors Classifier,0,0.45,0.7607843137254902,0.2866927669330738,0.423079252243042,0.0
97,4,SVC Classifier,0,0.45,0.7607843137254902,1.0,0.2744734287261963,0.0
98,4,Decision Tree,0,0.45,0.7686274509803922,0.3115857230292383,0.11818647384643555,0.0
99,4,RandomForest,0,0.45,0.7607843137254902,1.0,0.8172421455383301,0.0
100,4,AdaBoost (Discrete),0,0.45,0.7686274509803922,0.3115857230292383,49.23470878601074,0.0
101,4,AdaBoost (Real),0,0.45,0.7607843137254902,0.3769890791947507,70.93148303031921,0.0
102,4,Logistic Regression (Penalty = L2),0,0.45,0.7647058823529411,0.3838431694704549,0.15220904350280762,0.0
103,4,Naive Bayes,0,0.45,0.0392156862745098,0.3195771718380609,0.1075735092163086,0.0
104,4,KNeighbors Classifier,1,0.45,0.776,1.0,0.11850547790527344,0.0
105,4,SVC Classifier,1,0.45,0.776,1.0,0.1289362907409668,0.0
106,4,Decision Tree,1,0.45,0.784,0.3218297948685433,0.0020706653594970703,0.0
107,4,RandomForest,1,0.45,0.776,1.0,0.542180061340332,0.0
108,4,AdaBoost (Discrete),1,0.45,0.776,0.4071947447321208,47.94713115692139,0.0
109,4,AdaBoost (Real),1,0.45,0.776,0.4071947447321208,65.75602889060974,0.0
110,4,Logistic Regression (Penalty = L2),1,0.45,0.78,0.408248290463863,0.3810422420501709,0.0
111,4,Naive Bayes,1,0.45,0.036,0.3760603093086394,0.25898146629333496,0.0
112,4,KNeighbors Classifier,2,0.45,0.7942386831275721,0.9948453608247423,0.2618417739868164,0.0
113,4,SVC Classifier,2,0.45,0.7983539094650206,1.0,0.2469170093536377,0.0
114,4,Decision Tree,2,0.45,0.7942386831275721,0.5455521537286048,0.12202620506286621,0.0
115,4,RandomForest,2,0.45,0.7942386831275721,0.5455521537286048,0.7673158645629883,0.0
116,4,AdaBoost (Discrete),2,0.45,0.7901234567901234,0.9896907216494846,53.38263750076294,0.0
117,4,AdaBoost (Real),2,0.45,0.7942386831275721,0.9948453608247423,56.32862687110901,0.0
118,4,Logistic Regression (Penalty = L2),2,0.45,0.7901234567901234,0.5445882786578613,0.23574352264404297,0.0
119,4,Naive Bayes,2,0.45,0.02880658436213992,0.5,0.269550085067749,0.0
120,5,KNeighbors Classifier,0,0.45,0.7607843137254902,1.0,0.23938274383544922,0.0
121,5,SVC Classifier,0,0.45,0.7607843137254902,1.0,0.23917508125305176,0.0
122,5,Decision Tree,0,0.45,0.7647058823529411,0.408248290463863,0.0020618438720703125,0.0
123,5,RandomForest,0,0.45,0.7607843137254902,1.0,0.7171225547790527,0.0
124,5,AdaBoost (Discrete),0,0.45,0.7647058823529411,0.408248290463863,44.065367460250854,0.0
125,5,AdaBoost (Real),0,0.45,0.7607843137254902,1.0,70.85852217674255,0.0
126,5,Logistic Regression (Penalty = L2),0,0.45,0.7607843137254902,1.0,0.2815735340118408,0.0
127,5,Naive Bayes,0,0.45,0.0196078431372549,0.2403749283845681,0.11944460868835449,0.0
128,5,KNeighbors Classifier,1,0.45,0.776,1.0,0.1615278720855713,0.0
129,5,SVC Classifier,1,0.45,0.776,1.0,0.07004547119140625,0.0
130,5,Decision Tree,1,0.45,0.78,0.4472135954999579,0.0012657642364501953,0.0
131,5,RandomForest,1,0.45,0.776,1.0,0.5017375946044922,0.0
132,5,AdaBoost (Discrete),1,0.45,0.78,0.4472135954999579,34.36438179016113,0.0
133,5,AdaBoost (Real),1,0.45,0.78,0.4472135954999579,68.54580044746399,0.0
134,5,Logistic Regression (Penalty = L2),1,0.45,0.776,1.0,0.23623871803283691,0.0
135,5,Naive Bayes,1,0.45,0.028,0.09506391005973398,0.23554587364196777,0.0
136,5,KNeighbors Classifier,2,0.45,0.7942386831275721,0.9948453608247423,0.38953185081481934,0.0
137,5,SVC Classifier,2,0.45,0.7983539094650206,1.0,0.25623369216918945,0.0
138,5,Decision Tree,2,0.45,0.7983539094650206,1.0,0.12559151649475098,0.0
139,5,RandomForest,2,0.45,0.7983539094650206,1.0,1.0505709648132324,0.0
140,5,AdaBoost (Discrete),2,0.45,0.7942386831275721,0.9948453608247423,48.91617703437805,0.0
141,5,AdaBoost (Real),2,0.45,0.7942386831275721,0.9948453608247423,67.898521900177,0.0
142,5,Logistic Regression (Penalty = L2),2,0.45,0.7942386831275721,0.9948453608247423,0.2506372928619385,0.0
143,5,Naive Bayes,2,0.45,0.02880658436213992,0.12435400084345175,0.2514183521270752,0.0
144,6,KNeighbors Classifier,0,0.45,0.7647058823529411,0.2620113175395233,0.49044036865234375,0.0
145,6,SVC Classifier,0,0.45,0.7607843137254902,1.0,0.35517096519470215,0.0
146,6,Decision Tree,0,0.45,0.7725490196078432,0.28514649594268227,0.14600896835327148,0.0
147,6,RandomForest,0,0.45,0.7607843137254902,1.0,0.896364688873291,0.0
148,6,AdaBoost (Discrete),0,0.45,0.7647058823529411,0.408248290463863,48.392627477645874,0.0
149,6,AdaBoost (Real),0,0.45,0.7607843137254902,1.0,61.52952432632446,0.0
150,6,Logistic Regression (Penalty = L2),0,0.45,0.7686274509803922,0.3873141779594106,0.3302116394042969,0.0
151,6,Naive Bayes,0,0.45,0.043137254901960784,0.3670977715849853,0.24002766609191895,0.0
152,6,KNeighbors Classifier,1,0.45,0.788,0.49239345894554554,0.48290348052978516,0.0
153,6,SVC Classifier,1,0.45,0.776,1.0,0.21717119216918945,0.0
154,6,Decision Tree,1,0.45,0.788,0.28574404296988,0.001401662826538086,0.0
155,6,RandomForest,1,0.45,0.776,1.0,0.7380797863006592,0.0
156,6,AdaBoost (Discrete),1,0.45,0.776,0.4071947447321208,52.88687181472778,0.0
157,6,AdaBoost (Real),1,0.45,0.776,0.4071947447321208,71.08934211730957,0.0
158,6,Logistic Regression (Penalty = L2),1,0.45,0.776,0.3207200281427488,0.43726682662963867,0.0
159,6,Naive Bayes,1,0.45,0.044,0.16559340774040096,0.25902581214904785,0.0
160,6,KNeighbors Classifier,2,0.45,0.7777777777777778,0.36391779603417973,0.40845727920532227,0.0
161,6,SVC Classifier,2,0.45,0.7983539094650206,1.0,0.2705099582672119,0.0
162,6,Decision Tree,2,0.45,0.7860082304526749,0.4470694492780124,0.14975476264953613,0.0
163,6,RandomForest,2,0.45,0.7901234567901234,0.6997790520224827,0.6584770679473877,0.0
164,6,AdaBoost (Discrete),2,0.45,0.7860082304526749,0.9845360824742269,52.46347665786743,0.0
165,6,AdaBoost (Real),2,0.45,0.8024691358024691,0.4352840471927457,67.33962678909302,0.0
166,6,Logistic Regression (Penalty = L2),2,0.45,0.7860082304526749,0.4470694492780124,0.4099576473236084,0.0
167,6,Naive Bayes,2,0.45,0.04526748971193416,0.24935316404995922,0.133314847946167,0.0
168,7,KNeighbors Classifier,0,0.45,0.8156862745098039,0.6790752777955172,0.5218868255615234,0.0
169,7,SVC Classifier,0,0.45,0.7607843137254902,1.0,0.39321184158325195,0.0
170,7,Decision Tree,0,0.45,0.8156862745098039,0.7828209580141973,0.13012981414794922,0.0
171,7,RandomForest,0,0.45,0.7607843137254902,1.0,0.9303901195526123,0.0
172,7,AdaBoost (Discrete),0,0.45,0.7686274509803922,0.4791996883770477,56.99221754074097,0.0
173,7,AdaBoost (Real),0,0.45,0.6627450980392157,0.5867962993298582,80.01525211334229,0.0
174,7,Logistic Regression (Penalty = L2),0,0.45,0.7529411764705882,0.2836456415383528,0.7601799964904785,0.0
175,7,Naive Bayes,0,0.45,0.11764705882352941,0.32912771291696835,0.44083499908447266,0.0
176,7,KNeighbors Classifier,1,0.45,0.744,0.7301909269997741,0.4332699775695801,0.0
177,7,SVC Classifier,1,0.45,0.776,1.0,0.5821826457977295,0.0
178,7,Decision Tree,1,0.45,0.804,0.9395346225013701,0.0026183128356933594,0.0
179,7,RandomForest,1,0.45,0.776,1.0,0.9979126453399658,0.0
180,7,AdaBoost (Discrete),1,0.45,0.8,0.6433851479631425,65.32121515274048,0.0
181,7,AdaBoost (Real),1,0.45,0.72,0.5033779843569391,83.29630494117737,0.0
182,7,Logistic Regression (Penalty = L2),1,0.45,0.8,0.39704095828714797,0.643784761428833,0.0
183,7,Naive Bayes,1,0.45,0.084,0.279199252841938,0.333392858505249,0.0
184,7,KNeighbors Classifier,2,0.45,0.8024691358024691,0.6561287943726687,0.5102856159210205,0.0
185,7,SVC Classifier,2,0.45,0.7983539094650206,1.0,0.5975801944732666,0.0
186,7,Decision Tree,2,0.45,0.7942386831275721,0.8345695575996205,0.12321734428405762,0.0
187,7,RandomForest,2,0.45,0.8065843621399177,0.7071067811865476,0.8598506450653076,0.0
188,7,AdaBoost (Discrete),2,0.45,0.7613168724279835,0.6743875518791071,57.49770951271057,0.0
189,7,AdaBoost (Real),2,0.45,0.6584362139917695,0.6302022133499235,74.2264358997345,0.0
190,7,Logistic Regression (Penalty = L2),2,0.45,0.7818930041152263,0.44646733417548745,0.7067339420318604,0.0
191,7,Naive Bayes,2,0.45,0.10699588477366255,0.4563925617881304,0.22339773178100586,0.0
192,8,KNeighbors Classifier,0,0.45,0.7607843137254902,1.0,0.24295639991760254,0.0
193,8,SVC Classifier,0,0.45,0.7607843137254902,1.0,0.24593639373779297,0.0
194,8,Decision Tree,0,0.45,0.7647058823529411,0.408248290463863,0.0017540454864501953,0.0
195,8,RandomForest,0,0.45,0.7450980392156863,0.979381443298969,1.03230619430542,0.0
196,8,AdaBoost (Discrete),0,0.45,0.7607843137254902,0.4071947447321208,53.20024609565735,0.0
197,8,AdaBoost (Real),0,0.45,0.7647058823529411,0.408248290463863,71.11177921295166,0.0
198,8,Logistic Regression (Penalty = L2),0,0.45,0.7607843137254902,1.0,0.2887141704559326,0.0
199,8,Naive Bayes,0,0.45,0.0196078431372549,0.2403749283845681,0.2984304428100586,0.0
200,8,KNeighbors Classifier,1,0.45,0.776,1.0,0.29610586166381836,0.0
201,8,SVC Classifier,1,0.45,0.776,1.0,0.3399386405944824,0.0
202,8,Decision Tree,1,0.45,0.78,0.4472135954999579,0.0021424293518066406,0.0
203,8,RandomForest,1,0.45,0.776,1.0,1.192103385925293,0.0
204,8,AdaBoost (Discrete),1,0.45,0.78,0.4472135954999579,56.15179467201233,0.0
205,8,AdaBoost (Real),1,0.45,0.78,0.4472135954999579,77.76791048049927,0.0
206,8,Logistic Regression (Penalty = L2),1,0.45,0.776,1.0,0.2801084518432617,0.0
207,8,Naive Bayes,1,0.45,0.024,0.408248290463863,0.2673766613006592,0.0
208,8,KNeighbors Classifier,2,0.45,0.7983539094650206,1.0,0.279660701751709,0.0
209,8,SVC Classifier,2,0.45,0.7983539094650206,1.0,0.2755270004272461,0.0
210,8,Decision Tree,2,0.45,0.7942386831275721,0.9948453608247423,0.0013344287872314453,0.0
211,8,RandomForest,2,0.45,0.7983539094650206,1.0,1.0741772651672363,0.0
212,8,AdaBoost (Discrete),2,0.45,0.7942386831275721,0.9948453608247423,56.50580978393555,0.0
213,8,AdaBoost (Real),2,0.45,0.7942386831275721,0.9948453608247423,70.52121233940125,0.0
214,8,Logistic Regression (Penalty = L2),2,0.45,0.7983539094650206,1.0,0.26408910751342773,0.0
215,8,Naive Bayes,2,0.45,0.01646090534979424,1.0,0.2635056972503662,0.0
