,feat_set_id,classifier,fold_id,feat_th,score,geo_score,exec_t,geo_score_woz
0,0,KNeighbors Classifier,0,0.45,0.7435008665511266,0.6486330560262571,0.2936272621154785,0.0
1,0,SVC Classifier,0,0.45,0.6845753899480069,0.8129520829107402,0.49620652198791504,0.0
2,0,Decision Tree,0,0.45,0.733102253032929,0.6355144417343048,0.058892011642456055,0.0
3,0,RandomForest,0,0.45,0.7001733102253033,1.0,0.4523303508758545,0.0
4,0,AdaBoost (Discrete),0,0.45,0.6984402079722704,0.5922912266375854,27.513218879699707,0.0
5,0,AdaBoost (Real),0,0.45,0.729636048526863,0.5675979225136754,33.394516706466675,0.0
6,0,Logistic Regression (Penalty = L2),0,0.45,0.6741767764298093,0.7400850399357047,0.32755541801452637,0.0
7,0,Naive Bayes,0,0.45,0.6672443674176777,0.7914018355435688,0.06356263160705566,0.0
8,0,KNeighbors Classifier,1,0.45,0.7517361111111112,0.4524050622026646,0.41684532165527344,0.0
9,0,SVC Classifier,1,0.45,0.7274305555555556,0.7636780043269571,0.5175483226776123,0.0
10,0,Decision Tree,1,0.45,0.7413194444444444,0.7341830687736267,0.002586841583251953,0.0
11,0,RandomForest,1,0.45,0.7239583333333334,0.4956385459568428,0.35347700119018555,0.0
12,0,AdaBoost (Discrete),1,0.45,0.6996527777777778,0.432984228644562,34.83643627166748,0.0
13,0,AdaBoost (Real),1,0.45,0.7100694444444444,0.4356005110374635,52.79550576210022,0.0
14,0,Logistic Regression (Penalty = L2),1,0.45,0.7899305555555556,0.8044080808610958,0.4257786273956299,0.0
15,0,Naive Bayes,1,0.45,0.7777777777777778,0.8784280035315966,0.12122726440429688,0.0
16,0,KNeighbors Classifier,2,0.45,0.7930434782608695,0.5480288200791433,0.60764479637146,0.5480288200791433
17,0,SVC Classifier,2,0.45,0.8208695652173913,0.7556138122418227,0.7522499561309814,0.0
18,0,Decision Tree,2,0.45,0.36,0.48524688296777596,0.09085893630981445,0.48524688296777596
19,0,RandomForest,2,0.45,0.711304347826087,0.2781178990227415,0.6604673862457275,0.0
20,0,AdaBoost (Discrete),2,0.45,0.3947826086956522,0.39499521753847927,33.47623252868652,0.0
21,0,AdaBoost (Real),2,0.45,0.35478260869565215,0.39952475410835686,41.73254323005676,0.39952475410835686
22,0,Logistic Regression (Penalty = L2),2,0.45,0.6295652173913043,0.5043013773774697,0.37508559226989746,0.5043013773774697
23,0,Naive Bayes,2,0.45,0.4782608695652174,0.7962895022318469,0.06830477714538574,0.0
24,1,KNeighbors Classifier,0,0.45,0.6759098786828422,0.562385381853539,0.392467737197876,0.0
25,1,SVC Classifier,0,0.45,0.6845753899480069,0.8129520829107402,0.6127936840057373,0.0
26,1,Decision Tree,0,0.45,0.6360485268630849,0.5498693567355661,0.002936840057373047,0.0
27,1,RandomForest,0,0.45,0.7417677642980935,0.7407118766149331,0.6118440628051758,0.0
28,1,AdaBoost (Discrete),0,0.45,0.23570190641247835,0.23244442904715654,29.880836248397827,0.0
29,1,AdaBoost (Real),0,0.45,0.2218370883882149,0.2649102639566414,45.54566287994385,0.0
30,1,Logistic Regression (Penalty = L2),0,0.45,0.6395147313691508,0.6832394989103653,0.38068556785583496,0.0
31,1,Naive Bayes,0,0.45,0.6429809358752167,0.7508927762297288,0.17888379096984863,0.0
32,1,KNeighbors Classifier,1,0.45,0.6770833333333334,0.42863209519521667,0.5499961376190186,0.0
33,1,SVC Classifier,1,0.45,0.78125,0.7990572919580082,0.818248987197876,0.0
34,1,Decision Tree,1,0.45,0.4305555555555556,0.3586636086380604,0.09035325050354004,0.0
35,1,RandomForest,1,0.45,0.6840277777777778,0.5871610209441096,0.6642134189605713,0.0
36,1,AdaBoost (Discrete),1,0.45,0.7760416666666666,0.4741342848978511,39.774999141693115,0.0
37,1,AdaBoost (Real),1,0.45,0.7604166666666666,0.3182095817719693,64.51364135742188,0.0
38,1,Logistic Regression (Penalty = L2),1,0.45,0.734375,0.6312037025746289,0.4376704692840576,0.0
39,1,Naive Bayes,1,0.45,0.7777777777777778,0.625576578988088,0.16487979888916016,0.0
40,1,KNeighbors Classifier,2,0.45,0.7234782608695652,0.43304525477849365,0.5053365230560303,0.0
41,1,SVC Classifier,2,0.45,0.7234782608695652,0.37266643657948806,1.0732476711273193,0.0
42,1,Decision Tree,2,0.45,0.6139130434782609,0.6036902939854484,0.10284566879272461,0.0
43,1,RandomForest,2,0.45,0.6991304347826087,0.9975186104218362,0.8335342407226562,0.0
44,1,AdaBoost (Discrete),2,0.45,0.5756521739130435,0.4657370847229597,48.564125537872314,0.4657370847229597
45,1,AdaBoost (Real),2,0.45,0.6260869565217392,0.35378882851355054,67.58525729179382,0.35378882851355054
46,1,Logistic Regression (Penalty = L2),2,0.45,0.768695652173913,0.4644893341011511,0.4224891662597656,0.4644893341011511
47,1,Naive Bayes,2,0.45,0.5234782608695652,0.6343220427382565,0.11367154121398926,0.0
48,2,KNeighbors Classifier,0,0.45,0.6897746967071057,0.6768693574934168,0.4538085460662842,0.0
49,2,SVC Classifier,0,0.45,0.6845753899480069,0.8129520829107402,1.0467095375061035,0.0
50,2,Decision Tree,0,0.45,0.6759098786828422,0.6546607278906574,0.09828448295593262,0.0
51,2,RandomForest,0,0.45,0.7001733102253033,1.0,0.7481036186218262,0.0
52,2,AdaBoost (Discrete),0,0.45,0.7001733102253033,0.6602031733373562,47.16272711753845,0.0
53,2,AdaBoost (Real),0,0.45,0.7227036395147314,0.813853758940804,60.112162590026855,0.0
54,2,Logistic Regression (Penalty = L2),0,0.45,0.6932409012131716,0.7666772043328042,0.42070746421813965,0.0
55,2,Naive Bayes,0,0.45,0.6672443674176777,0.7914018355435688,0.12067961692810059,0.0
56,2,KNeighbors Classifier,1,0.45,0.53125,0.40991574111275864,0.683720588684082,0.40991574111275864
57,2,SVC Classifier,1,0.45,0.7274305555555556,0.7636780043269571,1.1054348945617676,0.0
58,2,Decision Tree,1,0.45,0.5069444444444444,0.5405887194344049,0.0027189254760742188,0.5405887194344049
59,2,RandomForest,1,0.45,0.6753472222222222,0.3691646898583522,0.8716044425964355,0.0
60,2,AdaBoost (Discrete),1,0.45,0.8038194444444444,0.5939652249328778,43.90124011039734,0.5939652249328778
61,2,AdaBoost (Real),1,0.45,0.8663194444444444,0.7205843482622097,52.77629804611206,0.7205843482622097
62,2,Logistic Regression (Penalty = L2),1,0.45,0.7569444444444444,0.5852450105383903,0.44818758964538574,0.0
63,2,Naive Bayes,1,0.45,0.8125,0.7204184105774583,0.1133420467376709,0.7204184105774583
64,2,KNeighbors Classifier,2,0.45,0.6782608695652174,0.6437580514872184,0.7092616558074951,0.6437580514872184
65,2,SVC Classifier,2,0.45,0.782608695652174,0.6280786458396762,0.9064388275146484,0.0
66,2,Decision Tree,2,0.45,0.5791304347826087,0.4500997657974422,0.0980081558227539,0.4500997657974422
67,2,RandomForest,2,0.45,0.7008695652173913,1.0,0.7112135887145996,0.0
68,2,AdaBoost (Discrete),2,0.45,0.4156521739130435,0.6253491247724716,44.721216440200806,0.6253491247724716
69,2,AdaBoost (Real),2,0.45,0.4017391304347826,0.6021718321778252,54.1693172454834,0.6021718321778252
70,2,Logistic Regression (Penalty = L2),2,0.45,0.7060869565217391,0.3326066600055566,0.3953537940979004,0.3326066600055566
71,2,Naive Bayes,2,0.45,0.52,0.822632013516035,0.1437079906463623,0.0
72,3,KNeighbors Classifier,0,0.45,0.8006932409012132,0.43431212830698024,0.5153741836547852,0.43431212830698024
73,3,SVC Classifier,0,0.45,0.6845753899480069,0.8129520829107402,0.9310848712921143,0.0
74,3,Decision Tree,0,0.45,0.7417677642980935,0.8617274844321391,0.094451904296875,0.0
75,3,RandomForest,0,0.45,0.7192374350086655,0.7958596836997172,0.6929497718811035,0.0
76,3,AdaBoost (Discrete),0,0.45,0.7417677642980935,0.8617274844321391,48.00748252868652,0.0
77,3,AdaBoost (Real),0,0.45,0.7383015597920277,0.8047276767101814,68.10517501831055,0.0
78,3,Logistic Regression (Penalty = L2),0,0.45,0.7105719237435009,0.8354757937727448,0.43757057189941406,0.0
79,3,Naive Bayes,0,0.45,0.5233968804159446,0.7201922951672233,0.18258953094482422,0.0
80,3,KNeighbors Classifier,1,0.45,0.7204861111111112,0.4797383732305324,0.3174891471862793,0.0
81,3,SVC Classifier,1,0.45,0.78125,0.7990572919580082,0.7656898498535156,0.0
82,3,Decision Tree,1,0.45,0.7378472222222222,0.4914408566362678,0.002741575241088867,0.0
83,3,RandomForest,1,0.45,0.7517361111111112,0.4841229182759271,0.651176929473877,0.0
84,3,AdaBoost (Discrete),1,0.45,0.6996527777777778,0.5623574092790359,43.21226215362549,0.0
85,3,AdaBoost (Real),1,0.45,0.3506944444444444,0.3477639653768881,55.287699937820435,0.0
86,3,Logistic Regression (Penalty = L2),1,0.45,0.7534722222222222,0.37957362148445783,0.3796660900115967,0.0
87,3,Naive Bayes,1,0.45,0.6840277777777778,0.7034341761336865,0.10128188133239746,0.0
88,3,KNeighbors Classifier,2,0.45,0.7304347826086957,0.4456329315450322,0.34552621841430664,0.0
89,3,SVC Classifier,2,0.45,0.7617391304347826,0.5617326583032773,0.7745296955108643,0.0
90,3,Decision Tree,2,0.45,0.8591304347826086,0.8867301295099007,0.0016713142395019531,0.0
91,3,RandomForest,2,0.45,0.7130434782608696,0.30428087129367126,0.7555379867553711,0.0
92,3,AdaBoost (Discrete),2,0.45,0.7982608695652174,0.527175998470217,50.1595618724823,0.0
93,3,AdaBoost (Real),2,0.45,0.7617391304347826,0.40903153868121966,72.14112687110901,0.0
94,3,Logistic Regression (Penalty = L2),2,0.45,0.8052173913043478,0.7259641061200546,0.4271419048309326,0.0
95,3,Naive Bayes,2,0.45,0.7791304347826087,0.6214035074764954,0.13130545616149902,0.6214035074764954
96,4,KNeighbors Classifier,0,0.45,0.7348353552859619,0.5802543034907401,0.4395270347595215,0.0
97,4,SVC Classifier,0,0.45,0.6845753899480069,0.8129520829107402,1.062288522720337,0.0
98,4,Decision Tree,0,0.45,0.6551126516464472,0.5758666391094819,0.0023491382598876953,0.0
99,4,RandomForest,0,0.45,0.6932409012131716,0.5611576392063142,1.0236339569091797,0.0
100,4,AdaBoost (Discrete),0,0.45,0.6689774696707106,0.7033913824331288,47.86648631095886,0.0
101,4,AdaBoost (Real),0,0.45,0.4679376083188908,0.4714760153183099,74.513356924057,0.0
102,4,Logistic Regression (Penalty = L2),0,0.45,0.6793760831889082,0.7701501075237294,0.4980759620666504,0.0
103,4,Naive Bayes,0,0.45,0.6429809358752167,0.7508927762297288,0.20899629592895508,0.0
104,4,KNeighbors Classifier,1,0.45,0.7274305555555556,0.6082431071696208,1.0359904766082764,0.0
105,4,SVC Classifier,1,0.45,0.78125,0.7990572919580082,1.62626051902771,0.0
106,4,Decision Tree,1,0.45,0.7690972222222222,0.739142879306685,0.0025653839111328125,0.0
107,4,RandomForest,1,0.45,0.7239583333333334,0.4956385459568428,1.4558687210083008,0.0
108,4,AdaBoost (Discrete),1,0.45,0.8003472222222222,0.7482476571665723,90.48496270179749,0.0
109,4,AdaBoost (Real),1,0.45,0.796875,0.7307814743652402,262.69980454444885,0.0
110,4,Logistic Regression (Penalty = L2),1,0.45,0.7690972222222222,0.739142879306685,0.46216344833374023,0.0
111,4,Naive Bayes,1,0.45,0.7638888888888888,0.8567963102657931,0.5012197494506836,0.0
112,4,KNeighbors Classifier,2,0.45,0.7443478260869565,0.43818505713331635,0.8581693172454834,0.43818505713331635
113,4,SVC Classifier,2,0.45,0.7234782608695652,0.37266643657948806,1.8823142051696777,0.0
114,4,Decision Tree,2,0.45,0.6434782608695652,0.5585336578731345,0.002023458480834961,0.0
115,4,RandomForest,2,0.45,0.7008695652173913,1.0,1.417829990386963,0.0
116,4,AdaBoost (Discrete),2,0.45,0.3739130434782609,0.38541984055103423,88.92571902275085,0.38541984055103423
117,4,AdaBoost (Real),2,0.45,0.33217391304347826,0.37066291043740013,227.5410921573639,0.37066291043740013
118,4,Logistic Regression (Penalty = L2),2,0.45,0.6904347826086956,0.3813573951783174,0.6745548248291016,0.3813573951783174
119,4,Naive Bayes,2,0.45,0.46608695652173915,0.6897771060056679,0.18547439575195312,0.0
120,5,KNeighbors Classifier,0,0.45,0.7694974003466204,0.8844083999045815,0.6830494403839111,0.0
121,5,SVC Classifier,0,0.45,0.6845753899480069,0.8129520829107402,2.0149037837982178,0.0
122,5,Decision Tree,0,0.45,0.7279029462738301,0.850160147988438,0.21437692642211914,0.0
123,5,RandomForest,0,0.45,0.7001733102253033,1.0,1.1536588668823242,0.0
124,5,AdaBoost (Discrete),0,0.45,0.7504332755632582,0.7495099471595351,65.19717812538147,0.0
125,5,AdaBoost (Real),0,0.45,0.7504332755632582,0.7495099471595351,56.04732632637024,0.0
126,5,Logistic Regression (Penalty = L2),0,0.45,0.708838821490468,0.8128093470509953,0.3399662971496582,0.0
127,5,Naive Bayes,0,0.45,0.6672443674176777,0.7914018355435688,0.21720170974731445,0.0
128,5,KNeighbors Classifier,1,0.45,0.703125,0.44018366531247133,0.5401878356933594,0.0
129,5,SVC Classifier,1,0.45,0.7274305555555556,0.7636780043269571,0.7935855388641357,0.0
130,5,Decision Tree,1,0.45,0.7534722222222222,0.7652317143212379,0.09021115303039551,0.0
131,5,RandomForest,1,0.45,0.6024305555555556,0.5453247035098121,0.7555787563323975,0.0
132,5,AdaBoost (Discrete),1,0.45,0.7986111111111112,0.849086528435673,47.16172528266907,0.0
133,5,AdaBoost (Real),1,0.45,0.7760416666666666,0.774725060390132,52.86073565483093,0.0
134,5,Logistic Regression (Penalty = L2),1,0.45,0.7899305555555556,0.8044080808610958,0.30435800552368164,0.0
135,5,Naive Bayes,1,0.45,0.7725694444444444,0.8267897662968247,0.10095596313476562,0.8267897662968247
136,5,KNeighbors Classifier,2,0.45,0.8104347826086956,0.673614248433891,0.4573519229888916,0.673614248433891
137,5,SVC Classifier,2,0.45,0.8208695652173913,0.7556138122418227,0.7963254451751709,0.0
138,5,Decision Tree,2,0.45,0.7930434782608695,0.7541242319280904,0.09837603569030762,0.7541242319280904
139,5,RandomForest,2,0.45,0.7008695652173913,1.0,0.7568614482879639,0.0
140,5,AdaBoost (Discrete),2,0.45,0.5843478260869566,0.5859737927618865,42.91407775878906,0.5859737927618865
141,5,AdaBoost (Real),2,0.45,0.8608695652173913,0.8155880245366387,54.22953724861145,0.8155880245366387
142,5,Logistic Regression (Penalty = L2),2,0.45,0.7947826086956522,0.6429930440446221,0.3283817768096924,0.6429930440446221
143,5,Naive Bayes,2,0.45,0.4782608695652174,0.7962895022318469,0.11222314834594727,0.0
144,6,KNeighbors Classifier,0,0.45,0.7729636048526863,0.6509065256051749,0.4292454719543457,0.0
145,6,SVC Classifier,0,0.45,0.6845753899480069,0.8129520829107402,0.7733581066131592,0.0
146,6,Decision Tree,0,0.45,0.7417677642980935,0.8617274844321391,0.002504110336303711,0.0
147,6,RandomForest,0,0.45,0.7417677642980935,0.7407118766149331,0.5455994606018066,0.0
148,6,AdaBoost (Discrete),0,0.45,0.7417677642980935,0.8617274844321391,45.73990511894226,0.0
149,6,AdaBoost (Real),0,0.45,0.7417677642980935,0.8617274844321391,90.18793368339539,0.0
150,6,Logistic Regression (Penalty = L2),0,0.45,0.7417677642980935,0.8617274844321391,0.3222074508666992,0.0
151,6,Naive Bayes,0,0.45,0.5233968804159446,0.7201922951672233,0.11687707901000977,0.0
152,6,KNeighbors Classifier,1,0.45,0.7413194444444444,0.6920039139148341,0.5363049507141113,0.0
153,6,SVC Classifier,1,0.45,0.78125,0.7990572919580082,0.8634817600250244,0.0
154,6,Decision Tree,1,0.45,0.7361111111111112,0.45621327850879984,0.002597332000732422,0.0
155,6,RandomForest,1,0.45,0.6996527777777778,1.0,0.8786139488220215,0.0
156,6,AdaBoost (Discrete),1,0.45,0.7361111111111112,0.45621327850879984,45.7972354888916,0.0
157,6,AdaBoost (Real),1,0.45,0.3385416666666667,0.45080933501212156,55.60119915008545,0.0
158,6,Logistic Regression (Penalty = L2),1,0.45,0.7361111111111112,0.45621327850879984,0.20887184143066406,0.0
159,6,Naive Bayes,1,0.45,0.6840277777777778,0.7034341761336865,0.10514497756958008,0.0
160,6,KNeighbors Classifier,2,0.45,0.7130434782608696,0.36984672568008214,0.40774106979370117,0.0
161,6,SVC Classifier,2,0.45,0.7617391304347826,0.5617326583032773,0.9060807228088379,0.0
162,6,Decision Tree,2,0.45,0.8382608695652174,0.8340051055773173,0.10248804092407227,0.0
163,6,RandomForest,2,0.45,0.7234782608695652,0.37266643657948806,0.7290117740631104,0.0
164,6,AdaBoost (Discrete),2,0.45,0.8260869565217391,0.6750965179801736,43.898380756378174,0.0
165,6,AdaBoost (Real),2,0.45,0.8260869565217391,0.6750965179801736,101.94506406784058,0.0
166,6,Logistic Regression (Penalty = L2),2,0.45,0.8382608695652174,0.8340051055773173,0.1149439811706543,0.0
167,6,Naive Bayes,2,0.45,0.7791304347826087,0.6214035074764954,0.22534513473510742,0.6214035074764954
168,7,KNeighbors Classifier,0,0.45,0.6169844020797227,0.6288249295942455,0.22142314910888672,0.0
169,7,SVC Classifier,0,0.45,0.6845753899480069,0.8129520829107402,0.7861177921295166,0.0
170,7,Decision Tree,0,0.45,0.6516464471403813,0.710816362353948,0.11076807975769043,0.0
171,7,RandomForest,0,0.45,0.7001733102253033,1.0,0.7762641906738281,0.0
172,7,AdaBoost (Discrete),0,0.45,0.7001733102253033,0.6798915172639858,46.85414671897888,0.0
173,7,AdaBoost (Real),0,0.45,0.6516464471403813,0.710816362353948,98.7481598854065,0.0
174,7,Logistic Regression (Penalty = L2),0,0.45,0.6516464471403813,0.710816362353948,0.3508434295654297,0.0
175,7,Naive Bayes,0,0.45,0.5979202772963604,0.6612555313096259,0.11284136772155762,0.0
176,7,KNeighbors Classifier,1,0.45,0.6510416666666666,0.5884801891333993,0.3537750244140625,0.0
177,7,SVC Classifier,1,0.45,0.78125,0.7990572919580082,0.8391819000244141,0.0
178,7,Decision Tree,1,0.45,0.7743055555555556,0.7358337303007616,0.11445403099060059,0.0
179,7,RandomForest,1,0.45,0.6788194444444444,0.9702233250620348,0.8223111629486084,0.0
180,7,AdaBoost (Discrete),1,0.45,0.7743055555555556,0.7358337303007616,45.683900594711304,0.0
181,7,AdaBoost (Real),1,0.45,0.7204861111111112,0.7145030651326695,103.31496810913086,0.0
182,7,Logistic Regression (Penalty = L2),1,0.45,0.734375,0.6312037025746289,0.21240735054016113,0.0
183,7,Naive Bayes,1,0.45,0.8020833333333334,0.9114630646885044,0.10517215728759766,0.0
184,7,KNeighbors Classifier,2,0.45,0.6660869565217391,0.74552755972367,0.5034024715423584,0.0
185,7,SVC Classifier,2,0.45,0.7008695652173913,1.0,0.6166677474975586,0.0
186,7,Decision Tree,2,0.45,0.7913043478260869,0.6672891251784395,0.0026803016662597656,0.0
187,7,RandomForest,2,0.45,0.7008695652173913,1.0,0.7184679508209229,0.0
188,7,AdaBoost (Discrete),2,0.45,0.4782608695652174,0.5440553244127483,37.270073652267456,0.0
189,7,AdaBoost (Real),2,0.45,0.5617391304347826,0.5821881563478313,145.91174626350403,0.0
190,7,Logistic Regression (Penalty = L2),2,0.45,0.7860869565217391,0.6655868496072321,0.18575263023376465,0.0
191,7,Naive Bayes,2,0.45,0.4469565217391304,0.762000762001143,0.09180426597595215,0.0
192,8,KNeighbors Classifier,0,0.45,0.7868284228769498,0.46566013323672006,0.29949355125427246,0.46566013323672006
193,8,SVC Classifier,0,0.45,0.6845753899480069,0.8129520829107402,0.5511398315429688,0.0
194,8,Decision Tree,0,0.45,0.7417677642980935,0.8617274844321391,0.002256155014038086,0.0
195,8,RandomForest,0,0.45,0.7417677642980935,0.7407118766149331,0.5533509254455566,0.0
196,8,AdaBoost (Discrete),0,0.45,0.7417677642980935,0.8617274844321391,36.03846335411072,0.0
197,8,AdaBoost (Real),0,0.45,0.7019064124783362,0.7780441650525227,57.0359902381897,0.0
198,8,Logistic Regression (Penalty = L2),0,0.45,0.7105719237435009,0.8354757937727448,0.28490138053894043,0.0
199,8,Naive Bayes,0,0.45,0.5233968804159446,0.7201922951672233,0.0962209701538086,0.0
200,8,KNeighbors Classifier,1,0.45,0.7534722222222222,0.49743023200987097,0.29274940490722656,0.0
201,8,SVC Classifier,1,0.45,0.78125,0.7990572919580082,0.6739017963409424,0.0
202,8,Decision Tree,1,0.45,0.765625,0.37109643438383094,0.09448862075805664,0.0
203,8,RandomForest,1,0.45,0.7604166666666666,0.5678252885462702,0.6832153797149658,0.0
204,8,AdaBoost (Discrete),1,0.45,0.7621527777777778,0.3577754838473189,36.44653344154358,0.0
205,8,AdaBoost (Real),1,0.45,0.6579861111111112,0.33072386996333997,50.688371658325195,0.0
206,8,Logistic Regression (Penalty = L2),1,0.45,0.78125,0.7990572919580082,0.1842041015625,0.0
207,8,Naive Bayes,1,0.45,0.6805555555555556,0.6814373013692131,0.09536957740783691,0.0
208,8,KNeighbors Classifier,2,0.45,0.7547826086956522,0.5401095835873294,0.2884042263031006,0.0
209,8,SVC Classifier,2,0.45,0.7234782608695652,0.37266643657948806,0.6967031955718994,0.0
210,8,Decision Tree,2,0.45,0.7547826086956522,0.5401095835873294,0.09476637840270996,0.0
211,8,RandomForest,2,0.45,0.7008695652173913,1.0,0.47777724266052246,0.0
212,8,AdaBoost (Discrete),2,0.45,0.7808695652173913,0.6531798531763924,37.33663368225098,0.0
213,8,AdaBoost (Real),2,0.45,0.7026086956521739,0.4663789287810054,72.4055004119873,0.0
214,8,Logistic Regression (Penalty = L2),2,0.45,0.7547826086956522,0.5401095835873294,0.20249080657958984,0.0
215,8,Naive Bayes,2,0.45,0.7791304347826087,0.6214035074764954,0.09269428253173828,0.6214035074764954
216,9,KNeighbors Classifier,0,0.45,0.7417677642980935,0.7407118766149331,0.3788332939147949,0.0
217,9,SVC Classifier,0,0.45,0.6845753899480069,0.8129520829107402,0.6820516586303711,0.0
218,9,Decision Tree,0,0.45,0.7417677642980935,0.8617274844321391,0.001474618911743164,0.0
219,9,RandomForest,0,0.45,0.6429809358752167,0.5376812956971576,0.47914671897888184,0.0
220,9,AdaBoost (Discrete),0,0.45,0.7417677642980935,0.8617274844321391,36.9693763256073,0.0
221,9,AdaBoost (Real),0,0.45,0.7417677642980935,0.8617274844321391,125.08271050453186,0.0
222,9,Logistic Regression (Penalty = L2),0,0.45,0.7417677642980935,0.8617274844321391,0.20748686790466309,0.0
223,9,Naive Bayes,0,0.45,0.5233968804159446,0.7201922951672233,0.002810955047607422,0.0
224,9,KNeighbors Classifier,1,0.45,0.7065972222222222,0.753294030738896,0.32124876976013184,0.0
225,9,SVC Classifier,1,0.45,0.78125,0.7990572919580082,0.5414788722991943,0.0
226,9,Decision Tree,1,0.45,0.7916666666666666,0.8719038629079734,0.1466059684753418,0.0
227,9,RandomForest,1,0.45,0.6649305555555556,0.5533004963001166,1.007636308670044,0.0
228,9,AdaBoost (Discrete),1,0.45,0.7916666666666666,0.8719038629079734,42.88955807685852,0.0
229,9,AdaBoost (Real),1,0.45,0.7916666666666666,0.8719038629079734,66.42670392990112,0.0
230,9,Logistic Regression (Penalty = L2),1,0.45,0.7916666666666666,0.8719038629079734,0.21717548370361328,0.0
231,9,Naive Bayes,1,0.45,0.6701388888888888,0.5937155022689299,0.10881662368774414,0.5937155022689299
232,9,KNeighbors Classifier,2,0.45,0.7234782608695652,0.37266643657948806,0.43920063972473145,0.0
233,9,SVC Classifier,2,0.45,0.7008695652173913,1.0,0.6442451477050781,0.0
234,9,Decision Tree,2,0.45,0.8382608695652174,0.8340051055773173,0.10272645950317383,0.0
235,9,RandomForest,2,0.45,0.7008695652173913,1.0,0.7302982807159424,0.0
236,9,AdaBoost (Discrete),2,0.45,0.8382608695652174,0.8340051055773173,45.884010314941406,0.0
237,9,AdaBoost (Real),2,0.45,0.8382608695652174,0.8340051055773173,47.50926971435547,0.0
238,9,Logistic Regression (Penalty = L2),2,0.45,0.8382608695652174,0.8340051055773173,0.1691431999206543,0.0
239,9,Naive Bayes,2,0.45,0.7791304347826087,0.6214035074764954,0.07798218727111816,0.6214035074764954
240,10,KNeighbors Classifier,0,0.45,0.7105719237435009,0.6198191590825773,0.5645966529846191,0.0
241,10,SVC Classifier,0,0.45,0.6845753899480069,0.8129520829107402,0.8281567096710205,0.0
242,10,Decision Tree,0,0.45,0.6984402079722704,0.6050054859335917,0.0020775794982910156,0.0
243,10,RandomForest,0,0.45,0.7001733102253033,1.0,0.727325439453125,0.0
244,10,AdaBoost (Discrete),0,0.45,0.729636048526863,0.6300815843286437,45.13231372833252,0.0
245,10,AdaBoost (Real),0,0.45,0.7279029462738301,0.6237343122729011,52.731985330581665,0.0
246,10,Logistic Regression (Penalty = L2),0,0.45,0.6880415944540728,0.7603453162872774,0.4499359130859375,0.0
247,10,Naive Bayes,0,0.45,0.6672443674176777,0.7914018355435688,0.10449337959289551,0.0
248,10,KNeighbors Classifier,1,0.45,0.7447916666666666,0.49934001010328316,0.7877390384674072,0.0
249,10,SVC Classifier,1,0.45,0.7274305555555556,0.7636780043269571,1.0659773349761963,0.0
250,10,Decision Tree,1,0.45,0.7638888888888888,0.5829359303495854,0.09508943557739258,0.0
251,10,RandomForest,1,0.45,0.6996527777777778,1.0,0.6998136043548584,0.0
252,10,AdaBoost (Discrete),1,0.45,0.7743055555555556,0.47748159228563797,44.40190577507019,0.0
253,10,AdaBoost (Real),1,0.45,0.7482638888888888,0.613700236755791,51.97273659706116,0.0
254,10,Logistic Regression (Penalty = L2),1,0.45,0.7638888888888888,0.5874287808097735,0.41920924186706543,0.0
255,10,Naive Bayes,1,0.45,0.7829861111111112,0.6820345298093242,0.20147085189819336,0.0
256,10,KNeighbors Classifier,2,0.45,0.8539130434782609,0.7080204561161934,0.9309303760528564,0.7080204561161934
257,10,SVC Classifier,2,0.45,0.8208695652173913,0.7556138122418227,0.9474632740020752,0.0
258,10,Decision Tree,2,0.45,0.8591304347826086,0.711592006657846,0.09497523307800293,0.711592006657846
259,10,RandomForest,2,0.45,0.7165217391304348,0.6898459005389914,0.5877351760864258,0.0
260,10,AdaBoost (Discrete),2,0.45,0.391304347826087,0.43951757274901015,41.981258392333984,0.43951757274901015
261,10,AdaBoost (Real),2,0.45,0.38782608695652177,0.40354574309085667,47.320003271102905,0.40354574309085667
262,10,Logistic Regression (Penalty = L2),2,0.45,0.5582608695652174,0.4862376070552159,0.34148669242858887,0.4862376070552159
263,10,Naive Bayes,2,0.45,0.5478260869565217,0.8392974277582299,0.0803229808807373,0.0
264,11,KNeighbors Classifier,0,0.45,0.7261698440207972,0.5706520252956392,0.6087784767150879,0.5706520252956392
265,11,SVC Classifier,0,0.45,0.6845753899480069,0.8129520829107402,0.8131241798400879,0.0
266,11,Decision Tree,0,0.45,0.682842287694974,0.5848234231377462,0.07518792152404785,0.0
267,11,RandomForest,0,0.45,0.7001733102253033,1.0,0.5609734058380127,0.0
268,11,AdaBoost (Discrete),0,0.45,0.7227036395147314,0.6062062106406165,36.15995216369629,0.0
269,11,AdaBoost (Real),0,0.45,0.7175043327556326,0.6239375890153178,44.207953453063965,0.0
270,11,Logistic Regression (Penalty = L2),0,0.45,0.6811091854419411,0.7477017178734385,0.44746899604797363,0.0
271,11,Naive Bayes,0,0.45,0.6672443674176777,0.7914018355435688,0.07755708694458008,0.0
272,11,KNeighbors Classifier,1,0.45,0.6840277777777778,0.36631720640257387,0.6710782051086426,0.0
273,11,SVC Classifier,1,0.45,0.7274305555555556,0.7636780043269571,0.9780104160308838,0.0
274,11,Decision Tree,1,0.45,0.4878472222222222,0.4904965021635879,0.07880282402038574,0.0
275,11,RandomForest,1,0.45,0.7065972222222222,0.1767766952966369,0.6405153274536133,0.0
276,11,AdaBoost (Discrete),1,0.45,0.7916666666666666,0.6084322818438446,33.40725898742676,0.0
277,11,AdaBoost (Real),1,0.45,0.7638888888888888,0.5958864994085247,38.678300857543945,0.0
278,11,Logistic Regression (Penalty = L2),1,0.45,0.7673611111111112,0.5663771903171781,0.32127952575683594,0.0
279,11,Naive Bayes,1,0.45,0.7829861111111112,0.6820345298093242,0.12525200843811035,0.0
280,11,KNeighbors Classifier,2,0.45,0.8730434782608696,0.7968541999442317,0.6793451309204102,0.7968541999442317
281,11,SVC Classifier,2,0.45,0.8069565217391305,0.7136018970643201,0.8157064914703369,0.0
282,11,Decision Tree,2,0.45,0.3443478260869565,0.41240707469646776,0.07091236114501953,0.41240707469646776
283,11,RandomForest,2,0.45,0.7008695652173913,1.0,0.47985291481018066,0.0
284,11,AdaBoost (Discrete),2,0.45,0.4,0.36675871311757846,31.316693544387817,0.36675871311757846
285,11,AdaBoost (Real),2,0.45,0.4991304347826087,0.5079292816916389,37.760101079940796,0.5079292816916389
286,11,Logistic Regression (Penalty = L2),2,0.45,0.6069565217391304,0.49878441983801747,0.2516608238220215,0.49878441983801747
287,11,Naive Bayes,2,0.45,0.5478260869565217,0.8392974277582299,0.11844062805175781,0.0
288,12,KNeighbors Classifier,0,0.45,0.7972270363951474,0.9065220230186477,0.20595932006835938,0.0
289,12,SVC Classifier,0,0.45,0.6845753899480069,0.8129520829107402,0.4776484966278076,0.0
290,12,Decision Tree,0,0.45,0.6845753899480069,0.8129520829107402,0.06651782989501953,0.0
291,12,RandomForest,0,0.45,0.6845753899480069,0.8129520829107402,0.41515421867370605,0.0
292,12,AdaBoost (Discrete),0,0.45,0.6845753899480069,0.8129520829107402,26.28789234161377,0.0
293,12,AdaBoost (Real),0,0.45,0.6845753899480069,0.8129520829107402,34.82574796676636,0.0
294,12,Logistic Regression (Penalty = L2),0,0.45,0.6845753899480069,0.8129520829107402,0.13180804252624512,0.0
295,12,Naive Bayes,0,0.45,0.5025996533795494,0.8129520829107402,0.0638723373413086,0.0
296,12,KNeighbors Classifier,1,0.45,0.6996527777777778,1.0,0.19817662239074707,0.0
297,12,SVC Classifier,1,0.45,0.78125,0.7990572919580082,0.3762502670288086,0.0
298,12,Decision Tree,1,0.45,0.78125,0.7990572919580082,0.002371072769165039,0.0
299,12,RandomForest,1,0.45,0.78125,0.7990572919580082,0.390317440032959,0.0
300,12,AdaBoost (Discrete),1,0.45,0.78125,0.7990572919580082,23.230284929275513,0.0
301,12,AdaBoost (Real),1,0.45,0.78125,0.7990572919580082,48.123990058898926,0.0
302,12,Logistic Regression (Penalty = L2),1,0.45,0.78125,0.7990572919580082,0.12598967552185059,0.0
303,12,Naive Bayes,1,0.45,0.6493055555555556,0.6035306720070966,0.10465407371520996,0.0
304,12,KNeighbors Classifier,2,0.45,0.8382608695652174,0.8340051055773173,0.1255505084991455,0.0
305,12,SVC Classifier,2,0.45,0.7008695652173913,1.0,0.3591911792755127,0.0
306,12,Decision Tree,2,0.45,0.8382608695652174,0.8340051055773173,0.07473397254943848,0.0
307,12,RandomForest,2,0.45,0.7008695652173913,1.0,0.3848998546600342,0.0
308,12,AdaBoost (Discrete),2,0.45,0.8382608695652174,0.8340051055773173,23.796597242355347,0.0
309,12,AdaBoost (Real),2,0.45,0.8382608695652174,0.8340051055773173,26.973729848861694,0.0
310,12,Logistic Regression (Penalty = L2),2,0.45,0.8382608695652174,0.8340051055773173,0.09936308860778809,0.0
311,12,Naive Bayes,2,0.45,0.76,0.641347040372881,0.0027008056640625,0.0
