,feat_set_id,classifier,fold_id,feat_th,score,geo_score,exec_t,geo_score_woz
0,0,KNeighbors Classifier,0,0.1,0.8955223880597015,0.8921364294818387,0.22793984413146973,0.8921364294818387
1,0,SVC Classifier,0,0.1,0.7208955223880597,0.6999328882119261,1.3572940826416016,0.6999328882119261
2,0,Decision Tree,0,0.1,0.7268656716417911,0.7149865108435953,0.10974764823913574,0.7149865108435953
3,0,RandomForest,0,0.1,0.6970149253731344,0.686298045429377,0.39328837394714355,0.686298045429377
4,0,AdaBoost (Discrete),0,0.1,0.8119402985074626,0.80209425556416,41.21592164039612,0.80209425556416
5,0,AdaBoost (Real),0,0.1,0.7656716417910447,0.7523057518862681,47.57534646987915,0.7523057518862681
6,0,Logistic Regression (Penalty = L2),0,0.1,0.8014925373134328,0.7980141606627333,0.611525297164917,0.7980141606627333
7,0,Naive Bayes,0,0.1,0.8059701492537313,0.7997613142011858,0.12020611763000488,0.7997613142011858
8,0,KNeighbors Classifier,1,0.1,0.9134328358208955,0.909631083832492,0.1456003189086914,0.909631083832492
9,0,SVC Classifier,1,0.1,0.746268656716418,0.7309584111931826,1.2763338088989258,0.7309584111931826
10,0,Decision Tree,1,0.1,0.7328358208955223,0.71920333441186,0.04856610298156738,0.71920333441186
11,0,RandomForest,1,0.1,0.6940298507462687,0.6755189993158826,0.3895738124847412,0.6755189993158826
12,0,AdaBoost (Discrete),1,0.1,0.7970149253731343,0.7878736849219217,39.33389854431152,0.7878736849219217
13,0,AdaBoost (Real),1,0.1,0.7507462686567165,0.7329497202804327,57.24755001068115,0.7329497202804327
14,0,Logistic Regression (Penalty = L2),1,0.1,0.8208955223880597,0.8157520351575644,0.40865540504455566,0.8157520351575644
15,0,Naive Bayes,1,0.1,0.8238805970149253,0.8193859458841581,0.10821056365966797,0.8193859458841581
16,0,KNeighbors Classifier,2,0.1,0.9212121212121213,0.9182313739108355,0.26030731201171875,0.9182313739108355
17,0,SVC Classifier,2,0.1,0.759090909090909,0.752875637916791,1.217341661453247,0.752875637916791
18,0,Decision Tree,2,0.1,0.7742424242424243,0.7678399057194629,0.05687880516052246,0.7678399057194629
19,0,RandomForest,2,0.1,0.6984848484848485,0.5700515418777701,0.4261815547943115,0.5700515418777701
20,0,AdaBoost (Discrete),2,0.1,0.803030303030303,0.7928924232759783,39.054272174835205,0.7928924232759783
21,0,AdaBoost (Real),2,0.1,0.7545454545454545,0.7138725300170079,49.14505481719971,0.7138725300170079
22,0,Logistic Regression (Penalty = L2),2,0.1,0.8363636363636363,0.8317521129932296,0.44567418098449707,0.8317521129932296
23,0,Naive Bayes,2,0.1,0.85,0.8467168270626654,0.10618805885314941,0.8467168270626654
24,1,KNeighbors Classifier,0,0.1,0.8761194029850746,0.8729380662043154,0.23799371719360352,0.8729380662043154
25,1,SVC Classifier,0,0.1,0.7238805970149254,0.7122217225359083,1.2627310752868652,0.7122217225359083
26,1,Decision Tree,0,0.1,0.7,0.6931955532855146,0.04868650436401367,0.6931955532855146
27,1,RandomForest,0,0.1,0.6238805970149254,0.5838064619802831,0.3374512195587158,0.5838064619802831
28,1,AdaBoost (Discrete),0,0.1,0.753731343283582,0.7471377285870715,37.49202513694763,0.7471377285870715
29,1,AdaBoost (Real),0,0.1,0.5477611940298508,0.4210498954539769,47.893253803253174,0.4210498954539769
30,1,Logistic Regression (Penalty = L2),0,0.1,0.7805970149253731,0.7734304463891729,0.4346761703491211,0.7734304463891729
31,1,Naive Bayes,0,0.1,0.8074626865671641,0.8033086604013904,0.05709505081176758,0.8033086604013904
32,1,KNeighbors Classifier,1,0.1,0.8671641791044776,0.8638536270703121,0.19126057624816895,0.8638536270703121
33,1,SVC Classifier,1,0.1,0.744776119402985,0.7346326301337595,1.1980879306793213,0.7346326301337595
34,1,Decision Tree,1,0.1,0.6880597014925374,0.6783962293544558,0.0487058162689209,0.6783962293544558
35,1,RandomForest,1,0.1,0.6373134328358209,0.5979184050450707,0.3959848880767822,0.5979184050450707
36,1,AdaBoost (Discrete),1,0.1,0.7731343283582089,0.7669460902715345,39.27002501487732,0.7669460902715345
37,1,AdaBoost (Real),1,0.1,0.6343283582089553,0.6038096050633361,48.309457778930664,0.6038096050633361
38,1,Logistic Regression (Penalty = L2),1,0.1,0.7925373134328358,0.7886404873260403,0.3992903232574463,0.7886404873260403
39,1,Naive Bayes,1,0.1,0.8164179104477612,0.8118624693059349,0.10008382797241211,0.8118624693059349
40,1,KNeighbors Classifier,2,0.1,0.8893939393939394,0.8883084870585749,0.2599930763244629,0.8883084870585749
41,1,SVC Classifier,2,0.1,0.7575757575757576,0.7491250637085896,1.2996876239776611,0.7491250637085896
42,1,Decision Tree,2,0.1,0.7378787878787879,0.7338940093792264,0.05307435989379883,0.7338940093792264
43,1,RandomForest,2,0.1,0.5924242424242424,0.45432512210654324,0.46794748306274414,0.45432512210654324
44,1,AdaBoost (Discrete),2,0.1,0.7803030303030303,0.7681427781474207,40.25588536262512,0.7681427781474207
45,1,AdaBoost (Real),2,0.1,0.75,0.7280143377749652,49.363123178482056,0.7280143377749652
46,1,Logistic Regression (Penalty = L2),2,0.1,0.8181818181818182,0.8149164100335956,0.4542887210845947,0.8149164100335956
47,1,Naive Bayes,2,0.1,0.8318181818181818,0.8305208169863284,0.06578469276428223,0.8305208169863284
48,2,KNeighbors Classifier,0,0.1,0.8746268656716418,0.8720965192817735,0.2129502296447754,0.8720965192817735
49,2,SVC Classifier,0,0.1,0.7134328358208956,0.688260836691021,1.275916337966919,0.688260836691021
50,2,Decision Tree,0,0.1,0.7014925373134329,0.6922923627728848,0.0781254768371582,0.6922923627728848
51,2,RandomForest,0,0.1,0.6253731343283582,0.5203816519569218,0.3644707202911377,0.5203816519569218
52,2,AdaBoost (Discrete),0,0.1,0.7671641791044777,0.7642506228670305,42.13539743423462,0.7642506228670305
53,2,AdaBoost (Real),0,0.1,0.691044776119403,0.6671427322384446,52.11795163154602,0.6671427322384446
54,2,Logistic Regression (Penalty = L2),0,0.1,0.7835820895522388,0.7795296626989109,0.4579298496246338,0.7795296626989109
55,2,Naive Bayes,0,0.1,0.8,0.7953779845883985,0.10801005363464355,0.7953779845883985
56,2,KNeighbors Classifier,1,0.1,0.8656716417910447,0.8635734215441635,0.28153014183044434,0.8635734215441635
57,2,SVC Classifier,1,0.1,0.7492537313432835,0.7323715462084551,1.396733045578003,0.7323715462084551
58,2,Decision Tree,1,0.1,0.7074626865671642,0.7007216511513172,0.11068320274353027,0.7007216511513172
59,2,RandomForest,1,0.1,0.6253731343283582,0.5807297583365125,0.45352625846862793,0.5807297583365125
60,2,AdaBoost (Discrete),1,0.1,0.7731343283582089,0.7688455474781997,44.2834632396698,0.7688455474781997
61,2,AdaBoost (Real),1,0.1,0.6955223880597015,0.6863917764814854,60.11742568016052,0.6863917764814854
62,2,Logistic Regression (Penalty = L2),1,0.1,0.7955223880597015,0.7900304055718106,0.4967021942138672,0.7900304055718106
63,2,Naive Bayes,1,0.1,0.8134328358208955,0.8101949976650618,0.14377951622009277,0.8101949976650618
64,2,KNeighbors Classifier,2,0.1,0.8863636363636364,0.8848817161380818,0.24299931526184082,0.8848817161380818
65,2,SVC Classifier,2,0.1,0.7636363636363637,0.7483131749961924,1.7033023834228516,0.7483131749961924
66,2,Decision Tree,2,0.1,0.7090909090909091,0.7038872318986822,0.12568926811218262,0.7038872318986822
67,2,RandomForest,2,0.1,0.6318181818181818,0.570051113993622,0.580157995223999,0.570051113993622
68,2,AdaBoost (Discrete),2,0.1,0.8075757575757576,0.8059154030086999,50.004212856292725,0.8059154030086999
69,2,AdaBoost (Real),2,0.1,0.7303030303030303,0.7133811580119629,60.80568170547485,0.7133811580119629
70,2,Logistic Regression (Penalty = L2),2,0.1,0.8136363636363636,0.8120191737711918,0.5025219917297363,0.8120191737711918
71,2,Naive Bayes,2,0.1,0.8393939393939394,0.8381843179096776,0.12279105186462402,0.8381843179096776
72,3,KNeighbors Classifier,0,0.1,0.8298507462686567,0.8251025964965164,0.2581477165222168,0.8251025964965164
73,3,SVC Classifier,0,0.1,0.6776119402985075,0.6548093743905516,1.6029856204986572,0.6548093743905516
74,3,Decision Tree,0,0.1,0.6373134328358209,0.632062024672036,0.1296987533569336,0.632062024672036
75,3,RandomForest,0,0.1,0.5776119402985075,0.5211375221946556,0.5721824169158936,0.5211375221946556
76,3,AdaBoost (Discrete),0,0.1,0.746268656716418,0.7396632965961989,49.38459801673889,0.7396632965961989
77,3,AdaBoost (Real),0,0.1,0.6417910447761194,0.6310777491545994,60.7759370803833,0.6310777491545994
78,3,Logistic Regression (Penalty = L2),0,0.1,0.7283582089552239,0.7131862395632746,0.4842715263366699,0.7131862395632746
79,3,Naive Bayes,0,0.1,0.755223880597015,0.750004390781679,0.13872718811035156,0.750004390781679
80,3,KNeighbors Classifier,1,0.1,0.8552238805970149,0.8519888375030317,0.2578730583190918,0.8519888375030317
81,3,SVC Classifier,1,0.1,0.6626865671641791,0.6363529074806146,1.6742124557495117,0.6363529074806146
82,3,Decision Tree,1,0.1,0.6895522388059702,0.6840140534959455,0.06497383117675781,0.6840140534959455
83,3,RandomForest,1,0.1,0.5985074626865672,0.5376129558989335,0.5671863555908203,0.5376129558989335
84,3,AdaBoost (Discrete),1,0.1,0.7373134328358208,0.7335142356585679,49.87084221839905,0.7335142356585679
85,3,AdaBoost (Real),1,0.1,0.41492537313432837,0.40320559765455055,60.17017912864685,0.0
86,3,Logistic Regression (Penalty = L2),1,0.1,0.7507462686567165,0.7444017100706364,0.4663231372833252,0.7444017100706364
87,3,Naive Bayes,1,0.1,0.7626865671641792,0.7589575547838802,0.12709999084472656,0.7589575547838802
88,3,KNeighbors Classifier,2,0.1,0.8560606060606061,0.8545213143463285,0.23372125625610352,0.8545213143463285
89,3,SVC Classifier,2,0.1,0.7212121212121212,0.6987038453494782,1.6028501987457275,0.6987038453494782
90,3,Decision Tree,2,0.1,0.6636363636363637,0.655234163980581,0.06929469108581543,0.655234163980581
91,3,RandomForest,2,0.1,0.5515151515151515,0.45851154370345987,0.5712957382202148,0.45851154370345987
92,3,AdaBoost (Discrete),2,0.1,0.7560606060606061,0.7476429080173577,49.59929704666138,0.7476429080173577
93,3,AdaBoost (Real),2,0.1,0.6378787878787879,0.6025444457930681,59.63278651237488,0.6025444457930681
94,3,Logistic Regression (Penalty = L2),2,0.1,0.7560606060606061,0.7374840411610384,0.5603761672973633,0.7374840411610384
95,3,Naive Bayes,2,0.1,0.8015151515151515,0.7943771643409189,0.09423303604125977,0.7943771643409189
96,4,KNeighbors Classifier,0,0.1,0.7970149253731343,0.7903941668319687,0.20032048225402832,0.7903941668319687
97,4,SVC Classifier,0,0.1,0.6149253731343284,0.5081507903675316,1.4853019714355469,0.5081507903675316
98,4,Decision Tree,0,0.1,0.673134328358209,0.664569370717631,0.1222846508026123,0.664569370717631
99,4,RandomForest,0,0.1,0.573134328358209,0.4514902055297369,0.5133471488952637,0.0
100,4,AdaBoost (Discrete),0,0.1,0.7,0.6903187921346292,43.0327787399292,0.6903187921346292
101,4,AdaBoost (Real),0,0.1,0.6432835820895523,0.6278456292963076,54.74323225021362,0.6278456292963076
102,4,Logistic Regression (Penalty = L2),0,0.1,0.6835820895522388,0.6539744621636788,0.43497323989868164,0.6539744621636788
103,4,Naive Bayes,0,0.1,0.7119402985074627,0.6960090020314842,0.06603026390075684,0.6960090020314842
104,4,KNeighbors Classifier,1,0.1,0.8074626865671641,0.7934980150985737,0.19432592391967773,0.7934980150985737
105,4,SVC Classifier,1,0.1,0.6537313432835821,0.5901441269980205,1.480431079864502,0.5901441269980205
106,4,Decision Tree,1,0.1,0.6776119402985075,0.6617085222507073,0.06409358978271484,0.6617085222507073
107,4,RandomForest,1,0.1,0.5671641791044776,0.3764444932716448,0.5722975730895996,0.3764444932716448
108,4,AdaBoost (Discrete),1,0.1,0.6970149253731344,0.6754431393340647,42.33498978614807,0.6754431393340647
109,4,AdaBoost (Real),1,0.1,0.4835820895522388,0.44939180826897757,56.383257150650024,0.44939180826897757
110,4,Logistic Regression (Penalty = L2),1,0.1,0.7164179104477612,0.6960645083844959,0.4499824047088623,0.6960645083844959
111,4,Naive Bayes,1,0.1,0.7388059701492538,0.7152327269320178,0.13440585136413574,0.7152327269320178
112,4,KNeighbors Classifier,2,0.1,0.8136363636363636,0.805038547232045,0.25789976119995117,0.805038547232045
113,4,SVC Classifier,2,0.1,0.6590909090909091,0.5745525475591831,1.4553186893463135,0.5745525475591831
114,4,Decision Tree,2,0.1,0.703030303030303,0.6946408691186582,0.13789653778076172,0.6946408691186582
115,4,RandomForest,2,0.1,0.5742424242424242,0.4468024220952895,0.4517533779144287,0.0
116,4,AdaBoost (Discrete),2,0.1,0.7454545454545455,0.737379412366122,42.71014666557312,0.737379412366122
117,4,AdaBoost (Real),2,0.1,0.5318181818181819,0.5067517416497013,54.74640226364136,0.5067517416497013
118,4,Logistic Regression (Penalty = L2),2,0.1,0.7196969696969697,0.7066092323318155,0.4478163719177246,0.7066092323318155
119,4,Naive Bayes,2,0.1,0.75,0.7371574737911483,0.13184857368469238,0.7371574737911483
120,5,KNeighbors Classifier,0,0.1,0.753731343283582,0.738701444220783,0.19101858139038086,0.738701444220783
121,5,SVC Classifier,0,0.1,0.5940298507462687,0.49808402455332784,1.2845180034637451,0.49808402455332784
122,5,Decision Tree,0,0.1,0.691044776119403,0.6729129278902222,0.1257004737854004,0.6729129278902222
123,5,RandomForest,0,0.1,0.47761194029850745,0.490150873515276,0.4423854351043701,0.0
124,5,AdaBoost (Discrete),0,0.1,0.6776119402985075,0.661044804037828,39.88555955886841,0.661044804037828
125,5,AdaBoost (Real),0,0.1,0.6104477611940299,0.5487928106308172,54.73305869102478,0.5487928106308172
126,5,Logistic Regression (Penalty = L2),0,0.1,0.6776119402985075,0.6584574225247044,0.3347504138946533,0.6584574225247044
127,5,Naive Bayes,0,0.1,0.7,0.6799471865110048,0.06680846214294434,0.6799471865110048
128,5,KNeighbors Classifier,1,0.1,0.7820895522388059,0.7637472759273031,0.19179701805114746,0.7637472759273031
129,5,SVC Classifier,1,0.1,0.6283582089552239,0.5505047693922192,1.4126598834991455,0.5505047693922192
130,5,Decision Tree,1,0.1,0.673134328358209,0.6477519483514228,0.07013225555419922,0.6477519483514228
131,5,RandomForest,1,0.1,0.508955223880597,0.2977963628051328,0.5424606800079346,0.0
132,5,AdaBoost (Discrete),1,0.1,0.6522388059701493,0.6181322853566487,41.4628791809082,0.6181322853566487
133,5,AdaBoost (Real),1,0.1,0.5119402985074627,0.4356575747691143,52.96674156188965,0.4356575747691143
134,5,Logistic Regression (Penalty = L2),1,0.1,0.7029850746268657,0.6834465518424343,0.32161521911621094,0.6834465518424343
135,5,Naive Bayes,1,0.1,0.7283582089552239,0.7109654346519281,0.0650184154510498,0.7109654346519281
136,5,KNeighbors Classifier,2,0.1,0.7924242424242425,0.7811834532612878,0.12115168571472168,0.7811834532612878
137,5,SVC Classifier,2,0.1,0.6287878787878788,0.5529447012315238,1.3417091369628906,0.5529447012315238
138,5,Decision Tree,2,0.1,0.7303030303030303,0.7213783067196342,0.12643671035766602,0.7213783067196342
139,5,RandomForest,2,0.1,0.5833333333333334,0.44816015415023125,0.5180060863494873,0.44816015415023125
140,5,AdaBoost (Discrete),2,0.1,0.65,0.6231309635828249,38.43071961402893,0.6231309635828249
141,5,AdaBoost (Real),2,0.1,0.5712121212121212,0.5114533465378369,48.547149658203125,0.5114533465378369
142,5,Logistic Regression (Penalty = L2),2,0.1,0.7439393939393939,0.7307090336096294,0.2992687225341797,0.7307090336096294
143,5,Naive Bayes,2,0.1,0.7560606060606061,0.7497981608231633,0.11768460273742676,0.7497981608231633
144,6,KNeighbors Classifier,0,0.1,0.5626865671641791,0.5439071528330245,0.11991715431213379,0.5439071528330245
145,6,SVC Classifier,0,0.1,0.47313432835820896,0.3481104246315559,1.2954621315002441,0.3481104246315559
146,6,Decision Tree,0,0.1,0.48955223880597015,0.46423314234190916,0.060649871826171875,0.46423314234190916
147,6,RandomForest,0,0.1,0.5044776119402985,0.42262504207789203,0.4744384288787842,0.42262504207789203
148,6,AdaBoost (Discrete),0,0.1,0.5104477611940299,0.4541689275277754,37.37415385246277,0.4541689275277754
149,6,AdaBoost (Real),0,0.1,0.43134328358208956,0.35323886782439107,66.58787703514099,0.35323886782439107
150,6,Logistic Regression (Penalty = L2),0,0.1,0.5029850746268657,0.4566883859357621,0.34777045249938965,0.4566883859357621
151,6,Naive Bayes,0,0.1,0.5507462686567164,0.5153787210957641,0.16802430152893066,0.5153787210957641
152,6,KNeighbors Classifier,1,0.1,0.6059701492537314,0.5881823372973431,0.18557143211364746,0.5881823372973431
153,6,SVC Classifier,1,0.1,0.49402985074626865,0.352008304455246,1.7125871181488037,0.352008304455246
154,6,Decision Tree,1,0.1,0.5149253731343284,0.4923671805519789,0.16481566429138184,0.4923671805519789
155,6,RandomForest,1,0.1,0.4791044776119403,0.34076847974386504,0.7530555725097656,0.34076847974386504
156,6,AdaBoost (Discrete),1,0.1,0.5268656716417911,0.47964355670528225,46.91266751289368,0.47964355670528225
157,6,AdaBoost (Real),1,0.1,0.4343283582089552,0.29609115800788205,61.08108711242676,0.0
158,6,Logistic Regression (Penalty = L2),1,0.1,0.5462686567164179,0.4840269123409571,0.33943676948547363,0.4840269123409571
159,6,Naive Bayes,1,0.1,0.5716417910447761,0.5336051412424709,0.1430056095123291,0.5336051412424709
160,6,KNeighbors Classifier,2,0.1,0.5757575757575758,0.5508745510382136,0.1434175968170166,0.5508745510382136
161,6,SVC Classifier,2,0.1,0.503030303030303,0.38070868395700685,1.450458288192749,0.38070868395700685
162,6,Decision Tree,2,0.1,0.47878787878787876,0.45817490589532883,0.1408543586730957,0.45817490589532883
163,6,RandomForest,2,0.1,0.49696969696969695,0.34450180232419914,0.5441157817840576,0.34450180232419914
164,6,AdaBoost (Discrete),2,0.1,0.5075757575757576,0.47367871944879725,41.43222188949585,0.47367871944879725
165,6,AdaBoost (Real),2,0.1,0.4803030303030303,0.4330488662536309,56.48018264770508,0.4330488662536309
166,6,Logistic Regression (Penalty = L2),2,0.1,0.5454545454545454,0.48069310121304765,0.37092137336730957,0.48069310121304765
167,6,Naive Bayes,2,0.1,0.5833333333333334,0.5344709850302827,0.1422748565673828,0.5344709850302827
168,7,KNeighbors Classifier,0,0.1,0.6029850746268657,0.5549842706746237,0.22150111198425293,0.5549842706746237
169,7,SVC Classifier,0,0.1,0.5402985074626866,0.4189552968818468,1.5851802825927734,0.4189552968818468
170,7,Decision Tree,0,0.1,0.5208955223880597,0.4796603058767962,0.07996821403503418,0.4796603058767962
171,7,RandomForest,0,0.1,0.5328358208955224,0.3772015293256681,0.5259716510772705,0.3772015293256681
172,7,AdaBoost (Discrete),0,0.1,0.5253731343283582,0.4780989406526451,41.77721452713013,0.4780989406526451
173,7,AdaBoost (Real),0,0.1,0.44029850746268656,0.27842868990303843,57.56813073158264,0.27842868990303843
174,7,Logistic Regression (Penalty = L2),0,0.1,0.5791044776119403,0.5049315553415608,0.29723429679870605,0.5049315553415608
175,7,Naive Bayes,0,0.1,0.6283582089552239,0.5862357066012905,0.15110349655151367,0.5862357066012905
176,7,KNeighbors Classifier,1,0.1,0.5955223880597015,0.5314019257645025,0.1523902416229248,0.5314019257645025
177,7,SVC Classifier,1,0.1,0.5343283582089552,0.3998471204073284,1.5204012393951416,0.3998471204073284
178,7,Decision Tree,1,0.1,0.517910447761194,0.4604376738982888,0.07148933410644531,0.4604376738982888
179,7,RandomForest,1,0.1,0.5194029850746269,0.43922456986029307,0.5500156879425049,0.0
180,7,AdaBoost (Discrete),1,0.1,0.5358208955223881,0.4996080354624559,43.63970232009888,0.4996080354624559
181,7,AdaBoost (Real),1,0.1,0.4134328358208955,0.3027163421050189,60.3414421081543,0.3027163421050189
182,7,Logistic Regression (Penalty = L2),1,0.1,0.5791044776119403,0.49193042885351834,0.29251813888549805,0.49193042885351834
183,7,Naive Bayes,1,0.1,0.6074626865671642,0.5443101065365451,0.15450119972229004,0.5443101065365451
184,7,KNeighbors Classifier,2,0.1,0.6257575757575757,0.5759959685955558,0.23027658462524414,0.5759959685955558
185,7,SVC Classifier,2,0.1,0.5772727272727273,0.48466318957930454,1.6329562664031982,0.48466318957930454
186,7,Decision Tree,2,0.1,0.5606060606060606,0.5202155939645874,0.07964134216308594,0.5202155939645874
187,7,RandomForest,2,0.1,0.49242424242424243,0.3399381305902176,0.6373097896575928,0.0
188,7,AdaBoost (Discrete),2,0.1,0.5272727272727272,0.4497424919070475,45.51735591888428,0.4497424919070475
189,7,AdaBoost (Real),2,0.1,0.4303030303030303,0.2943298612303696,60.12875008583069,0.2943298612303696
190,7,Logistic Regression (Penalty = L2),2,0.1,0.5969696969696969,0.5444637417840335,0.31628966331481934,0.5444637417840335
191,7,Naive Bayes,2,0.1,0.6439393939393939,0.5961980181354385,0.07548379898071289,0.5961980181354385
192,8,KNeighbors Classifier,0,0.1,0.7208955223880597,0.7120820035941071,0.16330599784851074,0.7120820035941071
193,8,SVC Classifier,0,0.1,0.5940298507462687,0.5599443366241761,1.9227361679077148,0.5599443366241761
194,8,Decision Tree,0,0.1,0.6343283582089553,0.62357799614138,0.08123230934143066,0.62357799614138
195,8,RandomForest,0,0.1,0.4835820895522388,0.42692928745891784,0.6475744247436523,0.0
196,8,AdaBoost (Discrete),0,0.1,0.6253731343283582,0.605402139859627,53.67997646331787,0.605402139859627
197,8,AdaBoost (Real),0,0.1,0.5447761194029851,0.49749716751266715,69.12999057769775,0.49749716751266715
198,8,Logistic Regression (Penalty = L2),0,0.1,0.6104477611940299,0.588016960583961,0.5303847789764404,0.588016960583961
199,8,Naive Bayes,0,0.1,0.6671641791044776,0.6579778137854851,0.17201757431030273,0.6579778137854851
200,8,KNeighbors Classifier,1,0.1,0.7268656716417911,0.720679085028319,0.23199844360351562,0.720679085028319
201,8,SVC Classifier,1,0.1,0.5805970149253732,0.5449184704192831,1.785933017730713,0.5449184704192831
202,8,Decision Tree,1,0.1,0.5955223880597015,0.5849982823406089,0.16112089157104492,0.5849982823406089
203,8,RandomForest,1,0.1,0.5134328358208955,0.4189370371119002,0.6392011642456055,0.4189370371119002
204,8,AdaBoost (Discrete),1,0.1,0.6194029850746269,0.594779163291939,53.324708461761475,0.594779163291939
205,8,AdaBoost (Real),1,0.1,0.5,0.4441674984792839,67.93392777442932,0.4441674984792839
206,8,Logistic Regression (Penalty = L2),1,0.1,0.6522388059701493,0.6333677221566598,0.4753994941711426,0.6333677221566598
207,8,Naive Bayes,1,0.1,0.6835820895522388,0.6712160939225326,0.16977906227111816,0.6712160939225326
208,8,KNeighbors Classifier,2,0.1,0.7787878787878788,0.7759214000148784,0.2367558479309082,0.7759214000148784
209,8,SVC Classifier,2,0.1,0.593939393939394,0.5562297070375435,1.7480673789978027,0.5562297070375435
210,8,Decision Tree,2,0.1,0.6424242424242425,0.6376523854492903,0.08115911483764648,0.6376523854492903
211,8,RandomForest,2,0.1,0.4621212121212121,0.32766197934763147,0.5028829574584961,0.0
212,8,AdaBoost (Discrete),2,0.1,0.6636363636363637,0.6329967357149903,52.77302527427673,0.6329967357149903
213,8,AdaBoost (Real),2,0.1,0.5909090909090909,0.5591386566242783,68.07816076278687,0.5591386566242783
214,8,Logistic Regression (Penalty = L2),2,0.1,0.6606060606060606,0.6231087579699033,0.45066332817077637,0.6231087579699033
215,8,Naive Bayes,2,0.1,0.7196969696969697,0.7035325140163526,0.16173815727233887,0.7035325140163526
216,9,KNeighbors Classifier,0,0.1,0.4955223880597015,0.44128216540740633,0.23798274993896484,0.44128216540740633
217,9,SVC Classifier,0,0.1,0.4552238805970149,0.3163700244924573,1.668973684310913,0.3163700244924573
218,9,Decision Tree,0,0.1,0.4373134328358209,0.40524143638669735,0.08005261421203613,0.40524143638669735
219,9,RandomForest,0,0.1,0.4388059701492537,0.3282101907817543,0.649261474609375,0.0
220,9,AdaBoost (Discrete),0,0.1,0.4253731343283582,0.3722301549512591,44.31926655769348,0.3722301549512591
221,9,AdaBoost (Real),0,0.1,0.3776119402985075,0.2850283104179757,61.66020488739014,0.2850283104179757
222,9,Logistic Regression (Penalty = L2),0,0.1,0.5194029850746269,0.43938584958315596,0.325972318649292,0.43938584958315596
223,9,Naive Bayes,0,0.1,0.5268656716417911,0.4386307120611345,0.08171868324279785,0.4386307120611345
224,9,KNeighbors Classifier,1,0.1,0.4761194029850746,0.43751701155560924,0.15748095512390137,0.43751701155560924
225,9,SVC Classifier,1,0.1,0.4417910447761194,0.29835583419857165,1.7543511390686035,0.29835583419857165
226,9,Decision Tree,1,0.1,0.4164179104477612,0.36765793961401927,0.08093118667602539,0.36765793961401927
227,9,RandomForest,1,0.1,0.44776119402985076,0.32946664018341515,0.6585733890533447,0.32946664018341515
228,9,AdaBoost (Discrete),1,0.1,0.4,0.34903279454585007,42.956509828567505,0.34903279454585007
229,9,AdaBoost (Real),1,0.1,0.3522388059701492,0.2199625728068117,57.83302855491638,0.2199625728068117
230,9,Logistic Regression (Penalty = L2),1,0.1,0.4835820895522388,0.3877808210906296,0.30008912086486816,0.3877808210906296
231,9,Naive Bayes,1,0.1,0.5208955223880597,0.45522018667332875,0.14691972732543945,0.45522018667332875
232,9,KNeighbors Classifier,2,0.1,0.5,0.45882052539441487,0.1559290885925293,0.45882052539441487
233,9,SVC Classifier,2,0.1,0.4484848484848485,0.41776678516182064,1.5524890422821045,0.0
234,9,Decision Tree,2,0.1,0.4121212121212121,0.36081185885400985,0.07710146903991699,0.36081185885400985
235,9,RandomForest,2,0.1,0.47575757575757577,0.3468003373409106,0.5360350608825684,0.3468003373409106
236,9,AdaBoost (Discrete),2,0.1,0.4257575757575758,0.3713682269678552,43.11944556236267,0.3713682269678552
237,9,AdaBoost (Real),2,0.1,0.3333333333333333,0.22809264100248366,57.76814937591553,0.22809264100248366
238,9,Logistic Regression (Penalty = L2),2,0.1,0.5015151515151515,0.3815945522184715,0.30556416511535645,0.3815945522184715
239,9,Naive Bayes,2,0.1,0.5348484848484848,0.4833507028421609,0.07915329933166504,0.4833507028421609
240,10,KNeighbors Classifier,0,0.1,0.9432835820895522,0.9426494664419987,0.6001167297363281,0.9426494664419987
241,10,SVC Classifier,0,0.1,0.8238805970149253,0.8220027316892247,2.063270092010498,0.8220027316892247
242,10,Decision Tree,0,0.1,0.7343283582089553,0.7274723367784625,0.14763522148132324,0.7274723367784625
243,10,RandomForest,0,0.1,0.6537313432835821,0.5913609250163959,0.6872179508209229,0.5913609250163959
244,10,AdaBoost (Discrete),0,0.1,0.8686567164179104,0.8657526626869373,69.83923649787903,0.8657526626869373
245,10,AdaBoost (Real),0,0.1,0.8313432835820895,0.826204874078595,84.02979969978333,0.826204874078595
246,10,Logistic Regression (Penalty = L2),0,0.1,0.8641791044776119,0.8633396441660954,0.6934304237365723,0.8633396441660954
247,10,Naive Bayes,0,0.1,0.8671641791044776,0.8652838434758993,0.17946100234985352,0.8652838434758993
248,10,KNeighbors Classifier,1,0.1,0.9298507462686567,0.9290694437259125,0.5191807746887207,0.9290694437259125
249,10,SVC Classifier,1,0.1,0.8298507462686567,0.8261686196443088,2.1723475456237793,0.8261686196443088
250,10,Decision Tree,1,0.1,0.7671641791044777,0.7653172522878543,0.07848978042602539,0.7653172522878543
251,10,RandomForest,1,0.1,0.6716417910447762,0.6029854523112747,0.6270086765289307,0.6029854523112747
252,10,AdaBoost (Discrete),1,0.1,0.8686567164179104,0.8668499035232683,69.62732243537903,0.8668499035232683
253,10,AdaBoost (Real),1,0.1,0.5134328358208955,0.3737864302887477,81.91416668891907,0.3737864302887477
254,10,Logistic Regression (Penalty = L2),1,0.1,0.8865671641791045,0.8853640463946484,0.6919412612915039,0.8853640463946484
255,10,Naive Bayes,1,0.1,0.8626865671641791,0.8606551063049996,0.1561603546142578,0.8606551063049996
256,10,KNeighbors Classifier,2,0.1,0.953030303030303,0.9525549816936673,0.6032533645629883,0.9525549816936673
257,10,SVC Classifier,2,0.1,0.8303030303030303,0.8268485615762494,2.0963828563690186,0.8268485615762494
258,10,Decision Tree,2,0.1,0.7924242424242425,0.788785808047371,0.1512598991394043,0.788785808047371
259,10,RandomForest,2,0.1,0.6287878787878788,0.5727694241871427,0.6011898517608643,0.5727694241871427
260,10,AdaBoost (Discrete),2,0.1,0.8803030303030303,0.8761269694982915,70.73323559761047,0.8761269694982915
261,10,AdaBoost (Real),2,0.1,0.8272727272727273,0.8066211295166653,83.6241044998169,0.8066211295166653
262,10,Logistic Regression (Penalty = L2),2,0.1,0.8818181818181818,0.8802729658196168,0.6074156761169434,0.8802729658196168
263,10,Naive Bayes,2,0.1,0.8878787878787879,0.8852861539690867,0.2127685546875,0.8852861539690867
264,11,KNeighbors Classifier,0,0.1,0.9507462686567164,0.9499671032063668,0.6840879917144775,0.9499671032063668
265,11,SVC Classifier,0,0.1,0.8432835820895522,0.8420153683393286,2.282827138900757,0.8420153683393286
266,11,Decision Tree,0,0.1,0.7373134328358208,0.7330804714329486,0.13530373573303223,0.7330804714329486
267,11,RandomForest,0,0.1,0.5865671641791045,0.465194762733899,0.7033405303955078,0.0
268,11,AdaBoost (Discrete),0,0.1,0.8805970149253731,0.878445724079165,74.9224500656128,0.878445724079165
269,11,AdaBoost (Real),0,0.1,0.8716417910447761,0.8696580254614216,90.61610960960388,0.8696580254614216
270,11,Logistic Regression (Penalty = L2),0,0.1,0.8940298507462686,0.8935660145078127,0.7401711940765381,0.8935660145078127
271,11,Naive Bayes,0,0.1,0.8880597014925373,0.8871086598463365,0.15723037719726562,0.8871086598463365
272,11,KNeighbors Classifier,1,0.1,0.9447761194029851,0.9441981447231286,0.7054579257965088,0.9441981447231286
273,11,SVC Classifier,1,0.1,0.8537313432835821,0.851891816059428,2.2004334926605225,0.851891816059428
274,11,Decision Tree,1,0.1,0.7776119402985074,0.7748210819412017,0.15075349807739258,0.7748210819412017
275,11,RandomForest,1,0.1,0.6119402985074627,0.5262116353733629,0.6817872524261475,0.0
276,11,AdaBoost (Discrete),1,0.1,0.9029850746268657,0.9023231193674722,79.55803036689758,0.9023231193674722
277,11,AdaBoost (Real),1,0.1,0.564179104477612,0.4833065535821906,90.38428163528442,0.4833065535821906
278,11,Logistic Regression (Penalty = L2),1,0.1,0.8970149253731343,0.895362869768768,0.7181980609893799,0.895362869768768
279,11,Naive Bayes,1,0.1,0.8970149253731343,0.8964078122427361,0.3243730068206787,0.8964078122427361
280,11,KNeighbors Classifier,2,0.1,0.956060606060606,0.9558330241480523,0.6529200077056885,0.9558330241480523
281,11,SVC Classifier,2,0.1,0.8424242424242424,0.8392834707746317,2.180849313735962,0.8392834707746317
282,11,Decision Tree,2,0.1,0.7909090909090909,0.7886003399187139,0.14974594116210938,0.7886003399187139
283,11,RandomForest,2,0.1,0.6636363636363637,0.53978981351581,0.5115673542022705,0.53978981351581
284,11,AdaBoost (Discrete),2,0.1,0.8984848484848484,0.8969868029125497,74.96277022361755,0.8969868029125497
285,11,AdaBoost (Real),2,0.1,0.8590909090909091,0.8546229625367286,86.46177172660828,0.8546229625367286
286,11,Logistic Regression (Penalty = L2),2,0.1,0.906060606060606,0.9054807534693888,0.8261284828186035,0.9054807534693888
287,11,Naive Bayes,2,0.1,0.9136363636363637,0.9130333964896351,0.1856539249420166,0.9130333964896351
288,12,KNeighbors Classifier,0,0.1,0.26417910447761195,0.20319856488331015,0.07314705848693848,0.20319856488331015
289,12,SVC Classifier,0,0.1,0.25970149253731345,0.13025335201697957,1.3614509105682373,0.0
290,12,Decision Tree,0,0.1,0.2656716417910448,0.22886511464069978,0.07168149948120117,0.22886511464069978
291,12,RandomForest,0,0.1,0.31044776119402984,0.4498818218354634,0.4593207836151123,0.0
292,12,AdaBoost (Discrete),0,0.1,0.30895522388059704,0.22032981301267424,33.192248582839966,0.0
293,12,AdaBoost (Real),0,0.1,0.22686567164179106,0.1506034705465646,49.48568296432495,0.0
294,12,Logistic Regression (Penalty = L2),0,0.1,0.28955223880597014,0.1889800598748544,0.3248586654663086,0.1889800598748544
295,12,Naive Bayes,0,0.1,0.3194029850746269,0.20461445173615775,0.07293224334716797,0.0
296,12,KNeighbors Classifier,1,0.1,0.2746268656716418,0.22368203260514377,0.07382917404174805,0.22368203260514377
297,12,SVC Classifier,1,0.1,0.26417910447761195,0.17645255455889752,1.3678202629089355,0.0
298,12,Decision Tree,1,0.1,0.2656716417910448,0.23976821135062631,0.0693044662475586,0.23976821135062631
299,12,RandomForest,1,0.1,0.30597014925373134,0.2078877479704225,0.4270293712615967,0.0
300,12,AdaBoost (Discrete),1,0.1,0.2955223880597015,0.27086014684315746,33.19578409194946,0.0
301,12,AdaBoost (Real),1,0.1,0.19701492537313434,0.22296886864909543,48.87726044654846,0.0
302,12,Logistic Regression (Penalty = L2),1,0.1,0.2791044776119403,0.24440699008221273,0.2548501491546631,0.0
303,12,Naive Bayes,1,0.1,0.30597014925373134,0.2569545442496236,0.06875371932983398,0.0
304,12,KNeighbors Classifier,2,0.1,0.26515151515151514,0.1873215643976957,0.14328598976135254,0.1873215643976957
305,12,SVC Classifier,2,0.1,0.2727272727272727,0.15001251768822718,1.2559814453125,0.0
306,12,Decision Tree,2,0.1,0.25303030303030305,0.20872503831715694,0.07204794883728027,0.20872503831715694
307,12,RandomForest,2,0.1,0.3393939393939394,0.38377388698570397,0.5266673564910889,0.0
308,12,AdaBoost (Discrete),2,0.1,0.2803030303030303,0.18007639206717035,33.15480017662048,0.18007639206717035
309,12,AdaBoost (Real),2,0.1,0.15303030303030302,0.13490326309400555,51.39084720611572,0.0
310,12,Logistic Regression (Penalty = L2),2,0.1,0.29545454545454547,0.24562588937617058,0.32196784019470215,0.0
311,12,Naive Bayes,2,0.1,0.3621212121212121,0.3223006011375047,0.0765218734741211,0.0
