,feat_set_id,classifier,fold_id,feat_th,score,geo_score,exec_t,geo_score_woz
0,0,KNeighbors Classifier,0,0.7,0.8149253731343283,0.7647376928022472,5.133177042007446,0.7647376928022472
1,0,SVC Classifier,0,0.7,0.7253731343283583,0.6877100458580642,7.740713357925415,0.6877100458580642
2,0,Decision Tree,0,0.7,0.5746268656716418,0.49351666786020904,0.465404748916626,0.49351666786020904
3,0,RandomForest,0,0.7,0.49850746268656715,0.3799019226485101,1.9276273250579834,0.0
4,0,AdaBoost (Discrete),0,0.7,0.7731343283582089,0.7460240936458432,343.0283284187317,0.7460240936458432
5,0,AdaBoost (Real),0,0.7,0.682089552238806,0.6329349478110887,334.6957013607025,0.6329349478110887
6,0,Logistic Regression (Penalty = L2),0,0.7,0.8119402985074626,0.7545440891844558,3.6221654415130615,0.7545440891844558
7,0,Naive Bayes,0,0.7,0.7119402985074627,0.6700135735621072,0.36833739280700684,0.6700135735621072
8,0,KNeighbors Classifier,1,0.7,0.8074626865671641,0.751162233716076,4.091853141784668,0.751162233716076
9,0,SVC Classifier,1,0.7,0.7477611940298508,0.7121629226861086,5.757219314575195,0.7121629226861086
10,0,Decision Tree,1,0.7,0.6567164179104478,0.6022653688296383,0.38396215438842773,0.6022653688296383
11,0,RandomForest,1,0.7,0.5104477611940299,0.4459348463238192,1.5310497283935547,0.0
12,0,AdaBoost (Discrete),1,0.7,0.7417910447761195,0.7052551928656271,313.548216342926,0.7052551928656271
13,0,AdaBoost (Real),1,0.7,0.6746268656716418,0.6367260019848759,238.08787751197815,0.6367260019848759
14,0,Logistic Regression (Penalty = L2),1,0.7,0.8044776119402985,0.7598131435479603,2.83148193359375,0.7598131435479603
15,0,Naive Bayes,1,0.7,0.735820895522388,0.695058674165172,0.32317090034484863,0.695058674165172
16,0,KNeighbors Classifier,2,0.7,0.8166666666666667,0.7714353443590108,3.1242988109588623,0.7714353443590108
17,0,SVC Classifier,2,0.7,0.7484848484848485,0.7192235472832601,5.243404865264893,0.7192235472832601
18,0,Decision Tree,2,0.7,0.6060606060606061,0.5469311119948879,0.24968934059143066,0.5469311119948879
19,0,RandomForest,2,0.7,0.5606060606060606,0.4780021454340168,1.744917869567871,0.0
20,0,AdaBoost (Discrete),2,0.7,0.7454545454545455,0.7191759782780927,241.94042372703552,0.7191759782780927
21,0,AdaBoost (Real),2,0.7,0.706060606060606,0.666535514258247,252.68056464195251,0.666535514258247
22,0,Logistic Regression (Penalty = L2),2,0.7,0.8151515151515152,0.7733900966256075,2.8353500366210938,0.7733900966256075
23,0,Naive Bayes,2,0.7,0.7196969696969697,0.684228011991126,0.3599109649658203,0.684228011991126
24,1,KNeighbors Classifier,0,0.7,0.7268656716417911,0.6758159564983073,3.4668328762054443,0.6758159564983073
25,1,SVC Classifier,0,0.7,0.6388059701492538,0.5811727382588634,5.8011391162872314,0.5811727382588634
26,1,Decision Tree,0,0.7,0.5895522388059702,0.5287942592389745,0.33245038986206055,0.5287942592389745
27,1,RandomForest,0,0.7,0.40746268656716417,0.4439966203955136,1.2994606494903564,0.0
28,1,AdaBoost (Discrete),0,0.7,0.7059701492537314,0.6699422848458696,246.27044010162354,0.6699422848458696
29,1,AdaBoost (Real),0,0.7,0.6238805970149254,0.5945368945114938,286.221791267395,0.5945368945114938
30,1,Logistic Regression (Penalty = L2),0,0.7,0.8029850746268656,0.7574974155586568,3.955343246459961,0.7574974155586568
31,1,Naive Bayes,0,0.7,0.6462686567164179,0.6123525482998222,0.2865281105041504,0.6123525482998222
32,1,KNeighbors Classifier,1,0.7,0.7432835820895523,0.6887127702006434,4.3464195728302,0.6887127702006434
33,1,SVC Classifier,1,0.7,0.6865671641791045,0.628816385556833,6.830067873001099,0.628816385556833
34,1,Decision Tree,1,0.7,0.5417910447761194,0.4898031524119897,0.45421433448791504,0.4898031524119897
35,1,RandomForest,1,0.7,0.48955223880597015,0.32458524099334296,1.7345471382141113,0.32458524099334296
36,1,AdaBoost (Discrete),1,0.7,0.6985074626865672,0.6736821532164072,329.4139449596405,0.6736821532164072
37,1,AdaBoost (Real),1,0.7,0.5432835820895522,0.5023262186263558,311.329674243927,0.5023262186263558
38,1,Logistic Regression (Penalty = L2),1,0.7,0.7761194029850746,0.7198083550980025,3.6161227226257324,0.7198083550980025
39,1,Naive Bayes,1,0.7,0.7044776119402985,0.6549795115810834,0.29473447799682617,0.6549795115810834
40,1,KNeighbors Classifier,2,0.7,0.753030303030303,0.7015290640944845,3.5207924842834473,0.7015290640944845
41,1,SVC Classifier,2,0.7,0.6696969696969697,0.6217185385603076,6.659569025039673,0.6217185385603076
42,1,Decision Tree,2,0.7,0.5575757575757576,0.525987776482803,0.3179922103881836,0.525987776482803
43,1,RandomForest,2,0.7,0.503030303030303,0.37310451554844626,1.6584038734436035,0.37310451554844626
44,1,AdaBoost (Discrete),2,0.7,0.7257575757575757,0.7095398910687863,327.9698176383972,0.7095398910687863
45,1,AdaBoost (Real),2,0.7,0.656060606060606,0.6157212787192897,338.15185952186584,0.6157212787192897
46,1,Logistic Regression (Penalty = L2),2,0.7,0.8257575757575758,0.7882918581620826,3.910379409790039,0.7882918581620826
47,1,Naive Bayes,2,0.7,0.6848484848484848,0.6523295115260567,0.23799514770507812,0.6523295115260567
48,2,KNeighbors Classifier,0,0.7,0.7895522388059701,0.7477376389044098,4.790236711502075,0.7477376389044098
49,2,SVC Classifier,0,0.7,0.7,0.6613978019545439,10.968818426132202,0.6613978019545439
50,2,Decision Tree,0,0.7,0.6134328358208955,0.5581157964684541,0.3520040512084961,0.5581157964684541
51,2,RandomForest,0,0.7,0.48208955223880595,0.3900077282186284,2.0876729488372803,0.0
52,2,AdaBoost (Discrete),0,0.7,0.7268656716417911,0.6795372211149598,376.85123586654663,0.6795372211149598
53,2,AdaBoost (Real),0,0.7,0.7089552238805971,0.6745800161830761,342.13116216659546,0.6745800161830761
54,2,Logistic Regression (Penalty = L2),0,0.7,0.8134328358208955,0.7600808771885058,4.240909099578857,0.7600808771885058
55,2,Naive Bayes,0,0.7,0.6850746268656717,0.6411437696148977,0.4621763229370117,0.6411437696148977
56,2,KNeighbors Classifier,1,0.7,0.7686567164179104,0.7072126736056638,4.0562424659729,0.7072126736056638
57,2,SVC Classifier,1,0.7,0.7149253731343284,0.6710525658578943,7.192813396453857,0.6710525658578943
58,2,Decision Tree,1,0.7,0.5940298507462687,0.5513533470035874,0.4642460346221924,0.5513533470035874
59,2,RandomForest,1,0.7,0.49701492537313435,0.27454427594547587,1.6006569862365723,0.27454427594547587
60,2,AdaBoost (Discrete),1,0.7,0.7298507462686568,0.7003206017654554,328.1978578567505,0.7003206017654554
61,2,AdaBoost (Real),1,0.7,0.6716417910447762,0.6443262195116578,341.69838428497314,0.6443262195116578
62,2,Logistic Regression (Penalty = L2),1,0.7,0.7940298507462686,0.7480083747687436,4.726527690887451,0.7480083747687436
63,2,Naive Bayes,1,0.7,0.7298507462686568,0.682834838716401,0.5036535263061523,0.682834838716401
64,2,KNeighbors Classifier,2,0.7,0.8045454545454546,0.7605432423339084,4.86158299446106,0.7605432423339084
65,2,SVC Classifier,2,0.7,0.7257575757575757,0.6887848851455683,7.400694131851196,0.6887848851455683
66,2,Decision Tree,2,0.7,0.6333333333333333,0.5656827424227203,0.4276247024536133,0.5656827424227203
67,2,RandomForest,2,0.7,0.5393939393939394,0.4226456770843635,1.9359848499298096,0.0
68,2,AdaBoost (Discrete),2,0.7,0.7575757575757576,0.7324927594093967,358.12339758872986,0.7324927594093967
69,2,AdaBoost (Real),2,0.7,0.6924242424242424,0.6608059083767016,344.39284229278564,0.6608059083767016
70,2,Logistic Regression (Penalty = L2),2,0.7,0.8272727272727273,0.7845686024869208,3.9256527423858643,0.7845686024869208
71,2,Naive Bayes,2,0.7,0.7121212121212122,0.6748854613146005,0.38013696670532227,0.6748854613146005
72,3,KNeighbors Classifier,0,0.7,0.7343283582089553,0.680425177717309,2.1658270359039307,0.680425177717309
73,3,SVC Classifier,0,0.7,0.5925373134328358,0.5232070511173297,5.821685552597046,0.5232070511173297
74,3,Decision Tree,0,0.7,0.5626865671641791,0.5124131913687857,0.38493943214416504,0.5124131913687857
75,3,RandomForest,0,0.7,0.46865671641791046,0.3747562083596475,1.7218749523162842,0.0
76,3,AdaBoost (Discrete),0,0.7,0.6761194029850747,0.6337353409414959,227.9458396434784,0.6337353409414959
77,3,AdaBoost (Real),0,0.7,0.5955223880597015,0.5502017509758602,241.2288053035736,0.5502017509758602
78,3,Logistic Regression (Penalty = L2),0,0.7,0.7805970149253731,0.7253435231568915,2.914832830429077,0.7253435231568915
79,3,Naive Bayes,0,0.7,0.6343283582089553,0.5860015416389973,0.4701395034790039,0.5860015416389973
80,3,KNeighbors Classifier,1,0.7,0.7328358208955223,0.6778467937223526,2.507915496826172,0.6778467937223526
81,3,SVC Classifier,1,0.7,0.6194029850746269,0.533620822570387,6.341882228851318,0.533620822570387
82,3,Decision Tree,1,0.7,0.564179104477612,0.5064942297447349,0.442852258682251,0.5064942297447349
83,3,RandomForest,1,0.7,0.5,0.49719867636435866,1.2853953838348389,0.0
84,3,AdaBoost (Discrete),1,0.7,0.6746268656716418,0.6530206477551912,239.4972324371338,0.6530206477551912
85,3,AdaBoost (Real),1,0.7,0.6014925373134329,0.5528255703813414,251.42381811141968,0.5528255703813414
86,3,Logistic Regression (Penalty = L2),1,0.7,0.7582089552238805,0.7080676873279945,3.0735979080200195,0.7080676873279945
87,3,Naive Bayes,1,0.7,0.6492537313432836,0.5995774785765747,0.2879624366760254,0.5995774785765747
88,3,KNeighbors Classifier,2,0.7,0.7363636363636363,0.6712189389693773,2.468852996826172,0.6712189389693773
89,3,SVC Classifier,2,0.7,0.6212121212121212,0.5702701804731785,6.214256763458252,0.5702701804731785
90,3,Decision Tree,2,0.7,0.5287878787878788,0.4720982399287933,0.47012829780578613,0.4720982399287933
91,3,RandomForest,2,0.7,0.503030303030303,0.36322506330697407,1.6036791801452637,0.0
92,3,AdaBoost (Discrete),2,0.7,0.7121212121212122,0.680852048118705,232.71194529533386,0.680852048118705
93,3,AdaBoost (Real),2,0.7,0.6424242424242425,0.5898787468335612,233.96335315704346,0.5898787468335612
94,3,Logistic Regression (Penalty = L2),2,0.7,0.793939393939394,0.7478512892009646,2.813770055770874,0.7478512892009646
95,3,Naive Bayes,2,0.7,0.6545454545454545,0.619636508248155,0.29662561416625977,0.619636508248155
96,4,KNeighbors Classifier,0,0.7,0.7835820895522388,0.7378539409396031,2.5998356342315674,0.7378539409396031
97,4,SVC Classifier,0,0.7,0.6746268656716418,0.634351701129704,5.567171573638916,0.634351701129704
98,4,Decision Tree,0,0.7,0.6059701492537314,0.5100989683283004,0.4173426628112793,0.5100989683283004
99,4,RandomForest,0,0.7,0.5208955223880597,0.47138259200726224,1.405548095703125,0.0
100,4,AdaBoost (Discrete),0,0.7,0.7119402985074627,0.6741474720556914,252.44547843933105,0.6741474720556914
101,4,AdaBoost (Real),0,0.7,0.7074626865671642,0.6558970431870554,258.9077432155609,0.6558970431870554
102,4,Logistic Regression (Penalty = L2),0,0.7,0.8044776119402985,0.7602211264902251,3.017493963241577,0.7602211264902251
103,4,Naive Bayes,0,0.7,0.6701492537313433,0.622919035400321,0.24687886238098145,0.622919035400321
104,4,KNeighbors Classifier,1,0.7,0.7820895522388059,0.7377734228229785,2.784888982772827,0.7377734228229785
105,4,SVC Classifier,1,0.7,0.682089552238806,0.6380495226364202,5.177656650543213,0.6380495226364202
106,4,Decision Tree,1,0.7,0.6358208955223881,0.5754711200930344,0.3789074420928955,0.5754711200930344
107,4,RandomForest,1,0.7,0.517910447761194,0.6151041922449537,1.43027925491333,0.0
108,4,AdaBoost (Discrete),1,0.7,0.7208955223880597,0.6950918561292359,1321.1333196163177,0.6950918561292359
109,4,AdaBoost (Real),1,0.7,0.4701492537313433,0.4234643974507336,210.155366897583,0.0
110,4,Logistic Regression (Penalty = L2),1,0.7,0.7716417910447761,0.727512491001644,2.3295116424560547,0.727512491001644
111,4,Naive Bayes,1,0.7,0.6925373134328359,0.6498458989011102,0.26814913749694824,0.6498458989011102
112,4,KNeighbors Classifier,2,0.7,0.7984848484848485,0.7472307499649695,2.3021275997161865,0.7472307499649695
113,4,SVC Classifier,2,0.7,0.7106060606060606,0.6775145090553526,4.606947898864746,0.6775145090553526
114,4,Decision Tree,2,0.7,0.5712121212121212,0.5266734010494402,0.37421441078186035,0.5266734010494402
115,4,RandomForest,2,0.7,0.5212121212121212,0.495753442312206,1.088545560836792,0.0
116,4,AdaBoost (Discrete),2,0.7,0.7106060606060606,0.6763058058335532,182.2660756111145,0.6763058058335532
117,4,AdaBoost (Real),2,0.7,0.5333333333333333,0.49122760683489564,171.71179175376892,0.49122760683489564
118,4,Logistic Regression (Penalty = L2),2,0.7,0.8136363636363636,0.7723343871257906,2.017343044281006,0.7723343871257906
119,4,Naive Bayes,2,0.7,0.6818181818181818,0.6448825577400864,0.21268582344055176,0.6448825577400864
120,5,KNeighbors Classifier,0,0.7,0.7343283582089553,0.6792705876824267,2.0059452056884766,0.6792705876824267
121,5,SVC Classifier,0,0.7,0.6268656716417911,0.5760133299196041,3.9410336017608643,0.5760133299196041
122,5,Decision Tree,0,0.7,0.5432835820895522,0.47204385444453645,0.3157839775085449,0.47204385444453645
123,5,RandomForest,0,0.7,0.5059701492537313,0.29984134923978495,0.8331089019775391,0.29984134923978495
124,5,AdaBoost (Discrete),0,0.7,0.6940298507462687,0.6612244848785761,190.68854784965515,0.6612244848785761
125,5,AdaBoost (Real),0,0.7,0.6507462686567164,0.6100991054687257,197.05952215194702,0.6100991054687257
126,5,Logistic Regression (Penalty = L2),0,0.7,0.8074626865671641,0.7586136381284677,2.026201009750366,0.7586136381284677
127,5,Naive Bayes,0,0.7,0.6522388059701493,0.6176339624972632,0.3021109104156494,0.6176339624972632
128,5,KNeighbors Classifier,1,0.7,0.746268656716418,0.6870586385599683,2.052917003631592,0.6870586385599683
129,5,SVC Classifier,1,0.7,0.6626865671641791,0.6167789035818083,4.15007758140564,0.6167789035818083
130,5,Decision Tree,1,0.7,0.5761194029850746,0.5345232324334251,0.20746254920959473,0.5345232324334251
131,5,RandomForest,1,0.7,0.4462686567164179,0.29917360535597975,0.9953193664550781,0.0
132,5,AdaBoost (Discrete),1,0.7,0.7074626865671642,0.677833965332386,183.64015173912048,0.677833965332386
133,5,AdaBoost (Real),1,0.7,0.6432835820895523,0.6115009332102618,166.0517861843109,0.6115009332102618
134,5,Logistic Regression (Penalty = L2),1,0.7,0.7746268656716417,0.7299982963676677,1.8971972465515137,0.7299982963676677
135,5,Naive Bayes,1,0.7,0.6940298507462687,0.6435816784406618,0.18102002143859863,0.6435816784406618
136,5,KNeighbors Classifier,2,0.7,0.7606060606060606,0.7161715874077008,2.0426025390625,0.7161715874077008
137,5,SVC Classifier,2,0.7,0.6575757575757576,0.6181948728738151,3.8577213287353516,0.6181948728738151
138,5,Decision Tree,2,0.7,0.5984848484848485,0.5533338089522412,0.3408651351928711,0.5533338089522412
139,5,RandomForest,2,0.7,0.5242424242424243,0.38504856098147977,0.9716799259185791,0.0
140,5,AdaBoost (Discrete),2,0.7,0.696969696969697,0.6607736306845637,168.19336986541748,0.6607736306845637
141,5,AdaBoost (Real),2,0.7,0.6636363636363637,0.6215337357127044,167.11500310897827,0.6215337357127044
142,5,Logistic Regression (Penalty = L2),2,0.7,0.8196969696969697,0.7754547437217899,2.0600016117095947,0.7754547437217899
143,5,Naive Bayes,2,0.7,0.6606060606060606,0.6190660083826405,0.2732861042022705,0.6190660083826405
144,6,KNeighbors Classifier,0,0.7,0.7835820895522388,0.7391920450679409,2.5244147777557373,0.7391920450679409
145,6,SVC Classifier,0,0.7,0.6955223880597015,0.6541287567021319,4.557598352432251,0.6541287567021319
146,6,Decision Tree,0,0.7,0.5895522388059702,0.5209185217129846,0.29650378227233887,0.5209185217129846
147,6,RandomForest,0,0.7,0.5373134328358209,0.4237529949772327,0.8214380741119385,0.4237529949772327
148,6,AdaBoost (Discrete),0,0.7,0.7283582089552239,0.6992424196995582,199.8092746734619,0.6992424196995582
149,6,AdaBoost (Real),0,0.7,0.691044776119403,0.6566574460209127,183.2926836013794,0.6566574460209127
150,6,Logistic Regression (Penalty = L2),0,0.7,0.8223880597014925,0.7740557812978099,1.9443457126617432,0.7740557812978099
151,6,Naive Bayes,0,0.7,0.6805970149253732,0.6339649903546838,0.2535135746002197,0.6339649903546838
152,6,KNeighbors Classifier,1,0.7,0.7791044776119403,0.7225412631671665,2.298208713531494,0.7225412631671665
153,6,SVC Classifier,1,0.7,0.7149253731343284,0.6718557071262314,4.078585386276245,0.6718557071262314
154,6,Decision Tree,1,0.7,0.6014925373134329,0.5594029303427145,0.2565324306488037,0.5594029303427145
155,6,RandomForest,1,0.7,0.5194029850746269,0.3999681616560442,0.7643823623657227,0.3999681616560442
156,6,AdaBoost (Discrete),1,0.7,0.7283582089552239,0.705400161303483,161.49513864517212,0.705400161303483
157,6,AdaBoost (Real),1,0.7,0.7059701492537314,0.6788867768576368,158.88165926933289,0.6788867768576368
158,6,Logistic Regression (Penalty = L2),1,0.7,0.7895522388059701,0.7392366219985602,1.881577491760254,0.7392366219985602
159,6,Naive Bayes,1,0.7,0.7328358208955223,0.6832312005959519,0.16233396530151367,0.6832312005959519
160,6,KNeighbors Classifier,2,0.7,0.8075757575757576,0.7667264150741484,2.0976994037628174,0.7667264150741484
161,6,SVC Classifier,2,0.7,0.7257575757575757,0.6910258487554707,3.5564303398132324,0.6910258487554707
162,6,Decision Tree,2,0.7,0.5984848484848485,0.5558222254559684,0.23903989791870117,0.5558222254559684
163,6,RandomForest,2,0.7,0.5378787878787878,0.43587860360106784,0.702376127243042,0.0
164,6,AdaBoost (Discrete),2,0.7,0.7363636363636363,0.7093720959560982,159.87220692634583,0.7093720959560982
165,6,AdaBoost (Real),2,0.7,0.6696969696969697,0.5809463290047004,153.92413711547852,0.5809463290047004
166,6,Logistic Regression (Penalty = L2),2,0.7,0.8393939393939394,0.8010628612551429,1.7957072257995605,0.8010628612551429
167,6,Naive Bayes,2,0.7,0.7106060606060606,0.6680529503967151,0.2278435230255127,0.6680529503967151
168,7,KNeighbors Classifier,0,0.7,0.8074626865671641,0.7504598025409923,3.2299857139587402,0.7504598025409923
169,7,SVC Classifier,0,0.7,0.7597014925373134,0.7316117043109931,4.513343095779419,0.7316117043109931
170,7,Decision Tree,0,0.7,0.5656716417910448,0.5031828275480645,0.22707247734069824,0.5031828275480645
171,7,RandomForest,0,0.7,0.4701492537313433,0.3889137533398747,0.7414641380310059,0.0
172,7,AdaBoost (Discrete),0,0.7,0.7388059701492538,0.6893477603602628,217.61717414855957,0.6893477603602628
173,7,AdaBoost (Real),0,0.7,0.6746268656716418,0.6193300273448292,218.74375748634338,0.6193300273448292
174,7,Logistic Regression (Penalty = L2),0,0.7,0.8298507462686567,0.7876922644216467,2.6314778327941895,0.7876922644216467
175,7,Naive Bayes,0,0.7,0.7134328358208956,0.6752494293092076,0.23119664192199707,0.6752494293092076
176,7,KNeighbors Classifier,1,0.7,0.7955223880597015,0.7361529841046549,3.2982583045959473,0.7361529841046549
177,7,SVC Classifier,1,0.7,0.7507462686567165,0.7081183664695611,4.38093113899231,0.7081183664695611
178,7,Decision Tree,1,0.7,0.6194029850746269,0.5654735863954736,0.2284231185913086,0.5654735863954736
179,7,RandomForest,1,0.7,0.5104477611940299,0.3165623484602077,0.7648749351501465,0.3165623484602077
180,7,AdaBoost (Discrete),1,0.7,0.7313432835820896,0.6875894523397089,209.04418635368347,0.6875894523397089
181,7,AdaBoost (Real),1,0.7,0.664179104477612,0.6284114082593976,208.06308770179749,0.6284114082593976
182,7,Logistic Regression (Penalty = L2),1,0.7,0.8164179104477612,0.7689946166407247,2.5803844928741455,0.7689946166407247
183,7,Naive Bayes,1,0.7,0.7432835820895523,0.6957381327610317,0.2426745891571045,0.6957381327610317
184,7,KNeighbors Classifier,2,0.7,0.8166666666666667,0.7656774240972815,3.5940661430358887,0.7656774240972815
185,7,SVC Classifier,2,0.7,0.7636363636363637,0.7309068401253822,4.21274471282959,0.7309068401253822
186,7,Decision Tree,2,0.7,0.6348484848484849,0.586988338429181,0.3029143810272217,0.586988338429181
187,7,RandomForest,2,0.7,0.5393939393939394,0.5504263951867092,0.7462525367736816,0.0
188,7,AdaBoost (Discrete),2,0.7,0.7666666666666667,0.7416161987278153,220.68897080421448,0.7416161987278153
189,7,AdaBoost (Real),2,0.7,0.6954545454545454,0.639174200805665,225.50720381736755,0.639174200805665
190,7,Logistic Regression (Penalty = L2),2,0.7,0.8318181818181818,0.7879076409616999,2.6920342445373535,0.7879076409616999
191,7,Naive Bayes,2,0.7,0.7303030303030303,0.68692464862232,0.25087618827819824,0.68692464862232
192,8,KNeighbors Classifier,0,0.7,0.7343283582089553,0.680425177717309,1.27327561378479,0.680425177717309
193,8,SVC Classifier,0,0.7,0.5925373134328358,0.5232070511173297,3.1024835109710693,0.5232070511173297
194,8,Decision Tree,0,0.7,0.5611940298507463,0.5093351988920074,0.1695544719696045,0.5093351988920074
195,8,RandomForest,0,0.7,0.46865671641791046,0.3747562083596475,0.6751518249511719,0.0
196,8,AdaBoost (Discrete),0,0.7,0.6761194029850747,0.6337353409414959,124.1846649646759,0.6337353409414959
197,8,AdaBoost (Real),0,0.7,0.6059701492537314,0.576835700433598,132.4642493724823,0.576835700433598
198,8,Logistic Regression (Penalty = L2),0,0.7,0.7805970149253731,0.7253435231568915,1.525571584701538,0.7253435231568915
199,8,Naive Bayes,0,0.7,0.6343283582089553,0.5860015416389973,0.15804648399353027,0.5860015416389973
200,8,KNeighbors Classifier,1,0.7,0.7328358208955223,0.6778467937223526,1.210242748260498,0.6778467937223526
201,8,SVC Classifier,1,0.7,0.6194029850746269,0.533620822570387,2.8203186988830566,0.533620822570387
202,8,Decision Tree,1,0.7,0.5791044776119403,0.5301447116508428,0.230560302734375,0.5301447116508428
203,8,RandomForest,1,0.7,0.5,0.49719867636435866,0.6856391429901123,0.0
204,8,AdaBoost (Discrete),1,0.7,0.6746268656716418,0.6530206477551912,139.3218231201172,0.6530206477551912
205,8,AdaBoost (Real),1,0.7,0.6164179104477612,0.5594216641618104,131.75825667381287,0.5594216641618104
206,8,Logistic Regression (Penalty = L2),1,0.7,0.7582089552238805,0.7080676873279945,1.747366189956665,0.7080676873279945
207,8,Naive Bayes,1,0.7,0.6492537313432836,0.5995774785765747,0.18121886253356934,0.5995774785765747
208,8,KNeighbors Classifier,2,0.7,0.7363636363636363,0.6712189389693773,1.1304123401641846,0.6712189389693773
209,8,SVC Classifier,2,0.7,0.6212121212121212,0.5702701804731785,3.0181548595428467,0.5702701804731785
210,8,Decision Tree,2,0.7,0.5803030303030303,0.5341748173283871,0.1814420223236084,0.5341748173283871
211,8,RandomForest,2,0.7,0.503030303030303,0.36322506330697407,0.7873373031616211,0.0
212,8,AdaBoost (Discrete),2,0.7,0.7121212121212122,0.680852048118705,125.22018146514893,0.680852048118705
213,8,AdaBoost (Real),2,0.7,0.6151515151515151,0.5712043730464356,138.79991936683655,0.5712043730464356
214,8,Logistic Regression (Penalty = L2),2,0.7,0.793939393939394,0.7478512892009646,1.7551989555358887,0.7478512892009646
215,8,Naive Bayes,2,0.7,0.6545454545454545,0.619636508248155,0.1928880214691162,0.619636508248155
