,feat_set_id,classifier,fold_id,feat_th,score,geo_score,exec_t,geo_score_woz
0,0,KNeighbors Classifier,0,0.55,0.9776119402985075,0.9773772659446601,1.9584476947784424,0.9773772659446601
1,0,SVC Classifier,0,0.55,0.9119402985074627,0.9109129759830438,2.7009060382843018,0.9109129759830438
2,0,Decision Tree,0,0.55,0.6970149253731344,0.6910964460651257,0.14025497436523438,0.6910964460651257
3,0,RandomForest,0,0.55,0.655223880597015,0.5865819580866072,0.48496341705322266,0.5865819580866072
4,0,AdaBoost (Discrete),0,0.55,0.9149253731343283,0.9137589141677065,113.02802562713623,0.9137589141677065
5,0,AdaBoost (Real),0,0.55,0.9,0.8975587243647348,125.35320925712585,0.8975587243647348
6,0,Logistic Regression (Penalty = L2),0,0.55,0.9477611940298507,0.9468949866409813,1.1910388469696045,0.9468949866409813
7,0,Naive Bayes,0,0.55,0.9388059701492537,0.9382263900466918,0.17259001731872559,0.9382263900466918
8,0,KNeighbors Classifier,1,0.55,0.9567164179104478,0.9563284283224982,2.4117019176483154,0.9563284283224982
9,0,SVC Classifier,1,0.55,0.9238805970149254,0.9230330870955009,3.024294853210449,0.9230330870955009
10,0,Decision Tree,1,0.55,0.7432835820895523,0.7384943280448071,0.16846895217895508,0.7384943280448071
11,0,RandomForest,1,0.55,0.6776119402985075,0.6497538428475061,0.5543003082275391,0.6497538428475061
12,0,AdaBoost (Discrete),1,0.55,0.9298507462686567,0.9291507422013281,121.37686467170715,0.9291507422013281
13,0,AdaBoost (Real),1,0.55,0.8880597014925373,0.887131927547042,129.15310668945312,0.887131927547042
14,0,Logistic Regression (Penalty = L2),1,0.55,0.9582089552238806,0.9579798604788823,1.0620090961456299,0.9579798604788823
15,0,Naive Bayes,1,0.55,0.9298507462686567,0.9293493084595832,0.10300803184509277,0.9293493084595832
16,0,KNeighbors Classifier,2,0.55,0.9742424242424242,0.9740757608466152,1.9519379138946533,0.9740757608466152
17,0,SVC Classifier,2,0.55,0.9242424242424242,0.9232961146659904,2.919894218444824,0.9232961146659904
18,0,Decision Tree,2,0.55,0.7257575757575757,0.7227425123855166,0.15604472160339355,0.7227425123855166
19,0,RandomForest,2,0.55,0.696969696969697,0.6822923870614939,0.5230259895324707,0.6822923870614939
20,0,AdaBoost (Discrete),2,0.55,0.9287878787878788,0.9281422811735112,123.47233128547668,0.9281422811735112
21,0,AdaBoost (Real),2,0.55,0.8515151515151516,0.8500850539085467,143.5819284915924,0.8500850539085467
22,0,Logistic Regression (Penalty = L2),2,0.55,0.953030303030303,0.952754393033301,1.3312957286834717,0.952754393033301
23,0,Naive Bayes,2,0.55,0.9454545454545454,0.9452786291514139,0.13984298706054688,0.9452786291514139
24,1,KNeighbors Classifier,0,0.55,0.9791044776119403,0.9789633360830158,2.642422914505005,0.9789633360830158
25,1,SVC Classifier,0,0.55,0.9149253731343283,0.9140706433030592,3.5806593894958496,0.9140706433030592
26,1,Decision Tree,0,0.55,0.691044776119403,0.6861651211585302,0.19532394409179688,0.6861651211585302
27,1,RandomForest,0,0.55,0.7014925373134329,0.6481184583873663,0.6524248123168945,0.6481184583873663
28,1,AdaBoost (Discrete),0,0.55,0.9298507462686567,0.9291710293556512,149.40649676322937,0.9291710293556512
29,1,AdaBoost (Real),0,0.55,0.9119402985074627,0.9108870500601318,163.107008934021,0.9108870500601318
30,1,Logistic Regression (Penalty = L2),0,0.55,0.9447761194029851,0.9440404085869277,1.4513592720031738,0.9440404085869277
31,1,Naive Bayes,0,0.55,0.9343283582089552,0.933707737009111,0.1489393711090088,0.933707737009111
32,1,KNeighbors Classifier,1,0.55,0.9611940298507463,0.9606761139359424,2.568744659423828,0.9606761139359424
33,1,SVC Classifier,1,0.55,0.9194029850746268,0.9183947348495144,3.773987293243408,0.9183947348495144
34,1,Decision Tree,1,0.55,0.6865671641791045,0.6833639901540115,0.20346355438232422,0.6833639901540115
35,1,RandomForest,1,0.55,0.7149253731343284,0.6404577802951135,0.68389892578125,0.6404577802951135
36,1,AdaBoost (Discrete),1,0.55,0.9283582089552239,0.9275224413942188,157.795645236969,0.9275224413942188
37,1,AdaBoost (Real),1,0.55,0.8432835820895522,0.8409320447363173,155.84046936035156,0.8409320447363173
38,1,Logistic Regression (Penalty = L2),1,0.55,0.9507462686567164,0.9501521462026709,1.335618495941162,0.9501521462026709
39,1,Naive Bayes,1,0.55,0.9343283582089552,0.9338977622128511,0.19188857078552246,0.9338977622128511
40,1,KNeighbors Classifier,2,0.55,0.9757575757575757,0.975537192649042,2.538980484008789,0.975537192649042
41,1,SVC Classifier,2,0.55,0.9287878787878788,0.9278845263720615,3.5875296592712402,0.9278845263720615
42,1,Decision Tree,2,0.55,0.7439393939393939,0.7404825203604528,0.13684344291687012,0.7404825203604528
43,1,RandomForest,2,0.55,0.7166666666666667,0.6768997447388512,0.5723464488983154,0.6768997447388512
44,1,AdaBoost (Discrete),2,0.55,0.9454545454545454,0.9447194603239133,150.97077631950378,0.9447194603239133
45,1,AdaBoost (Real),2,0.55,0.8924242424242425,0.8915464347947512,146.3451864719391,0.8915464347947512
46,1,Logistic Regression (Penalty = L2),2,0.55,0.956060606060606,0.955786313845814,1.4266698360443115,0.955786313845814
47,1,Naive Bayes,2,0.55,0.9409090909090909,0.9404059539188001,0.21008062362670898,0.9404059539188001
48,2,KNeighbors Classifier,0,0.55,0.9686567164179104,0.9681603562375167,2.6688828468322754,0.9681603562375167
49,2,SVC Classifier,0,0.55,0.9149253731343283,0.9134457627467261,3.5668516159057617,0.9134457627467261
50,2,Decision Tree,0,0.55,0.7522388059701492,0.741706085150278,0.19133400917053223,0.741706085150278
51,2,RandomForest,0,0.55,0.6567164179104478,0.6215565436198757,0.57989501953125,0.6215565436198757
52,2,AdaBoost (Discrete),0,0.55,0.9328358208955224,0.932206433432797,162.79338312149048,0.932206433432797
53,2,AdaBoost (Real),0,0.55,0.8850746268656716,0.883487196355346,203.12640738487244,0.883487196355346
54,2,Logistic Regression (Penalty = L2),0,0.55,0.9402985074626866,0.939492250234042,1.7460026741027832,0.939492250234042
55,2,Naive Bayes,0,0.55,0.9223880597014925,0.9214428634108158,0.2436847686767578,0.9214428634108158
56,2,KNeighbors Classifier,1,0.55,0.9492537313432836,0.9487984858940809,3.123487710952759,0.9487984858940809
57,2,SVC Classifier,1,0.55,0.9,0.8983402928481726,4.48403000831604,0.8983402928481726
58,2,Decision Tree,1,0.55,0.6671641791044776,0.6616670464470296,0.24191784858703613,0.6616670464470296
59,2,RandomForest,1,0.55,0.6776119402985075,0.637811252018249,0.7983813285827637,0.637811252018249
60,2,AdaBoost (Discrete),1,0.55,0.9208955223880597,0.9197806530882506,179.70545649528503,0.9197806530882506
61,2,AdaBoost (Real),1,0.55,0.8731343283582089,0.872375119167952,191.98676991462708,0.872375119167952
62,2,Logistic Regression (Penalty = L2),1,0.55,0.9402985074626866,0.9394514719841052,1.446077823638916,0.9394514719841052
63,2,Naive Bayes,1,0.55,0.9223880597014925,0.9215710820166174,0.16519975662231445,0.9215710820166174
64,2,KNeighbors Classifier,2,0.55,0.9636363636363636,0.9631514210774192,2.974287986755371,0.9631514210774192
65,2,SVC Classifier,2,0.55,0.9196969696969697,0.9189098407971084,4.372239828109741,0.9189098407971084
66,2,Decision Tree,2,0.55,0.7560606060606061,0.7538220824082957,0.22610020637512207,0.7538220824082957
67,2,RandomForest,2,0.55,0.6954545454545454,0.6699232210685537,0.8506574630737305,0.6699232210685537
68,2,AdaBoost (Discrete),2,0.55,0.9227272727272727,0.9220380416546614,173.78440880775452,0.9220380416546614
69,2,AdaBoost (Real),2,0.55,0.8727272727272727,0.8703377454384837,179.93611645698547,0.8703377454384837
70,2,Logistic Regression (Penalty = L2),2,0.55,0.9484848484848485,0.9482374864820761,1.621161937713623,0.9482374864820761
71,2,Naive Bayes,2,0.55,0.9333333333333333,0.9330090800917374,0.2884199619293213,0.9330090800917374
72,3,KNeighbors Classifier,0,0.55,0.9537313432835821,0.9526472430228767,2.831754207611084,0.9526472430228767
73,3,SVC Classifier,0,0.55,0.8850746268656716,0.8823400376849356,4.2034783363342285,0.8823400376849356
74,3,Decision Tree,0,0.55,0.6865671641791045,0.6816000477800138,0.21954965591430664,0.6816000477800138
75,3,RandomForest,0,0.55,0.655223880597015,0.5174482959245057,0.7301225662231445,0.5174482959245057
76,3,AdaBoost (Discrete),0,0.55,0.8925373134328358,0.8915227289639337,173.31305575370789,0.8915227289639337
77,3,AdaBoost (Real),0,0.55,0.8462686567164179,0.8438654881392442,185.66212010383606,0.8438654881392442
78,3,Logistic Regression (Penalty = L2),0,0.55,0.917910447761194,0.9161155092853245,1.572035789489746,0.9161155092853245
79,3,Naive Bayes,0,0.55,0.9149253731343283,0.9143410821315177,0.22715997695922852,0.9143410821315177
80,3,KNeighbors Classifier,1,0.55,0.9432835820895522,0.9422326245957082,2.999467134475708,0.9422326245957082
81,3,SVC Classifier,1,0.55,0.8671641791044776,0.863285502330394,4.366804838180542,0.863285502330394
82,3,Decision Tree,1,0.55,0.655223880597015,0.6518913241697974,0.20794677734375,0.6518913241697974
83,3,RandomForest,1,0.55,0.6402985074626866,0.5673754424775102,0.7610478401184082,0.5673754424775102
84,3,AdaBoost (Discrete),1,0.55,0.8820895522388059,0.8801811385434034,177.59836268424988,0.8801811385434034
85,3,AdaBoost (Real),1,0.55,0.7761194029850746,0.7698965031997284,177.39027905464172,0.7698965031997284
86,3,Logistic Regression (Penalty = L2),1,0.55,0.9208955223880597,0.919633744251684,1.5966014862060547,0.919633744251684
87,3,Naive Bayes,1,0.55,0.9029850746268657,0.901783954955953,0.15320158004760742,0.901783954955953
88,3,KNeighbors Classifier,2,0.55,0.9575757575757575,0.9567197559793941,2.850708246231079,0.9567197559793941
89,3,SVC Classifier,2,0.55,0.8803030303030303,0.8782022229821095,4.393632411956787,0.8782022229821095
90,3,Decision Tree,2,0.55,0.75,0.7442927687640162,0.2315807342529297,0.7442927687640162
91,3,RandomForest,2,0.55,0.6454545454545455,0.5757122177660954,0.7484335899353027,0.5757122177660954
92,3,AdaBoost (Discrete),2,0.55,0.9,0.897959954193075,178.32693791389465,0.897959954193075
93,3,AdaBoost (Real),2,0.55,0.8333333333333334,0.8301825364579527,189.02947998046875,0.8301825364579527
94,3,Logistic Regression (Penalty = L2),2,0.55,0.9212121212121213,0.9208948619417869,1.5517044067382812,0.9208948619417869
95,3,Naive Bayes,2,0.55,0.9196969696969697,0.919248576656802,0.16969609260559082,0.919248576656802
96,4,KNeighbors Classifier,0,0.55,0.9761194029850746,0.9759555336473826,2.468189239501953,0.9759555336473826
97,4,SVC Classifier,0,0.55,0.9164179104477612,0.9155874061125001,3.5939877033233643,0.9155874061125001
98,4,Decision Tree,0,0.55,0.7238805970149254,0.7182601338178208,0.22687172889709473,0.7182601338178208
99,4,RandomForest,0,0.55,0.7179104477611941,0.6951833174828654,0.7733659744262695,0.6951833174828654
100,4,AdaBoost (Discrete),0,0.55,0.926865671641791,0.9262274122928816,152.11165022850037,0.9262274122928816
101,4,AdaBoost (Real),0,0.55,0.8940298507462686,0.8916892865996281,159.47084093093872,0.8916892865996281
102,4,Logistic Regression (Penalty = L2),0,0.55,0.9477611940298507,0.9469274362308462,1.2789011001586914,0.9469274362308462
103,4,Naive Bayes,0,0.55,0.9373134328358209,0.9367950484468832,0.22617840766906738,0.9367950484468832
104,4,KNeighbors Classifier,1,0.55,0.9656716417910448,0.965203479757802,2.8524832725524902,0.965203479757802
105,4,SVC Classifier,1,0.55,0.9194029850746268,0.9180775450646494,3.5037119388580322,0.9180775450646494
106,4,Decision Tree,1,0.55,0.7597014925373134,0.7571605510280336,0.1419539451599121,0.7571605510280336
107,4,RandomForest,1,0.55,0.7567164179104477,0.7409125178102896,0.7511899471282959,0.7409125178102896
108,4,AdaBoost (Discrete),1,0.55,0.9328358208955224,0.9320913588079645,151.16967368125916,0.9320913588079645
109,4,AdaBoost (Real),1,0.55,0.8641791044776119,0.8618094885372595,153.90632438659668,0.8618094885372595
110,4,Logistic Regression (Penalty = L2),1,0.55,0.9522388059701492,0.9518440790300023,1.2739043235778809,0.9518440790300023
111,4,Naive Bayes,1,0.55,0.9417910447761194,0.9414480573899583,0.2612442970275879,0.9414480573899583
112,4,KNeighbors Classifier,2,0.55,0.9757575757575757,0.9755156622625882,2.299907684326172,0.9755156622625882
113,4,SVC Classifier,2,0.55,0.9287878787878788,0.9280318603312582,3.6103663444519043,0.9280318603312582
114,4,Decision Tree,2,0.55,0.7560606060606061,0.753945090951241,0.21896791458129883,0.753945090951241
115,4,RandomForest,2,0.55,0.7348484848484849,0.7209092760072785,0.8019833564758301,0.7209092760072785
116,4,AdaBoost (Discrete),2,0.55,0.9348484848484848,0.9340795260556296,143.6017792224884,0.9340795260556296
117,4,AdaBoost (Real),2,0.55,0.8833333333333333,0.8828945986205256,152.83507680892944,0.8828945986205256
118,4,Logistic Regression (Penalty = L2),2,0.55,0.95,0.94956585123392,1.2836413383483887,0.94956585123392
119,4,Naive Bayes,2,0.55,0.9424242424242424,0.9421374076523887,0.1497485637664795,0.9421374076523887
120,5,KNeighbors Classifier,0,0.55,0.9641791044776119,0.9637832189412109,1.8029980659484863,0.9637832189412109
121,5,SVC Classifier,0,0.55,0.8940298507462686,0.8916283077368197,3.0652379989624023,0.8916283077368197
122,5,Decision Tree,0,0.55,0.7343283582089553,0.7273345167916724,0.1377706527709961,0.7273345167916724
123,5,RandomForest,0,0.55,0.6582089552238806,0.6329219288933512,0.8425776958465576,0.6329219288933512
124,5,AdaBoost (Discrete),0,0.55,0.917910447761194,0.9171475632344485,122.38775181770325,0.9171475632344485
125,5,AdaBoost (Real),0,0.55,0.8746268656716418,0.8725718896393628,133.80342030525208,0.8725718896393628
126,5,Logistic Regression (Penalty = L2),0,0.55,0.9417910447761194,0.9405798931562607,1.0994281768798828,0.9405798931562607
127,5,Naive Bayes,0,0.55,0.9119402985074627,0.9112465723849192,0.18685221672058105,0.9112465723849192
128,5,KNeighbors Classifier,1,0.55,0.9611940298507463,0.9607874203454116,1.73201322555542,0.9607874203454116
129,5,SVC Classifier,1,0.55,0.8970149253731343,0.8960662366100114,2.8553452491760254,0.8960662366100114
130,5,Decision Tree,1,0.55,0.753731343283582,0.7489047559460258,0.2056102752685547,0.7489047559460258
131,5,RandomForest,1,0.55,0.6805970149253732,0.6381689865210779,0.6551611423492432,0.6381689865210779
132,5,AdaBoost (Discrete),1,0.55,0.9164179104477612,0.9158486528441582,115.12288165092468,0.9158486528441582
133,5,AdaBoost (Real),1,0.55,0.8776119402985074,0.8761425385573832,124.20499420166016,0.8761425385573832
134,5,Logistic Regression (Penalty = L2),1,0.55,0.9298507462686567,0.9290757834830761,1.0495378971099854,0.9290757834830761
135,5,Naive Bayes,1,0.55,0.9149253731343283,0.9142350040254066,0.21496915817260742,0.9142350040254066
136,5,KNeighbors Classifier,2,0.55,0.9651515151515152,0.9647659762982601,1.5632734298706055,0.9647659762982601
137,5,SVC Classifier,2,0.55,0.9136363636363637,0.9125097357043069,2.70879864692688,0.9125097357043069
138,5,Decision Tree,2,0.55,0.7454545454545455,0.7390148493064869,0.13264894485473633,0.7390148493064869
139,5,RandomForest,2,0.55,0.6196969696969697,0.658713737833354,0.5895354747772217,0.0
140,5,AdaBoost (Discrete),2,0.55,0.9242424242424242,0.9237058455867301,107.15361285209656,0.9237058455867301
141,5,AdaBoost (Real),2,0.55,0.8909090909090909,0.8888498705833868,119.29009127616882,0.8888498705833868
142,5,Logistic Regression (Penalty = L2),2,0.55,0.953030303030303,0.9527566286855558,0.9938786029815674,0.9527566286855558
143,5,Naive Bayes,2,0.55,0.9333333333333333,0.9329547872504933,0.18692874908447266,0.9329547872504933
144,6,KNeighbors Classifier,0,0.55,0.9402985074626866,0.9388369726249182,1.6211957931518555,0.9388369726249182
145,6,SVC Classifier,0,0.55,0.8671641791044776,0.8625815653710518,2.6759557723999023,0.8625815653710518
146,6,Decision Tree,0,0.55,0.6955223880597015,0.6920856089337715,0.12431025505065918,0.6920856089337715
147,6,RandomForest,0,0.55,0.6507462686567164,0.6122337752217362,0.6326050758361816,0.6122337752217362
148,6,AdaBoost (Discrete),0,0.55,0.8776119402985074,0.8761061660918437,102.42509484291077,0.8761061660918437
149,6,AdaBoost (Real),0,0.55,0.7970149253731343,0.7920880058931552,105.09494423866272,0.7920880058931552
150,6,Logistic Regression (Penalty = L2),0,0.55,0.9164179104477612,0.9145914475565626,0.8440165519714355,0.9145914475565626
151,6,Naive Bayes,0,0.55,0.9149253731343283,0.9143148121141825,0.15855741500854492,0.9143148121141825
152,6,KNeighbors Classifier,1,0.55,0.9522388059701492,0.9512684175637744,1.4310932159423828,0.9512684175637744
153,6,SVC Classifier,1,0.55,0.8492537313432836,0.8462672334289452,2.6385881900787354,0.8462672334289452
154,6,Decision Tree,1,0.55,0.6597014925373135,0.6546060077045325,0.12699246406555176,0.6546060077045325
155,6,RandomForest,1,0.55,0.6582089552238806,0.6311041286829929,0.5956912040710449,0.6311041286829929
156,6,AdaBoost (Discrete),1,0.55,0.8746268656716418,0.8705161984914913,104.87320971488953,0.8705161984914913
157,6,AdaBoost (Real),1,0.55,0.8477611940298507,0.8455226796561658,120.63282251358032,0.8455226796561658
158,6,Logistic Regression (Penalty = L2),1,0.55,0.9149253731343283,0.9136518580338194,1.093860149383545,0.9136518580338194
159,6,Naive Bayes,1,0.55,0.9044776119402985,0.9032306220400369,0.19537067413330078,0.9032306220400369
160,6,KNeighbors Classifier,2,0.55,0.9666666666666667,0.9664320549196467,1.6580734252929688,0.9664320549196467
161,6,SVC Classifier,2,0.55,0.8651515151515151,0.8602667860003845,2.9464900493621826,0.8602667860003845
162,6,Decision Tree,2,0.55,0.6909090909090909,0.6877145421733152,0.20066499710083008,0.6877145421733152
163,6,RandomForest,2,0.55,0.6666666666666666,0.6452763466223485,0.6854152679443359,0.6452763466223485
164,6,AdaBoost (Discrete),2,0.55,0.896969696969697,0.8944798445468716,114.36812019348145,0.8944798445468716
165,6,AdaBoost (Real),2,0.55,0.8272727272727273,0.8265881878509339,109.66919779777527,0.8265881878509339
166,6,Logistic Regression (Penalty = L2),2,0.55,0.9242424242424242,0.923696377593767,0.8758735656738281,0.923696377593767
167,6,Naive Bayes,2,0.55,0.9181818181818182,0.9178792602241274,0.10946869850158691,0.9178792602241274
168,7,KNeighbors Classifier,0,0.55,0.9671641791044776,0.966822884104504,1.5137546062469482,0.966822884104504
169,7,SVC Classifier,0,0.55,0.8761194029850746,0.8733823823870184,2.647149085998535,0.8733823823870184
170,7,Decision Tree,0,0.55,0.7283582089552239,0.7221711486364686,0.12051177024841309,0.7221711486364686
171,7,RandomForest,0,0.55,0.6626865671641791,0.6447685336868937,0.5485188961029053,0.6447685336868937
172,7,AdaBoost (Discrete),0,0.55,0.9283582089552239,0.9279104110934774,104.10131645202637,0.9279104110934774
173,7,AdaBoost (Real),0,0.55,0.8716417910447761,0.8692878814387908,114.96856737136841,0.8692878814387908
174,7,Logistic Regression (Penalty = L2),0,0.55,0.9328358208955224,0.9319468935675465,0.885298490524292,0.9319468935675465
175,7,Naive Bayes,0,0.55,0.9119402985074627,0.9110783304104211,0.21439337730407715,0.9110783304104211
176,7,KNeighbors Classifier,1,0.55,0.9552238805970149,0.9547044701141799,1.6049423217773438,0.9547044701141799
177,7,SVC Classifier,1,0.55,0.8970149253731343,0.8954352370137102,2.6030352115631104,0.8954352370137102
178,7,Decision Tree,1,0.55,0.7268656716417911,0.7254234853545305,0.11348915100097656,0.7254234853545305
179,7,RandomForest,1,0.55,0.7059701492537314,0.6635190291052814,0.6144187450408936,0.6635190291052814
180,7,AdaBoost (Discrete),1,0.55,0.9014925373134328,0.9006150058226472,104.42422556877136,0.9006150058226472
181,7,AdaBoost (Real),1,0.55,0.8641791044776119,0.8623504129076984,114.59968900680542,0.8623504129076984
182,7,Logistic Regression (Penalty = L2),1,0.55,0.9388059701492537,0.9380982432413354,0.9064843654632568,0.9380982432413354
183,7,Naive Bayes,1,0.55,0.9134328358208955,0.9126031776432689,0.12003827095031738,0.9126031776432689
184,7,KNeighbors Classifier,2,0.55,0.9681818181818181,0.9679826446967984,1.5512678623199463,0.9679826446967984
185,7,SVC Classifier,2,0.55,0.9121212121212121,0.9115064265396685,2.6785173416137695,0.9115064265396685
186,7,Decision Tree,2,0.55,0.7257575757575757,0.7136656491969164,0.18243145942687988,0.7136656491969164
187,7,RandomForest,2,0.55,0.7393939393939394,0.6828822308638618,0.5758743286132812,0.6828822308638618
188,7,AdaBoost (Discrete),2,0.55,0.9333333333333333,0.932726226148905,107.16990900039673,0.932726226148905
189,7,AdaBoost (Real),2,0.55,0.8575757575757575,0.8519048605325829,121.42341661453247,0.8519048605325829
190,7,Logistic Regression (Penalty = L2),2,0.55,0.9409090909090909,0.9404826357268623,0.9649820327758789,0.9404826357268623
191,7,Naive Bayes,2,0.55,0.9409090909090909,0.9405822156646787,0.1342606544494629,0.9405822156646787
192,8,KNeighbors Classifier,0,0.55,0.9537313432835821,0.9527891221527203,1.8978185653686523,0.9527891221527203
193,8,SVC Classifier,0,0.55,0.8791044776119403,0.8771259180267019,2.9699723720550537,0.8771259180267019
194,8,Decision Tree,0,0.55,0.7388059701492538,0.7346728531409222,0.1796112060546875,0.7346728531409222
195,8,RandomForest,0,0.55,0.6761194029850747,0.6387434153756314,0.6534314155578613,0.6387434153756314
196,8,AdaBoost (Discrete),0,0.55,0.8925373134328358,0.8901153431390867,114.19695854187012,0.8901153431390867
197,8,AdaBoost (Real),0,0.55,0.8402985074626865,0.8387257988776889,116.05016922950745,0.8387257988776889
198,8,Logistic Regression (Penalty = L2),0,0.55,0.9134328358208955,0.9113327527504066,0.9389452934265137,0.9113327527504066
199,8,Naive Bayes,0,0.55,0.9104477611940298,0.9100338821132472,0.1691727638244629,0.9100338821132472
200,8,KNeighbors Classifier,1,0.55,0.9447761194029851,0.9437783166673789,1.6126139163970947,0.9437783166673789
201,8,SVC Classifier,1,0.55,0.8641791044776119,0.8612685171614999,2.7588114738464355,0.8612685171614999
202,8,Decision Tree,1,0.55,0.682089552238806,0.6775098031582392,0.12107181549072266,0.6775098031582392
203,8,RandomForest,1,0.55,0.6776119402985075,0.6614564403250968,0.5430381298065186,0.6614564403250968
204,8,AdaBoost (Discrete),1,0.55,0.8626865671641791,0.860118886822925,106.83203053474426,0.860118886822925
205,8,AdaBoost (Real),1,0.55,0.7985074626865671,0.7953654731834892,103.40262627601624,0.7953654731834892
206,8,Logistic Regression (Penalty = L2),1,0.55,0.9164179104477612,0.9153480232129709,0.8165545463562012,0.9153480232129709
207,8,Naive Bayes,1,0.55,0.9074626865671642,0.906028197535843,0.15449023246765137,0.906028197535843
208,8,KNeighbors Classifier,2,0.55,0.956060606060606,0.9553248941568883,1.4617164134979248,0.9553248941568883
209,8,SVC Classifier,2,0.55,0.8863636363636364,0.8836936557482943,2.593287706375122,0.8836936557482943
210,8,Decision Tree,2,0.55,0.7878787878787878,0.7840473846020393,0.10511660575866699,0.7840473846020393
211,8,RandomForest,2,0.55,0.6833333333333333,0.6141823882832943,0.4708244800567627,0.6141823882832943
212,8,AdaBoost (Discrete),2,0.55,0.9,0.8976648470568569,97.4657256603241,0.8976648470568569
213,8,AdaBoost (Real),2,0.55,0.853030303030303,0.8516645613462254,105.33962059020996,0.8516645613462254
214,8,Logistic Regression (Penalty = L2),2,0.55,0.9272727272727272,0.9269039143668973,0.8294157981872559,0.9269039143668973
215,8,Naive Bayes,2,0.55,0.9196969696969697,0.9190679954715594,0.203108549118042,0.9190679954715594
216,9,KNeighbors Classifier,0,0.55,0.9402985074626866,0.9385053111290608,1.4229893684387207,0.9385053111290608
217,9,SVC Classifier,0,0.55,0.8462686567164179,0.8420533080634484,2.282758951187134,0.8420533080634484
218,9,Decision Tree,0,0.55,0.6134328358208955,0.6004924905307659,0.10514998435974121,0.6004924905307659
219,9,RandomForest,0,0.55,0.6283582089552239,0.5830909631687918,0.5311367511749268,0.5830909631687918
220,9,AdaBoost (Discrete),0,0.55,0.8776119402985074,0.8762891702954753,88.33839130401611,0.8762891702954753
221,9,AdaBoost (Real),0,0.55,0.8283582089552238,0.8266247210569995,95.22820901870728,0.8266247210569995
222,9,Logistic Regression (Penalty = L2),0,0.55,0.908955223880597,0.9073855688919542,0.8509387969970703,0.9073855688919542
223,9,Naive Bayes,0,0.55,0.8940298507462686,0.8934861235711079,0.11632680892944336,0.8934861235711079
224,9,KNeighbors Classifier,1,0.55,0.9194029850746268,0.9160400719112667,1.3931081295013428,0.9160400719112667
225,9,SVC Classifier,1,0.55,0.8373134328358209,0.832484013931897,2.268510103225708,0.832484013931897
226,9,Decision Tree,1,0.55,0.6985074626865672,0.6894698505533031,0.10462784767150879,0.6894698505533031
227,9,RandomForest,1,0.55,0.6029850746268657,0.5737685279741777,0.5831551551818848,0.5737685279741777
228,9,AdaBoost (Discrete),1,0.55,0.8537313432835821,0.8493642835758765,90.38699722290039,0.8493642835758765
229,9,AdaBoost (Real),1,0.55,0.6283582089552239,0.6112571143992375,91.85348629951477,0.6112571143992375
230,9,Logistic Regression (Penalty = L2),1,0.55,0.917910447761194,0.9171508806368607,0.8703165054321289,0.9171508806368607
231,9,Naive Bayes,1,0.55,0.8880597014925373,0.8863917631249133,0.1669600009918213,0.8863917631249133
232,9,KNeighbors Classifier,2,0.55,0.9545454545454546,0.9540031113808185,1.3399326801300049,0.9540031113808185
233,9,SVC Classifier,2,0.55,0.8636363636363636,0.8602747148968761,2.4692585468292236,0.8602747148968761
234,9,Decision Tree,2,0.55,0.706060606060606,0.7007946385408436,0.1039280891418457,0.7007946385408436
235,9,RandomForest,2,0.55,0.6515151515151515,0.6324844122020536,0.48658251762390137,0.6324844122020536
236,9,AdaBoost (Discrete),2,0.55,0.8893939393939394,0.8883043813400049,87.93146753311157,0.8883043813400049
237,9,AdaBoost (Real),2,0.55,0.853030303030303,0.8482257769381386,89.47971558570862,0.8482257769381386
238,9,Logistic Regression (Penalty = L2),2,0.55,0.9151515151515152,0.9146227023208483,0.7122235298156738,0.9146227023208483
239,9,Naive Bayes,2,0.55,0.9030303030303031,0.9023225429727891,0.14763307571411133,0.9023225429727891
240,10,KNeighbors Classifier,0,0.55,0.9731343283582089,0.9728410647635627,2.3170182704925537,0.9728410647635627
241,10,SVC Classifier,0,0.55,0.9208955223880597,0.9200979481730639,2.93279767036438,0.9200979481730639
242,10,Decision Tree,0,0.55,0.7074626865671642,0.7002541970458641,0.18907952308654785,0.7002541970458641
243,10,RandomForest,0,0.55,0.7059701492537314,0.6936457300089148,0.5790421962738037,0.6936457300089148
244,10,AdaBoost (Discrete),0,0.55,0.9283582089552239,0.9277645816812857,126.49274587631226,0.9277645816812857
245,10,AdaBoost (Real),0,0.55,0.8865671641791045,0.8832080216092904,132.08915281295776,0.8832080216092904
246,10,Logistic Regression (Penalty = L2),0,0.55,0.9432835820895522,0.942697611652557,1.1283762454986572,0.942697611652557
247,10,Naive Bayes,0,0.55,0.9328358208955224,0.9324712373418748,0.1515491008758545,0.9324712373418748
248,10,KNeighbors Classifier,1,0.55,0.9641791044776119,0.9638024706191646,2.316283702850342,0.9638024706191646
249,10,SVC Classifier,1,0.55,0.9238805970149254,0.9230681902386259,3.0739316940307617,0.9230681902386259
250,10,Decision Tree,1,0.55,0.746268656716418,0.7421911669558242,0.14365196228027344,0.7421911669558242
251,10,RandomForest,1,0.55,0.7149253731343284,0.689768909080817,0.5284781455993652,0.689768909080817
252,10,AdaBoost (Discrete),1,0.55,0.9328358208955224,0.9324845836334121,124.62932348251343,0.9324845836334121
253,10,AdaBoost (Real),1,0.55,0.8552238805970149,0.8529855547272525,119.10722088813782,0.8529855547272525
254,10,Logistic Regression (Penalty = L2),1,0.55,0.9522388059701492,0.9520339192563909,1.0511677265167236,0.9520339192563909
255,10,Naive Bayes,1,0.55,0.9298507462686567,0.9293031994904515,0.1324601173400879,0.9293031994904515
256,10,KNeighbors Classifier,2,0.55,0.9666666666666667,0.9664564078045258,2.0002212524414062,0.9664564078045258
257,10,SVC Classifier,2,0.55,0.9242424242424242,0.9234489550928395,2.7865800857543945,0.9234489550928395
258,10,Decision Tree,2,0.55,0.7378787878787879,0.7348908152299112,0.1313183307647705,0.7348908152299112
259,10,RandomForest,2,0.55,0.703030303030303,0.6955667151217968,0.4805278778076172,0.6955667151217968
260,10,AdaBoost (Discrete),2,0.55,0.9454545454545454,0.9448106466001798,116.55797791481018,0.9448106466001798
261,10,AdaBoost (Real),2,0.55,0.9090909090909091,0.9078885318950689,119.7383062839508,0.9078885318950689
262,10,Logistic Regression (Penalty = L2),2,0.55,0.95,0.9496840826872447,1.010974407196045,0.9496840826872447
263,10,Naive Bayes,2,0.55,0.9378787878787879,0.9375967638718722,0.13109445571899414,0.9375967638718722
264,11,KNeighbors Classifier,0,0.55,0.9746268656716418,0.9743259937562616,2.353654623031616,0.9743259937562616
265,11,SVC Classifier,0,0.55,0.9223880597014925,0.9217976140778577,3.0408568382263184,0.9217976140778577
266,11,Decision Tree,0,0.55,0.7343283582089553,0.7307860535254811,0.11971068382263184,0.7307860535254811
267,11,RandomForest,0,0.55,0.6701492537313433,0.6208883614518017,0.516357421875,0.6208883614518017
268,11,AdaBoost (Discrete),0,0.55,0.9298507462686567,0.9286675983381951,142.07643628120422,0.9286675983381951
269,11,AdaBoost (Real),0,0.55,0.8731343283582089,0.8708883819002952,143.9560329914093,0.8708883819002952
270,11,Logistic Regression (Penalty = L2),0,0.55,0.9522388059701492,0.9515602667055123,1.1344454288482666,0.9515602667055123
271,11,Naive Bayes,0,0.55,0.9447761194029851,0.9441394833375881,0.1547544002532959,0.9441394833375881
272,11,KNeighbors Classifier,1,0.55,0.9522388059701492,0.9517225928829843,2.5024962425231934,0.9517225928829843
273,11,SVC Classifier,1,0.55,0.9238805970149254,0.9227491203802465,3.0006320476531982,0.9227491203802465
274,11,Decision Tree,1,0.55,0.6298507462686567,0.6197014265532678,0.10254621505737305,0.6197014265532678
275,11,RandomForest,1,0.55,0.6776119402985075,0.6437348360190077,0.4755821228027344,0.6437348360190077
276,11,AdaBoost (Discrete),1,0.55,0.9149253731343283,0.9137962651707224,125.90383625030518,0.9137962651707224
277,11,AdaBoost (Real),1,0.55,0.8582089552238806,0.8559980402052629,139.83544206619263,0.8559980402052629
278,11,Logistic Regression (Penalty = L2),1,0.55,0.9462686567164179,0.9458879104552601,1.1039137840270996,0.9458879104552601
279,11,Naive Bayes,1,0.55,0.9253731343283582,0.9248251330001502,0.1575942039489746,0.9248251330001502
280,11,KNeighbors Classifier,2,0.55,0.9696969696969697,0.9693111362246274,2.1069045066833496,0.9693111362246274
281,11,SVC Classifier,2,0.55,0.9303030303030303,0.9292112407773958,2.7825801372528076,0.9292112407773958
282,11,Decision Tree,2,0.55,0.6954545454545454,0.684988323585093,0.149672269821167,0.684988323585093
283,11,RandomForest,2,0.55,0.7106060606060606,0.6611685661726808,0.4367971420288086,0.6611685661726808
284,11,AdaBoost (Discrete),2,0.55,0.9454545454545454,0.9450332628255356,123.89657759666443,0.9450332628255356
285,11,AdaBoost (Real),2,0.55,0.8954545454545455,0.8947125130812398,114.44032979011536,0.8947125130812398
286,11,Logistic Regression (Penalty = L2),2,0.55,0.9484848484848485,0.9482606399204319,0.8227615356445312,0.9482606399204319
287,11,Naive Bayes,2,0.55,0.9378787878787879,0.9375967638718722,0.10812640190124512,0.9375967638718722
288,12,KNeighbors Classifier,0,0.55,0.9388059701492537,0.9371547492541469,0.4900975227355957,0.9371547492541469
289,12,SVC Classifier,0,0.55,0.8298507462686567,0.8253715214638951,1.1856749057769775,0.8253715214638951
290,12,Decision Tree,0,0.55,0.7522388059701492,0.7480153432452485,0.06491971015930176,0.7480153432452485
291,12,RandomForest,0,0.55,0.6179104477611941,0.5703901781989246,0.29049181938171387,0.5703901781989246
292,12,AdaBoost (Discrete),0,0.55,0.8641791044776119,0.8624022686712836,41.3172767162323,0.8624022686712836
293,12,AdaBoost (Real),0,0.55,0.8402985074626865,0.83979635537377,47.60699129104614,0.83979635537377
294,12,Logistic Regression (Penalty = L2),0,0.55,0.9059701492537313,0.9037096092111201,0.38755249977111816,0.9037096092111201
295,12,Naive Bayes,0,0.55,0.8850746268656716,0.8839972194440154,0.1072535514831543,0.8839972194440154
296,12,KNeighbors Classifier,1,0.55,0.9343283582089552,0.9324760333612792,0.5462093353271484,0.9324760333612792
297,12,SVC Classifier,1,0.55,0.8149253731343283,0.8088816233677726,1.2203495502471924,0.8088816233677726
298,12,Decision Tree,1,0.55,0.7164179104477612,0.7114371124038339,0.06431865692138672,0.7114371124038339
299,12,RandomForest,1,0.55,0.6850746268656717,0.6713635294531979,0.3118717670440674,0.6713635294531979
300,12,AdaBoost (Discrete),1,0.55,0.844776119402985,0.8387569560166281,41.693872928619385,0.8387569560166281
301,12,AdaBoost (Real),1,0.55,0.5417910447761194,0.48926168895536276,45.247135162353516,0.48926168895536276
302,12,Logistic Regression (Penalty = L2),1,0.55,0.8970149253731343,0.8955512616292469,0.4009404182434082,0.8955512616292469
303,12,Naive Bayes,1,0.55,0.8850746268656716,0.8827195689771227,0.08731722831726074,0.8827195689771227
304,12,KNeighbors Classifier,2,0.55,0.943939393939394,0.9432057531730268,0.49214982986450195,0.9432057531730268
305,12,SVC Classifier,2,0.55,0.8621212121212121,0.8572640434884115,1.121485948562622,0.8572640434884115
306,12,Decision Tree,2,0.55,0.7424242424242424,0.7334475770727125,0.06411886215209961,0.7334475770727125
307,12,RandomForest,2,0.55,0.656060606060606,0.6111983765994055,0.2901194095611572,0.6111983765994055
308,12,AdaBoost (Discrete),2,0.55,0.8681818181818182,0.866162202147718,42.0773344039917,0.866162202147718
309,12,AdaBoost (Real),2,0.55,0.8348484848484848,0.8330696664333997,46.54362940788269,0.8330696664333997
310,12,Logistic Regression (Penalty = L2),2,0.55,0.9030303030303031,0.9021167761205398,0.32924628257751465,0.9021167761205398
311,12,Naive Bayes,2,0.55,0.9075757575757576,0.9068955419496516,0.08534932136535645,0.9068955419496516
