,feat_set_id,classifier,fold_id,feat_th,score,geo_score,exec_t,geo_score_woz
0,0,KNeighbors Classifier,0,0.6,0.6358381502890174,0.6615894887621312,2.0365102291107178,0.0
1,0,SVC Classifier,0,0.6,0.49710982658959535,1.0,2.2162513732910156,0.0
2,0,Decision Tree,0,0.6,0.6127167630057804,0.6093950923910053,0.19316363334655762,0.0
3,0,RandomForest,0,0.6,0.5375722543352601,0.5796499174725646,1.4680745601654053,0.0
4,0,AdaBoost (Discrete),0,0.6,0.7109826589595376,0.618493283792243,112.94933438301086,0.0
5,0,AdaBoost (Real),0,0.6,0.6358381502890174,0.6915925896742248,135.08146262168884,0.0
6,0,Logistic Regression (Penalty = L2),0,0.6,0.6242774566473989,0.41657530019889466,1.8788695335388184,0.0
7,0,Naive Bayes,0,0.6,0.21965317919075145,0.3991668535408312,0.7198688983917236,0.0
8,0,KNeighbors Classifier,1,0.6,0.6369047619047619,0.5664961382854188,1.774388313293457,0.0
9,0,SVC Classifier,1,0.6,0.5119047619047619,1.0,1.7903685569763184,0.0
10,0,Decision Tree,1,0.6,0.5892857142857143,0.6510817288395448,0.1762676239013672,0.0
11,0,RandomForest,1,0.6,0.5535714285714286,0.5773502691896257,1.2378666400909424,0.0
12,0,AdaBoost (Discrete),1,0.6,0.6964285714285714,0.5892713994748093,131.23285508155823,0.0
13,0,AdaBoost (Real),1,0.6,0.6309523809523809,0.6801485289257873,103.55857181549072,0.0
14,0,Logistic Regression (Penalty = L2),1,0.6,0.6190476190476191,0.41114794122644704,1.7963709831237793,0.0
15,0,Naive Bayes,1,0.6,0.23809523809523808,0.3877804781532088,1.0729379653930664,0.0
16,0,KNeighbors Classifier,2,0.6,0.6625766871165644,0.6289780878693794,2.1864240169525146,0.0
17,0,SVC Classifier,2,0.6,0.5153374233128835,1.0,1.6240260601043701,0.0
18,0,Decision Tree,2,0.6,0.5766871165644172,0.5494954977472799,0.16024184226989746,0.0
19,0,RandomForest,2,0.6,0.5766871165644172,0.7032088234337139,1.1126198768615723,0.0
20,0,AdaBoost (Discrete),2,0.6,0.7239263803680982,0.6574835459990859,126.579843044281,0.0
21,0,AdaBoost (Real),2,0.6,0.6012269938650306,0.7642670032220177,135.3346836566925,0.0
22,0,Logistic Regression (Penalty = L2),2,0.6,0.6319018404907976,0.5452626609914888,2.018592119216919,0.0
23,0,Naive Bayes,2,0.6,0.25153374233128833,0.44843966287143294,0.610875129699707,0.0
24,1,KNeighbors Classifier,0,0.6,0.6358381502890174,0.5892742628811236,1.7810437679290771,0.0
25,1,SVC Classifier,0,0.6,0.49710982658959535,1.0,1.814073085784912,0.0
26,1,Decision Tree,0,0.6,0.5895953757225434,0.6162463141747001,0.1640636920928955,0.0
27,1,RandomForest,0,0.6,0.5606936416184971,0.42585363401752674,1.108863115310669,0.0
28,1,AdaBoost (Discrete),0,0.6,0.6994219653179191,0.6078713877660737,153.8625304698944,0.0
29,1,AdaBoost (Real),0,0.6,0.5895953757225434,0.4921781255673398,162.39908123016357,0.0
30,1,Logistic Regression (Penalty = L2),0,0.6,0.6069364161849711,0.48326631621890564,2.410020351409912,0.0
31,1,Naive Bayes,0,0.6,0.21965317919075145,0.3953617940849403,0.661968469619751,0.0
32,1,KNeighbors Classifier,1,0.6,0.6369047619047619,0.44079149620350394,1.9004311561584473,0.0
33,1,SVC Classifier,1,0.6,0.5119047619047619,1.0,1.8701896667480469,0.0
34,1,Decision Tree,1,0.6,0.5892857142857143,0.5387405496292014,0.0030908584594726562,0.0
35,1,RandomForest,1,0.6,0.5595238095238095,0.4323810083064347,1.1158313751220703,0.0
36,1,AdaBoost (Discrete),1,0.6,0.7261904761904762,0.5769355895137832,140.89419555664062,0.0
37,1,AdaBoost (Real),1,0.6,0.625,0.6500854941749944,158.56673765182495,0.0
38,1,Logistic Regression (Penalty = L2),1,0.6,0.6666666666666666,0.5850826905713153,2.341596841812134,0.0
39,1,Naive Bayes,1,0.6,0.23214285714285715,0.4961369444028485,0.6505718231201172,0.0
40,1,KNeighbors Classifier,2,0.6,0.5766871165644172,0.5934302757470766,1.6086206436157227,0.0
41,1,SVC Classifier,2,0.6,0.5153374233128835,1.0,1.6022145748138428,0.0
42,1,Decision Tree,2,0.6,0.5276073619631901,0.4897764951342139,0.15590953826904297,0.4897764951342139
43,1,RandomForest,2,0.6,0.5766871165644172,0.43104850719901067,1.2801451683044434,0.0
44,1,AdaBoost (Discrete),2,0.6,0.6871165644171779,0.6923819808027945,140.9456923007965,0.0
45,1,AdaBoost (Real),2,0.6,0.6196319018404908,0.6036820069137626,152.0686490535736,0.0
46,1,Logistic Regression (Penalty = L2),2,0.6,0.6687116564417178,0.6222697068491473,2.160114049911499,0.0
47,1,Naive Bayes,2,0.6,0.26993865030674846,0.47369883722309636,0.4572017192840576,0.0
48,2,KNeighbors Classifier,0,0.6,0.630057803468208,0.4494096871361152,1.798936367034912,0.0
49,2,SVC Classifier,0,0.6,0.5028901734104047,0.5227579585747102,2.0594170093536377,0.0
50,2,Decision Tree,0,0.6,0.6069364161849711,0.49950752947043414,0.15393900871276855,0.0
51,2,RandomForest,0,0.6,0.5491329479768786,0.42168460634274996,1.2264342308044434,0.0
52,2,AdaBoost (Discrete),0,0.6,0.7514450867052023,0.5992681159199252,192.21114897727966,0.0
53,2,AdaBoost (Real),0,0.6,0.6242774566473989,0.7244007043050418,207.41408705711365,0.0
54,2,Logistic Regression (Penalty = L2),0,0.6,0.6994219653179191,0.5845231328018459,4.166592836380005,0.0
55,2,Naive Bayes,0,0.6,0.27167630057803466,0.45839851919691516,0.5959463119506836,0.0
56,2,KNeighbors Classifier,1,0.6,0.6309523809523809,0.5803149470004322,1.6514005661010742,0.0
57,2,SVC Classifier,1,0.6,0.5178571428571429,0.5503212081491045,2.1275482177734375,0.0
58,2,Decision Tree,1,0.6,0.625,0.6901279180454466,0.19364094734191895,0.0
59,2,RandomForest,1,0.6,0.5595238095238095,0.6389431042462725,1.2270889282226562,0.0
60,2,AdaBoost (Discrete),1,0.6,0.7380952380952381,0.7241738015840934,203.66547775268555,0.0
61,2,AdaBoost (Real),1,0.6,0.6369047619047619,0.6650311594592255,200.71483063697815,0.0
62,2,Logistic Regression (Penalty = L2),1,0.6,0.7380952380952381,0.7543443631414877,4.073748350143433,0.0
63,2,Naive Bayes,1,0.6,0.27976190476190477,0.44930502961322183,0.7459352016448975,0.44930502961322183
64,2,KNeighbors Classifier,2,0.6,0.6809815950920245,0.7830422747848993,1.762080192565918,0.0
65,2,SVC Classifier,2,0.6,0.5214723926380368,0.5503212081491045,2.2374484539031982,0.0
66,2,Decision Tree,2,0.6,0.6196319018404908,0.6344833560798592,0.16925287246704102,0.0
67,2,RandomForest,2,0.6,0.5828220858895705,0.7050027468126489,1.1307058334350586,0.0
68,2,AdaBoost (Discrete),2,0.6,0.7484662576687117,0.5466141956696251,197.01986145973206,0.5466141956696251
69,2,AdaBoost (Real),2,0.6,0.5950920245398773,0.8001929082948045,212.4035496711731,0.0
70,2,Logistic Regression (Penalty = L2),2,0.6,0.754601226993865,0.7353515306029488,3.840303897857666,0.0
71,2,Naive Bayes,2,0.6,0.2883435582822086,0.5057746205271176,0.4571411609649658,0.0
72,3,KNeighbors Classifier,0,0.6,0.5953757225433526,0.5561991114194047,1.311497449874878,0.0
73,3,SVC Classifier,0,0.6,0.49710982658959535,1.0,1.3120195865631104,0.0
74,3,Decision Tree,0,0.6,0.5722543352601156,0.6242292514656257,0.14049220085144043,0.0
75,3,RandomForest,0,0.6,0.5491329479768786,0.6434588841607617,1.1637260913848877,0.0
76,3,AdaBoost (Discrete),0,0.6,0.6994219653179191,0.6780553354806079,104.86504006385803,0.0
77,3,AdaBoost (Real),0,0.6,0.6647398843930635,0.7482392084546236,122.94057989120483,0.0
78,3,Logistic Regression (Penalty = L2),0,0.6,0.5317919075144508,0.32011247998491643,1.6504652500152588,0.0
79,3,Naive Bayes,0,0.6,0.2254335260115607,0.3659289836359019,0.4334266185760498,0.0
80,3,KNeighbors Classifier,1,0.6,0.5773809523809523,0.5564373751694582,1.742746353149414,0.0
81,3,SVC Classifier,1,0.6,0.5119047619047619,1.0,1.451951503753662,0.0
82,3,Decision Tree,1,0.6,0.5654761904761905,0.6917453886930756,0.15476274490356445,0.0
83,3,RandomForest,1,0.6,0.5416666666666666,0.4591497693322866,1.258479118347168,0.0
84,3,AdaBoost (Discrete),1,0.6,0.7142857142857143,0.7512907526862476,105.77937841415405,0.0
85,3,AdaBoost (Real),1,0.6,0.6309523809523809,0.5562019569128526,115.06014633178711,0.0
86,3,Logistic Regression (Penalty = L2),1,0.6,0.5297619047619048,0.3860973950960897,1.3500053882598877,0.0
87,3,Naive Bayes,1,0.6,0.2261904761904762,0.48617381734197573,0.5478909015655518,0.0
88,3,KNeighbors Classifier,2,0.6,0.5950920245398773,0.5426250684273143,1.4252820014953613,0.0
89,3,SVC Classifier,2,0.6,0.5153374233128835,1.0,1.345367193222046,0.0
90,3,Decision Tree,2,0.6,0.6441717791411042,0.5782308419817472,0.14330744743347168,0.0
91,3,RandomForest,2,0.6,0.5521472392638037,0.5721248424548514,1.0893752574920654,0.0
92,3,AdaBoost (Discrete),2,0.6,0.7361963190184049,0.6815711541524636,106.1619176864624,0.0
93,3,AdaBoost (Real),2,0.6,0.588957055214724,0.6534284421998113,109.74911427497864,0.0
94,3,Logistic Regression (Penalty = L2),2,0.6,0.558282208588957,0.32667368166555855,1.2857027053833008,0.0
95,3,Naive Bayes,2,0.6,0.27607361963190186,0.43069942983990084,0.44214653968811035,0.43069942983990084
96,4,KNeighbors Classifier,0,0.6,0.6473988439306358,0.5991226911801293,0.785334587097168,0.0
97,4,SVC Classifier,0,0.6,0.49710982658959535,1.0,0.742539644241333,0.0
98,4,Decision Tree,0,0.6,0.5838150289017341,0.6749713389292756,0.00275421142578125,0.0
99,4,RandomForest,0,0.6,0.5433526011560693,0.4528643556819756,1.1753718852996826,0.0
100,4,AdaBoost (Discrete),0,0.6,0.6878612716763006,0.6751275571513959,88.20762777328491,0.0
101,4,AdaBoost (Real),0,0.6,0.6358381502890174,0.6745525050508107,94.63086652755737,0.0
102,4,Logistic Regression (Penalty = L2),0,0.6,0.6184971098265896,0.45659006353492804,1.460113286972046,0.0
103,4,Naive Bayes,0,0.6,0.21965317919075145,0.3480985288405178,0.3667452335357666,0.0
104,4,KNeighbors Classifier,1,0.6,0.6666666666666666,0.7250910179127794,0.647620677947998,0.0
105,4,SVC Classifier,1,0.6,0.5119047619047619,1.0,0.6766650676727295,0.0
106,4,Decision Tree,1,0.6,0.5714285714285714,0.6421798908093777,0.12402582168579102,0.0
107,4,RandomForest,1,0.6,0.5595238095238095,0.50525425818795,0.9909012317657471,0.0
108,4,AdaBoost (Discrete),1,0.6,0.7261904761904762,0.6244880062066824,87.17619848251343,0.0
109,4,AdaBoost (Real),1,0.6,0.6011904761904762,0.7183584284940154,94.01044344902039,0.0
110,4,Logistic Regression (Penalty = L2),1,0.6,0.6190476190476191,0.45062024206556706,1.1568517684936523,0.0
111,4,Naive Bayes,1,0.6,0.25,0.4041963080025231,0.24123597145080566,0.0
112,4,KNeighbors Classifier,2,0.6,0.6625766871165644,0.5913079679015649,0.6045727729797363,0.0
113,4,SVC Classifier,2,0.6,0.5153374233128835,1.0,0.888577938079834,0.0
114,4,Decision Tree,2,0.6,0.5398773006134969,0.5428211618832615,0.15181565284729004,0.0
115,4,RandomForest,2,0.6,0.5705521472392638,0.5884307860887648,1.0693550109863281,0.0
116,4,AdaBoost (Discrete),2,0.6,0.6809815950920245,0.7074698775000721,81.67164349555969,0.0
117,4,AdaBoost (Real),2,0.6,0.5950920245398773,0.8088790809169033,100.62161111831665,0.0
118,4,Logistic Regression (Penalty = L2),2,0.6,0.6319018404907976,0.5452626609914888,1.1835789680480957,0.0
119,4,Naive Bayes,2,0.6,0.22699386503067484,0.4808080915628701,0.4337294101715088,0.0
120,5,KNeighbors Classifier,0,0.6,0.6473988439306358,0.6020747492277502,0.7059483528137207,0.0
121,5,SVC Classifier,0,0.6,0.49710982658959535,1.0,0.8718166351318359,0.0
122,5,Decision Tree,0,0.6,0.5491329479768786,0.532473293558788,0.14025330543518066,0.0
123,5,RandomForest,0,0.6,0.5491329479768786,0.6042750794713536,1.1314923763275146,0.0
124,5,AdaBoost (Discrete),0,0.6,0.6705202312138728,0.5943795029325221,107.47009038925171,0.0
125,5,AdaBoost (Real),0,0.6,0.6011560693641619,0.6626055043117666,112.43950629234314,0.0
126,5,Logistic Regression (Penalty = L2),0,0.6,0.6011560693641619,0.44315716591736365,1.6698744297027588,0.0
127,5,Naive Bayes,0,0.6,0.23699421965317918,0.4751285560567011,0.26452183723449707,0.0
128,5,KNeighbors Classifier,1,0.6,0.625,0.49819240185245706,0.5699849128723145,0.0
129,5,SVC Classifier,1,0.6,0.5119047619047619,1.0,0.8685953617095947,0.0
130,5,Decision Tree,1,0.6,0.4583333333333333,0.5951339578978183,0.12462878227233887,0.0
131,5,RandomForest,1,0.6,0.5476190476190477,0.575581947444966,1.046630859375,0.0
132,5,AdaBoost (Discrete),1,0.6,0.6785714285714286,0.7456173885220759,108.29273843765259,0.0
133,5,AdaBoost (Real),1,0.6,0.5773809523809523,0.5352893797612441,133.4229075908661,0.0
134,5,Logistic Regression (Penalty = L2),1,0.6,0.6666666666666666,0.5850826905713153,2.0677664279937744,0.0
135,5,Naive Bayes,1,0.6,0.2857142857142857,0.4401665996800022,0.5340211391448975,0.4401665996800022
136,5,KNeighbors Classifier,2,0.6,0.5644171779141104,0.5728860567941487,0.5876779556274414,0.0
137,5,SVC Classifier,2,0.6,0.5153374233128835,1.0,0.7104387283325195,0.0
138,5,Decision Tree,2,0.6,0.5521472392638037,0.44166498462253195,0.42481088638305664,0.44166498462253195
139,5,RandomForest,2,0.6,0.5705521472392638,0.7288434092860623,0.7692174911499023,0.0
140,5,AdaBoost (Discrete),2,0.6,0.6871165644171779,0.616224302440263,86.89875340461731,0.0
141,5,AdaBoost (Real),2,0.6,0.5705521472392638,0.5518219164354131,94.26957035064697,0.0
142,5,Logistic Regression (Penalty = L2),2,0.6,0.6503067484662577,0.5859911013665479,1.4377434253692627,0.0
143,5,Naive Bayes,2,0.6,0.3128834355828221,0.49363992836372833,0.35543084144592285,0.49363992836372833
144,6,KNeighbors Classifier,0,0.6,0.6416184971098265,0.6370439462453666,1.4270339012145996,0.0
145,6,SVC Classifier,0,0.6,0.49710982658959535,1.0,1.3322415351867676,0.0
146,6,Decision Tree,0,0.6,0.6589595375722543,0.631695247573559,0.11954903602600098,0.0
147,6,RandomForest,0,0.6,0.5260115606936416,0.4657072167363803,0.933380126953125,0.0
148,6,AdaBoost (Discrete),0,0.6,0.6994219653179191,0.6614585777626748,95.75236821174622,0.0
149,6,AdaBoost (Real),0,0.6,0.6011560693641619,0.5765670966876678,108.98062539100647,0.0
150,6,Logistic Regression (Penalty = L2),0,0.6,0.6589595375722543,0.5033773590615463,1.664937973022461,0.0
151,6,Naive Bayes,0,0.6,0.23121387283236994,0.38259785858810896,0.42347121238708496,0.0
152,6,KNeighbors Classifier,1,0.6,0.6488095238095238,0.5941896051338855,1.4009342193603516,0.0
153,6,SVC Classifier,1,0.6,0.5119047619047619,1.0,1.378899097442627,0.0
154,6,Decision Tree,1,0.6,0.6190476190476191,0.5508943831140456,0.10491538047790527,0.0
155,6,RandomForest,1,0.6,0.5714285714285714,0.7259795291154771,0.6957073211669922,0.0
156,6,AdaBoost (Discrete),1,0.6,0.7083333333333334,0.5610681892850408,96.42236661911011,0.0
157,6,AdaBoost (Real),1,0.6,0.625,0.6500854941749944,100.10559105873108,0.0
158,6,Logistic Regression (Penalty = L2),1,0.6,0.7023809523809523,0.617459497865768,1.5750923156738281,0.0
159,6,Naive Bayes,1,0.6,0.25,0.504058227400338,0.4337599277496338,0.0
160,6,KNeighbors Classifier,2,0.6,0.6257668711656442,0.6588758417345824,1.1037113666534424,0.0
161,6,SVC Classifier,2,0.6,0.5153374233128835,1.0,1.337611198425293,0.0
162,6,Decision Tree,2,0.6,0.5153374233128835,0.5580767647660678,0.10420703887939453,0.0
163,6,RandomForest,2,0.6,0.5460122699386503,0.7508319202957374,0.7829835414886475,0.0
164,6,AdaBoost (Discrete),2,0.6,0.7361963190184049,0.751053640572739,88.57436037063599,0.0
165,6,AdaBoost (Real),2,0.6,0.6319018404907976,0.6635321613801118,93.88155174255371,0.0
166,6,Logistic Regression (Penalty = L2),2,0.6,0.6809815950920245,0.6909521104107306,1.4388768672943115,0.0
167,6,Naive Bayes,2,0.6,0.26993865030674846,0.41648014127460825,0.3768632411956787,0.41648014127460825
168,7,KNeighbors Classifier,0,0.6,0.630057803468208,0.4494096871361152,1.509031057357788,0.0
169,7,SVC Classifier,0,0.6,0.5028901734104047,0.5227579585747102,1.8755261898040771,0.0
170,7,Decision Tree,0,0.6,0.6878612716763006,0.5804219253214047,0.09465312957763672,0.0
171,7,RandomForest,0,0.6,0.5375722543352601,0.5117240157381622,0.7149631977081299,0.0
172,7,AdaBoost (Discrete),0,0.6,0.7341040462427746,0.6042773164383831,132.62745928764343,0.0
173,7,AdaBoost (Real),0,0.6,0.6242774566473989,0.7244007043050418,142.48607087135315,0.0
174,7,Logistic Regression (Penalty = L2),0,0.6,0.7052023121387283,0.589677867306434,2.9251232147216797,0.0
175,7,Naive Bayes,0,0.6,0.2543352601156069,0.47940824030713286,0.5386407375335693,0.0
176,7,KNeighbors Classifier,1,0.6,0.6309523809523809,0.5803149470004322,1.7497239112854004,0.0
177,7,SVC Classifier,1,0.6,0.5178571428571429,0.5503212081491045,1.8677773475646973,0.0
178,7,Decision Tree,1,0.6,0.5833333333333334,0.5770421920008452,0.09383010864257812,0.0
179,7,RandomForest,1,0.6,0.5595238095238095,0.6192596340984008,0.6654927730560303,0.0
180,7,AdaBoost (Discrete),1,0.6,0.7202380952380952,0.7019356950326877,131.1272132396698,0.0
181,7,AdaBoost (Real),1,0.6,0.6309523809523809,0.6563300788860192,137.4488275051117,0.0
182,7,Logistic Regression (Penalty = L2),1,0.6,0.7380952380952381,0.7581388044181021,2.898336172103882,0.0
183,7,Naive Bayes,1,0.6,0.25595238095238093,0.4410714231202338,0.4614861011505127,0.0
184,7,KNeighbors Classifier,2,0.6,0.6809815950920245,0.7830422747848993,1.4264538288116455,0.0
185,7,SVC Classifier,2,0.6,0.5214723926380368,0.5503212081491045,1.9322938919067383,0.0
186,7,Decision Tree,2,0.6,0.6625766871165644,0.6828915645703256,0.0976557731628418,0.0
187,7,RandomForest,2,0.6,0.5766871165644172,0.7247796636776955,0.7645692825317383,0.0
188,7,AdaBoost (Discrete),2,0.6,0.7423312883435583,0.6239558804021469,125.12826228141785,0.0
189,7,AdaBoost (Real),2,0.6,0.6319018404907976,0.8529286505232769,126.61843252182007,0.0
190,7,Logistic Regression (Penalty = L2),2,0.6,0.7423312883435583,0.733627263857939,2.7297935485839844,0.0
191,7,Naive Bayes,2,0.6,0.2822085889570552,0.48870614528562994,0.4357011318206787,0.0
192,8,KNeighbors Classifier,0,0.6,0.6011560693641619,0.4394580498223171,0.3513913154602051,0.0
193,8,SVC Classifier,0,0.6,0.49710982658959535,1.0,0.43599843978881836,0.0
194,8,Decision Tree,0,0.6,0.5260115606936416,0.5377977101613782,0.0836794376373291,0.0
195,8,RandomForest,0,0.6,0.5491329479768786,0.6042750794713536,0.6126558780670166,0.0
196,8,AdaBoost (Discrete),0,0.6,0.6358381502890174,0.558370760342582,52.48716187477112,0.0
197,8,AdaBoost (Real),0,0.6,0.5491329479768786,0.35207906937863276,60.95988655090332,0.0
198,8,Logistic Regression (Penalty = L2),0,0.6,0.5144508670520231,0.223703282070684,0.7224929332733154,0.0
199,8,Naive Bayes,0,0.6,0.2254335260115607,0.4293271152250876,0.17759037017822266,0.0
200,8,KNeighbors Classifier,1,0.6,0.6190476190476191,0.5531599200890269,0.4580075740814209,0.0
201,8,SVC Classifier,1,0.6,0.5119047619047619,1.0,0.4617166519165039,0.0
202,8,Decision Tree,1,0.6,0.5535714285714286,0.679219252672646,0.06852126121520996,0.0
203,8,RandomForest,1,0.6,0.5535714285714286,0.6646247845960803,0.7670855522155762,0.0
204,8,AdaBoost (Discrete),1,0.6,0.6785714285714286,0.7214197721341126,52.25851631164551,0.0
205,8,AdaBoost (Real),1,0.6,0.5476190476190477,0.3470747221888375,60.55606508255005,0.0
206,8,Logistic Regression (Penalty = L2),1,0.6,0.5297619047619048,0.3860973950960897,0.6131079196929932,0.0
207,8,Naive Bayes,1,0.6,0.26785714285714285,0.41890441943262385,0.21351099014282227,0.41890441943262385
208,8,KNeighbors Classifier,2,0.6,0.6257668711656442,0.5460709492206627,0.43718528747558594,0.0
209,8,SVC Classifier,2,0.6,0.5153374233128835,1.0,0.454270601272583,0.0
210,8,Decision Tree,2,0.6,0.5521472392638037,0.6909746421538102,0.10725283622741699,0.0
211,8,RandomForest,2,0.6,0.558282208588957,0.7242447986095324,0.7200191020965576,0.0
212,8,AdaBoost (Discrete),2,0.6,0.6503067484662577,0.6489592314415971,54.14177846908569,0.0
213,8,AdaBoost (Real),2,0.6,0.48466257668711654,0.43952135193108144,58.637306213378906,0.0
214,8,Logistic Regression (Penalty = L2),2,0.6,0.5521472392638037,0.3388054567002404,0.7231254577636719,0.0
215,8,Naive Bayes,2,0.6,0.2822085889570552,0.41648014127460825,0.25666308403015137,0.41648014127460825
