,feat_set_id,classifier,fold_id,feat_th,score,geo_score,exec_t,geo_score_woz
0,0,KNeighbors Classifier,0,0.4,0.7647058823529411,0.3051845274712292,0.25740504264831543,0.0
1,0,SVC Classifier,0,0.4,0.7607843137254902,1.0,0.17504191398620605,0.0
2,0,Decision Tree,0,0.4,0.7725490196078432,0.28514649594268227,0.002626180648803711,0.0
3,0,RandomForest,0,0.4,0.7607843137254902,1.0,0.46718335151672363,0.0
4,0,AdaBoost (Discrete),0,0.4,0.7725490196078432,0.28514649594268227,28.344911813735962,0.0
5,0,AdaBoost (Real),0,0.4,0.7215686274509804,0.3962128245746799,44.09353423118591,0.0
6,0,Logistic Regression (Penalty = L2),0,0.4,0.7725490196078432,0.28514649594268227,0.25519275665283203,0.0
7,0,Naive Bayes,0,0.4,0.058823529411764705,0.4641588833612779,0.08158326148986816,0.0
8,0,KNeighbors Classifier,1,0.4,0.78,0.32127586985818757,0.1667177677154541,0.0
9,0,SVC Classifier,1,0.4,0.776,1.0,0.23842644691467285,0.0
10,0,Decision Tree,1,0.4,0.792,0.33075917348094774,0.0013775825500488281,0.0
11,0,RandomForest,1,0.4,0.776,1.0,0.6626925468444824,0.0
12,0,AdaBoost (Discrete),1,0.4,0.788,0.3750873119988622,30.002745151519775,0.0
13,0,AdaBoost (Real),1,0.4,0.724,0.31331174982534515,40.260577917099,0.0
14,0,Logistic Regression (Penalty = L2),1,0.4,0.784,0.2853751021838173,0.22980308532714844,0.0
15,0,Naive Bayes,1,0.4,0.052,0.47428812195586234,0.15896272659301758,0.0
16,0,KNeighbors Classifier,2,0.4,0.8065843621399177,0.43603844046495843,0.2439126968383789,0.0
17,0,SVC Classifier,2,0.4,0.7983539094650206,1.0,0.16431713104248047,0.0
18,0,Decision Tree,2,0.4,0.7983539094650206,0.4488613467085362,0.07360506057739258,0.0
19,0,RandomForest,2,0.4,0.7901234567901234,0.6997790520224827,0.5036234855651855,0.0
20,0,AdaBoost (Discrete),2,0.4,0.8106995884773662,0.4506320372839949,31.677656173706055,0.0
21,0,AdaBoost (Real),2,0.4,0.7448559670781894,0.5337527128091236,45.15394306182861,0.0
22,0,Logistic Regression (Penalty = L2),2,0.4,0.8024691358024691,0.44945390423181414,0.30859851837158203,0.0
23,0,Naive Bayes,2,0.4,0.04938271604938271,0.7825422900366437,0.2079930305480957,0.0
24,1,KNeighbors Classifier,0,0.4,0.788235294117647,0.5635944975721588,0.19572210311889648,0.0
25,1,SVC Classifier,0,0.4,0.7607843137254902,1.0,0.18400120735168457,0.0
26,1,Decision Tree,0,0.4,0.8156862745098039,0.7588208833164475,0.09464597702026367,0.0
27,1,RandomForest,0,0.4,0.7607843137254902,1.0,0.6703362464904785,0.0
28,1,AdaBoost (Discrete),0,0.4,0.6666666666666666,0.38270560617775207,38.748963594436646,0.0
29,1,AdaBoost (Real),0,0.4,0.611764705882353,0.36834947880011215,63.61149883270264,0.0
30,1,Logistic Regression (Penalty = L2),0,0.4,0.7568627450980392,0.9948453608247423,0.35695385932922363,0.0
31,1,Naive Bayes,0,0.4,0.09411764705882353,0.27366863172854883,0.12173247337341309,0.0
32,1,KNeighbors Classifier,1,0.4,0.724,0.6449169479255721,0.24503040313720703,0.0
33,1,SVC Classifier,1,0.4,0.776,1.0,0.34319448471069336,0.0
34,1,Decision Tree,1,0.4,0.8,0.6990745556223098,0.001605987548828125,0.0
35,1,RandomForest,1,0.4,0.776,1.0,0.7087550163269043,0.0
36,1,AdaBoost (Discrete),1,0.4,0.648,0.5226401299851532,44.62463188171387,0.0
37,1,AdaBoost (Real),1,0.4,0.492,0.4930027520117975,56.896296977996826,0.0
38,1,Logistic Regression (Penalty = L2),1,0.4,0.776,0.446059493974681,0.2946808338165283,0.0
39,1,Naive Bayes,1,0.4,0.072,0.23934187951582503,0.09907770156860352,0.0
40,1,KNeighbors Classifier,2,0.4,0.8106995884773662,0.6563609990586187,0.28281283378601074,0.0
41,1,SVC Classifier,2,0.4,0.7983539094650206,1.0,0.20247364044189453,0.0
42,1,Decision Tree,2,0.4,0.8353909465020576,0.7955024051351325,0.10643625259399414,0.0
43,1,RandomForest,2,0.4,0.7983539094650206,1.0,0.7046704292297363,0.0
44,1,AdaBoost (Discrete),2,0.4,0.6255144032921811,0.5174949943679849,41.12907028198242,0.0
45,1,AdaBoost (Real),2,0.4,0.6995884773662552,0.5372706895173354,55.12881684303284,0.0
46,1,Logistic Regression (Penalty = L2),2,0.4,0.7777777777777778,0.4922073153023159,0.3118410110473633,0.0
47,1,Naive Bayes,2,0.4,0.07818930041152264,0.415623132903698,0.21064448356628418,0.0
48,2,KNeighbors Classifier,0,0.4,0.7411764705882353,0.3087060741762904,0.31209492683410645,0.0
49,2,SVC Classifier,0,0.4,0.7607843137254902,1.0,0.31301236152648926,0.0
50,2,Decision Tree,0,0.4,0.7686274509803922,0.4394967226043702,0.10211563110351562,0.0
51,2,RandomForest,0,0.4,0.7607843137254902,1.0,0.7662656307220459,0.0
52,2,AdaBoost (Discrete),0,0.4,0.7647058823529411,0.2620113175395233,40.173394441604614,0.0
53,2,AdaBoost (Real),0,0.4,0.7647058823529411,0.2871896358074587,55.08479356765747,0.0
54,2,Logistic Regression (Penalty = L2),0,0.4,0.7647058823529411,0.3443764139406855,0.22498703002929688,0.0
55,2,Naive Bayes,0,0.4,0.0392156862745098,0.28573809127083305,0.11297821998596191,0.0
56,2,KNeighbors Classifier,1,0.4,0.78,0.4472135954999579,0.3372023105621338,0.0
57,2,SVC Classifier,1,0.4,0.776,1.0,0.2235424518585205,0.0
58,2,Decision Tree,1,0.4,0.796,0.44663617196473115,0.10608291625976562,0.0
59,2,RandomForest,1,0.4,0.776,1.0,0.7281920909881592,0.0
60,2,AdaBoost (Discrete),1,0.4,0.772,0.4061384660534476,41.96623659133911,0.0
61,2,AdaBoost (Real),1,0.4,0.784,0.4047822312576163,57.483306884765625,0.0
62,2,Logistic Regression (Penalty = L2),1,0.4,0.776,0.4071947447321208,0.3353579044342041,0.0
63,2,Naive Bayes,1,0.4,0.044,0.17186787701041736,0.22867608070373535,0.0
64,2,KNeighbors Classifier,2,0.4,0.7942386831275721,0.579735671095731,0.33698177337646484,0.0
65,2,SVC Classifier,2,0.4,0.7983539094650206,1.0,0.3378560543060303,0.0
66,2,Decision Tree,2,0.4,0.8024691358024691,0.504826569069606,0.12234330177307129,0.0
67,2,RandomForest,2,0.4,0.7942386831275721,0.7016181591415044,0.6915721893310547,0.0
68,2,AdaBoost (Discrete),2,0.4,0.7901234567901234,0.6997790520224827,42.79301190376282,0.0
69,2,AdaBoost (Real),2,0.4,0.8106995884773662,0.5099936537848853,58.826157331466675,0.0
70,2,Logistic Regression (Penalty = L2),2,0.4,0.7942386831275721,0.5455521537286048,0.222090482711792,0.0
71,2,Naive Bayes,2,0.4,0.053497942386831275,0.2447172055348498,0.21454596519470215,0.0
72,3,KNeighbors Classifier,0,0.4,0.7647058823529411,0.2620113175395233,0.43418216705322266,0.0
73,3,SVC Classifier,0,0.4,0.7607843137254902,1.0,0.21484732627868652,0.0
74,3,Decision Tree,0,0.4,0.7686274509803922,0.2848488475943904,0.001810312271118164,0.0
75,3,RandomForest,0,0.4,0.7607843137254902,1.0,0.7572996616363525,0.0
76,3,AdaBoost (Discrete),0,0.4,0.7686274509803922,0.3261165666552968,41.956631898880005,0.0
77,3,AdaBoost (Real),0,0.4,0.7647058823529411,0.3838431694704549,56.091031551361084,0.0
78,3,Logistic Regression (Penalty = L2),0,0.4,0.7725490196078432,0.28514649594268227,0.22616147994995117,0.0
79,3,Naive Bayes,0,0.4,0.043137254901960784,0.3670977715849853,0.20026254653930664,0.0
80,3,KNeighbors Classifier,1,0.4,0.788,0.49239345894554554,0.32537841796875,0.0
81,3,SVC Classifier,1,0.4,0.776,1.0,0.24059009552001953,0.0
82,3,Decision Tree,1,0.4,0.788,0.28574404296988,0.10634636878967285,0.0
83,3,RandomForest,1,0.4,0.776,1.0,0.7565085887908936,0.0
84,3,AdaBoost (Discrete),1,0.4,0.78,0.32127586985818757,41.746906042099,0.0
85,3,AdaBoost (Real),1,0.4,0.78,0.32127586985818757,63.26787567138672,0.0
86,3,Logistic Regression (Penalty = L2),1,0.4,0.784,0.2853751021838173,0.26251959800720215,0.0
87,3,Naive Bayes,1,0.4,0.04,0.33144540173399867,0.18747258186340332,0.0
88,3,KNeighbors Classifier,2,0.4,0.7777777777777778,0.36391779603417973,0.4834611415863037,0.0
89,3,SVC Classifier,2,0.4,0.7983539094650206,1.0,0.5139009952545166,0.0
90,3,Decision Tree,2,0.4,0.7942386831275721,0.4482664330796787,0.0013120174407958984,0.0
91,3,RandomForest,2,0.4,0.7901234567901234,0.6997790520224827,1.082859754562378,0.0
92,3,AdaBoost (Discrete),2,0.4,0.7942386831275721,0.49653968151942107,48.034321784973145,0.0
93,3,AdaBoost (Real),2,0.4,0.8065843621399177,0.43603844046495843,66.98716998100281,0.0
94,3,Logistic Regression (Penalty = L2),2,0.4,0.8024691358024691,0.44945390423181414,0.2828364372253418,0.0
95,3,Naive Bayes,2,0.4,0.03292181069958848,0.6299605249474366,0.399036169052124,0.0
96,4,KNeighbors Classifier,0,0.4,0.7607843137254902,1.0,0.3230257034301758,0.0
97,4,SVC Classifier,0,0.4,0.7607843137254902,1.0,0.18146228790283203,0.0
98,4,Decision Tree,0,0.4,0.7647058823529411,0.408248290463863,0.16566801071166992,0.0
99,4,RandomForest,0,0.4,0.7607843137254902,1.0,0.9659948348999023,0.0
100,4,AdaBoost (Discrete),0,0.4,0.7647058823529411,0.408248290463863,49.45165824890137,0.0
101,4,AdaBoost (Real),0,0.4,0.7647058823529411,0.408248290463863,100.31012010574341,0.0
102,4,Logistic Regression (Penalty = L2),0,0.4,0.7607843137254902,1.0,0.38498687744140625,0.0
103,4,Naive Bayes,0,0.4,0.0196078431372549,0.2554364774645177,0.37935566902160645,0.0
104,4,KNeighbors Classifier,1,0.4,0.776,1.0,0.4004182815551758,0.0
105,4,SVC Classifier,1,0.4,0.776,1.0,0.40828657150268555,0.0
106,4,Decision Tree,1,0.4,0.78,0.4472135954999579,0.002107858657836914,0.0
107,4,RandomForest,1,0.4,0.776,1.0,1.2982516288757324,0.0
108,4,AdaBoost (Discrete),1,0.4,0.776,1.0,71.0295979976654,0.0
109,4,AdaBoost (Real),1,0.4,0.776,0.446059493974681,99.42414689064026,0.0
110,4,Logistic Regression (Penalty = L2),1,0.4,0.776,1.0,0.405933141708374,0.0
111,4,Naive Bayes,1,0.4,0.024,0.408248290463863,0.40716004371643066,0.0
112,4,KNeighbors Classifier,2,0.4,0.7942386831275721,0.9948453608247423,0.3485708236694336,0.0
113,4,SVC Classifier,2,0.4,0.7983539094650206,1.0,0.42856574058532715,0.0
114,4,Decision Tree,2,0.4,0.7942386831275721,0.9948453608247423,0.0020055770874023438,0.0
115,4,RandomForest,2,0.4,0.7983539094650206,1.0,1.2205913066864014,0.0
116,4,AdaBoost (Discrete),2,0.4,0.7942386831275721,0.9948453608247423,73.72338509559631,0.0
117,4,AdaBoost (Real),2,0.4,0.7983539094650206,1.0,100.0177550315857,0.0
118,4,Logistic Regression (Penalty = L2),2,0.4,0.7983539094650206,1.0,0.43955111503601074,0.0
119,4,Naive Bayes,2,0.4,0.0205761316872428,0.5,0.22172188758850098,0.0
120,5,KNeighbors Classifier,0,0.4,0.7607843137254902,0.3769890791947507,0.4273850917816162,0.0
121,5,SVC Classifier,0,0.4,0.7607843137254902,1.0,0.18933558464050293,0.0
122,5,Decision Tree,0,0.4,0.7647058823529411,0.3838431694704549,0.16602444648742676,0.0
123,5,RandomForest,0,0.4,0.7607843137254902,1.0,1.342672348022461,0.0
124,5,AdaBoost (Discrete),0,0.4,0.7647058823529411,0.6308233860042737,75.59218406677246,0.0
125,5,AdaBoost (Real),0,0.4,0.7607843137254902,0.3769890791947507,99.05951809883118,0.0
126,5,Logistic Regression (Penalty = L2),0,0.4,0.7647058823529411,0.3838431694704549,0.43518829345703125,0.0
127,5,Naive Bayes,0,0.4,0.03529411764705882,0.32696253113310975,0.2460794448852539,0.0
128,5,KNeighbors Classifier,1,0.4,0.764,0.9845360824742269,0.45200252532958984,0.0
129,5,SVC Classifier,1,0.4,0.776,1.0,0.19282150268554688,0.0
130,5,Decision Tree,1,0.4,0.78,0.408248290463863,0.0012516975402832031,0.0
131,5,RandomForest,1,0.4,0.776,1.0,1.4422924518585205,0.0
132,5,AdaBoost (Discrete),1,0.4,0.776,0.4071947447321208,79.30597734451294,0.0
133,5,AdaBoost (Real),1,0.4,0.776,0.4071947447321208,78.4383339881897,0.0
134,5,Logistic Regression (Penalty = L2),1,0.4,0.78,0.408248290463863,0.21847796440124512,0.0
135,5,Naive Bayes,1,0.4,0.036,0.3760603093086394,0.2160499095916748,0.0
136,5,KNeighbors Classifier,2,0.4,0.7983539094650206,1.0,0.2164144515991211,0.0
137,5,SVC Classifier,2,0.4,0.7983539094650206,1.0,0.11023449897766113,0.0
138,5,Decision Tree,2,0.4,0.7942386831275721,0.5455521537286048,0.10596561431884766,0.0
139,5,RandomForest,2,0.4,0.7942386831275721,0.5455521537286048,0.7707979679107666,0.0
140,5,AdaBoost (Discrete),2,0.4,0.7901234567901234,0.6997790520224827,41.58304762840271,0.0
141,5,AdaBoost (Real),2,0.4,0.8024691358024691,0.5758603305272156,55.140862226486206,0.0
142,5,Logistic Regression (Penalty = L2),2,0.4,0.7942386831275721,0.5455521537286048,0.22901010513305664,0.0
143,5,Naive Bayes,2,0.4,0.037037037037037035,0.4518010018049224,0.1138463020324707,0.0
144,6,KNeighbors Classifier,0,0.4,0.7647058823529411,0.2620113175395233,0.31842613220214844,0.0
145,6,SVC Classifier,0,0.4,0.7607843137254902,1.0,0.12289214134216309,0.0
146,6,Decision Tree,0,0.4,0.7686274509803922,0.3261165666552968,0.11323690414428711,0.0
147,6,RandomForest,0,0.4,0.7647058823529411,0.4472135954999579,0.7619075775146484,0.0
148,6,AdaBoost (Discrete),0,0.4,0.7686274509803922,0.3261165666552968,39.375731229782104,0.0
149,6,AdaBoost (Real),0,0.4,0.7686274509803922,0.3261165666552968,78.31040906906128,0.0
150,6,Logistic Regression (Penalty = L2),0,0.4,0.7686274509803922,0.3261165666552968,0.3062410354614258,0.0
151,6,Naive Bayes,0,0.4,0.0392156862745098,0.447213595499958,0.10764598846435547,0.0
152,6,KNeighbors Classifier,1,0.4,0.788,0.49239345894554554,0.4161825180053711,0.0
153,6,SVC Classifier,1,0.4,0.776,1.0,0.3048737049102783,0.0
154,6,Decision Tree,1,0.4,0.784,0.3218297948685433,0.0022249221801757812,0.0
155,6,RandomForest,1,0.4,0.776,1.0,0.6293444633483887,0.0
156,6,AdaBoost (Discrete),1,0.4,0.78,0.32127586985818757,41.234227418899536,0.0
157,6,AdaBoost (Real),1,0.4,0.78,0.32127586985818757,59.43934941291809,0.0
158,6,Logistic Regression (Penalty = L2),1,0.4,0.784,0.3218297948685433,0.3501920700073242,0.0
159,6,Naive Bayes,1,0.4,0.04,0.33144540173399867,0.22046637535095215,0.0
160,6,KNeighbors Classifier,2,0.4,0.7818930041152263,0.36456533796210266,0.33724117279052734,0.0
161,6,SVC Classifier,2,0.4,0.7983539094650206,1.0,0.10675334930419922,0.0
162,6,Decision Tree,2,0.4,0.7942386831275721,0.4482664330796787,0.0014338493347167969,0.0
163,6,RandomForest,2,0.4,0.7901234567901234,0.6997790520224827,0.6552278995513916,0.0
164,6,AdaBoost (Discrete),2,0.4,0.7860082304526749,0.4948185130173913,42.46429109573364,0.0
165,6,AdaBoost (Real),2,0.4,0.8106995884773662,0.43679023236814946,55.3980598449707,0.0
166,6,Logistic Regression (Penalty = L2),2,0.4,0.8024691358024691,0.44945390423181414,0.323223352432251,0.0
167,6,Naive Bayes,2,0.4,0.03292181069958848,0.6299605249474366,0.21562528610229492,0.0
168,7,KNeighbors Classifier,0,0.4,0.7607843137254902,1.0,0.3312208652496338,0.0
169,7,SVC Classifier,0,0.4,0.7607843137254902,1.0,0.2232041358947754,0.0
170,7,Decision Tree,0,0.4,0.7647058823529411,0.408248290463863,0.0014312267303466797,0.0
171,7,RandomForest,0,0.4,0.7607843137254902,1.0,0.7464134693145752,0.0
172,7,AdaBoost (Discrete),0,0.4,0.7647058823529411,0.408248290463863,41.120675802230835,0.0
173,7,AdaBoost (Real),0,0.4,0.7647058823529411,0.408248290463863,54.20450568199158,0.0
174,7,Logistic Regression (Penalty = L2),0,0.4,0.7607843137254902,1.0,0.20764994621276855,0.0
175,7,Naive Bayes,0,0.4,0.03137254901960784,0.408248290463863,0.1090860366821289,0.0
176,7,KNeighbors Classifier,1,0.4,0.776,1.0,0.21776103973388672,0.0
177,7,SVC Classifier,1,0.4,0.776,1.0,0.10607361793518066,0.0
178,7,Decision Tree,1,0.4,0.78,0.4472135954999579,0.10222315788269043,0.0
179,7,RandomForest,1,0.4,0.776,1.0,0.8580062389373779,0.0
180,7,AdaBoost (Discrete),1,0.4,0.78,0.4472135954999579,40.369407653808594,0.0
181,7,AdaBoost (Real),1,0.4,0.78,0.4472135954999579,56.46101903915405,0.0
182,7,Logistic Regression (Penalty = L2),1,0.4,0.776,1.0,0.23627281188964844,0.0
183,7,Naive Bayes,1,0.4,0.032,0.10102047864498133,0.19109272956848145,0.0
184,7,KNeighbors Classifier,2,0.4,0.7860082304526749,0.9845360824742269,0.3549184799194336,0.0
185,7,SVC Classifier,2,0.4,0.7983539094650206,1.0,0.21119427680969238,0.0
186,7,Decision Tree,2,0.4,0.7983539094650206,1.0,0.001239776611328125,0.0
187,7,RandomForest,2,0.4,0.7983539094650206,1.0,0.5671021938323975,0.0
188,7,AdaBoost (Discrete),2,0.4,0.7983539094650206,1.0,43.60025477409363,0.0
189,7,AdaBoost (Real),2,0.4,0.7983539094650206,1.0,56.78894257545471,0.0
190,7,Logistic Regression (Penalty = L2),2,0.4,0.7983539094650206,1.0,0.11000347137451172,0.0
191,7,Naive Bayes,2,0.4,0.037037037037037035,0.12435400084345175,0.22317075729370117,0.0
192,8,KNeighbors Classifier,0,0.4,0.7607843137254902,1.0,0.2118520736694336,0.0
193,8,SVC Classifier,0,0.4,0.7607843137254902,1.0,0.11811494827270508,0.0
194,8,Decision Tree,0,0.4,0.7647058823529411,0.408248290463863,0.10616183280944824,0.0
195,8,RandomForest,0,0.4,0.7607843137254902,1.0,0.7509911060333252,0.0
196,8,AdaBoost (Discrete),0,0.4,0.7607843137254902,0.4071947447321208,41.38320279121399,0.0
197,8,AdaBoost (Real),0,0.4,0.7647058823529411,0.408248290463863,56.92286443710327,0.0
198,8,Logistic Regression (Penalty = L2),0,0.4,0.7607843137254902,1.0,0.2233562469482422,0.0
199,8,Naive Bayes,0,0.4,0.0196078431372549,0.2403749283845681,0.137709379196167,0.0
200,8,KNeighbors Classifier,1,0.4,0.776,1.0,0.3493180274963379,0.0
201,8,SVC Classifier,1,0.4,0.776,1.0,0.25066041946411133,0.0
202,8,Decision Tree,1,0.4,0.78,0.4472135954999579,0.11034655570983887,0.0
203,8,RandomForest,1,0.4,0.776,1.0,0.6420819759368896,0.0
204,8,AdaBoost (Discrete),1,0.4,0.78,0.4472135954999579,42.63418912887573,0.0
205,8,AdaBoost (Real),1,0.4,0.78,0.4472135954999579,50.5967276096344,0.0
206,8,Logistic Regression (Penalty = L2),1,0.4,0.776,1.0,0.19377470016479492,0.0
207,8,Naive Bayes,1,0.4,0.024,0.408248290463863,0.18947148323059082,0.0
208,8,KNeighbors Classifier,2,0.4,0.7983539094650206,1.0,0.19056129455566406,0.0
209,8,SVC Classifier,2,0.4,0.7983539094650206,1.0,0.1890730857849121,0.0
210,8,Decision Tree,2,0.4,0.7983539094650206,1.0,0.002077817916870117,0.0
211,8,RandomForest,2,0.4,0.7942386831275721,0.9948453608247423,0.6792752742767334,0.0
212,8,AdaBoost (Discrete),2,0.4,0.7942386831275721,0.9948453608247423,37.12307000160217,0.0
213,8,AdaBoost (Real),2,0.4,0.7942386831275721,0.9948453608247423,49.13389992713928,0.0
214,8,Logistic Regression (Penalty = L2),2,0.4,0.7983539094650206,1.0,0.19562315940856934,0.0
215,8,Naive Bayes,2,0.4,0.01646090534979424,1.0,0.18719816207885742,0.0
216,9,KNeighbors Classifier,0,0.4,0.7607843137254902,0.2866927669330738,0.3061389923095703,0.0
217,9,SVC Classifier,0,0.4,0.7607843137254902,1.0,0.1952989101409912,0.0
218,9,Decision Tree,0,0.4,0.7686274509803922,0.3115857230292383,0.09033465385437012,0.0
219,9,RandomForest,0,0.4,0.7607843137254902,1.0,0.4612162113189697,0.0
220,9,AdaBoost (Discrete),0,0.4,0.7647058823529411,0.3838431694704549,34.546239376068115,0.0
221,9,AdaBoost (Real),0,0.4,0.7607843137254902,0.3769890791947507,47.717230558395386,0.0
222,9,Logistic Regression (Penalty = L2),0,0.4,0.7647058823529411,0.3838431694704549,0.2813704013824463,0.0
223,9,Naive Bayes,0,0.4,0.0392156862745098,0.28573809127083305,0.0966496467590332,0.0
224,9,KNeighbors Classifier,1,0.4,0.788,0.7745966692414834,0.29091930389404297,0.0
225,9,SVC Classifier,1,0.4,0.776,1.0,0.19648194313049316,0.0
226,9,Decision Tree,1,0.4,0.78,0.32127586985818757,0.0021238327026367188,0.0
227,9,RandomForest,1,0.4,0.776,1.0,0.5834310054779053,0.0
228,9,AdaBoost (Discrete),1,0.4,0.776,0.4071947447321208,35.13995623588562,0.0
229,9,AdaBoost (Real),1,0.4,0.78,0.32127586985818757,49.44524359703064,0.0
230,9,Logistic Regression (Penalty = L2),1,0.4,0.78,0.408248290463863,0.28705906867980957,0.0
231,9,Naive Bayes,1,0.4,0.036,0.3760603093086394,0.1146693229675293,0.0
232,9,KNeighbors Classifier,2,0.4,0.7983539094650206,1.0,0.2906782627105713,0.0
233,9,SVC Classifier,2,0.4,0.7983539094650206,1.0,0.2965977191925049,0.0
234,9,Decision Tree,2,0.4,0.7942386831275721,0.5455521537286048,0.09417581558227539,0.0
235,9,RandomForest,2,0.4,0.7942386831275721,0.5455521537286048,0.5358011722564697,0.0
236,9,AdaBoost (Discrete),2,0.4,0.7942386831275721,0.5455521537286048,33.12914419174194,0.0
237,9,AdaBoost (Real),2,0.4,0.8024691358024691,0.5758603305272156,45.93034267425537,0.0
238,9,Logistic Regression (Penalty = L2),2,0.4,0.7942386831275721,0.5455521537286048,0.2741117477416992,0.0
239,9,Naive Bayes,2,0.4,0.037037037037037035,0.4518010018049224,0.18319463729858398,0.0
240,10,KNeighbors Classifier,0,0.4,0.7647058823529411,0.2620113175395233,0.32050609588623047,0.0
241,10,SVC Classifier,0,0.4,0.7607843137254902,1.0,0.18620800971984863,0.0
242,10,Decision Tree,0,0.4,0.7686274509803922,0.2848488475943904,0.09416508674621582,0.0
243,10,RandomForest,0,0.4,0.7607843137254902,1.0,0.6443338394165039,0.0
244,10,AdaBoost (Discrete),0,0.4,0.7686274509803922,0.2623518137972155,36.97420954704285,0.0
245,10,AdaBoost (Real),0,0.4,0.7686274509803922,0.3261165666552968,67.4937195777893,0.0
246,10,Logistic Regression (Penalty = L2),0,0.4,0.7725490196078432,0.28514649594268227,0.3337879180908203,0.0
247,10,Naive Bayes,0,0.4,0.043137254901960784,0.3670977715849853,0.17465734481811523,0.0
248,10,KNeighbors Classifier,1,0.4,0.788,0.49239345894554554,0.383228063583374,0.0
249,10,SVC Classifier,1,0.4,0.776,1.0,0.18479013442993164,0.0
250,10,Decision Tree,1,0.4,0.784,0.2853751021838173,0.09012269973754883,0.0
251,10,RandomForest,1,0.4,0.776,1.0,0.5787038803100586,0.0
252,10,AdaBoost (Discrete),1,0.4,0.78,0.32127586985818757,36.32715630531311,0.0
253,10,AdaBoost (Real),1,0.4,0.78,0.32127586985818757,52.313517570495605,0.0
254,10,Logistic Regression (Penalty = L2),1,0.4,0.784,0.2853751021838173,0.3568906784057617,0.0
255,10,Naive Bayes,1,0.4,0.044,0.16559340774040096,0.29598474502563477,0.0
256,10,KNeighbors Classifier,2,0.4,0.7860082304526749,0.36521058769422116,0.2978050708770752,0.0
257,10,SVC Classifier,2,0.4,0.7983539094650206,1.0,0.28755617141723633,0.0
258,10,Decision Tree,2,0.4,0.7942386831275721,0.4482664330796787,0.0019545555114746094,0.0
259,10,RandomForest,2,0.4,0.7901234567901234,0.6997790520224827,0.610358476638794,0.0
260,10,AdaBoost (Discrete),2,0.4,0.7942386831275721,0.49653968151942107,38.42280435562134,0.0
261,10,AdaBoost (Real),2,0.4,0.7942386831275721,0.49653968151942107,49.06820344924927,0.0
262,10,Logistic Regression (Penalty = L2),2,0.4,0.8024691358024691,0.44945390423181414,0.3633091449737549,0.0
263,10,Naive Bayes,2,0.4,0.04526748971193416,0.24935316404995922,0.17962217330932617,0.0
264,11,KNeighbors Classifier,0,0.4,0.7803921568627451,0.5168184330015749,0.18565702438354492,0.0
265,11,SVC Classifier,0,0.4,0.7607843137254902,1.0,0.31931495666503906,0.0
266,11,Decision Tree,0,0.4,0.8156862745098039,0.7773805203864741,0.09873294830322266,0.0
267,11,RandomForest,0,0.4,0.7607843137254902,1.0,0.7020761966705322,0.0
268,11,AdaBoost (Discrete),0,0.4,0.7058823529411765,0.6628133198601168,42.443989276885986,0.0
269,11,AdaBoost (Real),0,0.4,0.7372549019607844,0.3353425847183996,57.080732345581055,0.0
270,11,Logistic Regression (Penalty = L2),0,0.4,0.7607843137254902,0.2842497910855449,0.4579288959503174,0.0
271,11,Naive Bayes,0,0.4,0.11372549019607843,0.32706985808647315,0.20861434936523438,0.0
272,11,KNeighbors Classifier,1,0.4,0.76,0.6489487257402198,0.18270659446716309,0.0
273,11,SVC Classifier,1,0.4,0.776,1.0,0.34441328048706055,0.0
274,11,Decision Tree,1,0.4,0.808,0.8049348752788407,0.08694005012512207,0.0
275,11,RandomForest,1,0.4,0.776,1.0,0.5812759399414062,0.0
276,11,AdaBoost (Discrete),1,0.4,0.688,0.5538162685209681,38.78195118904114,0.0
277,11,AdaBoost (Real),1,0.4,0.7,0.27727381920052996,51.685511112213135,0.0
278,11,Logistic Regression (Penalty = L2),1,0.4,0.784,0.3300672026194222,0.6070261001586914,0.0
279,11,Naive Bayes,1,0.4,0.092,0.31544796096128963,0.22299814224243164,0.0
280,11,KNeighbors Classifier,2,0.4,0.8148148148148148,0.5657553518519117,0.3611724376678467,0.0
281,11,SVC Classifier,2,0.4,0.7983539094650206,1.0,0.44971776008605957,0.0
282,11,Decision Tree,2,0.4,0.8353909465020576,0.6817070254055768,0.11507487297058105,0.0
283,11,RandomForest,2,0.4,0.7983539094650206,0.703452458112659,0.6574575901031494,0.0
284,11,AdaBoost (Discrete),2,0.4,0.6625514403292181,0.626671448462949,41.39416146278381,0.0
285,11,AdaBoost (Real),2,0.4,0.6707818930041153,0.544096159486514,56.73106551170349,0.0
286,11,Logistic Regression (Penalty = L2),2,0.4,0.7942386831275721,0.4482664330796787,0.5076966285705566,0.0
287,11,Naive Bayes,2,0.4,0.09876543209876543,0.5290332514926492,0.20113611221313477,0.0
288,12,KNeighbors Classifier,0,0.4,0.7607843137254902,1.0,0.2524418830871582,0.0
289,12,SVC Classifier,0,0.4,0.7607843137254902,1.0,0.10134148597717285,0.0
290,12,Decision Tree,0,0.4,0.7607843137254902,1.0,0.10105085372924805,0.0
291,12,RandomForest,0,0.4,0.7450980392156863,0.979381443298969,0.6925957202911377,0.0
292,12,AdaBoost (Discrete),0,0.4,0.7607843137254902,1.0,37.13488721847534,0.0
293,12,AdaBoost (Real),0,0.4,0.7607843137254902,1.0,52.09171748161316,0.0
294,12,Logistic Regression (Penalty = L2),0,0.4,0.7607843137254902,1.0,0.20424270629882812,0.0
295,12,Naive Bayes,0,0.4,0.027450980392156862,1.0,0.18119263648986816,0.0
296,12,KNeighbors Classifier,1,0.4,0.768,0.9896907216494846,0.10389232635498047,0.0
297,12,SVC Classifier,1,0.4,0.776,1.0,0.12502694129943848,0.0
298,12,Decision Tree,1,0.4,0.776,1.0,0.10145807266235352,0.0
299,12,RandomForest,1,0.4,0.776,1.0,0.8061017990112305,0.0
300,12,AdaBoost (Discrete),1,0.4,0.776,1.0,36.027897119522095,0.0
301,12,AdaBoost (Real),1,0.4,0.776,1.0,46.27560591697693,0.0
302,12,Logistic Regression (Penalty = L2),1,0.4,0.776,1.0,0.25896620750427246,0.0
303,12,Naive Bayes,1,0.4,0.024,1.0,0.1945178508758545,0.0
304,12,KNeighbors Classifier,2,0.4,0.7983539094650206,1.0,0.1979377269744873,0.0
305,12,SVC Classifier,2,0.4,0.7983539094650206,1.0,0.10154151916503906,0.0
306,12,Decision Tree,2,0.4,0.7983539094650206,1.0,0.001173257827758789,0.0
307,12,RandomForest,2,0.4,0.7983539094650206,1.0,0.6979019641876221,0.0
308,12,AdaBoost (Discrete),2,0.4,0.7983539094650206,1.0,35.51482152938843,0.0
309,12,AdaBoost (Real),2,0.4,0.7983539094650206,1.0,46.82203984260559,0.0
310,12,Logistic Regression (Penalty = L2),2,0.4,0.7983539094650206,1.0,0.3708522319793701,0.0
311,12,Naive Bayes,2,0.4,0.024691358024691357,1.0,0.09953141212463379,0.0
