,feat_set_id,classifier,fold_id,feat_th,score,geo_score,exec_t,geo_score_woz
0,0,KNeighbors Classifier,0,0.7,0.5372446936323588,0.5397519587687444,19.315491199493408,0.5397519587687444
1,0,SVC Classifier,0,0.7,0.55126151381658,1.0,194.7650716304779,0.0
2,0,Decision Tree,0,0.7,0.5364437324789748,0.5312409752643984,1.1937077045440674,0.5312409752643984
3,0,RandomForest,0,0.7,0.5352422907488987,0.5377376807838424,2.4959702491760254,0.5377376807838424
4,0,AdaBoost (Discrete),0,0.7,0.5024028834601522,0.47555873208370336,310.8670959472656,0.47555873208370336
5,0,AdaBoost (Real),0,0.7,0.5434521425710853,0.5400608807527384,477.2663402557373,0.5400608807527384
6,0,Logistic Regression (Penalty = L2),0,0.7,0.5438526231477774,0.5239428919004026,2.009044885635376,0.5239428919004026
7,0,Naive Bayes,0,0.7,0.46235482579094916,0.17305238624530997,0.6294653415679932,0.17305238624530997
8,0,KNeighbors Classifier,1,0.7,0.4810735029040657,0.4822831687776503,28.869149684906006,0.4822831687776503
9,0,SVC Classifier,1,0.7,0.5509713599038654,0.9996366279069767,233.44575476646423,0.0
10,0,Decision Tree,1,0.7,0.4724614460244342,0.4749399641561332,1.3118607997894287,0.4749399641561332
11,0,RandomForest,1,0.7,0.4582415381534148,0.3961144992974336,2.802689790725708,0.3961144992974336
12,0,AdaBoost (Discrete),1,0.7,0.4816743440817144,0.4834759035210692,276.0765664577484,0.4834759035210692
13,0,AdaBoost (Real),1,0.7,0.5011015421590226,0.5036112750792967,375.9423711299896,0.5036112750792967
14,0,Logistic Regression (Penalty = L2),1,0.7,0.5285399559383136,0.5072786731079436,1.0664465427398682,0.5072786731079436
15,0,Naive Bayes,1,0.7,0.49769677548568,0.31291670016703055,0.368976354598999,0.31291670016703055
16,0,KNeighbors Classifier,2,0.7,0.4271980773082315,0.40751642950730155,13.086308479309082,0.40751642950730155
17,0,SVC Classifier,2,0.7,0.5513719206889646,0.021124141684149264,183.04862451553345,0.021124141684149264
18,0,Decision Tree,2,0.7,0.5099138794312037,0.4840430308755989,0.9641282558441162,0.4840430308755989
19,0,RandomForest,2,0.7,0.5585820148207491,0.47455231027568195,1.95051908493042,0.47455231027568195
20,0,AdaBoost (Discrete),2,0.7,0.5371520128179451,0.4939163543963159,274.52605748176575,0.4939163543963159
21,0,AdaBoost (Real),2,0.7,0.5577808932505508,0.5176053811282663,402.9723117351532,0.5176053811282663
22,0,Logistic Regression (Penalty = L2),2,0.7,0.5491688363709193,0.29554190838751965,1.3739137649536133,0.29554190838751965
23,0,Naive Bayes,2,0.7,0.409773683156419,0.1181760743994489,0.4409000873565674,0.1181760743994489
24,1,KNeighbors Classifier,0,0.7,0.5698838606327593,0.5559106101975837,13.754126787185669,0.5559106101975837
25,1,SVC Classifier,0,0.7,0.55126151381658,1.0,204.30916571617126,0.0
26,1,Decision Tree,0,0.7,0.5426511814177012,0.5440381130177001,1.2408781051635742,0.5440381130177001
27,1,RandomForest,0,0.7,0.5742891469763717,0.5762921529935858,2.5838937759399414,0.5762921529935858
28,1,AdaBoost (Discrete),0,0.7,0.5190228273928714,0.5122083725534873,358.95191836357117,0.5122083725534873
29,1,AdaBoost (Real),0,0.7,0.538846615939127,0.5383016554868533,391.6453173160553,0.5383016554868533
30,1,Logistic Regression (Penalty = L2),0,0.7,0.55126151381658,1.0,1.0260553359985352,0.0
31,1,Naive Bayes,0,0.7,0.46495794953944736,0.19773334896510292,0.49252796173095703,0.19773334896510292
32,1,KNeighbors Classifier,1,0.7,0.438614059683557,0.4408761758762875,25.241381406784058,0.4408761758762875
33,1,SVC Classifier,1,0.7,0.551171640296415,1.0,246.99323678016663,0.0
34,1,Decision Tree,1,0.7,0.44742639695573805,0.4493898260036329,2.873328924179077,0.4493898260036329
35,1,RandomForest,1,0.7,0.5053074304025635,0.43103664456806123,3.6534690856933594,0.43103664456806123
36,1,AdaBoost (Discrete),1,0.7,0.47406368916483077,0.47611465471074416,417.3219118118286,0.47611465471074416
37,1,AdaBoost (Real),1,0.7,0.47987182054876826,0.4805484112737896,461.5218994617462,0.4805484112737896
38,1,Logistic Regression (Penalty = L2),1,0.7,0.5037051872621671,0.26698730664752474,1.1278955936431885,0.26698730664752474
39,1,Naive Bayes,1,0.7,0.5535750050070098,0.08701790983413867,0.4883298873901367,0.08701790983413867
40,1,KNeighbors Classifier,2,0.7,0.509313038253555,0.42861590095123564,19.236258029937744,0.42861590095123564
41,1,SVC Classifier,2,0.7,0.5513719206889646,0.021124141684149264,211.06637740135193,0.021124141684149264
42,1,Decision Tree,2,0.7,0.5387542559583417,0.49205209417204776,1.1715192794799805,0.49205209417204776
43,1,RandomForest,2,0.7,0.5533747246144602,0.4806568799984687,2.55607271194458,0.4806568799984687
44,1,AdaBoost (Discrete),2,0.7,0.5229321049469257,0.45485543344474305,348.3778009414673,0.45485543344474305
45,1,AdaBoost (Real),2,0.7,0.509313038253555,0.4542793519017256,431.24382972717285,0.4542793519017256
46,1,Logistic Regression (Penalty = L2),2,0.7,0.5159222912076907,0.17212609330641385,1.3473200798034668,0.17212609330641385
47,1,Naive Bayes,2,0.7,0.3963548968555978,0.11879258931112031,0.4764981269836426,0.11879258931112031
48,2,KNeighbors Classifier,0,0.7,0.5150180216259511,0.5157789339481421,29.55825185775757,0.5157789339481421
49,2,SVC Classifier,0,0.7,0.55126151381658,1.0,257.00711846351624,0.0
50,2,Decision Tree,0,0.7,0.500200240288346,0.500365659287274,1.35455322265625,0.500365659287274
51,2,RandomForest,0,0.7,0.49439327192631155,0.49310450089759394,3.0407586097717285,0.49310450089759394
52,2,AdaBoost (Discrete),0,0.7,0.5030036043251902,0.4754032846345883,411.57156777381897,0.4754032846345883
53,2,AdaBoost (Real),0,0.7,0.5292350820985182,0.5071446656075136,452.98618268966675,0.5071446656075136
54,2,Logistic Regression (Penalty = L2),0,0.7,0.5416499799759712,0.5177959923464327,1.1166868209838867,0.5177959923464327
55,2,Naive Bayes,0,0.7,0.4655586704044854,0.18152575284329,0.362499475479126,0.18152575284329
56,2,KNeighbors Classifier,1,0.7,0.42319246945724015,0.4254251321578344,27.935800552368164,0.4254251321578344
57,2,SVC Classifier,1,0.7,0.5509713599038654,0.9996366279069767,223.18442273139954,0.0
58,2,Decision Tree,1,0.7,0.4620468656118566,0.464227023945637,1.1726515293121338,0.464227023945637
59,2,RandomForest,1,0.7,0.5185259363108352,0.4105952221264524,2.1471827030181885,0.4105952221264524
60,2,AdaBoost (Discrete),1,0.7,0.4888844382134989,0.4903135383585684,365.24039936065674,0.4903135383585684
61,2,AdaBoost (Real),1,0.7,0.4786701381934709,0.48011733084811326,416.7734842300415,0.48011733084811326
62,2,Logistic Regression (Penalty = L2),1,0.7,0.47146004406168635,0.45786717338505706,1.2127039432525635,0.45786717338505706
63,2,Naive Bayes,1,0.7,0.4770678950530743,0.22635252398919495,0.4142310619354248,0.22635252398919495
64,2,KNeighbors Classifier,2,0.7,0.4580412577608652,0.384671782794091,21.163201808929443,0.384671782794091
65,2,SVC Classifier,2,0.7,0.5513719206889646,0.021124141684149264,1312.6734812259674,0.021124141684149264
66,2,Decision Tree,2,0.7,0.5013018225515722,0.48505095717621627,0.39319515228271484,0.48505095717621627
67,2,RandomForest,2,0.7,0.5089124774684558,0.417725375798804,2.59814190864563,0.417725375798804
68,2,AdaBoost (Discrete),2,0.7,0.47166032445423595,0.4594938411336386,274.67360258102417,0.4594938411336386
69,2,AdaBoost (Real),2,0.7,0.49569397156018424,0.47325041389976796,322.8454587459564,0.47325041389976796
70,2,Logistic Regression (Penalty = L2),2,0.7,0.4984978970558782,0.2269995365125495,1.4344549179077148,0.2269995365125495
71,2,Naive Bayes,2,0.7,0.3915481674344082,0.14218140571468774,0.37415623664855957,0.14218140571468774
72,3,KNeighbors Classifier,0,0.7,0.5903083700440529,0.5838395849075947,5.952931880950928,0.5838395849075947
73,3,SVC Classifier,0,0.7,0.55126151381658,1.0,127.35548853874207,0.0
74,3,Decision Tree,0,0.7,0.5150180216259511,0.5150529551098894,0.6909084320068359,0.5150529551098894
75,3,RandomForest,0,0.7,0.6031237484981978,0.5972849167502443,1.5989439487457275,0.5972849167502443
76,3,AdaBoost (Discrete),0,0.7,0.5036043251902282,0.4960432865683356,176.02245211601257,0.4960432865683356
77,3,AdaBoost (Real),0,0.7,0.5592711253504205,0.5598855520430677,212.7704598903656,0.5598855520430677
78,3,Logistic Regression (Penalty = L2),0,0.7,0.55126151381658,1.0,0.6001830101013184,0.0
79,3,Naive Bayes,0,0.7,0.4571485782939527,0.13840963786522828,0.2948296070098877,0.13840963786522828
80,3,KNeighbors Classifier,1,0.7,0.4446224714600441,0.44696491047577896,7.391499996185303,0.44696491047577896
81,3,SVC Classifier,1,0.7,0.5509713599038654,0.9996366279069767,151.18971943855286,0.0
82,3,Decision Tree,1,0.7,0.46765471660324454,0.47011805103840104,0.5408415794372559,0.47011805103840104
83,3,RandomForest,1,0.7,0.4574404165832165,0.4406000673651825,1.4280929565429688,0.4406000673651825
84,3,AdaBoost (Discrete),1,0.7,0.48467854996995796,0.4869966294874065,165.87751746177673,0.4869966294874065
85,3,AdaBoost (Real),1,0.7,0.4782695774083717,0.4802459865747785,200.5625810623169,0.4802459865747785
86,3,Logistic Regression (Penalty = L2),1,0.7,0.5165231323853394,0.9371366279069767,0.45349693298339844,0.0
87,3,Naive Bayes,1,0.7,0.506509112757861,0.3408021551923323,0.1945643424987793,0.3408021551923323
88,3,KNeighbors Classifier,2,0.7,0.5057079911876627,0.4594320825603343,5.251560688018799,0.4594320825603343
89,3,SVC Classifier,2,0.7,0.5513719206889646,0.021124141684149264,89.37036204338074,0.021124141684149264
90,3,Decision Tree,2,0.7,0.5371520128179451,0.49027864813592514,0.6441240310668945,0.49027864813592514
91,3,RandomForest,2,0.7,0.5768075305427599,0.3352074332060207,1.4042344093322754,0.3352074332060207
92,3,AdaBoost (Discrete),2,0.7,0.5443621069497296,0.46003502050914524,168.90448188781738,0.46003502050914524
93,3,AdaBoost (Real),2,0.7,0.5545764069697576,0.48275430180119355,187.84855699539185,0.48275430180119355
94,3,Logistic Regression (Penalty = L2),2,0.7,0.540957340276387,0.17160199984190175,0.47823500633239746,0.17160199984190175
95,3,Naive Bayes,2,0.7,0.4057680753054276,0.06993692315230797,0.25081324577331543,0.06993692315230797
96,4,KNeighbors Classifier,0,0.7,0.5376451742090509,0.5401548132314209,4.742239236831665,0.5401548132314209
97,4,SVC Classifier,0,0.7,0.55126151381658,1.0,93.52708888053894,0.0
98,4,Decision Tree,0,0.7,0.5370444533440129,0.5305764817629026,0.49012136459350586,0.5305764817629026
99,4,RandomForest,0,0.7,0.6131357629154986,0.6072911075331117,1.295684814453125,0.6072911075331117
100,4,AdaBoost (Discrete),0,0.7,0.5120144173007609,0.4695986450674871,134.72465181350708,0.4695986450674871
101,4,AdaBoost (Real),0,0.7,0.5410492591109332,0.5260934988621473,170.89503836631775,0.5260934988621473
102,4,Logistic Regression (Penalty = L2),0,0.7,0.540048057669203,0.5255259841916863,0.6997694969177246,0.5255259841916863
103,4,Naive Bayes,0,0.7,0.460152182619143,0.15338292161643904,0.16153693199157715,0.15338292161643904
104,4,KNeighbors Classifier,1,0.7,0.46825555778089323,0.46875126474721196,5.986264228820801,0.46875126474721196
105,4,SVC Classifier,1,0.7,0.5509713599038654,0.9996366279069767,92.6554844379425,0.0
106,4,Decision Tree,1,0.7,0.46505107150010017,0.46744327122514334,0.33116722106933594,0.46744327122514334
107,4,RandomForest,1,0.7,0.41918686160624874,0.41908640183353446,1.015456199645996,0.41908640183353446
108,4,AdaBoost (Discrete),1,0.7,0.4856799519327058,0.48767504940285017,131.99211978912354,0.48767504940285017
109,4,AdaBoost (Real),1,0.7,0.48588023232525535,0.4883717841711635,170.75278663635254,0.4883717841711635
110,4,Logistic Regression (Penalty = L2),1,0.7,0.5491688363709193,0.4725149123057572,0.5718140602111816,0.4725149123057572
111,4,Naive Bayes,1,0.7,0.46685359503304624,0.18084105831390454,0.2274625301361084,0.18084105831390454
112,4,KNeighbors Classifier,2,0.7,0.46324854796715403,0.4439193851056608,4.23616623878479,0.4439193851056608
113,4,SVC Classifier,2,0.7,0.551171640296415,1.0,100.42800188064575,0.0
114,4,Decision Tree,2,0.7,0.5031043460845184,0.48743842504069984,0.5492262840270996,0.48743842504069984
115,4,RandomForest,2,0.7,0.5535750050070098,0.46505810103467976,1.0800387859344482,0.46505810103467976
116,4,AdaBoost (Discrete),2,0.7,0.513518926497096,0.5010099683619444,140.08379340171814,0.5010099683619444
117,4,AdaBoost (Real),2,0.7,0.5193270578810334,0.5112557246317978,166.90559935569763,0.5112557246317978
118,4,Logistic Regression (Penalty = L2),2,0.7,0.5307430402563589,0.2980405692868297,0.5225820541381836,0.2980405692868297
119,4,Naive Bayes,2,0.7,0.4045663929501302,0.08053503515840356,0.22724318504333496,0.08053503515840356
120,5,KNeighbors Classifier,0,0.7,0.5708850620744894,0.5569978423901478,4.126927852630615,0.5569978423901478
121,5,SVC Classifier,0,0.7,0.55126151381658,1.0,114.94459772109985,0.0
122,5,Decision Tree,0,0.7,0.5328394072887465,0.53377772830181,0.43944525718688965,0.53377772830181
123,5,RandomForest,0,0.7,0.5899078894673608,0.5769229570192105,1.1346025466918945,0.5769229570192105
124,5,AdaBoost (Discrete),0,0.7,0.5142170604725671,0.5036767078725635,133.3901162147522,0.5036767078725635
125,5,AdaBoost (Real),0,0.7,0.5434521425710853,0.5438567889017495,164.30803680419922,0.5438567889017495
126,5,Logistic Regression (Penalty = L2),0,0.7,0.55126151381658,1.0,0.40734410285949707,0.0
127,5,Naive Bayes,0,0.7,0.4593512214657589,0.14976795711806531,0.2043442726135254,0.14976795711806531
128,5,KNeighbors Classifier,1,0.7,0.4468255557780893,0.4490667790580695,6.493177652359009,0.4490667790580695
129,5,SVC Classifier,1,0.7,0.5509713599038654,0.9996366279069767,108.06737542152405,0.0
130,5,Decision Tree,1,0.7,0.5019026637292209,0.5044877174019533,0.5286235809326172,0.5044877174019533
131,5,RandomForest,1,0.7,0.4592429401161626,0.45005720193082865,1.3220791816711426,0.45005720193082865
132,5,AdaBoost (Discrete),1,0.7,0.49068696174644505,0.4927975916548451,146.61974048614502,0.4927975916548451
133,5,AdaBoost (Real),1,0.7,0.5017023833366714,0.5032553734041842,177.86333870887756,0.5032553734041842
134,5,Logistic Regression (Penalty = L2),1,0.7,0.5083116362908071,0.9222383720930233,0.3929781913757324,0.0
135,5,Naive Bayes,1,0.7,0.4750650911275786,0.2181782394879162,0.24854063987731934,0.2181782394879162
136,5,KNeighbors Classifier,2,0.7,0.5193270578810334,0.44462196028402007,4.3474836349487305,0.44462196028402007
137,5,SVC Classifier,2,0.7,0.5513719206889646,0.021124141684149264,104.43839287757874,0.021124141684149264
138,5,Decision Tree,2,0.7,0.5091127578610054,0.48512182131045806,0.5655205249786377,0.48512182131045806
139,5,RandomForest,2,0.7,0.6068495894251953,0.462477479383298,1.370661973953247,0.462477479383298
140,5,AdaBoost (Discrete),2,0.7,0.5405567794912878,0.5115195295111654,149.5710072517395,0.5115195295111654
141,5,AdaBoost (Real),2,0.7,0.5085119166833567,0.4857554614794871,191.54618191719055,0.4857554614794871
142,5,Logistic Regression (Penalty = L2),2,0.7,0.5113158421790507,0.17582294078307587,0.6524186134338379,0.17582294078307587
143,5,Naive Bayes,2,0.7,0.3895453635089125,0.11384105092600762,0.24092817306518555,0.11384105092600762
144,6,KNeighbors Classifier,0,0.7,0.5376451742090509,0.5386592562422295,14.875313997268677,0.5386592562422295
145,6,SVC Classifier,0,0.7,0.55126151381658,1.0,129.16226434707642,0.0
146,6,Decision Tree,0,0.7,0.5192230676812175,0.5218474095185319,0.7350809574127197,0.5218474095185319
147,6,RandomForest,0,0.7,0.5176211453744494,0.519114071345302,1.7573504447937012,0.519114071345302
148,6,AdaBoost (Discrete),0,0.7,0.47857428914697636,0.4578588880302922,244.9227590560913,0.4578588880302922
149,6,AdaBoost (Real),0,0.7,0.5004004805766921,0.48480172930060333,277.815096616745,0.48480172930060333
150,6,Logistic Regression (Penalty = L2),0,0.7,0.5536643972767321,0.5271802707019019,1.0490059852600098,0.5271802707019019
151,6,Naive Bayes,0,0.7,0.4683620344413296,0.22412967759492378,0.2440948486328125,0.22412967759492378
152,6,KNeighbors Classifier,1,0.7,0.48988584017624676,0.49234265629879875,25.32080888748169,0.49234265629879875
153,6,SVC Classifier,1,0.7,0.5509713599038654,0.9996366279069767,152.30340218544006,0.0
154,6,Decision Tree,1,0.7,0.4686561185659924,0.47110913312408975,0.7777261734008789,0.47110913312408975
155,6,RandomForest,1,0.7,0.48287602643701183,0.2835267910406695,1.3855321407318115,0.2835267910406695
156,6,AdaBoost (Discrete),1,0.7,0.4808732225115161,0.4816116307521991,245.0612919330597,0.4816116307521991
157,6,AdaBoost (Real),1,0.7,0.48207490486681354,0.48260951600374835,287.21498942375183,0.48260951600374835
158,6,Logistic Regression (Penalty = L2),1,0.7,0.5309433206489085,0.4898337868459278,0.7189319133758545,0.4898337868459278
159,6,Naive Bayes,1,0.7,0.5555778089325055,0.33542817973287753,0.3177623748779297,0.33542817973287753
160,6,KNeighbors Classifier,2,0.7,0.4207891047466453,0.38308781728083025,15.27980089187622,0.38308781728083025
161,6,SVC Classifier,2,0.7,0.5513719206889646,0.021124141684149264,133.92428755760193,0.021124141684149264
162,6,Decision Tree,2,0.7,0.47146004406168635,0.45994478003199873,0.7525792121887207,0.45994478003199873
163,6,RandomForest,2,0.7,0.5593831363909473,0.4716376723261451,1.5076913833618164,0.4716376723261451
164,6,AdaBoost (Discrete),2,0.7,0.5233326657320249,0.49514639886707473,226.66220664978027,0.49514639886707473
165,6,AdaBoost (Real),2,0.7,0.5157220108151412,0.4875945800747051,257.92133927345276,0.4875945800747051
166,6,Logistic Regression (Penalty = L2),2,0.7,0.5371520128179451,0.2377710818790534,0.745436429977417,0.2377710818790534
167,6,Naive Bayes,2,0.7,0.3999599439214901,0.1478920177669876,0.3131563663482666,0.1478920177669876
168,7,KNeighbors Classifier,0,0.7,0.5146175410492592,0.5154098613184495,18.56595778465271,0.5154098613184495
169,7,SVC Classifier,0,0.7,0.55126151381658,1.0,123.01186776161194,0.0
170,7,Decision Tree,0,0.7,0.5096115338406088,0.5122626408734877,0.6760084629058838,0.5122626408734877
171,7,RandomForest,0,0.7,0.5298358029635563,0.5149664046790728,1.3579826354980469,0.5149664046790728
172,7,AdaBoost (Discrete),0,0.7,0.4697637164597517,0.44650816449873987,229.06616592407227,0.44650816449873987
173,7,AdaBoost (Real),0,0.7,0.4945935122146576,0.47868501610238884,255.78786826133728,0.47868501610238884
174,7,Logistic Regression (Penalty = L2),0,0.7,0.5406487785342411,0.5197271056887202,0.7157073020935059,0.5197271056887202
175,7,Naive Bayes,0,0.7,0.46876251501802163,0.22644995595286435,0.2540881633758545,0.22644995595286435
176,7,KNeighbors Classifier,1,0.7,0.44081714400160227,0.4426585331897457,23.681984901428223,0.4426585331897457
177,7,SVC Classifier,1,0.7,0.5509713599038654,0.9996366279069767,115.23151230812073,0.0
178,7,Decision Tree,1,0.7,0.44862807931103543,0.4499291036168899,0.587547779083252,0.4499291036168899
179,7,RandomForest,1,0.7,0.5095133186461045,0.4200193559261955,1.3024747371673584,0.4200193559261955
180,7,AdaBoost (Discrete),1,0.7,0.47846985780092127,0.4781604520332152,212.83975887298584,0.4781604520332152
181,7,AdaBoost (Real),1,0.7,0.47386340877228117,0.47564512662199154,229.52231860160828,0.47564512662199154
182,7,Logistic Regression (Penalty = L2),1,0.7,0.4690566793510915,0.45022920349376694,0.8127937316894531,0.45022920349376694
183,7,Naive Bayes,1,0.7,0.5017023833366714,0.5042290769166725,0.25442004203796387,0.5042290769166725
184,7,KNeighbors Classifier,2,0.7,0.4233927498497897,0.37101333436249095,14.090810775756836,0.37101333436249095
185,7,SVC Classifier,2,0.7,0.5513719206889646,0.021124141684149264,107.72112536430359,0.021124141684149264
186,7,Decision Tree,2,0.7,0.4974964950931304,0.4786525813569535,0.6348316669464111,0.4786525813569535
187,7,RandomForest,2,0.7,0.5701982775886241,0.38726006697576243,1.1890337467193604,0.38726006697576243
188,7,AdaBoost (Discrete),2,0.7,0.4634488283597036,0.42678876830410734,189.65850114822388,0.42678876830410734
189,7,AdaBoost (Real),2,0.7,0.4902864009613459,0.4491516239348051,202.25880551338196,0.4491516239348051
190,7,Logistic Regression (Penalty = L2),2,0.7,0.5319447226116564,0.2559532148514081,0.6391592025756836,0.2559532148514081
191,7,Naive Bayes,2,0.7,0.4007610654916884,0.15006769743483475,0.245469331741333,0.15006769743483475
192,8,KNeighbors Classifier,0,0.7,0.5877052462955547,0.5821472294343594,1.0117409229278564,0.5821472294343594
193,8,SVC Classifier,0,0.7,0.55126151381658,1.0,60.42940616607666,0.0
194,8,Decision Tree,0,0.7,0.5228273928714458,0.5212528835482828,0.33938145637512207,0.5212528835482828
195,8,RandomForest,0,0.7,0.5877052462955547,0.5887225760103203,0.8548142910003662,0.5887225760103203
196,8,AdaBoost (Discrete),0,0.7,0.5296355626752103,0.5155469583152009,76.45016074180603,0.5155469583152009
197,8,AdaBoost (Real),0,0.7,0.5506607929515418,0.5508633151282281,100.86349987983704,0.5508633151282281
198,8,Logistic Regression (Penalty = L2),0,0.7,0.5514617541049259,0.021124141684149264,0.27442169189453125,0.021124141684149264
199,8,Naive Bayes,0,0.7,0.4553464156988386,0.12326724973389241,0.11099004745483398,0.12326724973389241
200,8,KNeighbors Classifier,1,0.7,0.44121770478670136,0.4424189059488312,1.4186022281646729,0.4424189059488312
201,8,SVC Classifier,1,0.7,0.5509713599038654,0.9996366279069767,86.72996616363525,0.0
202,8,Decision Tree,1,0.7,0.47546565191267776,0.4764421642026892,0.049680471420288086,0.4764421642026892
203,8,RandomForest,1,0.7,0.4696575205287402,0.45782485216465846,0.12758898735046387,0.45782485216465846
204,8,AdaBoost (Discrete),1,0.7,0.4888844382134989,0.4903681010279676,59.56152057647705,0.4903681010279676
205,8,AdaBoost (Real),1,0.7,0.4854796715401562,0.4877350602369705,99.81476187705994,0.4877350602369705
206,8,Logistic Regression (Penalty = L2),1,0.7,0.5081113558982575,0.921875,0.259096622467041,0.0
207,8,Naive Bayes,1,0.7,0.468856398958542,0.19062321291575585,0.10189127922058105,0.19062321291575585
208,8,KNeighbors Classifier,2,0.7,0.5617865011015422,0.5169863138894503,0.9311535358428955,0.5169863138894503
209,8,SVC Classifier,2,0.7,0.551171640296415,1.0,49.95956993103027,0.0
210,8,Decision Tree,2,0.7,0.5397556579210895,0.4970414634307216,0.403353214263916,0.4970414634307216
211,8,RandomForest,2,0.7,0.5221309833767274,0.4613838739356644,0.9465997219085693,0.4613838739356644
212,8,AdaBoost (Discrete),2,0.7,0.5982375325455638,0.5330497717782494,71.19220042228699,0.5330497717782494
213,8,AdaBoost (Real),2,0.7,0.5992389345083117,0.5456300637753011,96.13822507858276,0.5456300637753011
214,8,Logistic Regression (Penalty = L2),2,0.7,0.5523733226517124,0.11133076572943207,0.2578694820404053,0.11133076572943207
215,8,Naive Bayes,2,0.7,0.4039655517724815,0.018080070551672385,0.10855841636657715,0.018080070551672385
