,feat_set_id,classifier,fold_id,feat_th,score,geo_score,exec_t,geo_score_woz
0,0,KNeighbors Classifier,0,1.0,0.6794258373205742,0.3834327676123552,0.05655527114868164,0.3834327676123552
1,0,SVC Classifier,0,1.0,0.7942583732057417,0.8569568250501305,0.040528059005737305,0.0
2,0,Decision Tree,0,1.0,0.5358851674641149,0.3815129537247908,0.026763200759887695,0.3815129537247908
3,0,RandomForest,0,1.0,0.5023923444976076,0.30618621784789724,0.15580415725708008,0.0
4,0,AdaBoost (Discrete),0,1.0,0.6842105263157895,0.7138007815729402,9.03095531463623,0.7138007815729402
5,0,AdaBoost (Real),0,1.0,0.6698564593301436,0.6942099426082057,10.499342441558838,0.6942099426082057
6,0,Logistic Regression (Penalty = L2),0,1.0,0.8229665071770335,0.8936504412303007,0.15150856971740723,0.0
7,0,Naive Bayes,0,1.0,0.5741626794258373,0.5,0.02837848663330078,0.0
8,0,KNeighbors Classifier,1,1.0,0.75,0.8092214837250814,0.028974294662475586,0.0
9,0,SVC Classifier,1,1.0,0.8798076923076923,0.9527691731065936,0.04824709892272949,0.0
10,0,Decision Tree,1,1.0,0.6730769230769231,0.7284967160377441,0.022118568420410156,0.0
11,0,RandomForest,1,1.0,0.7259615384615384,0.7802076379614168,0.18821072578430176,0.0
12,0,AdaBoost (Discrete),1,1.0,0.7211538461538461,0.5242991087967237,9.979020118713379,0.5242991087967237
13,0,AdaBoost (Real),1,1.0,0.5817307692307693,0.45225562155402443,10.679035902023315,0.45225562155402443
14,0,Logistic Regression (Penalty = L2),1,1.0,0.8798076923076923,0.9524274542218717,0.023729324340820312,0.0
15,0,Naive Bayes,1,1.0,0.8942307692307693,0.9686939947968892,0.022521257400512695,0.0
16,0,KNeighbors Classifier,2,1.0,0.6153846153846154,0.5773502691896257,0.04529595375061035,0.0
17,0,SVC Classifier,2,1.0,0.6057692307692307,0.5590169943749475,0.05103802680969238,0.0
18,0,Decision Tree,2,1.0,0.4951923076923077,0.17838335854327694,0.0020606517791748047,0.17838335854327694
19,0,RandomForest,2,1.0,0.46153846153846156,1.0,0.14206862449645996,0.0
20,0,AdaBoost (Discrete),2,1.0,0.7692307692307693,0.5455020359417712,9.78675889968872,0.5455020359417712
21,0,AdaBoost (Real),2,1.0,0.7740384615384616,0.652981989220792,10.363921642303467,0.652981989220792
22,0,Logistic Regression (Penalty = L2),2,1.0,0.8173076923076923,0.8779711460710616,0.019845962524414062,0.0
23,0,Naive Bayes,2,1.0,0.5240384615384616,0.3679900360969936,0.01934194564819336,0.0
