,feat_set_id,classifier,fold_id,feat_th,score,geo_score,exec_t,geo_score_woz
0,0,KNeighbors Classifier,0,0.7,0.8237410071942446,0.8236353664637921,11.96780252456665,0.8236353664637921
1,0,SVC Classifier,0,0.7,0.8411270983213429,0.8281512539294267,17.762320280075073,0.8281512539294267
2,0,Decision Tree,0,0.7,0.7685851318944844,0.7686163030699656,0.607780933380127,0.7686163030699656
3,0,RandomForest,0,0.7,0.7655875299760192,0.7468267438807767,1.9233944416046143,0.7468267438807767
4,0,AdaBoost (Discrete),0,0.7,0.8435251798561151,0.8434988788037914,245.48811674118042,0.8434988788037914
5,0,AdaBoost (Real),0,0.7,0.8357314148681055,0.8345139759807852,299.393593788147,0.8345139759807852
6,0,Logistic Regression (Penalty = L2),0,0.7,0.8723021582733813,0.8715316299537736,1.1875379085540771,0.8715316299537736
7,0,Naive Bayes,0,0.7,0.8105515587529976,0.7822813287917487,0.31662893295288086,0.7822813287917487
8,0,KNeighbors Classifier,1,0.7,0.7851140456182473,0.7832864606405049,11.913463830947876,0.7832864606405049
9,0,SVC Classifier,1,0.7,0.8403361344537815,0.8289543171140876,19.249602794647217,0.8289543171140876
10,0,Decision Tree,1,0.7,0.734093637454982,0.73371612563154,0.5330474376678467,0.73371612563154
11,0,RandomForest,1,0.7,0.7599039615846338,0.7443266569664015,1.9474689960479736,0.7443266569664015
12,0,AdaBoost (Discrete),1,0.7,0.8205282112845138,0.8205362326471912,229.06773567199707,0.8205362326471912
13,0,AdaBoost (Real),1,0.7,0.8205282112845138,0.8204540161441304,279.6470892429352,0.8204540161441304
14,0,Logistic Regression (Penalty = L2),1,0.7,0.8505402160864346,0.8498368926047244,0.9917290210723877,0.8498368926047244
15,0,Naive Bayes,1,0.7,0.8067226890756303,0.7791359299450558,0.25647568702697754,0.7791359299450558
16,0,KNeighbors Classifier,2,0.7,0.8109243697478992,0.8090988440224784,10.114782571792603,0.8090988440224784
17,0,SVC Classifier,2,0.7,0.8457382953181273,0.8319677279972914,15.228080987930298,0.8319677279972914
18,0,Decision Tree,2,0.7,0.7382953181272509,0.7370618223186778,0.6365921497344971,0.7370618223186778
19,0,RandomForest,2,0.7,0.7737094837935174,0.7616294025445374,1.6631567478179932,0.7616294025445374
20,0,AdaBoost (Discrete),2,0.7,0.8535414165666266,0.8531496722205312,220.32152915000916,0.8531496722205312
21,0,AdaBoost (Real),2,0.7,0.8649459783913566,0.8643753271351154,246.08158493041992,0.8643753271351154
22,0,Logistic Regression (Penalty = L2),2,0.7,0.8643457382953181,0.8630394790891843,1.0664823055267334,0.8630394790891843
23,0,Naive Bayes,2,0.7,0.8115246098439376,0.7819980939491655,0.11875772476196289,0.7819980939491655
24,1,KNeighbors Classifier,0,0.7,0.8237410071942446,0.8236353664637921,9.406536340713501,0.8236353664637921
25,1,SVC Classifier,0,0.7,0.8411270983213429,0.8281512539294267,14.042661666870117,0.8281512539294267
26,1,Decision Tree,0,0.7,0.7589928057553957,0.7589267364644359,0.3353393077850342,0.7589267364644359
27,1,RandomForest,0,0.7,0.7655875299760192,0.7468267438807767,1.3929944038391113,0.7468267438807767
28,1,AdaBoost (Discrete),0,0.7,0.8435251798561151,0.8434988788037914,247.92816019058228,0.8434988788037914
29,1,AdaBoost (Real),0,0.7,0.8327338129496403,0.8317054436770224,250.44054627418518,0.8317054436770224
30,1,Logistic Regression (Penalty = L2),0,0.7,0.8723021582733813,0.8715316299537736,1.0778234004974365,0.8715316299537736
31,1,Naive Bayes,0,0.7,0.8105515587529976,0.7822813287917487,0.2601799964904785,0.7822813287917487
32,1,KNeighbors Classifier,1,0.7,0.7851140456182473,0.7832864606405049,10.461748361587524,0.7832864606405049
33,1,SVC Classifier,1,0.7,0.8403361344537815,0.8289543171140876,16.021301984786987,0.8289543171140876
34,1,Decision Tree,1,0.7,0.7527010804321729,0.7521145414120218,0.5526638031005859,0.7521145414120218
35,1,RandomForest,1,0.7,0.7599039615846338,0.7443266569664015,1.537419319152832,0.7443266569664015
36,1,AdaBoost (Discrete),1,0.7,0.8205282112845138,0.8205362326471912,249.77644109725952,0.8205362326471912
37,1,AdaBoost (Real),1,0.7,0.8277310924369747,0.8275959744004975,266.7248992919922,0.8275959744004975
38,1,Logistic Regression (Penalty = L2),1,0.7,0.8505402160864346,0.8498368926047244,0.48340702056884766,0.8498368926047244
39,1,Naive Bayes,1,0.7,0.8067226890756303,0.7791359299450558,0.10386991500854492,0.7791359299450558
40,1,KNeighbors Classifier,2,0.7,0.8109243697478992,0.8090988440224784,7.225247144699097,0.8090988440224784
41,1,SVC Classifier,2,0.7,0.8457382953181273,0.8319677279972914,15.156242609024048,0.8319677279972914
42,1,Decision Tree,2,0.7,0.7298919567827131,0.7291578602048138,0.5839226245880127,0.7291578602048138
43,1,RandomForest,2,0.7,0.7737094837935174,0.7616294025445374,1.8427984714508057,0.7616294025445374
44,1,AdaBoost (Discrete),2,0.7,0.8535414165666266,0.8531496722205312,216.42972469329834,0.8531496722205312
45,1,AdaBoost (Real),2,0.7,0.8535414165666266,0.8532664158083426,224.25619196891785,0.8532664158083426
46,1,Logistic Regression (Penalty = L2),2,0.7,0.8643457382953181,0.8630394790891843,1.0223774909973145,0.8630394790891843
47,1,Naive Bayes,2,0.7,0.8115246098439376,0.7819980939491655,0.3643226623535156,0.7819980939491655
48,2,KNeighbors Classifier,0,0.7,0.7985611510791367,0.7981186983846119,10.346826314926147,0.7981186983846119
49,2,SVC Classifier,0,0.7,0.8339328537170264,0.8192737576026249,14.446156024932861,0.8192737576026249
50,2,Decision Tree,0,0.7,0.7386091127098321,0.7376136356234159,0.5966439247131348,0.7376136356234159
51,2,RandomForest,0,0.7,0.7655875299760192,0.7468267438807767,1.459768533706665,0.7468267438807767
52,2,AdaBoost (Discrete),0,0.7,0.829736211031175,0.8297338035497126,217.85634851455688,0.8297338035497126
53,2,AdaBoost (Real),0,0.7,0.8387290167865707,0.8386349015510751,232.76356101036072,0.8386349015510751
54,2,Logistic Regression (Penalty = L2),0,0.7,0.8669064748201439,0.866201318058387,1.0201976299285889,0.866201318058387
55,2,Naive Bayes,0,0.7,0.8105515587529976,0.7822552337042356,0.1315321922302246,0.7822552337042356
56,2,KNeighbors Classifier,1,0.7,0.8061224489795918,0.8046803099986292,10.18111777305603,0.8046803099986292
57,2,SVC Classifier,1,0.7,0.8283313325330132,0.8181980955176626,14.730867862701416,0.8181980955176626
58,2,Decision Tree,1,0.7,0.7232893157262905,0.7229885515699644,0.597294807434082,0.7229885515699644
59,2,RandomForest,1,0.7,0.7599039615846338,0.7443266569664015,1.5543913841247559,0.7443266569664015
60,2,AdaBoost (Discrete),1,0.7,0.8163265306122449,0.816388271442698,215.57130527496338,0.816388271442698
61,2,AdaBoost (Real),1,0.7,0.8115246098439376,0.811295173998147,275.6292107105255,0.811295173998147
62,2,Logistic Regression (Penalty = L2),1,0.7,0.84093637454982,0.8405732040525962,1.0608642101287842,0.8405732040525962
63,2,Naive Bayes,1,0.7,0.7935174069627852,0.7647333132652592,0.42506885528564453,0.7647333132652592
64,2,KNeighbors Classifier,2,0.7,0.7983193277310925,0.7961515638857726,12.248820066452026,0.7961515638857726
65,2,SVC Classifier,2,0.7,0.8361344537815126,0.8202417490367594,17.6705162525177,0.8202417490367594
66,2,Decision Tree,2,0.7,0.7358943577430972,0.7346092442629247,0.5749187469482422,0.7346092442629247
67,2,RandomForest,2,0.7,0.7737094837935174,0.7616294025445374,1.9018819332122803,0.7616294025445374
68,2,AdaBoost (Discrete),2,0.7,0.8433373349339736,0.8431533258122557,254.38234567642212,0.8431533258122557
69,2,AdaBoost (Real),2,0.7,0.8481392557022809,0.8480777701850988,281.6758723258972,0.8480777701850988
70,2,Logistic Regression (Penalty = L2),2,0.7,0.8643457382953181,0.8630918337699881,1.0752182006835938,0.8630918337699881
71,2,Naive Bayes,2,0.7,0.8127250900360145,0.7837539533757806,0.15419697761535645,0.7837539533757806
72,3,KNeighbors Classifier,0,0.7,0.8237410071942446,0.8236353664637921,12.214549779891968,0.8236353664637921
73,3,SVC Classifier,0,0.7,0.8411270983213429,0.8281512539294267,17.4456946849823,0.8281512539294267
74,3,Decision Tree,0,0.7,0.7488009592326139,0.7484376818813228,0.5932166576385498,0.7484376818813228
75,3,RandomForest,0,0.7,0.7655875299760192,0.7468267438807767,1.7277343273162842,0.7468267438807767
76,3,AdaBoost (Discrete),0,0.7,0.8435251798561151,0.8434988788037914,264.3685004711151,0.8434988788037914
77,3,AdaBoost (Real),0,0.7,0.8273381294964028,0.8266221064123955,318.35340189933777,0.8266221064123955
78,3,Logistic Regression (Penalty = L2),0,0.7,0.8723021582733813,0.8715316299537736,1.3707759380340576,0.8715316299537736
79,3,Naive Bayes,0,0.7,0.8105515587529976,0.7822813287917487,0.18259644508361816,0.7822813287917487
80,3,KNeighbors Classifier,1,0.7,0.7851140456182473,0.7832864606405049,12.778072834014893,0.7832864606405049
81,3,SVC Classifier,1,0.7,0.8403361344537815,0.8289543171140876,20.815523624420166,0.8289543171140876
82,3,Decision Tree,1,0.7,0.7490996398559424,0.7490188371013938,0.6992571353912354,0.7490188371013938
83,3,RandomForest,1,0.7,0.7599039615846338,0.7443266569664015,2.118753433227539,0.7443266569664015
84,3,AdaBoost (Discrete),1,0.7,0.8205282112845138,0.8205362326471912,299.6675877571106,0.8205362326471912
85,3,AdaBoost (Real),1,0.7,0.8325330132052821,0.8321966545560078,314.6615619659424,0.8321966545560078
86,3,Logistic Regression (Penalty = L2),1,0.7,0.8505402160864346,0.8498368926047244,1.1744065284729004,0.8498368926047244
87,3,Naive Bayes,1,0.7,0.8067226890756303,0.7791359299450558,0.32053685188293457,0.7791359299450558
88,3,KNeighbors Classifier,2,0.7,0.8109243697478992,0.8090988440224784,13.088873624801636,0.8090988440224784
89,3,SVC Classifier,2,0.7,0.8457382953181273,0.8319677279972914,17.60528254508972,0.8319677279972914
90,3,Decision Tree,2,0.7,0.7581032412965186,0.7578725309628932,0.6032676696777344,0.7578725309628932
91,3,RandomForest,2,0.7,0.7737094837935174,0.7616294025445374,1.8910062313079834,0.7616294025445374
92,3,AdaBoost (Discrete),2,0.7,0.8535414165666266,0.8531496722205312,248.7284173965454,0.8531496722205312
93,3,AdaBoost (Real),2,0.7,0.8541416566626651,0.8541032239433364,267.01566338539124,0.8541032239433364
94,3,Logistic Regression (Penalty = L2),2,0.7,0.8643457382953181,0.8630394790891843,1.2438185214996338,0.8630394790891843
95,3,Naive Bayes,2,0.7,0.8115246098439376,0.7819980939491655,0.2881631851196289,0.7819980939491655
96,4,KNeighbors Classifier,0,0.7,0.8057553956834532,0.8050521003972478,8.104225158691406,0.8050521003972478
97,4,SVC Classifier,0,0.7,0.8369304556354916,0.8219018124951192,13.761454105377197,0.8219018124951192
98,4,Decision Tree,0,0.7,0.7553956834532374,0.7551383985049414,0.5526103973388672,0.7551383985049414
99,4,RandomForest,0,0.7,0.7799760191846523,0.7674825732276489,1.5522692203521729,0.7674825732276489
100,4,AdaBoost (Discrete),0,0.7,0.8393285371702638,0.8393941441344,227.705228805542,0.8393941441344
101,4,AdaBoost (Real),0,0.7,0.8339328537170264,0.8337599604908025,263.7551109790802,0.8337599604908025
102,4,Logistic Regression (Penalty = L2),0,0.7,0.8651079136690647,0.8644330224098145,1.0200836658477783,0.8644330224098145
103,4,Naive Bayes,0,0.7,0.8069544364508393,0.7789346493701397,0.3034698963165283,0.7789346493701397
104,4,KNeighbors Classifier,1,0.7,0.8109243697478992,0.8102388772689647,7.96738338470459,0.8102388772689647
105,4,SVC Classifier,1,0.7,0.8313325330132053,0.820482004744897,14.8734450340271,0.820482004744897
106,4,Decision Tree,1,0.7,0.7539015606242497,0.7537340129749294,0.6006205081939697,0.7537340129749294
107,4,RandomForest,1,0.7,0.7551020408163265,0.7388031993643557,1.7030961513519287,0.7388031993643557
108,4,AdaBoost (Discrete),1,0.7,0.8199279711884754,0.8198850473065682,238.5910084247589,0.8198850473065682
109,4,AdaBoost (Real),1,0.7,0.819327731092437,0.8193078777987988,257.22349309921265,0.8193078777987988
110,4,Logistic Regression (Penalty = L2),1,0.7,0.84093637454982,0.8405879638981489,1.0774879455566406,0.8405879638981489
111,4,Naive Bayes,1,0.7,0.7959183673469388,0.7679542662232233,0.29482364654541016,0.7679542662232233
112,4,KNeighbors Classifier,2,0.7,0.8043217286914766,0.8025892191888992,8.126166582107544,0.8025892191888992
113,4,SVC Classifier,2,0.7,0.8367346938775511,0.820743119423851,15.077083587646484,0.820743119423851
114,4,Decision Tree,2,0.7,0.7454981992797118,0.7444681636863427,0.6548805236816406,0.7444681636863427
115,4,RandomForest,2,0.7,0.7671068427370948,0.7627648741459752,1.474604845046997,0.7627648741459752
116,4,AdaBoost (Discrete),2,0.7,0.8385354141656662,0.838363784519792,223.75751185417175,0.838363784519792
117,4,AdaBoost (Real),2,0.7,0.8385354141656662,0.8381588026432139,268.95774960517883,0.8381588026432139
118,4,Logistic Regression (Penalty = L2),2,0.7,0.8619447779111644,0.8605612786412383,1.224350929260254,0.8605612786412383
119,4,Naive Bayes,2,0.7,0.8127250900360145,0.7837706677549495,0.15111637115478516,0.7837706677549495
120,5,KNeighbors Classifier,0,0.7,0.8057553956834532,0.8050521003972478,10.10086178779602,0.8050521003972478
121,5,SVC Classifier,0,0.7,0.8369304556354916,0.8219018124951192,18.024972677230835,0.8219018124951192
122,5,Decision Tree,0,0.7,0.763189448441247,0.7627019974988796,0.4881861209869385,0.7627019974988796
123,5,RandomForest,0,0.7,0.7799760191846523,0.7674825732276489,1.9118647575378418,0.7674825732276489
124,5,AdaBoost (Discrete),0,0.7,0.8393285371702638,0.8393941441344,226.85147142410278,0.8393941441344
125,5,AdaBoost (Real),0,0.7,0.8267386091127098,0.825694083078709,233.1367630958557,0.825694083078709
126,5,Logistic Regression (Penalty = L2),0,0.7,0.8651079136690647,0.8644330224098145,1.1433773040771484,0.8644330224098145
127,5,Naive Bayes,0,0.7,0.8069544364508393,0.7789346493701397,0.31004858016967773,0.7789346493701397
128,5,KNeighbors Classifier,1,0.7,0.8109243697478992,0.8102388772689647,7.507249355316162,0.8102388772689647
129,5,SVC Classifier,1,0.7,0.8313325330132053,0.820482004744897,14.192102909088135,0.820482004744897
130,5,Decision Tree,1,0.7,0.7376950780312125,0.7376327093789142,0.5791885852813721,0.7376327093789142
131,5,RandomForest,1,0.7,0.7551020408163265,0.7388031993643557,1.333601951599121,0.7388031993643557
132,5,AdaBoost (Discrete),1,0.7,0.8199279711884754,0.8198850473065682,207.81674218177795,0.8198850473065682
133,5,AdaBoost (Real),1,0.7,0.8151260504201681,0.8149165179818346,228.33319568634033,0.8149165179818346
134,5,Logistic Regression (Penalty = L2),1,0.7,0.84093637454982,0.8405879638981489,1.1301217079162598,0.8405879638981489
135,5,Naive Bayes,1,0.7,0.7959183673469388,0.7679542662232233,0.32834815979003906,0.7679542662232233
136,5,KNeighbors Classifier,2,0.7,0.8043217286914766,0.8025892191888992,7.596865892410278,0.8025892191888992
137,5,SVC Classifier,2,0.7,0.8367346938775511,0.820743119423851,13.371646165847778,0.820743119423851
138,5,Decision Tree,2,0.7,0.741296518607443,0.7402448519206732,0.5346810817718506,0.7402448519206732
139,5,RandomForest,2,0.7,0.7671068427370948,0.7627648741459752,1.6473138332366943,0.7627648741459752
140,5,AdaBoost (Discrete),2,0.7,0.8385354141656662,0.838363784519792,209.84805512428284,0.838363784519792
141,5,AdaBoost (Real),2,0.7,0.8481392557022809,0.8478564223929536,239.379323720932,0.8478564223929536
142,5,Logistic Regression (Penalty = L2),2,0.7,0.8619447779111644,0.8605612786412383,0.9605312347412109,0.8605612786412383
143,5,Naive Bayes,2,0.7,0.8127250900360145,0.7837706677549495,0.17017054557800293,0.7837706677549495
144,6,KNeighbors Classifier,0,0.7,0.8237410071942446,0.8236353664637921,10.767937183380127,0.8236353664637921
145,6,SVC Classifier,0,0.7,0.8411270983213429,0.8281512539294267,15.63979721069336,0.8281512539294267
146,6,Decision Tree,0,0.7,0.7511990407673861,0.7509061917639578,0.6379468441009521,0.7509061917639578
147,6,RandomForest,0,0.7,0.7655875299760192,0.7468267438807767,1.710768699645996,0.7468267438807767
148,6,AdaBoost (Discrete),0,0.7,0.8435251798561151,0.8434988788037914,1318.586552619934,0.8434988788037914
149,6,AdaBoost (Real),0,0.7,0.8375299760191847,0.8373193024144231,196.8130669593811,0.8373193024144231
150,6,Logistic Regression (Penalty = L2),0,0.7,0.8723021582733813,0.8715316299537736,0.9081239700317383,0.8715316299537736
151,6,Naive Bayes,0,0.7,0.8105515587529976,0.7822813287917487,0.26613402366638184,0.7822813287917487
152,6,KNeighbors Classifier,1,0.7,0.7851140456182473,0.7832864606405049,7.379348516464233,0.7832864606405049
153,6,SVC Classifier,1,0.7,0.8403361344537815,0.8289543171140876,12.774112701416016,0.8289543171140876
154,6,Decision Tree,1,0.7,0.7136854741896759,0.7134179159220259,0.4825310707092285,0.7134179159220259
155,6,RandomForest,1,0.7,0.7599039615846338,0.7443266569664015,1.3083183765411377,0.7443266569664015
156,6,AdaBoost (Discrete),1,0.7,0.8205282112845138,0.8205362326471912,174.58065581321716,0.8205362326471912
157,6,AdaBoost (Real),1,0.7,0.8253301320528211,0.8251393194360608,184.6961886882782,0.8251393194360608
158,6,Logistic Regression (Penalty = L2),1,0.7,0.8505402160864346,0.8498368926047244,0.7476625442504883,0.8498368926047244
159,6,Naive Bayes,1,0.7,0.8067226890756303,0.7791359299450558,0.19542980194091797,0.7791359299450558
160,6,KNeighbors Classifier,2,0.7,0.8109243697478992,0.8090988440224784,7.507685899734497,0.8090988440224784
161,6,SVC Classifier,2,0.7,0.8457382953181273,0.8319677279972914,10.601861238479614,0.8319677279972914
162,6,Decision Tree,2,0.7,0.7292917166866747,0.7281743503024061,0.41384124755859375,0.7281743503024061
163,6,RandomForest,2,0.7,0.7737094837935174,0.7616294025445374,1.164834976196289,0.7616294025445374
164,6,AdaBoost (Discrete),2,0.7,0.8535414165666266,0.8531496722205312,161.956613779068,0.8531496722205312
165,6,AdaBoost (Real),2,0.7,0.8577430972388955,0.8576582041428671,178.21132612228394,0.8576582041428671
166,6,Logistic Regression (Penalty = L2),2,0.7,0.8643457382953181,0.8630394790891843,0.7353918552398682,0.8630394790891843
167,6,Naive Bayes,2,0.7,0.8115246098439376,0.7819980939491655,0.1904299259185791,0.7819980939491655
168,7,KNeighbors Classifier,0,0.7,0.8051558752997602,0.8048369968402245,9.222708463668823,0.8048369968402245
169,7,SVC Classifier,0,0.7,0.8411270983213429,0.8286110145746406,11.503511428833008,0.8286110145746406
170,7,Decision Tree,0,0.7,0.7535971223021583,0.7514457486410144,0.42014646530151367,0.7514457486410144
171,7,RandomForest,0,0.7,0.7392086330935251,0.7218721587449527,1.2471256256103516,0.7218721587449527
172,7,AdaBoost (Discrete),0,0.7,0.8471223021582733,0.8471126520729851,172.7790412902832,0.8471126520729851
173,7,AdaBoost (Real),0,0.7,0.8357314148681055,0.8354691544796538,190.19230842590332,0.8354691544796538
174,7,Logistic Regression (Penalty = L2),0,0.7,0.8723021582733813,0.871629664491553,0.7741701602935791,0.871629664491553
175,7,Naive Bayes,0,0.7,0.8087529976019184,0.7799926060907993,0.10244202613830566,0.7799926060907993
176,7,KNeighbors Classifier,1,0.7,0.7983193277310925,0.7968160087943658,8.81914496421814,0.7968160087943658
177,7,SVC Classifier,1,0.7,0.8367346938775511,0.8252430143103197,11.770896196365356,0.8252430143103197
178,7,Decision Tree,1,0.7,0.7454981992797118,0.7445744182112252,0.3623993396759033,0.7445744182112252
179,7,RandomForest,1,0.7,0.7310924369747899,0.7208596617746772,0.923403263092041,0.7208596617746772
180,7,AdaBoost (Discrete),1,0.7,0.8277310924369747,0.827761004180411,159.76902270317078,0.827761004180411
181,7,AdaBoost (Real),1,0.7,0.8289315726290516,0.8286787999144718,171.98959016799927,0.8286787999144718
182,7,Logistic Regression (Penalty = L2),1,0.7,0.8505402160864346,0.8498328411707535,0.839580774307251,0.8498328411707535
183,7,Naive Bayes,1,0.7,0.8073229291716687,0.7795637460690521,0.1726534366607666,0.7795637460690521
184,7,KNeighbors Classifier,2,0.7,0.8097238895558223,0.8074272423994291,8.162088871002197,0.8074272423994291
185,7,SVC Classifier,2,0.7,0.8427370948379351,0.8286613645643972,10.67874002456665,0.8286613645643972
186,7,Decision Tree,2,0.7,0.7022809123649459,0.7009808112658075,0.3455235958099365,0.7009808112658075
187,7,RandomForest,2,0.7,0.748499399759904,0.7359812811322981,1.07029390335083,0.7359812811322981
188,7,AdaBoost (Discrete),2,0.7,0.8403361344537815,0.8399635253347134,168.3439712524414,0.8399635253347134
189,7,AdaBoost (Real),2,0.7,0.8433373349339736,0.8426720906999466,172.18102502822876,0.8426720906999466
190,7,Logistic Regression (Penalty = L2),2,0.7,0.865546218487395,0.8642914070076354,0.5967624187469482,0.8642914070076354
191,7,Naive Bayes,2,0.7,0.8115246098439376,0.7831888389483487,0.18764710426330566,0.7831888389483487
192,8,KNeighbors Classifier,0,0.7,0.8057553956834532,0.8050521003972478,4.3891472816467285,0.8050521003972478
193,8,SVC Classifier,0,0.7,0.8369304556354916,0.8219018124951192,9.211405515670776,0.8219018124951192
194,8,Decision Tree,0,0.7,0.7517985611510791,0.7509132098643426,0.3248465061187744,0.7509132098643426
195,8,RandomForest,0,0.7,0.7799760191846523,0.7674825732276489,1.0480947494506836,0.7674825732276489
196,8,AdaBoost (Discrete),0,0.7,0.8393285371702638,0.8393941441344,129.9226040840149,0.8393941441344
197,8,AdaBoost (Real),0,0.7,0.8333333333333334,0.833194656345245,138.2054238319397,0.833194656345245
198,8,Logistic Regression (Penalty = L2),0,0.7,0.8651079136690647,0.8644330224098145,0.5716264247894287,0.8644330224098145
199,8,Naive Bayes,0,0.7,0.8069544364508393,0.7789346493701397,0.12355661392211914,0.7789346493701397
200,8,KNeighbors Classifier,1,0.7,0.8109243697478992,0.8102388772689647,4.187013864517212,0.8102388772689647
201,8,SVC Classifier,1,0.7,0.8313325330132053,0.820482004744897,8.008259773254395,0.820482004744897
202,8,Decision Tree,1,0.7,0.7454981992797118,0.7453649414104018,0.2879972457885742,0.7453649414104018
203,8,RandomForest,1,0.7,0.7551020408163265,0.7388031993643557,0.8908360004425049,0.7388031993643557
204,8,AdaBoost (Discrete),1,0.7,0.8199279711884754,0.8198850473065682,115.18782043457031,0.8198850473065682
205,8,AdaBoost (Real),1,0.7,0.8145258103241296,0.8144053011071796,126.61674904823303,0.8144053011071796
206,8,Logistic Regression (Penalty = L2),1,0.7,0.84093637454982,0.8405879638981489,0.49974751472473145,0.8405879638981489
207,8,Naive Bayes,1,0.7,0.7959183673469388,0.7679542662232233,0.14287400245666504,0.7679542662232233
208,8,KNeighbors Classifier,2,0.7,0.8043217286914766,0.8025892191888992,4.7484824657440186,0.8025892191888992
209,8,SVC Classifier,2,0.7,0.8367346938775511,0.820743119423851,8.592201709747314,0.820743119423851
210,8,Decision Tree,2,0.7,0.7202881152460985,0.7194617603109954,0.2292020320892334,0.7194617603109954
211,8,RandomForest,2,0.7,0.7671068427370948,0.7627648741459752,0.7703585624694824,0.7627648741459752
212,8,AdaBoost (Discrete),2,0.7,0.8385354141656662,0.838363784519792,110.69636130332947,0.838363784519792
213,8,AdaBoost (Real),2,0.7,0.8415366146458584,0.8415733064444121,127.25944542884827,0.8415733064444121
214,8,Logistic Regression (Penalty = L2),2,0.7,0.8619447779111644,0.8605612786412383,0.629868745803833,0.8605612786412383
215,8,Naive Bayes,2,0.7,0.8127250900360145,0.7837706677549495,0.1637861728668213,0.7837706677549495
