,feat_set_id,classifier,fold_id,feat_th,score,geo_score,exec_t,geo_score_woz
0,0,KNeighbors Classifier,0,1.0,0.8571428571428571,0.7071067811865476,0.005637168884277344,0.7071067811865476
1,0,SVC Classifier,0,1.0,0.7142857142857143,1.0,0.003305673599243164,0.0
2,0,Decision Tree,0,1.0,0.9523809523809523,0.9128709291752769,0.009996414184570312,0.9128709291752769
3,0,RandomForest,0,1.0,0.9523809523809523,0.9128709291752769,0.14425182342529297,0.9128709291752769
4,0,AdaBoost (Discrete),0,1.0,0.9523809523809523,0.9128709291752769,0.03282594680786133,0.9128709291752769
5,0,AdaBoost (Real),0,1.0,0.9523809523809523,0.9128709291752769,0.002852916717529297,0.9128709291752769
6,0,Logistic Regression (Penalty = L2),0,1.0,1.0,1.0,0.08655190467834473,1.0
7,0,Naive Bayes,0,1.0,0.9523809523809523,0.9128709291752769,0.0018200874328613281,0.9128709291752769
8,0,KNeighbors Classifier,1,1.0,0.8095238095238095,0.6831300510639732,0.03095865249633789,0.6831300510639732
9,0,SVC Classifier,1,1.0,0.7142857142857143,1.0,0.029829025268554688,0.0
10,0,Decision Tree,1,1.0,0.9523809523809523,0.9660917830792959,0.0014874935150146484,0.9660917830792959
11,0,RandomForest,1,1.0,0.9523809523809523,0.9128709291752769,0.14156842231750488,0.9128709291752769
12,0,AdaBoost (Discrete),1,1.0,0.9523809523809523,0.9660917830792959,0.024910449981689453,0.9660917830792959
13,0,AdaBoost (Real),1,1.0,0.9523809523809523,0.9660917830792959,0.02258753776550293,0.9660917830792959
14,0,Logistic Regression (Penalty = L2),1,1.0,0.9523809523809523,0.9660917830792959,0.02170848846435547,0.9660917830792959
15,0,Naive Bayes,1,1.0,0.9523809523809523,0.9128709291752769,0.022023916244506836,0.9128709291752769
16,0,KNeighbors Classifier,2,1.0,0.7894736842105263,0.4472135954999579,0.0352632999420166,0.4472135954999579
17,0,SVC Classifier,2,1.0,0.7368421052631579,1.0,0.02593851089477539,0.0
18,0,Decision Tree,2,1.0,0.8947368421052632,0.9258200997725514,0.001710653305053711,0.9258200997725514
19,0,RandomForest,2,1.0,0.8947368421052632,0.7745966692414834,0.16489601135253906,0.7745966692414834
20,0,AdaBoost (Discrete),2,1.0,0.8947368421052632,0.7745966692414834,0.002566814422607422,0.7745966692414834
21,0,AdaBoost (Real),2,1.0,0.9473684210526315,0.8944271909999159,0.015395641326904297,0.8944271909999159
22,0,Logistic Regression (Penalty = L2),2,1.0,0.8947368421052632,0.7745966692414834,0.0014679431915283203,0.7745966692414834
23,0,Naive Bayes,2,1.0,0.8947368421052632,0.7745966692414834,0.022814035415649414,0.7745966692414834
