,feat_set_id,classifier,fold_id,feat_th,score,geo_score,exec_t,geo_score_woz
0,0,KNeighbors Classifier,0,0.65,0.8074626865671641,0.7818913648721364,3.283033847808838,0.7818913648721364
1,0,SVC Classifier,0,0.65,0.7701492537313432,0.7470295320088054,3.9824793338775635,0.7470295320088054
2,0,Decision Tree,0,0.65,0.6597014925373135,0.6295271240100053,0.26648592948913574,0.6295271240100053
3,0,RandomForest,0,0.65,0.608955223880597,0.489779874623793,0.909095048904419,0.489779874623793
4,0,AdaBoost (Discrete),0,0.65,0.7656716417910447,0.7523536837881265,189.1752154827118,0.7523536837881265
5,0,AdaBoost (Real),0,0.65,0.5313432835820896,0.34048298349319206,195.57941246032715,0.34048298349319206
6,0,Logistic Regression (Penalty = L2),0,0.65,0.8059701492537313,0.7885255065807988,1.8314299583435059,0.7885255065807988
7,0,Naive Bayes,0,0.65,0.7820895522388059,0.7572849960617049,0.306581974029541,0.7572849960617049
8,0,KNeighbors Classifier,1,0.65,0.8164179104477612,0.7715924147277619,3.284925937652588,0.7715924147277619
9,0,SVC Classifier,1,0.65,0.7671641791044777,0.734845738781238,3.8142943382263184,0.734845738781238
10,0,Decision Tree,1,0.65,0.6582089552238806,0.6396317898230839,0.25126147270202637,0.6396317898230839
11,0,RandomForest,1,0.65,0.6373134328358209,0.587534838197746,0.6387767791748047,0.0
12,0,AdaBoost (Discrete),1,0.65,0.755223880597015,0.7384933009118558,190.3820149898529,0.7384933009118558
13,0,AdaBoost (Real),1,0.65,0.6313432835820896,0.6095867057116712,190.76574444770813,0.6095867057116712
14,0,Logistic Regression (Penalty = L2),1,0.65,0.8134328358208955,0.7981439744443392,1.777895450592041,0.7981439744443392
15,0,Naive Bayes,1,0.65,0.764179104477612,0.7337182186317509,0.18638396263122559,0.7337182186317509
16,0,KNeighbors Classifier,2,0.65,0.8136363636363636,0.7844794143394337,3.3203623294830322,0.7844794143394337
17,0,SVC Classifier,2,0.65,0.7909090909090909,0.7663660761630535,3.976003408432007,0.7663660761630535
18,0,Decision Tree,2,0.65,0.6818181818181818,0.6537176114423379,0.1936478614807129,0.6537176114423379
19,0,RandomForest,2,0.65,0.6590909090909091,0.5737225290886009,0.690629243850708,0.5737225290886009
20,0,AdaBoost (Discrete),2,0.65,0.7651515151515151,0.7497340839161907,197.95783257484436,0.7497340839161907
21,0,AdaBoost (Real),2,0.65,0.5848484848484848,0.516448551200098,206.4719307422638,0.516448551200098
22,0,Logistic Regression (Penalty = L2),2,0.65,0.8136363636363636,0.7874839311219045,2.4141674041748047,0.7874839311219045
23,0,Naive Bayes,2,0.65,0.7772727272727272,0.7576999839663662,0.24026942253112793,0.7576999839663662
24,1,KNeighbors Classifier,0,0.65,0.8074626865671641,0.7789467413439717,4.333980321884155,0.7789467413439717
25,1,SVC Classifier,0,0.65,0.7582089552238805,0.7302579355596301,5.015989065170288,0.7302579355596301
26,1,Decision Tree,0,0.65,0.7014925373134329,0.6812439111272,0.3168141841888428,0.6812439111272
27,1,RandomForest,0,0.65,0.6179104477611941,0.4126821865079725,0.9270994663238525,0.4126821865079725
28,1,AdaBoost (Discrete),0,0.65,0.7791044776119403,0.7664360772208264,247.5695858001709,0.7664360772208264
29,1,AdaBoost (Real),0,0.65,0.5313432835820896,0.34048298349319206,243.2077260017395,0.34048298349319206
30,1,Logistic Regression (Penalty = L2),0,0.65,0.8059701492537313,0.7873505267652399,2.172691822052002,0.7873505267652399
31,1,Naive Bayes,0,0.65,0.7656716417910447,0.7429253470788547,0.28940677642822266,0.7429253470788547
32,1,KNeighbors Classifier,1,0.65,0.826865671641791,0.7991248897028046,4.186574697494507,0.7991248897028046
33,1,SVC Classifier,1,0.65,0.7761194029850746,0.7483483647954914,4.955595254898071,0.7483483647954914
34,1,Decision Tree,1,0.65,0.6716417910447762,0.6410674847393268,0.23154950141906738,0.6410674847393268
35,1,RandomForest,1,0.65,0.6462686567164179,0.5943331752451287,0.9093847274780273,0.0
36,1,AdaBoost (Discrete),1,0.65,0.7671641791044777,0.7502921818872883,232.43742442131042,0.7502921818872883
37,1,AdaBoost (Real),1,0.65,0.7119402985074627,0.6841362902713324,215.71237230300903,0.6841362902713324
38,1,Logistic Regression (Penalty = L2),1,0.65,0.8074626865671641,0.7908824682425372,2.177520990371704,0.7908824682425372
39,1,Naive Bayes,1,0.65,0.7611940298507462,0.7394407613205222,0.276386022567749,0.7394407613205222
40,1,KNeighbors Classifier,2,0.65,0.8212121212121212,0.7932542001233488,3.914518117904663,0.7932542001233488
41,1,SVC Classifier,2,0.65,0.796969696969697,0.7758725241120181,4.665567874908447,0.7758725241120181
42,1,Decision Tree,2,0.65,0.6818181818181818,0.6586065106622888,0.28708910942077637,0.6586065106622888
43,1,RandomForest,2,0.65,0.6621212121212121,0.5989762090162536,0.800485372543335,0.5989762090162536
44,1,AdaBoost (Discrete),2,0.65,0.7787878787878788,0.7534219933046606,232.7196924686432,0.7534219933046606
45,1,AdaBoost (Real),2,0.65,0.5969696969696969,0.5458773573406256,217.93397760391235,0.5458773573406256
46,1,Logistic Regression (Penalty = L2),2,0.65,0.8333333333333334,0.813366672128238,2.2897298336029053,0.813366672128238
47,1,Naive Bayes,2,0.65,0.7848484848484848,0.767278082717139,0.2442770004272461,0.767278082717139
48,2,KNeighbors Classifier,0,0.65,0.7940298507462686,0.7631023657966447,3.9608495235443115,0.7631023657966447
49,2,SVC Classifier,0,0.65,0.7611940298507462,0.7355515278271803,4.805368900299072,0.7355515278271803
50,2,Decision Tree,0,0.65,0.6313432835820896,0.6049298452396655,0.3036181926727295,0.6049298452396655
51,2,RandomForest,0,0.65,0.6059701492537314,0.6344143556605568,0.8375558853149414,0.0
52,2,AdaBoost (Discrete),0,0.65,0.7567164179104477,0.7373944695518416,235.93881607055664,0.7373944695518416
53,2,AdaBoost (Real),0,0.65,0.5328358208955224,0.34108615761380573,245.1037826538086,0.34108615761380573
54,2,Logistic Regression (Penalty = L2),0,0.65,0.7940298507462686,0.7728636001345126,2.2729647159576416,0.7728636001345126
55,2,Naive Bayes,0,0.65,0.7597014925373134,0.7331643347340449,0.23670625686645508,0.7331643347340449
56,2,KNeighbors Classifier,1,0.65,0.8164179104477612,0.781298849251192,3.933990240097046,0.781298849251192
57,2,SVC Classifier,1,0.65,0.7701492537313432,0.7363278087867438,4.8644068241119385,0.7363278087867438
58,2,Decision Tree,1,0.65,0.6492537313432836,0.6232688813325896,0.28995418548583984,0.6232688813325896
59,2,RandomForest,1,0.65,0.6179104477611941,0.3618187068346706,0.8898932933807373,0.3618187068346706
60,2,AdaBoost (Discrete),1,0.65,0.7776119402985074,0.7620370528508258,239.69533514976501,0.7620370528508258
61,2,AdaBoost (Real),1,0.65,0.6522388059701493,0.6133781819118073,223.868793964386,0.6133781819118073
62,2,Logistic Regression (Penalty = L2),1,0.65,0.7955223880597015,0.7734406771865738,2.04136323928833,0.7734406771865738
63,2,Naive Bayes,1,0.65,0.7686567164179104,0.7455927283504787,0.2940511703491211,0.7455927283504787
64,2,KNeighbors Classifier,2,0.65,0.8212121212121212,0.7956307028174254,3.8746564388275146,0.7956307028174254
65,2,SVC Classifier,2,0.65,0.793939393939394,0.7646935828261278,4.69421911239624,0.7646935828261278
66,2,Decision Tree,2,0.65,0.6924242424242424,0.6702061624113858,0.29008984565734863,0.6702061624113858
67,2,RandomForest,2,0.65,0.6484848484848484,0.5717508054722327,0.8701910972595215,0.5717508054722327
68,2,AdaBoost (Discrete),2,0.65,0.7651515151515151,0.7478068912819267,233.35914731025696,0.7478068912819267
69,2,AdaBoost (Real),2,0.65,0.7106060606060606,0.6837236012375748,215.42906260490417,0.6837236012375748
70,2,Logistic Regression (Penalty = L2),2,0.65,0.8136363636363636,0.7885734030983967,2.031076431274414,0.7885734030983967
71,2,Naive Bayes,2,0.65,0.7803030303030303,0.7574259393688533,0.29378819465637207,0.7574259393688533
72,3,KNeighbors Classifier,0,0.65,0.7880597014925373,0.7509157273335575,4.003742933273315,0.7509157273335575
73,3,SVC Classifier,0,0.65,0.7582089552238805,0.7286525526674663,4.593017816543579,0.7286525526674663
74,3,Decision Tree,0,0.65,0.6611940298507463,0.6264421543038493,0.22598910331726074,0.6264421543038493
75,3,RandomForest,0,0.65,0.5940298507462687,0.5525282906189831,0.826592206954956,0.0
76,3,AdaBoost (Discrete),0,0.65,0.753731343283582,0.7377301381860326,227.34666872024536,0.7377301381860326
77,3,AdaBoost (Real),0,0.65,0.5880597014925373,0.45996035112343414,219.20914673805237,0.45996035112343414
78,3,Logistic Regression (Penalty = L2),0,0.65,0.8074626865671641,0.7872734554234423,1.9977843761444092,0.7872734554234423
79,3,Naive Bayes,0,0.65,0.7626865671641792,0.7361514888601831,0.3001871109008789,0.7361514888601831
80,3,KNeighbors Classifier,1,0.65,0.8164179104477612,0.7883041932137228,3.8213424682617188,0.7883041932137228
81,3,SVC Classifier,1,0.65,0.755223880597015,0.722577636607436,4.506792306900024,0.722577636607436
82,3,Decision Tree,1,0.65,0.6746268656716418,0.6557361283228611,0.20563721656799316,0.6557361283228611
83,3,RandomForest,1,0.65,0.6208955223880597,0.36308095971361726,0.8152115345001221,0.36308095971361726
84,3,AdaBoost (Discrete),1,0.65,0.735820895522388,0.7097079502616522,208.37565517425537,0.7097079502616522
85,3,AdaBoost (Real),1,0.65,0.5656716417910448,0.5036146698959015,203.58846354484558,0.5036146698959015
86,3,Logistic Regression (Penalty = L2),1,0.65,0.7910447761194029,0.7707180978488197,1.886375904083252,0.7707180978488197
87,3,Naive Bayes,1,0.65,0.7522388059701492,0.7211576500397051,0.19622349739074707,0.7211576500397051
88,3,KNeighbors Classifier,2,0.65,0.8075757575757576,0.7779109532984005,3.544741153717041,0.7779109532984005
89,3,SVC Classifier,2,0.65,0.7833333333333333,0.7577439087540859,4.270823001861572,0.7577439087540859
90,3,Decision Tree,2,0.65,0.6681818181818182,0.6287745890768285,0.24840641021728516,0.6287745890768285
91,3,RandomForest,2,0.65,0.65,0.5715445641721487,0.7203598022460938,0.5715445641721487
92,3,AdaBoost (Discrete),2,0.65,0.7621212121212121,0.7420768409078723,191.46522641181946,0.7420768409078723
93,3,AdaBoost (Real),2,0.65,0.5969696969696969,0.5064431867645504,198.5125925540924,0.5064431867645504
94,3,Logistic Regression (Penalty = L2),2,0.65,0.8318181818181818,0.814624990906888,2.109126329421997,0.814624990906888
95,3,Naive Bayes,2,0.65,0.7787878787878788,0.7573264251808651,0.27002954483032227,0.7573264251808651
96,4,KNeighbors Classifier,0,0.65,0.8149253731343283,0.7893844966902256,2.980846881866455,0.7893844966902256
97,4,SVC Classifier,0,0.65,0.7716417910447761,0.7480526096795977,3.743162155151367,0.7480526096795977
98,4,Decision Tree,0,0.65,0.673134328358209,0.6463180275616888,0.26992154121398926,0.6463180275616888
99,4,RandomForest,0,0.65,0.6179104477611941,0.5655047946795496,0.6861081123352051,0.5655047946795496
100,4,AdaBoost (Discrete),0,0.65,0.7761194029850746,0.7562176283150783,172.81516790390015,0.7562176283150783
101,4,AdaBoost (Real),0,0.65,0.5313432835820896,0.34048298349319206,164.50202894210815,0.34048298349319206
102,4,Logistic Regression (Penalty = L2),0,0.65,0.8,0.7835655762993229,1.5220046043395996,0.7835655762993229
103,4,Naive Bayes,0,0.65,0.7761194029850746,0.7536552996406587,0.18716883659362793,0.7536552996406587
104,4,KNeighbors Classifier,1,0.65,0.826865671641791,0.8001019112952368,2.5183322429656982,0.8001019112952368
105,4,SVC Classifier,1,0.65,0.7776119402985074,0.7485348308858958,3.2658450603485107,0.7485348308858958
106,4,Decision Tree,1,0.65,0.7179104477611941,0.694692308074161,0.17977666854858398,0.694692308074161
107,4,RandomForest,1,0.65,0.6492537313432836,0.5252327707360605,0.6221911907196045,0.5252327707360605
108,4,AdaBoost (Discrete),1,0.65,0.7671641791044777,0.7509177244661687,153.9592080116272,0.7509177244661687
109,4,AdaBoost (Real),1,0.65,0.6283582089552239,0.5972579777349172,149.64951157569885,0.5972579777349172
110,4,Logistic Regression (Penalty = L2),1,0.65,0.8134328358208955,0.7976506824230358,1.5791940689086914,0.7976506824230358
111,4,Naive Bayes,1,0.65,0.7671641791044777,0.7414998490820451,0.18751764297485352,0.7414998490820451
112,4,KNeighbors Classifier,2,0.65,0.8287878787878787,0.7970772632422043,2.6375346183776855,0.7970772632422043
113,4,SVC Classifier,2,0.65,0.7909090909090909,0.7686606890855722,3.277465343475342,0.7686606890855722
114,4,Decision Tree,2,0.65,0.6984848484848485,0.6718421657090798,0.18005824089050293,0.6718421657090798
115,4,RandomForest,2,0.65,0.6196969696969697,0.47903409691073867,0.6380531787872314,0.47903409691073867
116,4,AdaBoost (Discrete),2,0.65,0.7803030303030303,0.7664706032398861,155.35026216506958,0.7664706032398861
117,4,AdaBoost (Real),2,0.65,0.6727272727272727,0.6449743167868535,164.7179605960846,0.6449743167868535
118,4,Logistic Regression (Penalty = L2),2,0.65,0.8348484848484848,0.8147619583497765,1.5482819080352783,0.8147619583497765
119,4,Naive Bayes,2,0.65,0.7818181818181819,0.7643433919068446,0.24866008758544922,0.7643433919068446
120,5,KNeighbors Classifier,0,0.65,0.8373134328358209,0.8151675213091487,2.111530065536499,0.8151675213091487
121,5,SVC Classifier,0,0.65,0.7656716417910447,0.7355591193904454,2.8001248836517334,0.7355591193904454
122,5,Decision Tree,0,0.65,0.6746268656716418,0.6603446424446089,0.18824243545532227,0.6603446424446089
123,5,RandomForest,0,0.65,0.6194029850746269,0.44035182371200327,0.598724365234375,0.44035182371200327
124,5,AdaBoost (Discrete),0,0.65,0.7716417910447761,0.7569175286462007,137.28269982337952,0.7569175286462007
125,5,AdaBoost (Real),0,0.65,0.5328358208955224,0.34108615761380573,140.72266292572021,0.34108615761380573
126,5,Logistic Regression (Penalty = L2),0,0.65,0.7955223880597015,0.7776386586734094,1.0534610748291016,0.7776386586734094
127,5,Naive Bayes,0,0.65,0.7716417910447761,0.7444719804597055,0.24871420860290527,0.7444719804597055
128,5,KNeighbors Classifier,1,0.65,0.8343283582089552,0.8082717344872146,1.9120254516601562,0.8082717344872146
129,5,SVC Classifier,1,0.65,0.7761194029850746,0.7439735595364838,2.664952039718628,0.7439735595364838
130,5,Decision Tree,1,0.65,0.6940298507462687,0.669284132158256,0.1676650047302246,0.669284132158256
131,5,RandomForest,1,0.65,0.6223880597014926,0.4674811000489885,0.562342643737793,0.4674811000489885
132,5,AdaBoost (Discrete),1,0.65,0.7686567164179104,0.7507024348168362,124.89652419090271,0.7507024348168362
133,5,AdaBoost (Real),1,0.65,0.6208955223880597,0.5910893788039915,114.70309734344482,0.5910893788039915
134,5,Logistic Regression (Penalty = L2),1,0.65,0.8194029850746268,0.8029821679315933,1.0378811359405518,0.8029821679315933
135,5,Naive Bayes,1,0.65,0.7701492537313432,0.7427799238265126,0.15614008903503418,0.7427799238265126
136,5,KNeighbors Classifier,2,0.65,0.8257575757575758,0.7979307645588246,1.7250659465789795,0.7979307645588246
137,5,SVC Classifier,2,0.65,0.7984848484848485,0.7770362593527766,2.487030267715454,0.7770362593527766
138,5,Decision Tree,2,0.65,0.7181818181818181,0.6963642494137345,0.1597580909729004,0.6963642494137345
139,5,RandomForest,2,0.65,0.6484848484848484,0.5261254759282724,0.4901578426361084,0.5261254759282724
140,5,AdaBoost (Discrete),2,0.65,0.7696969696969697,0.7580899894574633,117.36662936210632,0.7580899894574633
141,5,AdaBoost (Real),2,0.65,0.5636363636363636,0.40244982328656537,114.95467162132263,0.40244982328656537
142,5,Logistic Regression (Penalty = L2),2,0.65,0.8287878787878787,0.8138451312470039,1.0812289714813232,0.8138451312470039
143,5,Naive Bayes,2,0.65,0.7924242424242425,0.7765698867596446,0.1507432460784912,0.7765698867596446
144,6,KNeighbors Classifier,0,0.65,0.8194029850746268,0.7971613036397812,2.0991008281707764,0.7971613036397812
145,6,SVC Classifier,0,0.65,0.764179104477612,0.7338427863738073,2.573169469833374,0.7338427863738073
146,6,Decision Tree,0,0.65,0.6865671641791045,0.6646283897370757,0.14563536643981934,0.6646283897370757
147,6,RandomForest,0,0.65,0.6432835820895523,0.5443077226532205,0.4764878749847412,0.5443077226532205
148,6,AdaBoost (Discrete),0,0.65,0.7776119402985074,0.7644295540627996,126.02296376228333,0.7644295540627996
149,6,AdaBoost (Real),0,0.65,0.4955223880597015,0.3713830248030489,127.94421076774597,0.3713830248030489
150,6,Logistic Regression (Penalty = L2),0,0.65,0.8044776119402985,0.7853315387704772,1.1682307720184326,0.7853315387704772
151,6,Naive Bayes,0,0.65,0.7716417910447761,0.7452404352842278,0.20451903343200684,0.7452404352842278
152,6,KNeighbors Classifier,1,0.65,0.8194029850746268,0.7839899798125033,2.1444008350372314,0.7839899798125033
153,6,SVC Classifier,1,0.65,0.7686567164179104,0.7356376717010954,2.8060662746429443,0.7356376717010954
154,6,Decision Tree,1,0.65,0.6492537313432836,0.621438079543102,0.11035990715026855,0.621438079543102
155,6,RandomForest,1,0.65,0.6149253731343284,0.43237468922709094,0.5823700428009033,0.43237468922709094
156,6,AdaBoost (Discrete),1,0.65,0.7477611940298508,0.7260588583905923,120.42942404747009,0.7260588583905923
157,6,AdaBoost (Real),1,0.65,0.5417910447761194,0.455328629835691,121.28587675094604,0.455328629835691
158,6,Logistic Regression (Penalty = L2),1,0.65,0.8044776119402985,0.7863515660810694,1.1459276676177979,0.7863515660810694
159,6,Naive Bayes,1,0.65,0.7791044776119403,0.7562363006639643,0.1510322093963623,0.7562363006639643
160,6,KNeighbors Classifier,2,0.65,0.8121212121212121,0.7847314306594744,2.011152982711792,0.7847314306594744
161,6,SVC Classifier,2,0.65,0.7818181818181819,0.7579440307949151,2.5716676712036133,0.7579440307949151
162,6,Decision Tree,2,0.65,0.6954545454545454,0.6720068801548893,0.1931140422821045,0.6720068801548893
163,6,RandomForest,2,0.65,0.6363636363636364,0.4766837362236834,0.5732326507568359,0.4766837362236834
164,6,AdaBoost (Discrete),2,0.65,0.7833333333333333,0.7645801461844383,117.76617574691772,0.7645801461844383
165,6,AdaBoost (Real),2,0.65,0.6848484848484848,0.6379599331257625,117.53877234458923,0.6379599331257625
166,6,Logistic Regression (Penalty = L2),2,0.65,0.8287878787878787,0.8100881173216133,1.1361193656921387,0.8100881173216133
167,6,Naive Bayes,2,0.65,0.7924242424242425,0.7781066782827989,0.16776275634765625,0.7781066782827989
168,7,KNeighbors Classifier,0,0.65,0.808955223880597,0.7803185509496369,1.7688322067260742,0.7803185509496369
169,7,SVC Classifier,0,0.65,0.7731343283582089,0.7510255933312227,2.369108200073242,0.7510255933312227
170,7,Decision Tree,0,0.65,0.682089552238806,0.6571964960476367,0.09945178031921387,0.6571964960476367
171,7,RandomForest,0,0.65,0.5567164179104478,0.4416376688848377,0.48429059982299805,0.0
172,7,AdaBoost (Discrete),0,0.65,0.7731343283582089,0.7518562716392121,108.4084701538086,0.7518562716392121
173,7,AdaBoost (Real),0,0.65,0.5328358208955224,0.34108615761380573,106.82098722457886,0.34108615761380573
174,7,Logistic Regression (Penalty = L2),0,0.65,0.7985074626865671,0.7813539079165005,0.8960821628570557,0.7813539079165005
175,7,Naive Bayes,0,0.65,0.7686567164179104,0.7420103341061238,0.1300647258758545,0.7420103341061238
176,7,KNeighbors Classifier,1,0.65,0.8194029850746268,0.7876464679357985,1.6491899490356445,0.7876464679357985
177,7,SVC Classifier,1,0.65,0.7776119402985074,0.7425715628772083,2.188951015472412,0.7425715628772083
178,7,Decision Tree,1,0.65,0.7238805970149254,0.7095106271020002,0.13208866119384766,0.7095106271020002
179,7,RandomForest,1,0.65,0.5970149253731343,0.720857250698034,0.4229128360748291,0.0
180,7,AdaBoost (Discrete),1,0.65,0.7582089552238805,0.7354916328795199,103.23555946350098,0.7354916328795199
181,7,AdaBoost (Real),1,0.65,0.7059701492537314,0.691588906421398,99.87159848213196,0.691588906421398
182,7,Logistic Regression (Penalty = L2),1,0.65,0.8119402985074626,0.793296974250225,1.0099008083343506,0.793296974250225
183,7,Naive Bayes,1,0.65,0.7791044776119403,0.7541754133623011,0.13188505172729492,0.7541754133623011
184,7,KNeighbors Classifier,2,0.65,0.8196969696969697,0.7864214925906432,1.4760591983795166,0.7864214925906432
185,7,SVC Classifier,2,0.65,0.7924242424242425,0.7704936045525524,2.0294651985168457,0.7704936045525524
186,7,Decision Tree,2,0.65,0.656060606060606,0.6316871290876642,0.11963725090026855,0.6316871290876642
187,7,RandomForest,2,0.65,0.6060606060606061,0.555672493402013,0.3967914581298828,0.0
188,7,AdaBoost (Discrete),2,0.65,0.7757575757575758,0.7581391641561008,98.3113739490509,0.7581391641561008
189,7,AdaBoost (Real),2,0.65,0.5924242424242424,0.5400880260102864,98.73326849937439,0.5400880260102864
190,7,Logistic Regression (Penalty = L2),2,0.65,0.8242424242424242,0.8074448528815144,0.8721907138824463,0.8074448528815144
191,7,Naive Bayes,2,0.65,0.7909090909090909,0.7704203794041383,0.11342048645019531,0.7704203794041383
192,8,KNeighbors Classifier,0,0.65,0.8208955223880597,0.7962424418143111,1.665445327758789,0.7962424418143111
193,8,SVC Classifier,0,0.65,0.764179104477612,0.740194481427349,2.161146879196167,0.740194481427349
194,8,Decision Tree,0,0.65,0.6805970149253732,0.6627606819746131,0.11592388153076172,0.6627606819746131
195,8,RandomForest,0,0.65,0.6402985074626866,0.5378438116542502,0.4446413516998291,0.5378438116542502
196,8,AdaBoost (Discrete),0,0.65,0.7686567164179104,0.7534638699524882,98.49787545204163,0.7534638699524882
197,8,AdaBoost (Real),0,0.65,0.4955223880597015,0.3713830248030489,91.79324698448181,0.3713830248030489
198,8,Logistic Regression (Penalty = L2),0,0.65,0.8074626865671641,0.7897390964604059,0.8918519020080566,0.7897390964604059
199,8,Naive Bayes,0,0.65,0.7701492537313432,0.7485387871069744,0.14070367813110352,0.7485387871069744
200,8,KNeighbors Classifier,1,0.65,0.8253731343283582,0.7938524791655519,1.5499701499938965,0.7938524791655519
201,8,SVC Classifier,1,0.65,0.7671641791044777,0.7396540536577467,1.9622466564178467,0.7396540536577467
202,8,Decision Tree,1,0.65,0.6761194029850747,0.6554241903999212,0.09082674980163574,0.6554241903999212
203,8,RandomForest,1,0.65,0.6179104477611941,0.5254264710604156,0.41443753242492676,0.5254264710604156
204,8,AdaBoost (Discrete),1,0.65,0.755223880597015,0.7354535719867822,88.4580569267273,0.7354535719867822
205,8,AdaBoost (Real),1,0.65,0.7149253731343284,0.6902980869824065,88.88237452507019,0.6902980869824065
206,8,Logistic Regression (Penalty = L2),1,0.65,0.7970149253731343,0.7776800926808423,0.8075881004333496,0.7776800926808423
207,8,Naive Bayes,1,0.65,0.7776119402985074,0.753887379194334,0.1195981502532959,0.753887379194334
208,8,KNeighbors Classifier,2,0.65,0.8257575757575758,0.7995257502784197,1.5353517532348633,0.7995257502784197
209,8,SVC Classifier,2,0.65,0.7863636363636364,0.7637707762801856,1.9813244342803955,0.7637707762801856
210,8,Decision Tree,2,0.65,0.696969696969697,0.6655148117165631,0.13481616973876953,0.6655148117165631
211,8,RandomForest,2,0.65,0.6333333333333333,0.47654721193009103,0.3928334712982178,0.47654721193009103
212,8,AdaBoost (Discrete),2,0.65,0.7666666666666667,0.7455360353760793,89.07177233695984,0.7455360353760793
213,8,AdaBoost (Real),2,0.65,0.7045454545454546,0.6897586262249723,91.19939494132996,0.6897586262249723
214,8,Logistic Regression (Penalty = L2),2,0.65,0.8212121212121212,0.7991240110366216,0.8051257133483887,0.7991240110366216
215,8,Naive Bayes,2,0.65,0.8,0.7852455392246774,0.10322737693786621,0.7852455392246774
216,9,KNeighbors Classifier,0,0.65,0.8119402985074626,0.7875015098815711,1.1071879863739014,0.7875015098815711
217,9,SVC Classifier,0,0.65,0.753731343283582,0.7233385004977592,1.460749864578247,0.7233385004977592
218,9,Decision Tree,0,0.65,0.6567164179104478,0.6342219412368428,0.09956240653991699,0.6342219412368428
219,9,RandomForest,0,0.65,0.5656716417910448,0.45827034240248316,0.35117197036743164,0.45827034240248316
220,9,AdaBoost (Discrete),0,0.65,0.7298507462686568,0.7026375044403791,71.26008868217468,0.7026375044403791
221,9,AdaBoost (Real),0,0.65,0.5880597014925373,0.45996035112343414,74.56480765342712,0.45996035112343414
222,9,Logistic Regression (Penalty = L2),0,0.65,0.7955223880597015,0.7735680980196227,0.734076976776123,0.7735680980196227
223,9,Naive Bayes,0,0.65,0.7686567164179104,0.7403947009921469,0.08911991119384766,0.7403947009921469
224,9,KNeighbors Classifier,1,0.65,0.8238805970149253,0.7925502752101812,1.2222249507904053,0.7925502752101812
225,9,SVC Classifier,1,0.65,0.7626865671641792,0.7218742892992784,1.7143096923828125,0.7218742892992784
226,9,Decision Tree,1,0.65,0.6462686567164179,0.6181072615159001,0.10328984260559082,0.6181072615159001
227,9,RandomForest,1,0.65,0.5686567164179105,0.6661657887155031,0.35608649253845215,0.0
228,9,AdaBoost (Discrete),1,0.65,0.7432835820895523,0.7265424672645772,76.34700345993042,0.7265424672645772
229,9,AdaBoost (Real),1,0.65,0.6895522388059702,0.6674596806516225,71.99384427070618,0.6674596806516225
230,9,Logistic Regression (Penalty = L2),1,0.65,0.7895522388059701,0.7650237581757515,0.6224784851074219,0.7650237581757515
231,9,Naive Bayes,1,0.65,0.7835820895522388,0.7603141985386682,0.11616706848144531,0.7603141985386682
232,9,KNeighbors Classifier,2,0.65,0.8121212121212121,0.7777280251609651,1.1227142810821533,0.7777280251609651
233,9,SVC Classifier,2,0.65,0.7924242424242425,0.7707131571273389,1.596531629562378,0.7707131571273389
234,9,Decision Tree,2,0.65,0.7136363636363636,0.6941850562689355,0.09083724021911621,0.6941850562689355
235,9,RandomForest,2,0.65,0.6545454545454545,0.5754025471264907,0.36307430267333984,0.5754025471264907
236,9,AdaBoost (Discrete),2,0.65,0.7515151515151515,0.7238001049388675,72.55216360092163,0.7238001049388675
237,9,AdaBoost (Real),2,0.65,0.5227272727272727,0.2873034440454304,73.63158321380615,0.2873034440454304
238,9,Logistic Regression (Penalty = L2),2,0.65,0.806060606060606,0.7827001363679494,0.6178088188171387,0.7827001363679494
239,9,Naive Bayes,2,0.65,0.7909090909090909,0.7711687638509819,0.10863256454467773,0.7711687638509819
240,10,KNeighbors Classifier,0,0.65,0.7865671641791044,0.7469123272391636,1.8198318481445312,0.7469123272391636
241,10,SVC Classifier,0,0.65,0.7597014925373134,0.7351125512830615,1.8912239074707031,0.7351125512830615
242,10,Decision Tree,0,0.65,0.6582089552238806,0.6303017216960728,0.08512210845947266,0.6303017216960728
243,10,RandomForest,0,0.65,0.5835820895522388,0.45453698686392763,0.33588314056396484,0.45453698686392763
244,10,AdaBoost (Discrete),0,0.65,0.7716417910447761,0.7498597696096184,97.33305287361145,0.7498597696096184
245,10,AdaBoost (Real),0,0.65,0.5313432835820896,0.34048298349319206,97.50317168235779,0.34048298349319206
246,10,Logistic Regression (Penalty = L2),0,0.65,0.7985074626865671,0.7798925943849864,0.782677412033081,0.7798925943849864
247,10,Naive Bayes,0,0.65,0.7626865671641792,0.7371125509440368,0.11310887336730957,0.7371125509440368
248,10,KNeighbors Classifier,1,0.65,0.8059701492537313,0.7669681038561402,1.4647059440612793,0.7669681038561402
249,10,SVC Classifier,1,0.65,0.753731343283582,0.717707385141048,1.6452488899230957,0.717707385141048
250,10,Decision Tree,1,0.65,0.6477611940298508,0.6097843342325183,0.0809476375579834,0.6097843342325183
251,10,RandomForest,1,0.65,0.5373134328358209,0.446400094182201,0.2774975299835205,0.0
252,10,AdaBoost (Discrete),1,0.65,0.7716417910447761,0.7517959001998219,93.50433683395386,0.7517959001998219
253,10,AdaBoost (Real),1,0.65,0.6686567164179105,0.6338506311448856,92.97738790512085,0.6338506311448856
254,10,Logistic Regression (Penalty = L2),1,0.65,0.7970149253731343,0.776296708040899,0.9678025245666504,0.776296708040899
255,10,Naive Bayes,1,0.65,0.7507462686567165,0.7205836968128302,0.12763237953186035,0.7205836968128302
256,10,KNeighbors Classifier,2,0.65,0.8212121212121212,0.7933081224526592,1.714076042175293,0.7933081224526592
257,10,SVC Classifier,2,0.65,0.7954545454545454,0.7704496335805067,1.8827991485595703,0.7704496335805067
258,10,Decision Tree,2,0.65,0.6848484848484848,0.6672930291557476,0.11161589622497559,0.6672930291557476
259,10,RandomForest,2,0.65,0.6090909090909091,0.5556678510372417,0.30168604850769043,0.0
260,10,AdaBoost (Discrete),2,0.65,0.7666666666666667,0.7493995449634023,88.32817435264587,0.7493995449634023
261,10,AdaBoost (Real),2,0.65,0.509090909090909,0.49743596655837563,84.4299042224884,0.0
262,10,Logistic Regression (Penalty = L2),2,0.65,0.8378787878787879,0.8205643564103569,0.9948422908782959,0.8205643564103569
263,10,Naive Bayes,2,0.65,0.7818181818181819,0.7610827229402178,0.11848139762878418,0.7610827229402178
264,11,KNeighbors Classifier,0,0.65,0.7776119402985074,0.7430238249513083,2.450699806213379,0.7430238249513083
265,11,SVC Classifier,0,0.65,0.755223880597015,0.7264619234503342,2.4279825687408447,0.7264619234503342
266,11,Decision Tree,0,0.65,0.6537313432835821,0.6364834746787098,0.1378469467163086,0.6364834746787098
267,11,RandomForest,0,0.65,0.5955223880597015,0.5243162014655386,0.3796086311340332,0.5243162014655386
268,11,AdaBoost (Discrete),0,0.65,0.7686567164179104,0.7548905850644128,109.20983672142029,0.7548905850644128
269,11,AdaBoost (Real),0,0.65,0.5328358208955224,0.34108615761380573,109.17848181724548,0.34108615761380573
270,11,Logistic Regression (Penalty = L2),0,0.65,0.8,0.7810873239249857,1.0208454132080078,0.7810873239249857
271,11,Naive Bayes,0,0.65,0.7492537313432835,0.7226343824846347,0.16143417358398438,0.7226343824846347
272,11,KNeighbors Classifier,1,0.65,0.8059701492537313,0.7708657187215903,1.966956615447998,0.7708657187215903
273,11,SVC Classifier,1,0.65,0.7507462686567165,0.719133720809234,2.0811829566955566,0.719133720809234
274,11,Decision Tree,1,0.65,0.6477611940298508,0.6198448372911832,0.11885595321655273,0.6198448372911832
275,11,RandomForest,1,0.65,0.5985074626865672,0.4814887489181153,0.28885602951049805,0.4814887489181153
276,11,AdaBoost (Discrete),1,0.65,0.7820895522388059,0.7683546781505637,109.05422854423523,0.7683546781505637
277,11,AdaBoost (Real),1,0.65,0.5029850746268657,0.3746341580390796,96.19686651229858,0.3746341580390796
278,11,Logistic Regression (Penalty = L2),1,0.65,0.7850746268656716,0.762342955840795,1.0232949256896973,0.762342955840795
279,11,Naive Bayes,1,0.65,0.7432835820895523,0.7145235274595777,0.1125497817993164,0.7145235274595777
280,11,KNeighbors Classifier,2,0.65,0.8015151515151515,0.7727192007126615,1.5232489109039307,0.7727192007126615
281,11,SVC Classifier,2,0.65,0.7924242424242425,0.7486492021445246,1.6732919216156006,0.7486492021445246
282,11,Decision Tree,2,0.65,0.6772727272727272,0.6579857208506664,0.07808542251586914,0.6579857208506664
283,11,RandomForest,2,0.65,0.6318181818181818,0.5851278416435394,0.26589322090148926,0.5851278416435394
284,11,AdaBoost (Discrete),2,0.65,0.7742424242424243,0.7560958408468702,94.05446124076843,0.7560958408468702
285,11,AdaBoost (Real),2,0.65,0.47878787878787876,0.3469802686104181,88.02959060668945,0.0
286,11,Logistic Regression (Penalty = L2),2,0.65,0.8090909090909091,0.7864270154879388,0.9958755970001221,0.7864270154879388
287,11,Naive Bayes,2,0.65,0.7742424242424243,0.749825627880721,0.13699746131896973,0.749825627880721
288,12,KNeighbors Classifier,0,0.65,0.8328358208955224,0.8049833696855472,0.3745102882385254,0.8049833696855472
289,12,SVC Classifier,0,0.65,0.7656716417910447,0.7382110543099865,0.7811298370361328,0.7382110543099865
290,12,Decision Tree,0,0.65,0.6776119402985075,0.6568221830214859,0.05926799774169922,0.6568221830214859
291,12,RandomForest,0,0.65,0.5955223880597015,0.3991065940843972,0.1995072364807129,0.3991065940843972
292,12,AdaBoost (Discrete),0,0.65,0.746268656716418,0.7251724992454334,31.97822380065918,0.7251724992454334
293,12,AdaBoost (Real),0,0.65,0.4955223880597015,0.3713830248030489,34.65201377868652,0.3713830248030489
294,12,Logistic Regression (Penalty = L2),0,0.65,0.808955223880597,0.7926003250314404,0.3195157051086426,0.7926003250314404
295,12,Naive Bayes,0,0.65,0.7850746268656716,0.7630591670229755,0.059508562088012695,0.7630591670229755
296,12,KNeighbors Classifier,1,0.65,0.826865671641791,0.801239505352958,0.505927562713623,0.801239505352958
297,12,SVC Classifier,1,0.65,0.7746268656716417,0.7428222873942234,0.7691638469696045,0.7428222873942234
298,12,Decision Tree,1,0.65,0.691044776119403,0.6630551060397906,0.03359866142272949,0.6630551060397906
299,12,RandomForest,1,0.65,0.6522388059701493,0.5244688027195293,0.13300681114196777,0.5244688027195293
300,12,AdaBoost (Discrete),1,0.65,0.753731343283582,0.738636908323816,32.57385492324829,0.738636908323816
301,12,AdaBoost (Real),1,0.65,0.5850746268656717,0.5415230170689981,33.80583453178406,0.5415230170689981
302,12,Logistic Regression (Penalty = L2),1,0.65,0.7940298507462686,0.7729004636264286,0.332261323928833,0.7729004636264286
303,12,Naive Bayes,1,0.65,0.7850746268656716,0.7603852117855875,0.06573915481567383,0.7603852117855875
304,12,KNeighbors Classifier,2,0.65,0.8242424242424242,0.7966843385975955,0.424727201461792,0.7966843385975955
305,12,SVC Classifier,2,0.65,0.7803030303030303,0.7569621353970415,0.7964165210723877,0.7569621353970415
306,12,Decision Tree,2,0.65,0.7045454545454546,0.6798312881081638,0.060460805892944336,0.6798312881081638
307,12,RandomForest,2,0.65,0.6439393939393939,0.4513616856061227,0.20457816123962402,0.4513616856061227
308,12,AdaBoost (Discrete),2,0.65,0.7666666666666667,0.7462761688783467,30.916956186294556,0.7462761688783467
309,12,AdaBoost (Real),2,0.65,0.5893939393939394,0.45295847731206124,29.610981225967407,0.45295847731206124
310,12,Logistic Regression (Penalty = L2),2,0.65,0.8166666666666667,0.8013923745376861,0.3231947422027588,0.8013923745376861
311,12,Naive Bayes,2,0.65,0.7909090909090909,0.772340536118648,0.04072427749633789,0.772340536118648
