,feat_set_id,classifier,fold_id,feat_th,score,geo_score,exec_t,geo_score_woz
0,0,KNeighbors Classifier,0,0.6,0.796078431372549,0.5060256283691614,0.38805460929870605,0.0
1,0,SVC Classifier,0,0.6,0.7607843137254902,1.0,0.41556501388549805,0.0
2,0,Decision Tree,0,0.6,0.7843137254901961,0.6892502529678152,0.001954793930053711,0.0
3,0,RandomForest,0,0.6,0.7647058823529411,0.4472135954999579,0.7269246578216553,0.0
4,0,AdaBoost (Discrete),0,0.6,0.7725490196078432,0.392782166680611,46.441991567611694,0.0
5,0,AdaBoost (Real),0,0.6,0.6901960784313725,0.3331161577772725,71.02580046653748,0.0
6,0,Logistic Regression (Penalty = L2),0,0.6,0.7450980392156863,0.3247710856414427,0.5263369083404541,0.0
7,0,Naive Bayes,0,0.6,0.09019607843137255,0.30139632434832064,0.349376916885376,0.0
8,0,KNeighbors Classifier,1,0.6,0.816,0.500678109049936,0.3324778079986572,0.0
9,0,SVC Classifier,1,0.6,0.776,1.0,0.3281443119049072,0.0
10,0,Decision Tree,1,0.6,0.808,0.6719398651744072,0.0016317367553710938,0.0
11,0,RandomForest,1,0.6,0.78,0.408248290463863,0.6955132484436035,0.0
12,0,AdaBoost (Discrete),1,0.6,0.764,0.3480371832603735,46.5767080783844,0.0
13,0,AdaBoost (Real),1,0.6,0.696,0.3354999949395122,64.36341834068298,0.0
14,0,Logistic Regression (Penalty = L2),1,0.6,0.812,0.3980789945313083,0.5664913654327393,0.0
15,0,Naive Bayes,1,0.6,0.08,0.45986329782677027,0.24061822891235352,0.0
16,0,KNeighbors Classifier,2,0.6,0.8065843621399177,0.5525312842792302,0.41558051109313965,0.0
17,0,SVC Classifier,2,0.6,0.7983539094650206,1.0,0.4584085941314697,0.0
18,0,Decision Tree,2,0.6,0.7818930041152263,0.6407239531596868,0.0027837753295898438,0.0
19,0,RandomForest,2,0.6,0.7901234567901234,0.6997790520224827,0.8199832439422607,0.0
20,0,AdaBoost (Discrete),2,0.6,0.7037037037037037,0.5969397169494607,49.460829734802246,0.0
21,0,AdaBoost (Real),2,0.6,0.6790123456790124,0.48685143336787057,67.7096803188324,0.0
22,0,Logistic Regression (Penalty = L2),2,0.6,0.8106995884773662,0.5268533750468268,0.6204149723052979,0.0
23,0,Naive Bayes,2,0.6,0.07407407407407407,0.6729500963161781,0.18140482902526855,0.0
24,1,KNeighbors Classifier,0,0.6,0.8235294117647058,0.6503474987929083,0.2798726558685303,0.0
25,1,SVC Classifier,0,0.6,0.7607843137254902,1.0,0.38726377487182617,0.0
26,1,Decision Tree,0,0.6,0.7490196078431373,0.8699329300974492,0.12631487846374512,0.0
27,1,RandomForest,0,0.6,0.7607843137254902,1.0,0.7807848453521729,0.0
28,1,AdaBoost (Discrete),0,0.6,0.6823529411764706,0.49252815761255914,60.02949023246765,0.0
29,1,AdaBoost (Real),0,0.6,0.6549019607843137,0.4451688211503389,72.51591777801514,0.0
30,1,Logistic Regression (Penalty = L2),0,0.6,0.7686274509803922,0.3261165666552968,0.6571321487426758,0.0
31,1,Naive Bayes,0,0.6,0.10588235294117647,0.3214563589573323,0.2645752429962158,0.0
32,1,KNeighbors Classifier,1,0.6,0.748,0.7539082818483266,0.2601890563964844,0.0
33,1,SVC Classifier,1,0.6,0.776,1.0,0.6052429676055908,0.0
34,1,Decision Tree,1,0.6,0.76,0.816877199043428,0.15046095848083496,0.0
35,1,RandomForest,1,0.6,0.776,1.0,0.8369083404541016,0.0
36,1,AdaBoost (Discrete),1,0.6,0.744,0.5310808623253931,55.33994150161743,0.0
37,1,AdaBoost (Real),1,0.6,0.704,0.4207381669736717,70.7398157119751,0.0
38,1,Logistic Regression (Penalty = L2),1,0.6,0.788,0.39257956107813935,0.5995638370513916,0.0
39,1,Naive Bayes,1,0.6,0.096,0.3725558144718659,0.12184691429138184,0.0
40,1,KNeighbors Classifier,2,0.6,0.8148148148148148,0.6139669738544413,0.5067386627197266,0.0
41,1,SVC Classifier,2,0.6,0.7983539094650206,1.0,0.42635607719421387,0.0
42,1,Decision Tree,2,0.6,0.7736625514403292,0.8179319290975782,0.11042261123657227,0.0
43,1,RandomForest,2,0.6,0.8065843621399177,0.7071067811865476,0.8937745094299316,0.0
44,1,AdaBoost (Discrete),2,0.6,0.6748971193415638,0.5370562240909136,56.695006132125854,0.0
45,1,AdaBoost (Real),2,0.6,0.6049382716049383,0.5490120149313374,74.12412309646606,0.0
46,1,Logistic Regression (Penalty = L2),2,0.6,0.7818930041152263,0.44646733417548745,0.6083283424377441,0.0
47,1,Naive Bayes,2,0.6,0.09876543209876543,0.4746746450380486,0.24444842338562012,0.0
48,2,KNeighbors Classifier,0,0.6,0.7803921568627451,0.5042343216221411,0.49973464012145996,0.0
49,2,SVC Classifier,0,0.6,0.7607843137254902,1.0,0.37211132049560547,0.0
50,2,Decision Tree,0,0.6,0.788235294117647,0.5937822241031144,0.12226080894470215,0.0
51,2,RandomForest,0,0.6,0.7607843137254902,1.0,1.1087563037872314,0.0
52,2,AdaBoost (Discrete),0,0.6,0.7764705882352941,0.4408830753517122,54.387073040008545,0.0
53,2,AdaBoost (Real),0,0.6,0.7215686274509804,0.3764779058574139,71.53384971618652,0.0
54,2,Logistic Regression (Penalty = L2),0,0.6,0.7686274509803922,0.27847663515852666,0.5499570369720459,0.0
55,2,Naive Bayes,0,0.6,0.08235294117647059,0.2615475402820864,0.3604249954223633,0.0
56,2,KNeighbors Classifier,1,0.6,0.804,0.39738847850165865,0.524439811706543,0.0
57,2,SVC Classifier,1,0.6,0.776,1.0,0.3803744316101074,0.0
58,2,Decision Tree,1,0.6,0.816,0.673138698533935,0.12262725830078125,0.0
59,2,RandomForest,1,0.6,0.776,1.0,0.9844493865966797,0.0
60,2,AdaBoost (Discrete),1,0.6,0.804,0.523670760822645,52.732375144958496,0.0
61,2,AdaBoost (Real),1,0.6,0.736,0.48370513370019536,73.72120428085327,0.0
62,2,Logistic Regression (Penalty = L2),1,0.6,0.784,0.2853751021838173,0.4692356586456299,0.0
63,2,Naive Bayes,1,0.6,0.064,0.2363810231703655,0.2721679210662842,0.0
64,2,KNeighbors Classifier,2,0.6,0.7983539094650206,0.6005372400844862,0.4189910888671875,0.0
65,2,SVC Classifier,2,0.6,0.7983539094650206,1.0,0.43376874923706055,0.0
66,2,Decision Tree,2,0.6,0.7983539094650206,0.6728399902644729,0.002130746841430664,0.0
67,2,RandomForest,2,0.6,0.7901234567901234,0.6997790520224827,0.9781622886657715,0.0
68,2,AdaBoost (Discrete),2,0.6,0.8106995884773662,0.578166563621953,56.40849995613098,0.0
69,2,AdaBoost (Real),2,0.6,0.7037037037037037,0.6126645006596788,72.06850147247314,0.0
70,2,Logistic Regression (Penalty = L2),2,0.6,0.7860082304526749,0.5309421304177872,0.4555394649505615,0.0
71,2,Naive Bayes,2,0.6,0.06995884773662552,0.41008714685326075,0.27497339248657227,0.0
72,3,KNeighbors Classifier,0,0.6,0.7686274509803922,0.46624304221325463,0.2729620933532715,0.0
73,3,SVC Classifier,0,0.6,0.7607843137254902,1.0,0.2754216194152832,0.0
74,3,Decision Tree,0,0.6,0.7725490196078432,0.392782166680611,0.13408708572387695,0.0
75,3,RandomForest,0,0.6,0.7607843137254902,1.0,0.9474401473999023,0.0
76,3,AdaBoost (Discrete),0,0.6,0.7725490196078432,0.5054930082353892,53.26958131790161,0.0
77,3,AdaBoost (Real),0,0.6,0.7294117647058823,0.39964570741829464,68.72105884552002,0.0
78,3,Logistic Regression (Penalty = L2),0,0.6,0.7607843137254902,0.6291870061116916,0.3837409019470215,0.0
79,3,Naive Bayes,0,0.6,0.06274509803921569,0.23030374575892226,0.37701988220214844,0.0
80,3,KNeighbors Classifier,1,0.6,0.8,0.8419809710978226,0.2915761470794678,0.0
81,3,SVC Classifier,1,0.6,0.776,1.0,0.27527689933776855,0.0
82,3,Decision Tree,1,0.6,0.776,0.579735671095731,0.13420891761779785,0.0
83,3,RandomForest,1,0.6,0.776,1.0,0.813427209854126,0.0
84,3,AdaBoost (Discrete),1,0.6,0.78,0.9922379162651601,52.79891324043274,0.0
85,3,AdaBoost (Real),1,0.6,0.744,0.5714377759931166,68.78624701499939,0.0
86,3,Logistic Regression (Penalty = L2),1,0.6,0.776,1.0,0.26723313331604004,0.0
87,3,Naive Bayes,1,0.6,0.064,0.6258269289063796,0.3804793357849121,0.0
88,3,KNeighbors Classifier,2,0.6,0.7736625514403292,0.7680252718691689,0.2861135005950928,0.0
89,3,SVC Classifier,2,0.6,0.7983539094650206,1.0,0.27361559867858887,0.0
90,3,Decision Tree,2,0.6,0.7695473251028807,0.7669563405778318,0.13035917282104492,0.0
91,3,RandomForest,2,0.6,0.7901234567901234,0.6997790520224827,0.922551155090332,0.0
92,3,AdaBoost (Discrete),2,0.6,0.7901234567901234,0.6997790520224827,54.06497120857239,0.0
93,3,AdaBoost (Real),2,0.6,0.7325102880658436,0.5307199614827021,80.33399677276611,0.0
94,3,Logistic Regression (Penalty = L2),2,0.6,0.7777777777777778,0.4930304499002129,0.4509236812591553,0.0
95,3,Naive Bayes,2,0.6,0.053497942386831275,0.6597539553864471,0.2864208221435547,0.0
96,4,KNeighbors Classifier,0,0.6,0.7529411764705882,0.2836456415383528,0.42133140563964844,0.0
97,4,SVC Classifier,0,0.6,0.7607843137254902,1.0,0.28171300888061523,0.0
98,4,Decision Tree,0,0.6,0.7686274509803922,0.4394967226043702,0.14246082305908203,0.0
99,4,RandomForest,0,0.6,0.7607843137254902,1.0,0.9698545932769775,0.0
100,4,AdaBoost (Discrete),0,0.6,0.7647058823529411,0.2620113175395233,57.24134635925293,0.0
101,4,AdaBoost (Real),0,0.6,0.7607843137254902,0.3769890791947507,72.38008856773376,0.0
102,4,Logistic Regression (Penalty = L2),0,0.6,0.7647058823529411,0.29753668233353536,0.39165472984313965,0.0
103,4,Naive Bayes,0,0.6,0.050980392156862744,0.3104250684846592,0.24493169784545898,0.0
104,4,KNeighbors Classifier,1,0.6,0.764,0.4872371275731244,0.41591787338256836,0.0
105,4,SVC Classifier,1,0.6,0.776,1.0,0.2802882194519043,0.0
106,4,Decision Tree,1,0.6,0.796,0.44663617196473115,0.13433289527893066,0.0
107,4,RandomForest,1,0.6,0.776,1.0,1.0327403545379639,0.0
108,4,AdaBoost (Discrete),1,0.6,0.776,0.3207200281427488,51.58214449882507,0.0
109,4,AdaBoost (Real),1,0.6,0.78,0.32127586985818757,66.44909167289734,0.0
110,4,Logistic Regression (Penalty = L2),1,0.6,0.784,0.3218297948685433,0.48016357421875,0.0
111,4,Naive Bayes,1,0.6,0.04,0.33144540173399867,0.15414762496948242,0.0
112,4,KNeighbors Classifier,2,0.6,0.7942386831275721,0.4691714006711515,0.3135843276977539,0.0
113,4,SVC Classifier,2,0.6,0.7983539094650206,1.0,0.3003573417663574,0.0
114,4,Decision Tree,2,0.6,0.7942386831275721,0.43723205369083706,0.1982421875,0.0
115,4,RandomForest,2,0.6,0.7901234567901234,0.9896907216494846,0.989891529083252,0.0
116,4,AdaBoost (Discrete),2,0.6,0.7983539094650206,0.5465126348554787,53.850475549697876,0.0
117,4,AdaBoost (Real),2,0.6,0.7983539094650206,0.5807563345957418,72.92206501960754,0.0
118,4,Logistic Regression (Penalty = L2),2,0.6,0.7860082304526749,0.4470694492780124,0.38477373123168945,0.0
119,4,Naive Bayes,2,0.6,0.037037037037037035,0.7211247851537042,0.25599026679992676,0.0
120,5,KNeighbors Classifier,0,0.6,0.788235294117647,0.5826651104983986,0.38039207458496094,0.0
121,5,SVC Classifier,0,0.6,0.7607843137254902,1.0,0.26182103157043457,0.0
122,5,Decision Tree,0,0.6,0.788235294117647,0.47254372834850306,0.12647366523742676,0.0
123,5,RandomForest,0,0.6,0.7607843137254902,1.0,0.9188504219055176,0.0
124,5,AdaBoost (Discrete),0,0.6,0.7568627450980392,0.31036139395902695,53.10616970062256,0.0
125,5,AdaBoost (Real),0,0.6,0.7372549019607844,0.4456340833781532,70.93212795257568,0.0
126,5,Logistic Regression (Penalty = L2),0,0.6,0.7647058823529411,0.4294011091800735,0.24243760108947754,0.0
127,5,Naive Bayes,0,0.6,0.07058823529411765,0.26943944845710593,0.3681504726409912,0.0
128,5,KNeighbors Classifier,1,0.6,0.784,0.5817734230739429,0.3607368469238281,0.0
129,5,SVC Classifier,1,0.6,0.776,1.0,0.3583567142486572,0.0
130,5,Decision Tree,1,0.6,0.808,0.5546845547235159,0.0022559165954589844,0.0
131,5,RandomForest,1,0.6,0.776,1.0,0.9500296115875244,0.0
132,5,AdaBoost (Discrete),1,0.6,0.8,0.5870433681905574,49.7550630569458,0.0
133,5,AdaBoost (Real),1,0.6,0.728,0.3947480687843487,63.337302684783936,0.0
134,5,Logistic Regression (Penalty = L2),1,0.6,0.776,0.446059493974681,0.3479769229888916,0.0
135,5,Naive Bayes,1,0.6,0.068,0.28124075200533355,0.23563718795776367,0.0
136,5,KNeighbors Classifier,2,0.6,0.7736625514403292,0.7680252718691689,0.4652564525604248,0.0
137,5,SVC Classifier,2,0.6,0.7983539094650206,1.0,0.23558688163757324,0.0
138,5,Decision Tree,2,0.6,0.7777777777777778,0.6492205568287611,0.12683701515197754,0.0
139,5,RandomForest,2,0.6,0.7983539094650206,1.0,0.7070629596710205,0.0
140,5,AdaBoost (Discrete),2,0.6,0.7942386831275721,0.6997015012868739,50.286612033843994,0.0
141,5,AdaBoost (Real),2,0.6,0.7283950617283951,0.7624866433261743,65.7992491722107,0.0
142,5,Logistic Regression (Penalty = L2),2,0.6,0.7736625514403292,0.4921452945855164,0.3388528823852539,0.0
143,5,Naive Bayes,2,0.6,0.06172839506172839,0.35700159669360654,0.2546885013580322,0.0
144,6,KNeighbors Classifier,0,0.6,0.7725490196078432,0.5033266004844897,0.3424813747406006,0.0
145,6,SVC Classifier,0,0.6,0.7607843137254902,1.0,0.3576178550720215,0.0
146,6,Decision Tree,0,0.6,0.803921568627451,0.5958916523167173,0.0022192001342773438,0.0
147,6,RandomForest,0,0.6,0.7607843137254902,1.0,0.8372592926025391,0.0
148,6,AdaBoost (Discrete),0,0.6,0.7843137254901961,0.5180414528134383,51.77891778945923,0.0
149,6,AdaBoost (Real),0,0.6,0.7529411764705882,0.3900904864146128,67.18886971473694,0.0
150,6,Logistic Regression (Penalty = L2),0,0.6,0.7647058823529411,0.27823181998211616,0.48063182830810547,0.0
151,6,Naive Bayes,0,0.6,0.0784313725490196,0.27670268692065597,0.2451643943786621,0.0
152,6,KNeighbors Classifier,1,0.6,0.816,0.500678109049936,0.49248194694519043,0.0
153,6,SVC Classifier,1,0.6,0.776,1.0,0.4763011932373047,0.0
154,6,Decision Tree,1,0.6,0.82,0.6737341343889284,0.11449146270751953,0.0
155,6,RandomForest,1,0.6,0.776,1.0,0.7237226963043213,0.0
156,6,AdaBoost (Discrete),1,0.6,0.812,0.5247628886878963,51.9413104057312,0.0
157,6,AdaBoost (Real),1,0.6,0.768,0.47254372834850306,68.74899196624756,0.0
158,6,Logistic Regression (Penalty = L2),1,0.6,0.784,0.2853751021838173,0.43985939025878906,0.0
159,6,Naive Bayes,1,0.6,0.064,0.2363810231703655,0.2673327922821045,0.0
160,6,KNeighbors Classifier,2,0.6,0.8024691358024691,0.6010859277972174,0.546612024307251,0.0
161,6,SVC Classifier,2,0.6,0.7983539094650206,1.0,0.3960134983062744,0.0
162,6,Decision Tree,2,0.6,0.8065843621399177,0.67408026059129,0.13108205795288086,0.0
163,6,RandomForest,2,0.6,0.7942386831275721,0.9948453608247423,0.8082044124603271,0.0
164,6,AdaBoost (Discrete),2,0.6,0.8189300411522634,0.5793915037672752,64.21787595748901,0.0
165,6,AdaBoost (Real),2,0.6,0.7613168724279835,0.5705897105641187,93.30028891563416,0.0
166,6,Logistic Regression (Penalty = L2),2,0.6,0.7860082304526749,0.4470694492780124,0.4947474002838135,0.0
167,6,Naive Bayes,2,0.6,0.07818930041152264,0.415623132903698,0.3702733516693115,0.0
168,7,KNeighbors Classifier,0,0.6,0.8196078431372549,0.6794911240753443,0.8176085948944092,0.0
169,7,SVC Classifier,0,0.6,0.7607843137254902,1.0,0.8306353092193604,0.0
170,7,Decision Tree,0,0.6,0.8235294117647058,0.8161735394704847,0.1870417594909668,0.0
171,7,RandomForest,0,0.6,0.7607843137254902,1.0,1.131770372390747,0.0
172,7,AdaBoost (Discrete),0,0.6,0.792156862745098,0.8846991476935628,68.06857490539551,0.0
173,7,AdaBoost (Real),0,0.6,0.6980392156862745,0.3917854950715044,81.8930242061615,0.0
174,7,Logistic Regression (Penalty = L2),0,0.6,0.7647058823529411,0.3920788795851925,0.839707612991333,0.0
175,7,Naive Bayes,0,0.6,0.10980392156862745,0.31419291226453727,0.2638542652130127,0.0
176,7,KNeighbors Classifier,1,0.6,0.8,0.7370696708058684,0.5151586532592773,0.0
177,7,SVC Classifier,1,0.6,0.776,1.0,0.6393134593963623,0.0
178,7,Decision Tree,1,0.6,0.84,0.9450625684367311,0.0019025802612304688,0.0
179,7,RandomForest,1,0.6,0.788,0.7745966692414834,0.9254298210144043,0.0
180,7,AdaBoost (Discrete),1,0.6,0.836,0.7311497119186926,60.9344961643219,0.0
181,7,AdaBoost (Real),1,0.6,0.724,0.5986206805330004,77.4753520488739,0.0
182,7,Logistic Regression (Penalty = L2),1,0.6,0.808,0.39773448577795095,0.9467380046844482,0.0
183,7,Naive Bayes,1,0.6,0.08,0.27041586643733656,0.263322114944458,0.0
184,7,KNeighbors Classifier,2,0.6,0.8353909465020576,0.7530212497613873,0.5702323913574219,0.0
185,7,SVC Classifier,2,0.6,0.7983539094650206,1.0,0.5464932918548584,0.0
186,7,Decision Tree,2,0.6,0.7736625514403292,0.8319072298945556,0.0019073486328125,0.0
187,7,RandomForest,2,0.6,0.7983539094650206,1.0,0.9826898574829102,0.0
188,7,AdaBoost (Discrete),2,0.6,0.7407407407407407,0.6205568408333527,60.4237539768219,0.0
189,7,AdaBoost (Real),2,0.6,0.5843621399176955,0.6174463023812043,77.60159730911255,0.0
190,7,Logistic Regression (Penalty = L2),2,0.6,0.7860082304526749,0.5234649692628083,0.7381997108459473,0.0
191,7,Naive Bayes,2,0.6,0.10699588477366255,0.4563925617881304,0.2684452533721924,0.0
192,8,KNeighbors Classifier,0,0.6,0.7568627450980392,0.4061384660534476,0.3811330795288086,0.0
193,8,SVC Classifier,0,0.6,0.7607843137254902,1.0,0.252255916595459,0.0
194,8,Decision Tree,0,0.6,0.7647058823529411,0.4040819145799253,0.1415097713470459,0.0
195,8,RandomForest,0,0.6,0.7607843137254902,1.0,0.8980498313903809,0.0
196,8,AdaBoost (Discrete),0,0.6,0.7607843137254902,0.6291870061116916,51.288530588150024,0.0
197,8,AdaBoost (Real),0,0.6,0.7568627450980392,0.9948453608247423,70.9524827003479,0.0
198,8,Logistic Regression (Penalty = L2),0,0.6,0.7607843137254902,0.6291870061116916,0.37830543518066406,0.0
199,8,Naive Bayes,0,0.6,0.0392156862745098,0.3195771718380609,0.12986111640930176,0.0
200,8,KNeighbors Classifier,1,0.6,0.792,0.49324241486609405,0.26019906997680664,0.0
201,8,SVC Classifier,1,0.6,0.776,1.0,0.1312093734741211,0.0
202,8,Decision Tree,1,0.6,0.78,0.4472135954999579,0.0019457340240478516,0.0
203,8,RandomForest,1,0.6,0.776,1.0,0.8734662532806396,0.0
204,8,AdaBoost (Discrete),1,0.6,0.776,1.0,46.074941635131836,0.0
205,8,AdaBoost (Real),1,0.6,0.776,1.0,73.98641324043274,0.0
206,8,Logistic Regression (Penalty = L2),1,0.6,0.772,0.9948453608247423,0.410752534866333,0.0
207,8,Naive Bayes,1,0.6,0.036,0.3935979342530861,0.266923189163208,0.0
208,8,KNeighbors Classifier,2,0.6,0.7736625514403292,0.36326794144424507,0.4060792922973633,0.0
209,8,SVC Classifier,2,0.6,0.7983539094650206,1.0,0.14954876899719238,0.0
210,8,Decision Tree,2,0.6,0.7777777777777778,0.4930304499002129,0.002037525177001953,0.0
211,8,RandomForest,2,0.6,0.7860082304526749,0.6979350987461912,0.8146886825561523,0.0
212,8,AdaBoost (Discrete),2,0.6,0.7860082304526749,0.6979350987461912,57.02366828918457,0.0
213,8,AdaBoost (Real),2,0.6,0.7860082304526749,0.6979350987461912,80.22888541221619,0.0
214,8,Logistic Regression (Penalty = L2),2,0.6,0.7736625514403292,0.4921452945855164,0.4597170352935791,0.0
215,8,Naive Bayes,2,0.6,0.02880658436213992,0.5,0.42315673828125,0.0
