,feat_set_id,classifier,fold_id,feat_th,score,geo_score,exec_t,geo_score_woz
0,0,KNeighbors Classifier,0,0.25,0.9782608695652174,0.9794582191218704,3.972184181213379,0.9794582191218704
1,0,SVC Classifier,0,0.25,0.9549168368835717,0.969823003263057,46.17178225517273,0.969823003263057
2,0,Decision Tree,0,0.25,0.9479136270790779,0.9528374471734478,0.48197221755981445,0.9528374471734478
3,0,RandomForest,0,0.25,0.9835132769185877,0.9830967954485686,2.2732832431793213,0.9830967954485686
4,0,AdaBoost (Discrete),0,0.25,0.9797198716078203,0.9819461908563509,155.49870204925537,0.9819461908563509
5,0,AdaBoost (Real),0,0.25,0.977531368543916,0.9769988570711932,330.29525923728943,0.9769988570711932
6,0,Logistic Regression (Penalty = L2),0,0.25,0.9868689816165742,0.9903359603865091,1.066516399383545,0.9903359603865091
7,0,Naive Bayes,0,0.25,0.9544791362707907,0.9695298429954101,0.37648749351501465,0.9695298429954101
8,0,KNeighbors Classifier,1,0.25,0.9435283817306289,0.9222805023618194,3.2439136505126953,0.9222805023618194
9,0,SVC Classifier,1,0.25,0.9753392674740989,0.9829765857634052,46.24523687362671,0.9829765857634052
10,0,Decision Tree,1,0.25,0.9646869983948636,0.9414307467445401,0.5833539962768555,0.9414307467445401
11,0,RandomForest,1,0.25,0.9851160075879177,0.9870016269627401,1.8437042236328125,0.9870016269627401
12,0,AdaBoost (Discrete),1,0.25,0.9709616226470159,0.9589952520079218,160.67319107055664,0.9589952520079218
13,0,AdaBoost (Real),1,0.25,0.9657084488545162,0.9487014296019405,298.2022194862366,0.9487014296019405
14,0,Logistic Regression (Penalty = L2),1,0.25,0.985553772070626,0.9881644144893901,0.18286347389221191,0.9881644144893901
15,0,Naive Bayes,1,0.25,0.9760688749452794,0.9832425735890316,0.4472188949584961,0.9832425735890316
16,0,KNeighbors Classifier,2,0.25,0.9533051218444477,0.9170751079709413,1.2107596397399902,0.9170751079709413
17,0,SVC Classifier,2,0.25,0.9846782431052093,0.9895537768081122,32.044886350631714,0.9895537768081122
18,0,Decision Tree,2,0.25,0.9461549686268788,0.8961899363677828,0.5696103572845459,0.8961899363677828
19,0,RandomForest,2,0.25,0.9948927477017364,0.9957939862801636,2.5797390937805176,0.9957939862801636
20,0,AdaBoost (Discrete),2,0.25,0.9549102582810448,0.9197959502066498,192.6879014968872,0.9197959502066498
21,0,AdaBoost (Real),2,0.25,0.945133518167226,0.9025514603712173,268.0380320549011,0.9025514603712173
22,0,Logistic Regression (Penalty = L2),2,0.25,0.9946009047132642,0.9958240195744449,0.8979318141937256,0.9958240195744449
23,0,Naive Bayes,2,0.25,0.9000437764482708,0.9323619467499279,0.5170872211456299,0.9323619467499279
24,1,KNeighbors Classifier,0,0.25,0.7776480887073242,0.5692276232037492,1.2740333080291748,0.5692276232037492
25,1,SVC Classifier,0,0.25,0.768894076451707,1.0,116.58931231498718,0.0
26,1,Decision Tree,0,0.25,0.810183834257368,0.679094316934276,0.6415698528289795,0.679094316934276
27,1,RandomForest,0,0.25,0.7748759848263788,0.16088454986057046,2.5326194763183594,0.16088454986057046
28,1,AdaBoost (Discrete),0,0.25,0.8492850889991246,0.7037413263461597,192.0745005607605,0.7037413263461597
29,1,AdaBoost (Real),0,0.25,0.8227312518237525,0.6848747605232833,270.2918612957001,0.6848747605232833
30,1,Logistic Regression (Penalty = L2),0,0.25,0.8007003209804494,0.4489881757890197,0.9452121257781982,0.4489881757890197
31,1,Naive Bayes,0,0.25,0.768894076451707,1.0,0.40845489501953125,0.0
32,1,KNeighbors Classifier,1,0.25,0.7058222676200204,0.6987835611343348,1.4436182975769043,0.6987835611343348
33,1,SVC Classifier,1,0.25,0.7690062746242522,1.0,127.00270342826843,0.0
34,1,Decision Tree,1,0.25,0.7045089741718955,0.70599783769804,1.085932970046997,0.70599783769804
35,1,RandomForest,1,0.25,0.7745512914052239,0.23983741795579622,3.60091495513916,0.23983741795579622
36,1,AdaBoost (Discrete),1,0.25,0.7995038669195973,0.7781086688136523,233.4254822731018,0.7781086688136523
37,1,AdaBoost (Real),1,0.25,0.7334014300306435,0.7300664761531519,288.33928537368774,0.7300664761531519
38,1,Logistic Regression (Penalty = L2),1,0.25,0.8594776010506348,0.8293910240582649,1.3595421314239502,0.8293910240582649
39,1,Naive Bayes,1,0.25,0.7690062746242522,1.0,0.4871842861175537,0.0
40,1,KNeighbors Classifier,2,0.25,0.6440974755581497,0.5754517505178467,1.6751551628112793,0.5754517505178467
41,1,SVC Classifier,2,0.25,0.7690062746242522,1.0,120.94843983650208,0.0
42,1,Decision Tree,2,0.25,0.6667153071647454,0.6315048921040944,0.8099894523620605,0.6315048921040944
43,1,RandomForest,2,0.25,0.6496424923391215,0.42391940556442864,2.406461715698242,0.42391940556442864
44,1,AdaBoost (Discrete),2,0.25,0.7748431343936962,0.7037555469616757,208.6740324497223,0.7037555469616757
45,1,AdaBoost (Real),2,0.25,0.7234787684225886,0.6393135538946795,261.4358253479004,0.6393135538946795
46,1,Logistic Regression (Penalty = L2),2,0.25,0.8300014592149424,0.6927803723355878,0.7666337490081787,0.6927803723355878
47,1,Naive Bayes,2,0.25,0.4905880636217715,0.47385402141321176,0.3323197364807129,0.47385402141321176
48,2,KNeighbors Classifier,0,0.25,0.9784067697694777,0.9708460843445222,2.9566566944122314,0.9708460843445222
49,2,SVC Classifier,0,0.25,0.9511234315728042,0.967279329147529,56.35218620300293,0.967279329147529
50,2,Decision Tree,0,0.25,0.977531368543916,0.9727648323849062,0.3002626895904541,0.9727648323849062
51,2,RandomForest,0,0.25,0.9851181791654509,0.9865656321285626,1.3643114566802979,0.9865656321285626
52,2,AdaBoost (Discrete),0,0.25,0.9785526699737379,0.9711662314544095,117.82904291152954,0.9711662314544095
53,2,AdaBoost (Real),0,0.25,0.9731543624161074,0.963161785493973,228.31899333000183,0.963161785493973
54,2,Logistic Regression (Penalty = L2),0,0.25,0.9797198716078203,0.9856453475734291,0.9190835952758789,0.9856453475734291
55,2,Naive Bayes,0,0.25,0.9518529325941056,0.9675609760755352,0.32980942726135254,0.9675609760755352
56,2,KNeighbors Classifier,1,0.25,0.9525755143732672,0.9536942575809723,2.831589698791504,0.9536942575809723
57,2,SVC Classifier,1,0.25,0.9597256675908361,0.972620515394129,42.243523597717285,0.972620515394129
58,2,Decision Tree,1,0.25,0.9803005982781263,0.9752137433517761,0.44239139556884766,0.9752137433517761
59,2,RandomForest,1,0.25,0.9848241645994456,0.9863719607889473,1.802109956741333,0.9863719607889473
60,2,AdaBoost (Discrete),1,0.25,0.9807383627608347,0.9775140473057914,130.17371559143066,0.9775140473057914
61,2,AdaBoost (Real),1,0.25,0.9803005982781263,0.9765602197434903,191.70301747322083,0.9765602197434903
62,2,Logistic Regression (Penalty = L2),1,0.25,0.985553772070626,0.987945373753929,0.7022249698638916,0.987945373753929
63,2,Naive Bayes,1,0.25,0.9582664526484751,0.9716470184878037,0.22930097579956055,0.9716470184878037
64,2,KNeighbors Classifier,2,0.25,0.9846782431052093,0.9773495909074067,3.15873384475708,0.9773495909074067
65,2,SVC Classifier,2,0.25,0.9775280898876404,0.9848505022015631,55.555978775024414,0.9848505022015631
66,2,Decision Tree,2,0.25,0.9824894206916679,0.9750392483829109,0.32347941398620605,0.9750392483829109
67,2,RandomForest,2,0.25,0.9954764336786809,0.9961740603345681,1.6159584522247314,0.9961740603345681
68,2,AdaBoost (Discrete),2,0.25,0.992703925288195,0.9923832571758148,147.33902978897095,0.9923832571758148
69,2,AdaBoost (Real),2,0.25,0.9858456150590982,0.9783248261585725,249.8779399394989,0.9783248261585725
70,2,Logistic Regression (Penalty = L2),2,0.25,0.994163140230556,0.9953186896150836,1.156601905822754,0.9953186896150836
71,2,Naive Bayes,2,0.25,0.9821975777031957,0.9879245650880867,0.581031322479248,0.9879245650880867
72,4,KNeighbors Classifier,0,0.25,0.9854099795739714,0.9880712464740546,30.894754648208618,0.9880712464740546
73,4,SVC Classifier,0,0.25,0.9511234315728042,0.967279329147529,65.14546799659729,0.967279329147529
74,4,Decision Tree,0,0.25,0.9833673767143274,0.9845452364610506,0.4215881824493408,0.9845452364610506
75,4,RandomForest,0,0.25,0.9851181791654509,0.9865656321285626,2.3924343585968018,0.9865656321285626
76,4,AdaBoost (Discrete),0,0.25,0.9851181791654509,0.9865656321285626,137.89520001411438,0.9865656321285626
77,4,AdaBoost (Real),0,0.25,0.9835132769185877,0.984860139791176,847.4515581130981,0.984860139791176
78,4,Logistic Regression (Penalty = L2),0,0.25,0.9746133644587103,0.9824958741478244,0.9914658069610596,0.9824958741478244
79,4,Naive Bayes,0,0.25,0.951561132185585,0.9675731712876111,0.3555169105529785,0.9675731712876111
80,4,KNeighbors Classifier,1,0.25,0.9820516562089596,0.9799250442415646,30.707228660583496,0.9799250442415646
81,4,SVC Classifier,1,0.25,0.9697942506931271,0.9790977160926396,71.45550799369812,0.9790977160926396
82,4,Decision Tree,1,0.25,0.978403618853057,0.9719645139634124,0.6268737316131592,0.9719645139634124
83,4,RandomForest,1,0.25,0.9848241645994456,0.9863719607889473,4.410858392715454,0.9863719607889473
84,4,AdaBoost (Discrete),1,0.25,0.9846782431052093,0.9858369815722713,182.30422639846802,0.9858369815722713
85,4,AdaBoost (Real),1,0.25,0.979716912301182,0.9748377935523963,599.4001352787018,0.9748377935523963
86,4,Logistic Regression (Penalty = L2),1,0.25,0.985553772070626,0.987945373753929,1.1583530902862549,0.987945373753929
87,4,Naive Bayes,1,0.25,0.9759229534510433,0.9831463800190133,0.4743838310241699,0.9831463800190133
88,4,KNeighbors Classifier,2,0.25,0.9851160075879177,0.9737497589137166,29.47438144683838,0.9737497589137166
89,4,SVC Classifier,2,0.25,0.9772362468991682,0.9846580546174685,82.40583395957947,0.9846580546174685
90,4,Decision Tree,2,0.25,0.9893477309207647,0.9841889506094171,0.5219681262969971,0.9841889506094171
91,4,RandomForest,2,0.25,0.9954764336786809,0.9961740603345681,2.1358706951141357,0.9961740603345681
92,4,AdaBoost (Discrete),2,0.25,0.995622355172917,0.9962690561923471,152.20403361320496,0.9962690561923471
93,4,AdaBoost (Real),2,0.25,0.9909528673573618,0.9876908469903466,313.8694908618927,0.9876908469903466
94,4,Logistic Regression (Penalty = L2),2,0.25,0.9929957682766671,0.9945577424934386,0.716724157333374,0.9945577424934386
95,4,Naive Bayes,2,0.25,0.9843864001167372,0.9893622440903966,0.13162755966186523,0.9893622440903966
96,6,KNeighbors Classifier,0,0.25,0.9854099795739714,0.9880712464740546,29.34554171562195,0.9880712464740546
97,6,SVC Classifier,0,0.25,0.9511234315728042,0.967279329147529,73.46632981300354,0.967279329147529
98,6,Decision Tree,0,0.25,0.9833673767143274,0.9845452364610506,0.3924593925476074,0.9845452364610506
99,6,RandomForest,0,0.25,0.9851181791654509,0.9865656321285626,2.0888755321502686,0.9865656321285626
100,6,AdaBoost (Discrete),0,0.25,0.9851181791654509,0.9865656321285626,127.73444890975952,0.9865656321285626
101,6,AdaBoost (Real),0,0.25,0.9835132769185877,0.984860139791176,883.4555861949921,0.984860139791176
102,6,Logistic Regression (Penalty = L2),0,0.25,0.9746133644587103,0.9824958741478244,1.1465699672698975,0.9824958741478244
103,6,Naive Bayes,0,0.25,0.951561132185585,0.9675731712876111,0.13400602340698242,0.9675731712876111
104,6,KNeighbors Classifier,1,0.25,0.9820516562089596,0.9799250442415646,28.55468463897705,0.9799250442415646
105,6,SVC Classifier,1,0.25,0.9697942506931271,0.9790977160926396,70.00889897346497,0.9790977160926396
106,6,Decision Tree,1,0.25,0.978403618853057,0.9719645139634124,0.49280834197998047,0.9719645139634124
107,6,RandomForest,1,0.25,0.9848241645994456,0.9863719607889473,2.7453973293304443,0.9863719607889473
108,6,AdaBoost (Discrete),1,0.25,0.9846782431052093,0.9858369815722713,142.71822476387024,0.9858369815722713
109,6,AdaBoost (Real),1,0.25,0.979716912301182,0.9748377935523963,596.2365417480469,0.9748377935523963
110,6,Logistic Regression (Penalty = L2),1,0.25,0.985553772070626,0.987945373753929,1.3691833019256592,0.987945373753929
111,6,Naive Bayes,1,0.25,0.9759229534510433,0.9831463800190133,0.3309319019317627,0.9831463800190133
112,6,KNeighbors Classifier,2,0.25,0.9851160075879177,0.9737497589137166,31.44485640525818,0.9737497589137166
113,6,SVC Classifier,2,0.25,0.9772362468991682,0.9846580546174685,90.09373712539673,0.9846580546174685
114,6,Decision Tree,2,0.25,0.9893477309207647,0.9841889506094171,0.5037617683410645,0.9841889506094171
115,6,RandomForest,2,0.25,0.9954764336786809,0.9961740603345681,2.13224458694458,0.9961740603345681
116,6,AdaBoost (Discrete),2,0.25,0.995622355172917,0.9962690561923471,137.22120428085327,0.9962690561923471
117,6,AdaBoost (Real),2,0.25,0.9909528673573618,0.9876908469903466,296.7532844543457,0.9876908469903466
118,6,Logistic Regression (Penalty = L2),2,0.25,0.9929957682766671,0.9945577424934386,0.7539660930633545,0.9945577424934386
119,6,Naive Bayes,2,0.25,0.9843864001167372,0.9893622440903966,0.2739579677581787,0.9893622440903966
120,7,KNeighbors Classifier,0,0.25,0.9538955354537496,0.94787631834706,4.231395721435547,0.94787631834706
121,7,SVC Classifier,0,0.25,0.9569594397432156,0.9711899144463835,85.81757616996765,0.9711899144463835
122,7,Decision Tree,0,0.25,0.918879486431281,0.9229315557214899,0.8022036552429199,0.9229315557214899
123,7,RandomForest,0,0.25,0.9833673767143274,0.9812279802095485,2.8737082481384277,0.9812279802095485
124,7,AdaBoost (Discrete),0,0.25,0.9400350160490225,0.9404728085167121,312.5721893310547,0.9404728085167121
125,7,AdaBoost (Real),0,0.25,0.9028304639626495,0.8570605078099771,1369.2222604751587,0.8570605078099771
126,7,Logistic Regression (Penalty = L2),0,0.25,0.9862853807995331,0.9892993113713012,1.3040797710418701,0.9892993113713012
127,7,Naive Bayes,0,0.25,0.9620659468923256,0.9743879197638988,0.6053173542022705,0.9743879197638988
128,7,KNeighbors Classifier,1,0.25,0.8961038961038961,0.8333252580897204,3.4123010635375977,0.8333252580897204
129,7,SVC Classifier,1,0.25,0.9751933459798628,0.9828803051827577,51.52703619003296,0.9828803051827577
130,7,Decision Tree,1,0.25,0.8963957390923684,0.832118101925848,0.4413268566131592,0.832118101925848
131,7,RandomForest,1,0.25,0.9854078505763899,0.9876308916916071,2.054741144180298,0.9876308916916071
132,7,AdaBoost (Discrete),1,0.25,0.9622063329928499,0.9590568099807082,221.20237803459167,0.9590568099807082
133,7,AdaBoost (Real),1,0.25,0.9530132788559755,0.9511018428306967,330.3864438533783,0.9511018428306967
134,7,Logistic Regression (Penalty = L2),1,0.25,0.9854078505763899,0.9876308916916071,1.0003576278686523,0.9876308916916071
135,7,Naive Bayes,1,0.25,0.9579746096600029,0.971452202041036,0.32598400115966797,0.971452202041036
136,7,KNeighbors Classifier,2,0.25,0.9190135706989639,0.8657483598445755,5.460346460342407,0.8657483598445755
137,7,SVC Classifier,2,0.25,0.9792791478184737,0.9860043989092296,42.157639503479004,0.9860043989092296
138,7,Decision Tree,2,0.25,0.804902962206333,0.8190056148167223,0.6013753414154053,0.8190056148167223
139,7,RandomForest,2,0.25,0.9959141981613892,0.9964590207390621,2.060086250305176,0.9964590207390621
140,7,AdaBoost (Discrete),2,0.25,0.9087990661024369,0.8867976331621862,213.31715369224548,0.8867976331621862
141,7,AdaBoost (Real),2,0.25,0.9048591857580621,0.8821914063178107,273.70368123054504,0.8821914063178107
142,7,Logistic Regression (Penalty = L2),2,0.25,0.994309061724792,0.9954137671039203,0.7886466979980469,0.9954137671039203
143,7,Naive Bayes,2,0.25,0.9028162848387568,0.9342909385205673,0.39551377296447754,0.9342909385205673
