,feat_set_id,classifier,fold_id,feat_th,score,geo_score,exec_t,geo_score_woz
0,0,KNeighbors Classifier,0,0.35,0.592814371257485,0.5597944667867105,0.9056615829467773,0.5597944667867105
1,0,SVC Classifier,0,0.35,0.5868263473053892,0.26495145850196566,0.9566469192504883,0.0
2,0,Decision Tree,0,0.35,0.6107784431137725,0.64421783770966,0.08560800552368164,0.64421783770966
3,0,RandomForest,0,0.35,0.592814371257485,0.2438093199376099,0.3419198989868164,0.2438093199376099
4,0,AdaBoost (Discrete),0,0.35,0.437125748502994,0.34329817136034474,26.83491349220276,0.34329817136034474
5,0,AdaBoost (Real),0,0.35,0.562874251497006,0.6012854886644342,28.774413347244263,0.6012854886644342
6,0,Logistic Regression (Penalty = L2),0,0.35,0.5988023952095808,0.5620336684912228,0.18028545379638672,0.5620336684912228
7,0,Naive Bayes,0,0.35,0.5868263473053892,0.38157141418444396,0.15317296981811523,0.38157141418444396
8,0,KNeighbors Classifier,1,0.35,0.593939393939394,0.5833666780992305,0.8594629764556885,0.5833666780992305
9,0,SVC Classifier,1,0.35,0.5818181818181818,0.9947780321927768,0.941673755645752,0.0
10,0,Decision Tree,1,0.35,0.6060606060606061,0.7141847429636093,0.05219912528991699,0.7141847429636093
11,0,RandomForest,1,0.35,0.5878787878787879,1.0,0.3632395267486572,0.0
12,0,AdaBoost (Discrete),1,0.35,0.6484848484848484,0.623722882326302,28.364378929138184,0.623722882326302
13,0,AdaBoost (Real),1,0.35,0.5272727272727272,0.6249019454015914,30.58690357208252,0.6249019454015914
14,0,Logistic Regression (Penalty = L2),1,0.35,0.6,0.5127443011431096,0.153303861618042,0.5127443011431096
15,0,Naive Bayes,1,0.35,0.593939393939394,0.3076034143347049,0.08777880668640137,0.3076034143347049
16,0,KNeighbors Classifier,2,0.35,0.5818181818181818,0.5685915048814884,0.863905668258667,0.5685915048814884
17,0,SVC Classifier,2,0.35,0.6060606060606061,0.46206375934610827,0.9031589031219482,0.46206375934610827
18,0,Decision Tree,2,0.35,0.5151515151515151,0.60421863502675,0.09396219253540039,0.60421863502675
19,0,RandomForest,2,0.35,0.6,0.30867895949930413,0.3243422508239746,0.30867895949930413
20,0,AdaBoost (Discrete),2,0.35,0.43636363636363634,0.5692225725524779,26.909884691238403,0.5692225725524779
21,0,AdaBoost (Real),2,0.35,0.5636363636363636,0.6541130301896597,29.159806966781616,0.6541130301896597
22,0,Logistic Regression (Penalty = L2),2,0.35,0.6,0.5952753944880749,0.1956491470336914,0.5952753944880749
23,0,Naive Bayes,2,0.35,0.6181818181818182,0.4653880733506236,0.1343669891357422,0.4653880733506236
24,1,KNeighbors Classifier,0,0.35,0.6167664670658682,0.5568889068544663,0.6193082332611084,0.5568889068544663
25,1,SVC Classifier,0,0.35,0.6107784431137725,0.33693704166848315,0.5726356506347656,0.0
26,1,Decision Tree,0,0.35,0.5568862275449101,0.5984887715435963,0.05955195426940918,0.5984887715435963
27,1,RandomForest,0,0.35,0.5808383233532934,0.1693622593118876,0.2800168991088867,0.0
28,1,AdaBoost (Discrete),0,0.35,0.592814371257485,0.70245286258975,22.413689136505127,0.70245286258975
29,1,AdaBoost (Real),0,0.35,0.6047904191616766,0.7022488390921897,24.54629683494568,0.7022488390921897
30,1,Logistic Regression (Penalty = L2),0,0.35,0.6227544910179641,0.5708168632349495,0.17711734771728516,0.5708168632349495
31,1,Naive Bayes,0,0.35,0.5868263473053892,0.30503230872316595,0.05676150321960449,0.30503230872316595
32,1,KNeighbors Classifier,1,0.35,0.5696969696969697,0.5169820495270244,0.7144248485565186,0.5169820495270244
33,1,SVC Classifier,1,0.35,0.5818181818181818,1.0,0.6858465671539307,0.0
34,1,Decision Tree,1,0.35,0.5818181818181818,0.6551853485522242,0.04290604591369629,0.6551853485522242
35,1,RandomForest,1,0.35,0.5818181818181818,1.0,0.28499865531921387,0.0
36,1,AdaBoost (Discrete),1,0.35,0.48484848484848486,0.5954194592067895,23.01739263534546,0.5954194592067895
37,1,AdaBoost (Real),1,0.35,0.48484848484848486,0.5084353217822112,24.174212217330933,0.5084353217822112
38,1,Logistic Regression (Penalty = L2),1,0.35,0.6424242424242425,0.6302177567134459,0.16620421409606934,0.6302177567134459
39,1,Naive Bayes,1,0.35,0.5757575757575758,0.2424195277928551,0.07002544403076172,0.2424195277928551
40,1,KNeighbors Classifier,2,0.35,0.5515151515151515,0.4464765588004873,0.6171228885650635,0.4464765588004873
41,1,SVC Classifier,2,0.35,0.6,0.3339455162794333,0.6204683780670166,0.0
42,1,Decision Tree,2,0.35,0.6181818181818182,0.6501507945768054,0.044132232666015625,0.6501507945768054
43,1,RandomForest,2,0.35,0.5757575757575758,0.9895833333333334,0.3085319995880127,0.0
44,1,AdaBoost (Discrete),2,0.35,0.5272727272727272,0.6567280837409127,21.49728536605835,0.6567280837409127
45,1,AdaBoost (Real),2,0.35,0.5575757575757576,0.6696152079049733,24.29518723487854,0.6696152079049733
46,1,Logistic Regression (Penalty = L2),2,0.35,0.593939393939394,0.5625252147173601,0.1580338478088379,0.5625252147173601
47,1,Naive Bayes,2,0.35,0.5696969696969697,0.4069654215126358,0.06262755393981934,0.4069654215126358
48,2,KNeighbors Classifier,0,0.35,0.4251497005988024,0.14433756729740643,0.8162961006164551,0.0
49,2,SVC Classifier,0,0.35,0.5748502994011976,1.0,0.906529426574707,0.0
50,2,Decision Tree,0,0.35,0.4491017964071856,0.25,0.09453082084655762,0.0
51,2,RandomForest,0,0.35,0.5748502994011976,1.0,0.33847546577453613,0.0
52,2,AdaBoost (Discrete),0,0.35,0.47305389221556887,0.3227486121839514,24.557079076766968,0.0
53,2,AdaBoost (Real),0,0.35,0.46107784431137727,0.28867513459481287,23.67378878593445,0.0
54,2,Logistic Regression (Penalty = L2),0,0.35,0.47305389221556887,0.3227486121839514,0.15006732940673828,0.0
55,2,Naive Bayes,0,0.35,0.47305389221556887,0.3227486121839514,0.07278156280517578,0.0
56,2,KNeighbors Classifier,1,0.35,0.012121212121212121,0.10206207261596575,0.7485206127166748,0.0
57,2,SVC Classifier,1,0.35,0.5818181818181818,1.0,0.870471715927124,0.0
58,2,Decision Tree,1,0.35,0.45454545454545453,0.27003086243366087,0.04520440101623535,0.0
59,2,RandomForest,1,0.35,0.5818181818181818,1.0,0.3057715892791748,0.0
60,2,AdaBoost (Discrete),1,0.35,0.4909090909090909,0.3679900360969936,24.45844006538391,0.0
61,2,AdaBoost (Real),1,0.35,0.47878787878787876,0.338501600193165,24.433929920196533,0.0
62,2,Logistic Regression (Penalty = L2),1,0.35,0.49696969696969695,0.3818813079129867,0.12583446502685547,0.0
63,2,Naive Bayes,1,0.35,0.49696969696969695,0.3818813079129867,0.10247635841369629,0.0
64,2,KNeighbors Classifier,2,0.35,0.012121212121212121,0.10206207261596575,0.8367855548858643,0.0
65,2,SVC Classifier,2,0.35,0.5818181818181818,1.0,0.8775379657745361,0.0
66,2,Decision Tree,2,0.35,0.46060606060606063,0.28867513459481287,0.08615732192993164,0.0
67,2,RandomForest,2,0.35,0.5818181818181818,1.0,0.3208045959472656,0.0
68,2,AdaBoost (Discrete),2,0.35,0.46060606060606063,0.28867513459481287,25.00614047050476,0.0
69,2,AdaBoost (Real),2,0.35,0.46060606060606063,0.28867513459481287,24.73419976234436,0.0
70,2,Logistic Regression (Penalty = L2),2,0.35,0.46060606060606063,0.28867513459481287,0.19415688514709473,0.0
71,2,Naive Bayes,2,0.35,0.46060606060606063,0.28867513459481287,0.1042928695678711,0.0
72,3,KNeighbors Classifier,0,0.35,0.5868263473053892,0.7028605544181243,0.6844902038574219,0.7028605544181243
73,3,SVC Classifier,0,0.35,0.5748502994011976,1.0,0.724409818649292,0.0
74,3,Decision Tree,0,0.35,0.6227544910179641,0.7245917845327045,0.050913333892822266,0.7245917845327045
75,3,RandomForest,0,0.35,0.5748502994011976,1.0,0.44506406784057617,0.0
76,3,AdaBoost (Discrete),0,0.35,0.49700598802395207,0.5476497039017779,23.101655960083008,0.5476497039017779
77,3,AdaBoost (Real),0,0.35,0.6167664670658682,0.7168415455428754,25.043864727020264,0.7168415455428754
78,3,Logistic Regression (Penalty = L2),0,0.35,0.6407185628742516,0.7438211263683372,0.11655068397521973,0.7438211263683372
79,3,Naive Bayes,0,0.35,0.4550898203592814,0.47119893871100926,0.09568452835083008,0.47119893871100926
80,3,KNeighbors Classifier,1,0.35,0.5151515151515151,0.625163355992802,0.6748440265655518,0.625163355992802
81,3,SVC Classifier,1,0.35,0.5818181818181818,1.0,0.8376483917236328,0.0
82,3,Decision Tree,1,0.35,0.5454545454545454,0.6615467691941467,0.003122091293334961,0.6615467691941467
83,3,RandomForest,1,0.35,0.5818181818181818,1.0,0.3307621479034424,0.0
84,3,AdaBoost (Discrete),1,0.35,0.46060606060606063,0.5248847434211478,23.59562921524048,0.5248847434211478
85,3,AdaBoost (Real),1,0.35,0.5636363636363636,0.6780495352143556,23.797849416732788,0.6780495352143556
86,3,Logistic Regression (Penalty = L2),1,0.35,0.5454545454545454,0.6592049911221002,0.09504032135009766,0.6592049911221002
87,3,Naive Bayes,1,0.35,0.4666666666666667,0.45204227867215035,0.1040034294128418,0.45204227867215035
88,3,KNeighbors Classifier,2,0.35,0.509090909090909,0.6322680932616379,0.5513875484466553,0.6322680932616379
89,3,SVC Classifier,2,0.35,0.5818181818181818,1.0,0.6359031200408936,0.0
90,3,Decision Tree,2,0.35,0.5636363636363636,0.6868207519097768,0.003211498260498047,0.6868207519097768
91,3,RandomForest,2,0.35,0.5818181818181818,1.0,0.253859281539917,0.0
92,3,AdaBoost (Discrete),2,0.35,0.42424242424242425,0.27380511113530975,19.570695638656616,0.27380511113530975
93,3,AdaBoost (Real),2,0.35,0.5575757575757576,0.6805944577824355,21.93743896484375,0.6805944577824355
94,3,Logistic Regression (Penalty = L2),2,0.35,0.5636363636363636,0.6868207519097768,0.10391712188720703,0.6868207519097768
95,3,Naive Bayes,2,0.35,0.46060606060606063,0.4874318271070036,0.09589123725891113,0.4874318271070036
96,4,KNeighbors Classifier,0,0.35,0.6227544910179641,0.5708168632349495,0.5614359378814697,0.5708168632349495
97,4,SVC Classifier,0,0.35,0.5988023952095808,0.33333333333333337,0.4302642345428467,0.0
98,4,Decision Tree,0,0.35,0.6107784431137725,0.681866975476474,0.07249331474304199,0.681866975476474
99,4,RandomForest,0,0.35,0.5868263473053892,0.17025130615174972,0.298799991607666,0.0
100,4,AdaBoost (Discrete),0,0.35,0.5868263473053892,0.68563427278786,18.027678966522217,0.68563427278786
101,4,AdaBoost (Real),0,0.35,0.5868263473053892,0.6761917630820112,21.292428731918335,0.6761917630820112
102,4,Logistic Regression (Penalty = L2),0,0.35,0.6407185628742516,0.5884882756692001,0.12799429893493652,0.5884882756692001
103,4,Naive Bayes,0,0.35,0.5988023952095808,0.3071804943499485,0.08213567733764648,0.3071804943499485
104,4,KNeighbors Classifier,1,0.35,0.5818181818181818,0.5579701547631802,0.4645109176635742,0.5579701547631802
105,4,SVC Classifier,1,0.35,0.5818181818181818,1.0,0.4541482925415039,0.0
106,4,Decision Tree,1,0.35,0.6,0.6205567217966603,0.03973817825317383,0.6205567217966603
107,4,RandomForest,1,0.35,0.5818181818181818,1.0,0.27559709548950195,0.0
108,4,AdaBoost (Discrete),1,0.35,0.49696969696969695,0.602816730604466,21.425251007080078,0.602816730604466
109,4,AdaBoost (Real),1,0.35,0.5393939393939394,0.5414103284912233,21.61345863342285,0.5414103284912233
110,4,Logistic Regression (Penalty = L2),1,0.35,0.6848484848484848,0.6864958603041045,0.1370103359222412,0.6864958603041045
111,4,Naive Bayes,1,0.35,0.593939393939394,0.24499865251482233,0.12296652793884277,0.24499865251482233
112,4,KNeighbors Classifier,2,0.35,0.5454545454545454,0.4630184392489562,0.5073587894439697,0.4630184392489562
113,4,SVC Classifier,2,0.35,0.6,0.3339455162794333,0.5256967544555664,0.0
114,4,Decision Tree,2,0.35,0.5757575757575758,0.623722882326302,0.043912649154663086,0.623722882326302
115,4,RandomForest,2,0.35,0.593939393939394,0.23999591499791464,0.2630767822265625,0.0
116,4,AdaBoost (Discrete),2,0.35,0.5515151515151515,0.6769370647417922,20.285005807876587,0.6769370647417922
117,4,AdaBoost (Real),2,0.35,0.5757575757575758,0.681365233591485,21.84998321533203,0.681365233591485
118,4,Logistic Regression (Penalty = L2),2,0.35,0.6424242424242425,0.6302177567134459,0.28044939041137695,0.6302177567134459
119,4,Naive Bayes,2,0.35,0.6121212121212121,0.4174820633974326,0.04409384727478027,0.4174820633974326
120,5,KNeighbors Classifier,0,0.35,0.5688622754491018,0.9895833333333334,0.08502006530761719,0.0
121,5,SVC Classifier,0,0.35,0.5748502994011976,1.0,0.045032501220703125,0.0
122,5,Decision Tree,0,0.35,0.5748502994011976,1.0,0.041973114013671875,0.0
123,5,RandomForest,0,0.35,0.5748502994011976,1.0,0.2509634494781494,0.0
124,5,AdaBoost (Discrete),0,0.35,0.5748502994011976,1.0,15.70873761177063,0.0
125,5,AdaBoost (Real),0,0.35,0.5748502994011976,1.0,17.611109972000122,0.0
126,5,Logistic Regression (Penalty = L2),0,0.35,0.5748502994011976,1.0,0.042881011962890625,0.0
127,5,Naive Bayes,0,0.35,0.47305389221556887,0.3227486121839514,0.03953814506530762,0.0
128,5,KNeighbors Classifier,1,0.35,0.5636363636363636,0.96875,0.046018362045288086,0.0
129,5,SVC Classifier,1,0.35,0.5818181818181818,1.0,0.08730268478393555,0.0
130,5,Decision Tree,1,0.35,0.5818181818181818,1.0,0.04174375534057617,0.0
131,5,RandomForest,1,0.35,0.5818181818181818,1.0,0.2636899948120117,0.0
132,5,AdaBoost (Discrete),1,0.35,0.5818181818181818,1.0,16.031129121780396,0.0
133,5,AdaBoost (Real),1,0.35,0.5818181818181818,1.0,17.90039324760437,0.0
134,5,Logistic Regression (Penalty = L2),1,0.35,0.5818181818181818,1.0,0.04188203811645508,0.0
135,5,Naive Bayes,1,0.35,0.49696969696969695,0.3818813079129867,0.050881385803222656,0.0
136,5,KNeighbors Classifier,2,0.35,0.5818181818181818,1.0,0.047356367111206055,0.0
137,5,SVC Classifier,2,0.35,0.5818181818181818,1.0,0.08329200744628906,0.0
138,5,Decision Tree,2,0.35,0.5818181818181818,1.0,0.0019156932830810547,0.0
139,5,RandomForest,2,0.35,0.5818181818181818,1.0,0.2601602077484131,0.0
140,5,AdaBoost (Discrete),2,0.35,0.5818181818181818,1.0,16.295939922332764,0.0
141,5,AdaBoost (Real),2,0.35,0.5818181818181818,1.0,18.375828742980957,0.0
142,5,Logistic Regression (Penalty = L2),2,0.35,0.5818181818181818,1.0,0.042212486267089844,0.0
143,5,Naive Bayes,2,0.35,0.46060606060606063,0.28867513459481287,0.047644853591918945,0.0
144,6,KNeighbors Classifier,0,0.35,0.5808383233532934,0.2421043038757211,0.22396039962768555,0.2421043038757211
145,6,SVC Classifier,0,0.35,0.5748502994011976,1.0,0.2193915843963623,0.0
146,6,Decision Tree,0,0.35,0.5868263473053892,0.30503230872316595,0.04267430305480957,0.30503230872316595
147,6,RandomForest,0,0.35,0.5808383233532934,0.9947780321927768,0.27043724060058594,0.0
148,6,AdaBoost (Discrete),0,0.35,0.5089820359281437,0.5814292643960701,18.617223501205444,0.5814292643960701
149,6,AdaBoost (Real),0,0.35,0.592814371257485,0.349174828234333,19.755634784698486,0.349174828234333
150,6,Logistic Regression (Penalty = L2),0,0.35,0.592814371257485,0.3061101703606063,0.09998345375061035,0.3061101703606063
151,6,Naive Bayes,0,0.35,0.592814371257485,0.2438093199376099,0.15625214576721191,0.2438093199376099
152,6,KNeighbors Classifier,1,0.35,0.5333333333333333,0.6486979387971237,0.23602676391601562,0.6486979387971237
153,6,SVC Classifier,1,0.35,0.5818181818181818,1.0,0.2846395969390869,0.0
154,6,Decision Tree,1,0.35,0.5515151515151515,0.667788145051214,0.046805620193481445,0.667788145051214
155,6,RandomForest,1,0.35,0.5878787878787879,1.0,0.3200063705444336,0.0
156,6,AdaBoost (Discrete),1,0.35,0.46060606060606063,0.49794911558783184,18.966540575027466,0.49794911558783184
157,6,AdaBoost (Real),1,0.35,0.5575757575757576,0.6718851073252299,20.03426480293274,0.6718851073252299
158,6,Logistic Regression (Penalty = L2),1,0.35,0.6060606060606061,0.3875560167398291,0.09197783470153809,0.3875560167398291
159,6,Naive Bayes,1,0.35,0.593939393939394,0.24499865251482233,0.04809117317199707,0.24499865251482233
160,6,KNeighbors Classifier,2,0.35,0.5515151515151515,0.6759327056039406,0.22606134414672852,0.6759327056039406
161,6,SVC Classifier,2,0.35,0.5818181818181818,1.0,0.21843242645263672,0.0
162,6,Decision Tree,2,0.35,0.593939393939394,0.41304042791949586,0.04281449317932129,0.41304042791949586
163,6,RandomForest,2,0.35,0.6,0.3521180094469704,0.25650453567504883,0.3521180094469704
164,6,AdaBoost (Discrete),2,0.35,0.4484848484848485,0.43026999943178473,17.128010034561157,0.43026999943178473
165,6,AdaBoost (Real),2,0.35,0.593939393939394,0.41304042791949586,20.05968141555786,0.41304042791949586
166,6,Logistic Regression (Penalty = L2),2,0.35,0.6,0.41453156153050524,0.12627792358398438,0.41453156153050524
167,6,Naive Bayes,2,0.35,0.6,0.30867895949930413,0.09278512001037598,0.30867895949930413
168,7,KNeighbors Classifier,0,0.35,0.5568862275449101,0.96875,0.1976325511932373,0.0
169,7,SVC Classifier,0,0.35,0.5748502994011976,1.0,0.2052927017211914,0.0
170,7,Decision Tree,0,0.35,0.5748502994011976,1.0,0.04643535614013672,0.0
171,7,RandomForest,0,0.35,0.5748502994011976,1.0,0.27406954765319824,0.0
172,7,AdaBoost (Discrete),0,0.35,0.5748502994011976,1.0,17.815547704696655,0.0
173,7,AdaBoost (Real),0,0.35,0.5748502994011976,1.0,17.88539433479309,0.0
174,7,Logistic Regression (Penalty = L2),0,0.35,0.5748502994011976,1.0,0.09217047691345215,0.0
175,7,Naive Bayes,0,0.35,0.47305389221556887,0.3227486121839514,0.054058074951171875,0.0
176,7,KNeighbors Classifier,1,0.35,0.5636363636363636,0.96875,0.16567134857177734,0.0
177,7,SVC Classifier,1,0.35,0.5818181818181818,1.0,0.11694145202636719,0.0
178,7,Decision Tree,1,0.35,0.5818181818181818,1.0,0.030178308486938477,0.0
179,7,RandomForest,1,0.35,0.5818181818181818,1.0,0.2453289031982422,0.0
180,7,AdaBoost (Discrete),1,0.35,0.5818181818181818,1.0,15.959635972976685,0.0
181,7,AdaBoost (Real),1,0.35,0.5818181818181818,1.0,17.476969718933105,0.0
182,7,Logistic Regression (Penalty = L2),1,0.35,0.5818181818181818,1.0,0.10401701927185059,0.0
183,7,Naive Bayes,1,0.35,0.49696969696969695,0.3818813079129867,0.04228568077087402,0.0
184,7,KNeighbors Classifier,2,0.35,0.5818181818181818,1.0,0.1947169303894043,0.0
185,7,SVC Classifier,2,0.35,0.5818181818181818,1.0,0.20924901962280273,0.0
186,7,Decision Tree,2,0.35,0.5818181818181818,1.0,0.041809797286987305,0.0
187,7,RandomForest,2,0.35,0.5818181818181818,1.0,0.26326656341552734,0.0
188,7,AdaBoost (Discrete),2,0.35,0.5818181818181818,1.0,16.731426000595093,0.0
189,7,AdaBoost (Real),2,0.35,0.5818181818181818,1.0,18.38595962524414,0.0
190,7,Logistic Regression (Penalty = L2),2,0.35,0.5818181818181818,1.0,0.10028409957885742,0.0
191,7,Naive Bayes,2,0.35,0.46060606060606063,0.28867513459481287,0.060079336166381836,0.0
192,8,KNeighbors Classifier,0,0.35,0.5688622754491018,0.2041241452319315,0.21666693687438965,0.0
193,8,SVC Classifier,0,0.35,0.5748502994011976,1.0,0.2203536033630371,0.0
194,8,Decision Tree,0,0.35,0.5868263473053892,0.20742555849952674,0.04328584671020508,0.0
195,8,RandomForest,0,0.35,0.5748502994011976,1.0,0.27632713317871094,0.0
196,8,AdaBoost (Discrete),0,0.35,0.5808383233532934,0.20633095688266445,16.057145833969116,0.0
197,8,AdaBoost (Real),0,0.35,0.5808383233532934,0.20633095688266445,18.409350156784058,0.0
198,8,Logistic Regression (Penalty = L2),0,0.35,0.5868263473053892,0.20742555849952674,0.09665322303771973,0.0
199,8,Naive Bayes,0,0.35,0.08383233532934131,0.17417369831509522,0.0779871940612793,0.17417369831509522
200,8,KNeighbors Classifier,1,0.35,0.5818181818181818,0.23742903996690853,0.22841763496398926,0.0
201,8,SVC Classifier,1,0.35,0.5818181818181818,1.0,0.26077985763549805,0.0
202,8,Decision Tree,1,0.35,0.5878787878787879,0.20784255919268485,0.0029299259185791016,0.0
203,8,RandomForest,1,0.35,0.5818181818181818,0.12063455590514424,0.3030877113342285,0.0
204,8,AdaBoost (Discrete),1,0.35,0.6,0.24126911181028848,17.391343593597412,0.0
205,8,AdaBoost (Real),1,0.35,0.593939393939394,0.23999591499791464,18.487290620803833,0.0
206,8,Logistic Regression (Penalty = L2),1,0.35,0.593939393939394,0.23999591499791464,0.09101748466491699,0.0
207,8,Naive Bayes,1,0.35,0.12121212121212122,0.1402267234700459,0.002685546875,0.1402267234700459
208,8,KNeighbors Classifier,2,0.35,0.5878787878787879,0.2654537365992609,0.21045708656311035,0.0
209,8,SVC Classifier,2,0.35,0.5818181818181818,1.0,0.22846388816833496,0.0
210,8,Decision Tree,2,0.35,0.593939393939394,0.2668925207776696,0.042650461196899414,0.0
211,8,RandomForest,2,0.35,0.593939393939394,0.17149858514250885,0.27034783363342285,0.0
212,8,AdaBoost (Discrete),2,0.35,0.5878787878787879,0.2654537365992609,17.463045120239258,0.0
213,8,AdaBoost (Real),2,0.35,0.5878787878787879,0.2654537365992609,17.53701615333557,0.0
214,8,Logistic Regression (Penalty = L2),2,0.35,0.6,0.2923661081186918,0.08920812606811523,0.0
215,8,Naive Bayes,2,0.35,0.16363636363636364,0.2524273362705605,0.02888035774230957,0.2524273362705605
216,9,KNeighbors Classifier,0,0.35,0.4311377245508982,0.1767766952966369,0.4051802158355713,0.0
217,9,SVC Classifier,0,0.35,0.5748502994011976,1.0,0.4972803592681885,0.0
218,9,Decision Tree,0,0.35,0.4431137724550898,0.22821773229381923,0.04413294792175293,0.0
219,9,RandomForest,0,0.35,0.5748502994011976,1.0,0.3525199890136719,0.0
220,9,AdaBoost (Discrete),0,0.35,0.5748502994011976,1.0,19.007718563079834,0.0
221,9,AdaBoost (Real),0,0.35,0.4431137724550898,0.22821773229381923,19.113006114959717,0.0
222,9,Logistic Regression (Penalty = L2),0,0.35,0.4431137724550898,0.22821773229381923,0.0965416431427002,0.0
223,9,Naive Bayes,0,0.35,0.4431137724550898,0.22821773229381923,0.09658575057983398,0.0
224,9,KNeighbors Classifier,1,0.35,0.5575757575757576,0.9583333333333334,0.4268767833709717,0.0
225,9,SVC Classifier,1,0.35,0.5818181818181818,1.0,0.46896791458129883,0.0
226,9,Decision Tree,1,0.35,0.4727272727272727,0.3227486121839514,0.05192422866821289,0.0
227,9,RandomForest,1,0.35,0.5818181818181818,1.0,0.2632913589477539,0.0
228,9,AdaBoost (Discrete),1,0.35,0.5818181818181818,1.0,17.95031476020813,0.0
229,9,AdaBoost (Real),1,0.35,0.4727272727272727,0.3227486121839514,19.165509462356567,0.0
230,9,Logistic Regression (Penalty = L2),1,0.35,0.4727272727272727,0.3227486121839514,0.09556984901428223,0.0
231,9,Naive Bayes,1,0.35,0.4727272727272727,0.3227486121839514,0.08625268936157227,0.0
232,9,KNeighbors Classifier,2,0.35,0.5636363636363636,0.96875,0.40000343322753906,0.0
233,9,SVC Classifier,2,0.35,0.5818181818181818,1.0,0.4903531074523926,0.0
234,9,Decision Tree,2,0.35,0.4484848484848485,0.25,0.044783830642700195,0.0
235,9,RandomForest,2,0.35,0.5818181818181818,1.0,0.27343201637268066,0.0
236,9,AdaBoost (Discrete),2,0.35,0.5818181818181818,1.0,21.176361799240112,0.0
237,9,AdaBoost (Real),2,0.35,0.4484848484848485,0.25,23.776145696640015,0.0
238,9,Logistic Regression (Penalty = L2),2,0.35,0.4484848484848485,0.25,0.14938116073608398,0.0
239,9,Naive Bayes,2,0.35,0.4484848484848485,0.25,0.09470057487487793,0.0
240,10,KNeighbors Classifier,0,0.35,0.562874251497006,0.661800313128672,1.2006630897521973,0.661800313128672
241,10,SVC Classifier,0,0.35,0.5988023952095808,0.33333333333333337,1.169525384902954,0.0
242,10,Decision Tree,0,0.35,0.5508982035928144,0.630973324962883,0.10893678665161133,0.630973324962883
243,10,RandomForest,0,0.35,0.6047904191616766,0.26919095102908275,0.37238597869873047,0.0
244,10,AdaBoost (Discrete),0,0.35,0.437125748502994,0.5578607917351412,30.487292289733887,0.5578607917351412
245,10,AdaBoost (Real),0,0.35,0.6407185628742516,0.7270752453398629,32.71899056434631,0.7270752453398629
246,10,Logistic Regression (Penalty = L2),0,0.35,0.6287425149700598,0.7140889727299535,0.2101438045501709,0.7140889727299535
247,10,Naive Bayes,0,0.35,0.49101796407185627,0.5366937580243081,0.04686403274536133,0.5366937580243081
248,10,KNeighbors Classifier,1,0.35,0.6121212121212121,0.6933612743506348,1.197507381439209,0.6933612743506348
249,10,SVC Classifier,1,0.35,0.5818181818181818,1.0,1.2052257061004639,0.0
250,10,Decision Tree,1,0.35,0.6424242424242425,0.7277409784413306,0.07637143135070801,0.7277409784413306
251,10,RandomForest,1,0.35,0.5818181818181818,1.0,0.3715634346008301,0.0
252,10,AdaBoost (Discrete),1,0.35,0.4666666666666667,0.5194538659393476,31.43439745903015,0.5194538659393476
253,10,AdaBoost (Real),1,0.35,0.6060606060606061,0.6774937566577628,35.12636613845825,0.6774937566577628
254,10,Logistic Regression (Penalty = L2),1,0.35,0.6545454545454545,0.7570147956600648,0.1562485694885254,0.7570147956600648
255,10,Naive Bayes,1,0.35,0.49696969696969695,0.5237703350931935,0.15057039260864258,0.5237703350931935
256,10,KNeighbors Classifier,2,0.35,0.5575757575757576,0.6465063750027435,1.25028657913208,0.6465063750027435
257,10,SVC Classifier,2,0.35,0.6060606060606061,0.40219983326992187,1.1729891300201416,0.0
258,10,Decision Tree,2,0.35,0.5393939393939394,0.622539344601534,0.09792685508728027,0.622539344601534
259,10,RandomForest,2,0.35,0.5818181818181818,0.9947780321927768,0.46506237983703613,0.0
260,10,AdaBoost (Discrete),2,0.35,0.4303030303030303,0.5530057443306996,32.33230686187744,0.5530057443306996
261,10,AdaBoost (Real),2,0.35,0.5878787878787879,0.6916576771312541,35.38927698135376,0.6916576771312541
262,10,Logistic Regression (Penalty = L2),2,0.35,0.5696969696969697,0.6615467691941467,0.1708528995513916,0.6615467691941467
263,10,Naive Bayes,2,0.35,0.47878787878787876,0.5622022954645847,0.06194186210632324,0.5622022954645847
264,11,KNeighbors Classifier,0,0.35,0.6227544910179641,0.6926277799357227,2.269649028778076,0.6926277799357227
265,11,SVC Classifier,0,0.35,0.5868263473053892,0.26495145850196566,1.9388720989227295,0.0
266,11,Decision Tree,0,0.35,0.5029940119760479,0.5945289000178573,0.05502438545227051,0.5945289000178573
267,11,RandomForest,0,0.35,0.592814371257485,0.3061101703606063,0.4233520030975342,0.3061101703606063
268,11,AdaBoost (Discrete),0,0.35,0.437125748502994,0.34329817136034474,42.56705641746521,0.34329817136034474
269,11,AdaBoost (Real),0,0.35,0.6227544910179641,0.6883000627148177,43.72523355484009,0.6883000627148177
270,11,Logistic Regression (Penalty = L2),0,0.35,0.592814371257485,0.6631762013160654,0.18755292892456055,0.6631762013160654
271,11,Naive Bayes,0,0.35,0.4550898203592814,0.5193688327767603,0.17337679862976074,0.5193688327767603
272,11,KNeighbors Classifier,1,0.35,0.5393939393939394,0.6399655870870427,2.102490186691284,0.6399655870870427
273,11,SVC Classifier,1,0.35,0.5818181818181818,0.9947780321927768,2.1648108959198,0.0
274,11,Decision Tree,1,0.35,0.6060606060606061,0.6935736361631019,0.10320115089416504,0.6935736361631019
275,11,RandomForest,1,0.35,0.5818181818181818,0.9947780321927768,0.41182518005371094,0.0
276,11,AdaBoost (Discrete),1,0.35,0.5212121212121212,0.6428203976645589,37.51033115386963,0.6428203976645589
277,11,AdaBoost (Real),1,0.35,0.5212121212121212,0.5965694755053284,33.76107883453369,0.5965694755053284
278,11,Logistic Regression (Penalty = L2),1,0.35,0.5757575757575758,0.6650286584282477,0.17934370040893555,0.6650286584282477
279,11,Naive Bayes,1,0.35,0.4484848484848485,0.5188855352164768,0.15583157539367676,0.5188855352164768
280,11,KNeighbors Classifier,2,0.35,0.5333333333333333,0.6192279024801866,1.641460657119751,0.6192279024801866
281,11,SVC Classifier,2,0.35,0.6060606060606061,0.46206375934610827,1.6447856426239014,0.46206375934610827
282,11,Decision Tree,2,0.35,0.5515151515151515,0.6471166324681473,0.09443783760070801,0.6471166324681473
283,11,RandomForest,2,0.35,0.5878787878787879,1.0,0.28832459449768066,0.0
284,11,AdaBoost (Discrete),2,0.35,0.43636363636363634,0.5692225725524779,31.81045413017273,0.5692225725524779
285,11,AdaBoost (Real),2,0.35,0.503030303030303,0.6205567217966603,34.58361053466797,0.6205567217966603
286,11,Logistic Regression (Penalty = L2),2,0.35,0.5757575757575758,0.6688170960546029,0.1856095790863037,0.6688170960546029
287,11,Naive Bayes,2,0.35,0.4666666666666667,0.5613933701811722,0.1925818920135498,0.5613933701811722
288,12,KNeighbors Classifier,0,0.35,0.5688622754491018,0.9895833333333334,0.09461593627929688,0.0
289,12,SVC Classifier,0,0.35,0.5748502994011976,1.0,0.04638171195983887,0.0
290,12,Decision Tree,0,0.35,0.5748502994011976,1.0,0.0012099742889404297,0.0
291,12,RandomForest,0,0.35,0.5748502994011976,1.0,0.2461538314819336,0.0
292,12,AdaBoost (Discrete),0,0.35,0.5748502994011976,1.0,15.47654676437378,0.0
293,12,AdaBoost (Real),0,0.35,0.5748502994011976,1.0,18.36491346359253,0.0
294,12,Logistic Regression (Penalty = L2),0,0.35,0.5748502994011976,1.0,0.04721498489379883,0.0
295,12,Naive Bayes,0,0.35,0.4431137724550898,0.22821773229381923,0.040619850158691406,0.0
296,12,KNeighbors Classifier,1,0.35,0.5818181818181818,1.0,0.048226356506347656,0.0
297,12,SVC Classifier,1,0.35,0.5818181818181818,1.0,0.052733421325683594,0.0
298,12,Decision Tree,1,0.35,0.5818181818181818,1.0,0.049428701400756836,0.0
299,12,RandomForest,1,0.35,0.5818181818181818,1.0,0.34262514114379883,0.0
300,12,AdaBoost (Discrete),1,0.35,0.5818181818181818,1.0,15.857340097427368,0.0
301,12,AdaBoost (Real),1,0.35,0.5818181818181818,1.0,17.499428033828735,0.0
302,12,Logistic Regression (Penalty = L2),1,0.35,0.5818181818181818,1.0,0.046884775161743164,0.0
303,12,Naive Bayes,1,0.35,0.4727272727272727,0.3227486121839514,0.04321742057800293,0.0
304,12,KNeighbors Classifier,2,0.35,0.5818181818181818,1.0,0.04019308090209961,0.0
305,12,SVC Classifier,2,0.35,0.5818181818181818,1.0,0.04807567596435547,0.0
306,12,Decision Tree,2,0.35,0.5818181818181818,1.0,0.0022592544555664062,0.0
307,12,RandomForest,2,0.35,0.5818181818181818,1.0,0.28153467178344727,0.0
308,12,AdaBoost (Discrete),2,0.35,0.5818181818181818,1.0,17.567362785339355,0.0
309,12,AdaBoost (Real),2,0.35,0.5818181818181818,1.0,21.02171492576599,0.0
310,12,Logistic Regression (Penalty = L2),2,0.35,0.5818181818181818,1.0,0.04391765594482422,0.0
311,12,Naive Bayes,2,0.35,0.4484848484848485,0.25,0.042858123779296875,0.0
