,feat_set_id,classifier,fold_id,feat_th,score,geo_score,exec_t,geo_score_woz
0,0,KNeighbors Classifier,0,0.05,0.6481802426343154,0.680460131160533,0.216048002243042,0.0
1,0,SVC Classifier,0,0.05,0.7001733102253033,1.0,0.29062414169311523,0.0
2,0,Decision Tree,0,0.05,0.7001733102253033,1.0,0.05098223686218262,0.0
3,0,RandomForest,0,0.05,0.7001733102253033,1.0,0.38307714462280273,0.0
4,0,AdaBoost (Discrete),0,0.05,0.7001733102253033,1.0,25.323045015335083,0.0
5,0,AdaBoost (Real),0,0.05,0.7001733102253033,1.0,66.84854888916016,0.0
6,0,Logistic Regression (Penalty = L2),0,0.05,0.7001733102253033,1.0,0.21172213554382324,0.0
7,0,Naive Bayes,0,0.05,0.5441941074523396,0.850160147988438,0.07577800750732422,0.0
8,0,KNeighbors Classifier,1,0.05,0.6996527777777778,1.0,0.21245193481445312,0.0
9,0,SVC Classifier,1,0.05,0.6996527777777778,1.0,0.3560464382171631,0.0
10,0,Decision Tree,1,0.05,0.6996527777777778,1.0,0.08657431602478027,0.0
11,0,RandomForest,1,0.05,0.6996527777777778,1.0,0.5036606788635254,0.0
12,0,AdaBoost (Discrete),1,0.05,0.6996527777777778,1.0,31.217865467071533,0.0
13,0,AdaBoost (Real),1,0.05,0.6996527777777778,1.0,56.826765060424805,0.0
14,0,Logistic Regression (Penalty = L2),1,0.05,0.6996527777777778,1.0,0.1715834140777588,0.0
15,0,Naive Bayes,1,0.05,0.5920138888888888,0.8896984182487025,0.08033299446105957,0.0
16,0,KNeighbors Classifier,2,0.05,0.31130434782608696,0.5880661175073388,0.2432701587677002,0.0
17,0,SVC Classifier,2,0.05,0.7008695652173913,1.0,0.49196672439575195,0.0
18,0,Decision Tree,2,0.05,0.31130434782608696,0.5880661175073388,0.0012965202331542969,0.0
19,0,RandomForest,2,0.05,0.31130434782608696,0.5880661175073388,0.6112914085388184,0.0
20,0,AdaBoost (Discrete),2,0.05,0.31130434782608696,0.5880661175073388,33.071754455566406,0.0
21,0,AdaBoost (Real),2,0.05,0.31130434782608696,0.5880661175073388,50.60692477226257,0.0
22,0,Logistic Regression (Penalty = L2),2,0.05,0.31130434782608696,0.5880661175073388,0.13579487800598145,0.0
23,0,Naive Bayes,2,0.05,0.2747826086956522,0.31755000153891877,0.06433367729187012,0.31755000153891877
24,1,KNeighbors Classifier,0,0.05,0.7001733102253033,1.0,0.19974255561828613,0.0
25,1,SVC Classifier,0,0.05,0.7001733102253033,1.0,0.45502638816833496,0.0
26,1,Decision Tree,0,0.05,0.7001733102253033,1.0,0.06646871566772461,0.0
27,1,RandomForest,0,0.05,0.7001733102253033,1.0,0.46779489517211914,0.0
28,1,AdaBoost (Discrete),0,0.05,0.7001733102253033,1.0,35.21435356140137,0.0
29,1,AdaBoost (Real),0,0.05,0.7001733102253033,1.0,98.70438027381897,0.0
30,1,Logistic Regression (Penalty = L2),0,0.05,0.7001733102253033,1.0,0.22060608863830566,0.0
31,1,Naive Bayes,0,0.05,0.3830155979202773,0.48314266832172753,0.10109329223632812,0.0
32,1,KNeighbors Classifier,1,0.05,0.5920138888888888,0.6664016739677335,0.3002190589904785,0.0
33,1,SVC Classifier,1,0.05,0.6996527777777778,1.0,0.49838757514953613,0.0
34,1,Decision Tree,1,0.05,0.6996527777777778,1.0,0.09846067428588867,0.0
35,1,RandomForest,1,0.05,0.6996527777777778,1.0,0.7029433250427246,0.0
36,1,AdaBoost (Discrete),1,0.05,0.6996527777777778,1.0,42.11533880233765,0.0
37,1,AdaBoost (Real),1,0.05,0.6996527777777778,1.0,79.59322357177734,0.0
38,1,Logistic Regression (Penalty = L2),1,0.05,0.6996527777777778,1.0,0.23610997200012207,0.0
39,1,Naive Bayes,1,0.05,0.4305555555555556,0.5090374832823014,0.12044572830200195,0.0
40,1,KNeighbors Classifier,2,0.05,0.7008695652173913,1.0,0.359774112701416,0.0
41,1,SVC Classifier,2,0.05,0.7008695652173913,1.0,0.7393503189086914,0.0
42,1,Decision Tree,2,0.05,0.7008695652173913,1.0,0.0013785362243652344,0.0
43,1,RandomForest,2,0.05,0.7008695652173913,1.0,0.9527041912078857,0.0
44,1,AdaBoost (Discrete),2,0.05,0.7008695652173913,1.0,43.759599924087524,0.0
45,1,AdaBoost (Real),2,0.05,0.7008695652173913,1.0,126.76608157157898,0.0
46,1,Logistic Regression (Penalty = L2),2,0.05,0.7008695652173913,1.0,0.2001354694366455,0.0
47,1,Naive Bayes,2,0.05,0.48869565217391303,0.5240754477700762,0.10075950622558594,0.0
48,2,KNeighbors Classifier,0,0.05,0.6845753899480069,0.8129520829107402,0.2012927532196045,0.0
49,2,SVC Classifier,0,0.05,0.6845753899480069,0.8129520829107402,0.5001986026763916,0.0
50,2,Decision Tree,0,0.05,0.6845753899480069,0.8129520829107402,0.002348184585571289,0.0
51,2,RandomForest,0,0.05,0.6845753899480069,0.8129520829107402,0.6078944206237793,0.0
52,2,AdaBoost (Discrete),0,0.05,0.6845753899480069,0.8129520829107402,38.952069997787476,0.0
53,2,AdaBoost (Real),0,0.05,0.6845753899480069,0.8129520829107402,82.51974034309387,0.0
54,2,Logistic Regression (Penalty = L2),0,0.05,0.6845753899480069,0.8129520829107402,0.12208008766174316,0.0
55,2,Naive Bayes,0,0.05,0.6845753899480069,0.8129520829107402,0.20870375633239746,0.0
56,2,KNeighbors Classifier,1,0.05,0.6996527777777778,1.0,0.3609795570373535,0.0
57,2,SVC Classifier,1,0.05,0.7690972222222222,0.8841027752029671,0.4904904365539551,0.0
58,2,Decision Tree,1,0.05,0.7690972222222222,0.8841027752029671,0.0018191337585449219,0.0
59,2,RandomForest,1,0.05,0.7690972222222222,0.8841027752029671,0.6026713848114014,0.0
60,2,AdaBoost (Discrete),1,0.05,0.7690972222222222,0.8841027752029671,38.641945600509644,0.0
61,2,AdaBoost (Real),1,0.05,0.7690972222222222,0.8841027752029671,88.61701607704163,0.0
62,2,Logistic Regression (Penalty = L2),1,0.05,0.7690972222222222,0.8841027752029671,0.2081742286682129,0.0
63,2,Naive Bayes,1,0.05,0.7690972222222222,0.8841027752029671,0.09270501136779785,0.0
64,2,KNeighbors Classifier,2,0.05,0.88,0.9684860662631681,0.21738815307617188,0.0
65,2,SVC Classifier,2,0.05,0.7008695652173913,1.0,0.5413079261779785,0.0
66,2,Decision Tree,2,0.05,0.88,0.9684860662631681,0.10661458969116211,0.0
67,2,RandomForest,2,0.05,0.88,0.9684860662631681,0.8943283557891846,0.0
68,2,AdaBoost (Discrete),2,0.05,0.88,0.9684860662631681,45.06913161277771,0.0
69,2,AdaBoost (Real),2,0.05,0.88,0.9684860662631681,54.6047146320343,0.0
70,2,Logistic Regression (Penalty = L2),2,0.05,0.88,0.9684860662631681,0.11882162094116211,0.0
71,2,Naive Bayes,2,0.05,0.88,0.9684860662631681,0.10059881210327148,0.0
72,3,KNeighbors Classifier,0,0.05,0.6845753899480069,0.8129520829107402,0.3237013816833496,0.0
73,3,SVC Classifier,0,0.05,0.6845753899480069,0.8129520829107402,0.5453281402587891,0.0
74,3,Decision Tree,0,0.05,0.6845753899480069,0.8129520829107402,0.0022585391998291016,0.0
75,3,RandomForest,0,0.05,0.6845753899480069,0.8129520829107402,0.6530165672302246,0.0
76,3,AdaBoost (Discrete),0,0.05,0.6845753899480069,0.8129520829107402,45.67211127281189,0.0
77,3,AdaBoost (Real),0,0.05,0.6845753899480069,0.8129520829107402,97.73594570159912,0.0
78,3,Logistic Regression (Penalty = L2),0,0.05,0.6845753899480069,0.8129520829107402,0.19056200981140137,0.0
79,3,Naive Bayes,0,0.05,0.6845753899480069,0.8129520829107402,0.1488945484161377,0.0
80,3,KNeighbors Classifier,1,0.05,0.6996527777777778,1.0,0.3314826488494873,0.0
81,3,SVC Classifier,1,0.05,0.7690972222222222,0.8841027752029671,0.931466817855835,0.0
82,3,Decision Tree,1,0.05,0.7690972222222222,0.8841027752029671,0.0014147758483886719,0.0
83,3,RandomForest,1,0.05,0.7690972222222222,0.8841027752029671,1.2519447803497314,0.0
84,3,AdaBoost (Discrete),1,0.05,0.7690972222222222,0.8841027752029671,51.73944664001465,0.0
85,3,AdaBoost (Real),1,0.05,0.7690972222222222,0.8841027752029671,139.42192363739014,0.0
86,3,Logistic Regression (Penalty = L2),1,0.05,0.7690972222222222,0.8841027752029671,0.43269777297973633,0.0
87,3,Naive Bayes,1,0.05,0.7690972222222222,0.8841027752029671,0.22435355186462402,0.0
88,3,KNeighbors Classifier,2,0.05,0.88,0.9684860662631681,0.6499423980712891,0.0
89,3,SVC Classifier,2,0.05,0.7008695652173913,1.0,1.3609552383422852,0.0
90,3,Decision Tree,2,0.05,0.88,0.9684860662631681,0.002349853515625,0.0
91,3,RandomForest,2,0.05,0.88,0.9684860662631681,1.312870979309082,0.0
92,3,AdaBoost (Discrete),2,0.05,0.88,0.9684860662631681,84.48626661300659,0.0
93,3,AdaBoost (Real),2,0.05,0.88,0.9684860662631681,105.5583324432373,0.0
94,3,Logistic Regression (Penalty = L2),2,0.05,0.88,0.9684860662631681,0.37976503372192383,0.0
95,3,Naive Bayes,2,0.05,0.88,0.9684860662631681,0.17661428451538086,0.0
96,7,KNeighbors Classifier,0,0.05,0.7001733102253033,1.0,0.559086799621582,0.0
97,7,SVC Classifier,0,0.05,0.7001733102253033,1.0,1.1959445476531982,0.0
98,7,Decision Tree,0,0.05,0.7001733102253033,1.0,0.001310586929321289,0.0
99,7,RandomForest,0,0.05,0.7001733102253033,1.0,1.6293432712554932,0.0
100,7,AdaBoost (Discrete),0,0.05,0.7001733102253033,1.0,82.22845196723938,0.0
101,7,AdaBoost (Real),0,0.05,0.7001733102253033,1.0,306.1851074695587,0.0
102,7,Logistic Regression (Penalty = L2),0,0.05,0.7001733102253033,1.0,0.3129129409790039,0.0
103,7,Naive Bayes,0,0.05,0.5025996533795494,0.6332377902572627,0.00373077392578125,0.0
104,7,KNeighbors Classifier,1,0.05,0.6996527777777778,1.0,0.6378588676452637,0.0
105,7,SVC Classifier,1,0.05,0.6996527777777778,1.0,0.8917818069458008,0.0
106,7,Decision Tree,1,0.05,0.6996527777777778,1.0,0.001336812973022461,0.0
107,7,RandomForest,1,0.05,0.6996527777777778,1.0,1.569516658782959,0.0
108,7,AdaBoost (Discrete),1,0.05,0.6996527777777778,1.0,72.47558450698853,0.0
109,7,AdaBoost (Real),1,0.05,0.6996527777777778,1.0,133.59583926200867,0.0
110,7,Logistic Regression (Penalty = L2),1,0.05,0.6996527777777778,1.0,0.3690493106842041,0.0
111,7,Naive Bayes,1,0.05,0.5503472222222222,0.6848230649393702,0.11460328102111816,0.0
112,7,KNeighbors Classifier,2,0.05,0.7008695652173913,1.0,0.3373546600341797,0.0
113,7,SVC Classifier,2,0.05,0.7008695652173913,1.0,0.48914027214050293,0.0
114,7,Decision Tree,2,0.05,0.7008695652173913,1.0,0.002291440963745117,0.0
115,7,RandomForest,2,0.05,0.7008695652173913,1.0,0.7862095832824707,0.0
116,7,AdaBoost (Discrete),2,0.05,0.7008695652173913,1.0,44.03265357017517,0.0
117,7,AdaBoost (Real),2,0.05,0.7008695652173913,1.0,65.10565638542175,0.0
118,7,Logistic Regression (Penalty = L2),2,0.05,0.7008695652173913,1.0,0.2825124263763428,0.0
119,7,Naive Bayes,2,0.05,0.6139130434782609,0.7472032220800768,0.1561746597290039,0.0
120,8,KNeighbors Classifier,0,0.05,0.7001733102253033,1.0,0.22116374969482422,0.0
121,8,SVC Classifier,0,0.05,0.7001733102253033,1.0,0.5702042579650879,0.0
122,8,Decision Tree,0,0.05,0.7001733102253033,1.0,0.0019724369049072266,0.0
123,8,RandomForest,0,0.05,0.7001733102253033,1.0,0.8019769191741943,0.0
124,8,AdaBoost (Discrete),0,0.05,0.7001733102253033,1.0,42.94679069519043,0.0
125,8,AdaBoost (Real),0,0.05,0.7001733102253033,1.0,161.89183163642883,0.0
126,8,Logistic Regression (Penalty = L2),0,0.05,0.7001733102253033,1.0,0.2815837860107422,0.0
127,8,Naive Bayes,0,0.05,0.5025996533795494,0.6332377902572627,0.1875779628753662,0.0
128,8,KNeighbors Classifier,1,0.05,0.6996527777777778,1.0,0.46453189849853516,0.0
129,8,SVC Classifier,1,0.05,0.6996527777777778,1.0,0.580247163772583,0.0
130,8,Decision Tree,1,0.05,0.6996527777777778,1.0,0.002144336700439453,0.0
131,8,RandomForest,1,0.05,0.6996527777777778,1.0,0.7016990184783936,0.0
132,8,AdaBoost (Discrete),1,0.05,0.6996527777777778,1.0,44.942277669906616,0.0
133,8,AdaBoost (Real),1,0.05,0.6996527777777778,1.0,152.94054770469666,0.0
134,8,Logistic Regression (Penalty = L2),1,0.05,0.6996527777777778,1.0,0.2682352066040039,0.0
135,8,Naive Bayes,1,0.05,0.5503472222222222,0.6848230649393702,0.11212158203125,0.0
136,8,KNeighbors Classifier,2,0.05,0.7008695652173913,1.0,0.3552696704864502,0.0
137,8,SVC Classifier,2,0.05,0.7008695652173913,1.0,0.6584951877593994,0.0
138,8,Decision Tree,2,0.05,0.7008695652173913,1.0,0.002212047576904297,0.0
139,8,RandomForest,2,0.05,0.7008695652173913,1.0,0.5661957263946533,0.0
140,8,AdaBoost (Discrete),2,0.05,0.7008695652173913,1.0,45.51236581802368,0.0
141,8,AdaBoost (Real),2,0.05,0.7008695652173913,1.0,65.61120176315308,0.0
142,8,Logistic Regression (Penalty = L2),2,0.05,0.7008695652173913,1.0,0.2992825508117676,0.0
143,8,Naive Bayes,2,0.05,0.6139130434782609,0.7472032220800768,0.10787415504455566,0.0
144,9,KNeighbors Classifier,0,0.05,0.6845753899480069,0.8129520829107402,0.3367617130279541,0.0
145,9,SVC Classifier,0,0.05,0.6845753899480069,0.8129520829107402,0.5497856140136719,0.0
146,9,Decision Tree,0,0.05,0.6845753899480069,0.8129520829107402,0.0020503997802734375,0.0
147,9,RandomForest,0,0.05,0.6845753899480069,0.8129520829107402,0.7592480182647705,0.0
148,9,AdaBoost (Discrete),0,0.05,0.6845753899480069,0.8129520829107402,44.466426610946655,0.0
149,9,AdaBoost (Real),0,0.05,0.6845753899480069,0.8129520829107402,92.92954778671265,0.0
150,9,Logistic Regression (Penalty = L2),0,0.05,0.6845753899480069,0.8129520829107402,0.17252159118652344,0.0
151,9,Naive Bayes,0,0.05,0.6845753899480069,0.8129520829107402,0.0950167179107666,0.0
152,9,KNeighbors Classifier,1,0.05,0.6996527777777778,1.0,0.2832753658294678,0.0
153,9,SVC Classifier,1,0.05,0.7690972222222222,0.8841027752029671,0.5748379230499268,0.0
154,9,Decision Tree,1,0.05,0.7690972222222222,0.8841027752029671,0.09456181526184082,0.0
155,9,RandomForest,1,0.05,0.7690972222222222,0.8841027752029671,0.6848874092102051,0.0
156,9,AdaBoost (Discrete),1,0.05,0.7690972222222222,0.8841027752029671,39.042797565460205,0.0
157,9,AdaBoost (Real),1,0.05,0.7690972222222222,0.8841027752029671,73.51873230934143,0.0
158,9,Logistic Regression (Penalty = L2),1,0.05,0.7690972222222222,0.8841027752029671,0.19593381881713867,0.0
159,9,Naive Bayes,1,0.05,0.7690972222222222,0.8841027752029671,0.09111618995666504,0.0
160,9,KNeighbors Classifier,2,0.05,0.88,0.9684860662631681,0.2775888442993164,0.0
161,9,SVC Classifier,2,0.05,0.7008695652173913,1.0,0.4940047264099121,0.0
162,9,Decision Tree,2,0.05,0.88,0.9684860662631681,0.002385377883911133,0.0
163,9,RandomForest,2,0.05,0.88,0.9684860662631681,0.6562299728393555,0.0
164,9,AdaBoost (Discrete),2,0.05,0.88,0.9684860662631681,35.94897270202637,0.0
165,9,AdaBoost (Real),2,0.05,0.88,0.9684860662631681,45.53029203414917,0.0
166,9,Logistic Regression (Penalty = L2),2,0.05,0.88,0.9684860662631681,0.18686795234680176,0.0
167,9,Naive Bayes,2,0.05,0.88,0.9684860662631681,0.09671640396118164,0.0
168,10,KNeighbors Classifier,0,0.05,0.6845753899480069,0.8129520829107402,0.3941769599914551,0.0
169,10,SVC Classifier,0,0.05,0.6845753899480069,0.8129520829107402,0.5941011905670166,0.0
170,10,Decision Tree,0,0.05,0.6845753899480069,0.8129520829107402,0.09454607963562012,0.0
171,10,RandomForest,0,0.05,0.6845753899480069,0.8129520829107402,0.5762627124786377,0.0
172,10,AdaBoost (Discrete),0,0.05,0.6845753899480069,0.8129520829107402,36.661685943603516,0.0
173,10,AdaBoost (Real),0,0.05,0.6845753899480069,0.8129520829107402,77.55435419082642,0.0
174,10,Logistic Regression (Penalty = L2),0,0.05,0.6845753899480069,0.8129520829107402,0.11364507675170898,0.0
175,10,Naive Bayes,0,0.05,0.6845753899480069,0.8129520829107402,0.10336947441101074,0.0
176,10,KNeighbors Classifier,1,0.05,0.7690972222222222,0.8841027752029671,0.27341604232788086,0.0
177,10,SVC Classifier,1,0.05,0.7690972222222222,0.8841027752029671,0.558732271194458,0.0
178,10,Decision Tree,1,0.05,0.7690972222222222,0.8841027752029671,0.09078764915466309,0.0
179,10,RandomForest,1,0.05,0.7690972222222222,0.8841027752029671,0.5530214309692383,0.0
180,10,AdaBoost (Discrete),1,0.05,0.7690972222222222,0.8841027752029671,34.681889295578,0.0
181,10,AdaBoost (Real),1,0.05,0.7690972222222222,0.8841027752029671,67.79987978935242,0.0
182,10,Logistic Regression (Penalty = L2),1,0.05,0.7690972222222222,0.8841027752029671,0.1948084831237793,0.0
183,10,Naive Bayes,1,0.05,0.7690972222222222,0.8841027752029671,0.08858799934387207,0.0
184,10,KNeighbors Classifier,2,0.05,0.7008695652173913,1.0,0.1885700225830078,0.0
185,10,SVC Classifier,2,0.05,0.7008695652173913,1.0,0.5534212589263916,0.0
186,10,Decision Tree,2,0.05,0.88,0.9684860662631681,0.0014450550079345703,0.0
187,10,RandomForest,2,0.05,0.88,0.9684860662631681,0.6205334663391113,0.0
188,10,AdaBoost (Discrete),2,0.05,0.88,0.9684860662631681,35.60312008857727,0.0
189,10,AdaBoost (Real),2,0.05,0.88,0.9684860662631681,44.79635047912598,0.0
190,10,Logistic Regression (Penalty = L2),2,0.05,0.88,0.9684860662631681,0.18802213668823242,0.0
191,10,Naive Bayes,2,0.05,0.88,0.9684860662631681,0.09181499481201172,0.0
192,11,KNeighbors Classifier,0,0.05,0.7417677642980935,0.7407118766149331,0.23185229301452637,0.0
193,11,SVC Classifier,0,0.05,0.6845753899480069,0.8129520829107402,0.5731737613677979,0.0
194,11,Decision Tree,0,0.05,0.7036395147313691,0.8044512804538025,0.0018754005432128906,0.0
195,11,RandomForest,0,0.05,0.7417677642980935,0.7407118766149331,0.5798444747924805,0.0
196,11,AdaBoost (Discrete),0,0.05,0.6845753899480069,0.8129520829107402,38.37552881240845,0.0
197,11,AdaBoost (Real),0,0.05,0.6845753899480069,0.8129520829107402,134.37718653678894,0.0
198,11,Logistic Regression (Penalty = L2),0,0.05,0.6845753899480069,0.8129520829107402,0.20274138450622559,0.0
199,11,Naive Bayes,0,0.05,0.5805892547660312,0.6192878878744241,0.19689416885375977,0.0
200,11,KNeighbors Classifier,1,0.05,0.7673611111111112,0.6570858289451206,0.4112226963043213,0.0
201,11,SVC Classifier,1,0.05,0.7690972222222222,0.8841027752029671,0.7322463989257812,0.0
202,11,Decision Tree,1,0.05,0.7430555555555556,0.7741160010790055,0.0015981197357177734,0.0
203,11,RandomForest,1,0.05,0.7673611111111112,0.6570858289451206,0.7209722995758057,0.0
204,11,AdaBoost (Discrete),1,0.05,0.7430555555555556,0.7741160010790055,43.339274883270264,0.0
205,11,AdaBoost (Real),1,0.05,0.7690972222222222,0.8841027752029671,83.3150098323822,0.0
206,11,Logistic Regression (Penalty = L2),1,0.05,0.7795138888888888,0.8629082987258412,0.28646421432495117,0.0
207,11,Naive Bayes,1,0.05,0.6475694444444444,0.4748247474479005,0.18904638290405273,0.4748247474479005
208,11,KNeighbors Classifier,2,0.05,0.4591304347826087,0.7733142235452992,0.38061094284057617,0.0
209,11,SVC Classifier,2,0.05,0.7617391304347826,0.5617326583032773,0.683161735534668,0.0
210,11,Decision Tree,2,0.05,0.72,0.3901736308334235,0.1102457046508789,0.0
211,11,RandomForest,2,0.05,0.7304347826086957,0.9950248447588356,0.6799540519714355,0.0
212,11,AdaBoost (Discrete),2,0.05,0.5078260869565218,0.5269531596071265,41.56842613220215,0.5269531596071265
213,11,AdaBoost (Real),2,0.05,0.5721739130434783,0.5487734906727578,98.8761818408966,0.0
214,11,Logistic Regression (Penalty = L2),2,0.05,0.7217391304347827,0.3905129124224957,0.3110346794128418,0.0
215,11,Naive Bayes,2,0.05,0.5530434782608695,0.6231768205516174,0.0883626937866211,0.6231768205516174
