,feat_set_id,classifier,fold_id,feat_th,score,geo_score,exec_t,geo_score_woz
0,0,KNeighbors Classifier,0,0.75,0.9479136270790779,0.9464758645662895,3.8656294345855713,0.9464758645662895
1,0,SVC Classifier,0,0.75,0.9575430405602567,0.9715801072762871,58.67702627182007,0.9715801072762871
2,0,Decision Tree,0,0.75,0.9563758389261745,0.9572797044547132,0.14861631393432617,0.9572797044547132
3,0,RandomForest,0,0.75,0.97957397140356,0.9729527992063384,0.8158023357391357,0.9729527992063384
4,0,AdaBoost (Discrete),0,0.75,0.9573971403559965,0.959482882753104,207.17134928703308,0.959482882753104
5,0,AdaBoost (Real),0,0.75,0.9236941931718704,0.9254257397133469,425.635329246521,0.9254257397133469
6,0,Logistic Regression (Penalty = L2),0,0.75,0.9862853807995331,0.9892993113713012,1.3557662963867188,0.9892993113713012
7,0,Naive Bayes,0,0.75,0.9595856434199008,0.972734352848773,0.4624447822570801,0.972734352848773
8,0,KNeighbors Classifier,1,0.75,0.8975631110462571,0.8289004987214921,3.695492744445801,0.8289004987214921
9,0,SVC Classifier,1,0.75,0.9753392674740989,0.9829765857634052,56.729544162750244,0.9829765857634052
10,0,Decision Tree,1,0.75,0.9325842696629213,0.9147209031999575,0.5251028537750244,0.9147209031999575
11,0,RandomForest,1,0.75,0.9854078505763899,0.9876308916916071,2.570545196533203,0.9876308916916071
12,0,AdaBoost (Discrete),1,0.75,0.9716912301181964,0.9594588707210122,280.5867545604706,0.9594588707210122
13,0,AdaBoost (Real),1,0.75,0.9689187217277105,0.9539959277249342,333.71980690956116,0.9539959277249342
14,0,Logistic Regression (Penalty = L2),1,0.75,0.9854078505763899,0.9876308916916071,1.3781929016113281,0.9876308916916071
15,0,Naive Bayes,1,0.75,0.9582664526484751,0.9716470184878037,0.4363682270050049,0.9716470184878037
16,0,KNeighbors Classifier,2,0.75,0.9200350211586167,0.8671415760580957,6.219503164291382,0.8671415760580957
17,0,SVC Classifier,2,0.75,0.9803005982781263,0.9866768821356858,43.87066602706909,0.9866768821356858
18,0,Decision Tree,2,0.75,0.9657084488545162,0.9308431886840776,0.6622247695922852,0.9308431886840776
19,0,RandomForest,2,0.75,0.9957682766671531,0.9963640429929818,3.4796221256256104,0.9963640429929818
20,0,AdaBoost (Discrete),2,0.75,0.8816576681745221,0.8852421388809191,252.81173086166382,0.8852421388809191
21,0,AdaBoost (Real),2,0.75,0.9268933313877135,0.9057105038013056,318.44974994659424,0.9057105038013056
22,0,Logistic Regression (Penalty = L2),2,0.75,0.994309061724792,0.9954137671039203,0.9897582530975342,0.9954137671039203
23,0,Naive Bayes,2,0.75,0.9033999708157011,0.9346965347795344,0.3567013740539551,0.9346965347795344
24,1,KNeighbors Classifier,0,0.75,0.9629413481178873,0.9661681630282692,2.646824836730957,0.9661681630282692
25,1,SVC Classifier,0,0.75,0.951561132185585,0.9675731712876111,64.06189560890198,0.9675731712876111
26,1,Decision Tree,0,0.75,0.9398891158447622,0.940157372382226,0.7380874156951904,0.940157372382226
27,1,RandomForest,0,0.75,0.9606069448497228,0.9292481233922274,2.301387310028076,0.9292481233922274
28,1,AdaBoost (Discrete),0,0.75,0.9410563174788444,0.9498239372930074,286.36106300354004,0.9498239372930074
29,1,AdaBoost (Real),0,0.75,0.9448497227896119,0.9295010196628156,391.3137044906616,0.9295010196628156
30,1,Logistic Regression (Penalty = L2),0,0.75,0.9859935803910126,0.989108455902877,1.4139294624328613,0.989108455902877
31,1,Naive Bayes,0,0.75,0.9578348409687774,0.9715654347183178,0.5546624660491943,0.9715654347183178
32,1,KNeighbors Classifier,1,0.75,0.9357945425361156,0.9310324688580266,3.4013068675994873,0.9310324688580266
33,1,SVC Classifier,1,0.75,0.9611848825331971,0.9738040448822446,59.34401035308838,0.9738040448822446
34,1,Decision Tree,1,0.75,0.9677513497738217,0.9567230918421974,0.6724660396575928,0.9567230918421974
35,1,RandomForest,1,0.75,0.9687728002334743,0.9468411077871332,2.9270331859588623,0.9468411077871332
36,1,AdaBoost (Discrete),1,0.75,0.9538888078213921,0.9512229520444629,246.7681269645691,0.9512229520444629
37,1,AdaBoost (Real),1,0.75,0.9360863855245878,0.9477968300902542,340.96806836128235,0.9477968300902542
38,1,Logistic Regression (Penalty = L2),1,0.75,0.985553772070626,0.987945373753929,1.2907464504241943,0.987945373753929
39,1,Naive Bayes,1,0.75,0.9579746096600029,0.971452202041036,0.4694385528564453,0.971452202041036
40,1,KNeighbors Classifier,2,0.75,0.9490733985116008,0.930724965621419,4.84976053237915,0.930724965621419
41,1,SVC Classifier,2,0.75,0.9772362468991682,0.9846580546174685,79.74100613594055,0.9846580546174685
42,1,Decision Tree,2,0.75,0.9734422880490297,0.9656102870235997,0.4960448741912842,0.9656102870235997
43,1,RandomForest,2,0.75,0.9814679702320152,0.9635433407708306,1.9319298267364502,0.9635433407708306
44,1,AdaBoost (Discrete),2,0.75,0.9676054282795856,0.9667823124009349,216.24851632118225,0.9667823124009349
45,1,AdaBoost (Real),2,0.75,0.9557857872464613,0.9590787449126287,327.94195771217346,0.9590787449126287
46,1,Logistic Regression (Penalty = L2),2,0.75,0.9903691813804173,0.9930624654586026,1.1953074932098389,0.9930624654586026
47,1,Naive Bayes,2,0.75,0.9803005982781263,0.9864607919979854,0.5185132026672363,0.9864607919979854
48,2,KNeighbors Classifier,0,0.75,0.9479136270790779,0.9464758645662895,4.092165231704712,0.9464758645662895
49,2,SVC Classifier,0,0.75,0.9575430405602567,0.9715801072762871,65.23467588424683,0.9715801072762871
50,2,Decision Tree,0,0.75,0.9474759264662971,0.94036408672693,0.7000017166137695,0.94036408672693
51,2,RandomForest,0,0.75,0.97957397140356,0.9729527992063384,2.3261163234710693,0.9729527992063384
52,2,AdaBoost (Discrete),0,0.75,0.9573971403559965,0.959482882753104,246.73529767990112,0.959482882753104
53,2,AdaBoost (Real),0,0.75,0.9206302888824044,0.9255997650998281,403.56965017318726,0.9255997650998281
54,2,Logistic Regression (Penalty = L2),0,0.75,0.9862853807995331,0.9892993113713012,1.3623580932617188,0.9892993113713012
55,2,Naive Bayes,0,0.75,0.9595856434199008,0.972734352848773,0.67765212059021,0.972734352848773
56,2,KNeighbors Classifier,1,0.75,0.8975631110462571,0.8289004987214921,6.280586242675781,0.8289004987214921
57,2,SVC Classifier,1,0.75,0.9753392674740989,0.9829765857634052,78.78433108329773,0.9829765857634052
58,2,Decision Tree,1,0.75,0.9385670509266015,0.9264260237971471,0.6211733818054199,0.9264260237971471
59,2,RandomForest,1,0.75,0.9854078505763899,0.9876308916916071,3.206056594848633,0.9876308916916071
60,2,AdaBoost (Discrete),1,0.75,0.9716912301181964,0.9594588707210122,299.92743015289307,0.9594588707210122
61,2,AdaBoost (Real),1,0.75,0.9689187217277105,0.9539959277249342,383.9035725593567,0.9539959277249342
62,2,Logistic Regression (Penalty = L2),1,0.75,0.9854078505763899,0.9876308916916071,0.6417825222015381,0.9876308916916071
63,2,Naive Bayes,1,0.75,0.9582664526484751,0.9716470184878037,0.3141746520996094,0.9716470184878037
64,2,KNeighbors Classifier,2,0.75,0.9200350211586167,0.8671415760580957,6.6248767375946045,0.8671415760580957
65,2,SVC Classifier,2,0.75,0.9803005982781263,0.9866768821356858,54.87190628051758,0.9866768821356858
66,2,Decision Tree,2,0.75,0.9662921348314607,0.9488341521142883,0.8273682594299316,0.9488341521142883
67,2,RandomForest,2,0.75,0.9957682766671531,0.9963640429929818,2.9529035091400146,0.9963640429929818
68,2,AdaBoost (Discrete),2,0.75,0.8816576681745221,0.8852421388809191,300.358624458313,0.8852421388809191
69,2,AdaBoost (Real),2,0.75,0.9268933313877135,0.9057105038013056,419.20994305610657,0.9057105038013056
70,2,Logistic Regression (Penalty = L2),2,0.75,0.994309061724792,0.9954137671039203,1.509244680404663,0.9954137671039203
71,2,Naive Bayes,2,0.75,0.9033999708157011,0.9346965347795344,0.5402543544769287,0.9346965347795344
72,3,KNeighbors Classifier,0,0.75,0.957688940764517,0.9585752132919418,4.526216506958008,0.9585752132919418
73,3,SVC Classifier,0,0.75,0.9517070323898453,0.9676710988392294,108.78171753883362,0.9676710988392294
74,3,Decision Tree,0,0.75,0.906623869273417,0.8603487848689934,0.9921808242797852,0.8603487848689934
75,3,RandomForest,0,0.75,0.9606069448497228,0.928756570463125,3.343571901321411,0.928756570463125
76,3,AdaBoost (Discrete),0,0.75,0.9457251240151736,0.9524781254076857,235.1045696735382,0.9524781254076857
77,3,AdaBoost (Real),0,0.75,0.9263203968485556,0.9291115282053373,350.8376019001007,0.9291115282053373
78,3,Logistic Regression (Penalty = L2),0,0.75,0.9859935803910126,0.989108455902877,1.409273386001587,0.989108455902877
79,3,Naive Bayes,0,0.75,0.9572512401517362,0.9711754826918861,0.6223788261413574,0.9711754826918861
80,3,KNeighbors Classifier,1,0.75,0.9417773237997957,0.9413718562213553,3.3027992248535156,0.9413718562213553
81,3,SVC Classifier,1,0.75,0.9613308040274332,0.9739012842898346,60.1467502117157,0.9739012842898346
82,3,Decision Tree,1,0.75,0.9589960601196557,0.9409580543659558,0.6024446487426758,0.9409580543659558
83,3,RandomForest,1,0.75,0.9842404786225011,0.9851114210269346,2.4208972454071045,0.9851114210269346
84,3,AdaBoost (Discrete),1,0.75,0.9801546767838902,0.9769133592096796,232.75689697265625,0.9769133592096796
85,3,AdaBoost (Real),1,0.75,0.9429446957536846,0.9340337259563313,380.8872010707855,0.9340337259563313
86,3,Logistic Regression (Penalty = L2),1,0.75,0.985553772070626,0.987945373753929,1.1989455223083496,0.987945373753929
87,3,Naive Bayes,1,0.75,0.9582664526484751,0.9716470184878037,0.48307228088378906,0.9716470184878037
88,3,KNeighbors Classifier,2,0.75,0.9499489274770173,0.9329211668724214,5.014135360717773,0.9329211668724214
89,3,SVC Classifier,2,0.75,0.9772362468991682,0.9846580546174685,111.73921728134155,0.9846580546174685
90,3,Decision Tree,2,0.75,0.962352254487086,0.951448368197713,0.47818899154663086,0.951448368197713
91,3,RandomForest,2,0.75,0.9940172187363199,0.991903727950644,2.654932975769043,0.991903727950644
92,3,AdaBoost (Discrete),2,0.75,0.9677513497738217,0.974097641368005,237.74804186820984,0.974097641368005
93,3,AdaBoost (Real),2,0.75,0.9531592003502116,0.9603879329967518,319.1488788127899,0.9603879329967518
94,3,Logistic Regression (Penalty = L2),2,0.75,0.9903691813804173,0.9930624654586026,1.2266757488250732,0.9930624654586026
95,3,Naive Bayes,2,0.75,0.9804465197723625,0.9865567839012922,0.5165770053863525,0.9865567839012922
96,4,KNeighbors Classifier,0,0.75,0.9479136270790779,0.9464758645662895,4.162876605987549,0.9464758645662895
97,4,SVC Classifier,0,0.75,0.9575430405602567,0.9715801072762871,77.62968444824219,0.9715801072762871
98,4,Decision Tree,0,0.75,0.9414940180916254,0.9425238747534657,0.9270613193511963,0.9425238747534657
99,4,RandomForest,0,0.75,0.97957397140356,0.9729527992063384,2.624173641204834,0.9729527992063384
100,4,AdaBoost (Discrete),0,0.75,0.9573971403559965,0.959482882753104,276.1135368347168,0.959482882753104
101,4,AdaBoost (Real),0,0.75,0.9206302888824044,0.9255997650998281,354.0992760658264,0.9255997650998281
102,4,Logistic Regression (Penalty = L2),0,0.75,0.9862853807995331,0.9892993113713012,1.176917552947998,0.9892993113713012
103,4,Naive Bayes,0,0.75,0.9595856434199008,0.972734352848773,0.4005308151245117,0.972734352848773
104,4,KNeighbors Classifier,1,0.75,0.8975631110462571,0.8289004987214921,4.9289710521698,0.8289004987214921
105,4,SVC Classifier,1,0.75,0.9753392674740989,0.9829765857634052,64.19208884239197,0.9829765857634052
106,4,Decision Tree,1,0.75,0.9645410769006275,0.9562740037251132,0.7423677444458008,0.9562740037251132
107,4,RandomForest,1,0.75,0.9854078505763899,0.9876308916916071,2.9278151988983154,0.9876308916916071
108,4,AdaBoost (Discrete),1,0.75,0.9716912301181964,0.9594588707210122,265.9706542491913,0.9594588707210122
109,4,AdaBoost (Real),1,0.75,0.9636655479352109,0.945773336765643,337.9409897327423,0.945773336765643
110,4,Logistic Regression (Penalty = L2),1,0.75,0.9854078505763899,0.9876308916916071,1.1197998523712158,0.9876308916916071
111,4,Naive Bayes,1,0.75,0.9582664526484751,0.9716470184878037,0.46410369873046875,0.9716470184878037
112,4,KNeighbors Classifier,2,0.75,0.9200350211586167,0.8671415760580957,7.100494146347046,0.8671415760580957
113,4,SVC Classifier,2,0.75,0.9803005982781263,0.9866768821356858,57.476282835006714,0.9866768821356858
114,4,Decision Tree,2,0.75,0.9636655479352109,0.9455381372803685,0.6241519451141357,0.9455381372803685
115,4,RandomForest,2,0.75,0.9957682766671531,0.9963640429929818,2.6063835620880127,0.9963640429929818
116,4,AdaBoost (Discrete),2,0.75,0.8816576681745221,0.8852421388809191,269.12912130355835,0.8852421388809191
117,4,AdaBoost (Real),2,0.75,0.9268933313877135,0.9057105038013056,1346.4697811603546,0.9057105038013056
118,4,Logistic Regression (Penalty = L2),2,0.75,0.994309061724792,0.9954137671039203,1.416910171508789,0.9954137671039203
119,4,Naive Bayes,2,0.75,0.9033999708157011,0.9346965347795344,0.49670839309692383,0.9346965347795344
120,5,KNeighbors Classifier,0,0.75,0.957688940764517,0.9585752132919418,2.6608786582946777,0.9585752132919418
121,5,SVC Classifier,0,0.75,0.9517070323898453,0.9676710988392294,70.29678773880005,0.9676710988392294
122,5,Decision Tree,0,0.75,0.9559381383133937,0.9385921305599763,0.3260788917541504,0.9385921305599763
123,5,RandomForest,0,0.75,0.9606069448497228,0.928756570463125,1.990173101425171,0.928756570463125
124,5,AdaBoost (Discrete),0,0.75,0.9457251240151736,0.9524781254076857,168.92834877967834,0.9524781254076857
125,5,AdaBoost (Real),0,0.75,0.9266121972570761,0.9297390943209344,220.58486247062683,0.9297390943209344
126,5,Logistic Regression (Penalty = L2),0,0.75,0.9859935803910126,0.989108455902877,0.7862153053283691,0.989108455902877
127,5,Naive Bayes,0,0.75,0.9572512401517362,0.9711754826918861,0.2902405261993408,0.9711754826918861
128,5,KNeighbors Classifier,1,0.75,0.9417773237997957,0.9413718562213553,2.148134231567383,0.9413718562213553
129,5,SVC Classifier,1,0.75,0.9613308040274332,0.9739012842898346,38.01397156715393,0.9739012842898346
130,5,Decision Tree,1,0.75,0.9553480227637531,0.9254934352565084,0.4509596824645996,0.9254934352565084
131,5,RandomForest,1,0.75,0.9842404786225011,0.9851114210269346,1.745631456375122,0.9851114210269346
132,5,AdaBoost (Discrete),1,0.75,0.9801546767838902,0.9769133592096796,146.01554584503174,0.9769133592096796
133,5,AdaBoost (Real),1,0.75,0.9556398657522253,0.9407164266116769,234.4474756717682,0.9407164266116769
134,5,Logistic Regression (Penalty = L2),1,0.75,0.985553772070626,0.987945373753929,0.674769401550293,0.987945373753929
135,5,Naive Bayes,1,0.75,0.9582664526484751,0.9716470184878037,0.2920827865600586,0.9716470184878037
136,5,KNeighbors Classifier,2,0.75,0.9499489274770173,0.9329211668724214,3.296441078186035,0.9329211668724214
137,5,SVC Classifier,2,0.75,0.9772362468991682,0.9846580546174685,69.55425024032593,0.9846580546174685
138,5,Decision Tree,2,0.75,0.979716912301182,0.9703071279966253,0.46195507049560547,0.9703071279966253
139,5,RandomForest,2,0.75,0.9940172187363199,0.991903727950644,1.569931983947754,0.991903727950644
140,5,AdaBoost (Discrete),2,0.75,0.9677513497738217,0.974097641368005,141.1011266708374,0.974097641368005
141,5,AdaBoost (Real),2,0.75,0.9531592003502116,0.9603879329967518,200.18881845474243,0.9603879329967518
142,5,Logistic Regression (Penalty = L2),2,0.75,0.9903691813804173,0.9930624654586026,0.6853494644165039,0.9930624654586026
143,5,Naive Bayes,2,0.75,0.9804465197723625,0.9865567839012922,0.2880516052246094,0.9865567839012922
144,6,KNeighbors Classifier,0,0.75,0.9479136270790779,0.9464758645662895,2.7039411067962646,0.9464758645662895
145,6,SVC Classifier,0,0.75,0.9575430405602567,0.9715801072762871,52.02078437805176,0.9715801072762871
146,6,Decision Tree,0,0.75,0.9503939305515028,0.9476372381230755,0.4961996078491211,0.9476372381230755
147,6,RandomForest,0,0.75,0.97957397140356,0.9729527992063384,2.0141007900238037,0.9729527992063384
148,6,AdaBoost (Discrete),0,0.75,0.9573971403559965,0.959482882753104,174.69490933418274,0.959482882753104
149,6,AdaBoost (Real),0,0.75,0.9206302888824044,0.9255997650998281,235.06903982162476,0.9255997650998281
150,6,Logistic Regression (Penalty = L2),0,0.75,0.9862853807995331,0.9892993113713012,0.67934250831604,0.9892993113713012
151,6,Naive Bayes,0,0.75,0.9595856434199008,0.972734352848773,0.33492517471313477,0.972734352848773
152,6,KNeighbors Classifier,1,0.75,0.8975631110462571,0.8289004987214921,2.916330337524414,0.8289004987214921
153,6,SVC Classifier,1,0.75,0.9753392674740989,0.9829765857634052,39.37130427360535,0.9829765857634052
154,6,Decision Tree,1,0.75,0.9387129724208376,0.9279005331683534,0.4396519660949707,0.9279005331683534
155,6,RandomForest,1,0.75,0.9854078505763899,0.9876308916916071,1.5631616115570068,0.9876308916916071
156,6,AdaBoost (Discrete),1,0.75,0.9716912301181964,0.9594588707210122,149.88431572914124,0.9594588707210122
157,6,AdaBoost (Real),1,0.75,0.9689187217277105,0.9539959277249342,189.3136076927185,0.9539959277249342
158,6,Logistic Regression (Penalty = L2),1,0.75,0.9854078505763899,0.9876308916916071,0.6222009658813477,0.9876308916916071
159,6,Naive Bayes,1,0.75,0.9582664526484751,0.9716470184878037,0.21610069274902344,0.9716470184878037
160,6,KNeighbors Classifier,2,0.75,0.9200350211586167,0.8671415760580957,4.004464864730835,0.8671415760580957
161,6,SVC Classifier,2,0.75,0.9803005982781263,0.9866768821356858,31.283612728118896,0.9866768821356858
162,6,Decision Tree,2,0.75,0.9476141835692398,0.9081053602957053,0.4758906364440918,0.9081053602957053
163,6,RandomForest,2,0.75,0.9957682766671531,0.9963640429929818,1.501579761505127,0.9963640429929818
164,6,AdaBoost (Discrete),2,0.75,0.8809280607033416,0.8847640172479421,148.8683159351349,0.8847640172479421
165,6,AdaBoost (Real),2,0.75,0.9266014883992412,0.9055285063105097,189.6793553829193,0.9055285063105097
166,6,Logistic Regression (Penalty = L2),2,0.75,0.994309061724792,0.9954137671039203,0.469663143157959,0.9954137671039203
167,6,Naive Bayes,2,0.75,0.9033999708157011,0.9346965347795344,0.21718525886535645,0.9346965347795344
168,7,KNeighbors Classifier,0,0.75,0.9538955354537496,0.94787631834706,2.17684268951416,0.94787631834706
169,7,SVC Classifier,0,0.75,0.9569594397432156,0.9711899144463835,43.88063144683838,0.9711899144463835
170,7,Decision Tree,0,0.75,0.9667347534286548,0.9615412392753675,0.4642198085784912,0.9615412392753675
171,7,RandomForest,0,0.75,0.9833673767143274,0.9812279802095485,1.3924434185028076,0.9812279802095485
172,7,AdaBoost (Discrete),0,0.75,0.9400350160490225,0.9404728085167121,175.73091101646423,0.9404728085167121
173,7,AdaBoost (Real),0,0.75,0.917858185001459,0.8929410356221527,221.85743379592896,0.8929410356221527
174,7,Logistic Regression (Penalty = L2),0,0.75,0.9862853807995331,0.9892993113713012,0.7025542259216309,0.9892993113713012
175,7,Naive Bayes,0,0.75,0.9620659468923256,0.9743879197638988,0.3245871067047119,0.9743879197638988
176,7,KNeighbors Classifier,1,0.75,0.8961038961038961,0.8333252580897204,3.1089253425598145,0.8333252580897204
177,7,SVC Classifier,1,0.75,0.9751933459798628,0.9828803051827577,37.83600187301636,0.9828803051827577
178,7,Decision Tree,1,0.75,0.9403181088574347,0.9001679946574721,0.4600672721862793,0.9001679946574721
179,7,RandomForest,1,0.75,0.9854078505763899,0.9876308916916071,1.4476120471954346,0.9876308916916071
180,7,AdaBoost (Discrete),1,0.75,0.9622063329928499,0.9590568099807082,174.250506401062,0.9590568099807082
181,7,AdaBoost (Real),1,0.75,0.9600175105793083,0.9499605668681117,261.51484417915344,0.9499605668681117
182,7,Logistic Regression (Penalty = L2),1,0.75,0.9854078505763899,0.9876308916916071,0.7754900455474854,0.9876308916916071
183,7,Naive Bayes,1,0.75,0.9579746096600029,0.971452202041036,0.307110071182251,0.971452202041036
184,7,KNeighbors Classifier,2,0.75,0.9190135706989639,0.8657483598445755,4.741841554641724,0.8657483598445755
185,7,SVC Classifier,2,0.75,0.9792791478184737,0.9860043989092296,37.838974952697754,0.9860043989092296
186,7,Decision Tree,2,0.75,0.9425069312709762,0.8955870357870087,0.5557525157928467,0.8955870357870087
187,7,RandomForest,2,0.75,0.9959141981613892,0.9964590207390621,1.8199186325073242,0.9964590207390621
188,7,AdaBoost (Discrete),2,0.75,0.9087990661024369,0.8867976331621862,183.01346039772034,0.8867976331621862
189,7,AdaBoost (Real),2,0.75,0.8695461841529257,0.8532428944166828,234.2108817100525,0.8532428944166828
190,7,Logistic Regression (Penalty = L2),2,0.75,0.994309061724792,0.9954137671039203,0.6314098834991455,0.9954137671039203
191,7,Naive Bayes,2,0.75,0.9028162848387568,0.9342909385205673,0.23339414596557617,0.9342909385205673
192,8,KNeighbors Classifier,0,0.75,0.957688940764517,0.9585752132919418,1.37144136428833,0.9585752132919418
193,8,SVC Classifier,0,0.75,0.9517070323898453,0.9676710988392294,54.01848077774048,0.9676710988392294
194,8,Decision Tree,0,0.75,0.9118762766267873,0.8618879440011272,0.33580803871154785,0.8618879440011272
195,8,RandomForest,0,0.75,0.9606069448497228,0.928756570463125,1.4333984851837158,0.928756570463125
196,8,AdaBoost (Discrete),0,0.75,0.9457251240151736,0.9524781254076857,120.82519936561584,0.9524781254076857
197,8,AdaBoost (Real),0,0.75,0.9267580974613364,0.9300527185816073,192.66390657424927,0.9300527185816073
198,8,Logistic Regression (Penalty = L2),0,0.75,0.9859935803910126,0.989108455902877,0.8215358257293701,0.989108455902877
199,8,Naive Bayes,0,0.75,0.9572512401517362,0.9711754826918861,0.26750898361206055,0.9711754826918861
200,8,KNeighbors Classifier,1,0.75,0.9417773237997957,0.9413718562213553,1.9502625465393066,0.9413718562213553
201,8,SVC Classifier,1,0.75,0.9613308040274332,0.9739012842898346,35.281898498535156,0.9739012842898346
202,8,Decision Tree,1,0.75,0.958120531154239,0.9432151334689797,0.30641841888427734,0.9432151334689797
203,8,RandomForest,1,0.75,0.9842404786225011,0.9851114210269346,1.6896657943725586,0.9851114210269346
204,8,AdaBoost (Discrete),1,0.75,0.9801546767838902,0.9769133592096796,148.1817660331726,0.9769133592096796
205,8,AdaBoost (Real),1,0.75,0.9429446957536846,0.9340337259563313,218.01679587364197,0.9340337259563313
206,8,Logistic Regression (Penalty = L2),1,0.75,0.985553772070626,0.987945373753929,0.7218008041381836,0.987945373753929
207,8,Naive Bayes,1,0.75,0.9582664526484751,0.9716470184878037,0.25980257987976074,0.9716470184878037
208,8,KNeighbors Classifier,2,0.75,0.9499489274770173,0.9329211668724214,2.9854111671447754,0.9329211668724214
209,8,SVC Classifier,2,0.75,0.9772362468991682,0.9846580546174685,61.48058819770813,0.9846580546174685
210,8,Decision Tree,2,0.75,0.9554939442579892,0.9316419599380116,0.4353952407836914,0.9316419599380116
211,8,RandomForest,2,0.75,0.9940172187363199,0.991903727950644,1.2390916347503662,0.991903727950644
212,8,AdaBoost (Discrete),2,0.75,0.9677513497738217,0.974097641368005,130.57332253456116,0.974097641368005
213,8,AdaBoost (Real),2,0.75,0.9531592003502116,0.9606030250833464,192.7567458152771,0.9606030250833464
214,8,Logistic Regression (Penalty = L2),2,0.75,0.9903691813804173,0.9930624654586026,0.58778977394104,0.9930624654586026
215,8,Naive Bayes,2,0.75,0.9804465197723625,0.9865567839012922,0.2493753433227539,0.9865567839012922
