,feat_set_id,classifier,fold_id,feat_th,score,geo_score,exec_t,geo_score_woz
0,0,KNeighbors Classifier,0,0.7,0.6069364161849711,0.5610960118255495,0.17366290092468262,0.0
1,0,SVC Classifier,0,0.7,0.49710982658959535,1.0,0.1996908187866211,0.0
2,0,Decision Tree,0,0.7,0.6184971098265896,0.6504316642127952,0.029227495193481445,0.0
3,0,RandomForest,0,0.7,0.5491329479768786,0.422390949677227,0.1287219524383545,0.0
4,0,AdaBoost (Discrete),0,0.7,0.6936416184971098,0.5288050054837478,12.942731618881226,0.0
5,0,AdaBoost (Real),0,0.7,0.6589595375722543,0.7290022275036606,14.17229175567627,0.0
6,0,Logistic Regression (Penalty = L2),0,0.7,0.6358381502890174,0.45469917304765256,0.3134438991546631,0.0
7,0,Naive Bayes,0,0.7,0.21965317919075145,0.3991668535408312,0.07556033134460449,0.0
8,0,KNeighbors Classifier,1,0.7,0.6428571428571429,0.5409869360113657,0.20088982582092285,0.0
9,0,SVC Classifier,1,0.7,0.5119047619047619,1.0,0.22154641151428223,0.0
10,0,Decision Tree,1,0.7,0.6130952380952381,0.6556695145226585,0.02814340591430664,0.0
11,0,RandomForest,1,0.7,0.5535714285714286,0.5595642461260143,0.10651493072509766,0.0
12,0,AdaBoost (Discrete),1,0.7,0.7202380952380952,0.7795003950179016,13.865608930587769,0.0
13,0,AdaBoost (Real),1,0.7,0.6666666666666666,0.798079928364319,14.89622163772583,0.0
14,0,Logistic Regression (Penalty = L2),1,0.7,0.625,0.4470046280749025,0.2880237102508545,0.0
15,0,Naive Bayes,1,0.7,0.25,0.4181698984778722,0.059464454650878906,0.0
16,0,KNeighbors Classifier,2,0.7,0.6748466257668712,0.5747747285269627,0.22161316871643066,0.0
17,0,SVC Classifier,2,0.7,0.5153374233128835,1.0,0.2211933135986328,0.0
18,0,Decision Tree,2,0.7,0.5828220858895705,0.5992151267160194,0.02765798568725586,0.0
19,0,RandomForest,2,0.7,0.5521472392638037,0.5395313323208076,0.09793281555175781,0.0
20,0,AdaBoost (Discrete),2,0.7,0.7177914110429447,0.674637725508176,12.797847032546997,0.0
21,0,AdaBoost (Real),2,0.7,0.5644171779141104,0.5356036410340865,14.478533744812012,0.0
22,0,Logistic Regression (Penalty = L2),2,0.7,0.6932515337423313,0.6149834196279631,0.3226914405822754,0.0
23,0,Naive Bayes,2,0.7,0.25766871165644173,0.4715705532707429,0.06412959098815918,0.0
24,1,KNeighbors Classifier,0,0.7,0.5549132947976878,0.5643208209417312,0.18988609313964844,0.0
25,1,SVC Classifier,0,0.7,0.49710982658959535,1.0,0.22139263153076172,0.0
26,1,Decision Tree,0,0.7,0.6011560693641619,0.4640923793555637,0.02881455421447754,0.0
27,1,RandomForest,0,0.7,0.5549132947976878,0.48438841363348917,0.09624123573303223,0.0
28,1,AdaBoost (Discrete),0,0.7,0.6936416184971098,0.5369109580622465,16.713498830795288,0.0
29,1,AdaBoost (Real),0,0.7,0.5953757225433526,0.6329691034842289,17.813024044036865,0.0
30,1,Logistic Regression (Penalty = L2),0,0.7,0.6184971098265896,0.4725653855550048,0.2550828456878662,0.0
31,1,Naive Bayes,0,0.7,0.24277456647398843,0.40534831115499803,0.07934141159057617,0.0
32,1,KNeighbors Classifier,1,0.7,0.6369047619047619,0.4886551474651264,0.21295857429504395,0.0
33,1,SVC Classifier,1,0.7,0.5119047619047619,1.0,0.22153282165527344,0.0
34,1,Decision Tree,1,0.7,0.6428571428571429,0.702653888092861,0.005173683166503906,0.0
35,1,RandomForest,1,0.7,0.5476190476190477,0.575581947444966,0.12629485130310059,0.0
36,1,AdaBoost (Discrete),1,0.7,0.7083333333333334,0.5828922071764386,16.777141094207764,0.0
37,1,AdaBoost (Real),1,0.7,0.6130952380952381,0.52871435884137,17.757970094680786,0.0
38,1,Logistic Regression (Penalty = L2),1,0.7,0.7023809523809523,0.6292237188431867,0.3709096908569336,0.0
39,1,Naive Bayes,1,0.7,0.2619047619047619,0.4410714231202338,0.03708600997924805,0.0
40,1,KNeighbors Classifier,2,0.7,0.5644171779141104,0.5568356481270701,0.20473289489746094,0.0
41,1,SVC Classifier,2,0.7,0.5153374233128835,1.0,0.19436001777648926,0.0
42,1,Decision Tree,2,0.7,0.5460122699386503,0.6539093214343779,0.028324604034423828,0.0
43,1,RandomForest,2,0.7,0.5705521472392638,0.4069475124088966,0.12808871269226074,0.0
44,1,AdaBoost (Discrete),2,0.7,0.7239263803680982,0.7503272149014625,16.121039867401123,0.0
45,1,AdaBoost (Real),2,0.7,0.5337423312883436,0.5428336808647786,16.88196039199829,0.0
46,1,Logistic Regression (Penalty = L2),2,0.7,0.6932515337423313,0.5280720125556105,0.3486466407775879,0.0
47,1,Naive Bayes,2,0.7,0.27607361963190186,0.47369883722309636,0.07491040229797363,0.0
48,2,KNeighbors Classifier,0,0.7,0.6242774566473989,0.4643480292495597,0.20226550102233887,0.0
49,2,SVC Classifier,0,0.7,0.5028901734104047,0.5227579585747102,0.222182035446167,0.0
50,2,Decision Tree,0,0.7,0.6127167630057804,0.6127693420548457,0.02874898910522461,0.0
51,2,RandomForest,0,0.7,0.5549132947976878,0.3792258758532711,0.10270047187805176,0.0
52,2,AdaBoost (Discrete),0,0.7,0.7398843930635838,0.593330032251681,20.862749338150024,0.0
53,2,AdaBoost (Real),0,0.7,0.6242774566473989,0.7244007043050418,21.39417028427124,0.0
54,2,Logistic Regression (Penalty = L2),0,0.7,0.6820809248554913,0.5967260731744631,0.42968058586120605,0.0
55,2,Naive Bayes,0,0.7,0.2832369942196532,0.46376858100982044,0.08470606803894043,0.0
56,2,KNeighbors Classifier,1,0.7,0.6488095238095238,0.5241923835179018,0.17129111289978027,0.0
57,2,SVC Classifier,1,0.7,0.5238095238095238,0.6933612743506347,0.2524700164794922,0.0
58,2,Decision Tree,1,0.7,0.5595238095238095,0.5657862303949751,0.029532432556152344,0.0
59,2,RandomForest,1,0.7,0.5535714285714286,0.6613425865923768,0.12744522094726562,0.0
60,2,AdaBoost (Discrete),1,0.7,0.7619047619047619,0.7205875489128999,19.486857414245605,0.0
61,2,AdaBoost (Real),1,0.7,0.6547619047619048,0.7541912785069493,21.72008204460144,0.0
62,2,Logistic Regression (Penalty = L2),1,0.7,0.7380952380952381,0.7320013364107395,0.4405391216278076,0.0
63,2,Naive Bayes,1,0.7,0.25,0.4181698984778722,0.08853363990783691,0.0
64,2,KNeighbors Classifier,2,0.7,0.7055214723926381,0.6542728385368908,0.1114492416381836,0.0
65,2,SVC Classifier,2,0.7,0.5337423312883436,0.7937005259840998,0.11674022674560547,0.0
66,2,Decision Tree,2,0.7,0.5521472392638037,0.6276234418656256,0.016321659088134766,0.0
67,2,RandomForest,2,0.7,0.5705521472392638,0.6803749333171202,0.051888227462768555,0.0
68,2,AdaBoost (Discrete),2,0.7,0.754601226993865,0.711232694157212,20.973485469818115,0.0
69,2,AdaBoost (Real),2,0.7,0.5950920245398773,0.8001929082948045,21.68090319633484,0.0
70,2,Logistic Regression (Penalty = L2),2,0.7,0.7177914110429447,0.7172960229068771,0.47618961334228516,0.0
71,2,Naive Bayes,2,0.7,0.294478527607362,0.5243950337039179,0.07749652862548828,0.0
72,3,KNeighbors Classifier,0,0.7,0.6011560693641619,0.4525554845272288,0.1606733798980713,0.0
73,3,SVC Classifier,0,0.7,0.5028901734104047,0.5227579585747102,0.23458623886108398,0.0
74,3,Decision Tree,0,0.7,0.653179190751445,0.6159375866305387,0.0045392513275146484,0.0
75,3,RandomForest,0,0.7,0.5664739884393064,0.5157255454335411,0.12166643142700195,0.0
76,3,AdaBoost (Discrete),0,0.7,0.7398843930635838,0.6284946429795043,18.16141700744629,0.0
77,3,AdaBoost (Real),0,0.7,0.6242774566473989,0.8077533400191127,18.47606325149536,0.0
78,3,Logistic Regression (Penalty = L2),0,0.7,0.6878612716763006,0.6391596535527426,0.39853620529174805,0.0
79,3,Naive Bayes,0,0.7,0.23699421965317918,0.39709480348007326,0.0817263126373291,0.0
80,3,KNeighbors Classifier,1,0.7,0.6607142857142857,0.5731556932345555,0.1755995750427246,0.0
81,3,SVC Classifier,1,0.7,0.5119047619047619,1.0,0.2665233612060547,0.0
82,3,Decision Tree,1,0.7,0.6369047619047619,0.6482637669859552,0.03004145622253418,0.0
83,3,RandomForest,1,0.7,0.5416666666666666,0.9410360288810286,0.09897303581237793,0.0
84,3,AdaBoost (Discrete),1,0.7,0.7678571428571429,0.695197199801855,17.52498722076416,0.0
85,3,AdaBoost (Real),1,0.7,0.6369047619047619,0.6507162292496864,17.79007625579834,0.0
86,3,Logistic Regression (Penalty = L2),1,0.7,0.7440476190476191,0.750984946135362,0.2785298824310303,0.0
87,3,Naive Bayes,1,0.7,0.26785714285714285,0.43121403657697654,0.06864047050476074,0.43121403657697654
88,3,KNeighbors Classifier,2,0.7,0.6380368098159509,0.5448568056135092,0.2211589813232422,0.0
89,3,SVC Classifier,2,0.7,0.5153374233128835,1.0,0.22641730308532715,0.0
90,3,Decision Tree,2,0.7,0.5030674846625767,0.5254413990471323,0.025517940521240234,0.0
91,3,RandomForest,2,0.7,0.5644171779141104,0.6500593260343692,0.1003262996673584,0.0
92,3,AdaBoost (Discrete),2,0.7,0.7423312883435583,0.7158414817641848,16.837733030319214,0.0
93,3,AdaBoost (Real),2,0.7,0.6012269938650306,0.8173578594283549,18.48789405822754,0.0
94,3,Logistic Regression (Penalty = L2),2,0.7,0.7484662576687117,0.6753224649562828,0.2859807014465332,0.0
95,3,Naive Bayes,2,0.7,0.26993865030674846,0.4969317941717147,0.052642107009887695,0.0
96,4,KNeighbors Classifier,0,0.7,0.5895953757225434,0.4043347424665647,0.18474459648132324,0.0
97,4,SVC Classifier,0,0.7,0.49710982658959535,1.0,0.19005155563354492,0.0
98,4,Decision Tree,0,0.7,0.6242774566473989,0.5833924136856504,0.003018617630004883,0.0
99,4,RandomForest,0,0.7,0.5375722543352601,0.5796499174725646,0.09858107566833496,0.0
100,4,AdaBoost (Discrete),0,0.7,0.7052023121387283,0.6528499594054373,11.676171779632568,0.0
101,4,AdaBoost (Real),0,0.7,0.6647398843930635,0.7482392084546236,13.358419418334961,0.0
102,4,Logistic Regression (Penalty = L2),0,0.7,0.5491329479768786,0.2593717585434615,0.22009873390197754,0.0
103,4,Naive Bayes,0,0.7,0.23121387283236994,0.38977893923086965,0.06464600563049316,0.0
104,4,KNeighbors Classifier,1,0.7,0.6130952380952381,0.5049896121217647,0.17531251907348633,0.0
105,4,SVC Classifier,1,0.7,0.5119047619047619,1.0,0.15076613426208496,0.0
106,4,Decision Tree,1,0.7,0.5714285714285714,0.5483781472945476,0.027719974517822266,0.0
107,4,RandomForest,1,0.7,0.5595238095238095,0.5942189340961133,0.10419058799743652,0.0
108,4,AdaBoost (Discrete),1,0.7,0.6964285714285714,0.7432215829237611,12.110605239868164,0.0
109,4,AdaBoost (Real),1,0.7,0.6666666666666666,0.798079928364319,12.528511762619019,0.0
110,4,Logistic Regression (Penalty = L2),1,0.7,0.6011904761904762,0.37341848563228647,0.21750259399414062,0.0
111,4,Naive Bayes,1,0.7,0.2619047619047619,0.4410714231202338,0.061446428298950195,0.0
112,4,KNeighbors Classifier,2,0.7,0.6380368098159509,0.5146035479682434,0.1418018341064453,0.0
113,4,SVC Classifier,2,0.7,0.5153374233128835,1.0,0.11673593521118164,0.0
114,4,Decision Tree,2,0.7,0.5705521472392638,0.7176148927498375,0.003133058547973633,0.0
115,4,RandomForest,2,0.7,0.6012269938650306,0.9135945690055858,0.0702366828918457,0.0
116,4,AdaBoost (Discrete),2,0.7,0.7361963190184049,0.7010056025596615,10.175891637802124,0.0
117,4,AdaBoost (Real),2,0.7,0.5337423312883436,0.7180425207263512,12.278641939163208,0.0
118,4,Logistic Regression (Penalty = L2),2,0.7,0.6134969325153374,0.5068293502853337,0.2689645290374756,0.0
119,4,Naive Bayes,2,0.7,0.2822085889570552,0.48870614528562994,0.06504440307617188,0.0
120,5,KNeighbors Classifier,0,0.7,0.6184971098265896,0.5625348140278511,0.14325761795043945,0.0
121,5,SVC Classifier,0,0.7,0.49710982658959535,1.0,0.12508773803710938,0.0
122,5,Decision Tree,0,0.7,0.6473988439306358,0.5803897572887813,0.028182029724121094,0.0
123,5,RandomForest,0,0.7,0.5780346820809249,0.6914459382987216,0.10239076614379883,0.0
124,5,AdaBoost (Discrete),0,0.7,0.6936416184971098,0.6292237188431867,10.28916311264038,0.0
125,5,AdaBoost (Real),0,0.7,0.6358381502890174,0.6915925896742248,11.670994758605957,0.0
126,5,Logistic Regression (Penalty = L2),0,0.7,0.6358381502890174,0.45469917304765256,0.1948535442352295,0.0
127,5,Naive Bayes,0,0.7,0.24277456647398843,0.4168748588544191,0.05270814895629883,0.0
128,5,KNeighbors Classifier,1,0.7,0.6428571428571429,0.5409869360113657,0.11022233963012695,0.0
129,5,SVC Classifier,1,0.7,0.5119047619047619,1.0,0.06891965866088867,0.0
130,5,Decision Tree,1,0.7,0.5535714285714286,0.6004196371695273,0.016826868057250977,0.0
131,5,RandomForest,1,0.7,0.5654761904761905,0.4966753529735609,0.104400634765625,0.0
132,5,AdaBoost (Discrete),1,0.7,0.6964285714285714,0.750374530816644,10.109651565551758,0.0
133,5,AdaBoost (Real),1,0.7,0.6309523809523809,0.7135385621411178,11.511209487915039,0.0
134,5,Logistic Regression (Penalty = L2),1,0.7,0.625,0.4470046280749025,0.24410486221313477,0.0
135,5,Naive Bayes,1,0.7,0.25595238095238093,0.42752689377842096,0.03827643394470215,0.0
136,5,KNeighbors Classifier,2,0.7,0.6748466257668712,0.5836775926580572,0.13536357879638672,0.0
137,5,SVC Classifier,2,0.7,0.5153374233128835,1.0,0.09582090377807617,0.0
138,5,Decision Tree,2,0.7,0.5460122699386503,0.5249720409431013,0.003820180892944336,0.0
139,5,RandomForest,2,0.7,0.588957055214724,0.7521594538461184,0.07195091247558594,0.0
140,5,AdaBoost (Discrete),2,0.7,0.7239263803680982,0.5976118367256645,9.043446779251099,0.0
141,5,AdaBoost (Real),2,0.7,0.5950920245398773,0.8219489506067377,11.026295185089111,0.0
142,5,Logistic Regression (Penalty = L2),2,0.7,0.6932515337423313,0.6149834196279631,0.25075864791870117,0.0
143,5,Naive Bayes,2,0.7,0.25153374233128833,0.4804215860085767,0.05637788772583008,0.0
144,6,KNeighbors Classifier,0,0.7,0.6011560693641619,0.5603625404450402,0.13190460205078125,0.0
145,6,SVC Classifier,0,0.7,0.49710982658959535,1.0,0.16731476783752441,0.0
146,6,Decision Tree,0,0.7,0.6705202312138728,0.6530881746160948,0.0203549861907959,0.0
147,6,RandomForest,0,0.7,0.5664739884393064,0.5273700968948688,0.07336258888244629,0.0
148,6,AdaBoost (Discrete),0,0.7,0.6994219653179191,0.6554472270250881,9.389652013778687,0.0
149,6,AdaBoost (Real),0,0.7,0.6647398843930635,0.8380295147542739,9.625498056411743,0.0
150,6,Logistic Regression (Penalty = L2),0,0.7,0.6416184971098265,0.4595152335609156,0.17770004272460938,0.0
151,6,Naive Bayes,0,0.7,0.21965317919075145,0.3556790331430625,0.027991056442260742,0.0
152,6,KNeighbors Classifier,1,0.7,0.6428571428571429,0.5409869360113657,0.130263090133667,0.0
153,6,SVC Classifier,1,0.7,0.5119047619047619,1.0,0.11356616020202637,0.0
154,6,Decision Tree,1,0.7,0.5714285714285714,0.5920630366590566,0.020551443099975586,0.0
155,6,RandomForest,1,0.7,0.5297619047619048,0.3742031646082125,0.0734109878540039,0.0
156,6,AdaBoost (Discrete),1,0.7,0.7083333333333334,0.7300644634332626,7.915465831756592,0.0
157,6,AdaBoost (Real),1,0.7,0.6369047619047619,0.5646280698265078,9.623179197311401,0.0
158,6,Logistic Regression (Penalty = L2),1,0.7,0.6130952380952381,0.42474389437581167,0.15689587593078613,0.0
159,6,Naive Bayes,1,0.7,0.25,0.4314179877611909,0.04476594924926758,0.0
160,6,KNeighbors Classifier,2,0.7,0.6748466257668712,0.5747747285269627,0.1337876319885254,0.0
161,6,SVC Classifier,2,0.7,0.5153374233128835,1.0,0.11784482002258301,0.0
162,6,Decision Tree,2,0.7,0.5828220858895705,0.7171893855454202,0.003026247024536133,0.0
163,6,RandomForest,2,0.7,0.5521472392638037,0.5946035575013605,0.09440898895263672,0.0
164,6,AdaBoost (Discrete),2,0.7,0.7361963190184049,0.7905463389265845,7.820612907409668,0.0
165,6,AdaBoost (Real),2,0.7,0.6012269938650306,0.7535144383900454,8.630340576171875,0.0
166,6,Logistic Regression (Penalty = L2),2,0.7,0.6625766871165644,0.49303615559345126,0.1589515209197998,0.0
167,6,Naive Bayes,2,0.7,0.24539877300613497,0.43839178573826393,0.0671694278717041,0.0
168,7,KNeighbors Classifier,0,0.7,0.5491329479768786,0.5634853938035123,0.12195658683776855,0.0
169,7,SVC Classifier,0,0.7,0.49710982658959535,1.0,0.12508177757263184,0.0
170,7,Decision Tree,0,0.7,0.5722543352601156,0.6958802637145903,0.021396636962890625,0.0
171,7,RandomForest,0,0.7,0.5780346820809249,0.8746954073710493,0.11826872825622559,0.0
172,7,AdaBoost (Discrete),0,0.7,0.7052023121387283,0.5879170325868956,10.784431457519531,0.0
173,7,AdaBoost (Real),0,0.7,0.5838150289017341,0.6032635397433515,11.416805028915405,0.0
174,7,Logistic Regression (Penalty = L2),0,0.7,0.6242774566473989,0.5103988469320805,0.19559717178344727,0.0
175,7,Naive Bayes,0,0.7,0.24855491329479767,0.35097626525886044,0.03843545913696289,0.35097626525886044
176,7,KNeighbors Classifier,1,0.7,0.6309523809523809,0.5299961363543438,0.13529634475708008,0.0
177,7,SVC Classifier,1,0.7,0.5119047619047619,1.0,0.10029053688049316,0.0
178,7,Decision Tree,1,0.7,0.5,0.49193524405441896,0.0038826465606689453,0.0
179,7,RandomForest,1,0.7,0.5535714285714286,0.6646247845960803,0.09323763847351074,0.0
180,7,AdaBoost (Discrete),1,0.7,0.6785714285714286,0.7438278035808883,10.87710952758789,0.0
181,7,AdaBoost (Real),1,0.7,0.6130952380952381,0.52871435884137,10.796908378601074,0.0
182,7,Logistic Regression (Penalty = L2),1,0.7,0.7083333333333334,0.5826391483385842,0.24943971633911133,0.0
183,7,Naive Bayes,1,0.7,0.2619047619047619,0.4711206761990738,0.06083250045776367,0.0
184,7,KNeighbors Classifier,2,0.7,0.5705521472392638,0.5576864447113838,0.08900570869445801,0.0
185,7,SVC Classifier,2,0.7,0.5153374233128835,1.0,0.07351040840148926,0.0
186,7,Decision Tree,2,0.7,0.5644171779141104,0.6166541788788874,0.017271995544433594,0.0
187,7,RandomForest,2,0.7,0.6012269938650306,0.7909313908842954,0.06390643119812012,0.0
188,7,AdaBoost (Discrete),2,0.7,0.6993865030674846,0.6312044247764963,10.34944462776184,0.0
189,7,AdaBoost (Real),2,0.7,0.6012269938650306,0.7358663523040623,11.97725796699524,0.0
190,7,Logistic Regression (Penalty = L2),2,0.7,0.6871165644171779,0.5768012128355466,0.2223224639892578,0.0
191,7,Naive Bayes,2,0.7,0.3128834355828221,0.5226137301342834,0.058263540267944336,0.5226137301342834
192,8,KNeighbors Classifier,0,0.7,0.5664739884393064,0.5885308295473356,0.12906789779663086,0.0
193,8,SVC Classifier,0,0.7,0.49710982658959535,1.0,0.09630441665649414,0.0
194,8,Decision Tree,0,0.7,0.6184971098265896,0.5417746097691102,0.019934892654418945,0.0
195,8,RandomForest,0,0.7,0.5549132947976878,0.39877402047426347,0.07348895072937012,0.0
196,8,AdaBoost (Discrete),0,0.7,0.6705202312138728,0.5985879820888279,10.33274793624878,0.0
197,8,AdaBoost (Real),0,0.7,0.5895953757225434,0.7082854423479151,10.413206577301025,0.0
198,8,Logistic Regression (Penalty = L2),0,0.7,0.6184971098265896,0.4583310432019756,0.18630099296569824,0.0
199,8,Naive Bayes,0,0.7,0.23699421965317918,0.34264155433507515,0.07560157775878906,0.34264155433507515
200,8,KNeighbors Classifier,1,0.7,0.6190476190476191,0.3983999227482093,0.12008285522460938,0.0
201,8,SVC Classifier,1,0.7,0.5119047619047619,1.0,0.09465956687927246,0.0
202,8,Decision Tree,1,0.7,0.5595238095238095,0.6550160701277652,0.019259929656982422,0.0
203,8,RandomForest,1,0.7,0.5654761904761905,0.6928863216301597,0.09198570251464844,0.0
204,8,AdaBoost (Discrete),1,0.7,0.7142857142857143,0.6220594947361991,9.747786283493042,0.0
205,8,AdaBoost (Real),1,0.7,0.5952380952380952,0.5321151873287943,10.387563467025757,0.0
206,8,Logistic Regression (Penalty = L2),1,0.7,0.7023809523809523,0.6292237188431867,0.18013715744018555,0.0
207,8,Naive Bayes,1,0.7,0.27976190476190477,0.4401665996800022,0.04160189628601074,0.4401665996800022
208,8,KNeighbors Classifier,2,0.7,0.588957055214724,0.5986130423038731,0.1076047420501709,0.0
209,8,SVC Classifier,2,0.7,0.5153374233128835,1.0,0.08830523490905762,0.0
210,8,Decision Tree,2,0.7,0.6196319018404908,0.5464403082528263,0.02004528045654297,0.5464403082528263
211,8,RandomForest,2,0.7,0.558282208588957,0.5667521832510313,0.09590268135070801,0.0
212,8,AdaBoost (Discrete),2,0.7,0.754601226993865,0.6773191979452873,8.526933670043945,0.0
213,8,AdaBoost (Real),2,0.7,0.6196319018404908,0.7073163024401158,9.911367654800415,0.0
214,8,Logistic Regression (Penalty = L2),2,0.7,0.6809815950920245,0.5645640373682371,0.1291360855102539,0.0
215,8,Naive Bayes,2,0.7,0.26993865030674846,0.4406555500474421,0.051361799240112305,0.0
216,9,KNeighbors Classifier,0,0.7,0.6184971098265896,0.4382861769530271,0.11969780921936035,0.0
217,9,SVC Classifier,0,0.7,0.5028901734104047,0.5227579585747102,0.14256906509399414,0.0
218,9,Decision Tree,0,0.7,0.6705202312138728,0.654211323665384,0.02893853187561035,0.0
219,9,RandomForest,0,0.7,0.5433526011560693,0.4924790605054523,0.07893514633178711,0.0
220,9,AdaBoost (Discrete),0,0.7,0.7398843930635838,0.6244110893278985,10.454875469207764,0.0
221,9,AdaBoost (Real),0,0.7,0.6242774566473989,0.8077533400191127,11.877663850784302,0.0
222,9,Logistic Regression (Penalty = L2),0,0.7,0.6994219653179191,0.5851107035483709,0.2957417964935303,0.0
223,9,Naive Bayes,0,0.7,0.2832369942196532,0.5050554216890176,0.047411441802978516,0.0
224,9,KNeighbors Classifier,1,0.7,0.6369047619047619,0.5528317319680368,0.10087966918945312,0.0
225,9,SVC Classifier,1,0.7,0.5119047619047619,1.0,0.14343738555908203,0.0
226,9,Decision Tree,1,0.7,0.6488095238095238,0.5555439337999956,0.02048325538635254,0.5555439337999956
227,9,RandomForest,1,0.7,0.5535714285714286,0.5773502691896257,0.08955860137939453,0.0
228,9,AdaBoost (Discrete),1,0.7,0.7559523809523809,0.7019356950326877,11.205160856246948,0.0
229,9,AdaBoost (Real),1,0.7,0.6369047619047619,0.7602220013433093,11.281399011611938,0.0
230,9,Logistic Regression (Penalty = L2),1,0.7,0.75,0.7560282848601713,0.1933279037475586,0.0
231,9,Naive Bayes,1,0.7,0.25595238095238093,0.3872887239761657,0.0719459056854248,0.3872887239761657
232,9,KNeighbors Classifier,2,0.7,0.6503067484662577,0.6252985910627927,0.11469221115112305,0.0
233,9,SVC Classifier,2,0.7,0.5153374233128835,1.0,0.10215401649475098,0.0
234,9,Decision Tree,2,0.7,0.6687116564417178,0.6214145185974047,0.004259824752807617,0.6214145185974047
235,9,RandomForest,2,0.7,0.5828220858895705,0.6397240008585254,0.0731968879699707,0.0
236,9,AdaBoost (Discrete),2,0.7,0.7423312883435583,0.7100739809467425,10.586493015289307,0.0
237,9,AdaBoost (Real),2,0.7,0.5950920245398773,0.7844474436340608,10.509737730026245,0.0
238,9,Logistic Regression (Penalty = L2),2,0.7,0.754601226993865,0.6760597288505897,0.21888446807861328,0.0
239,9,Naive Bayes,2,0.7,0.2883435582822086,0.5082917825105903,0.057073354721069336,0.0
240,10,KNeighbors Classifier,0,0.7,0.6184971098265896,0.4382861769530271,0.16547560691833496,0.0
241,10,SVC Classifier,0,0.7,0.5028901734104047,0.5227579585747102,0.19697165489196777,0.0
242,10,Decision Tree,0,0.7,0.630057803468208,0.4783254092541538,0.0057141780853271484,0.4783254092541538
243,10,RandomForest,0,0.7,0.5317919075144508,0.32011247998491643,0.02437305450439453,0.0
244,10,AdaBoost (Discrete),0,0.7,0.7167630057803468,0.5700646128185722,10.560995817184448,0.0
245,10,AdaBoost (Real),0,0.7,0.6242774566473989,0.7244007043050418,11.345976829528809,0.0
246,10,Logistic Regression (Penalty = L2),0,0.7,0.6994219653179191,0.5851107035483709,0.2576584815979004,0.0
247,10,Naive Bayes,0,0.7,0.2543352601156069,0.4375120665169366,0.10098052024841309,0.0
248,10,KNeighbors Classifier,1,0.7,0.6369047619047619,0.5528317319680368,0.15157246589660645,0.0
249,10,SVC Classifier,1,0.7,0.5119047619047619,1.0,0.16374826431274414,0.0
250,10,Decision Tree,1,0.7,0.6488095238095238,0.6957014939510777,0.0062711238861083984,0.0
251,10,RandomForest,1,0.7,0.5535714285714286,0.36475054303378174,0.06169414520263672,0.0
252,10,AdaBoost (Discrete),1,0.7,0.7380952380952381,0.6839483178084655,11.024563074111938,0.0
253,10,AdaBoost (Real),1,0.7,0.6607142857142857,0.6671125599275987,11.521952629089355,0.0
254,10,Logistic Regression (Penalty = L2),1,0.7,0.75,0.7560282848601713,0.24989628791809082,0.0
255,10,Naive Bayes,1,0.7,0.25595238095238093,0.4410714231202338,0.08111381530761719,0.0
256,10,KNeighbors Classifier,2,0.7,0.6503067484662577,0.6252985910627927,0.2133796215057373,0.0
257,10,SVC Classifier,2,0.7,0.5153374233128835,1.0,0.14561104774475098,0.0
258,10,Decision Tree,2,0.7,0.558282208588957,0.7233225939528439,0.004391193389892578,0.0
259,10,RandomForest,2,0.7,0.588957055214724,0.677610913400481,0.07775282859802246,0.0
260,10,AdaBoost (Discrete),2,0.7,0.7607361963190185,0.7461137785478512,10.045233726501465,0.0
261,10,AdaBoost (Real),2,0.7,0.5950920245398773,0.7885335496610465,10.918577432632446,0.0
262,10,Logistic Regression (Penalty = L2),2,0.7,0.7484662576687117,0.6753224649562828,0.2552053928375244,0.0
263,10,Naive Bayes,2,0.7,0.27607361963190186,0.463331307464678,0.050797462463378906,0.0
264,11,KNeighbors Classifier,0,0.7,0.6127167630057804,0.4536539848090178,0.15375447273254395,0.0
265,11,SVC Classifier,0,0.7,0.5028901734104047,0.5227579585747102,0.1471395492553711,0.0
266,11,Decision Tree,0,0.7,0.630057803468208,0.6289574555071299,0.006313800811767578,0.0
267,11,RandomForest,0,0.7,0.5317919075144508,0.5091969063347358,0.06795549392700195,0.0
268,11,AdaBoost (Discrete),0,0.7,0.7341040462427746,0.5909222007407172,9.909234046936035,0.0
269,11,AdaBoost (Real),0,0.7,0.6242774566473989,0.7244007043050418,10.187456130981445,0.0
270,11,Logistic Regression (Penalty = L2),0,0.7,0.7052023121387283,0.6343635844505381,0.22722411155700684,0.0
271,11,Naive Bayes,0,0.7,0.26011560693641617,0.44572384648725094,0.05097794532775879,0.0
272,11,KNeighbors Classifier,1,0.7,0.6428571428571429,0.5409869360113656,0.1326901912689209,0.0
273,11,SVC Classifier,1,0.7,0.5238095238095238,0.6933612743506347,0.08114504814147949,0.0
274,11,Decision Tree,1,0.7,0.6130952380952381,0.5690158009126467,0.0065610408782958984,0.5690158009126467
275,11,RandomForest,1,0.7,0.5416666666666666,0.4450050658086207,0.024455547332763672,0.0
276,11,AdaBoost (Discrete),1,0.7,0.7559523809523809,0.7272759833414827,8.18742036819458,0.0
277,11,AdaBoost (Real),1,0.7,0.6607142857142857,0.6671125599275987,10.02084231376648,0.0
278,11,Logistic Regression (Penalty = L2),1,0.7,0.7202380952380952,0.6924255472005971,0.25913524627685547,0.0
279,11,Naive Bayes,1,0.7,0.2619047619047619,0.40694619779349034,0.06140589714050293,0.40694619779349034
280,11,KNeighbors Classifier,2,0.7,0.6748466257668712,0.6503954493803717,0.16393351554870605,0.0
281,11,SVC Classifier,2,0.7,0.5337423312883436,0.7937005259840998,0.16465425491333008,0.0
282,11,Decision Tree,2,0.7,0.5644171779141104,0.5655837658775568,0.01734471321105957,0.0
283,11,RandomForest,2,0.7,0.5828220858895705,0.6397240008585254,0.06743383407592773,0.0
284,11,AdaBoost (Discrete),2,0.7,0.7607361963190185,0.8047399938630203,8.193118810653687,0.0
285,11,AdaBoost (Real),2,0.7,0.6257668711656442,0.8228020420406904,9.765754222869873,0.0
286,11,Logistic Regression (Penalty = L2),2,0.7,0.7239263803680982,0.718169192330571,0.13498854637145996,0.0
287,11,Naive Bayes,2,0.7,0.2883435582822086,0.49453559168067723,0.03356575965881348,0.0
288,12,KNeighbors Classifier,0,0.7,0.5953757225433526,0.47469532528691855,0.048761606216430664,0.0
289,12,SVC Classifier,0,0.7,0.49710982658959535,1.0,0.04663586616516113,0.0
290,12,Decision Tree,0,0.7,0.6242774566473989,0.5466223793024981,0.003462076187133789,0.0
291,12,RandomForest,0,0.7,0.5086705202312138,0.5108729549290354,0.031168699264526367,0.0
292,12,AdaBoost (Discrete),0,0.7,0.7052023121387283,0.6617554128597908,3.778252124786377,0.0
293,12,AdaBoost (Real),0,0.7,0.6647398843930635,0.8380295147542739,4.395605087280273,0.0
294,12,Logistic Regression (Penalty = L2),0,0.7,0.5433526011560693,0.29108922648939284,0.04992985725402832,0.0
295,12,Naive Bayes,0,0.7,0.2543352601156069,0.36879064073046086,0.039664268493652344,0.36879064073046086
296,12,KNeighbors Classifier,1,0.7,0.6071428571428571,0.43929454483276636,0.08066606521606445,0.0
297,12,SVC Classifier,1,0.7,0.5119047619047619,1.0,0.0231935977935791,0.0
298,12,Decision Tree,1,0.7,0.5714285714285714,0.48109133751379257,0.0038831233978271484,0.0
299,12,RandomForest,1,0.7,0.5297619047619048,0.4128554883887076,0.031065702438354492,0.0
300,12,AdaBoost (Discrete),1,0.7,0.7142857142857143,0.6755782320243142,4.117411136627197,0.0
301,12,AdaBoost (Real),1,0.7,0.6011904761904762,0.5481374116650087,4.6459808349609375,0.0
302,12,Logistic Regression (Penalty = L2),1,0.7,0.5773809523809523,0.3227175875048251,0.09696507453918457,0.0
303,12,Naive Bayes,1,0.7,0.25,0.4152972640208647,0.0299985408782959,0.0
304,12,KNeighbors Classifier,2,0.7,0.6196319018404908,0.507835360824296,0.06021380424499512,0.0
305,12,SVC Classifier,2,0.7,0.5153374233128835,1.0,0.048398733139038086,0.0
306,12,Decision Tree,2,0.7,0.588957055214724,0.6679473272363033,0.0033681392669677734,0.0
307,12,RandomForest,2,0.7,0.5766871165644172,0.6935721830872812,0.04573798179626465,0.0
308,12,AdaBoost (Discrete),2,0.7,0.7055214723926381,0.6861571392744376,3.5936765670776367,0.0
309,12,AdaBoost (Real),2,0.7,0.6012269938650306,0.7535144383900454,4.504603624343872,0.0
310,12,Logistic Regression (Penalty = L2),2,0.7,0.6012269938650306,0.4063966238795425,0.047302961349487305,0.0
311,12,Naive Bayes,2,0.7,0.27607361963190186,0.43761927331152534,0.02425408363342285,0.43761927331152534
