,feat_set_id,classifier,fold_id,feat_th,score,geo_score,exec_t,geo_score_woz
0,0,KNeighbors Classifier,0,0.6,0.22051639916259597,0.34534550661733604,1.3169424533843994,0.0
1,0,SVC Classifier,0,0.6,0.19678995115143055,0.4223466021531681,20.362205028533936,0.0
2,0,Decision Tree,0,0.6,0.19818562456385205,0.3270954658435584,0.30292820930480957,0.0
3,0,RandomForest,0,0.6,0.2302861130495464,0.3291078568200736,1.6870496273040771,0.0
4,0,AdaBoost (Discrete),0,0.6,0.17725052337752967,0.20373630264994222,121.55445313453674,0.0
5,0,AdaBoost (Real),0,0.6,0.18492672714584787,0.16533687632288097,478.53206300735474,0.0
6,0,Logistic Regression (Penalty = L2),0,0.6,0.2595952547103978,0.3248156488856836,8.871537208557129,0.0
7,0,Naive Bayes,0,0.6,0.09909281228192603,0.3703248727369661,0.7391979694366455,0.0
8,0,KNeighbors Classifier,1,0.6,0.22855133614627285,0.312250505641626,1.421445369720459,0.0
9,0,SVC Classifier,1,0.6,0.1940928270042194,0.3464053319411094,5.64861798286438,0.0
10,0,Decision Tree,1,0.6,0.2158931082981716,0.27815811474921714,0.39750003814697266,0.0
11,0,RandomForest,1,0.6,0.25949367088607594,0.27374101708214593,1.2943744659423828,0.0
12,0,AdaBoost (Discrete),1,0.6,0.17229254571026723,0.20587955282372072,98.0015857219696,0.0
13,0,AdaBoost (Real),1,0.6,0.23980309423347398,0.4184685380700097,222.18648600578308,0.0
14,0,Logistic Regression (Penalty = L2),1,0.6,0.25246132208157523,0.313557613008864,6.052656888961792,0.0
15,0,Naive Bayes,1,0.6,0.11322081575246132,0.30909104342156,0.46155858039855957,0.0
16,0,KNeighbors Classifier,2,0.6,0.23796033994334279,0.3571169425109181,1.1600899696350098,0.0
17,0,SVC Classifier,2,0.6,0.19759206798866855,0.2133808407957597,21.020291328430176,0.0
18,0,Decision Tree,2,0.6,0.20609065155807366,0.3157140089318761,0.42388105392456055,0.0
19,0,RandomForest,2,0.6,0.26416430594900847,0.2567553476131811,1.4371230602264404,0.0
20,0,AdaBoost (Discrete),2,0.6,0.16359773371104816,0.21459913225762495,117.54211497306824,0.0
21,0,AdaBoost (Real),2,0.6,0.24220963172804533,0.5383036027466336,245.88599920272827,0.0
22,0,Logistic Regression (Penalty = L2),2,0.6,0.26770538243626063,0.34090123299534886,5.655573129653931,0.0
23,0,Naive Bayes,2,0.6,0.1048158640226629,0.4123239979236083,0.48830580711364746,0.0
24,1,KNeighbors Classifier,0,0.6,0.2198185624563852,0.26483319035206365,0.7800760269165039,0.0
25,1,SVC Classifier,0,0.6,0.16189811584089323,0.06196428721699752,16.71084213256836,0.0
26,1,Decision Tree,0,0.6,0.2030704815073273,0.3230703228396901,0.23478317260742188,0.0
27,1,RandomForest,0,0.6,0.22958827634333567,0.3222511823619907,1.260728359222412,0.0
28,1,AdaBoost (Discrete),0,0.6,0.19330076762037685,0.20267008835778735,121.51571822166443,0.0
29,1,AdaBoost (Real),0,0.6,0.16957431960921143,0.17058980324502412,281.2487053871155,0.0
30,1,Logistic Regression (Penalty = L2),0,0.6,0.2568039078855548,0.289929159556014,8.029759168624878,0.0
31,1,Naive Bayes,0,0.6,0.19958129797627355,0.338986884280557,0.7044215202331543,0.0
32,1,KNeighbors Classifier,1,0.6,0.23769338959212377,0.3466734878623157,1.1000173091888428,0.0
33,1,SVC Classifier,1,0.6,0.16455696202531644,0.06877140614051333,21.159757614135742,0.0
34,1,Decision Tree,1,0.6,0.22644163150492264,0.291691086341375,0.577594518661499,0.0
35,1,RandomForest,1,0.6,0.27285513361462727,0.3102595854798332,1.5571660995483398,0.0
36,1,AdaBoost (Discrete),1,0.6,0.20464135021097046,0.2259760472381875,150.1237988471985,0.0
37,1,AdaBoost (Real),1,0.6,0.18565400843881857,0.2501248779920027,315.0507228374481,0.0
38,1,Logistic Regression (Penalty = L2),1,0.6,0.27285513361462727,0.2454808472542738,7.800408601760864,0.0
39,1,Naive Bayes,1,0.6,0.2742616033755274,0.5511127402673611,0.7075204849243164,0.0
40,1,KNeighbors Classifier,2,0.6,0.24079320113314448,0.3513394391759957,1.2321970462799072,0.0
41,1,SVC Classifier,2,0.6,0.1621813031161473,1.0,20.72220468521118,0.0
42,1,Decision Tree,2,0.6,0.22308781869688385,0.284761560721286,0.4177119731903076,0.0
43,1,RandomForest,2,0.6,0.25708215297450426,0.2737096806382533,1.6351654529571533,0.0
44,1,AdaBoost (Discrete),2,0.6,0.21388101983002833,0.20784200266741598,147.8131127357483,0.0
45,1,AdaBoost (Real),2,0.6,0.19688385269121814,0.21131882956920686,306.519415140152,0.0
46,1,Logistic Regression (Penalty = L2),2,0.6,0.2811614730878187,0.28331397319684215,8.102355480194092,0.0
47,1,Naive Bayes,2,0.6,0.2705382436260623,0.5288829043509111,0.7139055728912354,0.0
48,2,KNeighbors Classifier,0,0.6,0.22958827634333567,0.3366935332272433,1.4707670211791992,0.0
49,2,SVC Classifier,0,0.6,0.16050244242847173,1.0,20.85994529724121,0.0
50,2,Decision Tree,0,0.6,0.21144452198185626,0.29169742142432636,0.31561708450317383,0.0
51,2,RandomForest,0,0.6,0.2302861130495464,0.3807449131983429,1.6220264434814453,0.0
52,2,AdaBoost (Discrete),0,0.6,0.1856245638520586,0.20359161749257954,136.1692397594452,0.0
53,2,AdaBoost (Real),0,0.6,0.19539427773900908,0.2964970126806519,330.51083850860596,0.0
54,2,Logistic Regression (Penalty = L2),0,0.6,0.25471039776692256,0.2450710450371738,10.638166189193726,0.0
55,2,Naive Bayes,0,0.6,0.20865317515701326,0.3323965187199791,0.9011843204498291,0.0
56,2,KNeighbors Classifier,1,0.6,0.22433192686357242,0.3562204988640228,1.439499855041504,0.0
57,2,SVC Classifier,1,0.6,0.16244725738396623,0.06884283908215143,23.18890118598938,0.0
58,2,Decision Tree,1,0.6,0.18917018284106893,0.27924786303764865,0.4940147399902344,0.0
59,2,RandomForest,1,0.6,0.2489451476793249,0.269856624894252,2.017036199569702,0.0
60,2,AdaBoost (Discrete),1,0.6,0.2158931082981716,0.2621712985691424,170.82230138778687,0.0
61,2,AdaBoost (Real),1,0.6,0.24824191279887484,0.2739889163044151,316.02077865600586,0.0
62,2,Logistic Regression (Penalty = L2),1,0.6,0.26582278481012656,0.38705297283795537,8.369410514831543,0.0
63,2,Naive Bayes,1,0.6,0.26019690576652604,0.5135457267298041,0.8753113746643066,0.0
64,2,KNeighbors Classifier,2,0.6,0.24008498583569404,0.34210810520291896,1.7193880081176758,0.0
65,2,SVC Classifier,2,0.6,0.1621813031161473,1.0,21.70056986808777,0.0
66,2,Decision Tree,2,0.6,0.2046742209631728,0.29802027985212926,0.33809375762939453,0.0
67,2,RandomForest,2,0.6,0.26841359773371104,0.34196791873640314,1.634490728378296,0.0
68,2,AdaBoost (Discrete),2,0.6,0.18696883852691218,0.20851178903341172,152.1388964653015,0.0
69,2,AdaBoost (Real),2,0.6,0.23796033994334279,0.3687361373187293,305.10626792907715,0.0
70,2,Logistic Regression (Penalty = L2),2,0.6,0.27407932011331443,0.36172777387196176,8.255518198013306,0.0
71,2,Naive Bayes,2,0.6,0.24575070821529746,0.39491797020188274,0.6721677780151367,0.0
72,3,KNeighbors Classifier,0,0.6,0.2135380321004885,0.3600945216513203,0.8565075397491455,0.0
73,3,SVC Classifier,0,0.6,0.16050244242847173,1.0,19.26009249687195,0.0
74,3,Decision Tree,0,0.6,0.20516399162595952,0.2599922615655997,0.4102602005004883,0.0
75,3,RandomForest,0,0.6,0.23377529658060014,0.3273074373477715,1.3972771167755127,0.0
76,3,AdaBoost (Discrete),0,0.6,0.18632240055826937,0.14515216637734124,116.32857346534729,0.0
77,3,AdaBoost (Real),0,0.6,0.18492672714584787,0.16533687632288097,309.79518127441406,0.0
78,3,Logistic Regression (Penalty = L2),0,0.6,0.2505233775296581,0.27971155082524024,7.06959867477417,0.0
79,3,Naive Bayes,0,0.6,0.21423586880669923,0.3757270122829713,0.7692701816558838,0.0
80,3,KNeighbors Classifier,1,0.6,0.2320675105485232,0.29634406258766643,0.6742331981658936,0.0
81,3,SVC Classifier,1,0.6,0.1617440225035162,1.0,21.379474878311157,0.0
82,3,Decision Tree,1,0.6,0.21167369901547117,0.31517928405886625,0.46543264389038086,0.0
83,3,RandomForest,1,0.6,0.2679324894514768,0.23785266410181205,1.9541709423065186,0.0
84,3,AdaBoost (Discrete),1,0.6,0.1779184247538678,0.22236495590842037,133.61975622177124,0.0
85,3,AdaBoost (Real),1,0.6,0.2419127988748242,0.2192898638485571,289.5406320095062,0.0
86,3,Logistic Regression (Penalty = L2),1,0.6,0.26019690576652604,0.21956386432489988,5.584062814712524,0.0
87,3,Naive Bayes,1,0.6,0.28621659634317864,0.5475729919182338,0.7662274837493896,0.0
88,3,KNeighbors Classifier,2,0.6,0.2386685552407932,0.33622621228116767,0.5811722278594971,0.0
89,3,SVC Classifier,2,0.6,0.1621813031161473,1.0,18.22192645072937,0.0
90,3,Decision Tree,2,0.6,0.20325779036827196,0.33121451554364806,0.4509446620941162,0.0
91,3,RandomForest,2,0.6,0.26558073654390935,0.33700583482242485,1.9016211032867432,0.0
92,3,AdaBoost (Discrete),2,0.6,0.19263456090651557,0.22888592219132795,117.74330759048462,0.0
93,3,AdaBoost (Real),2,0.6,0.24220963172804533,0.5383036027466336,284.85121059417725,0.0
94,3,Logistic Regression (Penalty = L2),2,0.6,0.2839943342776204,0.34343153495065204,5.811670541763306,0.0
95,3,Naive Bayes,2,0.6,0.28257790368271957,0.5653675920853805,0.6374244689941406,0.0
96,4,KNeighbors Classifier,0,0.6,0.22191207257501744,0.38438552845197527,0.907249927520752,0.0
97,4,SVC Classifier,0,0.6,0.16050244242847173,1.0,21.22565221786499,0.0
98,4,Decision Tree,0,0.6,0.19469644103279832,0.2514566633236782,0.30670952796936035,0.0
99,4,RandomForest,0,0.6,0.23517096999302164,0.25056873439262667,1.6346766948699951,0.0
100,4,AdaBoost (Discrete),0,0.6,0.1884159106769016,0.2138064280510638,123.5744514465332,0.0
101,4,AdaBoost (Real),0,0.6,0.21423586880669923,0.17012003007388435,303.6097774505615,0.0
102,4,Logistic Regression (Penalty = L2),0,0.6,0.24563852058618282,0.2362947123147683,5.429515600204468,0.0
103,4,Naive Bayes,0,0.6,0.2002791346824843,0.3226318295772829,0.7899670600891113,0.0
104,4,KNeighbors Classifier,1,0.6,0.2060478199718706,0.3543797445786768,0.9166092872619629,0.0
105,4,SVC Classifier,1,0.6,0.1617440225035162,1.0,19.601218461990356,0.0
106,4,Decision Tree,1,0.6,0.20182841068917018,0.2882691035764971,0.2900118827819824,0.0
107,4,RandomForest,1,0.6,0.2440225035161744,0.2777488852419075,1.5745525360107422,0.0
108,4,AdaBoost (Discrete),1,0.6,0.19831223628691982,0.2057793995747862,120.20028853416443,0.0
109,4,AdaBoost (Real),1,0.6,0.2468354430379747,0.38404445647195457,287.79186606407166,0.0
110,4,Logistic Regression (Penalty = L2),1,0.6,0.2468354430379747,0.29204456381558086,5.507760763168335,0.0
111,4,Naive Bayes,1,0.6,0.2468354430379747,0.5917156354827866,0.6822645664215088,0.0
112,4,KNeighbors Classifier,2,0.6,0.2245042492917847,0.38601901942359024,0.8298969268798828,0.0
113,4,SVC Classifier,2,0.6,0.1621813031161473,1.0,18.82432460784912,0.0
114,4,Decision Tree,2,0.6,0.20821529745042494,0.3340523804326375,0.36317873001098633,0.0
115,4,RandomForest,2,0.6,0.24079320113314448,0.39987799062928636,1.458258867263794,0.0
116,4,AdaBoost (Discrete),2,0.6,0.18626062322946177,0.20990927657929961,117.14140295982361,0.0
117,4,AdaBoost (Real),2,0.6,0.25,0.33372589622679405,277.29873871803284,0.0
118,4,Logistic Regression (Penalty = L2),2,0.6,0.25708215297450426,0.3848814954614062,5.294595956802368,0.0
119,4,Naive Bayes,2,0.6,0.2514164305949009,0.47123229152385104,0.6160843372344971,0.0
120,5,KNeighbors Classifier,0,0.6,0.21493370551290997,0.33222086001640677,0.6330068111419678,0.0
121,5,SVC Classifier,0,0.6,0.16050244242847173,1.0,17.931732416152954,0.0
122,5,Decision Tree,0,0.6,0.20516399162595952,0.25236433713356204,0.5303921699523926,0.0
123,5,RandomForest,0,0.6,0.24424284717376135,0.357755035030281,1.5218324661254883,0.0
124,5,AdaBoost (Discrete),0,0.6,0.17515701325889743,0.19605221425224056,127.35138654708862,0.0
125,5,AdaBoost (Real),0,0.6,0.18771807397069085,0.24790615745917,283.8768870830536,0.0
126,5,Logistic Regression (Penalty = L2),0,0.6,0.24563852058618282,0.2991411925588689,6.043350458145142,0.0
127,5,Naive Bayes,0,0.6,0.21144452198185626,0.4093736005984107,0.6764590740203857,0.0
128,5,KNeighbors Classifier,1,0.6,0.2250351617440225,0.30867857449758834,0.6608588695526123,0.0
129,5,SVC Classifier,1,0.6,0.1617440225035162,1.0,19.56059241294861,0.0
130,5,Decision Tree,1,0.6,0.2180028129395218,0.3117684857089497,0.39453125,0.0
131,5,RandomForest,1,0.6,0.25949367088607594,0.2298106431668665,1.5441546440124512,0.0
132,5,AdaBoost (Discrete),1,0.6,0.17440225035161744,0.2280821417053282,136.29230999946594,0.0
133,5,AdaBoost (Real),1,0.6,0.23839662447257384,0.3572231086041732,1309.8135652542114,0.0
134,5,Logistic Regression (Penalty = L2),1,0.6,0.26652601969057665,0.2293438491624786,4.720288515090942,0.0
135,5,Naive Bayes,1,0.6,0.2742616033755274,0.5474741624927806,0.4293830394744873,0.0
136,5,KNeighbors Classifier,2,0.6,0.23441926345609065,0.3446496302913338,0.6526150703430176,0.0
137,5,SVC Classifier,2,0.6,0.1621813031161473,1.0,13.832566499710083,0.0
138,5,Decision Tree,2,0.6,0.2075070821529745,0.31577154598289975,0.23029017448425293,0.0
139,5,RandomForest,2,0.6,0.27124645892351273,0.32525618412046203,1.1424379348754883,0.0
140,5,AdaBoost (Discrete),2,0.6,0.1961756373937677,0.2512828490365503,93.0583713054657,0.0
141,5,AdaBoost (Real),2,0.6,0.19759206798866855,0.3850170419275805,196.67450428009033,0.0
142,5,Logistic Regression (Penalty = L2),2,0.6,0.26912181303116145,0.349916311216697,4.245944976806641,0.0
143,5,Naive Bayes,2,0.6,0.2790368271954674,0.5325196260528597,0.49345993995666504,0.0
144,6,KNeighbors Classifier,0,0.6,0.21563154221912073,0.3286604947787193,0.8175969123840332,0.0
145,6,SVC Classifier,0,0.6,0.162595952547104,0.04315207656541808,13.802290439605713,0.0
146,6,Decision Tree,0,0.6,0.20586182833217026,0.33229195008722767,0.2991766929626465,0.0
147,6,RandomForest,0,0.6,0.25331472435450103,0.35578443601723597,0.9803776741027832,0.0
148,6,AdaBoost (Discrete),0,0.6,0.19539427773900908,0.18617234086173975,87.65898942947388,0.0
149,6,AdaBoost (Real),0,0.6,0.17236566643405443,0.1986506400677108,194.03536224365234,0.0
150,6,Logistic Regression (Penalty = L2),0,0.6,0.25610607117934403,0.20422545232470932,5.107764720916748,0.0
151,6,Naive Bayes,0,0.6,0.20376831821353802,0.43245458361737227,0.488445520401001,0.0
152,6,KNeighbors Classifier,1,0.6,0.23277074542897327,0.3546679816966042,0.7903821468353271,0.0
153,6,SVC Classifier,1,0.6,0.1631504922644163,0.029269720826991724,13.000182867050171,0.0
154,6,Decision Tree,1,0.6,0.1990154711673699,0.271724324313278,0.2870821952819824,0.0
155,6,RandomForest,1,0.6,0.25738396624472576,0.30164770834106985,1.054936408996582,0.0
156,6,AdaBoost (Discrete),1,0.6,0.20464135021097046,0.21583632559168373,89.75763273239136,0.0
157,6,AdaBoost (Real),1,0.6,0.24050632911392406,0.3762288701850156,188.2120292186737,0.0
158,6,Logistic Regression (Penalty = L2),1,0.6,0.25949367088607594,0.3631166735407773,5.273640871047974,0.0
159,6,Naive Bayes,1,0.6,0.270042194092827,0.5104860360350268,0.4819033145904541,0.0
160,6,KNeighbors Classifier,2,0.6,0.23371104815864022,0.3253920304231145,0.8026673793792725,0.0
161,6,SVC Classifier,2,0.6,0.1621813031161473,1.0,13.718576669692993,0.0
162,6,Decision Tree,2,0.6,0.21600566572237961,0.37443674542745087,0.28698301315307617,0.0
163,6,RandomForest,2,0.6,0.26628895184135976,0.3163565328957764,1.1679742336273193,0.0
164,6,AdaBoost (Discrete),2,0.6,0.17209631728045327,0.15922504547420724,85.88887095451355,0.0
165,6,AdaBoost (Real),2,0.6,0.20396600566572237,0.266917577850736,185.95326209068298,0.0
166,6,Logistic Regression (Penalty = L2),2,0.6,0.28257790368271957,0.2823159901135078,4.614638090133667,0.0
167,6,Naive Bayes,2,0.6,0.2584985835694051,0.49153213968046716,0.6323614120483398,0.0
168,7,KNeighbors Classifier,0,0.6,0.2226099092812282,0.3631516100807486,1.3963720798492432,0.0
169,7,SVC Classifier,0,0.6,0.19330076762037685,0.43374535059637953,14.389361143112183,0.0
170,7,Decision Tree,0,0.6,0.21144452198185626,0.3185066037051472,0.37291693687438965,0.0
171,7,RandomForest,0,0.6,0.24982554082344732,0.3505014716300752,1.030104398727417,0.0
172,7,AdaBoost (Discrete),0,0.6,0.18143754361479414,0.2259050340650982,92.72652983665466,0.0
173,7,AdaBoost (Real),0,0.6,0.18422889043963714,0.1720553017869783,181.98689079284668,0.0
174,7,Logistic Regression (Penalty = L2),0,0.6,0.26238660153524074,0.2785500010128073,5.592946767807007,0.0
175,7,Naive Bayes,0,0.6,0.11793440334961619,0.36400916640364633,0.44568419456481934,0.0
176,7,KNeighbors Classifier,1,0.6,0.22855133614627285,0.32605017545439047,1.1477632522583008,0.0
177,7,SVC Classifier,1,0.6,0.20675105485232068,0.46640548688179284,13.502879858016968,0.0
178,7,Decision Tree,1,0.6,0.20464135021097046,0.3487641269103188,0.3261871337890625,0.0
179,7,RandomForest,1,0.6,0.2510548523206751,0.2315734078860657,0.9151294231414795,0.0
180,7,AdaBoost (Discrete),1,0.6,0.2180028129395218,0.28510827773804975,93.53957629203796,0.0
181,7,AdaBoost (Real),1,0.6,0.2489451476793249,0.360912763985535,192.40535950660706,0.0
182,7,Logistic Regression (Penalty = L2),1,0.6,0.25668073136427566,0.37878550656642507,5.4127771854400635,0.0
183,7,Naive Bayes,1,0.6,0.13853727144866385,0.29608488936827176,0.4347224235534668,0.0
184,7,KNeighbors Classifier,2,0.6,0.22804532577903683,0.32932183898240547,1.161808729171753,0.0
185,7,SVC Classifier,2,0.6,0.21104815864022664,0.45368823166620964,12.967061519622803,0.0
186,7,Decision Tree,2,0.6,0.21813031161473087,0.2974479752383228,0.25606250762939453,0.0
187,7,RandomForest,2,0.6,0.26487252124645894,0.31656346706255484,1.0656096935272217,0.0
188,7,AdaBoost (Discrete),2,0.6,0.18909348441926346,0.19398972378049192,86.24483942985535,0.0
189,7,AdaBoost (Real),2,0.6,0.23441926345609065,0.34396545582060123,160.19464945793152,0.0
190,7,Logistic Regression (Penalty = L2),2,0.6,0.26628895184135976,0.2526326450785386,4.894588470458984,0.0
191,7,Naive Bayes,2,0.6,0.12677053824362605,0.4911428114748987,0.3712327480316162,0.0
192,8,KNeighbors Classifier,0,0.6,0.209351011863224,0.33689966568715124,0.3229992389678955,0.0
193,8,SVC Classifier,0,0.6,0.16050244242847173,1.0,8.548306226730347,0.0
194,8,Decision Tree,0,0.6,0.2016748080949058,0.29558964796629145,0.16881227493286133,0.0
195,8,RandomForest,0,0.6,0.23237962316817865,0.30437757742849036,0.6806662082672119,0.0
196,8,AdaBoost (Discrete),0,0.6,0.18353105373342637,0.14853423008513306,52.62117648124695,0.0
197,8,AdaBoost (Real),0,0.6,0.21423586880669923,0.17012003007388435,135.44888925552368,0.0
198,8,Logistic Regression (Penalty = L2),0,0.6,0.23098394975575715,0.22615314638695422,2.0454111099243164,0.0
199,8,Naive Bayes,0,0.6,0.21702721563154223,0.3757708175014595,0.329012393951416,0.0
200,8,KNeighbors Classifier,1,0.6,0.20534458509142053,0.3607342741819228,0.30338573455810547,0.0
201,8,SVC Classifier,1,0.6,0.1617440225035162,1.0,8.422931671142578,0.0
202,8,Decision Tree,1,0.6,0.21237693389592124,0.2769303134897376,0.14921116828918457,0.0
203,8,RandomForest,1,0.6,0.25316455696202533,0.2638688027902012,0.7742693424224854,0.0
204,8,AdaBoost (Discrete),1,0.6,0.19479606188466947,0.23136022921149024,53.58834433555603,0.0
205,8,AdaBoost (Real),1,0.6,0.2468354430379747,0.38404445647195457,129.00777959823608,0.0
206,8,Logistic Regression (Penalty = L2),1,0.6,0.23558368495077356,0.3138008885398116,1.9402189254760742,0.0
207,8,Naive Bayes,1,0.6,0.27355836849507736,0.5834681163494125,0.2094569206237793,0.0
208,8,KNeighbors Classifier,2,0.6,0.2245042492917847,0.37912699266208877,0.2865931987762451,0.0
209,8,SVC Classifier,2,0.6,0.1621813031161473,1.0,7.99911642074585,0.0
210,8,Decision Tree,2,0.6,0.18838526912181303,0.3176326104476888,0.21935653686523438,0.0
211,8,RandomForest,2,0.6,0.27124645892351273,0.32300437675684973,0.7219729423522949,0.0
212,8,AdaBoost (Discrete),2,0.6,0.1961756373937677,0.23141298272530123,51.61461114883423,0.0
213,8,AdaBoost (Real),2,0.6,0.25,0.33372589622679405,126.17812895774841,0.0
214,8,Logistic Regression (Penalty = L2),2,0.6,0.2514164305949009,0.3677434865563041,2.1241588592529297,0.0
215,8,Naive Bayes,2,0.6,0.28328611898017,0.5373241840489958,0.34210801124572754,0.0
