,feat_set_id,classifier,fold_id,feat_th,score,geo_score,exec_t,geo_score_woz
0,0,KNeighbors Classifier,0,0.55,0.7504332755632582,0.6436560064880525,0.39913320541381836,0.0
1,0,SVC Classifier,0,0.55,0.6845753899480069,0.8129520829107402,0.5368587970733643,0.0
2,0,Decision Tree,0,0.55,0.7019064124783362,0.6093117197198867,0.055338382720947266,0.0
3,0,RandomForest,0,0.55,0.6932409012131716,0.5611576392063142,0.483928918838501,0.0
4,0,AdaBoost (Discrete),0,0.55,0.729636048526863,0.7365491437026513,28.445051908493042,0.0
5,0,AdaBoost (Real),0,0.55,0.7365684575389948,0.5870584975387696,38.901252031326294,0.0
6,0,Logistic Regression (Penalty = L2),0,0.55,0.6689774696707106,0.7362734178225363,0.3027021884918213,0.0
7,0,Naive Bayes,0,0.55,0.6672443674176777,0.7914018355435688,0.06418466567993164,0.0
8,0,KNeighbors Classifier,1,0.55,0.7760416666666666,0.6584696633725178,0.532304048538208,0.0
9,0,SVC Classifier,1,0.55,0.7274305555555556,0.7636780043269571,0.5823228359222412,0.0
10,0,Decision Tree,1,0.55,0.8055555555555556,0.8378971412275886,0.0017800331115722656,0.0
11,0,RandomForest,1,0.55,0.7239583333333334,0.4956385459568428,0.5534703731536865,0.0
12,0,AdaBoost (Discrete),1,0.55,0.7534722222222222,0.44445336208567127,38.12847185134888,0.0
13,0,AdaBoost (Real),1,0.55,0.6909722222222222,0.4385220278298957,46.925251722335815,0.0
14,0,Logistic Regression (Penalty = L2),1,0.55,0.7673611111111112,0.6886662017645397,0.36502790451049805,0.0
15,0,Naive Bayes,1,0.55,0.7777777777777778,0.8784280035315966,0.14493656158447266,0.0
16,0,KNeighbors Classifier,2,0.55,0.8226086956521739,0.6948007300889434,0.6204280853271484,0.6948007300889434
17,0,SVC Classifier,2,0.55,0.8208695652173913,0.7556138122418227,0.778303861618042,0.0
18,0,Decision Tree,2,0.55,0.7773913043478261,0.6207667380113036,0.1149454116821289,0.6207667380113036
19,0,RandomForest,2,0.55,0.7182608695652174,0.2795084971874737,0.675161600112915,0.0
20,0,AdaBoost (Discrete),2,0.55,0.3947826086956522,0.41004535955825294,35.179017305374146,0.41004535955825294
21,0,AdaBoost (Real),2,0.55,0.35478260869565215,0.39952475410835686,42.08883476257324,0.39952475410835686
22,0,Logistic Regression (Penalty = L2),2,0.55,0.6086956521739131,0.4992153355053947,0.3156766891479492,0.4992153355053947
23,0,Naive Bayes,2,0.55,0.4782608695652174,0.7962895022318469,0.08214116096496582,0.0
24,1,KNeighbors Classifier,0,0.55,0.6967071057192374,0.5916516027851242,0.33922290802001953,0.0
25,1,SVC Classifier,0,0.55,0.6845753899480069,0.8129520829107402,0.6217515468597412,0.0
26,1,Decision Tree,0,0.55,0.6360485268630849,0.5498693567355661,0.0670173168182373,0.0
27,1,RandomForest,0,0.55,0.7261698440207972,0.5648671314898963,0.4796736240386963,0.0
28,1,AdaBoost (Discrete),0,0.55,0.23743500866551126,0.24436069827658005,30.21016025543213,0.0
29,1,AdaBoost (Real),0,0.55,0.2218370883882149,0.2649102639566414,48.28377389907837,0.0
30,1,Logistic Regression (Penalty = L2),0,0.55,0.6395147313691508,0.6832394989103653,0.40477442741394043,0.0
31,1,Naive Bayes,0,0.55,0.6429809358752167,0.7508927762297288,0.08903121948242188,0.0
32,1,KNeighbors Classifier,1,0.55,0.7430555555555556,0.4490507916151869,0.5962851047515869,0.0
33,1,SVC Classifier,1,0.55,0.7274305555555556,0.7636780043269571,0.9679081439971924,0.0
34,1,Decision Tree,1,0.55,0.7847222222222222,0.5819384709900155,0.09130477905273438,0.0
35,1,RandomForest,1,0.55,0.6944444444444444,0.3451183851258305,0.4662952423095703,0.0
36,1,AdaBoost (Discrete),1,0.55,0.6145833333333334,0.48328555100451154,41.13594388961792,0.0
37,1,AdaBoost (Real),1,0.55,0.3975694444444444,0.42192333943536187,54.73108100891113,0.0
38,1,Logistic Regression (Penalty = L2),1,0.55,0.71875,0.6138900896607005,0.48758816719055176,0.0
39,1,Naive Bayes,1,0.55,0.78125,0.6802396938019404,0.11562204360961914,0.0
40,1,KNeighbors Classifier,2,0.55,0.7808695652173913,0.6834667707379308,0.7296838760375977,0.0
41,1,SVC Classifier,2,0.55,0.7930434782608695,0.6834487561136172,1.0408904552459717,0.0
42,1,Decision Tree,2,0.55,0.6660869565217391,0.5072479556239898,0.10287046432495117,0.5072479556239898
43,1,RandomForest,2,0.55,0.7182608695652174,0.2795084971874737,0.7281081676483154,0.0
44,1,AdaBoost (Discrete),2,0.55,0.12521739130434784,0.23599415229887397,49.213356494903564,0.23599415229887397
45,1,AdaBoost (Real),2,0.55,0.10086956521739131,0.1882353342184756,63.992077589035034,0.1882353342184756
46,1,Logistic Regression (Penalty = L2),2,0.55,0.6104347826086957,0.4215862361310502,0.574268102645874,0.4215862361310502
47,1,Naive Bayes,2,0.55,0.528695652173913,0.7234770261807716,0.2212209701538086,0.0
48,2,KNeighbors Classifier,0,0.55,0.6568457538994801,0.635797814864237,2.0488104820251465,0.0
49,2,SVC Classifier,0,0.55,0.6845753899480069,0.8129520829107402,1.463465690612793,0.0
50,2,Decision Tree,0,0.55,0.6741767764298093,0.3947386309273556,0.11536097526550293,0.0
51,2,RandomForest,0,0.55,0.7001733102253033,1.0,0.8784716129302979,0.0
52,2,AdaBoost (Discrete),0,0.55,0.7521663778162911,0.6944144468157013,52.36712455749512,0.0
53,2,AdaBoost (Real),0,0.55,0.7313691507798961,0.6279488611465976,63.71315789222717,0.0
54,2,Logistic Regression (Penalty = L2),0,0.55,0.6863084922010398,0.7210131717325844,0.5241396427154541,0.0
55,2,Naive Bayes,0,0.55,0.6672443674176777,0.7914018355435688,0.0037114620208740234,0.0
56,2,KNeighbors Classifier,1,0.55,0.6961805555555556,0.3630128918050201,1.5396497249603271,0.0
57,2,SVC Classifier,1,0.55,0.7274305555555556,0.7636780043269571,1.4658560752868652,0.0
58,2,Decision Tree,1,0.55,0.7690972222222222,0.7360620424468348,0.09898114204406738,0.0
59,2,RandomForest,1,0.55,0.6996527777777778,1.0,0.9519336223602295,0.0
60,2,AdaBoost (Discrete),1,0.55,0.7517361111111112,0.43129654708987847,47.45246863365173,0.0
61,2,AdaBoost (Real),1,0.55,0.7777777777777778,0.6136183382979365,56.380085468292236,0.0
62,2,Logistic Regression (Penalty = L2),1,0.55,0.7482638888888888,0.6268843050507011,0.4635913372039795,0.0
63,2,Naive Bayes,1,0.55,0.7829861111111112,0.6820345298093242,0.11288833618164062,0.0
64,2,KNeighbors Classifier,2,0.55,0.8330434782608696,0.7552608308349611,1.53892183303833,0.7552608308349611
65,2,SVC Classifier,2,0.55,0.7356521739130435,0.6012871326420459,1.3918097019195557,0.0
66,2,Decision Tree,2,0.55,0.7495652173913043,0.3576791347466741,0.003335714340209961,0.3576791347466741
67,2,RandomForest,2,0.55,0.7008695652173913,1.0,0.7086615562438965,0.0
68,2,AdaBoost (Discrete),2,0.55,0.3652173913043478,0.49979308913426346,49.19341278076172,0.49979308913426346
69,2,AdaBoost (Real),2,0.55,0.4956521739130435,0.4877721037836525,61.7997612953186,0.4877721037836525
70,2,Logistic Regression (Penalty = L2),2,0.55,0.6052173913043478,0.52602626583304,0.4599776268005371,0.52602626583304
71,2,Naive Bayes,2,0.55,0.5478260869565217,0.8392974277582299,0.2458655834197998,0.0
72,3,KNeighbors Classifier,0,0.55,0.7642980935875217,0.5472755947892984,0.47045135498046875,0.0
73,3,SVC Classifier,0,0.55,0.6845753899480069,0.8129520829107402,1.0033600330352783,0.0
74,3,Decision Tree,0,0.55,0.6915077989601387,0.5592965183231553,0.0017514228820800781,0.0
75,3,RandomForest,0,0.55,0.7001733102253033,1.0,0.8224406242370605,0.0
76,3,AdaBoost (Discrete),0,0.55,0.6499133448873483,0.649519052838329,44.11070227622986,0.0
77,3,AdaBoost (Real),0,0.55,0.6897746967071057,0.6879217878062984,51.256938457489014,0.0
78,3,Logistic Regression (Penalty = L2),0,0.55,0.7729636048526863,0.8697686616293296,0.7371482849121094,0.0
79,3,Naive Bayes,0,0.55,0.5008665511265165,0.8129520829107402,0.10880899429321289,0.0
80,3,KNeighbors Classifier,1,0.55,0.6892361111111112,0.6386839465829941,0.764132022857666,0.0
81,3,SVC Classifier,1,0.55,0.7690972222222222,0.7912067141500564,1.0523314476013184,0.0
82,3,Decision Tree,1,0.55,0.6215277777777778,0.29527568549379063,0.1063985824584961,0.0
83,3,RandomForest,1,0.55,0.6996527777777778,1.0,0.7387373447418213,0.0
84,3,AdaBoost (Discrete),1,0.55,0.4340277777777778,0.351939547449174,43.462308168411255,0.0
85,3,AdaBoost (Real),1,0.55,0.3246527777777778,0.23710894586055717,56.84752058982849,0.0
86,3,Logistic Regression (Penalty = L2),1,0.55,0.703125,0.4083599471453902,0.3707244396209717,0.0
87,3,Naive Bayes,1,0.55,0.6840277777777778,0.7034341761336865,0.11551547050476074,0.0
88,3,KNeighbors Classifier,2,0.55,0.7339130434782609,0.44676254788595293,0.5413341522216797,0.0
89,3,SVC Classifier,2,0.55,0.7617391304347826,0.6767502123205655,0.9670798778533936,0.0
90,3,Decision Tree,2,0.55,0.7913043478260869,0.6825830828642085,0.10692930221557617,0.0
91,3,RandomForest,2,0.55,0.7078260869565217,0.1767766952966369,0.5562503337860107,0.0
92,3,AdaBoost (Discrete),2,0.55,0.7704347826086957,0.6006742489485261,39.45229196548462,0.0
93,3,AdaBoost (Real),2,0.55,0.6417391304347826,0.4572275931746659,57.22021770477295,0.0
94,3,Logistic Regression (Penalty = L2),2,0.55,0.7391304347826086,0.4937575579721191,0.2696726322174072,0.0
95,3,Naive Bayes,2,0.55,0.7791304347826087,0.6214035074764954,0.07785677909851074,0.6214035074764954
96,4,KNeighbors Classifier,0,0.55,0.7140381282495667,0.5734070056698467,0.3157460689544678,0.0
97,4,SVC Classifier,0,0.55,0.6845753899480069,0.8129520829107402,0.5321178436279297,0.0
98,4,Decision Tree,0,0.55,0.6551126516464472,0.5758666391094819,0.05889439582824707,0.0
99,4,RandomForest,0,0.55,0.6707105719237435,0.9579207920792079,0.29485130310058594,0.0
100,4,AdaBoost (Discrete),0,0.55,0.6932409012131716,0.44346147734842134,27.950523853302002,0.0
101,4,AdaBoost (Real),0,0.55,0.7123050259965338,0.3481307672667008,74.80526900291443,0.0
102,4,Logistic Regression (Penalty = L2),0,0.55,0.6793760831889082,0.7701501075237294,0.6219220161437988,0.0
103,4,Naive Bayes,0,0.55,0.6429809358752167,0.7508927762297288,0.13311767578125,0.0
104,4,KNeighbors Classifier,1,0.55,0.7743055555555556,0.7712684317386043,0.6586523056030273,0.0
105,4,SVC Classifier,1,0.55,0.7274305555555556,0.7636780043269571,1.190664529800415,0.0
106,4,Decision Tree,1,0.55,0.6927083333333334,0.301374539863944,0.12697577476501465,0.0
107,4,RandomForest,1,0.55,0.7604166666666666,0.5678252885462702,1.0740323066711426,0.0
108,4,AdaBoost (Discrete),1,0.55,0.5625,0.6443917382541577,93.49824833869934,0.0
109,4,AdaBoost (Real),1,0.55,0.3472222222222222,0.44815170680957994,118.99951529502869,0.0
110,4,Logistic Regression (Penalty = L2),1,0.55,0.7690972222222222,0.4675522092211202,0.7218728065490723,0.0
111,4,Naive Bayes,1,0.55,0.7638888888888888,0.8567963102657931,0.20920252799987793,0.0
112,4,KNeighbors Classifier,2,0.55,0.782608695652174,0.5684014679485636,1.2845473289489746,0.5684014679485636
113,4,SVC Classifier,2,0.55,0.7930434782608695,0.6834487561136172,1.9879071712493896,0.0
114,4,Decision Tree,2,0.55,0.8173913043478261,0.7076615946085145,0.002218961715698242,0.7076615946085145
115,4,RandomForest,2,0.55,0.7182608695652174,0.2795084971874737,1.1837568283081055,0.0
116,4,AdaBoost (Discrete),2,0.55,0.23304347826086957,0.2878787818101127,93.57905173301697,0.2878787818101127
117,4,AdaBoost (Real),2,0.55,0.2,0.306050454848247,116.95493721961975,0.306050454848247
118,4,Logistic Regression (Penalty = L2),2,0.55,0.68,0.5159949093569284,0.7612922191619873,0.5159949093569284
119,4,Naive Bayes,2,0.55,0.46608695652173915,0.6897771060056679,0.4573667049407959,0.0
120,5,KNeighbors Classifier,0,0.55,0.7504332755632582,0.6436560064880525,1.276360273361206,0.0
121,5,SVC Classifier,0,0.55,0.6845753899480069,0.8129520829107402,1.8396391868591309,0.0
122,5,Decision Tree,0,0.55,0.708838821490468,0.6177461698220267,0.21837186813354492,0.0
123,5,RandomForest,0,0.55,0.6932409012131716,0.5611576392063142,1.4624688625335693,0.0
124,5,AdaBoost (Discrete),0,0.55,0.729636048526863,0.7365491437026513,96.66776490211487,0.0
125,5,AdaBoost (Real),0,0.55,0.7365684575389948,0.5870584975387696,112.2723753452301,0.0
126,5,Logistic Regression (Penalty = L2),0,0.55,0.6689774696707106,0.7362734178225363,0.783881664276123,0.0
127,5,Naive Bayes,0,0.55,0.6672443674176777,0.7914018355435688,0.21681690216064453,0.0
128,5,KNeighbors Classifier,1,0.55,0.7760416666666666,0.6584696633725178,1.5198895931243896,0.0
129,5,SVC Classifier,1,0.55,0.7274305555555556,0.7636780043269571,2.2643697261810303,0.0
130,5,Decision Tree,1,0.55,0.7517361111111112,0.7126247890854978,0.002832651138305664,0.0
131,5,RandomForest,1,0.55,0.7239583333333334,0.4956385459568428,1.648639440536499,0.0
132,5,AdaBoost (Discrete),1,0.55,0.7430555555555556,0.42928019398890077,83.77661037445068,0.0
133,5,AdaBoost (Real),1,0.55,0.6909722222222222,0.4385220278298957,68.64597487449646,0.0
134,5,Logistic Regression (Penalty = L2),1,0.55,0.7673611111111112,0.6886662017645397,0.34781312942504883,0.0
135,5,Naive Bayes,1,0.55,0.7777777777777778,0.8784280035315966,0.1079869270324707,0.0
136,5,KNeighbors Classifier,2,0.55,0.8226086956521739,0.6948007300889434,0.8374359607696533,0.6948007300889434
137,5,SVC Classifier,2,0.55,0.8208695652173913,0.7556138122418227,1.07505464553833,0.0
138,5,Decision Tree,2,0.55,0.7617391304347826,0.6798153079009692,0.10693836212158203,0.6798153079009692
139,5,RandomForest,2,0.55,0.7182608695652174,0.2795084971874737,0.777367353439331,0.0
140,5,AdaBoost (Discrete),2,0.55,0.3947826086956522,0.41004535955825294,46.737680435180664,0.41004535955825294
141,5,AdaBoost (Real),2,0.55,0.3269565217391304,0.3884159698050426,56.72440767288208,0.3884159698050426
142,5,Logistic Regression (Penalty = L2),2,0.55,0.6086956521739131,0.4992153355053947,0.41222453117370605,0.4992153355053947
143,5,Naive Bayes,2,0.55,0.4782608695652174,0.7962895022318469,0.1009676456451416,0.0
144,6,KNeighbors Classifier,0,0.55,0.7868284228769498,0.46566013323672006,0.6021625995635986,0.46566013323672006
145,6,SVC Classifier,0,0.55,0.6845753899480069,0.8129520829107402,0.6807959079742432,0.0
146,6,Decision Tree,0,0.55,0.7417677642980935,0.8617274844321391,0.09503579139709473,0.0
147,6,RandomForest,0,0.55,0.707105719237435,0.7819118483651858,0.585585355758667,0.0
148,6,AdaBoost (Discrete),0,0.55,0.7417677642980935,0.8617274844321391,43.00120186805725,0.0
149,6,AdaBoost (Real),0,0.55,0.7435008665511266,0.8084677170456163,82.45636868476868,0.0
150,6,Logistic Regression (Penalty = L2),0,0.55,0.7105719237435009,0.8354757937727448,0.23761653900146484,0.0
151,6,Naive Bayes,0,0.55,0.5233968804159446,0.7201922951672233,0.1198728084564209,0.0
152,6,KNeighbors Classifier,1,0.55,0.7326388888888888,0.33946031123148374,0.43983983993530273,0.0
153,6,SVC Classifier,1,0.55,0.7690972222222222,0.8841027752029671,0.8726410865783691,0.0
154,6,Decision Tree,1,0.55,0.7430555555555556,0.37104097107898465,0.1148068904876709,0.0
155,6,RandomForest,1,0.55,0.8038194444444444,0.7744915485716632,0.770240306854248,0.0
156,6,AdaBoost (Discrete),1,0.55,0.625,0.6085132024195975,47.055240631103516,0.0
157,6,AdaBoost (Real),1,0.55,0.3263888888888889,0.4485257902109938,57.895525217056274,0.0
158,6,Logistic Regression (Penalty = L2),1,0.55,0.7517361111111112,0.367138391479228,0.2219083309173584,0.0
159,6,Naive Bayes,1,0.55,0.6840277777777778,0.7034341761336865,0.1035158634185791,0.0
160,6,KNeighbors Classifier,2,0.55,0.7252173913043478,0.4439331176013182,0.5238163471221924,0.0
161,6,SVC Classifier,2,0.55,0.7617391304347826,0.5617326583032773,0.8968729972839355,0.0
162,6,Decision Tree,2,0.55,0.8591304347826086,0.8867301295099007,0.10644793510437012,0.0
163,6,RandomForest,2,0.55,0.7356521739130435,0.41354808950411825,0.6483705043792725,0.0
164,6,AdaBoost (Discrete),2,0.55,0.8417391304347827,0.8595882179663128,46.963626861572266,0.0
165,6,AdaBoost (Real),2,0.55,0.8486956521739131,0.8541244265211884,62.115198373794556,0.0
166,6,Logistic Regression (Penalty = L2),2,0.55,0.8382608695652174,0.8340051055773173,0.3301503658294678,0.0
167,6,Naive Bayes,2,0.55,0.7791304347826087,0.6214035074764954,0.10931038856506348,0.6214035074764954
168,7,KNeighbors Classifier,0,0.55,0.6967071057192374,0.5916516027851242,0.6212353706359863,0.0
169,7,SVC Classifier,0,0.55,0.6845753899480069,0.8129520829107402,0.7499890327453613,0.0
170,7,Decision Tree,0,0.55,0.6360485268630849,0.5498693567355661,0.0024042129516601562,0.0
171,7,RandomForest,0,0.55,0.7261698440207972,0.5648671314898963,0.6512637138366699,0.0
172,7,AdaBoost (Discrete),0,0.55,0.23743500866551126,0.24436069827658005,46.50333309173584,0.0
173,7,AdaBoost (Real),0,0.55,0.2218370883882149,0.2649102639566414,56.56906485557556,0.0
174,7,Logistic Regression (Penalty = L2),0,0.55,0.6395147313691508,0.6832394989103653,0.4580700397491455,0.0
175,7,Naive Bayes,0,0.55,0.6429809358752167,0.7508927762297288,0.09141182899475098,0.0
176,7,KNeighbors Classifier,1,0.55,0.7430555555555556,0.4490507916151869,0.590562105178833,0.0
177,7,SVC Classifier,1,0.55,0.7274305555555556,0.7636780043269571,0.8765542507171631,0.0
178,7,Decision Tree,1,0.55,0.7430555555555556,0.4962951782399247,0.09138846397399902,0.0
179,7,RandomForest,1,0.55,0.6944444444444444,0.3451183851258305,0.6715559959411621,0.0
180,7,AdaBoost (Discrete),1,0.55,0.6163194444444444,0.4387967910771173,51.971179485321045,0.0
181,7,AdaBoost (Real),1,0.55,0.3940972222222222,0.41724010574566045,60.79501914978027,0.0
182,7,Logistic Regression (Penalty = L2),1,0.55,0.71875,0.6138900896607005,0.3660402297973633,0.0
183,7,Naive Bayes,1,0.55,0.78125,0.6802396938019404,0.20871782302856445,0.0
184,7,KNeighbors Classifier,2,0.55,0.7808695652173913,0.6834667707379308,0.7996013164520264,0.0
185,7,SVC Classifier,2,0.55,0.7930434782608695,0.6834487561136172,1.095670461654663,0.0
186,7,Decision Tree,2,0.55,0.5930434782608696,0.4260779208871076,0.0024967193603515625,0.4260779208871076
187,7,RandomForest,2,0.55,0.7182608695652174,0.2795084971874737,0.8451380729675293,0.0
188,7,AdaBoost (Discrete),2,0.55,0.12521739130434784,0.23599415229887397,47.73668646812439,0.23599415229887397
189,7,AdaBoost (Real),2,0.55,0.11304347826086956,0.19054540236783327,58.50359654426575,0.19054540236783327
190,7,Logistic Regression (Penalty = L2),2,0.55,0.6104347826086957,0.4215862361310502,0.594104528427124,0.4215862361310502
191,7,Naive Bayes,2,0.55,0.528695652173913,0.7234770261807716,0.21715998649597168,0.0
192,8,KNeighbors Classifier,0,0.55,0.7868284228769498,0.46566013323672006,0.4342939853668213,0.46566013323672006
193,8,SVC Classifier,0,0.55,0.6845753899480069,0.8129520829107402,0.9104995727539062,0.0
194,8,Decision Tree,0,0.55,0.7417677642980935,0.8617274844321391,0.10957765579223633,0.0
195,8,RandomForest,0,0.55,0.707105719237435,0.7819118483651858,0.6743731498718262,0.0
196,8,AdaBoost (Discrete),0,0.55,0.7417677642980935,0.8617274844321391,46.92245292663574,0.0
197,8,AdaBoost (Real),0,0.55,0.7019064124783362,0.7780441650525227,70.45702195167542,0.0
198,8,Logistic Regression (Penalty = L2),0,0.55,0.7105719237435009,0.8354757937727448,0.2753763198852539,0.0
199,8,Naive Bayes,0,0.55,0.5233968804159446,0.7201922951672233,0.09641265869140625,0.0
200,8,KNeighbors Classifier,1,0.55,0.7326388888888888,0.33946031123148374,0.3890202045440674,0.0
201,8,SVC Classifier,1,0.55,0.7690972222222222,0.8841027752029671,0.8603072166442871,0.0
202,8,Decision Tree,1,0.55,0.7430555555555556,0.37104097107898465,0.09872913360595703,0.0
203,8,RandomForest,1,0.55,0.8038194444444444,0.7744915485716632,0.7338306903839111,0.0
204,8,AdaBoost (Discrete),1,0.55,0.625,0.6085132024195975,40.76633954048157,0.0
205,8,AdaBoost (Real),1,0.55,0.3159722222222222,0.42487423462558527,52.01188039779663,0.0
206,8,Logistic Regression (Penalty = L2),1,0.55,0.7517361111111112,0.367138391479228,0.28325676918029785,0.0
207,8,Naive Bayes,1,0.55,0.6840277777777778,0.7034341761336865,0.18072509765625,0.0
208,8,KNeighbors Classifier,2,0.55,0.7252173913043478,0.4439331176013182,0.35740184783935547,0.0
209,8,SVC Classifier,2,0.55,0.7617391304347826,0.5617326583032773,0.7479209899902344,0.0
210,8,Decision Tree,2,0.55,0.8591304347826086,0.8867301295099007,0.0866084098815918,0.0
211,8,RandomForest,2,0.55,0.7356521739130435,0.41354808950411825,0.5530486106872559,0.0
212,8,AdaBoost (Discrete),2,0.55,0.8417391304347827,0.8595882179663128,38.5057852268219,0.0
213,8,AdaBoost (Real),2,0.55,0.8521739130434782,0.8790560898948038,52.68287539482117,0.0
214,8,Logistic Regression (Penalty = L2),2,0.55,0.8382608695652174,0.8340051055773173,0.20088958740234375,0.0
215,8,Naive Bayes,2,0.55,0.7791304347826087,0.6214035074764954,0.08473658561706543,0.6214035074764954
216,9,KNeighbors Classifier,0,0.55,0.7642980935875217,0.5472755947892984,0.5932011604309082,0.0
217,9,SVC Classifier,0,0.55,0.6845753899480069,0.8129520829107402,0.852571964263916,0.0
218,9,Decision Tree,0,0.55,0.6915077989601387,0.5592965183231553,0.14513564109802246,0.0
219,9,RandomForest,0,0.55,0.7001733102253033,1.0,0.6656093597412109,0.0
220,9,AdaBoost (Discrete),0,0.55,0.6499133448873483,0.649519052838329,40.453080892562866,0.0
221,9,AdaBoost (Real),0,0.55,0.6967071057192374,0.6467741736364929,46.60565209388733,0.0
222,9,Logistic Regression (Penalty = L2),0,0.55,0.7729636048526863,0.8697686616293296,0.3569066524505615,0.0
223,9,Naive Bayes,0,0.55,0.5008665511265165,0.8129520829107402,0.18531513214111328,0.0
224,9,KNeighbors Classifier,1,0.55,0.6892361111111112,0.6386839465829941,0.7549102306365967,0.0
225,9,SVC Classifier,1,0.55,0.7690972222222222,0.7912067141500564,0.7494289875030518,0.0
226,9,Decision Tree,1,0.55,0.625,0.28718639095187526,0.09082198143005371,0.0
227,9,RandomForest,1,0.55,0.6996527777777778,1.0,0.5480067729949951,0.0
228,9,AdaBoost (Discrete),1,0.55,0.4236111111111111,0.3482732438780431,39.340315103530884,0.0
229,9,AdaBoost (Real),1,0.55,0.3177083333333333,0.23685790390910116,47.91955852508545,0.0
230,9,Logistic Regression (Penalty = L2),1,0.55,0.703125,0.4083599471453902,0.401395320892334,0.0
231,9,Naive Bayes,1,0.55,0.6840277777777778,0.7034341761336865,0.09094524383544922,0.0
232,9,KNeighbors Classifier,2,0.55,0.7339130434782609,0.44676254788595293,0.5511429309844971,0.0
233,9,SVC Classifier,2,0.55,0.7617391304347826,0.6767502123205655,0.8315544128417969,0.0
234,9,Decision Tree,2,0.55,0.7095652173913043,0.6491160003311088,0.09091377258300781,0.0
235,9,RandomForest,2,0.55,0.7078260869565217,0.1767766952966369,0.5595746040344238,0.0
236,9,AdaBoost (Discrete),2,0.55,0.7704347826086957,0.6006742489485261,39.62972021102905,0.0
237,9,AdaBoost (Real),2,0.55,0.688695652173913,0.5983460454239183,52.387853384017944,0.0
238,9,Logistic Regression (Penalty = L2),2,0.55,0.7391304347826086,0.4937575579721191,0.4609353542327881,0.0
239,9,Naive Bayes,2,0.55,0.7791304347826087,0.6214035074764954,0.10772943496704102,0.6214035074764954
240,10,KNeighbors Classifier,0,0.55,0.6741767764298093,0.5675078717845609,0.909193754196167,0.0
241,10,SVC Classifier,0,0.55,0.6845753899480069,0.8129520829107402,0.9564282894134521,0.0
242,10,Decision Tree,0,0.55,0.733102253032929,0.5489141542518593,0.09502601623535156,0.0
243,10,RandomForest,0,0.55,0.7001733102253033,0.4199540286014814,0.6517541408538818,0.0
244,10,AdaBoost (Discrete),0,0.55,0.7487001733102253,0.6330959950896453,41.68046474456787,0.0
245,10,AdaBoost (Real),0,0.55,0.7227036395147314,0.6188016175915455,53.22131156921387,0.0
246,10,Logistic Regression (Penalty = L2),0,0.55,0.6932409012131716,0.7458113231260104,0.4231574535369873,0.0
247,10,Naive Bayes,0,0.55,0.6672443674176777,0.7914018355435688,0.10125374794006348,0.0
248,10,KNeighbors Classifier,1,0.55,0.6163194444444444,0.44925026170452087,0.9101583957672119,0.0
249,10,SVC Classifier,1,0.55,0.7274305555555556,0.7636780043269571,1.0670323371887207,0.0
250,10,Decision Tree,1,0.55,0.8055555555555556,0.30966093962940583,0.0021734237670898438,0.30966093962940583
251,10,RandomForest,1,0.55,0.7239583333333334,0.42760658851442285,0.6148638725280762,0.0
252,10,AdaBoost (Discrete),1,0.55,0.7916666666666666,0.3906977268904176,43.61800003051758,0.0
253,10,AdaBoost (Real),1,0.55,0.7743055555555556,0.6410769994818538,54.24704337120056,0.0
254,10,Logistic Regression (Penalty = L2),1,0.55,0.7430555555555556,0.5247803248102658,0.38846778869628906,0.0
255,10,Naive Bayes,1,0.55,0.7829861111111112,0.6820345298093242,0.1129150390625,0.0
256,10,KNeighbors Classifier,2,0.55,0.7773913043478261,0.44479750225479026,1.26613450050354,0.44479750225479026
257,10,SVC Classifier,2,0.55,0.7530434782608696,0.5985404082828448,1.244804859161377,0.0
258,10,Decision Tree,2,0.55,0.7356521739130435,0.42719894956405396,0.10235095024108887,0.42719894956405396
259,10,RandomForest,2,0.55,0.7060869565217391,0.15309310892394862,0.6615040302276611,0.0
260,10,AdaBoost (Discrete),2,0.55,0.40869565217391307,0.501007423896477,46.68810558319092,0.501007423896477
261,10,AdaBoost (Real),2,0.55,0.3234782608695652,0.3996983473511857,50.71176719665527,0.3996983473511857
262,10,Logistic Regression (Penalty = L2),2,0.55,0.6086956521739131,0.4992153355053947,0.385775089263916,0.4992153355053947
263,10,Naive Bayes,2,0.55,0.5478260869565217,0.8392974277582299,0.09328579902648926,0.0
264,11,KNeighbors Classifier,0,0.55,0.6568457538994801,0.635797814864237,1.474144697189331,0.0
265,11,SVC Classifier,0,0.55,0.6845753899480069,0.8129520829107402,1.1678411960601807,0.0
266,11,Decision Tree,0,0.55,0.6325823223570191,0.23571164288298738,0.09549975395202637,0.0
267,11,RandomForest,0,0.55,0.7001733102253033,1.0,0.5730142593383789,0.0
268,11,AdaBoost (Discrete),0,0.55,0.7521663778162911,0.6944144468157013,40.97366666793823,0.0
269,11,AdaBoost (Real),0,0.55,0.7313691507798961,0.6220896794104745,53.40722036361694,0.0
270,11,Logistic Regression (Penalty = L2),0,0.55,0.6863084922010398,0.7210131717325844,0.32819151878356934,0.0
271,11,Naive Bayes,0,0.55,0.6672443674176777,0.7914018355435688,0.10509347915649414,0.0
272,11,KNeighbors Classifier,1,0.55,0.6961805555555556,0.3630128918050201,1.3589305877685547,0.0
273,11,SVC Classifier,1,0.55,0.7274305555555556,0.7636780043269571,1.3463590145111084,0.0
274,11,Decision Tree,1,0.55,0.6996527777777778,0.5584404290852446,0.0031175613403320312,0.0
275,11,RandomForest,1,0.55,0.6996527777777778,1.0,0.797945499420166,0.0
276,11,AdaBoost (Discrete),1,0.55,0.7517361111111112,0.43129654708987847,46.10850811004639,0.0
277,11,AdaBoost (Real),1,0.55,0.7690972222222222,0.5572880389795307,47.969311237335205,0.0
278,11,Logistic Regression (Penalty = L2),1,0.55,0.7482638888888888,0.6268843050507011,0.3815939426422119,0.0
279,11,Naive Bayes,1,0.55,0.7829861111111112,0.6820345298093242,0.1643199920654297,0.0
280,11,KNeighbors Classifier,2,0.55,0.8330434782608696,0.7552608308349611,1.3699924945831299,0.7552608308349611
281,11,SVC Classifier,2,0.55,0.7356521739130435,0.6012871326420459,1.106766939163208,0.0
282,11,Decision Tree,2,0.55,0.4330434782608696,0.34050967714647484,0.0943765640258789,0.34050967714647484
283,11,RandomForest,2,0.55,0.7008695652173913,1.0,0.6390707492828369,0.0
284,11,AdaBoost (Discrete),2,0.55,0.3634782608695652,0.49891083840597705,39.284159898757935,0.49891083840597705
285,11,AdaBoost (Real),2,0.55,0.5304347826086957,0.5946496597352795,45.2452232837677,0.5946496597352795
286,11,Logistic Regression (Penalty = L2),2,0.55,0.6052173913043478,0.52602626583304,0.41780877113342285,0.52602626583304
287,11,Naive Bayes,2,0.55,0.5478260869565217,0.8392974277582299,0.09619402885437012,0.0
288,12,KNeighbors Classifier,0,0.55,0.7868284228769498,0.46566013323672006,0.4321146011352539,0.46566013323672006
289,12,SVC Classifier,0,0.55,0.6845753899480069,0.8129520829107402,0.5276205539703369,0.0
290,12,Decision Tree,0,0.55,0.7417677642980935,0.8617274844321391,0.08141565322875977,0.0
291,12,RandomForest,0,0.55,0.707105719237435,0.7819118483651858,0.6041028499603271,0.0
292,12,AdaBoost (Discrete),0,0.55,0.7417677642980935,0.8617274844321391,34.20853519439697,0.0
293,12,AdaBoost (Real),0,0.55,0.7435008665511266,0.8084677170456163,61.56748080253601,0.0
294,12,Logistic Regression (Penalty = L2),0,0.55,0.7105719237435009,0.8354757937727448,0.2547609806060791,0.0
295,12,Naive Bayes,0,0.55,0.5233968804159446,0.7201922951672233,0.08419370651245117,0.0
296,12,KNeighbors Classifier,1,0.55,0.7326388888888888,0.33946031123148374,0.3402547836303711,0.0
297,12,SVC Classifier,1,0.55,0.7690972222222222,0.8841027752029671,0.7837495803833008,0.0
298,12,Decision Tree,1,0.55,0.7430555555555556,0.37104097107898465,0.0827791690826416,0.0
299,12,RandomForest,1,0.55,0.8038194444444444,0.7744915485716632,0.6707193851470947,0.0
300,12,AdaBoost (Discrete),1,0.55,0.625,0.6085132024195975,35.06178426742554,0.0
301,12,AdaBoost (Real),1,0.55,0.3454861111111111,0.25762293466772973,41.79593873023987,0.0
302,12,Logistic Regression (Penalty = L2),1,0.55,0.7517361111111112,0.367138391479228,0.16881108283996582,0.0
303,12,Naive Bayes,1,0.55,0.6840277777777778,0.7034341761336865,0.1768629550933838,0.0
304,12,KNeighbors Classifier,2,0.55,0.7252173913043478,0.4439331176013182,0.24633264541625977,0.0
305,12,SVC Classifier,2,0.55,0.7617391304347826,0.5617326583032773,0.6739115715026855,0.0
306,12,Decision Tree,2,0.55,0.8591304347826086,0.8867301295099007,0.0017070770263671875,0.0
307,12,RandomForest,2,0.55,0.7356521739130435,0.41354808950411825,0.5212562084197998,0.0
308,12,AdaBoost (Discrete),2,0.55,0.8417391304347827,0.8595882179663128,33.89019966125488,0.0
309,12,AdaBoost (Real),2,0.55,0.8469565217391304,0.7106920617814119,68.75404381752014,0.0
310,12,Logistic Regression (Penalty = L2),2,0.55,0.8382608695652174,0.8340051055773173,0.21504783630371094,0.0
311,12,Naive Bayes,2,0.55,0.7791304347826087,0.6214035074764954,0.07544636726379395,0.6214035074764954
