,feat_set_id,classifier,fold_id,feat_th,score,geo_score,exec_t,geo_score_woz
0,0,KNeighbors Classifier,0,0.95,0.7736,0.5557334893703684,1218.819319486618,0.5557334893703684
1,0,SVC Classifier,0,0.95,0.7795,0.09014398837291854,440.1368131637573,0.09014398837291854
2,0,Decision Tree,0,0.95,0.7199,0.5622580448898494,3.4726006984710693,0.5622580448898494
3,0,RandomForest,0,0.95,0.8038,0.440996177624002,4.439978361129761,0.440996177624002
4,0,AdaBoost (Discrete),0,0.95,0.8092,0.5727415070805113,940.5590839385986,0.5727415070805113
5,0,AdaBoost (Real),0,0.95,0.7843,0.5638889561256943,971.6379415988922,0.5638889561256943
6,0,Logistic Regression (Penalty = L2),0,0.95,0.8065,0.48358057394572007,2.6741292476654053,0.48358057394572007
7,0,Naive Bayes,0,0.95,0.696,0.6694864472870795,0.8757398128509521,0.6694864472870795
8,0,KNeighbors Classifier,1,0.95,0.7731,0.5936237630093872,92.45704674720764,0.5936237630093872
9,0,SVC Classifier,1,0.95,0.7788,1.0,295.31507110595703,0.0
10,0,Decision Tree,1,0.95,0.7268,0.5881451396834672,2.047382116317749,0.5881451396834672
11,0,RandomForest,1,0.95,0.808,0.4606225844239554,2.6221163272857666,0.4606225844239554
12,0,AdaBoost (Discrete),1,0.95,0.8223,0.6182277298901594,783.6261959075928,0.6182277298901594
13,0,AdaBoost (Real),1,0.95,0.7992,0.6116361199922522,888.4173929691315,0.6116361199922522
14,0,Logistic Regression (Penalty = L2),1,0.95,0.8121,0.4953574599275717,2.8572235107421875,0.4953574599275717
15,0,Naive Bayes,1,0.95,0.6224,0.6656842312232755,0.8229455947875977,0.6656842312232755
16,0,KNeighbors Classifier,2,0.95,0.7818,0.5619199313734236,113.04025936126709,0.5619199313734236
17,0,SVC Classifier,2,0.95,0.7788,1.0,380.7488868236542,0.0
18,0,Decision Tree,2,0.95,0.7286,0.5609238755384821,2.4717886447906494,0.5609238755384821
19,0,RandomForest,2,0.95,0.8066,0.4208981873405754,3.5054447650909424,0.4208981873405754
20,0,AdaBoost (Discrete),2,0.95,0.8236,0.5722542043592718,830.8308415412903,0.5722542043592718
21,0,AdaBoost (Real),2,0.95,0.7906,0.5463137515883604,842.9845597743988,0.5463137515883604
22,0,Logistic Regression (Penalty = L2),2,0.95,0.8092,0.45235325947546534,2.4156620502471924,0.45235325947546534
23,0,Naive Bayes,2,0.95,0.7574,0.6897528990820567,0.804950475692749,0.6897528990820567
24,1,KNeighbors Classifier,0,0.95,0.7762,0.5667072771146083,93.00745868682861,0.5667072771146083
25,1,SVC Classifier,0,0.95,0.7795,0.09014398837291854,326.09778094291687,0.09014398837291854
26,1,Decision Tree,0,0.95,0.7217,0.5587758782351503,2.1967520713806152,0.5587758782351503
27,1,RandomForest,0,0.95,0.8036,0.4357193585285388,2.89711856842041,0.4357193585285388
28,1,AdaBoost (Discrete),0,0.95,0.8074,0.5756637698243192,729.4359192848206,0.5756637698243192
29,1,AdaBoost (Real),0,0.95,0.7838,0.5614159981666055,683.8754408359528,0.5614159981666055
30,1,Logistic Regression (Penalty = L2),0,0.95,0.8075,0.4922093724647611,1.9121487140655518,0.4922093724647611
31,1,Naive Bayes,0,0.95,0.6213,0.6444884340220971,0.5530698299407959,0.6444884340220971
32,1,KNeighbors Classifier,1,0.95,0.7759,0.5986129714482878,74.63094520568848,0.5986129714482878
33,1,SVC Classifier,1,0.95,0.7788,1.0,238.35773730278015,0.0
34,1,Decision Tree,1,0.95,0.7249,0.5832591761602125,2.7013790607452393,0.5832591761602125
35,1,RandomForest,1,0.95,0.8104,0.4684673950729155,2.9475698471069336,0.4684673950729155
36,1,AdaBoost (Discrete),1,0.95,0.8221,0.6027552137523234,543.9294731616974,0.6027552137523234
37,1,AdaBoost (Real),1,0.95,0.7928,0.608283375934959,511.8595600128174,0.608283375934959
38,1,Logistic Regression (Penalty = L2),1,0.95,0.8145,0.5102581203403024,1.1974132061004639,0.5102581203403024
39,1,Naive Bayes,1,0.95,0.5472,0.6156371972327037,0.3538665771484375,0.6156371972327037
40,1,KNeighbors Classifier,2,0.95,0.7829,0.5607328581022476,46.639864444732666,0.5607328581022476
41,1,SVC Classifier,2,0.95,0.7788,1.0,171.15374326705933,0.0
42,1,Decision Tree,2,0.95,0.7351,0.5622828222440388,1.39274001121521,0.5622828222440388
43,1,RandomForest,2,0.95,0.808,0.4321489849769338,1.78471040725708,0.4321489849769338
44,1,AdaBoost (Discrete),2,0.95,0.8217,0.5601145940441549,385.7716898918152,0.5601145940441549
45,1,AdaBoost (Real),2,0.95,0.794,0.5489813425474066,354.1421251296997,0.5489813425474066
46,1,Logistic Regression (Penalty = L2),2,0.95,0.8092,0.4500461885360981,0.8067035675048828,0.4500461885360981
47,1,Naive Bayes,2,0.95,0.7187,0.6878148790835418,0.278949499130249,0.6878148790835418
48,2,KNeighbors Classifier,0,0.95,0.7727,0.5527727586352638,43.66760468482971,0.5527727586352638
49,2,SVC Classifier,0,0.95,0.7795,0.09014398837291854,133.90941071510315,0.09014398837291854
50,2,Decision Tree,0,0.95,0.7213,0.5662610157042588,0.9414050579071045,0.5662610157042588
51,2,RandomForest,0,0.95,0.8043,0.46877106425961906,1.1279702186584473,0.46877106425961906
52,2,AdaBoost (Discrete),0,0.95,0.8085,0.5718037445461954,301.37965655326843,0.5718037445461954
53,2,AdaBoost (Real),0,0.95,0.7833,0.5608916384701765,275.39168787002563,0.5608916384701765
54,2,Logistic Regression (Penalty = L2),0,0.95,0.8053,0.47855158537113107,0.7715768814086914,0.47855158537113107
55,2,Naive Bayes,0,0.95,0.6999,0.669068178875443,0.21437978744506836,0.669068178875443
56,2,KNeighbors Classifier,1,0.95,0.7742,0.5905844630505642,33.11198854446411,0.5905844630505642
57,2,SVC Classifier,1,0.95,0.7788,1.0,100.741534948349,0.0
58,2,Decision Tree,1,0.95,0.7293,0.591694925338765,0.6005425453186035,0.591694925338765
59,2,RandomForest,1,0.95,0.8139,0.5000328542152023,0.7593426704406738,0.5000328542152023
60,2,AdaBoost (Discrete),1,0.95,0.8216,0.6118545082393085,204.40797591209412,0.6118545082393085
61,2,AdaBoost (Real),1,0.95,0.7907,0.6000218566930596,216.19212985038757,0.6000218566930596
62,2,Logistic Regression (Penalty = L2),1,0.95,0.8112,0.4930066682155156,0.5690836906433105,0.4930066682155156
63,2,Naive Bayes,1,0.95,0.6219,0.6654425538269252,0.18037986755371094,0.6654425538269252
64,2,KNeighbors Classifier,2,0.95,0.7812,0.5584271325966685,23.362131357192993,0.5584271325966685
65,2,SVC Classifier,2,0.95,0.7788,1.0,81.34068417549133,0.0
66,2,Decision Tree,2,0.95,0.7254,0.5649760121359813,0.5612192153930664,0.5649760121359813
67,2,RandomForest,2,0.95,0.8103,0.45083326282351316,0.6647415161132812,0.45083326282351316
68,2,AdaBoost (Discrete),2,0.95,0.8222,0.571036262961712,188.03842568397522,0.571036262961712
69,2,AdaBoost (Real),2,0.95,0.795,0.5592060028132847,180.3356523513794,0.5592060028132847
70,2,Logistic Regression (Penalty = L2),2,0.95,0.8092,0.45418817824310664,0.5467214584350586,0.45418817824310664
71,2,Naive Bayes,2,0.95,0.7555,0.6903668109526303,0.18159842491149902,0.6903668109526303
72,3,KNeighbors Classifier,0,0.95,0.7746,0.5622471012107899,15.09390640258789,0.5622471012107899
73,3,SVC Classifier,0,0.95,0.7795,0.09014398837291854,60.630146503448486,0.09014398837291854
74,3,Decision Tree,0,0.95,0.73,0.5757427198034087,0.4098317623138428,0.5757427198034087
75,3,RandomForest,0,0.95,0.8039,0.48441711800676385,0.583355188369751,0.48441711800676385
76,3,AdaBoost (Discrete),0,0.95,0.8074,0.5713736551701512,130.74540305137634,0.5713736551701512
77,3,AdaBoost (Real),0,0.95,0.7871,0.5656536172828541,137.03340792655945,0.5656536172828541
78,3,Logistic Regression (Penalty = L2),0,0.95,0.8069,0.489541551341463,0.3575713634490967,0.489541551341463
79,3,Naive Bayes,0,0.95,0.6143,0.6402162775496325,0.16045498847961426,0.6402162775496325
80,3,KNeighbors Classifier,1,0.95,0.7764,0.6002734821872301,14.766589403152466,0.6002734821872301
81,3,SVC Classifier,1,0.95,0.7788,1.0,99.55490040779114,0.0
82,3,Decision Tree,1,0.95,0.7287,0.5935222522341262,0.6592445373535156,0.5935222522341262
83,3,RandomForest,1,0.95,0.8102,0.47278352681615904,0.9398233890533447,0.47278352681615904
84,3,AdaBoost (Discrete),1,0.95,0.8215,0.6018814811189003,239.06241965293884,0.6018814811189003
85,3,AdaBoost (Real),1,0.95,0.7908,0.5976801088257336,289.7847089767456,0.5976801088257336
86,3,Logistic Regression (Penalty = L2),1,0.95,0.8144,0.5102243317682467,0.9617280960083008,0.5102243317682467
87,3,Naive Bayes,1,0.95,0.5471,0.6157384560030331,0.24306750297546387,0.6157384560030331
88,3,KNeighbors Classifier,2,0.95,0.7837,0.5607241621813148,35.73590564727783,0.5607241621813148
89,3,SVC Classifier,2,0.95,0.7788,1.0,126.11650395393372,0.0
90,3,Decision Tree,2,0.95,0.7324,0.5779332719896547,0.8603572845458984,0.5779332719896547
91,3,RandomForest,2,0.95,0.8084,0.43226180288382304,1.2490575313568115,0.43226180288382304
92,3,AdaBoost (Discrete),2,0.95,0.8224,0.5724763101007522,246.65751814842224,0.5724763101007522
93,3,AdaBoost (Real),2,0.95,0.7919,0.5492104819782637,265.70443391799927,0.5492104819782637
94,3,Logistic Regression (Penalty = L2),2,0.95,0.8088,0.44714062909440616,0.8340239524841309,0.44714062909440616
95,3,Naive Bayes,2,0.95,0.7226,0.6888332806906009,0.2680692672729492,0.6888332806906009
96,4,KNeighbors Classifier,0,0.95,0.7736,0.5557334893703684,35.678415298461914,0.5557334893703684
97,4,SVC Classifier,0,0.95,0.7795,0.09014398837291854,126.12042927742004,0.09014398837291854
98,4,Decision Tree,0,0.95,0.7206,0.5653875084447901,0.7933712005615234,0.5653875084447901
99,4,RandomForest,0,0.95,0.8038,0.440996177624002,0.9800469875335693,0.440996177624002
100,4,AdaBoost (Discrete),0,0.95,0.8092,0.5727415070805113,257.83931612968445,0.5727415070805113
101,4,AdaBoost (Real),0,0.95,0.7842,0.5635250393687665,291.10772037506104,0.5635250393687665
102,4,Logistic Regression (Penalty = L2),0,0.95,0.8065,0.48358057394572007,0.903839111328125,0.48358057394572007
103,4,Naive Bayes,0,0.95,0.696,0.6694864472870795,0.25708723068237305,0.6694864472870795
104,4,KNeighbors Classifier,1,0.95,0.7731,0.5936237630093872,41.85455918312073,0.5936237630093872
105,4,SVC Classifier,1,0.95,0.7788,1.0,130.26736521720886,0.0
106,4,Decision Tree,1,0.95,0.7243,0.5872467045868681,0.746551513671875,0.5872467045868681
107,4,RandomForest,1,0.95,0.808,0.4606225844239554,1.0998198986053467,0.4606225844239554
108,4,AdaBoost (Discrete),1,0.95,0.8223,0.6182277298901594,264.48953461647034,0.6182277298901594
109,4,AdaBoost (Real),1,0.95,0.7991,0.6115929360249592,277.8973948955536,0.6115929360249592
110,4,Logistic Regression (Penalty = L2),1,0.95,0.8121,0.4953574599275717,0.9187707901000977,0.4953574599275717
111,4,Naive Bayes,1,0.95,0.6224,0.6656842312232755,0.26641392707824707,0.6656842312232755
112,4,KNeighbors Classifier,2,0.95,0.7818,0.5619199313734236,39.618748903274536,0.5619199313734236
113,4,SVC Classifier,2,0.95,0.7788,1.0,126.58020281791687,0.0
114,4,Decision Tree,2,0.95,0.7277,0.5730394030850597,0.6951980590820312,0.5730394030850597
115,4,RandomForest,2,0.95,0.8066,0.4208981873405754,0.8698973655700684,0.4208981873405754
116,4,AdaBoost (Discrete),2,0.95,0.8236,0.5722542043592718,249.089102268219,0.5722542043592718
117,4,AdaBoost (Real),2,0.95,0.7906,0.5463137515883604,259.21487498283386,0.5463137515883604
118,4,Logistic Regression (Penalty = L2),2,0.95,0.8092,0.45235325947546534,0.6781127452850342,0.45235325947546534
119,4,Naive Bayes,2,0.95,0.7574,0.6897528990820567,0.23484396934509277,0.6897528990820567
120,5,KNeighbors Classifier,0,0.95,0.7762,0.5667072771146083,32.419928312301636,0.5667072771146083
121,5,SVC Classifier,0,0.95,0.7795,0.09014398837291854,109.1895661354065,0.09014398837291854
122,5,Decision Tree,0,0.95,0.7151,0.5692845142317441,0.6402709484100342,0.5692845142317441
123,5,RandomForest,0,0.95,0.8036,0.4357193585285388,0.9630756378173828,0.4357193585285388
124,5,AdaBoost (Discrete),0,0.95,0.8074,0.5756637698243192,245.72880935668945,0.5756637698243192
125,5,AdaBoost (Real),0,0.95,0.7838,0.5614159981666055,255.3434419631958,0.5614159981666055
126,5,Logistic Regression (Penalty = L2),0,0.95,0.8075,0.4922093724647611,0.7508432865142822,0.4922093724647611
127,5,Naive Bayes,0,0.95,0.6213,0.6444884340220971,0.21625638008117676,0.6444884340220971
128,5,KNeighbors Classifier,1,0.95,0.7759,0.5986129714482878,30.990561962127686,0.5986129714482878
129,5,SVC Classifier,1,0.95,0.7788,1.0,101.96466016769409,0.0
130,5,Decision Tree,1,0.95,0.7223,0.5807171708480635,0.628462553024292,0.5807171708480635
131,5,RandomForest,1,0.95,0.8104,0.4684673950729155,0.9459652900695801,0.4684673950729155
132,5,AdaBoost (Discrete),1,0.95,0.8221,0.6027552137523234,232.71006202697754,0.6027552137523234
133,5,AdaBoost (Real),1,0.95,0.7928,0.608283375934959,245.39251065254211,0.608283375934959
134,5,Logistic Regression (Penalty = L2),1,0.95,0.8145,0.5102581203403024,0.5919005870819092,0.5102581203403024
135,5,Naive Bayes,1,0.95,0.5472,0.6156371972327037,0.18362998962402344,0.6156371972327037
136,5,KNeighbors Classifier,2,0.95,0.7829,0.5607328581022476,27.505703449249268,0.5607328581022476
137,5,SVC Classifier,2,0.95,0.7788,1.0,89.63493776321411,0.0
138,5,Decision Tree,2,0.95,0.735,0.5616529320271956,0.6655635833740234,0.5616529320271956
139,5,RandomForest,2,0.95,0.808,0.4321489849769338,0.96097731590271,0.4321489849769338
140,5,AdaBoost (Discrete),2,0.95,0.8217,0.5601145940441549,229.13881254196167,0.5601145940441549
141,5,AdaBoost (Real),2,0.95,0.7942,0.5497443468663497,249.3275763988495,0.5497443468663497
142,5,Logistic Regression (Penalty = L2),2,0.95,0.8092,0.4500461885360981,0.620159387588501,0.4500461885360981
143,5,Naive Bayes,2,0.95,0.7187,0.6878148790835418,0.19581866264343262,0.6878148790835418
144,6,KNeighbors Classifier,0,0.95,0.7727,0.5527727586352638,36.86088252067566,0.5527727586352638
145,6,SVC Classifier,0,0.95,0.7795,0.09014398837291854,113.52737259864807,0.09014398837291854
146,6,Decision Tree,0,0.95,0.7194,0.5656918938079645,0.659583330154419,0.5656918938079645
147,6,RandomForest,0,0.95,0.8043,0.46877106425961906,0.8969602584838867,0.46877106425961906
148,6,AdaBoost (Discrete),0,0.95,0.8085,0.5718037445461954,236.15941905975342,0.5718037445461954
149,6,AdaBoost (Real),0,0.95,0.7833,0.5608916384701765,254.61472177505493,0.5608916384701765
150,6,Logistic Regression (Penalty = L2),0,0.95,0.8053,0.47855158537113107,0.9090752601623535,0.47855158537113107
151,6,Naive Bayes,0,0.95,0.6999,0.669068178875443,0.2495439052581787,0.669068178875443
152,6,KNeighbors Classifier,1,0.95,0.7742,0.5905844630505642,40.335946559906006,0.5905844630505642
153,6,SVC Classifier,1,0.95,0.7788,1.0,116.42646074295044,0.0
154,6,Decision Tree,1,0.95,0.722,0.587228466828371,0.6700847148895264,0.587228466828371
155,6,RandomForest,1,0.95,0.8139,0.5000328542152023,0.8273148536682129,0.5000328542152023
156,6,AdaBoost (Discrete),1,0.95,0.8216,0.6118545082393085,241.13536524772644,0.6118545082393085
157,6,AdaBoost (Real),1,0.95,0.791,0.6001499797999742,260.34975934028625,0.6001499797999742
158,6,Logistic Regression (Penalty = L2),1,0.95,0.8112,0.4930066682155156,0.7851889133453369,0.4930066682155156
159,6,Naive Bayes,1,0.95,0.6219,0.6654425538269252,0.26084017753601074,0.6654425538269252
160,6,KNeighbors Classifier,2,0.95,0.7812,0.5584271325966685,34.167868852615356,0.5584271325966685
161,6,SVC Classifier,2,0.95,0.7788,1.0,115.27287554740906,0.0
162,6,Decision Tree,2,0.95,0.7313,0.569003627868975,0.7497329711914062,0.569003627868975
163,6,RandomForest,2,0.95,0.8103,0.45083326282351316,0.856149435043335,0.45083326282351316
164,6,AdaBoost (Discrete),2,0.95,0.8222,0.571036262961712,237.62108540534973,0.571036262961712
165,6,AdaBoost (Real),2,0.95,0.7951,0.5595796787673223,252.60753965377808,0.5595796787673223
166,6,Logistic Regression (Penalty = L2),2,0.95,0.8092,0.45418817824310664,0.6653144359588623,0.45418817824310664
167,6,Naive Bayes,2,0.95,0.7555,0.6903668109526303,0.2233295440673828,0.6903668109526303
168,7,KNeighbors Classifier,0,0.95,0.7727,0.5527727586352638,33.2327721118927,0.5527727586352638
169,7,SVC Classifier,0,0.95,0.7795,0.09014398837291854,101.31249666213989,0.09014398837291854
170,7,Decision Tree,0,0.95,0.7178,0.5627346110177027,0.5782949924468994,0.5627346110177027
171,7,RandomForest,0,0.95,0.8043,0.46877106425961906,0.8218815326690674,0.46877106425961906
172,7,AdaBoost (Discrete),0,0.95,0.8084,0.571432322782713,238.19646835327148,0.571432322782713
173,7,AdaBoost (Real),0,0.95,0.7833,0.5608916384701765,251.55172610282898,0.5608916384701765
174,7,Logistic Regression (Penalty = L2),0,0.95,0.8053,0.47855158537113107,0.818443775177002,0.47855158537113107
175,7,Naive Bayes,0,0.95,0.6999,0.669068178875443,0.20054888725280762,0.669068178875443
176,7,KNeighbors Classifier,1,0.95,0.7742,0.5905844630505642,35.4628689289093,0.5905844630505642
177,7,SVC Classifier,1,0.95,0.7788,1.0,96.35885286331177,0.0
178,7,Decision Tree,1,0.95,0.7161,0.5831498886871994,0.5578460693359375,0.5831498886871994
179,7,RandomForest,1,0.95,0.8139,0.5000328542152023,0.6989903450012207,0.5000328542152023
180,7,AdaBoost (Discrete),1,0.95,0.8216,0.6118545082393085,214.3159463405609,0.6118545082393085
181,7,AdaBoost (Real),1,0.95,0.791,0.6001499797999742,226.7926185131073,0.6001499797999742
182,7,Logistic Regression (Penalty = L2),1,0.95,0.8112,0.4930066682155156,0.861854076385498,0.4930066682155156
183,7,Naive Bayes,1,0.95,0.6219,0.6654425538269252,0.1920769214630127,0.6654425538269252
184,7,KNeighbors Classifier,2,0.95,0.7812,0.5584271325966685,29.335329055786133,0.5584271325966685
185,7,SVC Classifier,2,0.95,0.7788,1.0,102.2589704990387,0.0
186,7,Decision Tree,2,0.95,0.7306,0.558288498724081,0.6066088676452637,0.558288498724081
187,7,RandomForest,2,0.95,0.8103,0.45083326282351316,0.8632569313049316,0.45083326282351316
188,7,AdaBoost (Discrete),2,0.95,0.8222,0.571036262961712,210.95514917373657,0.571036262961712
189,7,AdaBoost (Real),2,0.95,0.7951,0.5595796787673223,226.05669522285461,0.5595796787673223
190,7,Logistic Regression (Penalty = L2),2,0.95,0.8092,0.45418817824310664,0.7194528579711914,0.45418817824310664
191,7,Naive Bayes,2,0.95,0.7555,0.6903668109526303,0.2462770938873291,0.6903668109526303
192,8,KNeighbors Classifier,0,0.95,0.7746,0.5622471012107899,27.9242000579834,0.5622471012107899
193,8,SVC Classifier,0,0.95,0.7795,0.09014398837291854,96.54041004180908,0.09014398837291854
194,8,Decision Tree,0,0.95,0.7154,0.5650113551663957,0.4728078842163086,0.5650113551663957
195,8,RandomForest,0,0.95,0.8039,0.48441711800676385,0.7837183475494385,0.48441711800676385
196,8,AdaBoost (Discrete),0,0.95,0.8074,0.5713736551701512,150.80358576774597,0.5713736551701512
197,8,AdaBoost (Real),0,0.95,0.7872,0.5660174987082544,163.21065187454224,0.5660174987082544
198,8,Logistic Regression (Penalty = L2),0,0.95,0.8069,0.489541551341463,0.5434887409210205,0.489541551341463
199,8,Naive Bayes,0,0.95,0.6143,0.6402162775496325,0.18584847450256348,0.6402162775496325
200,8,KNeighbors Classifier,1,0.95,0.7764,0.6002734821872301,21.372246742248535,0.6002734821872301
201,8,SVC Classifier,1,0.95,0.7788,1.0,70.14220643043518,0.0
202,8,Decision Tree,1,0.95,0.7256,0.5875870388400597,0.41704559326171875,0.5875870388400597
203,8,RandomForest,1,0.95,0.8102,0.47278352681615904,0.6165192127227783,0.47278352681615904
204,8,AdaBoost (Discrete),1,0.95,0.8215,0.6018814811189003,138.29603576660156,0.6018814811189003
205,8,AdaBoost (Real),1,0.95,0.7908,0.5976801088257336,141.309072971344,0.5976801088257336
206,8,Logistic Regression (Penalty = L2),1,0.95,0.8144,0.5102243317682467,0.48181581497192383,0.5102243317682467
207,8,Naive Bayes,1,0.95,0.5471,0.6157384560030331,0.16098761558532715,0.6157384560030331
208,8,KNeighbors Classifier,2,0.95,0.7837,0.5607241621813148,22.125536680221558,0.5607241621813148
209,8,SVC Classifier,2,0.95,0.7788,1.0,75.43772315979004,0.0
210,8,Decision Tree,2,0.95,0.7409,0.5677156297218269,0.4463348388671875,0.5677156297218269
211,8,RandomForest,2,0.95,0.8084,0.43226180288382304,0.6015257835388184,0.43226180288382304
212,8,AdaBoost (Discrete),2,0.95,0.8224,0.5724763101007522,137.6894407272339,0.5724763101007522
213,8,AdaBoost (Real),2,0.95,0.7917,0.5487918801145977,148.09461545944214,0.5487918801145977
214,8,Logistic Regression (Penalty = L2),2,0.95,0.8088,0.44714062909440616,0.43625807762145996,0.44714062909440616
215,8,Naive Bayes,2,0.95,0.7226,0.6888332806906009,0.1627047061920166,0.6888332806906009
