,feat_set_id,classifier,fold_id,feat_th,score,geo_score,exec_t,geo_score_woz
0,0,KNeighbors Classifier,0,0.7,0.6412478336221837,0.5317673138783903,0.5698161125183105,0.0
1,0,SVC Classifier,0,0.7,0.6845753899480069,0.8129520829107402,0.6834957599639893,0.0
2,0,Decision Tree,0,0.7,0.6377816291161178,0.5069603932607605,0.05113530158996582,0.0
3,0,RandomForest,0,0.7,0.7001733102253033,1.0,0.5280923843383789,0.0
4,0,AdaBoost (Discrete),0,0.7,0.7435008665511266,0.6296561947166893,28.759159564971924,0.0
5,0,AdaBoost (Real),0,0.7,0.7209705372616985,0.587723421417095,40.36260485649109,0.0
6,0,Logistic Regression (Penalty = L2),0,0.7,0.6741767764298093,0.7213751564454057,0.532883882522583,0.0
7,0,Naive Bayes,0,0.7,0.6672443674176777,0.7914018355435688,0.08867835998535156,0.0
8,0,KNeighbors Classifier,1,0.7,0.5798611111111112,0.4289100916671341,0.8402643203735352,0.0
9,0,SVC Classifier,1,0.7,0.7274305555555556,0.7636780043269571,0.9208807945251465,0.0
10,0,Decision Tree,1,0.7,0.6944444444444444,0.47402286211824657,0.13500237464904785,0.47402286211824657
11,0,RandomForest,1,0.7,0.6996527777777778,0.2148885971408009,0.5996828079223633,0.0
12,0,AdaBoost (Discrete),1,0.7,0.7864583333333334,0.3832603266531163,36.59277105331421,0.0
13,0,AdaBoost (Real),1,0.7,0.7256944444444444,0.5829411165200306,40.63386416435242,0.0
14,0,Logistic Regression (Penalty = L2),1,0.7,0.7604166666666666,0.5555347616516378,0.29601192474365234,0.0
15,0,Naive Bayes,1,0.7,0.7829861111111112,0.6820345298093242,0.08301734924316406,0.0
16,0,KNeighbors Classifier,2,0.7,0.7930434782608695,0.49624985883569067,1.0555858612060547,0.0
17,0,SVC Classifier,2,0.7,0.76,0.6431303330664584,1.0658676624298096,0.0
18,0,Decision Tree,2,0.7,0.76,0.5503846876077771,0.11843562126159668,0.5503846876077771
19,0,RandomForest,2,0.7,0.7060869565217391,0.15309310892394862,0.703688383102417,0.0
20,0,AdaBoost (Discrete),2,0.7,0.3582608695652174,0.4782634801856082,36.057711601257324,0.4782634801856082
21,0,AdaBoost (Real),2,0.7,0.24521739130434783,0.3651269580627894,42.86698293685913,0.0
22,0,Logistic Regression (Penalty = L2),2,0.7,0.5878260869565217,0.4939689121928252,0.30808281898498535,0.4939689121928252
23,0,Naive Bayes,2,0.7,0.5478260869565217,0.8392974277582299,0.07568359375,0.0
24,1,KNeighbors Classifier,0,0.7,0.658578856152513,0.552335171587467,0.6915261745452881,0.0
25,1,SVC Classifier,0,0.7,0.6845753899480069,0.8129520829107402,0.8293554782867432,0.0
26,1,Decision Tree,0,0.7,0.6915077989601387,0.5137036471650376,0.0708167552947998,0.0
27,1,RandomForest,0,0.7,0.7001733102253033,1.0,0.5209627151489258,0.0
28,1,AdaBoost (Discrete),0,0.7,0.4904679376083189,0.45750142096989754,35.43768572807312,0.0
29,1,AdaBoost (Real),0,0.7,0.21663778162911612,0.20326950298303628,53.783528089523315,0.0
30,1,Logistic Regression (Penalty = L2),0,0.7,0.6516464471403813,0.6944685089339834,0.4170050621032715,0.0
31,1,Naive Bayes,0,0.7,0.6429809358752167,0.7508927762297288,0.10817503929138184,0.0
32,1,KNeighbors Classifier,1,0.7,0.6215277777777778,0.43097892916169106,0.8399527072906494,0.0
33,1,SVC Classifier,1,0.7,0.7274305555555556,0.7636780043269571,0.9180960655212402,0.0
34,1,Decision Tree,1,0.7,0.7604166666666666,0.39472466349172847,0.0019021034240722656,0.39472466349172847
35,1,RandomForest,1,0.7,0.7274305555555556,0.3535533905932738,0.6518077850341797,0.0
36,1,AdaBoost (Discrete),1,0.7,0.6440972222222222,0.5101775486431266,41.42982769012451,0.0
37,1,AdaBoost (Real),1,0.7,0.3645833333333333,0.3978845263465365,51.29371976852417,0.0
38,1,Logistic Regression (Penalty = L2),1,0.7,0.7447916666666666,0.49525552075780965,0.49768877029418945,0.0
39,1,Naive Bayes,1,0.7,0.7795138888888888,0.6540502707279278,0.1991865634918213,0.0
40,1,KNeighbors Classifier,2,0.7,0.782608695652174,0.4320421363976603,0.9052417278289795,0.0
41,1,SVC Classifier,2,0.7,0.7634782608695653,0.7035061518616564,0.8008828163146973,0.0
42,1,Decision Tree,2,0.7,0.2852173913043478,0.36544178444741726,0.0990138053894043,0.36544178444741726
43,1,RandomForest,2,0.7,0.7095652173913043,0.8929664868390964,0.7139706611633301,0.0
44,1,AdaBoost (Discrete),2,0.7,0.08695652173913043,0.16101465871056037,44.32026982307434,0.0
45,1,AdaBoost (Real),2,0.7,0.23652173913043478,0.327488408701166,56.70474314689636,0.327488408701166
46,1,Logistic Regression (Penalty = L2),2,0.7,0.6313043478260869,0.4258096637678546,0.40772223472595215,0.4258096637678546
47,1,Naive Bayes,2,0.7,0.528695652173913,0.7234770261807716,0.10139608383178711,0.0
48,2,KNeighbors Classifier,0,0.7,0.6568457538994801,0.635797814864237,1.6300606727600098,0.0
49,2,SVC Classifier,0,0.7,0.6845753899480069,0.8129520829107402,1.038728952407837,0.0
50,2,Decision Tree,0,0.7,0.6741767764298093,0.3947386309273556,0.09840583801269531,0.0
51,2,RandomForest,0,0.7,0.7001733102253033,1.0,0.799544095993042,0.0
52,2,AdaBoost (Discrete),0,0.7,0.7521663778162911,0.6944144468157013,48.246214389801025,0.0
53,2,AdaBoost (Real),0,0.7,0.7313691507798961,0.6279488611465976,56.5719780921936,0.0
54,2,Logistic Regression (Penalty = L2),0,0.7,0.6863084922010398,0.7210131717325844,0.6669247150421143,0.0
55,2,Naive Bayes,0,0.7,0.6672443674176777,0.7914018355435688,0.10216712951660156,0.0
56,2,KNeighbors Classifier,1,0.7,0.6961805555555556,0.3630128918050201,1.4001922607421875,0.0
57,2,SVC Classifier,1,0.7,0.7274305555555556,0.7636780043269571,1.5127406120300293,0.0
58,2,Decision Tree,1,0.7,0.7690972222222222,0.7360620424468348,0.09883999824523926,0.0
59,2,RandomForest,1,0.7,0.6996527777777778,1.0,0.8035392761230469,0.0
60,2,AdaBoost (Discrete),1,0.7,0.7517361111111112,0.43129654708987847,47.21081280708313,0.0
61,2,AdaBoost (Real),1,0.7,0.7777777777777778,0.6136183382979365,55.879170656204224,0.0
62,2,Logistic Regression (Penalty = L2),1,0.7,0.7482638888888888,0.6268843050507011,0.43853259086608887,0.0
63,2,Naive Bayes,1,0.7,0.7829861111111112,0.6820345298093242,0.09757184982299805,0.0
64,2,KNeighbors Classifier,2,0.7,0.8330434782608696,0.7552608308349611,1.7162115573883057,0.7552608308349611
65,2,SVC Classifier,2,0.7,0.7356521739130435,0.6012871326420459,1.2093820571899414,0.0
66,2,Decision Tree,2,0.7,0.7495652173913043,0.3576791347466741,0.09588956832885742,0.3576791347466741
67,2,RandomForest,2,0.7,0.7008695652173913,1.0,0.6714072227478027,0.0
68,2,AdaBoost (Discrete),2,0.7,0.3652173913043478,0.49979308913426346,49.55862784385681,0.49979308913426346
69,2,AdaBoost (Real),2,0.7,0.4956521739130435,0.4877721037836525,56.86418342590332,0.4877721037836525
70,2,Logistic Regression (Penalty = L2),2,0.7,0.6052173913043478,0.52602626583304,0.33683204650878906,0.52602626583304
71,2,Naive Bayes,2,0.7,0.5478260869565217,0.8392974277582299,0.10527777671813965,0.0
72,3,KNeighbors Classifier,0,0.7,0.8474870017331022,0.5028156476471782,0.8165829181671143,0.0
73,3,SVC Classifier,0,0.7,0.6845753899480069,0.8129520829107402,0.9623644351959229,0.0
74,3,Decision Tree,0,0.7,0.82842287694974,0.5866288510833652,0.08716106414794922,0.0
75,3,RandomForest,0,0.7,0.7001733102253033,1.0,0.7824914455413818,0.0
76,3,AdaBoost (Discrete),0,0.7,0.804159445407279,0.6896016823299717,56.23069095611572,0.0
77,3,AdaBoost (Real),0,0.7,0.7989601386481803,0.6638293255126994,60.04790234565735,0.0
78,3,Logistic Regression (Penalty = L2),0,0.7,0.8145580589254766,0.79184034919538,0.44447779655456543,0.0
79,3,Naive Bayes,0,0.7,0.6239168110918544,0.715691883119022,0.22493457794189453,0.0
80,3,KNeighbors Classifier,1,0.7,0.8454861111111112,0.6424761748173966,0.9787709712982178,0.0
81,3,SVC Classifier,1,0.7,0.7621527777777778,0.8048829346318248,1.0935924053192139,0.0
82,3,Decision Tree,1,0.7,0.7447916666666666,0.5016114636969278,0.10645294189453125,0.0
83,3,RandomForest,1,0.7,0.6996527777777778,1.0,0.8102655410766602,0.0
84,3,AdaBoost (Discrete),1,0.7,0.7621527777777778,0.45815255394636895,48.910155057907104,0.0
85,3,AdaBoost (Real),1,0.7,0.703125,0.43863808096689527,59.384777784347534,0.0
86,3,Logistic Regression (Penalty = L2),1,0.7,0.7256944444444444,0.42715941874798585,0.49854207038879395,0.0
87,3,Naive Bayes,1,0.7,0.703125,0.7460503702454486,0.10924839973449707,0.0
88,3,KNeighbors Classifier,2,0.7,0.7808695652173913,0.6075786988067915,1.08021879196167,0.0
89,3,SVC Classifier,2,0.7,0.7460869565217392,0.5730588119775418,1.0184831619262695,0.0
90,3,Decision Tree,2,0.7,0.7339130434782609,0.5321459467025488,0.10706162452697754,0.0
91,3,RandomForest,2,0.7,0.7008695652173913,1.0,0.651796817779541,0.0
92,3,AdaBoost (Discrete),2,0.7,0.42434782608695654,0.5109752727677275,38.950971364974976,0.0
93,3,AdaBoost (Real),2,0.7,0.5739130434782609,0.6015919838095493,40.63052940368652,0.6015919838095493
94,3,Logistic Regression (Penalty = L2),2,0.7,0.6730434782608695,0.5144288976443118,0.048433542251586914,0.5144288976443118
95,3,Naive Bayes,2,0.7,0.4782608695652174,0.7962895022318469,0.026058673858642578,0.0
96,4,KNeighbors Classifier,0,0.7,0.658578856152513,0.552335171587467,0.20121359825134277,0.0
97,4,SVC Classifier,0,0.7,0.6845753899480069,0.8129520829107402,0.26438426971435547,0.0
98,4,Decision Tree,0,0.7,0.7365684575389948,0.5534508405980612,0.0026857852935791016,0.0
99,4,RandomForest,0,0.7,0.7001733102253033,1.0,0.7736709117889404,0.0
100,4,AdaBoost (Discrete),0,0.7,0.4904679376083189,0.45750142096989754,41.91236710548401,0.0
101,4,AdaBoost (Real),0,0.7,0.21663778162911612,0.20326950298303628,38.965824842453,0.0
102,4,Logistic Regression (Penalty = L2),0,0.7,0.6516464471403813,0.6944685089339834,0.4136826992034912,0.0
103,4,Naive Bayes,0,0.7,0.6429809358752167,0.7508927762297288,0.10881829261779785,0.0
104,4,KNeighbors Classifier,1,0.7,0.6215277777777778,0.43097892916169106,0.8632876873016357,0.0
105,4,SVC Classifier,1,0.7,0.7274305555555556,0.7636780043269571,1.1825215816497803,0.0
106,4,Decision Tree,1,0.7,0.6041666666666666,0.41568009496759645,0.09505057334899902,0.41568009496759645
107,4,RandomForest,1,0.7,0.7274305555555556,0.3535533905932738,0.7853138446807861,0.0
108,4,AdaBoost (Discrete),1,0.7,0.6440972222222222,0.5101775486431266,75.68597793579102,0.0
109,4,AdaBoost (Real),1,0.7,0.3732638888888889,0.40496580395563037,121.20089221000671,0.0
110,4,Logistic Regression (Penalty = L2),1,0.7,0.7447916666666666,0.49525552075780965,1.0655877590179443,0.0
111,4,Naive Bayes,1,0.7,0.7795138888888888,0.6540502707279278,0.2015073299407959,0.0
112,4,KNeighbors Classifier,2,0.7,0.782608695652174,0.4320421363976603,2.546363353729248,0.0
113,4,SVC Classifier,2,0.7,0.7634782608695653,0.7035061518616564,2.5002715587615967,0.0
114,4,Decision Tree,2,0.7,0.7356521739130435,0.43957523392428466,0.21107149124145508,0.43957523392428466
115,4,RandomForest,2,0.7,0.7095652173913043,0.8929664868390964,1.0739219188690186,0.0
116,4,AdaBoost (Discrete),2,0.7,0.11652173913043479,0.2253562689035162,93.78046417236328,0.2253562689035162
117,4,AdaBoost (Real),2,0.7,0.22782608695652173,0.30648286822138565,117.86025381088257,0.30648286822138565
118,4,Logistic Regression (Penalty = L2),2,0.7,0.6313043478260869,0.4258096637678546,0.8499727249145508,0.4258096637678546
119,4,Naive Bayes,2,0.7,0.528695652173913,0.7234770261807716,0.36919116973876953,0.0
120,5,KNeighbors Classifier,0,0.7,0.6412478336221837,0.5317673138783903,1.9543051719665527,0.0
121,5,SVC Classifier,0,0.7,0.6845753899480069,0.8129520829107402,1.7258021831512451,0.0
122,5,Decision Tree,0,0.7,0.7383015597920277,0.6546443199423838,0.18703413009643555,0.0
123,5,RandomForest,0,0.7,0.7001733102253033,1.0,1.3106787204742432,0.0
124,5,AdaBoost (Discrete),0,0.7,0.7435008665511266,0.6235309029471434,95.52528667449951,0.0
125,5,AdaBoost (Real),0,0.7,0.707105719237435,0.582920563852312,116.171804189682,0.0
126,5,Logistic Regression (Penalty = L2),0,0.7,0.6741767764298093,0.7213751564454057,0.8936071395874023,0.0
127,5,Naive Bayes,0,0.7,0.6672443674176777,0.7914018355435688,0.21777772903442383,0.0
128,5,KNeighbors Classifier,1,0.7,0.5798611111111112,0.4289100916671341,2.5146894454956055,0.0
129,5,SVC Classifier,1,0.7,0.7274305555555556,0.7636780043269571,2.482348680496216,0.0
130,5,Decision Tree,1,0.7,0.7621527777777778,0.5648126044727336,0.21922802925109863,0.0
131,5,RandomForest,1,0.7,0.6996527777777778,0.2148885971408009,1.5795271396636963,0.0
132,5,AdaBoost (Discrete),1,0.7,0.7864583333333334,0.3832603266531163,95.01927137374878,0.0
133,5,AdaBoost (Real),1,0.7,0.7777777777777778,0.6004572360003874,71.88920760154724,0.0
134,5,Logistic Regression (Penalty = L2),1,0.7,0.7604166666666666,0.5555347616516378,0.386521577835083,0.0
135,5,Naive Bayes,1,0.7,0.7829861111111112,0.6820345298093242,0.22187113761901855,0.0
136,5,KNeighbors Classifier,2,0.7,0.7930434782608695,0.49624985883569067,1.1072108745574951,0.0
137,5,SVC Classifier,2,0.7,0.76,0.6431303330664584,1.1374809741973877,0.0
138,5,Decision Tree,2,0.7,0.26608695652173914,0.3320900547809518,0.09921407699584961,0.3320900547809518
139,5,RandomForest,2,0.7,0.7060869565217391,0.15309310892394862,0.794029951095581,0.0
140,5,AdaBoost (Discrete),2,0.7,0.3582608695652174,0.4782634801856082,49.751057624816895,0.4782634801856082
141,5,AdaBoost (Real),2,0.7,0.38782608695652177,0.40056293892069006,64.25109934806824,0.40056293892069006
142,5,Logistic Regression (Penalty = L2),2,0.7,0.5878260869565217,0.4939689121928252,0.4717106819152832,0.4939689121928252
143,5,Naive Bayes,2,0.7,0.5478260869565217,0.8392974277582299,0.1209251880645752,0.0
144,6,KNeighbors Classifier,0,0.7,0.8405545927209706,0.6218715553815801,0.6780910491943359,0.0
145,6,SVC Classifier,0,0.7,0.6845753899480069,0.8129520829107402,1.2002856731414795,0.0
146,6,Decision Tree,0,0.7,0.8613518197573656,0.6810793075951989,0.1188814640045166,0.0
147,6,RandomForest,0,0.7,0.7001733102253033,1.0,0.839684009552002,0.0
148,6,AdaBoost (Discrete),0,0.7,0.8128249566724437,0.6728161503862766,51.51400136947632,0.0
149,6,AdaBoost (Real),0,0.7,0.7902946273830156,0.66438072868665,63.51673626899719,0.0
150,6,Logistic Regression (Penalty = L2),0,0.7,0.8093587521663779,0.7887572472247117,0.6412529945373535,0.0
151,6,Naive Bayes,0,0.7,0.6239168110918544,0.715691883119022,0.12081480026245117,0.0
152,6,KNeighbors Classifier,1,0.7,0.8368055555555556,0.5995761098529245,0.720780611038208,0.0
153,6,SVC Classifier,1,0.7,0.7864583333333334,0.8272367977810088,1.2574818134307861,0.0
154,6,Decision Tree,1,0.7,0.7135416666666666,0.4587911582138497,0.11351251602172852,0.0
155,6,RandomForest,1,0.7,0.6996527777777778,1.0,0.7748079299926758,0.0
156,6,AdaBoost (Discrete),1,0.7,0.7430555555555556,0.4453674258743815,53.01146078109741,0.0
157,6,AdaBoost (Real),1,0.7,0.6649305555555556,0.40523606999947637,65.46130752563477,0.0
158,6,Logistic Regression (Penalty = L2),1,0.7,0.7638888888888888,0.5874287808097735,0.779761791229248,0.0
159,6,Naive Bayes,1,0.7,0.703125,0.7460503702454486,0.12074017524719238,0.0
160,6,KNeighbors Classifier,2,0.7,0.7582608695652174,0.5155956755543233,0.9602069854736328,0.0
161,6,SVC Classifier,2,0.7,0.7460869565217392,0.5954229891263427,1.0765411853790283,0.0
162,6,Decision Tree,2,0.7,0.64,0.4855054360112483,0.00182342529296875,0.0
163,6,RandomForest,2,0.7,0.7008695652173913,1.0,0.8727898597717285,0.0
164,6,AdaBoost (Discrete),2,0.7,0.37565217391304345,0.41928206402789586,53.26313495635986,0.0
165,6,AdaBoost (Real),2,0.7,0.2608695652173913,0.37654449848486055,62.24916315078735,0.0
166,6,Logistic Regression (Penalty = L2),2,0.7,0.7043478260869566,0.5213665838981704,0.7892665863037109,0.5213665838981704
167,6,Naive Bayes,2,0.7,0.4782608695652174,0.7962895022318469,0.11668848991394043,0.0
168,7,KNeighbors Classifier,0,0.7,0.658578856152513,0.552335171587467,0.9222605228424072,0.0
169,7,SVC Classifier,0,0.7,0.6845753899480069,0.8129520829107402,1.1241569519042969,0.0
170,7,Decision Tree,0,0.7,0.6741767764298093,0.4647735942599077,0.11419796943664551,0.0
171,7,RandomForest,0,0.7,0.7001733102253033,1.0,0.922985315322876,0.0
172,7,AdaBoost (Discrete),0,0.7,0.4904679376083189,0.45750142096989754,53.573055028915405,0.0
173,7,AdaBoost (Real),0,0.7,0.21663778162911612,0.20326950298303628,64.45178484916687,0.0
174,7,Logistic Regression (Penalty = L2),0,0.7,0.6516464471403813,0.6944685089339834,0.27996063232421875,0.0
175,7,Naive Bayes,0,0.7,0.6429809358752167,0.7508927762297288,0.2251734733581543,0.0
176,7,KNeighbors Classifier,1,0.7,0.6215277777777778,0.43097892916169106,1.0019497871398926,0.0
177,7,SVC Classifier,1,0.7,0.7274305555555556,0.7636780043269571,1.1637213230133057,0.0
178,7,Decision Tree,1,0.7,0.7986111111111112,0.5812820254570997,0.1110849380493164,0.0
179,7,RandomForest,1,0.7,0.7274305555555556,0.3535533905932738,0.7897443771362305,0.0
180,7,AdaBoost (Discrete),1,0.7,0.6440972222222222,0.5101775486431266,50.567530155181885,0.0
181,7,AdaBoost (Real),1,0.7,0.328125,0.36496164348214727,60.76343584060669,0.0
182,7,Logistic Regression (Penalty = L2),1,0.7,0.7447916666666666,0.49525552075780965,0.4759957790374756,0.0
183,7,Naive Bayes,1,0.7,0.7795138888888888,0.6540502707279278,0.10832762718200684,0.0
184,7,KNeighbors Classifier,2,0.7,0.782608695652174,0.4320421363976603,1.1442089080810547,0.0
185,7,SVC Classifier,2,0.7,0.7634782608695653,0.7035061518616564,0.9224953651428223,0.0
186,7,Decision Tree,2,0.7,0.6539130434782608,0.65521980155955,0.10669779777526855,0.65521980155955
187,7,RandomForest,2,0.7,0.7095652173913043,0.8929664868390964,0.7151181697845459,0.0
188,7,AdaBoost (Discrete),2,0.7,0.11652173913043479,0.2253562689035162,46.889641523361206,0.2253562689035162
189,7,AdaBoost (Real),2,0.7,0.20521739130434782,0.2499212008930899,57.4012348651886,0.0
190,7,Logistic Regression (Penalty = L2),2,0.7,0.6313043478260869,0.4258096637678546,0.3949096202850342,0.4258096637678546
191,7,Naive Bayes,2,0.7,0.528695652173913,0.7234770261807716,0.09580874443054199,0.0
192,8,KNeighbors Classifier,0,0.7,0.8145580589254766,0.5724912494584015,0.4053151607513428,0.0
193,8,SVC Classifier,0,0.7,0.6845753899480069,0.8129520829107402,0.9276776313781738,0.0
194,8,Decision Tree,0,0.7,0.8180242634315424,0.6061487993124353,0.10309171676635742,0.0
195,8,RandomForest,0,0.7,0.7261698440207972,0.5648671314898963,0.6289350986480713,0.0
196,8,AdaBoost (Discrete),0,0.7,0.4904679376083189,0.5170493425695564,45.795226097106934,0.0
197,8,AdaBoost (Real),0,0.7,0.2270363951473137,0.2097878018695395,58.09205412864685,0.0
198,8,Logistic Regression (Penalty = L2),0,0.7,0.7989601386481803,0.6772411912960691,0.38936781883239746,0.0
199,8,Naive Bayes,0,0.7,0.5805892547660312,0.6192878878744241,0.10831737518310547,0.0
200,8,KNeighbors Classifier,1,0.7,0.7795138888888888,0.5091814037166411,0.6248884201049805,0.0
201,8,SVC Classifier,1,0.7,0.78125,0.7990572919580082,0.9336466789245605,0.0
202,8,Decision Tree,1,0.7,0.7222222222222222,0.4595893554729374,0.09917521476745605,0.0
203,8,RandomForest,1,0.7,0.6996527777777778,1.0,0.8229105472564697,0.0
204,8,AdaBoost (Discrete),1,0.7,0.5850694444444444,0.4846249242988852,45.14010524749756,0.0
205,8,AdaBoost (Real),1,0.7,0.3645833333333333,0.2647274485925808,56.40021896362305,0.0
206,8,Logistic Regression (Penalty = L2),1,0.7,0.7309027777777778,0.6198297312824206,0.45636510848999023,0.0
207,8,Naive Bayes,1,0.7,0.6840277777777778,0.7034341761336865,0.11594057083129883,0.0
208,8,KNeighbors Classifier,2,0.7,0.7495652173913043,0.4903586796053695,0.648937463760376,0.0
209,8,SVC Classifier,2,0.7,0.7582608695652174,0.7006482951515399,1.1854002475738525,0.0
210,8,Decision Tree,2,0.7,0.7373913043478261,0.46149214623469476,0.1069037914276123,0.0
211,8,RandomForest,2,0.7,0.7252173913043478,0.24596703670154926,0.6988601684570312,0.0
212,8,AdaBoost (Discrete),2,0.7,0.08869565217391304,0.16241485645850362,46.4690043926239,0.0
213,8,AdaBoost (Real),2,0.7,0.10086956521739131,0.18749425586667126,55.92441391944885,0.0
214,8,Logistic Regression (Penalty = L2),2,0.7,0.671304347826087,0.4335701799040503,0.3475480079650879,0.4335701799040503
215,8,Naive Bayes,2,0.7,0.46608695652173915,0.6897771060056679,0.09566831588745117,0.0
216,9,KNeighbors Classifier,0,0.7,0.8474870017331022,0.5028156476471782,0.8614621162414551,0.0
217,9,SVC Classifier,0,0.7,0.6845753899480069,0.8129520829107402,1.0834739208221436,0.0
218,9,Decision Tree,0,0.7,0.8024263431542461,0.5051779654213504,0.10658860206604004,0.0
219,9,RandomForest,0,0.7,0.7001733102253033,1.0,0.8513073921203613,0.0
220,9,AdaBoost (Discrete),0,0.7,0.804159445407279,0.6896016823299717,46.35566186904907,0.0
221,9,AdaBoost (Real),0,0.7,0.8006932409012132,0.6904103206332113,56.32536697387695,0.0
222,9,Logistic Regression (Penalty = L2),0,0.7,0.8145580589254766,0.79184034919538,0.4993271827697754,0.0
223,9,Naive Bayes,0,0.7,0.6239168110918544,0.715691883119022,0.11579537391662598,0.0
224,9,KNeighbors Classifier,1,0.7,0.8454861111111112,0.6424761748173966,0.8935489654541016,0.0
225,9,SVC Classifier,1,0.7,0.7621527777777778,0.8048829346318248,1.1587011814117432,0.0
226,9,Decision Tree,1,0.7,0.7239583333333334,0.5012376288113232,0.0020220279693603516,0.0
227,9,RandomForest,1,0.7,0.6996527777777778,1.0,0.7296197414398193,0.0
228,9,AdaBoost (Discrete),1,0.7,0.7621527777777778,0.45815255394636895,47.393474102020264,0.0
229,9,AdaBoost (Real),1,0.7,0.6979166666666666,0.5638996067533109,56.17098546028137,0.0
230,9,Logistic Regression (Penalty = L2),1,0.7,0.7256944444444444,0.42715941874798585,0.38768768310546875,0.0
231,9,Naive Bayes,1,0.7,0.703125,0.7460503702454486,0.10142970085144043,0.0
232,9,KNeighbors Classifier,2,0.7,0.7808695652173913,0.6075786988067915,0.9662454128265381,0.0
233,9,SVC Classifier,2,0.7,0.7460869565217392,0.5730588119775418,1.0389821529388428,0.0
234,9,Decision Tree,2,0.7,0.6991304347826087,0.3309623982468355,0.10228466987609863,0.3309623982468355
235,9,RandomForest,2,0.7,0.7008695652173913,1.0,0.7348537445068359,0.0
236,9,AdaBoost (Discrete),2,0.7,0.43130434782608695,0.5146122298445023,46.24416542053223,0.0
237,9,AdaBoost (Real),2,0.7,0.5269565217391304,0.5621715646151254,57.2869668006897,0.5621715646151254
238,9,Logistic Regression (Penalty = L2),2,0.7,0.6730434782608695,0.5144288976443118,0.4282379150390625,0.5144288976443118
239,9,Naive Bayes,2,0.7,0.4782608695652174,0.7962895022318469,0.10839509963989258,0.0
240,10,KNeighbors Classifier,0,0.7,0.6447140381282496,0.4224977729790333,1.256119728088379,0.0
241,10,SVC Classifier,0,0.7,0.6845753899480069,0.8129520829107402,1.2599842548370361,0.0
242,10,Decision Tree,0,0.7,0.8214904679376083,0.5523639825609472,0.10312557220458984,0.0
243,10,RandomForest,0,0.7,0.7261698440207972,0.5648671314898963,0.7324082851409912,0.0
244,10,AdaBoost (Discrete),0,0.7,0.7175043327556326,0.6075665456619013,46.878026247024536,0.0
245,10,AdaBoost (Real),0,0.7,0.729636048526863,0.621434847685018,55.60130000114441,0.0
246,10,Logistic Regression (Penalty = L2),0,0.7,0.6880415944540728,0.2869599175073888,0.43085503578186035,0.0
247,10,Naive Bayes,0,0.7,0.6672443674176777,0.7914018355435688,0.12926793098449707,0.0
248,10,KNeighbors Classifier,1,0.7,0.6857638888888888,0.5284134209839263,1.3366937637329102,0.0
249,10,SVC Classifier,1,0.7,0.7274305555555556,0.7636780043269571,1.301131248474121,0.0
250,10,Decision Tree,1,0.7,0.6684027777777778,0.3511266523346786,0.10316872596740723,0.0
251,10,RandomForest,1,0.7,0.7152777777777778,0.3504693768635238,0.7940599918365479,0.0
252,10,AdaBoost (Discrete),1,0.7,0.7795138888888888,0.5470927187396201,41.41354012489319,0.0
253,10,AdaBoost (Real),1,0.7,0.8038194444444444,0.6532149565741712,48.104782819747925,0.0
254,10,Logistic Regression (Penalty = L2),1,0.7,0.7465277777777778,0.6237020964135888,0.3715529441833496,0.0
255,10,Naive Bayes,1,0.7,0.7829861111111112,0.6820345298093242,0.21903061866760254,0.0
256,10,KNeighbors Classifier,2,0.7,0.7982608695652174,0.5361136739493405,1.2305474281311035,0.5361136739493405
257,10,SVC Classifier,2,0.7,0.7321739130434782,0.5996729360851237,1.032057285308838,0.0
258,10,Decision Tree,2,0.7,0.7130434782608696,0.6357373543212734,0.10268521308898926,0.6357373543212734
259,10,RandomForest,2,0.7,0.7182608695652174,0.2795084971874737,0.8997132778167725,0.0
260,10,AdaBoost (Discrete),2,0.7,0.38956521739130434,0.47791390929704813,41.37844395637512,0.47791390929704813
261,10,AdaBoost (Real),2,0.7,0.4852173913043478,0.5436696697781048,55.46936511993408,0.5436696697781048
262,10,Logistic Regression (Penalty = L2),2,0.7,0.5460869565217391,0.5096429924082122,0.40437912940979004,0.5096429924082122
263,10,Naive Bayes,2,0.7,0.5478260869565217,0.8392974277582299,0.24116039276123047,0.0
264,11,KNeighbors Classifier,0,0.7,0.6568457538994801,0.635797814864237,1.4700767993927002,0.0
265,11,SVC Classifier,0,0.7,0.6845753899480069,0.8129520829107402,1.407031536102295,0.0
266,11,Decision Tree,0,0.7,0.6325823223570191,0.23571164288298738,0.10334444046020508,0.0
267,11,RandomForest,0,0.7,0.7001733102253033,1.0,0.8036379814147949,0.0
268,11,AdaBoost (Discrete),0,0.7,0.7521663778162911,0.6944144468157013,47.77509903907776,0.0
269,11,AdaBoost (Real),0,0.7,0.7313691507798961,0.6220896794104745,58.15977668762207,0.0
270,11,Logistic Regression (Penalty = L2),0,0.7,0.6863084922010398,0.7210131717325844,0.43457579612731934,0.0
271,11,Naive Bayes,0,0.7,0.6672443674176777,0.7914018355435688,0.10196971893310547,0.0
272,11,KNeighbors Classifier,1,0.7,0.6961805555555556,0.3630128918050201,1.4211246967315674,0.0
273,11,SVC Classifier,1,0.7,0.7274305555555556,0.7636780043269571,1.6105377674102783,0.0
274,11,Decision Tree,1,0.7,0.6996527777777778,0.5584404290852446,0.1024026870727539,0.0
275,11,RandomForest,1,0.7,0.6996527777777778,1.0,0.5979001522064209,0.0
276,11,AdaBoost (Discrete),1,0.7,0.7517361111111112,0.43129654708987847,47.273327112197876,0.0
277,11,AdaBoost (Real),1,0.7,0.7690972222222222,0.5572880389795307,52.864264249801636,0.0
278,11,Logistic Regression (Penalty = L2),1,0.7,0.7482638888888888,0.6268843050507011,0.35341382026672363,0.0
279,11,Naive Bayes,1,0.7,0.7829861111111112,0.6820345298093242,0.09881472587585449,0.0
280,11,KNeighbors Classifier,2,0.7,0.8330434782608696,0.7552608308349611,1.6250877380371094,0.7552608308349611
281,11,SVC Classifier,2,0.7,0.7356521739130435,0.6012871326420459,1.2351384162902832,0.0
282,11,Decision Tree,2,0.7,0.4330434782608696,0.34050967714647484,0.10999584197998047,0.34050967714647484
283,11,RandomForest,2,0.7,0.7008695652173913,1.0,0.67120361328125,0.0
284,11,AdaBoost (Discrete),2,0.7,0.3634782608695652,0.49891083840597705,45.734110832214355,0.49891083840597705
285,11,AdaBoost (Real),2,0.7,0.5304347826086957,0.5946496597352795,53.133920669555664,0.5946496597352795
286,11,Logistic Regression (Penalty = L2),2,0.7,0.6052173913043478,0.52602626583304,0.362947940826416,0.52602626583304
287,11,Naive Bayes,2,0.7,0.5478260869565217,0.8392974277582299,0.17788434028625488,0.0
288,12,KNeighbors Classifier,0,0.7,0.8145580589254766,0.5724912494584015,0.37226128578186035,0.0
289,12,SVC Classifier,0,0.7,0.6845753899480069,0.8129520829107402,0.8466660976409912,0.0
290,12,Decision Tree,0,0.7,0.8180242634315424,0.6315130506291561,0.09088540077209473,0.0
291,12,RandomForest,0,0.7,0.7261698440207972,0.5648671314898963,0.568291187286377,0.0
292,12,AdaBoost (Discrete),0,0.7,0.4904679376083189,0.5170493425695564,39.43497347831726,0.0
293,12,AdaBoost (Real),0,0.7,0.23570190641247835,0.2748997881797984,48.553465604782104,0.0
294,12,Logistic Regression (Penalty = L2),0,0.7,0.7989601386481803,0.6772411912960691,0.31890130043029785,0.0
295,12,Naive Bayes,0,0.7,0.5805892547660312,0.6192878878744241,0.07732748985290527,0.0
296,12,KNeighbors Classifier,1,0.7,0.7795138888888888,0.5091814037166411,0.5226573944091797,0.0
297,12,SVC Classifier,1,0.7,0.78125,0.7990572919580082,0.7034573554992676,0.0
298,12,Decision Tree,1,0.7,0.7083333333333334,0.4291111747212836,0.0947408676147461,0.0
299,12,RandomForest,1,0.7,0.6996527777777778,1.0,0.6931374073028564,0.0
300,12,AdaBoost (Discrete),1,0.7,0.5850694444444444,0.4846249242988852,36.10644602775574,0.0
301,12,AdaBoost (Real),1,0.7,0.3090277777777778,0.31853992743885695,41.882359743118286,0.0
302,12,Logistic Regression (Penalty = L2),1,0.7,0.7309027777777778,0.6198297312824206,0.25141143798828125,0.0
303,12,Naive Bayes,1,0.7,0.6840277777777778,0.7034341761336865,0.07260704040527344,0.0
304,12,KNeighbors Classifier,2,0.7,0.7495652173913043,0.4903586796053695,0.5615670680999756,0.0
305,12,SVC Classifier,2,0.7,0.7582608695652174,0.7006482951515399,0.7184443473815918,0.0
306,12,Decision Tree,2,0.7,0.7165217391304348,0.45670950000507576,0.0024805068969726562,0.0
307,12,RandomForest,2,0.7,0.7252173913043478,0.24596703670154926,0.5151076316833496,0.0
308,12,AdaBoost (Discrete),2,0.7,0.08869565217391304,0.16241485645850362,30.447734117507935,0.0
309,12,AdaBoost (Real),2,0.7,0.10086956521739131,0.18749425586667126,37.53382182121277,0.0
310,12,Logistic Regression (Penalty = L2),2,0.7,0.671304347826087,0.4335701799040503,0.2375941276550293,0.4335701799040503
311,12,Naive Bayes,2,0.7,0.46608695652173915,0.6897771060056679,0.05968213081359863,0.0
