,feat_set_id,classifier,fold_id,feat_th,score,geo_score,exec_t,geo_score_woz
0,0,KNeighbors Classifier,0,0.05,0.453,0.49704450502265307,59.03427290916443,0.49704450502265307
1,0,SVC Classifier,0,0.05,0.7795,0.09014398837291854,1210.576622724533,0.09014398837291854
2,0,Decision Tree,0,0.05,0.8087,0.5399942204299294,0.09361124038696289,0.5399942204299294
3,0,RandomForest,0,0.05,0.8031,0.45868793940557906,0.22403240203857422,0.45868793940557906
4,0,AdaBoost (Discrete),0,0.05,0.809,0.5426281056022232,150.46368598937988,0.5426281056022232
5,0,AdaBoost (Real),0,0.05,0.8088,0.541475122779432,1332.647471189499,0.541475122779432
6,0,Logistic Regression (Penalty = L2),0,0.05,0.8031,0.4618062302747353,0.9479780197143555,0.4618062302747353
7,0,Naive Bayes,0,0.05,0.7987,0.6128809750946417,0.41266465187072754,0.6128809750946417
8,0,KNeighbors Classifier,1,0.05,0.6211,0.4148293367289105,35.552173376083374,0.4148293367289105
9,0,SVC Classifier,1,0.05,0.7788,1.0,134.59351015090942,0.0
10,0,Decision Tree,1,0.05,0.8254,0.5870325605476784,0.3010573387145996,0.5870325605476784
11,0,RandomForest,1,0.05,0.8122,0.49291982489552855,1.5900490283966064,0.49291982489552855
12,0,AdaBoost (Discrete),1,0.05,0.825,0.5785533636821976,101.5949809551239,0.5785533636821976
13,0,AdaBoost (Real),1,0.05,0.8254,0.5880194354845573,764.0283894538879,0.5880194354845573
14,0,Logistic Regression (Penalty = L2),1,0.05,0.8123,0.4933653015566221,0.5974917411804199,0.4933653015566221
15,0,Naive Bayes,1,0.05,0.813,0.6579739274509033,0.30233025550842285,0.6579739274509033
16,0,KNeighbors Classifier,2,0.05,0.7111,0.3583258941737551,28.996647119522095,0.3583258941737551
17,0,SVC Classifier,2,0.05,0.7788,1.0,93.24983525276184,0.0
18,0,Decision Tree,2,0.05,0.823,0.5499084112747326,0.2648458480834961,0.5499084112747326
19,0,RandomForest,2,0.05,0.8122,0.4672526082648893,1.297370433807373,0.4672526082648893
20,0,AdaBoost (Discrete),2,0.05,0.8231,0.5463129546800016,81.57758331298828,0.5463129546800016
21,0,AdaBoost (Real),2,0.05,0.8228,0.5505575376209837,773.6021654605865,0.5505575376209837
22,0,Logistic Regression (Penalty = L2),2,0.05,0.8122,0.46769559972944375,0.7539575099945068,0.46769559972944375
23,0,Naive Bayes,2,0.05,0.8198,0.6373842013740348,0.29931116104125977,0.6373842013740348
24,1,KNeighbors Classifier,0,0.05,0.7528,0.5069345903313763,7.9286932945251465,0.5069345903313763
25,1,SVC Classifier,0,0.05,0.7788,1.0,137.67166471481323,0.0
26,1,Decision Tree,0,0.05,0.7709,0.5186009450516573,0.6793813705444336,0.5186009450516573
27,1,RandomForest,0,0.05,0.81,0.537559170967288,1.6705904006958008,0.537559170967288
28,1,AdaBoost (Discrete),0,0.05,0.8099,0.5375229948394522,135.51325154304504,0.5375229948394522
29,1,AdaBoost (Real),0,0.05,0.7865,0.5132601269813758,200.91926622390747,0.5132601269813758
30,1,Logistic Regression (Penalty = L2),0,0.05,0.8098,0.5374868162767433,0.7085449695587158,0.5374868162767433
31,1,Naive Bayes,0,0.05,0.8102,0.537266290375669,0.3397402763366699,0.537266290375669
32,1,KNeighbors Classifier,1,0.05,0.7234,0.6277010334721602,6.59135365486145,0.6277010334721602
33,1,SVC Classifier,1,0.05,0.7788,1.0,130.11866927146912,0.0
34,1,Decision Tree,1,0.05,0.7884,0.5697238224194039,0.8897504806518555,0.5697238224194039
35,1,RandomForest,1,0.05,0.8169,0.5165779636134972,1.7622044086456299,0.5165779636134972
36,1,AdaBoost (Discrete),1,0.05,0.825,0.586216000514813,132.71455836296082,0.586216000514813
37,1,AdaBoost (Real),1,0.05,0.8007,0.5583726603995962,214.8071310520172,0.5583726603995962
38,1,Logistic Regression (Penalty = L2),1,0.05,0.825,0.586216000514813,0.7930834293365479,0.586216000514813
39,1,Naive Bayes,1,0.05,0.8249,0.5851859609408057,0.35431480407714844,0.5851859609408057
40,1,KNeighbors Classifier,2,0.05,0.7698,0.48328194631405186,7.6006104946136475,0.48328194631405186
41,1,SVC Classifier,2,0.05,0.7788,1.0,150.96592497825623,0.0
42,1,Decision Tree,2,0.05,0.7816,0.52825342852196,1.2982866764068604,0.52825342852196
43,1,RandomForest,2,0.05,0.7941,0.3248903337611793,2.1775341033935547,0.3248903337611793
44,1,AdaBoost (Discrete),2,0.05,0.8231,0.553542491711878,151.68661403656006,0.553542491711878
45,1,AdaBoost (Real),2,0.05,0.7984,0.5271481268506738,217.43802285194397,0.5271481268506738
46,1,Logistic Regression (Penalty = L2),2,0.05,0.8158,0.5022842621365722,0.859076738357544,0.5022842621365722
47,1,Naive Bayes,2,0.05,0.8225,0.5500871477541514,0.3363227844238281,0.5500871477541514
48,2,KNeighbors Classifier,0,0.05,0.453,0.49704450502265307,34.11668682098389,0.49704450502265307
49,2,SVC Classifier,0,0.05,0.7795,0.09014398837291854,138.81147980690002,0.09014398837291854
50,2,Decision Tree,0,0.05,0.8087,0.5399942204299294,0.33762311935424805,0.5399942204299294
51,2,RandomForest,0,0.05,0.8031,0.45868793940557906,1.681920051574707,0.45868793940557906
52,2,AdaBoost (Discrete),0,0.05,0.809,0.5426281056022232,99.02182841300964,0.5426281056022232
53,2,AdaBoost (Real),0,0.05,0.8088,0.541475122779432,921.3411974906921,0.541475122779432
54,2,Logistic Regression (Penalty = L2),0,0.05,0.8031,0.4618062302747353,0.7089908123016357,0.4618062302747353
55,2,Naive Bayes,0,0.05,0.7987,0.6128809750946417,0.30033373832702637,0.6128809750946417
56,2,KNeighbors Classifier,1,0.05,0.6211,0.4148293367289105,31.609922170639038,0.4148293367289105
57,2,SVC Classifier,1,0.05,0.7788,1.0,121.25909495353699,0.0
58,2,Decision Tree,1,0.05,0.8254,0.5870325605476784,0.23259377479553223,0.5870325605476784
59,2,RandomForest,1,0.05,0.8122,0.49291982489552855,1.4209072589874268,0.49291982489552855
60,2,AdaBoost (Discrete),1,0.05,0.825,0.5785533636821976,88.46065855026245,0.5785533636821976
61,2,AdaBoost (Real),1,0.05,0.8254,0.5880194354845573,683.7480843067169,0.5880194354845573
62,2,Logistic Regression (Penalty = L2),1,0.05,0.8123,0.4933653015566221,0.5846662521362305,0.4933653015566221
63,2,Naive Bayes,1,0.05,0.813,0.6579739274509033,0.35907578468322754,0.6579739274509033
64,2,KNeighbors Classifier,2,0.05,0.7111,0.3583258941737551,30.8545503616333,0.3583258941737551
65,2,SVC Classifier,2,0.05,0.7788,1.0,96.30503749847412,0.0
66,2,Decision Tree,2,0.05,0.823,0.5499084112747326,0.21651601791381836,0.5499084112747326
67,2,RandomForest,2,0.05,0.8122,0.4672526082648893,1.351255178451538,0.4672526082648893
68,2,AdaBoost (Discrete),2,0.05,0.8231,0.5463129546800016,84.69999670982361,0.5463129546800016
69,2,AdaBoost (Real),2,0.05,0.8227,0.5497989876518654,699.5504763126373,0.5497989876518654
70,2,Logistic Regression (Penalty = L2),2,0.05,0.8122,0.46769559972944375,0.5686006546020508,0.46769559972944375
71,2,Naive Bayes,2,0.05,0.8198,0.6373842013740348,0.28028154373168945,0.6373842013740348
72,3,KNeighbors Classifier,0,0.05,0.3898,0.4465368785977873,23.162896394729614,0.4465368785977873
73,3,SVC Classifier,0,0.05,0.7788,1.0,79.82308983802795,0.0
74,3,Decision Tree,0,0.05,0.8091,0.5331998579600798,0.11507177352905273,0.5331998579600798
75,3,RandomForest,0,0.05,0.8098,0.5374868162767433,0.9793291091918945,0.5374868162767433
76,3,AdaBoost (Discrete),0,0.05,0.8091,0.5331998579600798,64.01758670806885,0.5331998579600798
77,3,AdaBoost (Real),0,0.05,0.8097,0.5359881800938336,1164.6037924289703,0.5359881800938336
78,3,Logistic Regression (Penalty = L2),0,0.05,0.8098,0.5374868162767433,0.4666931629180908,0.5374868162767433
79,3,Naive Bayes,0,0.05,0.8098,0.5374868162767433,0.1432323455810547,0.5374868162767433
80,3,KNeighbors Classifier,1,0.05,0.7373,0.4167498066475552,15.173775911331177,0.4167498066475552
81,3,SVC Classifier,1,0.05,0.7788,1.0,53.37041664123535,0.0
82,3,Decision Tree,1,0.05,0.8245,0.584698307625315,0.14400768280029297,0.584698307625315
83,3,RandomForest,1,0.05,0.8249,0.5865063598458912,0.8924369812011719,0.5865063598458912
84,3,AdaBoost (Discrete),1,0.05,0.8245,0.584698307625315,52.24328899383545,0.584698307625315
85,3,AdaBoost (Real),1,0.05,0.8245,0.584698307625315,837.5525434017181,0.584698307625315
86,3,Logistic Regression (Penalty = L2),1,0.05,0.8249,0.5865063598458912,0.27629685401916504,0.5865063598458912
87,3,Naive Bayes,1,0.05,0.8249,0.5865063598458912,0.10819053649902344,0.5865063598458912
88,3,KNeighbors Classifier,2,0.05,0.7875,0.23526314858897693,12.051749467849731,0.23526314858897693
89,3,SVC Classifier,2,0.05,0.7788,1.0,37.59067463874817,0.0
90,3,Decision Tree,2,0.05,0.824,0.5545891737925498,0.10873866081237793,0.5545891737925498
91,3,RandomForest,2,0.05,0.8241,0.5578316001828668,0.6982786655426025,0.5578316001828668
92,3,AdaBoost (Discrete),2,0.05,0.8241,0.5578316001828668,36.31275391578674,0.5578316001828668
93,3,AdaBoost (Real),2,0.05,0.8241,0.5553406581675171,639.8196189403534,0.5553406581675171
94,3,Logistic Regression (Penalty = L2),2,0.05,0.8241,0.5578316001828668,0.21959471702575684,0.5578316001828668
95,3,Naive Bayes,2,0.05,0.8241,0.5578316001828668,0.08323216438293457,0.5578316001828668
96,4,KNeighbors Classifier,0,0.05,0.453,0.49704450502265307,9.26029086112976,0.49704450502265307
97,4,SVC Classifier,0,0.05,0.7795,0.09014398837291854,37.02739906311035,0.09014398837291854
98,4,Decision Tree,0,0.05,0.8087,0.5399942204299294,0.07369065284729004,0.5399942204299294
99,4,RandomForest,0,0.05,0.8031,0.45868793940557906,0.42879605293273926,0.45868793940557906
100,4,AdaBoost (Discrete),0,0.05,0.809,0.5426281056022232,26.536073446273804,0.5426281056022232
101,4,AdaBoost (Real),0,0.05,0.8088,0.541475122779432,252.01510787010193,0.541475122779432
102,4,Logistic Regression (Penalty = L2),0,0.05,0.8031,0.4618062302747353,0.19588899612426758,0.4618062302747353
103,4,Naive Bayes,0,0.05,0.7987,0.6128809750946417,0.07547187805175781,0.6128809750946417
104,4,KNeighbors Classifier,1,0.05,0.6211,0.4148293367289105,6.998623847961426,0.4148293367289105
105,4,SVC Classifier,1,0.05,0.7788,1.0,29.429498434066772,0.0
106,4,Decision Tree,1,0.05,0.8254,0.5870325605476784,0.07302737236022949,0.5870325605476784
107,4,RandomForest,1,0.05,0.8122,0.49291982489552855,0.46039676666259766,0.49291982489552855
108,4,AdaBoost (Discrete),1,0.05,0.825,0.5785533636821976,24.445062398910522,0.5785533636821976
109,4,AdaBoost (Real),1,0.05,0.8254,0.5880194354845573,174.47628903388977,0.5880194354845573
110,4,Logistic Regression (Penalty = L2),1,0.05,0.8123,0.4933653015566221,0.21419239044189453,0.4933653015566221
111,4,Naive Bayes,1,0.05,0.813,0.6579739274509033,0.09648394584655762,0.6579739274509033
112,4,KNeighbors Classifier,2,0.05,0.7111,0.3583258941737551,8.613287925720215,0.3583258941737551
113,4,SVC Classifier,2,0.05,0.7788,1.0,26.54308295249939,0.0
114,4,Decision Tree,2,0.05,0.823,0.5499084112747326,0.0786278247833252,0.5499084112747326
115,4,RandomForest,2,0.05,0.8122,0.4672526082648893,0.42227792739868164,0.4672526082648893
116,4,AdaBoost (Discrete),2,0.05,0.8231,0.5463129546800016,21.582940340042114,0.5463129546800016
117,4,AdaBoost (Real),2,0.05,0.8228,0.5501966723242271,178.95525479316711,0.5501966723242271
118,4,Logistic Regression (Penalty = L2),2,0.05,0.8122,0.46769559972944375,0.16067957878112793,0.46769559972944375
119,4,Naive Bayes,2,0.05,0.8198,0.6373842013740348,0.06675100326538086,0.6373842013740348
120,5,KNeighbors Classifier,0,0.05,0.3898,0.4465368785977873,6.407432794570923,0.4465368785977873
121,5,SVC Classifier,0,0.05,0.7788,1.0,24.154272079467773,0.0
122,5,Decision Tree,0,0.05,0.8091,0.5331998579600798,0.05082297325134277,0.5331998579600798
123,5,RandomForest,0,0.05,0.8098,0.5374868162767433,0.33704471588134766,0.5374868162767433
124,5,AdaBoost (Discrete),0,0.05,0.8091,0.5331998579600798,20.56027364730835,0.5331998579600798
125,5,AdaBoost (Real),0,0.05,0.8097,0.5359881800938336,380.43451166152954,0.5359881800938336
126,5,Logistic Regression (Penalty = L2),0,0.05,0.8098,0.5374868162767433,0.14289569854736328,0.5374868162767433
127,5,Naive Bayes,0,0.05,0.8098,0.5374868162767433,0.06155800819396973,0.5374868162767433
128,5,KNeighbors Classifier,1,0.05,0.7373,0.4167498066475552,5.97461462020874,0.4167498066475552
129,5,SVC Classifier,1,0.05,0.7788,1.0,18.802924394607544,0.0
130,5,Decision Tree,1,0.05,0.8245,0.584698307625315,0.03702497482299805,0.584698307625315
131,5,RandomForest,1,0.05,0.8249,0.5865063598458912,0.30071353912353516,0.5865063598458912
132,5,AdaBoost (Discrete),1,0.05,0.8245,0.584698307625315,16.411089181900024,0.584698307625315
133,5,AdaBoost (Real),1,0.05,0.8245,0.584698307625315,309.5774962902069,0.584698307625315
134,5,Logistic Regression (Penalty = L2),1,0.05,0.8249,0.5865063598458912,0.14765143394470215,0.5865063598458912
135,5,Naive Bayes,1,0.05,0.8249,0.5865063598458912,0.06477212905883789,0.5865063598458912
136,5,KNeighbors Classifier,2,0.05,0.7875,0.23526314858897693,5.768078804016113,0.23526314858897693
137,5,SVC Classifier,2,0.05,0.7788,1.0,17.731760025024414,0.0
138,5,Decision Tree,2,0.05,0.824,0.5545891737925498,0.06160473823547363,0.5545891737925498
139,5,RandomForest,2,0.05,0.8241,0.5578316001828668,0.30868101119995117,0.5578316001828668
140,5,AdaBoost (Discrete),2,0.05,0.8241,0.5578316001828668,17.091506242752075,0.5578316001828668
141,5,AdaBoost (Real),2,0.05,0.8241,0.5553406581675171,471.36848068237305,0.5553406581675171
142,5,Logistic Regression (Penalty = L2),2,0.05,0.8241,0.5578316001828668,0.21771764755249023,0.5578316001828668
143,5,Naive Bayes,2,0.05,0.8241,0.5578316001828668,0.07123756408691406,0.5578316001828668
144,6,KNeighbors Classifier,0,0.05,0.453,0.49704450502265307,9.888964653015137,0.49704450502265307
145,6,SVC Classifier,0,0.05,0.7795,0.09014398837291854,42.37305045127869,0.09014398837291854
146,6,Decision Tree,0,0.05,0.8087,0.5399942204299294,0.0733189582824707,0.5399942204299294
147,6,RandomForest,0,0.05,0.8031,0.45868793940557906,0.5072011947631836,0.45868793940557906
148,6,AdaBoost (Discrete),0,0.05,0.809,0.5426281056022232,30.531359434127808,0.5426281056022232
149,6,AdaBoost (Real),0,0.05,0.8088,0.541475122779432,310.77105164527893,0.541475122779432
150,6,Logistic Regression (Penalty = L2),0,0.05,0.8031,0.4618062302747353,0.27092671394348145,0.4618062302747353
151,6,Naive Bayes,0,0.05,0.7987,0.6128809750946417,0.11268305778503418,0.6128809750946417
152,6,KNeighbors Classifier,1,0.05,0.6211,0.4148293367289105,11.933350324630737,0.4148293367289105
153,6,SVC Classifier,1,0.05,0.7788,1.0,45.09902906417847,0.0
154,6,Decision Tree,1,0.05,0.8254,0.5870325605476784,0.09633994102478027,0.5870325605476784
155,6,RandomForest,1,0.05,0.8122,0.49291982489552855,0.5870218276977539,0.49291982489552855
156,6,AdaBoost (Discrete),1,0.05,0.825,0.5785533636821976,33.264108657836914,0.5785533636821976
157,6,AdaBoost (Real),1,0.05,0.8254,0.5880194354845573,235.21924686431885,0.5880194354845573
158,6,Logistic Regression (Penalty = L2),1,0.05,0.8123,0.4933653015566221,0.27295827865600586,0.4933653015566221
159,6,Naive Bayes,1,0.05,0.813,0.6579739274509033,0.11208295822143555,0.6579739274509033
160,6,KNeighbors Classifier,2,0.05,0.7111,0.3583258941737551,11.75942063331604,0.3583258941737551
161,6,SVC Classifier,2,0.05,0.7788,1.0,37.989989042282104,0.0
162,6,Decision Tree,2,0.05,0.8229,0.5495103595314583,0.08986568450927734,0.5495103595314583
163,6,RandomForest,2,0.05,0.8122,0.4672526082648893,0.5915231704711914,0.4672526082648893
164,6,AdaBoost (Discrete),2,0.05,0.8231,0.5463129546800016,34.74774765968323,0.5463129546800016
165,6,AdaBoost (Real),2,0.05,0.8228,0.5501966723242271,285.09892320632935,0.5501966723242271
166,6,Logistic Regression (Penalty = L2),2,0.05,0.8122,0.46769559972944375,0.24216008186340332,0.46769559972944375
167,6,Naive Bayes,2,0.05,0.8198,0.6373842013740348,0.11495423316955566,0.6373842013740348
168,7,KNeighbors Classifier,0,0.05,0.7519,0.5777305966366398,2.84368896484375,0.5777305966366398
169,7,SVC Classifier,0,0.05,0.7795,0.09014398837291854,47.66437602043152,0.09014398837291854
170,7,Decision Tree,0,0.05,0.7686,0.5283124345852892,0.312664270401001,0.5283124345852892
171,7,RandomForest,0,0.05,0.8104,0.5362405710304716,0.6215760707855225,0.5362405710304716
172,7,AdaBoost (Discrete),0,0.05,0.8081,0.5426572557990559,48.307666063308716,0.5426572557990559
173,7,AdaBoost (Real),0,0.05,0.7897,0.524740249550609,74.14560651779175,0.524740249550609
174,7,Logistic Regression (Penalty = L2),0,0.05,0.8031,0.4618062302747353,0.2535867691040039,0.4618062302747353
175,7,Naive Bayes,0,0.05,0.7952,0.6244904655755414,0.12255167961120605,0.6244904655755414
176,7,KNeighbors Classifier,1,0.05,0.7683,0.5818378355263657,2.7507236003875732,0.5818378355263657
177,7,SVC Classifier,1,0.05,0.7788,1.0,49.23154377937317,0.0
178,7,Decision Tree,1,0.05,0.7884,0.5719664035884786,0.26893115043640137,0.5719664035884786
179,7,RandomForest,1,0.05,0.8253,0.5800134290808993,0.5802035331726074,0.5800134290808993
180,7,AdaBoost (Discrete),1,0.05,0.8253,0.5800134290808993,44.36561608314514,0.5800134290808993
181,7,AdaBoost (Real),1,0.05,0.8061,0.5784136325546297,65.39580059051514,0.5784136325546297
182,7,Logistic Regression (Penalty = L2),1,0.05,0.8123,0.4933653015566221,0.26062440872192383,0.4933653015566221
183,7,Naive Bayes,1,0.05,0.8089,0.6741215074290099,0.13362956047058105,0.6741215074290099
184,7,KNeighbors Classifier,2,0.05,0.7903,0.499287124006843,2.8217716217041016,0.499287124006843
185,7,SVC Classifier,2,0.05,0.7788,1.0,40.40023922920227,0.0
186,7,Decision Tree,2,0.05,0.7804,0.532396898668312,0.32880163192749023,0.532396898668312
187,7,RandomForest,2,0.05,0.8233,0.5485689678291474,0.5988309383392334,0.5485689678291474
188,7,AdaBoost (Discrete),2,0.05,0.8232,0.5485326182967332,46.048463582992554,0.5485326182967332
189,7,AdaBoost (Real),2,0.05,0.8039,0.5421853114374483,66.7280285358429,0.5421853114374483
190,7,Logistic Regression (Penalty = L2),2,0.05,0.8103,0.4554302931091201,0.26114630699157715,0.4554302931091201
191,7,Naive Bayes,2,0.05,0.8145,0.6497844195859046,0.12039566040039062,0.6497844195859046
192,8,KNeighbors Classifier,0,0.05,0.3898,0.4465368785977873,8.67081880569458,0.4465368785977873
193,8,SVC Classifier,0,0.05,0.7788,1.0,31.7491352558136,0.0
194,8,Decision Tree,0,0.05,0.8091,0.5331998579600798,0.0711054801940918,0.5331998579600798
195,8,RandomForest,0,0.05,0.8098,0.5374868162767433,0.5109748840332031,0.5374868162767433
196,8,AdaBoost (Discrete),0,0.05,0.8091,0.5331998579600798,28.283419132232666,0.5331998579600798
197,8,AdaBoost (Real),0,0.05,0.8097,0.5359881800938336,520.0297977924347,0.5359881800938336
198,8,Logistic Regression (Penalty = L2),0,0.05,0.8098,0.5374868162767433,0.22237062454223633,0.5374868162767433
199,8,Naive Bayes,0,0.05,0.8098,0.5374868162767433,0.09832429885864258,0.5374868162767433
200,8,KNeighbors Classifier,1,0.05,0.7373,0.4167498066475552,8.8351411819458,0.4167498066475552
201,8,SVC Classifier,1,0.05,0.7788,1.0,28.414066791534424,0.0
202,8,Decision Tree,1,0.05,0.8245,0.584698307625315,0.07444453239440918,0.584698307625315
203,8,RandomForest,1,0.05,0.8249,0.5865063598458912,0.5195183753967285,0.5865063598458912
204,8,AdaBoost (Discrete),1,0.05,0.8245,0.584698307625315,28.76847505569458,0.584698307625315
205,8,AdaBoost (Real),1,0.05,0.8245,0.584698307625315,492.58943819999695,0.584698307625315
206,8,Logistic Regression (Penalty = L2),1,0.05,0.8249,0.5865063598458912,0.25699901580810547,0.5865063598458912
207,8,Naive Bayes,1,0.05,0.8249,0.5865063598458912,0.1036233901977539,0.5865063598458912
208,8,KNeighbors Classifier,2,0.05,0.7875,0.23526314858897693,7.426529407501221,0.23526314858897693
209,8,SVC Classifier,2,0.05,0.7788,1.0,23.807870388031006,0.0
210,8,Decision Tree,2,0.05,0.824,0.5545891737925498,0.07478141784667969,0.5545891737925498
211,8,RandomForest,2,0.05,0.8241,0.5578316001828668,0.42438673973083496,0.5578316001828668
212,8,AdaBoost (Discrete),2,0.05,0.8241,0.5578316001828668,23.731653690338135,0.5578316001828668
213,8,AdaBoost (Real),2,0.05,0.8241,0.5553406581675171,499.0839524269104,0.5553406581675171
214,8,Logistic Regression (Penalty = L2),2,0.05,0.8241,0.5578316001828668,0.1891181468963623,0.5578316001828668
215,8,Naive Bayes,2,0.05,0.8241,0.5578316001828668,0.0834658145904541,0.5578316001828668
