,feat_set_id,classifier,fold_id,feat_th,score,geo_score,exec_t,geo_score_woz
0,0,KNeighbors Classifier,0,0.15,0.3719512195121951,0.40944025881203033,0.045320987701416016,0.0
1,0,SVC Classifier,0,0.15,0.4268292682926829,1.0,0.09787201881408691,0.0
2,0,Decision Tree,0,0.15,0.43902439024390244,0.13621382470980556,0.001798391342163086,0.13621382470980556
3,0,RandomForest,0,0.15,0.4369918699186992,0.6574002070086624,0.11366438865661621,0.0
4,0,AdaBoost (Discrete),0,0.15,0.43902439024390244,0.13621382470980556,5.012399196624756,0.13621382470980556
5,0,AdaBoost (Real),0,0.15,0.43902439024390244,0.13621382470980556,5.944249868392944,0.13621382470980556
6,0,Logistic Regression (Penalty = L2),0,0.15,0.4369918699186992,0.6574002070086624,0.03668546676635742,0.0
7,0,Naive Bayes,0,0.15,0.4491869918699187,0.4386567344827272,0.0041961669921875,0.4386567344827272
8,0,KNeighbors Classifier,1,0.15,0.47046843177189407,0.18037704779835434,0.059938907623291016,0.18037704779835434
9,0,SVC Classifier,1,0.15,0.42769857433808556,1.0,0.11413288116455078,0.0
10,0,Decision Tree,1,0.15,0.43380855397148677,0.4933734558595332,0.0021669864654541016,0.0
11,0,RandomForest,1,0.15,0.43380855397148677,0.4933734558595332,0.09457182884216309,0.0
12,0,AdaBoost (Discrete),1,0.15,0.43380855397148677,0.4933734558595332,5.266698837280273,0.0
13,0,AdaBoost (Real),1,0.15,0.43380855397148677,0.4933734558595332,5.926394701004028,0.0
14,0,Logistic Regression (Penalty = L2),1,0.15,0.4317718940936864,0.48585020342495194,0.004698753356933594,0.0
15,0,Naive Bayes,1,0.15,0.47657841140529533,0.4841441132005446,0.01990675926208496,0.4841441132005446
16,0,KNeighbors Classifier,2,0.15,0.38979591836734695,0.4300164613713991,0.04302024841308594,0.0
17,0,SVC Classifier,2,0.15,0.42653061224489797,1.0,0.08146810531616211,0.0
18,0,Decision Tree,2,0.15,0.3979591836734694,0.39632934516264773,0.0019562244415283203,0.39632934516264773
19,0,RandomForest,2,0.15,0.4346938775510204,0.133103125648719,0.09147024154663086,0.133103125648719
20,0,AdaBoost (Discrete),2,0.15,0.3979591836734694,0.39632934516264773,4.677466154098511,0.39632934516264773
21,0,AdaBoost (Real),2,0.15,0.3979591836734694,0.39632934516264773,5.410455703735352,0.39632934516264773
22,0,Logistic Regression (Penalty = L2),2,0.15,0.4346938775510204,0.6352573315091198,0.01921868324279785,0.0
23,0,Naive Bayes,2,0.15,0.39591836734693875,0.3998673015156289,0.01970052719116211,0.3998673015156289
24,1,KNeighbors Classifier,0,0.15,0.4695121951219512,0.3730009284575678,0.003596067428588867,0.3730009284575678
25,1,SVC Classifier,0,0.15,0.4268292682926829,1.0,0.09630322456359863,0.0
26,1,Decision Tree,0,0.15,0.4695121951219512,0.38108142543943224,0.0024912357330322266,0.38108142543943224
27,1,RandomForest,0,0.15,0.5101626016260162,0.6589782222579075,0.09447383880615234,0.0
28,1,AdaBoost (Discrete),0,0.15,0.4898373983739837,0.4031072522122931,4.61534857749939,0.4031072522122931
29,1,AdaBoost (Real),0,0.15,0.49796747967479676,0.4395571168565615,6.0960307121276855,0.4395571168565615
30,1,Logistic Regression (Penalty = L2),0,0.15,0.4654471544715447,0.20908114821359475,0.020345449447631836,0.20908114821359475
31,1,Naive Bayes,0,0.15,0.4898373983739837,0.6352234031660235,0.004048585891723633,0.0
32,1,KNeighbors Classifier,1,0.15,0.4623217922606925,0.39867454379777617,0.021745920181274414,0.39867454379777617
33,1,SVC Classifier,1,0.15,0.42769857433808556,1.0,0.09493112564086914,0.0
34,1,Decision Tree,1,0.15,0.48879837067209775,0.41744352506444765,0.0186460018157959,0.41744352506444765
35,1,RandomForest,1,0.15,0.5112016293279023,0.6569601499752189,0.07250666618347168,0.0
36,1,AdaBoost (Discrete),1,0.15,0.5641547861507128,0.478384165433215,4.995815992355347,0.478384165433215
37,1,AdaBoost (Real),1,0.15,0.4989816700610998,0.47249261938271053,6.22393012046814,0.47249261938271053
38,1,Logistic Regression (Penalty = L2),1,0.15,0.49287169042769857,0.6265820313548791,0.004275798797607422,0.0
39,1,Naive Bayes,1,0.15,0.5071283095723014,0.6544396966311035,0.0034341812133789062,0.0
40,1,KNeighbors Classifier,2,0.15,0.45102040816326533,0.4075021477400168,0.005539894104003906,0.4075021477400168
41,1,SVC Classifier,2,0.15,0.42653061224489797,1.0,0.0922236442565918,0.0
42,1,Decision Tree,2,0.15,0.46122448979591835,0.4012747661252036,0.0017778873443603516,0.4012747661252036
43,1,RandomForest,2,0.15,0.5061224489795918,0.6464303679891581,0.07184410095214844,0.0
44,1,AdaBoost (Discrete),2,0.15,0.5142857142857142,0.46373126605748477,4.65579628944397,0.46373126605748477
45,1,AdaBoost (Real),2,0.15,0.47551020408163264,0.433067197824715,5.849292039871216,0.433067197824715
46,1,Logistic Regression (Penalty = L2),2,0.15,0.47551020408163264,0.21428956592312146,0.005006074905395508,0.21428956592312146
47,1,Naive Bayes,2,0.15,0.48775510204081635,0.19229762659430907,0.018290996551513672,0.19229762659430907
48,2,KNeighbors Classifier,0,0.15,0.4695121951219512,0.3730009284575678,0.022462129592895508,0.3730009284575678
49,2,SVC Classifier,0,0.15,0.4268292682926829,1.0,0.07728004455566406,0.0
50,2,Decision Tree,0,0.15,0.47560975609756095,0.3881925946601172,0.002480030059814453,0.3881925946601172
51,2,RandomForest,0,0.15,0.5101626016260162,0.6589782222579075,0.0648953914642334,0.0
52,2,AdaBoost (Discrete),0,0.15,0.4898373983739837,0.4031072522122931,4.636470556259155,0.4031072522122931
53,2,AdaBoost (Real),0,0.15,0.49796747967479676,0.4395571168565615,5.659083127975464,0.4395571168565615
54,2,Logistic Regression (Penalty = L2),0,0.15,0.4654471544715447,0.20908114821359475,0.0032515525817871094,0.20908114821359475
55,2,Naive Bayes,0,0.15,0.4898373983739837,0.6352234031660235,0.01841449737548828,0.0
56,2,KNeighbors Classifier,1,0.15,0.4623217922606925,0.39867454379777617,0.021135568618774414,0.39867454379777617
57,2,SVC Classifier,1,0.15,0.42769857433808556,1.0,0.06660079956054688,0.0
58,2,Decision Tree,1,0.15,0.4908350305498982,0.4326803977652146,0.0027697086334228516,0.4326803977652146
59,2,RandomForest,1,0.15,0.5112016293279023,0.6569601499752189,0.09273338317871094,0.0
60,2,AdaBoost (Discrete),1,0.15,0.5641547861507128,0.478384165433215,5.682982444763184,0.478384165433215
61,2,AdaBoost (Real),1,0.15,0.4989816700610998,0.47249261938271053,6.408893585205078,0.47249261938271053
62,2,Logistic Regression (Penalty = L2),1,0.15,0.49287169042769857,0.6265820313548791,0.02102971076965332,0.0
63,2,Naive Bayes,1,0.15,0.5071283095723014,0.6544396966311035,0.019967079162597656,0.0
64,2,KNeighbors Classifier,2,0.15,0.45102040816326533,0.4075021477400168,0.02263951301574707,0.4075021477400168
65,2,SVC Classifier,2,0.15,0.42653061224489797,1.0,0.07722330093383789,0.0
66,2,Decision Tree,2,0.15,0.4673469387755102,0.4126964734101518,0.01866769790649414,0.4126964734101518
67,2,RandomForest,2,0.15,0.5061224489795918,0.6464303679891581,0.09417915344238281,0.0
68,2,AdaBoost (Discrete),2,0.15,0.5142857142857142,0.46373126605748477,5.342462062835693,0.46373126605748477
69,2,AdaBoost (Real),2,0.15,0.47551020408163264,0.433067197824715,6.235679864883423,0.433067197824715
70,2,Logistic Regression (Penalty = L2),2,0.15,0.47551020408163264,0.21428956592312146,0.02005314826965332,0.21428956592312146
71,2,Naive Bayes,2,0.15,0.48775510204081635,0.19229762659430907,0.00415492057800293,0.19229762659430907
72,3,KNeighbors Classifier,0,0.15,0.4695121951219512,0.3730009284575678,0.022086381912231445,0.3730009284575678
73,3,SVC Classifier,0,0.15,0.4268292682926829,1.0,0.10400009155273438,0.0
74,3,Decision Tree,0,0.15,0.47560975609756095,0.3919573039039929,0.020096778869628906,0.3919573039039929
75,3,RandomForest,0,0.15,0.5101626016260162,0.6589782222579075,0.09522557258605957,0.0
76,3,AdaBoost (Discrete),0,0.15,0.4898373983739837,0.4031072522122931,5.240641355514526,0.4031072522122931
77,3,AdaBoost (Real),0,0.15,0.49796747967479676,0.4395571168565615,6.423733949661255,0.4395571168565615
78,3,Logistic Regression (Penalty = L2),0,0.15,0.4654471544715447,0.20908114821359475,0.02231884002685547,0.20908114821359475
79,3,Naive Bayes,0,0.15,0.4898373983739837,0.6352234031660235,0.003752470016479492,0.0
80,3,KNeighbors Classifier,1,0.15,0.4623217922606925,0.39867454379777617,0.043340206146240234,0.39867454379777617
81,3,SVC Classifier,1,0.15,0.42769857433808556,1.0,0.08540558815002441,0.0
82,3,Decision Tree,1,0.15,0.48879837067209775,0.42478513576704674,0.00395965576171875,0.42478513576704674
83,3,RandomForest,1,0.15,0.5112016293279023,0.6569601499752189,0.13732361793518066,0.0
84,3,AdaBoost (Discrete),1,0.15,0.5641547861507128,0.478384165433215,5.347460508346558,0.478384165433215
85,3,AdaBoost (Real),1,0.15,0.4989816700610998,0.47249261938271053,6.511361360549927,0.47249261938271053
86,3,Logistic Regression (Penalty = L2),1,0.15,0.49287169042769857,0.6265820313548791,0.021213769912719727,0.0
87,3,Naive Bayes,1,0.15,0.5071283095723014,0.6544396966311035,0.003505706787109375,0.0
88,3,KNeighbors Classifier,2,0.15,0.45102040816326533,0.4075021477400168,0.02205824851989746,0.4075021477400168
89,3,SVC Classifier,2,0.15,0.42653061224489797,1.0,0.0736532211303711,0.0
90,3,Decision Tree,2,0.15,0.45714285714285713,0.3971509057221904,0.0026328563690185547,0.3971509057221904
91,3,RandomForest,2,0.15,0.5061224489795918,0.6464303679891581,0.06257319450378418,0.0
92,3,AdaBoost (Discrete),2,0.15,0.5142857142857142,0.46373126605748477,4.898936986923218,0.46373126605748477
93,3,AdaBoost (Real),2,0.15,0.47551020408163264,0.433067197824715,5.948614597320557,0.433067197824715
94,3,Logistic Regression (Penalty = L2),2,0.15,0.47551020408163264,0.21428956592312146,0.021798372268676758,0.21428956592312146
95,3,Naive Bayes,2,0.15,0.48775510204081635,0.19229762659430907,0.0038361549377441406,0.19229762659430907
96,7,KNeighbors Classifier,0,0.15,0.4695121951219512,0.3730009284575678,0.021287202835083008,0.3730009284575678
97,7,SVC Classifier,0,0.15,0.4268292682926829,1.0,0.07412505149841309,0.0
98,7,Decision Tree,0,0.15,0.47560975609756095,0.3881925946601172,0.01902008056640625,0.3881925946601172
99,7,RandomForest,0,0.15,0.5101626016260162,0.6589782222579075,0.07490324974060059,0.0
100,7,AdaBoost (Discrete),0,0.15,0.4898373983739837,0.4031072522122931,4.690404653549194,0.4031072522122931
101,7,AdaBoost (Real),0,0.15,0.49796747967479676,0.4395571168565615,5.794201374053955,0.4395571168565615
102,7,Logistic Regression (Penalty = L2),0,0.15,0.4654471544715447,0.20908114821359475,0.0040531158447265625,0.20908114821359475
103,7,Naive Bayes,0,0.15,0.4898373983739837,0.6352234031660235,0.0031592845916748047,0.0
104,7,KNeighbors Classifier,1,0.15,0.4623217922606925,0.39867454379777617,0.021733522415161133,0.39867454379777617
105,7,SVC Classifier,1,0.15,0.42769857433808556,1.0,0.07663154602050781,0.0
106,7,Decision Tree,1,0.15,0.48879837067209775,0.4211799961315477,0.0019261837005615234,0.4211799961315477
107,7,RandomForest,1,0.15,0.5112016293279023,0.6569601499752189,0.07464051246643066,0.0
108,7,AdaBoost (Discrete),1,0.15,0.5641547861507128,0.478384165433215,4.645765781402588,0.478384165433215
109,7,AdaBoost (Real),1,0.15,0.4989816700610998,0.47249261938271053,5.697173833847046,0.47249261938271053
110,7,Logistic Regression (Penalty = L2),1,0.15,0.49287169042769857,0.6265820313548791,0.019952058792114258,0.0
111,7,Naive Bayes,1,0.15,0.5071283095723014,0.6544396966311035,0.0029306411743164062,0.0
112,7,KNeighbors Classifier,2,0.15,0.45102040816326533,0.4075021477400168,0.005326747894287109,0.4075021477400168
113,7,SVC Classifier,2,0.15,0.42653061224489797,1.0,0.07386994361877441,0.0
114,7,Decision Tree,2,0.15,0.46530612244897956,0.4121344515379412,0.002542257308959961,0.4121344515379412
115,7,RandomForest,2,0.15,0.5061224489795918,0.6464303679891581,0.07391595840454102,0.0
116,7,AdaBoost (Discrete),2,0.15,0.5142857142857142,0.46373126605748477,4.670538902282715,0.46373126605748477
117,7,AdaBoost (Real),2,0.15,0.47551020408163264,0.433067197824715,5.706829309463501,0.433067197824715
118,7,Logistic Regression (Penalty = L2),2,0.15,0.47551020408163264,0.21428956592312146,0.005112886428833008,0.21428956592312146
119,7,Naive Bayes,2,0.15,0.48775510204081635,0.19229762659430907,0.01897716522216797,0.19229762659430907
120,8,KNeighbors Classifier,0,0.15,0.4695121951219512,0.3730009284575678,0.022841215133666992,0.3730009284575678
121,8,SVC Classifier,0,0.15,0.4268292682926829,1.0,0.0770423412322998,0.0
122,8,Decision Tree,0,0.15,0.47560975609756095,0.38737399829150526,0.01892232894897461,0.38737399829150526
123,8,RandomForest,0,0.15,0.5101626016260162,0.6589782222579075,0.07617712020874023,0.0
124,8,AdaBoost (Discrete),0,0.15,0.4898373983739837,0.4031072522122931,4.968806505203247,0.4031072522122931
125,8,AdaBoost (Real),0,0.15,0.49796747967479676,0.4395571168565615,6.421470403671265,0.4395571168565615
126,8,Logistic Regression (Penalty = L2),0,0.15,0.4654471544715447,0.20908114821359475,0.020078659057617188,0.20908114821359475
127,8,Naive Bayes,0,0.15,0.4898373983739837,0.6352234031660235,0.0040323734283447266,0.0
128,8,KNeighbors Classifier,1,0.15,0.4623217922606925,0.39867454379777617,0.0222015380859375,0.39867454379777617
129,8,SVC Classifier,1,0.15,0.42769857433808556,1.0,0.07502985000610352,0.0
130,8,Decision Tree,1,0.15,0.49490835030549896,0.43575740495231996,0.018767118453979492,0.43575740495231996
131,8,RandomForest,1,0.15,0.5112016293279023,0.6569601499752189,0.09321188926696777,0.0
132,8,AdaBoost (Discrete),1,0.15,0.5641547861507128,0.478384165433215,4.932247638702393,0.478384165433215
133,8,AdaBoost (Real),1,0.15,0.4989816700610998,0.47249261938271053,6.226902961730957,0.47249261938271053
134,8,Logistic Regression (Penalty = L2),1,0.15,0.49287169042769857,0.6265820313548791,0.021295547485351562,0.0
135,8,Naive Bayes,1,0.15,0.5071283095723014,0.6544396966311035,0.004441976547241211,0.0
136,8,KNeighbors Classifier,2,0.15,0.45102040816326533,0.4075021477400168,0.022533178329467773,0.4075021477400168
137,8,SVC Classifier,2,0.15,0.42653061224489797,1.0,0.07579493522644043,0.0
138,8,Decision Tree,2,0.15,0.463265306122449,0.40237717486813784,0.019168853759765625,0.40237717486813784
139,8,RandomForest,2,0.15,0.5061224489795918,0.6464303679891581,0.07601785659790039,0.0
140,8,AdaBoost (Discrete),2,0.15,0.5142857142857142,0.46373126605748477,5.048851251602173,0.46373126605748477
141,8,AdaBoost (Real),2,0.15,0.47551020408163264,0.433067197824715,5.8828208446502686,0.433067197824715
142,8,Logistic Regression (Penalty = L2),2,0.15,0.47551020408163264,0.21428956592312146,0.0054531097412109375,0.21428956592312146
143,8,Naive Bayes,2,0.15,0.48775510204081635,0.19229762659430907,0.003987550735473633,0.19229762659430907
144,9,KNeighbors Classifier,0,0.15,0.4695121951219512,0.3730009284575678,0.022143125534057617,0.3730009284575678
145,9,SVC Classifier,0,0.15,0.4268292682926829,1.0,0.07197284698486328,0.0
146,9,Decision Tree,0,0.15,0.4735772357723577,0.3874508887258969,0.0026748180389404297,0.3874508887258969
147,9,RandomForest,0,0.15,0.5101626016260162,0.6589782222579075,0.073516845703125,0.0
148,9,AdaBoost (Discrete),0,0.15,0.4898373983739837,0.4031072522122931,4.671948671340942,0.4031072522122931
149,9,AdaBoost (Real),0,0.15,0.49796747967479676,0.4395571168565615,5.522696018218994,0.4395571168565615
150,9,Logistic Regression (Penalty = L2),0,0.15,0.4654471544715447,0.20908114821359475,0.021991968154907227,0.20908114821359475
151,9,Naive Bayes,0,0.15,0.4898373983739837,0.6352234031660235,0.0031502246856689453,0.0
152,9,KNeighbors Classifier,1,0.15,0.4623217922606925,0.39867454379777617,0.004537105560302734,0.39867454379777617
153,9,SVC Classifier,1,0.15,0.42769857433808556,1.0,0.09519171714782715,0.0
154,9,Decision Tree,1,0.15,0.4908350305498982,0.42930446576969056,0.0027704238891601562,0.42930446576969056
155,9,RandomForest,1,0.15,0.5112016293279023,0.6569601499752189,0.07251238822937012,0.0
156,9,AdaBoost (Discrete),1,0.15,0.5641547861507128,0.478384165433215,4.592263698577881,0.478384165433215
157,9,AdaBoost (Real),1,0.15,0.4989816700610998,0.47249261938271053,5.568402051925659,0.47249261938271053
158,9,Logistic Regression (Penalty = L2),1,0.15,0.49287169042769857,0.6265820313548791,0.003085613250732422,0.0
159,9,Naive Bayes,1,0.15,0.5071283095723014,0.6544396966311035,0.0033469200134277344,0.0
160,9,KNeighbors Classifier,2,0.15,0.45102040816326533,0.4075021477400168,0.0207672119140625,0.4075021477400168
161,9,SVC Classifier,2,0.15,0.42653061224489797,1.0,0.07533597946166992,0.0
162,9,Decision Tree,2,0.15,0.45714285714285713,0.40379936708036196,0.0021555423736572266,0.40379936708036196
163,9,RandomForest,2,0.15,0.5061224489795918,0.6464303679891581,0.07308816909790039,0.0
164,9,AdaBoost (Discrete),2,0.15,0.5142857142857142,0.46373126605748477,4.607455253601074,0.46373126605748477
165,9,AdaBoost (Real),2,0.15,0.47551020408163264,0.433067197824715,5.709447383880615,0.433067197824715
166,9,Logistic Regression (Penalty = L2),2,0.15,0.47551020408163264,0.21428956592312146,0.01321721076965332,0.21428956592312146
167,9,Naive Bayes,2,0.15,0.48775510204081635,0.19229762659430907,0.019500255584716797,0.19229762659430907
168,10,KNeighbors Classifier,0,0.15,0.4695121951219512,0.3730009284575678,0.004154205322265625,0.3730009284575678
169,10,SVC Classifier,0,0.15,0.4268292682926829,1.0,0.08871245384216309,0.0
170,10,Decision Tree,0,0.15,0.4715447154471545,0.381993106965137,0.018453359603881836,0.381993106965137
171,10,RandomForest,0,0.15,0.5101626016260162,0.6589782222579075,0.0739145278930664,0.0
172,10,AdaBoost (Discrete),0,0.15,0.4898373983739837,0.4031072522122931,4.921050310134888,0.4031072522122931
173,10,AdaBoost (Real),0,0.15,0.49796747967479676,0.4395571168565615,5.966128587722778,0.4395571168565615
174,10,Logistic Regression (Penalty = L2),0,0.15,0.4654471544715447,0.20908114821359475,0.01981520652770996,0.20908114821359475
175,10,Naive Bayes,0,0.15,0.4898373983739837,0.6352234031660235,0.019465923309326172,0.0
176,10,KNeighbors Classifier,1,0.15,0.4623217922606925,0.39867454379777617,0.0059506893157958984,0.39867454379777617
177,10,SVC Classifier,1,0.15,0.42769857433808556,1.0,0.08680939674377441,0.0
178,10,Decision Tree,1,0.15,0.4908350305498982,0.425808718364886,0.018468141555786133,0.425808718364886
179,10,RandomForest,1,0.15,0.5112016293279023,0.6569601499752189,0.07642340660095215,0.0
180,10,AdaBoost (Discrete),1,0.15,0.5641547861507128,0.478384165433215,4.409019708633423,0.478384165433215
181,10,AdaBoost (Real),1,0.15,0.4989816700610998,0.47249261938271053,6.613748550415039,0.47249261938271053
182,10,Logistic Regression (Penalty = L2),1,0.15,0.49287169042769857,0.6265820313548791,0.0051136016845703125,0.0
183,10,Naive Bayes,1,0.15,0.5071283095723014,0.6544396966311035,0.02016472816467285,0.0
184,10,KNeighbors Classifier,2,0.15,0.45102040816326533,0.4075021477400168,0.02250504493713379,0.4075021477400168
185,10,SVC Classifier,2,0.15,0.42653061224489797,1.0,0.07709264755249023,0.0
186,10,Decision Tree,2,0.15,0.45714285714285713,0.3971509057221904,0.0025963783264160156,0.3971509057221904
187,10,RandomForest,2,0.15,0.5061224489795918,0.6464303679891581,0.09547877311706543,0.0
188,10,AdaBoost (Discrete),2,0.15,0.5142857142857142,0.46373126605748477,4.938462495803833,0.46373126605748477
189,10,AdaBoost (Real),2,0.15,0.47551020408163264,0.433067197824715,6.174578666687012,0.433067197824715
190,10,Logistic Regression (Penalty = L2),2,0.15,0.47551020408163264,0.21428956592312146,0.02042698860168457,0.21428956592312146
191,10,Naive Bayes,2,0.15,0.48775510204081635,0.19229762659430907,0.004071235656738281,0.19229762659430907
192,11,KNeighbors Classifier,0,0.15,0.483739837398374,0.41276725148662824,0.043495893478393555,0.41276725148662824
193,11,SVC Classifier,0,0.15,0.4268292682926829,1.0,0.10613536834716797,0.0
194,11,Decision Tree,0,0.15,0.4878048780487805,0.425920009594006,0.0023086071014404297,0.425920009594006
195,11,RandomForest,0,0.15,0.5264227642276422,0.43630249162398277,0.07448530197143555,0.43630249162398277
196,11,AdaBoost (Discrete),0,0.15,0.5386178861788617,0.4940902488661163,5.401005983352661,0.4940902488661163
197,11,AdaBoost (Real),0,0.15,0.5101626016260162,0.4603860819225447,6.1034533977508545,0.4603860819225447
198,11,Logistic Regression (Penalty = L2),0,0.15,0.532520325203252,0.49204566476087797,0.02161717414855957,0.49204566476087797
199,11,Naive Bayes,0,0.15,0.44715447154471544,0.45125474194665,0.02024221420288086,0.45125474194665
200,11,KNeighbors Classifier,1,0.15,0.4745417515274949,0.41381094143952846,0.028534889221191406,0.41381094143952846
201,11,SVC Classifier,1,0.15,0.42769857433808556,1.0,0.09593605995178223,0.0
202,11,Decision Tree,1,0.15,0.4847250509164969,0.44777451926294776,0.019322872161865234,0.44777451926294776
203,11,RandomForest,1,0.15,0.5132382892057027,0.6536045284052282,0.0756082534790039,0.0
204,11,AdaBoost (Discrete),1,0.15,0.5458248472505092,0.5057362129234948,5.026668548583984,0.5057362129234948
205,11,AdaBoost (Real),1,0.15,0.49490835030549896,0.4582552354832567,6.302560567855835,0.4582552354832567
206,11,Logistic Regression (Penalty = L2),1,0.15,0.5193482688391039,0.440854014703172,0.021745920181274414,0.440854014703172
207,11,Naive Bayes,1,0.15,0.48879837067209775,0.48905797308620613,0.020683765411376953,0.48905797308620613
208,11,KNeighbors Classifier,2,0.15,0.5,0.43910266971382933,0.04416394233703613,0.43910266971382933
209,11,SVC Classifier,2,0.15,0.42653061224489797,1.0,0.11478018760681152,0.0
210,11,Decision Tree,2,0.15,0.4897959183673469,0.44266903342081065,0.018801212310791016,0.44266903342081065
211,11,RandomForest,2,0.15,0.5102040816326531,0.3810705518406968,0.07706308364868164,0.3810705518406968
212,11,AdaBoost (Discrete),2,0.15,0.5204081632653061,0.47732476793500933,5.378559589385986,0.47732476793500933
213,11,AdaBoost (Real),2,0.15,0.4775510204081633,0.4521560797775726,6.317850112915039,0.4521560797775726
214,11,Logistic Regression (Penalty = L2),2,0.15,0.5306122448979592,0.4675429162028777,0.02129054069519043,0.4675429162028777
215,11,Naive Bayes,2,0.15,0.4673469387755102,0.4663691970929697,0.004260540008544922,0.4663691970929697
