,feat_set_id,classifier,fold_id,feat_th,score,geo_score,exec_t,geo_score_woz
0,0,KNeighbors Classifier,0,0.7,0.3233394833948339,0.15238101820893185,2.9179558753967285,0.0
1,0,SVC Classifier,0,0.7,0.5461254612546126,0.697622748635951,18.32535409927368,0.0
2,0,Decision Tree,0,0.7,0.29566420664206644,0.18122417657108653,0.19055724143981934,0.0
3,0,RandomForest,0,0.7,0.49031365313653136,0.645797079747296,0.8355922698974609,0.0
4,0,AdaBoost (Discrete),0,0.7,0.18357933579335795,0.18286580610604722,78.38752317428589,0.0
5,0,AdaBoost (Real),0,0.7,0.13745387453874539,0.16005888878711952,172.36565780639648,0.0
6,0,Logistic Regression (Penalty = L2),0,0.7,0.4561808118081181,0.14485611630270454,1.6060209274291992,0.0
7,0,Naive Bayes,0,0.7,0.24769372693726938,0.3094215850686802,0.21680140495300293,0.0
8,0,KNeighbors Classifier,1,0.7,0.402123730378578,0.20283431039932157,3.1675314903259277,0.0
9,0,SVC Classifier,1,0.7,0.44321329639889195,0.16703914387924193,23.35195779800415,0.0
10,0,Decision Tree,1,0.7,0.38688827331486614,0.2053847806243863,0.36928319931030273,0.0
11,0,RandomForest,1,0.7,0.48984302862419205,0.5383653616534838,1.0217289924621582,0.0
12,0,AdaBoost (Discrete),1,0.7,0.37903970452446906,0.3413826090348263,99.98283243179321,0.0
13,0,AdaBoost (Real),1,0.7,0.23822714681440443,0.1994785847215583,135.30535316467285,0.0
14,0,Logistic Regression (Penalty = L2),1,0.7,0.5078485687903971,0.2767251807278389,1.5362176895141602,0.0
15,0,Naive Bayes,1,0.7,0.4644506001846722,0.3006951544781474,0.26766300201416016,0.0
16,0,KNeighbors Classifier,2,0.7,0.43273231622746183,0.17052511092810294,2.487870931625366,0.0
17,0,SVC Classifier,2,0.7,0.4368932038834951,1.0,21.340307235717773,0.0
18,0,Decision Tree,2,0.7,0.39759593157651413,0.2130236924553624,0.17844891548156738,0.0
19,0,RandomForest,2,0.7,0.4586222838650023,0.30138494896411294,1.1272799968719482,0.0
20,0,AdaBoost (Discrete),2,0.7,0.3818770226537217,0.3386929478519608,95.09419178962708,0.0
21,0,AdaBoost (Real),2,0.7,0.16319926028663892,0.23679856566049903,132.9884397983551,0.0
22,0,Logistic Regression (Penalty = L2),2,0.7,0.5034674063800277,0.4475984891374921,1.6952474117279053,0.0
23,0,Naive Bayes,2,0.7,0.3786407766990291,0.3065287838156661,0.16412925720214844,0.0
24,1,KNeighbors Classifier,0,0.7,0.30719557195571956,0.21634956007660724,2.686042547225952,0.0
25,1,SVC Classifier,0,0.7,0.5299815498154982,0.6247060456424677,22.12596845626831,0.0
26,1,Decision Tree,0,0.7,0.29428044280442806,0.19649618479917255,0.2744140625,0.0
27,1,RandomForest,0,0.7,0.48985239852398527,0.6447160278652763,1.1196210384368896,0.0
28,1,AdaBoost (Discrete),0,0.7,0.2061808118081181,0.23786830383174157,93.5547604560852,0.0
29,1,AdaBoost (Real),0,0.7,0.1305350553505535,0.17696935160005228,132.97813272476196,0.0
30,1,Logistic Regression (Penalty = L2),0,0.7,0.4252767527675277,0.19085513645330168,1.5643696784973145,0.0
31,1,Naive Bayes,0,0.7,0.18588560885608857,0.20747539650508792,0.1627185344696045,0.0
32,1,KNeighbors Classifier,1,0.7,0.3956602031394275,0.17661438173394303,2.506520986557007,0.0
33,1,SVC Classifier,1,0.7,0.44367497691597413,0.16298272798328395,20.421305656433105,0.0
34,1,Decision Tree,1,0.7,0.39058171745152354,0.19020487579575152,0.2528712749481201,0.0
35,1,RandomForest,1,0.7,0.4773776546629732,0.6134991359777334,0.9149127006530762,0.0
36,1,AdaBoost (Discrete),1,0.7,0.3518005540166205,0.29477823719949925,92.17756986618042,0.0
37,1,AdaBoost (Real),1,0.7,0.38180978762696216,0.14945155415815134,124.0427680015564,0.0
38,1,Logistic Regression (Penalty = L2),1,0.7,0.49445983379501385,0.26566322577567236,1.3923940658569336,0.0
39,1,Naive Bayes,1,0.7,0.4843028624192059,0.2461727493011192,0.15179109573364258,0.0
40,1,KNeighbors Classifier,2,0.7,0.42903374942209893,0.2700854075979887,2.4158554077148438,0.0
41,1,SVC Classifier,2,0.7,0.4368932038834951,1.0,19.160945892333984,0.0
42,1,Decision Tree,2,0.7,0.406380027739251,0.18159934987827514,0.225250244140625,0.0
43,1,RandomForest,2,0.7,0.47018030513176146,0.3896435898395173,0.9168596267700195,0.0
44,1,AdaBoost (Discrete),2,0.7,0.3333333333333333,0.29779198182191813,80.02290678024292,0.0
45,1,AdaBoost (Real),2,0.7,0.343042071197411,0.2713410807012674,100.94591617584229,0.0
46,1,Logistic Regression (Penalty = L2),2,0.7,0.5043920480813685,0.19226281225730554,1.2022912502288818,0.0
47,1,Naive Bayes,2,0.7,0.4096162736939436,0.15901381001801368,0.15709710121154785,0.0
48,2,KNeighbors Classifier,0,0.7,0.3011992619926199,0.1923825994755723,2.4918177127838135,0.0
49,2,SVC Classifier,0,0.7,0.5179889298892989,0.5964221362623663,14.51598072052002,0.0
50,2,Decision Tree,0,0.7,0.3519372693726937,0.17729808211891937,0.16534137725830078,0.0
51,2,RandomForest,0,0.7,0.4797047970479705,0.581356859680352,0.6402575969696045,0.0
52,2,AdaBoost (Discrete),0,0.7,0.22047970479704798,0.21933253457701188,60.43082284927368,0.0
53,2,AdaBoost (Real),0,0.7,0.136070110701107,0.15576774960666737,84.22231602668762,0.0
54,2,Logistic Regression (Penalty = L2),0,0.7,0.4123616236162362,0.24941231440428996,0.9256210327148438,0.0
55,2,Naive Bayes,0,0.7,0.2043357933579336,0.2156967663605567,0.10839390754699707,0.0
56,2,KNeighbors Classifier,1,0.7,0.4196675900277008,0.23140509422405184,1.657442569732666,0.0
57,2,SVC Classifier,1,0.7,0.45013850415512463,0.24657015578230046,11.220609188079834,0.0
58,2,Decision Tree,1,0.7,0.3864265927977839,0.2342487605773989,0.17063212394714355,0.0
59,2,RandomForest,1,0.7,0.4801477377654663,0.6261408475066261,0.4781482219696045,0.0
60,2,AdaBoost (Discrete),1,0.7,0.3845798707294552,0.3313498692418189,49.327170848846436,0.0
61,2,AdaBoost (Real),1,0.7,0.20960295475530932,0.2108614868970526,68.2649610042572,0.0
62,2,Logistic Regression (Penalty = L2),1,0.7,0.5009233610341643,0.2960617846267174,0.8158633708953857,0.0
63,2,Naive Bayes,1,0.7,0.4727608494921514,0.23247982366624714,0.10329890251159668,0.0
64,2,KNeighbors Classifier,2,0.7,0.4188626907073509,0.21616012214461025,1.3756468296051025,0.0
65,2,SVC Classifier,2,0.7,0.4368932038834951,1.0,10.312207698822021,0.0
66,2,Decision Tree,2,0.7,0.37309292649098474,0.17470973634138645,0.1544179916381836,0.0
67,2,RandomForest,2,0.7,0.45307443365695793,0.41430308752463046,0.44429445266723633,0.0
68,2,AdaBoost (Discrete),2,0.7,0.3587609801202034,0.2629041198717996,42.38551354408264,0.0
69,2,AdaBoost (Real),2,0.7,0.2501155802126676,0.27882153758469974,60.84136629104614,0.0
70,2,Logistic Regression (Penalty = L2),2,0.7,0.5224225612575127,0.45965547787245825,0.6603655815124512,0.0
71,2,Naive Bayes,2,0.7,0.415164123901988,0.15197594097689418,0.11394572257995605,0.0
72,3,KNeighbors Classifier,0,0.7,0.30719557195571956,0.21634956007660724,1.1799330711364746,0.0
73,3,SVC Classifier,0,0.7,0.5299815498154982,0.6247060456424677,10.02748155593872,0.0
74,3,Decision Tree,0,0.7,0.23247232472324722,0.20037490033893152,0.14197230339050293,0.0
75,3,RandomForest,0,0.7,0.48985239852398527,0.6447160278652763,0.4764845371246338,0.0
76,3,AdaBoost (Discrete),0,0.7,0.2066420664206642,0.23931446717255256,40.11450982093811,0.0
77,3,AdaBoost (Real),0,0.7,0.10055350553505535,0.13628050258978022,56.99354290962219,0.0
78,3,Logistic Regression (Penalty = L2),0,0.7,0.4252767527675277,0.19085513645330168,0.6977837085723877,0.0
79,3,Naive Bayes,0,0.7,0.18588560885608857,0.20747539650508792,0.06107449531555176,0.0
80,3,KNeighbors Classifier,1,0.7,0.3956602031394275,0.17661438173394303,1.0448591709136963,0.0
81,3,SVC Classifier,1,0.7,0.44367497691597413,0.16298272798328395,8.643421411514282,0.0
82,3,Decision Tree,1,0.7,0.40304709141274236,0.25830633416667825,0.09945893287658691,0.0
83,3,RandomForest,1,0.7,0.4773776546629732,0.6134991359777334,0.33167290687561035,0.0
84,3,AdaBoost (Discrete),1,0.7,0.3518005540166205,0.29477823719949925,36.539045333862305,0.0
85,3,AdaBoost (Real),1,0.7,0.38180978762696216,0.14945155415815134,52.26985168457031,0.0
86,3,Logistic Regression (Penalty = L2),1,0.7,0.49445983379501385,0.26566322577567236,0.6486780643463135,0.0
87,3,Naive Bayes,1,0.7,0.4843028624192059,0.2461727493011192,0.12264585494995117,0.0
88,3,KNeighbors Classifier,2,0.7,0.42903374942209893,0.2700854075979887,0.9718105792999268,0.0
89,3,SVC Classifier,2,0.7,0.4368932038834951,1.0,8.898680686950684,0.0
90,3,Decision Tree,2,0.7,0.42256125751271384,0.20804725984743974,0.15751028060913086,0.0
91,3,RandomForest,2,0.7,0.47018030513176146,0.3896435898395173,0.4399526119232178,0.0
92,3,AdaBoost (Discrete),2,0.7,0.3333333333333333,0.29779198182191813,53.66353702545166,0.0
93,3,AdaBoost (Real),2,0.7,0.31946370781322236,0.30475262874744835,75.69045805931091,0.0
94,3,Logistic Regression (Penalty = L2),2,0.7,0.5043920480813685,0.19226281225730554,1.0399539470672607,0.0
95,3,Naive Bayes,2,0.7,0.4096162736939436,0.15901381001801368,0.17467164993286133,0.0
96,4,KNeighbors Classifier,0,0.7,0.3505535055350554,0.15203516712758922,0.5749149322509766,0.0
97,4,SVC Classifier,0,0.7,0.5410516605166051,0.6798627651458892,11.251898765563965,0.0
98,4,Decision Tree,0,0.7,0.34732472324723246,0.21723785051404587,0.16208219528198242,0.0
99,4,RandomForest,0,0.7,0.48800738007380073,0.6347274074559722,0.5720818042755127,0.0
100,4,AdaBoost (Discrete),0,0.7,0.20848708487084872,0.21816134573588566,42.90414762496948,0.0
101,4,AdaBoost (Real),0,0.7,0.08763837638376384,0.152168942323623,66.32461214065552,0.0
102,4,Logistic Regression (Penalty = L2),0,0.7,0.4654059040590406,0.09776326840884245,0.6962606906890869,0.0
103,4,Naive Bayes,0,0.7,0.24861623616236161,0.25554143812395613,0.05312657356262207,0.0
104,4,KNeighbors Classifier,1,0.7,0.4113573407202216,0.15057342523567094,0.7350585460662842,0.0
105,4,SVC Classifier,1,0.7,0.43998153277931673,0.14916575052069256,9.657678842544556,0.0
106,4,Decision Tree,1,0.7,0.44182825484764543,0.21628684803060355,0.13185691833496094,0.0
107,4,RandomForest,1,0.7,0.4843028624192059,0.6083245007801688,0.4407832622528076,0.0
108,4,AdaBoost (Discrete),1,0.7,0.3591874422899354,0.33439059218524003,42.48736262321472,0.0
109,4,AdaBoost (Real),1,0.7,0.20221606648199447,0.27044929127999895,61.56725788116455,0.0
110,4,Logistic Regression (Penalty = L2),1,0.7,0.5143120960295475,0.21403159540836073,0.6629495620727539,0.0
111,4,Naive Bayes,1,0.7,0.47968605724838415,0.4601806472870478,0.16228008270263672,0.0
112,4,KNeighbors Classifier,2,0.7,0.42394822006472493,0.28049493119419594,0.4620840549468994,0.0
113,4,SVC Classifier,2,0.7,0.4368932038834951,1.0,9.33637261390686,0.0
114,4,Decision Tree,2,0.7,0.3892741562644475,0.28336712008708553,0.09109020233154297,0.0
115,4,RandomForest,2,0.7,0.4905224225612575,0.45191137052319946,0.4822535514831543,0.0
116,4,AdaBoost (Discrete),2,0.7,0.3846509477577439,0.3407337801770703,38.945162773132324,0.0
117,4,AdaBoost (Real),2,0.7,0.22098936662043459,0.28438759529613394,59.82967662811279,0.0
118,4,Logistic Regression (Penalty = L2),2,0.7,0.517799352750809,0.429665254144529,0.7056701183319092,0.0
119,4,Naive Bayes,2,0.7,0.4331946370781322,0.24193332048212435,0.11481690406799316,0.0
120,5,KNeighbors Classifier,0,0.7,0.35424354243542433,0.23720013586057995,0.9280445575714111,0.0
121,5,SVC Classifier,0,0.7,0.5387453874538746,0.6694076425208765,10.388550996780396,0.0
122,5,Decision Tree,0,0.7,0.3284132841328413,0.21186560175653704,0.17412900924682617,0.0
123,5,RandomForest,0,0.7,0.4561808118081181,0.5651880809974736,0.48401832580566406,0.0
124,5,AdaBoost (Discrete),0,0.7,0.18957564575645758,0.19477878871698817,41.04621505737305,0.0
125,5,AdaBoost (Real),0,0.7,0.13699261992619927,0.156702948839883,63.232019901275635,0.0
126,5,Logistic Regression (Penalty = L2),0,0.7,0.45433579335793356,0.11800672818668136,0.7748777866363525,0.0
127,5,Naive Bayes,0,0.7,0.24953874538745388,0.26355039536311303,0.09262824058532715,0.0
128,5,KNeighbors Classifier,1,0.7,0.389196675900277,0.19293205561764903,0.8807404041290283,0.0
129,5,SVC Classifier,1,0.7,0.44136657433056325,0.15392054329899538,9.425314903259277,0.0
130,5,Decision Tree,1,0.7,0.4007386888273315,0.19005188418747926,0.09005403518676758,0.0
131,5,RandomForest,1,0.7,0.5060018467220684,0.5774582254862294,0.48842883110046387,0.0
132,5,AdaBoost (Discrete),1,0.7,0.3361034164358264,0.3363900674297717,42.024131059646606,0.0
133,5,AdaBoost (Real),1,0.7,0.24653739612188366,0.2850277081454318,59.89250159263611,0.0
134,5,Logistic Regression (Penalty = L2),1,0.7,0.5069252077562327,0.21944617896464702,0.7954938411712646,0.0
135,5,Naive Bayes,1,0.7,0.47691597414589104,0.4621459770267796,0.07835936546325684,0.0
136,5,KNeighbors Classifier,2,0.7,0.4281091077207582,0.17151623752470432,0.6451501846313477,0.0
137,5,SVC Classifier,2,0.7,0.4368932038834951,1.0,9.222594738006592,0.0
138,5,Decision Tree,2,0.7,0.39158576051779936,0.22856024061021885,0.17336440086364746,0.0
139,5,RandomForest,2,0.7,0.5090152565880721,0.5224864526634277,0.4779646396636963,0.0
140,5,AdaBoost (Discrete),2,0.7,0.39297272306981046,0.24924180573645915,41.36635780334473,0.0
141,5,AdaBoost (Real),2,0.7,0.2635228848821082,0.30691155700131967,60.785415172576904,0.0
142,5,Logistic Regression (Penalty = L2),2,0.7,0.5071659731853907,0.44228617423053523,0.6111354827880859,0.0
143,5,Naive Bayes,2,0.7,0.4331946370781322,0.48206651575466164,0.11017417907714844,0.0
144,6,KNeighbors Classifier,0,0.7,0.3505535055350554,0.15203516712758922,0.5427367687225342,0.0
145,6,SVC Classifier,0,0.7,0.5410516605166051,0.6798627651458892,8.708253860473633,0.0
146,6,Decision Tree,0,0.7,0.33579335793357934,0.21123587719583292,0.12114500999450684,0.0
147,6,RandomForest,0,0.7,0.48800738007380073,0.6347274074559722,0.5013706684112549,0.0
148,6,AdaBoost (Discrete),0,0.7,0.20848708487084872,0.21816134573588566,34.91930079460144,0.0
149,6,AdaBoost (Real),0,0.7,0.10608856088560886,0.18542139814897035,55.13223600387573,0.0
150,6,Logistic Regression (Penalty = L2),0,0.7,0.4654059040590406,0.09776326840884245,0.5957577228546143,0.0
151,6,Naive Bayes,0,0.7,0.24861623616236161,0.25554143812395613,0.08997678756713867,0.0
152,6,KNeighbors Classifier,1,0.7,0.4113573407202216,0.15057342523567094,0.603057861328125,0.0
153,6,SVC Classifier,1,0.7,0.43998153277931673,0.14916575052069256,8.615617513656616,0.0
154,6,Decision Tree,1,0.7,0.40166204986149584,0.21620785336416867,0.11212801933288574,0.0
155,6,RandomForest,1,0.7,0.4843028624192059,0.6083245007801688,0.4264256954193115,0.0
156,6,AdaBoost (Discrete),1,0.7,0.3591874422899354,0.33439059218524003,35.83993339538574,0.0
157,6,AdaBoost (Real),1,0.7,0.2146814404432133,0.27734707374178574,55.255533933639526,0.0
158,6,Logistic Regression (Penalty = L2),1,0.7,0.5143120960295475,0.21403159540836073,0.7297005653381348,0.0
159,6,Naive Bayes,1,0.7,0.47968605724838415,0.4601806472870478,0.10017991065979004,0.0
160,6,KNeighbors Classifier,2,0.7,0.42394822006472493,0.28049493119419594,0.3571319580078125,0.0
161,6,SVC Classifier,2,0.7,0.4368932038834951,1.0,8.758050441741943,0.0
162,6,Decision Tree,2,0.7,0.4160887656033287,0.23355096748109366,0.12610650062561035,0.0
163,6,RandomForest,2,0.7,0.4905224225612575,0.45191137052319946,0.44008636474609375,0.0
164,6,AdaBoost (Discrete),2,0.7,0.3846509477577439,0.3407337801770703,35.4721884727478,0.0
165,6,AdaBoost (Real),2,0.7,0.22792417938049006,0.27593065365132097,54.23194122314453,0.0
166,6,Logistic Regression (Penalty = L2),2,0.7,0.517799352750809,0.429665254144529,0.7468082904815674,0.0
167,6,Naive Bayes,2,0.7,0.4331946370781322,0.24193332048212435,0.0990285873413086,0.0
168,7,KNeighbors Classifier,0,0.7,0.30904059040590404,0.19708500481093727,1.1272521018981934,0.0
169,7,SVC Classifier,0,0.7,0.5295202952029521,0.6249421394778204,8.46461272239685,0.0
170,7,Decision Tree,0,0.7,0.2864391143911439,0.21858174866690838,0.14174175262451172,0.0
171,7,RandomForest,0,0.7,0.4690959409594096,0.6157203718515821,0.395735502243042,0.0
172,7,AdaBoost (Discrete),0,0.7,0.18911439114391143,0.20863691904907927,37.114667892456055,0.0
173,7,AdaBoost (Real),0,0.7,0.12730627306273062,0.19206496116500718,57.991652727127075,0.0
174,7,Logistic Regression (Penalty = L2),0,0.7,0.4598708487084871,0.21280750085220024,0.7679493427276611,0.0
175,7,Naive Bayes,0,0.7,0.2066420664206642,0.246484216893854,0.14454007148742676,0.0
176,7,KNeighbors Classifier,1,0.7,0.4233610341643583,0.20781592951796427,1.041013240814209,0.0
177,7,SVC Classifier,1,0.7,0.4519852262234534,0.260063165868498,9.48576545715332,0.0
178,7,Decision Tree,1,0.7,0.41089566020313945,0.2753587149949379,0.1548161506652832,0.0
179,7,RandomForest,1,0.7,0.4866112650046168,0.6278806142594446,0.4749321937561035,0.0
180,7,AdaBoost (Discrete),1,0.7,0.40304709141274236,0.3123686708986983,40.53477883338928,0.0
181,7,AdaBoost (Real),1,0.7,0.41458910433979684,0.27462191385762824,58.8852117061615,0.0
182,7,Logistic Regression (Penalty = L2),1,0.7,0.5175438596491229,0.2626625211691761,0.7302489280700684,0.0
183,7,Naive Bayes,1,0.7,0.47691597414589104,0.1979040516212727,0.1230463981628418,0.0
184,7,KNeighbors Classifier,2,0.7,0.4137771613499769,0.2652821002257754,0.8761351108551025,0.0
185,7,SVC Classifier,2,0.7,0.4368932038834951,1.0,9.531164169311523,0.0
186,7,Decision Tree,2,0.7,0.3846509477577439,0.24415607074997872,0.15802502632141113,0.0
187,7,RandomForest,2,0.7,0.46601941747572817,0.45797142674555125,0.4252498149871826,0.0
188,7,AdaBoost (Discrete),2,0.7,0.3231622746185853,0.27013370519726104,38.08998346328735,0.0
189,7,AdaBoost (Real),2,0.7,0.23763291724456773,0.28998730871854306,58.11100506782532,0.0
190,7,Logistic Regression (Penalty = L2),2,0.7,0.5293573740175682,0.4563998317961885,0.682288408279419,0.0
191,7,Naive Bayes,2,0.7,0.4114655570966251,0.14234886549371342,0.12171626091003418,0.0
192,8,KNeighbors Classifier,0,0.7,0.30719557195571956,0.21634956007660724,1.275724172592163,0.0
193,8,SVC Classifier,0,0.7,0.5299815498154982,0.6247060456424677,9.662592649459839,0.0
194,8,Decision Tree,0,0.7,0.3556273062730627,0.18366286708525464,0.1428382396697998,0.0
195,8,RandomForest,0,0.7,0.48985239852398527,0.6447160278652763,0.47455883026123047,0.0
196,8,AdaBoost (Discrete),0,0.7,0.2066420664206642,0.23931446717255256,50.66306447982788,0.0
197,8,AdaBoost (Real),0,0.7,0.12592250922509224,0.14512805974205314,74.97162985801697,0.0
198,8,Logistic Regression (Penalty = L2),0,0.7,0.4252767527675277,0.19085513645330168,0.923987627029419,0.0
199,8,Naive Bayes,0,0.7,0.18588560885608857,0.20747539650508792,0.15495657920837402,0.0
200,8,KNeighbors Classifier,1,0.7,0.3956602031394275,0.17661438173394303,1.551701307296753,0.0
201,8,SVC Classifier,1,0.7,0.44367497691597413,0.16298272798328395,12.204731464385986,0.0
202,8,Decision Tree,1,0.7,0.3961218836565097,0.21573942367151838,0.14427661895751953,0.0
203,8,RandomForest,1,0.7,0.4773776546629732,0.6134991359777334,0.594202995300293,0.0
204,8,AdaBoost (Discrete),1,0.7,0.3513388734995383,0.29408135413546915,52.9473922252655,0.0
205,8,AdaBoost (Real),1,0.7,0.38180978762696216,0.14945155415815134,76.87882590293884,0.0
206,8,Logistic Regression (Penalty = L2),1,0.7,0.49445983379501385,0.26566322577567236,0.862818717956543,0.0
207,8,Naive Bayes,1,0.7,0.4843028624192059,0.2461727493011192,0.15770936012268066,0.0
208,8,KNeighbors Classifier,2,0.7,0.42903374942209893,0.2700854075979887,1.415574312210083,0.0
209,8,SVC Classifier,2,0.7,0.4368932038834951,1.0,11.947977304458618,0.0
210,8,Decision Tree,2,0.7,0.39944521497919555,0.2289861651271669,0.20295286178588867,0.0
211,8,RandomForest,2,0.7,0.47018030513176146,0.3896435898395173,0.5299069881439209,0.0
212,8,AdaBoost (Discrete),2,0.7,0.3333333333333333,0.29779198182191813,52.437000036239624,0.0
213,8,AdaBoost (Real),2,0.7,0.2926490984743412,0.32298397113780364,75.60418248176575,0.0
214,8,Logistic Regression (Penalty = L2),2,0.7,0.5043920480813685,0.19226281225730554,0.9683725833892822,0.0
215,8,Naive Bayes,2,0.7,0.4096162736939436,0.15901381001801368,0.1322314739227295,0.0
216,9,KNeighbors Classifier,0,0.7,0.30904059040590404,0.19708500481093727,1.3896515369415283,0.0
217,9,SVC Classifier,0,0.7,0.5295202952029521,0.6249421394778204,12.13288164138794,0.0
218,9,Decision Tree,0,0.7,0.33302583025830257,0.26246087343456775,0.14472150802612305,0.0
219,9,RandomForest,0,0.7,0.4690959409594096,0.6157203718515821,0.5254223346710205,0.0
220,9,AdaBoost (Discrete),0,0.7,0.18957564575645758,0.20894351454089258,49.430506229400635,0.0
221,9,AdaBoost (Real),0,0.7,0.0853321033210332,0.14858852564887684,73.58787703514099,0.0
222,9,Logistic Regression (Penalty = L2),0,0.7,0.4598708487084871,0.21280750085220024,0.9379565715789795,0.0
223,9,Naive Bayes,0,0.7,0.2066420664206642,0.246484216893854,0.1704235076904297,0.0
224,9,KNeighbors Classifier,1,0.7,0.4233610341643583,0.20781592951796427,1.437373161315918,0.0
225,9,SVC Classifier,1,0.7,0.4519852262234534,0.260063165868498,11.954914569854736,0.0
226,9,Decision Tree,1,0.7,0.4325946445060018,0.2225451746409196,0.1875286102294922,0.0
227,9,RandomForest,1,0.7,0.4866112650046168,0.6278806142594446,0.5250952243804932,0.0
228,9,AdaBoost (Discrete),1,0.7,0.40304709141274236,0.3123686708986983,50.06059145927429,0.0
229,9,AdaBoost (Real),1,0.7,0.4155124653739612,0.2766194712252522,72.11414575576782,0.0
230,9,Logistic Regression (Penalty = L2),1,0.7,0.5175438596491229,0.2626625211691761,0.792046070098877,0.0
231,9,Naive Bayes,1,0.7,0.47691597414589104,0.1979040516212727,0.11407756805419922,0.0
232,9,KNeighbors Classifier,2,0.7,0.4137771613499769,0.2652821002257754,1.016308069229126,0.0
233,9,SVC Classifier,2,0.7,0.4368932038834951,1.0,10.189451456069946,0.0
234,9,Decision Tree,2,0.7,0.40129449838187703,0.24906363164763184,0.12888288497924805,0.0
235,9,RandomForest,2,0.7,0.46601941747572817,0.45797142674555125,0.4762759208679199,0.0
236,9,AdaBoost (Discrete),2,0.7,0.3231622746185853,0.27013370519726104,45.102620363235474,0.0
237,9,AdaBoost (Real),2,0.7,0.29680998613037446,0.3330604865030818,72.0809428691864,0.0
238,9,Logistic Regression (Penalty = L2),2,0.7,0.5293573740175682,0.4563998317961885,0.8053638935089111,0.0
239,9,Naive Bayes,2,0.7,0.4114655570966251,0.14234886549371342,0.09861564636230469,0.0
240,10,KNeighbors Classifier,0,0.7,0.28920664206642066,0.19119341614641908,2.5214900970458984,0.0
241,10,SVC Classifier,0,0.7,0.5212177121771218,0.6002837489187511,12.975354194641113,0.0
242,10,Decision Tree,0,0.7,0.34317343173431736,0.22137103716931408,0.19301795959472656,0.0
243,10,RandomForest,0,0.7,0.4921586715867159,0.6367690998377578,0.6258509159088135,0.0
244,10,AdaBoost (Discrete),0,0.7,0.18035055350553506,0.19577071223929085,56.65274000167847,0.0
245,10,AdaBoost (Real),0,0.7,0.13330258302583026,0.1364108600023062,72.85913920402527,0.0
246,10,Logistic Regression (Penalty = L2),0,0.7,0.4072878228782288,0.19386648593239394,0.9901654720306396,0.0
247,10,Naive Bayes,0,0.7,0.1886531365313653,0.20888815864902946,0.09070086479187012,0.0
248,10,KNeighbors Classifier,1,0.7,0.4136657433056325,0.22813429730930496,1.700941562652588,0.0
249,10,SVC Classifier,1,0.7,0.44321329639889195,0.15863573851930093,10.338995456695557,0.0
250,10,Decision Tree,1,0.7,0.39658356417359186,0.17598261721001401,0.16082406044006348,0.0
251,10,RandomForest,1,0.7,0.48753462603878117,0.5542204398432988,0.4751155376434326,0.0
252,10,AdaBoost (Discrete),1,0.7,0.3651892890120037,0.31832396079985786,50.355292081832886,0.0
253,10,AdaBoost (Real),1,0.7,0.3734995383194829,0.10492570493763673,67.9630172252655,0.0
254,10,Logistic Regression (Penalty = L2),1,0.7,0.5,0.33996385249623495,0.8676180839538574,0.0
255,10,Naive Bayes,1,0.7,0.47691597414589104,0.2436476197697974,0.08157610893249512,0.0
256,10,KNeighbors Classifier,2,0.7,0.42487286176606565,0.22069879184355545,1.6854047775268555,0.0
257,10,SVC Classifier,2,0.7,0.4368932038834951,1.0,11.365369319915771,0.0
258,10,Decision Tree,2,0.7,0.3878871937124364,0.23171084064562114,0.1657547950744629,0.0
259,10,RandomForest,2,0.7,0.4627831715210356,0.30070365133849625,0.5285615921020508,0.0
260,10,AdaBoost (Discrete),2,0.7,0.3559870550161812,0.3005456149558376,51.55987000465393,0.0
261,10,AdaBoost (Real),2,0.7,0.31853906611188165,0.25612585972413887,69.88818907737732,0.0
262,10,Logistic Regression (Penalty = L2),2,0.7,0.5196486361534906,0.19649588682616387,0.9856882095336914,0.0
263,10,Naive Bayes,2,0.7,0.4114655570966251,0.14478404935628855,0.13976502418518066,0.0
264,11,KNeighbors Classifier,0,0.7,0.3030442804428044,0.16640711774592565,3.7037131786346436,0.0
265,11,SVC Classifier,0,0.7,0.5295202952029521,0.643494937720922,12.685490131378174,0.0
266,11,Decision Tree,0,0.7,0.31780442804428044,0.23060831521310984,0.17564797401428223,0.0
267,11,RandomForest,0,0.7,0.49308118081180813,0.6495352090771908,0.4867591857910156,0.0
268,11,AdaBoost (Discrete),0,0.7,0.15313653136531366,0.15368319144799839,62.566824197769165,0.0
269,11,AdaBoost (Real),0,0.7,0.1738929889298893,0.1388392760629485,94.3492796421051,0.0
270,11,Logistic Regression (Penalty = L2),0,0.7,0.38883763837638374,0.19583890174176669,1.1683173179626465,0.0
271,11,Naive Bayes,0,0.7,0.1886531365313653,0.2661727256697766,0.11030268669128418,0.0
272,11,KNeighbors Classifier,1,0.7,0.42705447830101567,0.23432887029827568,2.8750762939453125,0.0
273,11,SVC Classifier,1,0.7,0.44182825484764543,0.14948380152256274,15.140430688858032,0.0
274,11,Decision Tree,1,0.7,0.4155124653739612,0.23907635437950442,0.19406485557556152,0.0
275,11,RandomForest,1,0.7,0.4939981532779317,0.5723078121815725,0.622387170791626,0.0
276,11,AdaBoost (Discrete),1,0.7,0.3878116343490305,0.36808387934753906,69.40614771842957,0.0
277,11,AdaBoost (Real),1,0.7,0.3734995383194829,0.1053517435614084,97.04482007026672,0.0
278,11,Logistic Regression (Penalty = L2),1,0.7,0.5036934441366574,0.36044897943126,1.274430274963379,0.0
279,11,Naive Bayes,1,0.7,0.45244690674053556,0.3466847378324841,0.15115761756896973,0.0
280,11,KNeighbors Classifier,2,0.7,0.4165510864539991,0.20753690679568748,3.0584781169891357,0.0
281,11,SVC Classifier,2,0.7,0.4368932038834951,1.0,14.589484930038452,0.0
282,11,Decision Tree,2,0.7,0.3920480813684697,0.2517795260791758,0.20827341079711914,0.0
283,11,RandomForest,2,0.7,0.47249190938511326,0.3565984793532948,0.6135513782501221,0.0
284,11,AdaBoost (Discrete),2,0.7,0.36384650947757746,0.3056707964200595,64.39454913139343,0.0
285,11,AdaBoost (Real),2,0.7,0.332871012482663,0.1573839576074769,85.30761528015137,0.0
286,11,Logistic Regression (Penalty = L2),2,0.7,0.5131761442441054,0.188361804594418,1.3555457592010498,0.0
287,11,Naive Bayes,2,0.7,0.3596856218215442,0.16916446081183378,0.15405869483947754,0.0
288,12,KNeighbors Classifier,0,0.7,0.3505535055350554,0.15203516712758922,0.6703522205352783,0.0
289,12,SVC Classifier,0,0.7,0.5410516605166051,0.6798627651458892,10.458922624588013,0.0
290,12,Decision Tree,0,0.7,0.31226937269372695,0.24351138758617671,0.1437087059020996,0.0
291,12,RandomForest,0,0.7,0.48800738007380073,0.6347274074559722,0.4809575080871582,0.0
292,12,AdaBoost (Discrete),0,0.7,0.20848708487084872,0.21816134573588566,44.27191877365112,0.0
293,12,AdaBoost (Real),0,0.7,0.0940959409594096,0.16341271080521047,67.59766101837158,0.0
294,12,Logistic Regression (Penalty = L2),0,0.7,0.4654059040590406,0.09776326840884245,0.6390731334686279,0.0
295,12,Naive Bayes,0,0.7,0.24861623616236161,0.25554143812395613,0.09750676155090332,0.0
296,12,KNeighbors Classifier,1,0.7,0.4113573407202216,0.15057342523567094,0.5764753818511963,0.0
297,12,SVC Classifier,1,0.7,0.43998153277931673,0.14916575052069256,9.364405393600464,0.0
298,12,Decision Tree,1,0.7,0.39519852262234534,0.22623540909340556,0.1681962013244629,0.0
299,12,RandomForest,1,0.7,0.4843028624192059,0.6083245007801688,0.4764070510864258,0.0
300,12,AdaBoost (Discrete),1,0.7,0.35964912280701755,0.33509905318308775,40.11304450035095,0.0
301,12,AdaBoost (Real),1,0.7,0.234533702677747,0.24007148086939453,67.24760603904724,0.0
302,12,Logistic Regression (Penalty = L2),1,0.7,0.5143120960295475,0.21403159540836073,0.7633056640625,0.0
303,12,Naive Bayes,1,0.7,0.47968605724838415,0.4601806472870478,0.1310420036315918,0.0
304,12,KNeighbors Classifier,2,0.7,0.42394822006472493,0.28049493119419594,0.48061203956604004,0.0
305,12,SVC Classifier,2,0.7,0.4368932038834951,1.0,8.868736982345581,0.0
306,12,Decision Tree,2,0.7,0.4017568192325474,0.29316461017870227,0.12903714179992676,0.0
307,12,RandomForest,2,0.7,0.4905224225612575,0.45191137052319946,0.4640815258026123,0.0
308,12,AdaBoost (Discrete),2,0.7,0.3846509477577439,0.3407337801770703,40.42402267456055,0.0
309,12,AdaBoost (Real),2,0.7,0.21174294960702728,0.26045212246002464,67.14243030548096,0.0
310,12,Logistic Regression (Penalty = L2),2,0.7,0.517799352750809,0.429665254144529,0.6963648796081543,0.0
311,12,Naive Bayes,2,0.7,0.4331946370781322,0.24193332048212435,0.12430095672607422,0.0
