,feat_set_id,classifier,fold_id,feat_th,score,geo_score,exec_t,geo_score_woz
0,0,KNeighbors Classifier,0,0.45,0.792156862745098,0.505580769670668,0.32212042808532715,0.0
1,0,SVC Classifier,0,0.45,0.7607843137254902,1.0,0.2442173957824707,0.0
2,0,Decision Tree,0,0.45,0.7686274509803922,0.6867020911182494,0.08214688301086426,0.0
3,0,RandomForest,0,0.45,0.7607843137254902,1.0,0.653501033782959,0.0
4,0,AdaBoost (Discrete),0,0.45,0.7254901960784313,0.3705986151008815,30.2637677192688,0.0
5,0,AdaBoost (Real),0,0.45,0.596078431372549,0.26063636560758346,51.75289511680603,0.0
6,0,Logistic Regression (Penalty = L2),0,0.45,0.7764705882352941,0.3275473108225278,0.4381718635559082,0.0
7,0,Naive Bayes,0,0.45,0.09019607843137255,0.30139632434832064,0.04487204551696777,0.0
8,0,KNeighbors Classifier,1,0.45,0.816,0.6021683110619066,0.06702446937561035,0.0
9,0,SVC Classifier,1,0.45,0.776,1.0,0.08001351356506348,0.0
10,0,Decision Tree,1,0.45,0.816,0.500678109049936,0.06240558624267578,0.0
11,0,RandomForest,1,0.45,0.776,1.0,0.1810297966003418,0.0
12,0,AdaBoost (Discrete),1,0.45,0.736,0.31079155631342953,23.77248239517212,0.0
13,0,AdaBoost (Real),1,0.45,0.752,0.4667158053688232,31.913405418395996,0.0
14,0,Logistic Regression (Penalty = L2),1,0.45,0.784,0.2853751021838173,0.24778056144714355,0.0
15,0,Naive Bayes,1,0.45,0.08,0.45986329782677027,0.06500005722045898,0.0
16,0,KNeighbors Classifier,2,0.45,0.8065843621399177,0.5841527956104312,0.13692188262939453,0.0
17,0,SVC Classifier,2,0.45,0.7983539094650206,1.0,0.13847088813781738,0.0
18,0,Decision Tree,2,0.45,0.8024691358024691,0.6976863383908974,0.06583952903747559,0.0
19,0,RandomForest,2,0.45,0.7901234567901234,0.6997790520224827,0.4269871711730957,0.0
20,0,AdaBoost (Discrete),2,0.45,0.6995884773662552,0.41924743417739685,26.60523557662964,0.0
21,0,AdaBoost (Real),2,0.45,0.411522633744856,0.4688866405237673,39.46161675453186,0.0
22,0,Logistic Regression (Penalty = L2),2,0.45,0.8065843621399177,0.534493780778225,0.39798879623413086,0.0
23,0,Naive Bayes,2,0.45,0.06995884773662552,0.7565428747114508,0.184126615524292,0.0
24,1,KNeighbors Classifier,0,0.45,0.8235294117647058,0.7015616970039255,0.2359447479248047,0.0
25,1,SVC Classifier,0,0.45,0.7607843137254902,1.0,0.25783252716064453,0.0
26,1,Decision Tree,0,0.45,0.796078431372549,0.8562575023522669,0.0026102066040039062,0.0
27,1,RandomForest,0,0.45,0.7607843137254902,1.0,0.45360279083251953,0.0
28,1,AdaBoost (Discrete),0,0.45,0.6901960784313725,0.5359932868117497,31.354440450668335,0.0
29,1,AdaBoost (Real),0,0.45,0.5098039215686274,0.46037053126771454,43.26742362976074,0.0
30,1,Logistic Regression (Penalty = L2),0,0.45,0.7529411764705882,0.9896907216494846,0.32500147819519043,0.0
31,1,Naive Bayes,0,0.45,0.09803921568627451,0.29331077701527647,0.16711759567260742,0.0
32,1,KNeighbors Classifier,1,0.45,0.732,0.7517769786501978,0.16792654991149902,0.0
33,1,SVC Classifier,1,0.45,0.776,1.0,0.24123597145080566,0.0
34,1,Decision Tree,1,0.45,0.736,0.9283233049504936,0.0828089714050293,0.0
35,1,RandomForest,1,0.45,0.776,1.0,0.5458636283874512,0.0
36,1,AdaBoost (Discrete),1,0.45,0.716,0.5532438243499739,33.011420488357544,0.0
37,1,AdaBoost (Real),1,0.45,0.328,0.2860703459734912,53.14337396621704,0.0
38,1,Logistic Regression (Penalty = L2),1,0.45,0.772,0.44490239865603887,0.40652012825012207,0.0
39,1,Naive Bayes,1,0.45,0.084,0.26830140923465134,0.13357019424438477,0.0
40,1,KNeighbors Classifier,2,0.45,0.8106995884773662,0.7175868135347769,0.22029542922973633,0.0
41,1,SVC Classifier,2,0.45,0.7983539094650206,1.0,0.19671249389648438,0.0
42,1,Decision Tree,2,0.45,0.8271604938271605,0.9123882599788014,0.1268455982208252,0.0
43,1,RandomForest,2,0.45,0.7983539094650206,1.0,0.5340347290039062,0.0
44,1,AdaBoost (Discrete),2,0.45,0.6748971193415638,0.5160863043370713,39.49525046348572,0.0
45,1,AdaBoost (Real),2,0.45,0.7283950617283951,0.9123711340206185,52.091121673583984,0.0
46,1,Logistic Regression (Penalty = L2),2,0.45,0.7818930041152263,0.4935146411515345,0.4350111484527588,0.0
47,1,Naive Bayes,2,0.45,0.08641975308641975,0.37942603546347325,0.11700582504272461,0.0
48,2,KNeighbors Classifier,0,0.45,0.7490196078431373,0.3095370536284227,0.22579717636108398,0.0
49,2,SVC Classifier,0,0.45,0.7607843137254902,1.0,0.20702362060546875,0.0
50,2,Decision Tree,0,0.45,0.7686274509803922,0.4394967226043702,0.0021839141845703125,0.0
51,2,RandomForest,0,0.45,0.7607843137254902,1.0,0.5701682567596436,0.0
52,2,AdaBoost (Discrete),0,0.45,0.7607843137254902,0.2616694886088574,37.40619659423828,0.0
53,2,AdaBoost (Real),0,0.45,0.7647058823529411,0.2871896358074587,48.116682052612305,0.0
54,2,Logistic Regression (Penalty = L2),0,0.45,0.7607843137254902,0.3439247717704234,0.3312101364135742,0.0
55,2,Naive Bayes,0,0.45,0.043137254901960784,0.30676310548712155,0.20403838157653809,0.0
56,2,KNeighbors Classifier,1,0.45,0.792,0.49324241486609405,0.3103017807006836,0.0
57,2,SVC Classifier,1,0.45,0.776,1.0,0.20991015434265137,0.0
58,2,Decision Tree,1,0.45,0.8,0.4472135954999579,0.0014543533325195312,0.0
59,2,RandomForest,1,0.45,0.776,1.0,0.6485083103179932,0.0
60,2,AdaBoost (Discrete),1,0.45,0.768,0.4050794330486773,36.941630363464355,0.0
61,2,AdaBoost (Real),1,0.45,0.78,0.32127586985818757,50.01135301589966,0.0
62,2,Logistic Regression (Penalty = L2),1,0.45,0.776,0.4071947447321208,0.7046716213226318,0.0
63,2,Naive Bayes,1,0.45,0.04,0.15945775785021718,0.21469449996948242,0.0
64,2,KNeighbors Classifier,2,0.45,0.7942386831275721,0.579735671095731,0.32094740867614746,0.0
65,2,SVC Classifier,2,0.45,0.7983539094650206,1.0,0.2157583236694336,0.0
66,2,Decision Tree,2,0.45,0.7983539094650206,0.5041574800327548,0.10642671585083008,0.0
67,2,RandomForest,2,0.45,0.7901234567901234,0.6997790520224827,0.6563975811004639,0.0
68,2,AdaBoost (Discrete),2,0.45,0.7901234567901234,0.49566702650208644,38.747710943222046,0.0
69,2,AdaBoost (Real),2,0.45,0.7818930041152263,0.4939124382737847,55.68379044532776,0.0
70,2,Logistic Regression (Penalty = L2),2,0.45,0.7901234567901234,0.5445882786578613,0.3484988212585449,0.0
71,2,Naive Bayes,2,0.45,0.04526748971193416,0.23004969224668356,0.22153162956237793,0.0
72,3,KNeighbors Classifier,0,0.45,0.7647058823529411,0.2620113175395233,0.32468557357788086,0.0
73,3,SVC Classifier,0,0.45,0.7607843137254902,1.0,0.21063995361328125,0.0
74,3,Decision Tree,0,0.45,0.7725490196078432,0.28514649594268227,0.002214670181274414,0.0
75,3,RandomForest,0,0.45,0.7607843137254902,1.0,0.7726128101348877,0.0
76,3,AdaBoost (Discrete),0,0.45,0.7686274509803922,0.3218297948685433,37.81061601638794,0.0
77,3,AdaBoost (Real),0,0.45,0.7686274509803922,0.3873141779594106,58.988064765930176,0.0
78,3,Logistic Regression (Penalty = L2),0,0.45,0.7725490196078432,0.28514649594268227,0.29649901390075684,0.0
79,3,Naive Bayes,0,0.45,0.043137254901960784,0.3670977715849853,0.1755208969116211,0.0
80,3,KNeighbors Classifier,1,0.45,0.788,0.49239345894554554,0.3206932544708252,0.0
81,3,SVC Classifier,1,0.45,0.776,1.0,0.21661829948425293,0.0
82,3,Decision Tree,1,0.45,0.784,0.2853751021838173,0.0021932125091552734,0.0
83,3,RandomForest,1,0.45,0.776,1.0,0.6493730545043945,0.0
84,3,AdaBoost (Discrete),1,0.45,0.784,0.2853751021838173,43.779496908187866,0.0
85,3,AdaBoost (Real),1,0.45,0.78,0.32127586985818757,61.22306752204895,0.0
86,3,Logistic Regression (Penalty = L2),1,0.45,0.784,0.2853751021838173,0.332688570022583,0.0
87,3,Naive Bayes,1,0.45,0.04,0.33144540173399867,0.22063183784484863,0.0
88,3,KNeighbors Classifier,2,0.45,0.7860082304526749,0.36521058769422116,0.3323099613189697,0.0
89,3,SVC Classifier,2,0.45,0.7983539094650206,1.0,0.22379684448242188,0.0
90,3,Decision Tree,2,0.45,0.7983539094650206,0.4488613467085362,0.10632896423339844,0.0
91,3,RandomForest,2,0.45,0.7901234567901234,0.6997790520224827,0.7058775424957275,0.0
92,3,AdaBoost (Discrete),2,0.45,0.7942386831275721,0.49653968151942107,44.38438963890076,0.0
93,3,AdaBoost (Real),2,0.45,0.8065843621399177,0.43603844046495843,52.23006081581116,0.0
94,3,Logistic Regression (Penalty = L2),2,0.45,0.8024691358024691,0.44945390423181414,0.05913186073303223,0.0
95,3,Naive Bayes,2,0.45,0.03292181069958848,0.6299605249474366,0.024017333984375,0.0
96,4,KNeighbors Classifier,0,0.45,0.7607843137254902,1.0,0.016570091247558594,0.0
97,4,SVC Classifier,0,0.45,0.7607843137254902,1.0,0.015430927276611328,0.0
98,4,Decision Tree,0,0.45,0.7647058823529411,0.408248290463863,0.006326913833618164,0.0
99,4,RandomForest,0,0.45,0.7607843137254902,1.0,0.09090328216552734,0.0
100,4,AdaBoost (Discrete),0,0.45,0.7647058823529411,0.408248290463863,5.80841326713562,0.0
101,4,AdaBoost (Real),0,0.45,0.7647058823529411,0.408248290463863,52.139565229415894,0.0
102,4,Logistic Regression (Penalty = L2),0,0.45,0.7607843137254902,1.0,0.09664559364318848,0.0
103,4,Naive Bayes,0,0.45,0.023529411764705882,0.2295748846661433,0.12479829788208008,0.0
104,4,KNeighbors Classifier,1,0.45,0.78,0.4472135954999579,0.16911935806274414,0.0
105,4,SVC Classifier,1,0.45,0.776,1.0,0.11938858032226562,0.0
106,4,Decision Tree,1,0.45,0.78,0.4472135954999579,0.0012392997741699219,0.0
107,4,RandomForest,1,0.45,0.776,1.0,0.54825758934021,0.0
108,4,AdaBoost (Discrete),1,0.45,0.776,1.0,39.21945381164551,0.0
109,4,AdaBoost (Real),1,0.45,0.776,0.446059493974681,68.4832170009613,0.0
110,4,Logistic Regression (Penalty = L2),1,0.45,0.776,1.0,0.2808661460876465,0.0
111,4,Naive Bayes,1,0.45,0.032,0.3021375397356768,0.2598283290863037,0.0
112,4,KNeighbors Classifier,2,0.45,0.7818930041152263,0.4935146411515345,0.26037049293518066,0.0
113,4,SVC Classifier,2,0.45,0.7983539094650206,1.0,0.23595452308654785,0.0
114,4,Decision Tree,2,0.45,0.7860082304526749,0.4948185130173913,0.001191854476928711,0.0
115,4,RandomForest,2,0.45,0.7983539094650206,1.0,0.7879652976989746,0.0
116,4,AdaBoost (Discrete),2,0.45,0.7983539094650206,1.0,80.10454773902893,0.0
117,4,AdaBoost (Real),2,0.45,0.7818930041152263,0.4935146411515345,117.08609509468079,0.0
118,4,Logistic Regression (Penalty = L2),2,0.45,0.7901234567901234,0.9896907216494846,0.21958613395690918,0.0
119,4,Naive Bayes,2,0.45,0.0205761316872428,0.5,0.4399399757385254,0.0
120,5,KNeighbors Classifier,0,0.45,0.7607843137254902,0.2866927669330738,0.4205002784729004,0.0
121,5,SVC Classifier,0,0.45,0.7607843137254902,1.0,0.4125196933746338,0.0
122,5,Decision Tree,0,0.45,0.7647058823529411,0.31117921763277673,0.21009230613708496,0.0
123,5,RandomForest,0,0.45,0.7607843137254902,1.0,1.0221822261810303,0.0
124,5,AdaBoost (Discrete),0,0.45,0.7686274509803922,0.3115857230292383,82.28136730194092,0.0
125,5,AdaBoost (Real),0,0.45,0.7607843137254902,0.3769890791947507,118.10444188117981,0.0
126,5,Logistic Regression (Penalty = L2),0,0.45,0.7647058823529411,0.3838431694704549,0.5925970077514648,0.0
127,5,Naive Bayes,0,0.45,0.0392156862745098,0.3195771718380609,0.44252729415893555,0.0
128,5,KNeighbors Classifier,1,0.45,0.776,1.0,0.6640455722808838,0.0
129,5,SVC Classifier,1,0.45,0.776,1.0,0.45741868019104004,0.0
130,5,Decision Tree,1,0.45,0.784,0.3218297948685433,0.0022363662719726562,0.0
131,5,RandomForest,1,0.45,0.776,1.0,1.564462423324585,0.0
132,5,AdaBoost (Discrete),1,0.45,0.776,0.4071947447321208,85.6519033908844,0.0
133,5,AdaBoost (Real),1,0.45,0.776,0.4071947447321208,108.86057305335999,0.0
134,5,Logistic Regression (Penalty = L2),1,0.45,0.78,0.408248290463863,0.4315989017486572,0.0
135,5,Naive Bayes,1,0.45,0.036,0.3760603093086394,0.4345386028289795,0.0
136,5,KNeighbors Classifier,2,0.45,0.7942386831275721,0.9948453608247423,0.43121790885925293,0.0
137,5,SVC Classifier,2,0.45,0.7983539094650206,1.0,0.4347419738769531,0.0
138,5,Decision Tree,2,0.45,0.7901234567901234,0.5445882786578613,0.0013115406036376953,0.0
139,5,RandomForest,2,0.45,0.7942386831275721,0.5455521537286048,1.5696783065795898,0.0
140,5,AdaBoost (Discrete),2,0.45,0.7860082304526749,0.6979350987461912,84.25036358833313,0.0
141,5,AdaBoost (Real),2,0.45,0.7942386831275721,0.9948453608247423,91.68226861953735,0.0
142,5,Logistic Regression (Penalty = L2),2,0.45,0.7901234567901234,0.5445882786578613,0.2269277572631836,0.0
143,5,Naive Bayes,2,0.45,0.02880658436213992,0.5,0.20639896392822266,0.0
144,6,KNeighbors Classifier,0,0.45,0.7647058823529411,0.2620113175395233,0.3305356502532959,0.0
145,6,SVC Classifier,0,0.45,0.7607843137254902,1.0,0.21556830406188965,0.0
146,6,Decision Tree,0,0.45,0.7725490196078432,0.28514649594268227,0.0013229846954345703,0.0
147,6,RandomForest,0,0.45,0.7607843137254902,1.0,0.762991189956665,0.0
148,6,AdaBoost (Discrete),0,0.45,0.7686274509803922,0.3218297948685433,36.246145725250244,0.0
149,6,AdaBoost (Real),0,0.45,0.7686274509803922,0.3261165666552968,72.26952075958252,0.0
150,6,Logistic Regression (Penalty = L2),0,0.45,0.7725490196078432,0.28514649594268227,0.21793270111083984,0.0
151,6,Naive Bayes,0,0.45,0.043137254901960784,0.3670977715849853,0.21999478340148926,0.0
152,6,KNeighbors Classifier,1,0.45,0.788,0.49239345894554554,0.3232400417327881,0.0
153,6,SVC Classifier,1,0.45,0.776,1.0,0.21651339530944824,0.0
154,6,Decision Tree,1,0.45,0.784,0.2853751021838173,0.0021512508392333984,0.0
155,6,RandomForest,1,0.45,0.776,1.0,0.47322726249694824,0.0
156,6,AdaBoost (Discrete),1,0.45,0.784,0.2853751021838173,41.56030321121216,0.0
157,6,AdaBoost (Real),1,0.45,0.78,0.32127586985818757,56.10318326950073,0.0
158,6,Logistic Regression (Penalty = L2),1,0.45,0.784,0.2853751021838173,0.3337898254394531,0.0
159,6,Naive Bayes,1,0.45,0.04,0.33144540173399867,0.26185107231140137,0.0
160,6,KNeighbors Classifier,2,0.45,0.7860082304526749,0.36521058769422116,0.34258079528808594,0.0
161,6,SVC Classifier,2,0.45,0.7983539094650206,1.0,0.23206257820129395,0.0
162,6,Decision Tree,2,0.45,0.7983539094650206,0.4488613467085362,0.001911163330078125,0.0
163,6,RandomForest,2,0.45,0.7901234567901234,0.6997790520224827,0.7000854015350342,0.0
164,6,AdaBoost (Discrete),2,0.45,0.7983539094650206,0.4345270299307295,40.3543541431427,0.0
165,6,AdaBoost (Real),2,0.45,0.8065843621399177,0.43603844046495843,51.550506830215454,0.0
166,6,Logistic Regression (Penalty = L2),2,0.45,0.8024691358024691,0.44945390423181414,0.22917985916137695,0.0
167,6,Naive Bayes,2,0.45,0.03292181069958848,0.6299605249474366,0.22161078453063965,0.0
168,7,KNeighbors Classifier,0,0.45,0.7607843137254902,1.0,0.22312569618225098,0.0
169,7,SVC Classifier,0,0.45,0.7607843137254902,1.0,0.2200160026550293,0.0
170,7,Decision Tree,0,0.45,0.7647058823529411,0.408248290463863,0.0018427371978759766,0.0
171,7,RandomForest,0,0.45,0.7607843137254902,1.0,0.559516429901123,0.0
172,7,AdaBoost (Discrete),0,0.45,0.7647058823529411,0.408248290463863,44.07396912574768,0.0
173,7,AdaBoost (Real),0,0.45,0.7607843137254902,1.0,59.357423067092896,0.0
174,7,Logistic Regression (Penalty = L2),0,0.45,0.7607843137254902,1.0,0.22577738761901855,0.0
175,7,Naive Bayes,0,0.45,0.0196078431372549,0.2403749283845681,0.23218941688537598,0.0
176,7,KNeighbors Classifier,1,0.45,0.776,1.0,0.37096095085144043,0.0
177,7,SVC Classifier,1,0.45,0.776,1.0,0.23033928871154785,0.0
178,7,Decision Tree,1,0.45,0.78,0.4472135954999579,0.11019110679626465,0.0
179,7,RandomForest,1,0.45,0.776,1.0,0.7997012138366699,0.0
180,7,AdaBoost (Discrete),1,0.45,0.78,0.4472135954999579,44.242409229278564,0.0
181,7,AdaBoost (Real),1,0.45,0.78,0.4472135954999579,59.54755353927612,0.0
182,7,Logistic Regression (Penalty = L2),1,0.45,0.776,1.0,0.23615598678588867,0.0
183,7,Naive Bayes,1,0.45,0.028,0.09506391005973398,0.22296547889709473,0.0
184,7,KNeighbors Classifier,2,0.45,0.7942386831275721,0.9948453608247423,0.34368014335632324,0.0
185,7,SVC Classifier,2,0.45,0.7983539094650206,1.0,0.22890949249267578,0.0
186,7,Decision Tree,2,0.45,0.7983539094650206,1.0,0.0012140274047851562,0.0
187,7,RandomForest,2,0.45,0.7983539094650206,1.0,0.6684784889221191,0.0
188,7,AdaBoost (Discrete),2,0.45,0.7942386831275721,0.9948453608247423,43.67936325073242,0.0
189,7,AdaBoost (Real),2,0.45,0.7942386831275721,0.9948453608247423,53.67929029464722,0.0
190,7,Logistic Regression (Penalty = L2),2,0.45,0.7942386831275721,0.9948453608247423,0.18550729751586914,0.0
191,7,Naive Bayes,2,0.45,0.02880658436213992,0.12435400084345175,0.3055908679962158,0.0
192,8,KNeighbors Classifier,0,0.45,0.7647058823529411,0.4472135954999579,0.19282817840576172,0.0
193,8,SVC Classifier,0,0.45,0.7607843137254902,1.0,0.20036602020263672,0.0
194,8,Decision Tree,0,0.45,0.7686274509803922,0.3218297948685433,0.09008049964904785,0.0
195,8,RandomForest,0,0.45,0.7607843137254902,1.0,0.6016132831573486,0.0
196,8,AdaBoost (Discrete),0,0.45,0.7647058823529411,0.408248290463863,36.93435835838318,0.0
197,8,AdaBoost (Real),0,0.45,0.7647058823529411,0.408248290463863,45.9692542552948,0.0
198,8,Logistic Regression (Penalty = L2),0,0.45,0.7607843137254902,1.0,0.26636409759521484,0.0
199,8,Naive Bayes,0,0.45,0.023529411764705882,0.2295748846661433,0.18406271934509277,0.0
200,8,KNeighbors Classifier,1,0.45,0.78,0.4472135954999579,0.27831006050109863,0.0
201,8,SVC Classifier,1,0.45,0.776,1.0,0.18363285064697266,0.0
202,8,Decision Tree,1,0.45,0.784,0.34199518933533946,0.0017826557159423828,0.0
203,8,RandomForest,1,0.45,0.776,1.0,0.5273075103759766,0.0
204,8,AdaBoost (Discrete),1,0.45,0.776,1.0,34.4697687625885,0.0
205,8,AdaBoost (Real),1,0.45,0.776,0.446059493974681,48.543689012527466,0.0
206,8,Logistic Regression (Penalty = L2),1,0.45,0.776,1.0,0.19028735160827637,0.0
207,8,Naive Bayes,1,0.45,0.032,0.3021375397356768,0.1933910846710205,0.0
208,8,KNeighbors Classifier,2,0.45,0.7818930041152263,0.4935146411515345,0.18649792671203613,0.0
209,8,SVC Classifier,2,0.45,0.7983539094650206,1.0,0.09475255012512207,0.0
210,8,Decision Tree,2,0.45,0.7818930041152263,0.4935146411515345,0.09051203727722168,0.0
211,8,RandomForest,2,0.45,0.7983539094650206,1.0,0.648247480392456,0.0
212,8,AdaBoost (Discrete),2,0.45,0.7983539094650206,1.0,41.58256149291992,0.0
213,8,AdaBoost (Real),2,0.45,0.7818930041152263,0.4935146411515345,55.9065899848938,0.0
214,8,Logistic Regression (Penalty = L2),2,0.45,0.7901234567901234,0.9896907216494846,0.3298225402832031,0.0
215,8,Naive Bayes,2,0.45,0.0205761316872428,0.5,0.2084352970123291,0.0
216,9,KNeighbors Classifier,0,0.45,0.7607843137254902,0.2866927669330738,0.3361778259277344,0.0
217,9,SVC Classifier,0,0.45,0.7607843137254902,1.0,0.21704411506652832,0.0
218,9,Decision Tree,0,0.45,0.7686274509803922,0.3115857230292383,0.0013370513916015625,0.0
219,9,RandomForest,0,0.45,0.7607843137254902,1.0,0.6548981666564941,0.0
220,9,AdaBoost (Discrete),0,0.45,0.7686274509803922,0.4047822312576163,41.83857250213623,0.0
221,9,AdaBoost (Real),0,0.45,0.7607843137254902,0.3769890791947507,53.5378315448761,0.0
222,9,Logistic Regression (Penalty = L2),0,0.45,0.7647058823529411,0.3838431694704549,0.30600547790527344,0.0
223,9,Naive Bayes,0,0.45,0.0392156862745098,0.3195771718380609,0.21269583702087402,0.0
224,9,KNeighbors Classifier,1,0.45,0.776,1.0,0.31729960441589355,0.0
225,9,SVC Classifier,1,0.45,0.776,1.0,0.20910382270812988,0.0
226,9,Decision Tree,1,0.45,0.78,0.32127586985818757,0.002162933349609375,0.0
227,9,RandomForest,1,0.45,0.776,1.0,0.8334677219390869,0.0
228,9,AdaBoost (Discrete),1,0.45,0.78,0.32127586985818757,40.2984733581543,0.0
229,9,AdaBoost (Real),1,0.45,0.776,0.4071947447321208,52.399446964263916,0.0
230,9,Logistic Regression (Penalty = L2),1,0.45,0.776,0.4071947447321208,0.1930861473083496,0.0
231,9,Naive Bayes,1,0.45,0.036,0.3760603093086394,0.19590973854064941,0.0
232,9,KNeighbors Classifier,2,0.45,0.7942386831275721,0.9948453608247423,0.2798957824707031,0.0
233,9,SVC Classifier,2,0.45,0.7983539094650206,1.0,0.28528761863708496,0.0
234,9,Decision Tree,2,0.45,0.7901234567901234,0.5445882786578613,0.001371145248413086,0.0
235,9,RandomForest,2,0.45,0.7942386831275721,0.5455521537286048,0.6718194484710693,0.0
236,9,AdaBoost (Discrete),2,0.45,0.7901234567901234,0.9896907216494846,36.82812738418579,0.0
237,9,AdaBoost (Real),2,0.45,0.7942386831275721,0.9948453608247423,47.26879000663757,0.0
238,9,Logistic Regression (Penalty = L2),2,0.45,0.7901234567901234,0.5445882786578613,0.28456687927246094,0.0
239,9,Naive Bayes,2,0.45,0.02880658436213992,0.5,0.19074320793151855,0.0
240,10,KNeighbors Classifier,0,0.45,0.7647058823529411,0.2620113175395233,0.2883148193359375,0.0
241,10,SVC Classifier,0,0.45,0.7607843137254902,1.0,0.28644752502441406,0.0
242,10,Decision Tree,0,0.45,0.7686274509803922,0.2848488475943904,0.0941317081451416,0.0
243,10,RandomForest,0,0.45,0.7607843137254902,1.0,0.602362871170044,0.0
244,10,AdaBoost (Discrete),0,0.45,0.7686274509803922,0.2623518137972155,38.69732069969177,0.0
245,10,AdaBoost (Real),0,0.45,0.7686274509803922,0.3261165666552968,69.19225358963013,0.0
246,10,Logistic Regression (Penalty = L2),0,0.45,0.7725490196078432,0.28514649594268227,0.3578464984893799,0.0
247,10,Naive Bayes,0,0.45,0.043137254901960784,0.3670977715849853,0.2517251968383789,0.0
248,10,KNeighbors Classifier,1,0.45,0.788,0.49239345894554554,0.2792825698852539,0.0
249,10,SVC Classifier,1,0.45,0.776,1.0,0.28655529022216797,0.0
250,10,Decision Tree,1,0.45,0.784,0.2853751021838173,0.0013723373413085938,0.0
251,10,RandomForest,1,0.45,0.776,1.0,0.5838735103607178,0.0
252,10,AdaBoost (Discrete),1,0.45,0.78,0.32127586985818757,35.668601751327515,0.0
253,10,AdaBoost (Real),1,0.45,0.78,0.32127586985818757,50.38093018531799,0.0
254,10,Logistic Regression (Penalty = L2),1,0.45,0.784,0.2853751021838173,0.3267064094543457,0.0
255,10,Naive Bayes,1,0.45,0.044,0.16559340774040096,0.09434223175048828,0.0
256,10,KNeighbors Classifier,2,0.45,0.7860082304526749,0.36521058769422116,0.28931474685668945,0.0
257,10,SVC Classifier,2,0.45,0.7983539094650206,1.0,0.18482685089111328,0.0
258,10,Decision Tree,2,0.45,0.7942386831275721,0.4482664330796787,0.09018087387084961,0.0
259,10,RandomForest,2,0.45,0.7901234567901234,0.6997790520224827,0.6301889419555664,0.0
260,10,AdaBoost (Discrete),2,0.45,0.7942386831275721,0.49653968151942107,35.72701382637024,0.0
261,10,AdaBoost (Real),2,0.45,0.7942386831275721,0.49653968151942107,47.05547332763672,0.0
262,10,Logistic Regression (Penalty = L2),2,0.45,0.8024691358024691,0.44945390423181414,0.40471339225769043,0.0
263,10,Naive Bayes,2,0.45,0.04526748971193416,0.24935316404995922,0.33301758766174316,0.0
264,11,KNeighbors Classifier,0,0.45,0.8156862745098039,0.6790752777955172,0.44213032722473145,0.0
265,11,SVC Classifier,0,0.45,0.7607843137254902,1.0,0.33058810234069824,0.0
266,11,Decision Tree,0,0.45,0.796078431372549,0.7804734943878556,0.11095380783081055,0.0
267,11,RandomForest,0,0.45,0.7607843137254902,1.0,0.7836611270904541,0.0
268,11,AdaBoost (Discrete),0,0.45,0.7647058823529411,0.5076552607314919,48.00996685028076,0.0
269,11,AdaBoost (Real),0,0.45,0.6784313725490196,0.38801809350352506,61.53631281852722,0.0
270,11,Logistic Regression (Penalty = L2),0,0.45,0.7529411764705882,0.2836456415383528,0.6657505035400391,0.0
271,11,Naive Bayes,0,0.45,0.11764705882352941,0.32912771291696835,0.22589802742004395,0.0
272,11,KNeighbors Classifier,1,0.45,0.744,0.7301909269997741,0.3348267078399658,0.0
273,11,SVC Classifier,1,0.45,0.776,1.0,0.4829273223876953,0.0
274,11,Decision Tree,1,0.45,0.796,0.9382700922504694,0.0017943382263183594,0.0
275,11,RandomForest,1,0.45,0.776,1.0,0.682396411895752,0.0
276,11,AdaBoost (Discrete),1,0.45,0.8,0.6433851479631425,47.008429765701294,0.0
277,11,AdaBoost (Real),1,0.45,0.72,0.5033779843569391,60.3513126373291,0.0
278,11,Logistic Regression (Penalty = L2),1,0.45,0.8,0.39704095828714797,0.7714841365814209,0.0
279,11,Naive Bayes,1,0.45,0.084,0.279199252841938,0.27150678634643555,0.0
280,11,KNeighbors Classifier,2,0.45,0.8024691358024691,0.6561287943726687,0.43248581886291504,0.0
281,11,SVC Classifier,2,0.45,0.7983539094650206,1.0,0.43010497093200684,0.0
282,11,Decision Tree,2,0.45,0.7777777777777778,0.8324458573507347,0.003060579299926758,0.0
283,11,RandomForest,2,0.45,0.8065843621399177,0.7071067811865476,0.6509389877319336,0.0
284,11,AdaBoost (Discrete),2,0.45,0.7654320987654321,0.6748940404620429,46.295456647872925,0.0
285,11,AdaBoost (Real),2,0.45,0.7037037037037037,0.5710157099195491,63.51885747909546,0.0
286,11,Logistic Regression (Penalty = L2),2,0.45,0.7818930041152263,0.44646733417548745,0.6002902984619141,0.0
287,11,Naive Bayes,2,0.45,0.10699588477366255,0.4563925617881304,0.2087383270263672,0.0
288,12,KNeighbors Classifier,0,0.45,0.7607843137254902,1.0,0.22699284553527832,0.0
289,12,SVC Classifier,0,0.45,0.7607843137254902,1.0,0.215684175491333,0.0
290,12,Decision Tree,0,0.45,0.7607843137254902,0.4071947447321208,0.002022981643676758,0.0
291,12,RandomForest,0,0.45,0.7450980392156863,0.979381443298969,0.8414168357849121,0.0
292,12,AdaBoost (Discrete),0,0.45,0.7607843137254902,0.4071947447321208,40.619807958602905,0.0
293,12,AdaBoost (Real),0,0.45,0.7647058823529411,0.408248290463863,57.24391055107117,0.0
294,12,Logistic Regression (Penalty = L2),0,0.45,0.7607843137254902,1.0,0.286238431930542,0.0
295,12,Naive Bayes,0,0.45,0.0196078431372549,0.2403749283845681,0.20032525062561035,0.0
296,12,KNeighbors Classifier,1,0.45,0.776,1.0,0.10138702392578125,0.0
297,12,SVC Classifier,1,0.45,0.776,1.0,0.19010615348815918,0.0
298,12,Decision Tree,1,0.45,0.78,0.4472135954999579,0.0939335823059082,0.0
299,12,RandomForest,1,0.45,0.776,1.0,0.4740591049194336,0.0
300,12,AdaBoost (Discrete),1,0.45,0.78,0.4472135954999579,37.000981092453,0.0
301,12,AdaBoost (Real),1,0.45,0.78,0.4472135954999579,50.336705684661865,0.0
302,12,Logistic Regression (Penalty = L2),1,0.45,0.776,1.0,0.2858898639678955,0.0
303,12,Naive Bayes,1,0.45,0.024,0.408248290463863,0.09790992736816406,0.0
304,12,KNeighbors Classifier,2,0.45,0.7983539094650206,1.0,0.09798765182495117,0.0
305,12,SVC Classifier,2,0.45,0.7983539094650206,1.0,0.19180512428283691,0.0
306,12,Decision Tree,2,0.45,0.7983539094650206,1.0,0.0019676685333251953,0.0
307,12,RandomForest,2,0.45,0.7983539094650206,1.0,0.5691797733306885,0.0
308,12,AdaBoost (Discrete),2,0.45,0.7942386831275721,0.9948453608247423,37.47022867202759,0.0
309,12,AdaBoost (Real),2,0.45,0.7942386831275721,0.9948453608247423,48.59969162940979,0.0
310,12,Logistic Regression (Penalty = L2),2,0.45,0.7983539094650206,1.0,0.2005765438079834,0.0
311,12,Naive Bayes,2,0.45,0.01646090534979424,1.0,0.1829078197479248,0.0
