,feat_set_id,classifier,fold_id,feat_th,score,geo_score,exec_t,geo_score_woz
0,0,KNeighbors Classifier,0,0.35,0.7647058823529411,0.3051845274712292,0.2620227336883545,0.0
1,0,SVC Classifier,0,0.35,0.7607843137254902,1.0,0.1910402774810791,0.0
2,0,Decision Tree,0,0.35,0.7725490196078432,0.3265403707549072,0.001619577407836914,0.0
3,0,RandomForest,0,0.35,0.7607843137254902,1.0,0.3537311553955078,0.0
4,0,AdaBoost (Discrete),0,0.35,0.7686274509803922,0.3261165666552968,24.587761640548706,0.0
5,0,AdaBoost (Real),0,0.35,0.7411764705882353,0.39982810483487013,43.04091811180115,0.0
6,0,Logistic Regression (Penalty = L2),0,0.35,0.7686274509803922,0.3261165666552968,0.31720781326293945,0.0
7,0,Naive Bayes,0,0.35,0.058823529411764705,0.4641588833612779,0.0978999137878418,0.0
8,0,KNeighbors Classifier,1,0.35,0.78,0.32127586985818757,0.2552773952484131,0.0
9,0,SVC Classifier,1,0.35,0.776,1.0,0.13457679748535156,0.0
10,0,Decision Tree,1,0.35,0.796,0.3760603093086394,0.07774949073791504,0.0
11,0,RandomForest,1,0.35,0.776,1.0,0.4473714828491211,0.0
12,0,AdaBoost (Discrete),1,0.35,0.792,0.49324241486609405,25.92963671684265,0.0
13,0,AdaBoost (Real),1,0.35,0.74,0.3902587920470759,37.0348117351532,0.0
14,0,Logistic Regression (Penalty = L2),1,0.35,0.78,0.32127586985818757,0.3093421459197998,0.0
15,0,Naive Bayes,1,0.35,0.052,0.47428812195586234,0.0818023681640625,0.0
16,0,KNeighbors Classifier,2,0.35,0.8065843621399177,0.43603844046495843,0.16630291938781738,0.0
17,0,SVC Classifier,2,0.35,0.7983539094650206,1.0,0.16223812103271484,0.0
18,0,Decision Tree,2,0.35,0.8024691358024691,0.44945390423181414,0.0022792816162109375,0.0
19,0,RandomForest,2,0.35,0.7901234567901234,0.6997790520224827,0.5004749298095703,0.0
20,0,AdaBoost (Discrete),2,0.35,0.7942386831275721,0.4482664330796787,31.603501081466675,0.0
21,0,AdaBoost (Real),2,0.35,0.7448559670781894,0.5337527128091236,42.885403871536255,0.0
22,0,Logistic Regression (Penalty = L2),2,0.35,0.8024691358024691,0.44945390423181414,0.29958367347717285,0.0
23,0,Naive Bayes,2,0.35,0.04938271604938271,0.7825422900366437,0.18028044700622559,0.0
24,1,KNeighbors Classifier,0,0.35,0.792156862745098,0.6426280768968415,0.1824636459350586,0.0
25,1,SVC Classifier,0,0.35,0.7607843137254902,1.0,0.1917555332183838,0.0
26,1,Decision Tree,0,0.35,0.788235294117647,0.5303896212628101,0.09468436241149902,0.0
27,1,RandomForest,0,0.35,0.7607843137254902,1.0,0.481403112411499,0.0
28,1,AdaBoost (Discrete),0,0.35,0.7333333333333333,0.4451350517973486,37.742796659469604,0.0
29,1,AdaBoost (Real),0,0.35,0.7058823529411765,0.5051023932249066,50.43082571029663,0.0
30,1,Logistic Regression (Penalty = L2),0,0.35,0.7607843137254902,0.446059493974681,0.2990756034851074,0.0
31,1,Naive Bayes,0,0.35,0.08235294117647059,0.2508096999745844,0.2034296989440918,0.0
32,1,KNeighbors Classifier,1,0.35,0.768,0.8649819079870731,0.19317984580993652,0.0
33,1,SVC Classifier,1,0.35,0.776,1.0,0.19184470176696777,0.0
34,1,Decision Tree,1,0.35,0.696,0.6343431055017867,0.002436399459838867,0.0
35,1,RandomForest,1,0.35,0.776,1.0,0.6813821792602539,0.0
36,1,AdaBoost (Discrete),1,0.35,0.636,0.5281944144774786,40.71588397026062,0.0
37,1,AdaBoost (Real),1,0.35,0.744,0.4980122327116293,71.87192416191101,0.0
38,1,Logistic Regression (Penalty = L2),1,0.35,0.78,0.34140655617640037,0.3232588768005371,0.0
39,1,Naive Bayes,1,0.35,0.056,0.20859155250247424,0.22043633460998535,0.0
40,1,KNeighbors Classifier,2,0.35,0.7325102880658436,0.7571285357250909,0.3199961185455322,0.0
41,1,SVC Classifier,2,0.35,0.7983539094650206,1.0,0.20813703536987305,0.0
42,1,Decision Tree,2,0.35,0.7736625514403292,0.8229947583068706,0.10252618789672852,0.0
43,1,RandomForest,2,0.35,0.7983539094650206,1.0,0.6023647785186768,0.0
44,1,AdaBoost (Discrete),2,0.35,0.6995884773662552,0.6117284177111479,40.264228105545044,0.0
45,1,AdaBoost (Real),2,0.35,0.7325102880658436,0.6673818213307288,54.376407861709595,0.0
46,1,Logistic Regression (Penalty = L2),2,0.35,0.7942386831275721,0.497416003373807,0.20926308631896973,0.0
47,1,Naive Bayes,2,0.35,0.06584362139917696,0.41008714685326075,0.2034463882446289,0.0
48,2,KNeighbors Classifier,0,0.35,0.7607843137254902,0.2866927669330738,0.3121025562286377,0.0
49,2,SVC Classifier,0,0.35,0.7607843137254902,1.0,0.2074720859527588,0.0
50,2,Decision Tree,0,0.35,0.7686274509803922,0.3115857230292383,0.001329660415649414,0.0
51,2,RandomForest,0,0.35,0.7607843137254902,1.0,0.6256508827209473,0.0
52,2,AdaBoost (Discrete),0,0.35,0.7647058823529411,0.3838431694704549,39.46128582954407,0.0
53,2,AdaBoost (Real),0,0.35,0.7607843137254902,0.304656525504104,54.65777921676636,0.0
54,2,Logistic Regression (Penalty = L2),0,0.35,0.7647058823529411,0.3838431694704549,0.21986794471740723,0.0
55,2,Naive Bayes,0,0.35,0.0392156862745098,0.28573809127083305,0.3325989246368408,0.0
56,2,KNeighbors Classifier,1,0.35,0.776,1.0,0.3079245090484619,0.0
57,2,SVC Classifier,1,0.35,0.776,1.0,0.22324562072753906,0.0
58,2,Decision Tree,1,0.35,0.784,0.3218297948685433,0.002161741256713867,0.0
59,2,RandomForest,1,0.35,0.776,1.0,0.6675558090209961,0.0
60,2,AdaBoost (Discrete),1,0.35,0.776,0.4071947447321208,43.151777029037476,0.0
61,2,AdaBoost (Real),1,0.35,0.78,0.32127586985818757,56.001538038253784,0.0
62,2,Logistic Regression (Penalty = L2),1,0.35,0.78,0.408248290463863,0.3107259273529053,0.0
63,2,Naive Bayes,1,0.35,0.04,0.15945775785021718,0.25382542610168457,0.0
64,2,KNeighbors Classifier,2,0.35,0.7983539094650206,1.0,0.34090447425842285,0.0
65,2,SVC Classifier,2,0.35,0.7983539094650206,1.0,0.2285327911376953,0.0
66,2,Decision Tree,2,0.35,0.7942386831275721,0.5455521537286048,0.0013675689697265625,0.0
67,2,RandomForest,2,0.35,0.7901234567901234,0.6997790520224827,0.6975433826446533,0.0
68,2,AdaBoost (Discrete),2,0.35,0.7942386831275721,0.5455521537286048,44.081632137298584,0.0
69,2,AdaBoost (Real),2,0.35,0.8024691358024691,0.5758603305272156,58.334203481674194,0.0
70,2,Logistic Regression (Penalty = L2),2,0.35,0.7942386831275721,0.5455521537286048,0.24444150924682617,0.0
71,2,Naive Bayes,2,0.35,0.04938271604938271,0.23004969224668356,0.1535656452178955,0.0
72,3,KNeighbors Classifier,0,0.35,0.7647058823529411,0.2620113175395233,0.4250204563140869,0.0
73,3,SVC Classifier,0,0.35,0.7607843137254902,1.0,0.2359015941619873,0.0
74,3,Decision Tree,0,0.35,0.7686274509803922,0.2848488475943904,0.0018537044525146484,0.0
75,3,RandomForest,0,0.35,0.7607843137254902,1.0,0.8825128078460693,0.0
76,3,AdaBoost (Discrete),0,0.35,0.7686274509803922,0.3261165666552968,43.744205713272095,0.0
77,3,AdaBoost (Real),0,0.35,0.7686274509803922,0.3873141779594106,58.60506010055542,0.0
78,3,Logistic Regression (Penalty = L2),0,0.35,0.7725490196078432,0.28514649594268227,0.24962711334228516,0.0
79,3,Naive Bayes,0,0.35,0.043137254901960784,0.3670977715849853,0.2168891429901123,0.0
80,3,KNeighbors Classifier,1,0.35,0.788,0.49239345894554554,0.3472568988800049,0.0
81,3,SVC Classifier,1,0.35,0.776,1.0,0.26645493507385254,0.0
82,3,Decision Tree,1,0.35,0.784,0.2853751021838173,0.11798977851867676,0.0
83,3,RandomForest,1,0.35,0.776,1.0,0.7512400150299072,0.0
84,3,AdaBoost (Discrete),1,0.35,0.78,0.32127586985818757,41.6343629360199,0.0
85,3,AdaBoost (Real),1,0.35,0.78,0.32127586985818757,60.14763879776001,0.0
86,3,Logistic Regression (Penalty = L2),1,0.35,0.788,0.28574404296988,0.325894832611084,0.0
87,3,Naive Bayes,1,0.35,0.04,0.33144540173399867,0.12117528915405273,0.0
88,3,KNeighbors Classifier,2,0.35,0.7777777777777778,0.36391779603417973,0.38627028465270996,0.0
89,3,SVC Classifier,2,0.35,0.7983539094650206,1.0,0.24593877792358398,0.0
90,3,Decision Tree,2,0.35,0.7942386831275721,0.4482664330796787,0.11361241340637207,0.0
91,3,RandomForest,2,0.35,0.7901234567901234,0.6997790520224827,1.2920968532562256,0.0
92,3,AdaBoost (Discrete),2,0.35,0.7983539094650206,0.4345270299307295,42.98668384552002,0.0
93,3,AdaBoost (Real),2,0.35,0.7983539094650206,0.49870967526827226,61.97112727165222,0.0
94,3,Logistic Regression (Penalty = L2),2,0.35,0.8024691358024691,0.44945390423181414,0.45435380935668945,0.0
95,3,Naive Bayes,2,0.35,0.03292181069958848,0.6299605249474366,0.3235812187194824,0.0
96,4,KNeighbors Classifier,0,0.35,0.7607843137254902,1.0,0.09859633445739746,0.0
97,4,SVC Classifier,0,0.35,0.7607843137254902,1.0,0.11164426803588867,0.0
98,4,Decision Tree,0,0.35,0.7607843137254902,1.0,0.0012216567993164062,0.0
99,4,RandomForest,0,0.35,0.7607843137254902,1.0,0.7785346508026123,0.0
100,4,AdaBoost (Discrete),0,0.35,0.7647058823529411,0.408248290463863,48.7411470413208,0.0
101,4,AdaBoost (Real),0,0.35,0.7607843137254902,1.0,58.748459339141846,0.0
102,4,Logistic Regression (Penalty = L2),0,0.35,0.7607843137254902,1.0,0.41222620010375977,0.0
103,4,Naive Bayes,0,0.35,0.01568627450980392,0.28867513459481287,0.3916299343109131,0.0
104,4,KNeighbors Classifier,1,0.35,0.776,1.0,0.3762187957763672,0.0
105,4,SVC Classifier,1,0.35,0.776,1.0,0.1808786392211914,0.0
106,4,Decision Tree,1,0.35,0.776,1.0,0.0019423961639404297,0.0
107,4,RandomForest,1,0.35,0.776,1.0,1.0251140594482422,0.0
108,4,AdaBoost (Discrete),1,0.35,0.776,1.0,74.37690234184265,0.0
109,4,AdaBoost (Real),1,0.35,0.776,1.0,92.26877045631409,0.0
110,4,Logistic Regression (Penalty = L2),1,0.35,0.776,1.0,0.4138174057006836,0.0
111,4,Naive Bayes,1,0.35,0.02,0.8333333333333334,0.4155890941619873,0.0
112,4,KNeighbors Classifier,2,0.35,0.7942386831275721,0.9948453608247423,0.24800825119018555,0.0
113,4,SVC Classifier,2,0.35,0.7983539094650206,1.0,0.4347810745239258,0.0
114,4,Decision Tree,2,0.35,0.7942386831275721,0.9948453608247423,0.0019159317016601562,0.0
115,4,RandomForest,2,0.35,0.7942386831275721,0.9948453608247423,1.4528849124908447,0.0
116,4,AdaBoost (Discrete),2,0.35,0.7942386831275721,0.9948453608247423,70.54937291145325,0.0
117,4,AdaBoost (Real),2,0.35,0.7942386831275721,0.9948453608247423,100.28348636627197,0.0
118,4,Logistic Regression (Penalty = L2),2,0.35,0.7983539094650206,1.0,0.43468260765075684,0.0
119,4,Naive Bayes,2,0.35,0.01646090534979424,1.0,0.21724724769592285,0.0
120,5,KNeighbors Classifier,0,0.35,0.7607843137254902,0.3769890791947507,0.4444878101348877,0.0
121,5,SVC Classifier,0,0.35,0.7607843137254902,1.0,0.4627211093902588,0.0
122,5,Decision Tree,0,0.35,0.7647058823529411,0.3838431694704549,0.19780898094177246,0.0
123,5,RandomForest,0,0.35,0.7607843137254902,1.0,1.082273006439209,0.0
124,5,AdaBoost (Discrete),0,0.35,0.7647058823529411,0.6308233860042737,71.0233268737793,0.0
125,5,AdaBoost (Real),0,0.35,0.7607843137254902,0.3769890791947507,98.83057975769043,0.0
126,5,Logistic Regression (Penalty = L2),0,0.35,0.7647058823529411,0.3838431694704549,0.49053382873535156,0.0
127,5,Naive Bayes,0,0.35,0.03529411764705882,0.32696253113310975,0.44638919830322266,0.0
128,5,KNeighbors Classifier,1,0.35,0.764,0.9845360824742269,0.45552849769592285,0.0
129,5,SVC Classifier,1,0.35,0.776,1.0,0.2296133041381836,0.0
130,5,Decision Tree,1,0.35,0.78,0.408248290463863,0.002014636993408203,0.0
131,5,RandomForest,1,0.35,0.776,1.0,1.365562915802002,0.0
132,5,AdaBoost (Discrete),1,0.35,0.776,0.4071947447321208,74.1228597164154,0.0
133,5,AdaBoost (Real),1,0.35,0.776,0.4071947447321208,99.62029767036438,0.0
134,5,Logistic Regression (Penalty = L2),1,0.35,0.78,0.408248290463863,0.5776166915893555,0.0
135,5,Naive Bayes,1,0.35,0.036,0.3760603093086394,0.3910102844238281,0.0
136,5,KNeighbors Classifier,2,0.35,0.7983539094650206,1.0,0.23425555229187012,0.0
137,5,SVC Classifier,2,0.35,0.7983539094650206,1.0,0.4628441333770752,0.0
138,5,Decision Tree,2,0.35,0.7942386831275721,0.5455521537286048,0.21787619590759277,0.0
139,5,RandomForest,2,0.35,0.7942386831275721,0.5455521537286048,1.0785119533538818,0.0
140,5,AdaBoost (Discrete),2,0.35,0.7901234567901234,0.6997790520224827,62.138742446899414,0.0
141,5,AdaBoost (Real),2,0.35,0.8024691358024691,0.5758603305272156,51.798298358917236,0.0
142,5,Logistic Regression (Penalty = L2),2,0.35,0.7942386831275721,0.5455521537286048,0.20818114280700684,0.0
143,5,Naive Bayes,2,0.35,0.037037037037037035,0.4518010018049224,0.10598063468933105,0.0
144,6,KNeighbors Classifier,0,0.35,0.7647058823529411,0.2620113175395233,0.2099008560180664,0.0
145,6,SVC Classifier,0,0.35,0.7607843137254902,1.0,0.18704891204833984,0.0
146,6,Decision Tree,0,0.35,0.7686274509803922,0.3261165666552968,0.002088785171508789,0.0
147,6,RandomForest,0,0.35,0.7607843137254902,1.0,0.7390990257263184,0.0
148,6,AdaBoost (Discrete),0,0.35,0.7647058823529411,0.3051845274712292,41.00806403160095,0.0
149,6,AdaBoost (Real),0,0.35,0.7686274509803922,0.3261165666552968,81.24515342712402,0.0
150,6,Logistic Regression (Penalty = L2),0,0.35,0.7686274509803922,0.3261165666552968,0.32222437858581543,0.0
151,6,Naive Bayes,0,0.35,0.0392156862745098,0.447213595499958,0.10880136489868164,0.0
152,6,KNeighbors Classifier,1,0.35,0.788,0.49239345894554554,0.22880816459655762,0.0
153,6,SVC Classifier,1,0.35,0.776,1.0,0.22479820251464844,0.0
154,6,Decision Tree,1,0.35,0.784,0.3218297948685433,0.10635042190551758,0.0
155,6,RandomForest,1,0.35,0.776,1.0,0.6467845439910889,0.0
156,6,AdaBoost (Discrete),1,0.35,0.776,0.446059493974681,42.39083170890808,0.0
157,6,AdaBoost (Real),1,0.35,0.78,0.32127586985818757,58.689098596572876,0.0
158,6,Logistic Regression (Penalty = L2),1,0.35,0.784,0.3218297948685433,0.21617913246154785,0.0
159,6,Naive Bayes,1,0.35,0.04,0.33144540173399867,0.10567164421081543,0.0
160,6,KNeighbors Classifier,2,0.35,0.7818930041152263,0.36456533796210266,0.3282623291015625,0.0
161,6,SVC Classifier,2,0.35,0.7983539094650206,1.0,0.28660154342651367,0.0
162,6,Decision Tree,2,0.35,0.7942386831275721,0.4482664330796787,0.09744501113891602,0.0
163,6,RandomForest,2,0.35,0.7983539094650206,0.5465126348554787,0.6288142204284668,0.0
164,6,AdaBoost (Discrete),2,0.35,0.7901234567901234,0.49566702650208644,42.65577006340027,0.0
165,6,AdaBoost (Real),2,0.35,0.8024691358024691,0.5,54.72587013244629,0.0
166,6,Logistic Regression (Penalty = L2),2,0.35,0.8024691358024691,0.44945390423181414,0.20270538330078125,0.0
167,6,Naive Bayes,2,0.35,0.03292181069958848,0.6299605249474366,0.21628808975219727,0.0
168,7,KNeighbors Classifier,0,0.35,0.7607843137254902,1.0,0.21878576278686523,0.0
169,7,SVC Classifier,0,0.35,0.7607843137254902,1.0,0.21954798698425293,0.0
170,7,Decision Tree,0,0.35,0.7647058823529411,0.408248290463863,0.001779317855834961,0.0
171,7,RandomForest,0,0.35,0.7607843137254902,1.0,0.7730576992034912,0.0
172,7,AdaBoost (Discrete),0,0.35,0.7647058823529411,0.408248290463863,41.737144231796265,0.0
173,7,AdaBoost (Real),0,0.35,0.7647058823529411,0.408248290463863,58.14499521255493,0.0
174,7,Logistic Regression (Penalty = L2),0,0.35,0.7607843137254902,1.0,0.22481274604797363,0.0
175,7,Naive Bayes,0,0.35,0.03137254901960784,0.408248290463863,0.22422075271606445,0.0
176,7,KNeighbors Classifier,1,0.35,0.776,1.0,0.34597063064575195,0.0
177,7,SVC Classifier,1,0.35,0.776,1.0,0.21064352989196777,0.0
178,7,Decision Tree,1,0.35,0.78,0.4472135954999579,0.10622739791870117,0.0
179,7,RandomForest,1,0.35,0.776,1.0,0.7573025226593018,0.0
180,7,AdaBoost (Discrete),1,0.35,0.78,0.4472135954999579,44.02984929084778,0.0
181,7,AdaBoost (Real),1,0.35,0.78,0.4472135954999579,57.39419651031494,0.0
182,7,Logistic Regression (Penalty = L2),1,0.35,0.776,1.0,0.2116405963897705,0.0
183,7,Naive Bayes,1,0.35,0.032,0.10102047864498133,0.10813665390014648,0.0
184,7,KNeighbors Classifier,2,0.35,0.7860082304526749,0.9845360824742269,0.22446298599243164,0.0
185,7,SVC Classifier,2,0.35,0.7983539094650206,1.0,0.22286009788513184,0.0
186,7,Decision Tree,2,0.35,0.7983539094650206,1.0,0.11780238151550293,0.0
187,7,RandomForest,2,0.35,0.7983539094650206,1.0,0.7837543487548828,0.0
188,7,AdaBoost (Discrete),2,0.35,0.7983539094650206,1.0,43.25248312950134,0.0
189,7,AdaBoost (Real),2,0.35,0.7983539094650206,1.0,55.29660153388977,0.0
190,7,Logistic Regression (Penalty = L2),2,0.35,0.7983539094650206,1.0,0.3219738006591797,0.0
191,7,Naive Bayes,2,0.35,0.037037037037037035,0.12435400084345175,0.18010735511779785,0.0
192,8,KNeighbors Classifier,0,0.35,0.7607843137254902,1.0,0.1909642219543457,0.0
193,8,SVC Classifier,0,0.35,0.7607843137254902,1.0,0.19960689544677734,0.0
194,8,Decision Tree,0,0.35,0.7647058823529411,0.408248290463863,0.0012803077697753906,0.0
195,8,RandomForest,0,0.35,0.7607843137254902,1.0,0.6526966094970703,0.0
196,8,AdaBoost (Discrete),0,0.35,0.7647058823529411,0.408248290463863,41.63563656806946,0.0
197,8,AdaBoost (Real),0,0.35,0.7647058823529411,0.408248290463863,53.16075873374939,0.0
198,8,Logistic Regression (Penalty = L2),0,0.35,0.7607843137254902,1.0,0.19272637367248535,0.0
199,8,Naive Bayes,0,0.35,0.03137254901960784,0.408248290463863,0.19435477256774902,0.0
200,8,KNeighbors Classifier,1,0.35,0.776,1.0,0.18938589096069336,0.0
201,8,SVC Classifier,1,0.35,0.776,1.0,0.1876063346862793,0.0
202,8,Decision Tree,1,0.35,0.78,0.4472135954999579,0.0020122528076171875,0.0
203,8,RandomForest,1,0.35,0.776,1.0,0.6854982376098633,0.0
204,8,AdaBoost (Discrete),1,0.35,0.78,0.4472135954999579,38.54509973526001,0.0
205,8,AdaBoost (Real),1,0.35,0.78,0.4472135954999579,50.97972106933594,0.0
206,8,Logistic Regression (Penalty = L2),1,0.35,0.776,1.0,0.19153046607971191,0.0
207,8,Naive Bayes,1,0.35,0.028,0.4472135954999579,0.2149372100830078,0.0
208,8,KNeighbors Classifier,2,0.35,0.7983539094650206,1.0,0.2073671817779541,0.0
209,8,SVC Classifier,2,0.35,0.7983539094650206,1.0,0.19574332237243652,0.0
210,8,Decision Tree,2,0.35,0.7983539094650206,1.0,0.0018439292907714844,0.0
211,8,RandomForest,2,0.35,0.7983539094650206,1.0,0.6918728351593018,0.0
212,8,AdaBoost (Discrete),2,0.35,0.7983539094650206,1.0,40.48272156715393,0.0
213,8,AdaBoost (Real),2,0.35,0.7983539094650206,1.0,54.221959352493286,0.0
214,8,Logistic Regression (Penalty = L2),2,0.35,0.7983539094650206,1.0,0.19780874252319336,0.0
215,8,Naive Bayes,2,0.35,0.024691358024691357,1.0,0.20264363288879395,0.0
216,9,KNeighbors Classifier,0,0.35,0.7607843137254902,0.2866927669330738,0.3031198978424072,0.0
217,9,SVC Classifier,0,0.35,0.7607843137254902,1.0,0.20678114891052246,0.0
218,9,Decision Tree,0,0.35,0.7686274509803922,0.3115857230292383,0.09842395782470703,0.0
219,9,RandomForest,0,0.35,0.7607843137254902,1.0,0.6132826805114746,0.0
220,9,AdaBoost (Discrete),0,0.35,0.7647058823529411,0.3838431694704549,38.54179549217224,0.0
221,9,AdaBoost (Real),0,0.35,0.7607843137254902,0.3769890791947507,44.45751643180847,0.0
222,9,Logistic Regression (Penalty = L2),0,0.35,0.7647058823529411,0.3838431694704549,0.29375505447387695,0.0
223,9,Naive Bayes,0,0.35,0.0392156862745098,0.28573809127083305,0.19933271408081055,0.0
224,9,KNeighbors Classifier,1,0.35,0.788,0.7745966692414834,0.2874176502227783,0.0
225,9,SVC Classifier,1,0.35,0.776,1.0,0.09858989715576172,0.0
226,9,Decision Tree,1,0.35,0.78,0.32127586985818757,0.09446024894714355,0.0
227,9,RandomForest,1,0.35,0.776,1.0,0.4955716133117676,0.0
228,9,AdaBoost (Discrete),1,0.35,0.776,0.4071947447321208,33.68137574195862,0.0
229,9,AdaBoost (Real),1,0.35,0.78,0.32127586985818757,45.0849883556366,0.0
230,9,Logistic Regression (Penalty = L2),1,0.35,0.78,0.408248290463863,0.19107413291931152,0.0
231,9,Naive Bayes,1,0.35,0.036,0.3760603093086394,0.09677791595458984,0.0
232,9,KNeighbors Classifier,2,0.35,0.7983539094650206,1.0,0.2879359722137451,0.0
233,9,SVC Classifier,2,0.35,0.7983539094650206,1.0,0.09743309020996094,0.0
234,9,Decision Tree,2,0.35,0.7942386831275721,0.5455521537286048,0.09427428245544434,0.0
235,9,RandomForest,2,0.35,0.7942386831275721,0.5455521537286048,0.5755410194396973,0.0
236,9,AdaBoost (Discrete),2,0.35,0.7942386831275721,0.5455521537286048,31.992273330688477,0.0
237,9,AdaBoost (Real),2,0.35,0.8024691358024691,0.5758603305272156,42.80771327018738,0.0
238,9,Logistic Regression (Penalty = L2),2,0.35,0.7942386831275721,0.5455521537286048,0.2899022102355957,0.0
239,9,Naive Bayes,2,0.35,0.037037037037037035,0.4518010018049224,0.20251917839050293,0.0
240,10,KNeighbors Classifier,0,0.35,0.7647058823529411,0.2620113175395233,0.39478087425231934,0.0
241,10,SVC Classifier,0,0.35,0.7607843137254902,1.0,0.1990528106689453,0.0
242,10,Decision Tree,0,0.35,0.7725490196078432,0.28514649594268227,0.09383964538574219,0.0
243,10,RandomForest,0,0.35,0.7607843137254902,1.0,0.48175621032714844,0.0
244,10,AdaBoost (Discrete),0,0.35,0.7686274509803922,0.3261165666552968,35.313138246536255,0.0
245,10,AdaBoost (Real),0,0.35,0.7686274509803922,0.3873141779594106,44.81453490257263,0.0
246,10,Logistic Regression (Penalty = L2),0,0.35,0.7725490196078432,0.28514649594268227,0.3150594234466553,0.0
247,10,Naive Bayes,0,0.35,0.043137254901960784,0.3670977715849853,0.17153692245483398,0.0
248,10,KNeighbors Classifier,1,0.35,0.788,0.49239345894554554,0.28820180892944336,0.0
249,10,SVC Classifier,1,0.35,0.776,1.0,0.18550419807434082,0.0
250,10,Decision Tree,1,0.35,0.784,0.2853751021838173,0.0901494026184082,0.0
251,10,RandomForest,1,0.35,0.776,1.0,0.6426639556884766,0.0
252,10,AdaBoost (Discrete),1,0.35,0.78,0.32127586985818757,32.73702812194824,0.0
253,10,AdaBoost (Real),1,0.35,0.78,0.32127586985818757,45.29999375343323,0.0
254,10,Logistic Regression (Penalty = L2),1,0.35,0.784,0.2853751021838173,0.4010770320892334,0.0
255,10,Naive Bayes,1,0.35,0.044,0.16559340774040096,0.14363336563110352,0.0
256,10,KNeighbors Classifier,2,0.35,0.7777777777777778,0.36391779603417973,0.28076624870300293,0.0
257,10,SVC Classifier,2,0.35,0.7983539094650206,1.0,0.1865100860595703,0.0
258,10,Decision Tree,2,0.35,0.7983539094650206,0.4488613467085362,0.0860130786895752,0.0
259,10,RandomForest,2,0.35,0.7901234567901234,0.6997790520224827,0.48691701889038086,0.0
260,10,AdaBoost (Discrete),2,0.35,0.7983539094650206,0.4345270299307295,32.2588791847229,0.0
261,10,AdaBoost (Real),2,0.35,0.8065843621399177,0.43603844046495843,44.57923126220703,0.0
262,10,Logistic Regression (Penalty = L2),2,0.35,0.8024691358024691,0.44945390423181414,0.39597153663635254,0.0
263,10,Naive Bayes,2,0.35,0.04526748971193416,0.24935316404995922,0.10917520523071289,0.0
264,11,KNeighbors Classifier,0,0.35,0.788235294117647,0.5051339451704815,0.2171797752380371,0.0
265,11,SVC Classifier,0,0.35,0.7607843137254902,1.0,0.30393195152282715,0.0
266,11,Decision Tree,0,0.35,0.7607843137254902,0.6306575194725914,0.0016360282897949219,0.0
267,11,RandomForest,0,0.35,0.7607843137254902,1.0,0.6799919605255127,0.0
268,11,AdaBoost (Discrete),0,0.35,0.6588235294117647,0.4576700248933026,40.62365412712097,0.0
269,11,AdaBoost (Real),0,0.35,0.6745098039215687,0.45360889625217216,53.1867618560791,0.0
270,11,Logistic Regression (Penalty = L2),0,0.35,0.7803921568627451,0.3278877973280665,0.3670198917388916,0.0
271,11,Naive Bayes,0,0.35,0.09803921568627451,0.278619637636725,0.21932077407836914,0.0
272,11,KNeighbors Classifier,1,0.35,0.808,0.6009085336818761,0.2151939868927002,0.0
273,11,SVC Classifier,1,0.35,0.776,1.0,0.3269033432006836,0.0
274,11,Decision Tree,1,0.35,0.74,0.6991410109653732,0.0017898082733154297,0.0
275,11,RandomForest,1,0.35,0.776,1.0,0.5412065982818604,0.0
276,11,AdaBoost (Discrete),1,0.35,0.676,0.751502179725232,39.75968599319458,0.0
277,11,AdaBoost (Real),1,0.35,0.644,0.3407898630693129,53.278053283691406,0.0
278,11,Logistic Regression (Penalty = L2),1,0.35,0.788,0.33041391263057845,0.44740724563598633,0.0
279,11,Naive Bayes,1,0.35,0.068,0.23804196860365237,0.2189769744873047,0.0
280,11,KNeighbors Classifier,2,0.35,0.7777777777777778,0.5330398935236673,0.32427024841308594,0.0
281,11,SVC Classifier,2,0.35,0.7983539094650206,1.0,0.32518577575683594,0.0
282,11,Decision Tree,2,0.35,0.7818930041152263,0.7881521350051378,0.10560393333435059,0.0
283,11,RandomForest,2,0.35,0.7901234567901234,0.6997790520224827,0.6758687496185303,0.0
284,11,AdaBoost (Discrete),2,0.35,0.6666666666666666,0.7198564619729987,39.71722435951233,0.0
285,11,AdaBoost (Real),2,0.35,0.6131687242798354,0.4968682295115664,55.39231872558594,0.0
286,11,Logistic Regression (Penalty = L2),2,0.35,0.7983539094650206,0.533081631635245,0.5212771892547607,0.0
287,11,Naive Bayes,2,0.35,0.08641975308641975,0.45219191231077444,0.2071518898010254,0.0
288,12,KNeighbors Classifier,0,0.35,0.7607843137254902,1.0,0.2391045093536377,0.0
289,12,SVC Classifier,0,0.35,0.7607843137254902,1.0,0.12047219276428223,0.0
290,12,Decision Tree,0,0.35,0.7607843137254902,1.0,0.053842782974243164,0.0
291,12,RandomForest,0,0.35,0.7450980392156863,0.979381443298969,0.5477492809295654,0.0
292,12,AdaBoost (Discrete),0,0.35,0.7607843137254902,1.0,35.62593984603882,0.0
293,12,AdaBoost (Real),0,0.35,0.7607843137254902,1.0,52.11384701728821,0.0
294,12,Logistic Regression (Penalty = L2),0,0.35,0.7607843137254902,1.0,0.27088236808776855,0.0
295,12,Naive Bayes,0,0.35,0.027450980392156862,1.0,0.11039948463439941,0.0
296,12,KNeighbors Classifier,1,0.35,0.768,0.9896907216494846,0.17937183380126953,0.0
297,12,SVC Classifier,1,0.35,0.776,1.0,0.19089031219482422,0.0
298,12,Decision Tree,1,0.35,0.776,1.0,0.11339664459228516,0.0
299,12,RandomForest,1,0.35,0.776,1.0,0.572075605392456,0.0
300,12,AdaBoost (Discrete),1,0.35,0.776,1.0,39.020092487335205,0.0
301,12,AdaBoost (Real),1,0.35,0.776,1.0,50.87015891075134,0.0
302,12,Logistic Regression (Penalty = L2),1,0.35,0.776,1.0,0.26849985122680664,0.0
303,12,Naive Bayes,1,0.35,0.024,1.0,0.11333751678466797,0.0
304,12,KNeighbors Classifier,2,0.35,0.7983539094650206,1.0,0.1913607120513916,0.0
305,12,SVC Classifier,2,0.35,0.7983539094650206,1.0,0.18303561210632324,0.0
306,12,Decision Tree,2,0.35,0.7983539094650206,1.0,0.0011360645294189453,0.0
307,12,RandomForest,2,0.35,0.7983539094650206,1.0,0.7067382335662842,0.0
308,12,AdaBoost (Discrete),2,0.35,0.7983539094650206,1.0,36.40056753158569,0.0
309,12,AdaBoost (Real),2,0.35,0.7983539094650206,1.0,49.93871068954468,0.0
310,12,Logistic Regression (Penalty = L2),2,0.35,0.7983539094650206,1.0,0.26251816749572754,0.0
311,12,Naive Bayes,2,0.35,0.024691358024691357,1.0,0.09618544578552246,0.0
