,feat_set_id,classifier,fold_id,feat_th,score,geo_score,exec_t,geo_score_woz
0,0,KNeighbors Classifier,0,0.8,0.6011560693641619,0.46804088014592204,2.3770601749420166,0.0
1,0,SVC Classifier,0,0.8,0.49710982658959535,1.0,3.310497283935547,0.0
2,0,Decision Tree,0,0.8,0.630057803468208,0.6676667400714822,0.18606162071228027,0.0
3,0,RandomForest,0,0.8,0.5317919075144508,0.4088823739025936,1.606722116470337,0.0
4,0,AdaBoost (Discrete),0,0.8,0.6994219653179191,0.5800521268915344,154.30898904800415,0.0
5,0,AdaBoost (Real),0,0.8,0.5838150289017341,0.5044092843087497,189.31271266937256,0.0
6,0,Logistic Regression (Penalty = L2),0,0.8,0.6820809248554913,0.5235591624536262,4.372925758361816,0.0
7,0,Naive Bayes,0,0.8,0.23121387283236994,0.38259785858810896,0.7837178707122803,0.0
8,0,KNeighbors Classifier,1,0.8,0.6190476190476191,0.5726862468993734,2.251518964767456,0.0
9,0,SVC Classifier,1,0.8,0.5119047619047619,1.0,2.431659698486328,0.0
10,0,Decision Tree,1,0.8,0.6547619047619048,0.6172846749936609,0.3288083076477051,0.0
11,0,RandomForest,1,0.8,0.5773809523809523,0.8218759147586129,1.4706735610961914,0.0
12,0,AdaBoost (Discrete),1,0.8,0.7321428571428571,0.7066145591751481,177.51332569122314,0.0
13,0,AdaBoost (Real),1,0.8,0.625,0.7405300576904412,200.30169677734375,0.0
14,0,Logistic Regression (Penalty = L2),1,0.8,0.7023809523809523,0.7673653924161533,3.5994927883148193,0.0
15,0,Naive Bayes,1,0.8,0.25595238095238093,0.4410714231202338,0.6569771766662598,0.0
16,0,KNeighbors Classifier,2,0.8,0.6257668711656442,0.7595258047502624,1.8725042343139648,0.0
17,0,SVC Classifier,2,0.8,0.5153374233128835,1.0,2.466724157333374,0.0
18,0,Decision Tree,2,0.8,0.5153374233128835,0.5956671820641518,0.18083691596984863,0.0
19,0,RandomForest,2,0.8,0.5766871165644172,0.3316060316314412,1.2785577774047852,0.0
20,0,AdaBoost (Discrete),2,0.8,0.7116564417177914,0.6396048870201145,181.9137146472931,0.0
21,0,AdaBoost (Real),2,0.8,0.6073619631901841,0.6629640653392018,188.22870111465454,0.0
22,0,Logistic Regression (Penalty = L2),2,0.8,0.6932515337423313,0.6412023191837368,3.382408380508423,0.0
23,0,Naive Bayes,2,0.8,0.26380368098159507,0.477667372412877,0.6806743144989014,0.0
24,1,KNeighbors Classifier,0,0.8,0.5838150289017341,0.4916252785782054,1.7621493339538574,0.0
25,1,SVC Classifier,0,0.8,0.49710982658959535,1.0,2.132456064224243,0.0
26,1,Decision Tree,0,0.8,0.6416184971098265,0.6057442420747402,0.25705718994140625,0.0
27,1,RandomForest,0,0.8,0.5202312138728323,0.44179182268315764,1.4942958354949951,0.0
28,1,AdaBoost (Discrete),0,0.8,0.7167630057803468,0.5921717501155788,192.464768409729,0.0
29,1,AdaBoost (Real),0,0.8,0.5838150289017341,0.6427062487216478,203.22075486183167,0.0
30,1,Logistic Regression (Penalty = L2),0,0.8,0.6358381502890174,0.5094668756558539,3.9927244186401367,0.0
31,1,Naive Bayes,0,0.8,0.23121387283236994,0.421076555895163,0.6229100227355957,0.0
32,1,KNeighbors Classifier,1,0.8,0.625,0.47725710393395043,2.244431972503662,0.0
33,1,SVC Classifier,1,0.8,0.5119047619047619,1.0,2.5106632709503174,0.0
34,1,Decision Tree,1,0.8,0.5892857142857143,0.5371479480184503,0.1538097858428955,0.0
35,1,RandomForest,1,0.8,0.5595238095238095,0.6389431042462725,1.0529606342315674,0.0
36,1,AdaBoost (Discrete),1,0.8,0.7083333333333334,0.6017275906870686,184.37446284294128,0.0
37,1,AdaBoost (Real),1,0.8,0.6547619047619048,0.7442683778843526,185.0842568874359,0.0
38,1,Logistic Regression (Penalty = L2),1,0.8,0.6904761904761905,0.6004878638932739,3.8741400241851807,0.0
39,1,Naive Bayes,1,0.8,0.25595238095238093,0.4410714231202338,0.6068053245544434,0.0
40,1,KNeighbors Classifier,2,0.8,0.6380368098159509,0.6735896711080995,2.0539023876190186,0.0
41,1,SVC Classifier,2,0.8,0.5153374233128835,1.0,2.3172829151153564,0.0
42,1,Decision Tree,2,0.8,0.5521472392638037,0.611174499613495,0.31078529357910156,0.0
43,1,RandomForest,2,0.8,0.5705521472392638,0.6309573444801932,1.433131456375122,0.0
44,1,AdaBoost (Discrete),2,0.8,0.7055214723926381,0.6796163438956043,184.83634233474731,0.0
45,1,AdaBoost (Real),2,0.8,0.5950920245398773,0.772945652877547,190.33721351623535,0.0
46,1,Logistic Regression (Penalty = L2),2,0.8,0.6809815950920245,0.7454595575650553,4.02092981338501,0.0
47,1,Naive Bayes,2,0.8,0.26993865030674846,0.4671017061378148,0.7026207447052002,0.0
48,2,KNeighbors Classifier,0,0.8,0.6416184971098265,0.4854183838936154,2.863398790359497,0.0
49,2,SVC Classifier,0,0.8,0.5028901734104047,0.5227579585747102,2.796410322189331,0.0
50,2,Decision Tree,0,0.8,0.630057803468208,0.6617554128597908,0.3169870376586914,0.0
51,2,RandomForest,0,0.8,0.5375722543352601,0.7311104457090247,1.3137421607971191,0.0
52,2,AdaBoost (Discrete),0,0.8,0.7167630057803468,0.5676031479408895,217.48322868347168,0.0
53,2,AdaBoost (Real),0,0.8,0.6242774566473989,0.7244007043050418,226.7620701789856,0.0
54,2,Logistic Regression (Penalty = L2),0,0.8,0.6936416184971098,0.6164751047171951,4.464344263076782,0.0
55,2,Naive Bayes,0,0.8,0.2543352601156069,0.47940824030713286,0.7915849685668945,0.0
56,2,KNeighbors Classifier,1,0.8,0.6130952380952381,0.4648742216504246,2.4005849361419678,0.0
57,2,SVC Classifier,1,0.8,0.5238095238095238,0.6933612743506347,3.250481605529785,0.0
58,2,Decision Tree,1,0.8,0.5952380952380952,0.6044489752036425,0.2944059371948242,0.6044489752036425
59,2,RandomForest,1,0.8,0.5714285714285714,0.4554974654853728,1.2477092742919922,0.0
60,2,AdaBoost (Discrete),1,0.8,0.7380952380952381,0.7191990613580159,221.02998566627502,0.0
61,2,AdaBoost (Real),1,0.8,0.6547619047619048,0.7541912785069493,232.41161060333252,0.0
62,2,Logistic Regression (Penalty = L2),1,0.8,0.7380952380952381,0.7424447892866327,4.254288196563721,0.0
63,2,Naive Bayes,1,0.8,0.25595238095238093,0.4410714231202338,0.6992974281311035,0.0
64,2,KNeighbors Classifier,2,0.8,0.6809815950920245,0.761806343235413,2.410799503326416,0.0
65,2,SVC Classifier,2,0.8,0.5337423312883436,0.7937005259840998,2.658186435699463,0.0
66,2,Decision Tree,2,0.8,0.6012269938650306,0.6193145414495554,0.2739720344543457,0.0
67,2,RandomForest,2,0.8,0.5705521472392638,0.6803749333171202,1.224602222442627,0.0
68,2,AdaBoost (Discrete),2,0.8,0.7423312883435583,0.7664449318838749,211.69743633270264,0.0
69,2,AdaBoost (Real),2,0.8,0.6012269938650306,0.8337639034473011,222.15522241592407,0.0
70,2,Logistic Regression (Penalty = L2),2,0.8,0.7300613496932515,0.7233955248932324,4.703429698944092,0.0
71,2,Naive Bayes,2,0.8,0.27607361963190186,0.4585964912915911,0.7707030773162842,0.0
72,3,KNeighbors Classifier,0,0.8,0.6069364161849711,0.49465131156610986,1.7669346332550049,0.0
73,3,SVC Classifier,0,0.8,0.49710982658959535,1.0,1.9301295280456543,0.0
74,3,Decision Tree,0,0.8,0.5606936416184971,0.712350367241846,0.15355515480041504,0.0
75,3,RandomForest,0,0.8,0.5491329479768786,0.7952707287670506,1.309934377670288,0.0
76,3,AdaBoost (Discrete),0,0.8,0.7109826589595376,0.6693832203059867,144.10255670547485,0.0
77,3,AdaBoost (Real),0,0.8,0.6416184971098265,0.6336890158683727,155.7433807849884,0.0
78,3,Logistic Regression (Penalty = L2),0,0.8,0.653179190751445,0.5438245259395813,2.841703176498413,0.0
79,3,Naive Bayes,0,0.8,0.21965317919075145,0.381053892672676,0.5760788917541504,0.0
80,3,KNeighbors Classifier,1,0.8,0.6428571428571429,0.5409869360113657,1.8981363773345947,0.0
81,3,SVC Classifier,1,0.8,0.5119047619047619,1.0,1.9407835006713867,0.0
82,3,Decision Tree,1,0.8,0.5654761904761905,0.6453902256663182,0.1411576271057129,0.0
83,3,RandomForest,1,0.8,0.5535714285714286,0.4065851364889782,1.143249273300171,0.0
84,3,AdaBoost (Discrete),1,0.8,0.6904761904761905,0.5717822623579174,144.2223105430603,0.0
85,3,AdaBoost (Real),1,0.8,0.6130952380952381,0.627160082198851,135.86964321136475,0.0
86,3,Logistic Regression (Penalty = L2),1,0.8,0.6845238095238095,0.6241046796236606,2.239753246307373,0.0
87,3,Naive Bayes,1,0.8,0.25595238095238093,0.4410714231202338,0.4930446147918701,0.0
88,3,KNeighbors Classifier,2,0.8,0.656441717791411,0.6487319249520168,1.3364510536193848,0.0
89,3,SVC Classifier,2,0.8,0.5153374233128835,1.0,1.6190154552459717,0.0
90,3,Decision Tree,2,0.8,0.6073619631901841,0.7721843388484496,0.11745476722717285,0.0
91,3,RandomForest,2,0.8,0.588957055214724,0.7311846378041618,0.8668477535247803,0.0
92,3,AdaBoost (Discrete),2,0.8,0.7361963190184049,0.8765775085156663,124.59850788116455,0.0
93,3,AdaBoost (Real),2,0.8,0.5766871165644172,0.7005405329545655,132.14968752861023,0.0
94,3,Logistic Regression (Penalty = L2),2,0.8,0.6932515337423313,0.5974428308362809,3.2259161472320557,0.0
95,3,Naive Bayes,2,0.8,0.25766871165644173,0.4198548231432729,0.4233250617980957,0.0
96,4,KNeighbors Classifier,0,0.8,0.6184971098265896,0.5359654376867975,2.6898205280303955,0.0
97,4,SVC Classifier,0,0.8,0.49710982658959535,1.0,2.291253089904785,0.0
98,4,Decision Tree,0,0.8,0.6184971098265896,0.5522513809509155,0.16112661361694336,0.0
99,4,RandomForest,0,0.8,0.5664739884393064,0.6034176336545163,1.1407337188720703,0.0
100,4,AdaBoost (Discrete),0,0.8,0.6994219653179191,0.5800521268915344,1194.1529700756073,0.0
101,4,AdaBoost (Real),0,0.8,0.6242774566473989,0.5947027506115736,122.38390111923218,0.0
102,4,Logistic Regression (Penalty = L2),0,0.8,0.6705202312138728,0.493636014093141,2.5725717544555664,0.0
103,4,Naive Bayes,0,0.8,0.2254335260115607,0.40583805298744546,0.4324214458465576,0.0
104,4,KNeighbors Classifier,1,0.8,0.6190476190476191,0.5690738191526042,1.522071123123169,0.0
105,4,SVC Classifier,1,0.8,0.5119047619047619,1.0,1.8876357078552246,0.0
106,4,Decision Tree,1,0.8,0.6369047619047619,0.6579702088334953,0.08028817176818848,0.0
107,4,RandomForest,1,0.8,0.5595238095238095,0.3656467468215549,0.7565674781799316,0.0
108,4,AdaBoost (Discrete),1,0.8,0.7321428571428571,0.6603390116699737,111.79324960708618,0.0
109,4,AdaBoost (Real),1,0.8,0.625,0.7405300576904412,112.6283586025238,0.0
110,4,Logistic Regression (Penalty = L2),1,0.8,0.6964285714285714,0.677412309569415,2.151623487472534,0.0
111,4,Naive Bayes,1,0.8,0.25,0.4181698984778722,0.43787312507629395,0.0
112,4,KNeighbors Classifier,2,0.8,0.6687116564417178,0.6150198811587813,1.3409678936004639,0.0
113,4,SVC Classifier,2,0.8,0.5153374233128835,1.0,1.7538022994995117,0.0
114,4,Decision Tree,2,0.8,0.5521472392638037,0.5436828131452391,0.09737825393676758,0.0
115,4,RandomForest,2,0.8,0.5766871165644172,0.5898945623563898,0.6759066581726074,0.0
116,4,AdaBoost (Discrete),2,0.8,0.7300613496932515,0.6609010760833647,107.34593772888184,0.0
117,4,AdaBoost (Real),2,0.8,0.5766871165644172,0.6646826288764908,112.35870695114136,0.0
118,4,Logistic Regression (Penalty = L2),2,0.8,0.7055214723926381,0.7708973291694818,2.0551822185516357,0.0
119,4,Naive Bayes,2,0.8,0.25766871165644173,0.41646579662658867,0.40764665603637695,0.0
120,5,KNeighbors Classifier,0,0.8,0.5838150289017341,0.4916252785782054,1.1341063976287842,0.0
121,5,SVC Classifier,0,0.8,0.49710982658959535,1.0,1.5681416988372803,0.0
122,5,Decision Tree,0,0.8,0.630057803468208,0.5931901380821795,0.18977761268615723,0.0
123,5,RandomForest,0,0.8,0.5606936416184971,0.6964705665515708,0.7021541595458984,0.0
124,5,AdaBoost (Discrete),0,0.8,0.7109826589595376,0.5881676905727509,110.66284966468811,0.0
125,5,AdaBoost (Real),0,0.8,0.6358381502890174,0.5473950687608571,125.11478877067566,0.0
126,5,Logistic Regression (Penalty = L2),0,0.8,0.6358381502890174,0.5094668756558539,2.434983253479004,0.0
127,5,Naive Bayes,0,0.8,0.23121387283236994,0.38259785858810896,0.47899770736694336,0.0
128,5,KNeighbors Classifier,1,0.8,0.625,0.47725710393395043,1.381462574005127,0.0
129,5,SVC Classifier,1,0.8,0.5119047619047619,1.0,1.5206725597381592,0.0
130,5,Decision Tree,1,0.8,0.5952380952380952,0.6837268306447838,0.10489344596862793,0.0
131,5,RandomForest,1,0.8,0.5476190476190477,0.4705355686715127,0.6589736938476562,0.0
132,5,AdaBoost (Discrete),1,0.8,0.7083333333333334,0.5795025468664925,110.3880500793457,0.0
133,5,AdaBoost (Real),1,0.8,0.6488095238095238,0.7149849211379788,122.19599962234497,0.0
134,5,Logistic Regression (Penalty = L2),1,0.8,0.6964285714285714,0.6059531451373878,2.0975818634033203,0.0
135,5,Naive Bayes,1,0.8,0.25595238095238093,0.4410714231202338,0.42909979820251465,0.0
136,5,KNeighbors Classifier,2,0.8,0.6380368098159509,0.6735896711080995,1.216871976852417,0.0
137,5,SVC Classifier,2,0.8,0.5153374233128835,1.0,1.390028953552246,0.0
138,5,Decision Tree,2,0.8,0.5214723926380368,0.6336638447268502,0.10495710372924805,0.0
139,5,RandomForest,2,0.8,0.5644171779141104,0.5946035575013605,0.7023706436157227,0.0
140,5,AdaBoost (Discrete),2,0.8,0.7300613496932515,0.6733697943877439,112.74489879608154,0.0
141,5,AdaBoost (Real),2,0.8,0.6012269938650306,0.810908927640115,110.03858709335327,0.0
142,5,Logistic Regression (Penalty = L2),2,0.8,0.6809815950920245,0.7454595575650553,2.1082494258880615,0.0
143,5,Naive Bayes,2,0.8,0.2822085889570552,0.4563837694016583,0.36765480041503906,0.4563837694016583
144,6,KNeighbors Classifier,0,0.8,0.6011560693641619,0.5263068418078998,1.3322196006774902,0.0
145,6,SVC Classifier,0,0.8,0.5028901734104047,0.5227579585747102,1.4777777194976807,0.0
146,6,Decision Tree,0,0.8,0.6127167630057804,0.5727176651994346,0.16585111618041992,0.0
147,6,RandomForest,0,0.8,0.5433526011560693,0.5081327481546147,0.803004264831543,0.0
148,6,AdaBoost (Discrete),0,0.8,0.6936416184971098,0.5794366787083676,105.3331708908081,0.0
149,6,AdaBoost (Real),0,0.8,0.6358381502890174,0.6375158500661904,113.33748888969421,0.0
150,6,Logistic Regression (Penalty = L2),0,0.8,0.6936416184971098,0.5750825260187903,2.410818099975586,0.0
151,6,Naive Bayes,0,0.8,0.23121387283236994,0.421076555895163,0.34966468811035156,0.0
152,6,KNeighbors Classifier,1,0.8,0.6190476190476191,0.5635155382481076,1.397719383239746,0.0
153,6,SVC Classifier,1,0.8,0.5119047619047619,1.0,1.7192864418029785,0.0
154,6,Decision Tree,1,0.8,0.6607142857142857,0.6727183688190537,0.1166532039642334,0.0
155,6,RandomForest,1,0.8,0.5357142857142857,0.41412387656655203,0.8661608695983887,0.0
156,6,AdaBoost (Discrete),1,0.8,0.75,0.6298143680263425,108.92375755310059,0.0
157,6,AdaBoost (Real),1,0.8,0.6190476190476191,0.6191825160984615,113.03274822235107,0.0
158,6,Logistic Regression (Penalty = L2),1,0.8,0.7142857142857143,0.6835607999574664,2.383720874786377,0.0
159,6,Naive Bayes,1,0.8,0.25,0.4181698984778722,0.46189117431640625,0.0
160,6,KNeighbors Classifier,2,0.8,0.6380368098159509,0.7692884830813544,1.3801097869873047,0.0
161,6,SVC Classifier,2,0.8,0.5153374233128835,1.0,1.6661052703857422,0.0
162,6,Decision Tree,2,0.8,0.49079754601226994,0.6611750599264371,0.18646502494812012,0.0
163,6,RandomForest,2,0.8,0.5644171779141104,0.6147881529512643,0.5024838447570801,0.0
164,6,AdaBoost (Discrete),2,0.8,0.6993865030674846,0.6866061743109099,108.92804431915283,0.0
165,6,AdaBoost (Real),2,0.8,0.6012269938650306,0.810908927640115,112.51089382171631,0.0
166,6,Logistic Regression (Penalty = L2),2,0.8,0.7055214723926381,0.778500678089177,2.1897201538085938,0.0
167,6,Naive Bayes,2,0.8,0.25766871165644173,0.4715705532707429,0.34113335609436035,0.0
168,7,KNeighbors Classifier,0,0.8,0.6416184971098265,0.49771148228661405,1.3450095653533936,0.0
169,7,SVC Classifier,0,0.8,0.5028901734104047,0.5227579585747102,1.6507534980773926,0.0
170,7,Decision Tree,0,0.8,0.6589595375722543,0.6154615876053701,0.1700761318206787,0.0
171,7,RandomForest,0,0.8,0.5260115606936416,0.2863424630911014,0.631659984588623,0.0
172,7,AdaBoost (Discrete),0,0.8,0.7225433526011561,0.5619921735989805,106.55785799026489,0.0
173,7,AdaBoost (Real),0,0.8,0.6242774566473989,0.7244007043050418,115.4380578994751,0.0
174,7,Logistic Regression (Penalty = L2),0,0.8,0.6936416184971098,0.6226764059032338,2.5798399448394775,0.0
175,7,Naive Bayes,0,0.8,0.26011560693641617,0.44572384648725094,0.4372284412384033,0.0
176,7,KNeighbors Classifier,1,0.8,0.6488095238095238,0.6474380034053117,1.399242877960205,0.0
177,7,SVC Classifier,1,0.8,0.5238095238095238,0.6933612743506347,1.677764654159546,0.0
178,7,Decision Tree,1,0.8,0.6309523809523809,0.712581425040589,0.16958928108215332,0.0
179,7,RandomForest,1,0.8,0.5476190476190477,0.48549177170732344,0.5988516807556152,0.0
180,7,AdaBoost (Discrete),1,0.8,0.7440476190476191,0.7299790169008447,108.44250893592834,0.0
181,7,AdaBoost (Real),1,0.8,0.6607142857142857,0.6671125599275987,108.10431289672852,0.0
182,7,Logistic Regression (Penalty = L2),1,0.8,0.7321428571428571,0.7038952103609406,2.178161382675171,0.0
183,7,Naive Bayes,1,0.8,0.25595238095238093,0.4410714231202338,0.306229829788208,0.0
184,7,KNeighbors Classifier,2,0.8,0.656441717791411,0.6549050373521691,1.2960171699523926,0.0
185,7,SVC Classifier,2,0.8,0.5337423312883436,0.7937005259840998,1.5307376384735107,0.0
186,7,Decision Tree,2,0.8,0.6257668711656442,0.6229344598959825,0.15082287788391113,0.0
187,7,RandomForest,2,0.8,0.5705521472392638,0.3891852707755854,0.6009759902954102,0.0
188,7,AdaBoost (Discrete),2,0.8,0.7791411042944786,0.6811164343095505,101.8375768661499,0.0
189,7,AdaBoost (Real),2,0.8,0.6319018404907976,0.8529286505232769,106.02189302444458,0.0
190,7,Logistic Regression (Penalty = L2),2,0.8,0.7239263803680982,0.6951415456598962,2.3415451049804688,0.0
191,7,Naive Bayes,2,0.8,0.2883435582822086,0.49453559168067723,0.33345484733581543,0.0
192,8,KNeighbors Classifier,0,0.8,0.6069364161849711,0.49465131156610986,0.8341610431671143,0.0
193,8,SVC Classifier,0,0.8,0.49710982658959535,1.0,0.9371235370635986,0.0
194,8,Decision Tree,0,0.8,0.6127167630057804,0.5538241372890452,0.07671999931335449,0.0
195,8,RandomForest,0,0.8,0.5433526011560693,0.5081327481546147,0.5346906185150146,0.0
196,8,AdaBoost (Discrete),0,0.8,0.7052023121387283,0.5757093278309972,65.22274851799011,0.0
197,8,AdaBoost (Real),0,0.8,0.6820809248554913,0.7909586007776034,74.62912774085999,0.0
198,8,Logistic Regression (Penalty = L2),0,0.8,0.653179190751445,0.5438245259395813,1.2467625141143799,0.0
199,8,Naive Bayes,0,0.8,0.2254335260115607,0.36112429080833913,0.2379617691040039,0.0
200,8,KNeighbors Classifier,1,0.8,0.6428571428571429,0.5409869360113657,0.9343881607055664,0.0
201,8,SVC Classifier,1,0.8,0.5119047619047619,1.0,0.9146120548248291,0.0
202,8,Decision Tree,1,0.8,0.5178571428571429,0.5175798750695647,0.07548117637634277,0.0
203,8,RandomForest,1,0.8,0.5535714285714286,0.5773502691896257,0.47023916244506836,0.0
204,8,AdaBoost (Discrete),1,0.8,0.7202380952380952,0.7850319715668809,68.33979058265686,0.0
205,8,AdaBoost (Real),1,0.8,0.6130952380952381,0.627160082198851,82.37789678573608,0.0
206,8,Logistic Regression (Penalty = L2),1,0.8,0.6845238095238095,0.6241046796236606,1.607004165649414,0.0
207,8,Naive Bayes,1,0.8,0.25595238095238093,0.4410714231202338,0.3257300853729248,0.0
208,8,KNeighbors Classifier,2,0.8,0.656441717791411,0.6487319249520168,0.7961928844451904,0.0
209,8,SVC Classifier,2,0.8,0.5153374233128835,1.0,1.053889513015747,0.0
210,8,Decision Tree,2,0.8,0.5521472392638037,0.537366058939675,0.14565467834472656,0.537366058939675
211,8,RandomForest,2,0.8,0.5705521472392638,0.7288434092860623,0.5092732906341553,0.0
212,8,AdaBoost (Discrete),2,0.8,0.7361963190184049,0.7571971342220861,73.84400653839111,0.0
213,8,AdaBoost (Real),2,0.8,0.558282208588957,0.5502753097880939,83.30648159980774,0.0
214,8,Logistic Regression (Penalty = L2),2,0.8,0.6871165644171779,0.6804351706467535,1.4408094882965088,0.0
215,8,Naive Bayes,2,0.8,0.26993865030674846,0.4219394198189631,0.33477306365966797,0.4219394198189631
