,feat_set_id,classifier,fold_id,feat_th,score,geo_score,exec_t,geo_score_woz
0,0,KNeighbors Classifier,0,0.6,0.3251957623215108,0.28939476178488316,3.7035632133483887,0.0
1,0,SVC Classifier,0,0.6,0.5439889451865499,0.6898275498384226,29.8433735370636,0.0
2,0,Decision Tree,0,0.6,0.3532934131736527,0.265516163630519,0.3891627788543701,0.0
3,0,RandomForest,0,0.6,0.4887148779364348,0.64494479672236,1.5556817054748535,0.0
4,0,AdaBoost (Discrete),0,0.6,0.15937356057116536,0.18014738810556216,150.69181299209595,0.18014738810556216
5,0,AdaBoost (Real),0,0.6,0.15430677107323815,0.15771241128009614,304.9943845272064,0.0
6,0,Logistic Regression (Penalty = L2),0,0.6,0.4491017964071856,0.0983705617700953,3.4500019550323486,0.0
7,0,Naive Bayes,0,0.6,0.28374021188392445,0.3213137317056177,0.4187138080596924,0.0
8,0,KNeighbors Classifier,1,0.6,0.40525587828492393,0.2461912420303257,3.0644171237945557,0.0
9,0,SVC Classifier,1,0.6,0.437989857076994,0.0916855623712715,33.174643754959106,0.0
10,0,Decision Tree,1,0.6,0.4223144306131858,0.3009637531577355,0.4211444854736328,0.0
11,0,RandomForest,1,0.6,0.48040571692023976,0.5521169659626766,1.5190916061401367,0.0
12,0,AdaBoost (Discrete),1,0.6,0.3771323190410327,0.280695612194383,134.67600750923157,0.0
13,0,AdaBoost (Real),1,0.6,0.43291839557399725,0.17967076288882852,183.6027708053589,0.0
14,0,Logistic Regression (Penalty = L2),1,0.6,0.5112955278930382,0.21088643197089238,2.3490469455718994,0.0
15,0,Naive Bayes,1,0.6,0.4702627939142462,0.2710122707913236,0.37149643898010254,0.0
16,0,KNeighbors Classifier,2,0.6,0.4250115366866636,0.271854944660133,2.8330774307250977,0.0
17,0,SVC Classifier,2,0.6,0.4360867558837102,1.0,27.060728073120117,0.0
18,0,Decision Tree,2,0.6,0.40609137055837563,0.3570215290096119,0.5348484516143799,0.0
19,0,RandomForest,2,0.6,0.46746654360867557,0.3811362584588857,1.7633373737335205,0.0
20,0,AdaBoost (Discrete),2,0.6,0.34886940470696814,0.2859901159730901,127.43951940536499,0.0
21,0,AdaBoost (Real),2,0.6,0.3437932625749885,0.20875476820582117,193.77684879302979,0.0
22,0,Logistic Regression (Penalty = L2),2,0.6,0.4942316566682049,0.18879703656140484,2.4134421348571777,0.0
23,0,Naive Bayes,2,0.6,0.3668666359021689,0.2751126332764863,0.2408761978149414,0.0
24,1,KNeighbors Classifier,0,0.6,0.30999539382772917,0.23726655632306368,3.9423623085021973,0.0
25,1,SVC Classifier,0,0.6,0.5287885766927684,0.6249421394778204,30.433892488479614,0.0
26,1,Decision Tree,0,0.6,0.3072316904652234,0.2594277427455156,0.3748593330383301,0.2594277427455156
27,1,RandomForest,0,0.6,0.4661446338093045,0.6032131995982025,1.4575088024139404,0.0
28,1,AdaBoost (Discrete),0,0.6,0.18470750806080147,0.23742839342504746,126.91145300865173,0.23742839342504746
29,1,AdaBoost (Real),0,0.6,0.17273146015660987,0.20780291600630027,239.20114517211914,0.20780291600630027
30,1,Logistic Regression (Penalty = L2),0,0.6,0.45923537540304005,0.21280750085220024,3.3057749271392822,0.0
31,1,Naive Bayes,0,0.6,0.2081989866421004,0.24985043575931057,0.29736852645874023,0.0
32,1,KNeighbors Classifier,1,0.6,0.4223144306131858,0.2589192252012124,3.8801727294921875,0.0
33,1,SVC Classifier,1,0.6,0.4513600737667128,0.260063165868498,34.156853437423706,0.0
34,1,Decision Tree,1,0.6,0.3909635776855694,0.22432006659276219,0.5693740844726562,0.0
35,1,RandomForest,1,0.6,0.4827109266943292,0.6312670094403118,1.7118830680847168,0.0
36,1,AdaBoost (Discrete),1,0.6,0.3822037805440295,0.38137294922530784,157.67920303344727,0.0
37,1,AdaBoost (Real),1,0.6,0.2909174734900876,0.18263645536021514,222.9565510749817,0.0
38,1,Logistic Regression (Penalty = L2),1,0.6,0.516828031350853,0.2625946808348494,2.5093374252319336,0.0
39,1,Naive Bayes,1,0.6,0.4762563393268787,0.1979040516212727,0.4021179676055908,0.0
40,1,KNeighbors Classifier,2,0.6,0.41301338255652975,0.3179259710327689,3.0651180744171143,0.0
41,1,SVC Classifier,2,0.6,0.4360867558837102,1.0,32.728410482406616,0.0
42,1,Decision Tree,2,0.6,0.4093216428241809,0.2966273556744554,0.40980982780456543,0.0
43,1,RandomForest,2,0.6,0.46377480387632675,0.4646245670946581,1.5391490459442139,0.0
44,1,AdaBoost (Discrete),2,0.6,0.3248730964467005,0.284691169250185,147.7437825202942,0.0
45,1,AdaBoost (Real),2,0.6,0.22704199353945548,0.26841966436183196,189.911128282547,0.0
46,1,Logistic Regression (Penalty = L2),2,0.6,0.528380249192432,0.4557625312906142,1.6609199047088623,0.0
47,1,Naive Bayes,2,0.6,0.3931702814951546,0.1635633727279573,0.6031262874603271,0.0
48,2,KNeighbors Classifier,0,0.6,0.3477660064486412,0.20792571881054592,3.185351610183716,0.20792571881054592
49,2,SVC Classifier,0,0.6,0.5370796867802856,0.6578813013718787,26.28682518005371,0.0
50,2,Decision Tree,0,0.6,0.36158452326116997,0.2736471949668073,0.4858710765838623,0.0
51,2,RandomForest,0,0.6,0.4836480884385076,0.6385791023265277,1.4084241390228271,0.0
52,2,AdaBoost (Discrete),0,0.6,0.1883924458774758,0.2625428394943542,119.92542338371277,0.2625428394943542
53,2,AdaBoost (Real),0,0.6,0.2077383694150161,0.14753032560428356,160.60472965240479,0.14753032560428356
54,2,Logistic Regression (Penalty = L2),0,0.6,0.4569322892676186,0.128174757442012,2.2264275550842285,0.0
55,2,Naive Bayes,0,0.6,0.24044219253800092,0.1457740200227378,0.34747886657714844,0.0
56,2,KNeighbors Classifier,1,0.6,0.40756108805901337,0.26879929744658915,3.2760443687438965,0.0
57,2,SVC Classifier,1,0.6,0.44029506685108344,0.1493248606998152,26.599157333374023,0.0
58,2,Decision Tree,1,0.6,0.3831258644536653,0.22729053328029566,0.3500404357910156,0.0
59,2,RandomForest,1,0.6,0.4831719686491471,0.6266348639353728,1.2951385974884033,0.0
60,2,AdaBoost (Discrete),1,0.6,0.36698939603503916,0.36577415817381087,115.89685416221619,0.0
61,2,AdaBoost (Real),1,0.6,0.17657906869525128,0.23050856017431345,166.41985654830933,0.23050856017431345
62,2,Logistic Regression (Penalty = L2),1,0.6,0.5112955278930382,0.27354279065663994,2.341538190841675,0.0
63,2,Naive Bayes,1,0.6,0.47717842323651455,0.45527644328746697,0.3548729419708252,0.0
64,2,KNeighbors Classifier,2,0.6,0.4116289801568989,0.26046842263196723,2.7641072273254395,0.0
65,2,SVC Classifier,2,0.6,0.4360867558837102,1.0,26.053478240966797,0.0
66,2,Decision Tree,2,0.6,0.41209044762344255,0.3259616155954642,0.3470804691314697,0.0
67,2,RandomForest,2,0.6,0.5136132902630365,0.5771648942388883,1.2638919353485107,0.0
68,2,AdaBoost (Discrete),2,0.6,0.34840793724042457,0.32618210630235583,121.67235851287842,0.0
69,2,AdaBoost (Real),2,0.6,0.25980618366405167,0.3700350733814288,185.27775979042053,0.0
70,2,Logistic Regression (Penalty = L2),2,0.6,0.5186894323950162,0.45664985892549387,2.1766536235809326,0.0
71,2,Naive Bayes,2,0.6,0.43239501615136133,0.2878190460653837,0.25391125679016113,0.0
72,3,KNeighbors Classifier,0,0.6,0.3661906955320129,0.18964329832163201,1.239009141921997,0.18964329832163201
73,3,SVC Classifier,0,0.6,0.5403040073698756,0.6741448845324103,26.20513391494751,0.0
74,3,Decision Tree,0,0.6,0.3325656379548595,0.2740076576052695,0.4028358459472656,0.0
75,3,RandomForest,0,0.6,0.48733302625518193,0.6338672573097613,1.5040795803070068,0.0
76,3,AdaBoost (Discrete),0,0.6,0.28466144633809304,0.22942074421840786,101.09816765785217,0.22942074421840786
77,3,AdaBoost (Real),0,0.6,0.17319207738369416,0.1834270580788159,182.92284274101257,0.0
78,3,Logistic Regression (Penalty = L2),0,0.6,0.471672040534316,0.1817451599385965,2.2490146160125732,0.0
79,3,Naive Bayes,0,0.6,0.3030861354214648,0.30952747690127247,0.30877208709716797,0.0
80,3,KNeighbors Classifier,1,0.6,0.39188566159520516,0.22396133693934542,1.3627426624298096,0.0
81,3,SVC Classifier,1,0.6,0.4407561088059013,0.1625496080892746,29.29808497428894,0.0
82,3,Decision Tree,1,0.6,0.3817427385892116,0.2617471896635533,0.4478473663330078,0.0
83,3,RandomForest,1,0.6,0.5062240663900415,0.607860773636411,1.8659608364105225,0.0
84,3,AdaBoost (Discrete),1,0.6,0.33195020746887965,0.2933856039911063,123.08132076263428,0.0
85,3,AdaBoost (Real),1,0.6,0.2143845089903181,0.23642967017676114,197.52968645095825,0.23642967017676114
86,3,Logistic Regression (Penalty = L2),1,0.6,0.5195942830797603,0.16577782493924237,1.8895080089569092,0.0
87,3,Naive Bayes,1,0.6,0.4827109266943292,0.4787547589221875,0.28467774391174316,0.0
88,3,KNeighbors Classifier,2,0.6,0.41901245962159667,0.31670682205780204,0.9748024940490723,0.0
89,3,SVC Classifier,2,0.6,0.4360867558837102,1.0,27.63701868057251,0.0
90,3,Decision Tree,2,0.6,0.4125519150899862,0.3137972119133749,0.45244574546813965,0.0
91,3,RandomForest,2,0.6,0.5163820950622982,0.5485793489212819,1.5107481479644775,0.0
92,3,AdaBoost (Discrete),2,0.6,0.3774803876326719,0.2672110796643268,120.72601318359375,0.0
93,3,AdaBoost (Real),2,0.6,0.23811721273650208,0.2876641085733496,188.59611010551453,0.0
94,3,Logistic Regression (Penalty = L2),2,0.6,0.520073834794647,0.4361271773684582,2.055112361907959,0.0
95,3,Naive Bayes,2,0.6,0.4347023534840794,0.4877890140132698,0.29612207412719727,0.0
96,4,KNeighbors Classifier,0,0.6,0.3707968678028558,0.281664504649272,2.0624189376831055,0.0
97,4,SVC Classifier,0,0.6,0.5370796867802856,0.6588631269214148,30.858713150024414,0.0
98,4,Decision Tree,0,0.6,0.32197144173192077,0.28386808312262246,0.4578220844268799,0.0
99,4,RandomForest,0,0.6,0.4776600644864118,0.6214247151155889,1.6085186004638672,0.0
100,4,AdaBoost (Discrete),0,0.6,0.2690004606172271,0.2657746977270455,136.2729778289795,0.2657746977270455
101,4,AdaBoost (Real),0,0.6,0.12805158912943343,0.1630286724873573,217.42638063430786,0.1630286724873573
102,4,Logistic Regression (Penalty = L2),0,0.6,0.46936895439889453,0.09890727714235101,2.773970603942871,0.0
103,4,Naive Bayes,0,0.6,0.29663749424228464,0.3118322274720637,0.32560014724731445,0.0
104,4,KNeighbors Classifier,1,0.6,0.40064545873674506,0.25164171535816154,1.98966383934021,0.0
105,4,SVC Classifier,1,0.6,0.44029506685108344,0.1493248606998152,35.08222770690918,0.0
106,4,Decision Tree,1,0.6,0.40156754264638084,0.2973888280768243,0.5123822689056396,0.0
107,4,RandomForest,1,0.6,0.5053019824804057,0.6025244281005098,1.8678040504455566,0.0
108,4,AdaBoost (Discrete),1,0.6,0.34071000461041956,0.31032852771639613,155.68353652954102,0.0
109,4,AdaBoost (Real),1,0.6,0.23559243891194098,0.273635313844999,250.15769815444946,0.273635313844999
110,4,Logistic Regression (Penalty = L2),1,0.6,0.5228215767634855,0.1666017839271127,2.8625729084014893,0.0
111,4,Naive Bayes,1,0.6,0.47763946519133244,0.4741326925282311,0.4775686264038086,0.0
112,4,KNeighbors Classifier,2,0.6,0.42178126442085834,0.24304958117158978,2.503316879272461,0.0
113,4,SVC Classifier,2,0.6,0.4360867558837102,1.0,40.72600984573364,0.0
114,4,Decision Tree,2,0.6,0.43054914628518687,0.3324340491624051,0.5199575424194336,0.0
115,4,RandomForest,2,0.6,0.5085371481310568,0.5227779374574615,0.7579512596130371,0.0
116,4,AdaBoost (Discrete),2,0.6,0.3622519612367328,0.2720466920577087,145.12976384162903,0.0
117,4,AdaBoost (Real),2,0.6,0.3197969543147208,0.27171546646648237,176.57587671279907,0.27171546646648237
118,4,Logistic Regression (Penalty = L2),2,0.6,0.5034610059990771,0.4429258599929377,2.5228092670440674,0.0
119,4,Naive Bayes,2,0.6,0.435163820950623,0.48732984575041843,0.3373887538909912,0.0
120,5,KNeighbors Classifier,0,0.6,0.3528327959465684,0.22507057712219294,4.087313175201416,0.22507057712219294
121,5,SVC Classifier,0,0.6,0.5449101796407185,0.6749031844344036,37.95164728164673,0.0
122,5,Decision Tree,0,0.6,0.3542146476278213,0.23773132684625115,0.48084378242492676,0.0
123,5,RandomForest,0,0.6,0.4767388300322432,0.6094325798713558,1.1680567264556885,0.0
124,5,AdaBoost (Discrete),0,0.6,0.19438046982957163,0.21398281008338815,148.13383722305298,0.21398281008338815
125,5,AdaBoost (Real),0,0.6,0.23952095808383234,0.17570763934811345,225.86790871620178,0.17570763934811345
126,5,Logistic Regression (Penalty = L2),0,0.6,0.4661446338093045,0.10691605462347505,2.509232521057129,0.0
127,5,Naive Bayes,0,0.6,0.24873330262551818,0.14568346824948367,0.3112142086029053,0.0
128,5,KNeighbors Classifier,1,0.6,0.408944213923467,0.21618023620048604,3.355522632598877,0.0
129,5,SVC Classifier,1,0.6,0.4407561088059013,0.17070835746043952,35.2677788734436,0.0
130,5,Decision Tree,1,0.6,0.4029506685108345,0.2873800407237778,0.6662006378173828,0.0
131,5,RandomForest,1,0.6,0.5025357307514984,0.5835253140307585,2.039170980453491,0.0
132,5,AdaBoost (Discrete),1,0.6,0.31304748732134624,0.3073876230956404,154.28494310379028,0.0
133,5,AdaBoost (Real),1,0.6,0.28446288612263715,0.14197801204241475,224.20675230026245,0.0
134,5,Logistic Regression (Penalty = L2),1,0.6,0.5214384508990318,0.2580510507965959,2.0507941246032715,0.0
135,5,Naive Bayes,1,0.6,0.47763946519133244,0.45807771891361443,0.3406209945678711,0.0
136,5,KNeighbors Classifier,2,0.6,0.4028610982925704,0.3297368612916253,2.3822062015533447,0.0
137,5,SVC Classifier,2,0.6,0.4360867558837102,1.0,34.771289587020874,0.0
138,5,Decision Tree,2,0.6,0.3668666359021689,0.31456880050297126,0.5588710308074951,0.0
139,5,RandomForest,2,0.6,0.5066912782648824,0.5254944365355319,1.814840316772461,0.0
140,5,AdaBoost (Discrete),2,0.6,0.3308721735117674,0.2732328832532483,142.1080756187439,0.0
141,5,AdaBoost (Real),2,0.6,0.26765113059529305,0.2903521314914978,208.55273270606995,0.0
142,5,Logistic Regression (Penalty = L2),2,0.6,0.5149976926626673,0.4347109203692394,2.5419068336486816,0.0
143,5,Naive Bayes,2,0.6,0.42778034148592525,0.14518813627232335,0.558521032333374,0.0
144,6,KNeighbors Classifier,0,0.6,0.3477660064486412,0.20792571881054592,4.81985878944397,0.20792571881054592
145,6,SVC Classifier,0,0.6,0.5370796867802856,0.6578813013718787,37.71581959724426,0.0
146,6,Decision Tree,0,0.6,0.3007830492860433,0.2323389932014529,0.5106689929962158,0.0
147,6,RandomForest,0,0.6,0.4836480884385076,0.6385791023265277,1.9345626831054688,0.0
148,6,AdaBoost (Discrete),0,0.6,0.1883924458774758,0.2625428394943542,151.27895951271057,0.2625428394943542
149,6,AdaBoost (Real),0,0.6,0.22432058959005066,0.15163279465645232,225.4491593837738,0.15163279465645232
150,6,Logistic Regression (Penalty = L2),0,0.6,0.4569322892676186,0.128174757442012,2.4714162349700928,0.0
151,6,Naive Bayes,0,0.6,0.24044219253800092,0.1457740200227378,0.2528550624847412,0.0
152,6,KNeighbors Classifier,1,0.6,0.40756108805901337,0.26879929744658915,4.336851358413696,0.0
153,6,SVC Classifier,1,0.6,0.44029506685108344,0.1493248606998152,37.08529043197632,0.0
154,6,Decision Tree,1,0.6,0.4029506685108345,0.3033303739254357,0.47707676887512207,0.0
155,6,RandomForest,1,0.6,0.4831719686491471,0.6266348639353728,1.9086434841156006,0.0
156,6,AdaBoost (Discrete),1,0.6,0.3674504379898571,0.365975742346925,157.51512670516968,0.0
157,6,AdaBoost (Real),1,0.6,0.1673582295988935,0.2723640381114165,239.3844816684723,0.2723640381114165
158,6,Logistic Regression (Penalty = L2),1,0.6,0.5112955278930382,0.27354279065663994,2.6236376762390137,0.0
159,6,Naive Bayes,1,0.6,0.47717842323651455,0.45527644328746697,0.33913326263427734,0.0
160,6,KNeighbors Classifier,2,0.6,0.4116289801568989,0.26046842263196723,3.2136523723602295,0.0
161,6,SVC Classifier,2,0.6,0.4360867558837102,1.0,36.87010097503662,0.0
162,6,Decision Tree,2,0.6,0.3940932164282418,0.3397226627565782,0.24556374549865723,0.0
163,6,RandomForest,2,0.6,0.5136132902630365,0.5771648942388883,1.5392704010009766,0.0
164,6,AdaBoost (Discrete),2,0.6,0.34840793724042457,0.32618210630235583,158.82871270179749,0.0
165,6,AdaBoost (Real),2,0.6,0.28380249192431933,0.31164816307877086,212.97470140457153,0.0
166,6,Logistic Regression (Penalty = L2),2,0.6,0.5186894323950162,0.45664985892549387,2.3360583782196045,0.0
167,6,Naive Bayes,2,0.6,0.43239501615136133,0.2878190460653837,0.27872467041015625,0.0
168,7,KNeighbors Classifier,0,0.6,0.29709811146936893,0.20273499643303924,10.19121265411377,0.0
169,7,SVC Classifier,0,0.6,0.5287885766927684,0.6429774915332556,39.530309200286865,0.0
170,7,Decision Tree,0,0.6,0.3417779824965454,0.2841791668870216,0.4361996650695801,0.0
171,7,RandomForest,0,0.6,0.49239981575310915,0.6506071140639493,1.7831501960754395,0.0
172,7,AdaBoost (Discrete),0,0.6,0.1828650391524643,0.21332739909055518,171.88068675994873,0.21332739909055518
173,7,AdaBoost (Real),0,0.6,0.08060801473975127,0.08436162490777585,237.65909075737,0.08436162490777585
174,7,Logistic Regression (Penalty = L2),0,0.6,0.4039613081529249,0.12951383777918352,3.3503589630126953,0.0
175,7,Naive Bayes,0,0.6,0.19253800092123446,0.32108656678474107,0.4155886173248291,0.0
176,7,KNeighbors Classifier,1,0.6,0.4107883817427386,0.2743082667472208,6.211404323577881,0.0
177,7,SVC Classifier,1,0.6,0.44306131857999076,0.17509891998996285,40.98736000061035,0.0
178,7,Decision Tree,1,0.6,0.4024896265560166,0.22644246634878815,0.6840591430664062,0.0
179,7,RandomForest,1,0.6,0.5002305209774089,0.6399578672210863,1.7531633377075195,0.0
180,7,AdaBoost (Discrete),1,0.6,0.37989857076994005,0.38523211061287393,175.21881985664368,0.0
181,7,AdaBoost (Real),1,0.6,0.36330106039649607,0.1081092177207808,224.14609217643738,0.0
182,7,Logistic Regression (Penalty = L2),1,0.6,0.5016136468418626,0.331576275116474,3.3788681030273438,0.0
183,7,Naive Bayes,1,0.6,0.4499769479022591,0.35946414277156846,0.43918609619140625,0.0
184,7,KNeighbors Classifier,2,0.6,0.41901245962159667,0.2805254745392026,5.689037799835205,0.0
185,7,SVC Classifier,2,0.6,0.4360867558837102,1.0,34.58276033401489,0.0
186,7,Decision Tree,2,0.6,0.39640055376095984,0.3871924273700467,0.5687763690948486,0.0
187,7,RandomForest,2,0.6,0.5209967697277342,0.5747314775854089,1.8301849365234375,0.0
188,7,AdaBoost (Discrete),2,0.6,0.3622519612367328,0.3499014583703279,155.18426370620728,0.0
189,7,AdaBoost (Real),2,0.6,0.3571758191047531,0.3256773579551461,1284.8106052875519,0.0
190,7,Logistic Regression (Penalty = L2),2,0.6,0.5173050299953853,0.18964022022554072,3.4132704734802246,0.0
191,7,Naive Bayes,2,0.6,0.35902168897092757,0.19281649818483487,0.3771941661834717,0.0
192,8,KNeighbors Classifier,0,0.6,0.3661906955320129,0.18964329832163201,1.1303093433380127,0.18964329832163201
193,8,SVC Classifier,0,0.6,0.5403040073698756,0.6741448845324103,21.18023920059204,0.0
194,8,Decision Tree,0,0.6,0.33578995854444954,0.2829197456383535,0.23396062850952148,0.0
195,8,RandomForest,0,0.6,0.48733302625518193,0.6338672573097613,1.3152294158935547,0.0
196,8,AdaBoost (Discrete),0,0.6,0.28466144633809304,0.22942074421840786,93.53090953826904,0.22942074421840786
197,8,AdaBoost (Real),0,0.6,0.17411331183786274,0.1862293628900647,145.19320154190063,0.0
198,8,Logistic Regression (Penalty = L2),0,0.6,0.471672040534316,0.1817451599385965,1.5130457878112793,0.0
199,8,Naive Bayes,0,0.6,0.3030861354214648,0.30952747690127247,0.24719977378845215,0.0
200,8,KNeighbors Classifier,1,0.6,0.39188566159520516,0.22396133693934542,1.0396888256072998,0.0
201,8,SVC Classifier,1,0.6,0.4407561088059013,0.1625496080892746,18.06683039665222,0.0
202,8,Decision Tree,1,0.6,0.4250806823420931,0.2974274936579813,0.3577613830566406,0.0
203,8,RandomForest,1,0.6,0.5062240663900415,0.607860773636411,1.2344920635223389,0.0
204,8,AdaBoost (Discrete),1,0.6,0.33195020746887965,0.2933856039911063,80.16151332855225,0.0
205,8,AdaBoost (Real),1,0.6,0.21254034117104656,0.2594237372232673,128.16466641426086,0.0
206,8,Logistic Regression (Penalty = L2),1,0.6,0.5195942830797603,0.16577782493924237,1.4934096336364746,0.0
207,8,Naive Bayes,1,0.6,0.4827109266943292,0.4787547589221875,0.09905791282653809,0.0
208,8,KNeighbors Classifier,2,0.6,0.41901245962159667,0.31670682205780204,0.6080563068389893,0.0
209,8,SVC Classifier,2,0.6,0.4360867558837102,1.0,19.036279678344727,0.0
210,8,Decision Tree,2,0.6,0.4148592524227042,0.32116967124762924,0.19769048690795898,0.0
211,8,RandomForest,2,0.6,0.5163820950622982,0.5485793489212819,1.0758614540100098,0.0
212,8,AdaBoost (Discrete),2,0.6,0.3774803876326719,0.2672110796643268,76.63951086997986,0.0
213,8,AdaBoost (Real),2,0.6,0.24642362713428703,0.27945111406462486,123.67750883102417,0.0
214,8,Logistic Regression (Penalty = L2),2,0.6,0.520073834794647,0.4361271773684582,1.162273645401001,0.0
215,8,Naive Bayes,2,0.6,0.4347023534840794,0.4877890140132698,0.19272541999816895,0.0
