,feat_set_id,classifier,fold_id,feat_th,score,geo_score,exec_t,geo_score_woz
0,0,KNeighbors Classifier,0,0.85,0.9802816901408451,0.9803538826154417,2.150400161743164,0.9803538826154417
1,0,SVC Classifier,0,0.85,0.9098591549295775,0.4530153324120529,1.4459195137023926,0.4530153324120529
2,0,Decision Tree,0,0.85,0.8126760563380282,0.5859360515033275,0.20272088050842285,0.5859360515033275
3,0,RandomForest,0,0.85,0.8816901408450705,0.3894430545898086,1.009969711303711,0.3894430545898086
4,0,AdaBoost (Discrete),0,0.85,0.9549295774647887,0.9588818342562253,93.8802056312561,0.9588818342562253
5,0,AdaBoost (Real),0,0.85,0.971830985915493,0.9738886153093352,116.68226456642151,0.9738886153093352
6,0,Logistic Regression (Penalty = L2),0,0.85,0.967605633802817,0.9692165455989482,0.7875809669494629,0.9692165455989482
7,0,Naive Bayes,0,0.85,0.971830985915493,0.976722909042524,0.1363670825958252,0.976722909042524
8,0,KNeighbors Classifier,1,0.85,0.9760225669957687,0.9527357661655405,2.0750064849853516,0.9527357661655405
9,0,SVC Classifier,1,0.85,0.9760225669957687,0.9369604361556937,1.576911211013794,0.9369604361556937
10,0,Decision Tree,1,0.85,0.9322990126939351,0.9126546812923019,0.11269092559814453,0.9126546812923019
11,0,RandomForest,1,0.85,0.9337094499294781,0.7927843292491847,1.0146605968475342,0.7927843292491847
12,0,AdaBoost (Discrete),1,0.85,0.9703808180535967,0.9184735248681712,94.49288272857666,0.9184735248681712
13,0,AdaBoost (Real),1,0.85,0.9661495063469676,0.9447528473012373,108.65319967269897,0.9447528473012373
14,0,Logistic Regression (Penalty = L2),1,0.85,0.9732016925246827,0.9576354655560266,0.8054122924804688,0.9576354655560266
15,0,Naive Bayes,1,0.85,0.9464033850493653,0.9578533891458472,0.24894213676452637,0.9578533891458472
16,0,KNeighbors Classifier,2,0.85,0.9618104667609618,0.9193972159149747,2.2636396884918213,0.9193972159149747
17,0,SVC Classifier,2,0.85,0.9872701555869873,0.9683996942491399,1.6116657257080078,0.9683996942491399
18,0,Decision Tree,2,0.85,0.7807637906647807,0.8591928547323197,0.11613583564758301,0.8591928547323197
19,0,RandomForest,2,0.85,0.9278642149929278,0.8246054665620237,1.042987585067749,0.8246054665620237
20,0,AdaBoost (Discrete),2,0.85,0.9236209335219236,0.9263480050091923,87.5090012550354,0.9263480050091923
21,0,AdaBoost (Real),2,0.85,0.8769448373408769,0.8907014975437931,108.86731052398682,0.8907014975437931
22,0,Logistic Regression (Penalty = L2),2,0.85,0.958981612446959,0.9182711924785147,0.638697624206543,0.9182711924785147
23,0,Naive Bayes,2,0.85,0.9207920792079208,0.9513896579271525,0.25353384017944336,0.9513896579271525
24,1,KNeighbors Classifier,0,0.85,0.9802816901408451,0.9775023353024564,2.5970687866210938,0.9775023353024564
25,1,SVC Classifier,0,0.85,0.9098591549295775,0.4530153324120529,1.6004748344421387,0.4530153324120529
26,1,Decision Tree,0,0.85,0.9478873239436619,0.9452566814472732,0.21767687797546387,0.9452566814472732
27,1,RandomForest,0,0.85,0.8760563380281691,0.356209562137551,1.002199411392212,0.356209562137551
28,1,AdaBoost (Discrete),0,0.85,0.956338028169014,0.9573486207730734,107.23761916160583,0.9573486207730734
29,1,AdaBoost (Real),0,0.85,0.9394366197183098,0.9569853771494398,127.79308223724365,0.9569853771494398
30,1,Logistic Regression (Penalty = L2),0,0.85,0.9633802816901409,0.970247876221977,0.8582091331481934,0.970247876221977
31,1,Naive Bayes,0,0.85,0.971830985915493,0.9738886153093352,0.13779854774475098,0.9738886153093352
32,1,KNeighbors Classifier,1,0.85,0.9774330042313117,0.9502266535294304,2.6523537635803223,0.9502266535294304
33,1,SVC Classifier,1,0.85,0.9760225669957687,0.9369604361556937,1.8439655303955078,0.9369604361556937
34,1,Decision Tree,1,0.85,0.9435825105782792,0.9027497966419129,0.12473702430725098,0.9027497966419129
35,1,RandomForest,1,0.85,0.9083215796897038,0.7060391369632562,0.995903491973877,0.7060391369632562
36,1,AdaBoost (Discrete),1,0.85,0.9703808180535967,0.9184735248681712,107.92938280105591,0.9184735248681712
37,1,AdaBoost (Real),1,0.85,0.919605077574048,0.9270776417568118,123.3211841583252,0.9270776417568118
38,1,Logistic Regression (Penalty = L2),1,0.85,0.9760225669957687,0.9401854081524661,0.9251217842102051,0.9401854081524661
39,1,Naive Bayes,1,0.85,0.9633286318758815,0.9505083333365072,0.13022899627685547,0.9505083333365072
40,1,KNeighbors Classifier,2,0.85,0.9603960396039604,0.904847202479791,2.67826509475708,0.904847202479791
41,1,SVC Classifier,2,0.85,0.983026874115983,0.9573941993397243,1.5785837173461914,0.9573941993397243
42,1,Decision Tree,2,0.85,0.8316831683168316,0.805067497526733,0.2539055347442627,0.805067497526733
43,1,RandomForest,2,0.85,0.8642149929278642,0.45518904985878383,1.1394124031066895,0.45518904985878383
44,1,AdaBoost (Discrete),2,0.85,0.9292786421499293,0.8511303953743646,110.40609622001648,0.8511303953743646
45,1,AdaBoost (Real),2,0.85,0.8939179632248939,0.9104595101188733,133.30257415771484,0.9104595101188733
46,1,Logistic Regression (Penalty = L2),2,0.85,0.9618104667609618,0.9261537341880445,0.9058167934417725,0.9261537341880445
47,1,Naive Bayes,2,0.85,0.9123055162659123,0.9447968803042718,0.13685250282287598,0.9447968803042718
48,2,KNeighbors Classifier,0,0.85,0.9859154929577465,0.9827596686612138,2.7902510166168213,0.9827596686612138
49,2,SVC Classifier,0,0.85,0.9098591549295775,0.4530153324120529,1.6899888515472412,0.4530153324120529
50,2,Decision Tree,0,0.85,0.8225352112676056,0.5395172286527135,0.14587044715881348,0.5395172286527135
51,2,RandomForest,0,0.85,0.8845070422535212,0.3931700088390291,1.2385666370391846,0.3931700088390291
52,2,AdaBoost (Discrete),0,0.85,0.9098591549295775,0.911671874731986,115.46107506752014,0.911671874731986
53,2,AdaBoost (Real),0,0.85,0.9591549295774648,0.9712252902998816,130.34126114845276,0.9712252902998816
54,2,Logistic Regression (Penalty = L2),0,0.85,0.9746478873239437,0.9722265541948297,1.0381217002868652,0.9722265541948297
55,2,Naive Bayes,0,0.85,0.9732394366197183,0.9773299464325066,0.47698402404785156,0.9773299464325066
56,2,KNeighbors Classifier,1,0.85,0.9661495063469676,0.9393554974920645,2.8564584255218506,0.9393554974920645
57,2,SVC Classifier,1,0.85,0.9760225669957687,0.9369604361556937,2.042898416519165,0.9369604361556937
58,2,Decision Tree,1,0.85,0.9605077574047954,0.9226723645586217,0.2738516330718994,0.9226723645586217
59,2,RandomForest,1,0.85,0.92524682651622,0.7540488463006698,1.0833675861358643,0.7540488463006698
60,2,AdaBoost (Discrete),1,0.85,0.9703808180535967,0.9184735248681712,90.66197967529297,0.9184735248681712
61,2,AdaBoost (Real),1,0.85,0.9506346967559943,0.9440774475050246,114.11766052246094,0.9440774475050246
62,2,Logistic Regression (Penalty = L2),1,0.85,0.9732016925246827,0.9576354655560266,0.6318864822387695,0.9576354655560266
63,2,Naive Bayes,1,0.85,0.9421720733427362,0.9560078096427188,0.24645614624023438,0.9560078096427188
64,2,KNeighbors Classifier,2,0.85,0.9632248939179632,0.9165181743727414,2.53922700881958,0.9165181743727414
65,2,SVC Classifier,2,0.85,0.9872701555869873,0.9683996942491399,1.682410478591919,0.9683996942491399
66,2,Decision Tree,2,0.85,0.9504950495049505,0.9529216890081492,0.12500739097595215,0.9529216890081492
67,2,RandomForest,2,0.85,0.9222065063649222,0.7835171940697466,1.0080726146697998,0.7835171940697466
68,2,AdaBoost (Discrete),2,0.85,0.9405940594059405,0.9427176550970101,95.91316986083984,0.9427176550970101
69,2,AdaBoost (Real),2,0.85,0.9151343705799151,0.9196381481104676,120.97885227203369,0.9196381481104676
70,2,Logistic Regression (Penalty = L2),2,0.85,0.958981612446959,0.9182711924785147,0.7797122001647949,0.9182711924785147
71,2,Naive Bayes,2,0.85,0.9165487977369166,0.949483060316506,0.14046192169189453,0.949483060316506
72,3,KNeighbors Classifier,0,0.85,0.9774647887323944,0.9791465490261932,2.0561044216156006,0.9791465490261932
73,3,SVC Classifier,0,0.85,0.9098591549295775,0.4530153324120529,1.5930907726287842,0.4530153324120529
74,3,Decision Tree,0,0.85,0.8154929577464789,0.8566703296828058,0.1358025074005127,0.8566703296828058
75,3,RandomForest,0,0.85,0.8830985915492958,0.391315405750407,1.2538409233093262,0.391315405750407
76,3,AdaBoost (Discrete),0,0.85,0.9549295774647887,0.9608923225279017,106.32177639007568,0.9608923225279017
77,3,AdaBoost (Real),0,0.85,0.9619718309859155,0.9667950076001116,118.63028120994568,0.9667950076001116
78,3,Logistic Regression (Penalty = L2),0,0.85,0.9774647887323944,0.9734253551060988,0.7766108512878418,0.9734253551060988
79,3,Naive Bayes,0,0.85,0.9732394366197183,0.9744927647293644,0.1370220184326172,0.9744927647293644
80,3,KNeighbors Classifier,1,0.85,0.9774330042313117,0.9502266535294304,2.089155673980713,0.9502266535294304
81,3,SVC Classifier,1,0.85,0.9760225669957687,0.9369604361556937,1.6562519073486328,0.9369604361556937
82,3,Decision Tree,1,0.85,0.921015514809591,0.904893178794465,0.13247251510620117,0.904893178794465
83,3,RandomForest,1,0.85,0.8631875881523272,0.5351996242533478,1.2828176021575928,0.5351996242533478
84,3,AdaBoost (Discrete),1,0.85,0.9647390691114246,0.896062730767775,107.0834527015686,0.896062730767775
85,3,AdaBoost (Real),1,0.85,0.9365303244005642,0.9352212732190006,147.23382949829102,0.9352212732190006
86,3,Logistic Regression (Penalty = L2),1,0.85,0.9760225669957687,0.9369604361556937,0.7999725341796875,0.9369604361556937
87,3,Naive Bayes,1,0.85,0.9689703808180536,0.9646971167307591,0.16452336311340332,0.9646971167307591
88,3,KNeighbors Classifier,2,0.85,0.9561527581329562,0.9102509470933294,2.320150375366211,0.9102509470933294
89,3,SVC Classifier,2,0.85,0.9872701555869873,0.9683996942491399,1.6355946063995361,0.9683996942491399
90,3,Decision Tree,2,0.85,0.6987270155586988,0.7730228627359216,0.26598334312438965,0.7730228627359216
91,3,RandomForest,2,0.85,0.9024045261669024,0.7267592911855771,1.3642477989196777,0.7267592911855771
92,3,AdaBoost (Discrete),2,0.85,0.9292786421499293,0.8511303953743646,106.11664581298828,0.8511303953743646
93,3,AdaBoost (Real),2,0.85,0.8656294200848657,0.8949375392788251,112.87977409362793,0.8949375392788251
94,3,Logistic Regression (Penalty = L2),2,0.85,0.9561527581329562,0.9271817244134989,0.6111304759979248,0.9271817244134989
95,3,Naive Bayes,2,0.85,0.9094766619519095,0.943522708993876,0.2623262405395508,0.943522708993876
96,4,KNeighbors Classifier,0,0.85,0.9830985915492958,0.9787009905012263,2.1737403869628906,0.9787009905012263
97,4,SVC Classifier,0,0.85,0.9098591549295775,0.4530153324120529,1.7113566398620605,0.4530153324120529
98,4,Decision Tree,0,0.85,0.967605633802817,0.9542796349493861,0.14860844612121582,0.9542796349493861
99,4,RandomForest,0,0.85,0.8887323943661972,0.3986314009794656,1.1372299194335938,0.3986314009794656
100,4,AdaBoost (Discrete),0,0.85,0.976056338028169,0.9785417640983738,104.34922575950623,0.9785417640983738
101,4,AdaBoost (Real),0,0.85,0.976056338028169,0.97282632396706,113.57432699203491,0.97282632396706
102,4,Logistic Regression (Penalty = L2),0,0.85,0.9661971830985916,0.9686122957256189,0.7259869575500488,0.9686122957256189
103,4,Naive Bayes,0,0.85,0.971830985915493,0.976722909042524,0.13408708572387695,0.976722909042524
104,4,KNeighbors Classifier,1,0.85,0.9661495063469676,0.9361870014819027,2.099414587020874,0.9361870014819027
105,4,SVC Classifier,1,0.85,0.9760225669957687,0.9369604361556937,1.6681668758392334,0.9369604361556937
106,4,Decision Tree,1,0.85,0.9153737658674189,0.7010288599377755,0.13259029388427734,0.7010288599377755
107,4,RandomForest,1,0.85,0.8772919605077574,0.8451542547285166,1.1705005168914795,0.0
108,4,AdaBoost (Discrete),1,0.85,0.9647390691114246,0.896062730767775,95.72404026985168,0.896062730767775
109,4,AdaBoost (Real),1,0.85,0.9675599435825106,0.9540701793599212,100.81029081344604,0.9540701793599212
110,4,Logistic Regression (Penalty = L2),1,0.85,0.9732016925246827,0.9576354655560266,0.7435703277587891,0.9576354655560266
111,4,Naive Bayes,1,0.85,0.9435825105782792,0.956623794226582,0.13790583610534668,0.956623794226582
112,4,KNeighbors Classifier,2,0.85,0.9632248939179632,0.9233601839295728,2.37491774559021,0.9233601839295728
113,4,SVC Classifier,2,0.85,0.9872701555869873,0.9683996942491399,1.6562752723693848,0.9683996942491399
114,4,Decision Tree,2,0.85,0.6831683168316832,0.8126983527044465,0.1446840763092041,0.8126983527044465
115,4,RandomForest,2,0.85,0.8486562942008486,0.7365588802190108,1.1777470111846924,0.7365588802190108
116,4,AdaBoost (Discrete),2,0.85,0.925035360678925,0.9389797721405366,93.6572196483612,0.9389797721405366
117,4,AdaBoost (Real),2,0.85,0.8585572842998586,0.8795204566152056,118.69844102859497,0.8795204566152056
118,4,Logistic Regression (Penalty = L2),2,0.85,0.958981612446959,0.9216628268230621,0.7618505954742432,0.9216628268230621
119,4,Naive Bayes,2,0.85,0.900990099009901,0.9424258307478608,0.10609006881713867,0.9424258307478608
120,5,KNeighbors Classifier,0,0.85,0.9845070422535211,0.9792992186394924,2.0142104625701904,0.9792992186394924
121,5,SVC Classifier,0,0.85,0.9098591549295775,0.4530153324120529,1.4015636444091797,0.4530153324120529
122,5,Decision Tree,0,0.85,0.9056338028169014,0.9418824889847136,0.1207277774810791,0.9418824889847136
123,5,RandomForest,0,0.85,0.8746478873239436,0.40881495629347636,0.9597911834716797,0.40881495629347636
124,5,AdaBoost (Discrete),0,0.85,0.928169014084507,0.9527053643274915,84.63236260414124,0.9527053643274915
125,5,AdaBoost (Real),0,0.85,0.9492957746478873,0.9592534181166058,88.26900601387024,0.9592534181166058
126,5,Logistic Regression (Penalty = L2),0,0.85,0.9816901408450704,0.9723039854275715,0.51430344581604,0.9723039854275715
127,5,Naive Bayes,0,0.85,0.9732394366197183,0.9744927647293644,0.16459083557128906,0.9744927647293644
128,5,KNeighbors Classifier,1,0.85,0.9675599435825106,0.9399317893528756,1.539316177368164,0.9399317893528756
129,5,SVC Classifier,1,0.85,0.9760225669957687,0.9369604361556937,1.4129235744476318,0.9369604361556937
130,5,Decision Tree,1,0.85,0.9661495063469676,0.9361870014819027,0.1933436393737793,0.9361870014819027
131,5,RandomForest,1,0.85,0.8829337094499294,0.6148564413248687,0.8748593330383301,0.6148564413248687
132,5,AdaBoost (Discrete),1,0.85,0.9703808180535967,0.9184735248681712,91.7216124534607,0.9184735248681712
133,5,AdaBoost (Real),1,0.85,0.9506346967559943,0.9323841422610092,108.1326322555542,0.9323841422610092
134,5,Logistic Regression (Penalty = L2),1,0.85,0.9760225669957687,0.9369604361556937,0.6864092350006104,0.9369604361556937
135,5,Naive Bayes,1,0.85,0.9647390691114246,0.9628973044968077,0.13711094856262207,0.9628973044968077
136,5,KNeighbors Classifier,2,0.85,0.9603960396039604,0.9084069686825428,2.4461960792541504,0.9084069686825428
137,5,SVC Classifier,2,0.85,0.9858557284299858,0.9647590595276887,1.648716688156128,0.9647590595276887
138,5,Decision Tree,2,0.85,0.743988684582744,0.8395638216788388,0.13290834426879883,0.8395638216788388
139,5,RandomForest,2,0.85,0.9080622347949081,0.7274433706296509,1.298421859741211,0.7274433706296509
140,5,AdaBoost (Discrete),2,0.85,0.9292786421499293,0.8511303953743646,98.23524188995361,0.8511303953743646
141,5,AdaBoost (Real),2,0.85,0.8868458274398868,0.913332413968765,110.71552610397339,0.913332413968765
142,5,Logistic Regression (Penalty = L2),2,0.85,0.9603960396039604,0.9153997862278452,0.551079511642456,0.9153997862278452
143,5,Naive Bayes,2,0.85,0.8981612446958982,0.9411312881420332,0.254148006439209,0.9411312881420332
144,6,KNeighbors Classifier,0,0.85,0.9802816901408451,0.9803538826154417,2.684427261352539,0.9803538826154417
145,6,SVC Classifier,0,0.85,0.9098591549295775,0.4530153324120529,1.6431026458740234,0.4530153324120529
146,6,Decision Tree,0,0.85,0.8760563380281691,0.9262803982696854,0.25321412086486816,0.9262803982696854
147,6,RandomForest,0,0.85,0.8859154929577465,0.4178054790383972,1.1512672901153564,0.4178054790383972
148,6,AdaBoost (Discrete),0,0.85,0.8985915492957747,0.9359389158981621,98.7965042591095,0.9359389158981621
149,6,AdaBoost (Real),0,0.85,0.9394366197183098,0.962547638133686,106.49034190177917,0.962547638133686
150,6,Logistic Regression (Penalty = L2),0,0.85,0.9704225352112676,0.9704227902110237,0.8657314777374268,0.9704227902110237
151,6,Naive Bayes,0,0.85,0.9732394366197183,0.9773299464325066,0.12247300148010254,0.9773299464325066
152,6,KNeighbors Classifier,1,0.85,0.9788434414668548,0.9538955186996372,2.690189838409424,0.9538955186996372
153,6,SVC Classifier,1,0.85,0.9760225669957687,0.9369604361556937,1.857743740081787,0.9369604361556937
154,6,Decision Tree,1,0.85,0.9506346967559943,0.8872596061925486,0.2301778793334961,0.8872596061925486
155,6,RandomForest,1,0.85,0.8617771509167842,0.520214083969102,0.8312258720397949,0.520214083969102
156,6,AdaBoost (Discrete),1,0.85,0.9647390691114246,0.896062730767775,102.4174644947052,0.896062730767775
157,6,AdaBoost (Real),1,0.85,0.9816643159379408,0.9656738092592515,117.63577175140381,0.9656738092592515
158,6,Logistic Regression (Penalty = L2),1,0.85,0.9732016925246827,0.9576354655560266,0.9773030281066895,0.9576354655560266
159,6,Naive Bayes,1,0.85,0.9435825105782792,0.956623794226582,0.29418373107910156,0.956623794226582
160,6,KNeighbors Classifier,2,0.85,0.9632248939179632,0.9130363100692748,3.0865728855133057,0.9130363100692748
161,6,SVC Classifier,2,0.85,0.9858557284299858,0.9647590595276887,1.903611421585083,0.9647590595276887
162,6,Decision Tree,2,0.85,0.695898161244696,0.7730559897836112,0.3459360599517822,0.7730559897836112
163,6,RandomForest,2,0.85,0.9391796322489392,0.8239945708948146,1.2764358520507812,0.8239945708948146
164,6,AdaBoost (Discrete),2,0.85,0.9377652050919377,0.9163858761212227,115.00240445137024,0.9163858761212227
165,6,AdaBoost (Real),2,0.85,0.9264497878359265,0.9306157621465116,133.6846845149994,0.9306157621465116
166,6,Logistic Regression (Penalty = L2),2,0.85,0.9618104667609618,0.9124805970226375,0.8456406593322754,0.9124805970226375
167,6,Naive Bayes,2,0.85,0.9278642149929278,0.9545504441297977,0.29012036323547363,0.9545504441297977
168,7,KNeighbors Classifier,0,0.85,0.9802816901408451,0.9775023353024564,3.382587432861328,0.9775023353024564
169,7,SVC Classifier,0,0.85,0.9098591549295775,0.4530153324120529,1.9579415321350098,0.4530153324120529
170,7,Decision Tree,0,0.85,0.9028169014084507,0.8138983088650654,0.27754783630371094,0.8138983088650654
171,7,RandomForest,0,0.85,0.8619718309859155,0.4083244492213061,1.1081445217132568,0.4083244492213061
172,7,AdaBoost (Discrete),0,0.85,0.8985915492957747,0.9359389158981621,124.84763979911804,0.9359389158981621
173,7,AdaBoost (Real),0,0.85,0.9352112676056338,0.9579102648609162,145.0873246192932,0.9579102648609162
174,7,Logistic Regression (Penalty = L2),0,0.85,0.9732394366197183,0.9744927647293644,0.8013899326324463,0.9744927647293644
175,7,Naive Bayes,0,0.85,0.9732394366197183,0.9773299464325066,0.13899755477905273,0.9773299464325066
176,7,KNeighbors Classifier,1,0.85,0.9760225669957687,0.9527357661655405,3.484689712524414,0.9527357661655405
177,7,SVC Classifier,1,0.85,0.9760225669957687,0.9369604361556937,2.3056259155273438,0.9369604361556937
178,7,Decision Tree,1,0.85,0.9069111424541608,0.7733624341883388,0.2861604690551758,0.7733624341883388
179,7,RandomForest,1,0.85,0.8815232722143864,0.6099373790634576,1.4131488800048828,0.6099373790634576
180,7,AdaBoost (Discrete),1,0.85,0.9703808180535967,0.9184735248681712,119.97694492340088,0.9184735248681712
181,7,AdaBoost (Real),1,0.85,0.9746121297602257,0.9511958742398139,129.11622762680054,0.9511958742398139
182,7,Logistic Regression (Penalty = L2),1,0.85,0.9732016925246827,0.9576354655560266,0.6410441398620605,0.9576354655560266
183,7,Naive Bayes,1,0.85,0.9478138222849083,0.9584670045533571,0.12621784210205078,0.9584670045533571
184,7,KNeighbors Classifier,2,0.85,0.9618104667609618,0.908960200834328,2.878936290740967,0.908960200834328
185,7,SVC Classifier,2,0.85,0.9844413012729845,0.9610907387064838,1.6627380847930908,0.9610907387064838
186,7,Decision Tree,2,0.85,0.7185289957567186,0.6579794953450836,0.12879109382629395,0.6579794953450836
187,7,RandomForest,2,0.85,0.8741159830268741,0.7643269673381782,0.9769232273101807,0.7643269673381782
188,7,AdaBoost (Discrete),2,0.85,0.9193776520509194,0.9151860988650686,112.42892861366272,0.9151860988650686
189,7,AdaBoost (Real),2,0.85,0.9292786421499293,0.9193460928490378,139.7979221343994,0.9193460928490378
190,7,Logistic Regression (Penalty = L2),2,0.85,0.958981612446959,0.911367135761647,0.8531022071838379,0.911367135761647
191,7,Naive Bayes,2,0.85,0.9278642149929278,0.9545504441297977,0.14606714248657227,0.9545504441297977
192,8,KNeighbors Classifier,0,0.85,0.9816901408450704,0.9781020301371197,1.7523233890533447,0.9781020301371197
193,8,SVC Classifier,0,0.85,0.9098591549295775,0.4530153324120529,1.4408533573150635,0.4530153324120529
194,8,Decision Tree,0,0.85,0.8450704225352113,0.6313594852684241,0.3016505241394043,0.6313594852684241
195,8,RandomForest,0,0.85,0.8845070422535212,0.41583466917384043,1.1459190845489502,0.41583466917384043
196,8,AdaBoost (Discrete),0,0.85,0.9549295774647887,0.9608923225279017,102.35516667366028,0.9608923225279017
197,8,AdaBoost (Real),0,0.85,0.967605633802817,0.9692165455989482,118.26163578033447,0.9692165455989482
198,8,Logistic Regression (Penalty = L2),0,0.85,0.9732394366197183,0.9716260435082653,0.7449729442596436,0.9716260435082653
199,8,Naive Bayes,0,0.85,0.9732394366197183,0.9744927647293644,0.15646743774414062,0.9744927647293644
200,8,KNeighbors Classifier,1,0.85,0.9661495063469676,0.9361870014819027,1.8485965728759766,0.9361870014819027
201,8,SVC Classifier,1,0.85,0.9760225669957687,0.9369604361556937,1.777907371520996,0.9369604361556937
202,8,Decision Tree,1,0.85,0.9125528913963329,0.8407738416487983,0.2975003719329834,0.8407738416487983
203,8,RandomForest,1,0.85,0.8829337094499294,0.6148564413248687,1.052760362625122,0.6148564413248687
204,8,AdaBoost (Discrete),1,0.85,0.9703808180535967,0.9184735248681712,112.4175353050232,0.9184735248681712
205,8,AdaBoost (Real),1,0.85,0.92524682651622,0.9303817492241766,126.78261971473694,0.9303817492241766
206,8,Logistic Regression (Penalty = L2),1,0.85,0.9746121297602257,0.9363942967815083,0.6845033168792725,0.9363942967815083
207,8,Naive Bayes,1,0.85,0.9647390691114246,0.9628973044968077,0.16025686264038086,0.9628973044968077
208,8,KNeighbors Classifier,2,0.85,0.9490806223479491,0.9074484325973885,2.1605143547058105,0.9074484325973885
209,8,SVC Classifier,2,0.85,0.9858557284299858,0.9647590595276887,1.4916157722473145,0.9647590595276887
210,8,Decision Tree,2,0.85,0.9123055162659123,0.8447426844900428,0.15315651893615723,0.8447426844900428
211,8,RandomForest,2,0.85,0.9335219236209336,0.8048989793462182,1.2624292373657227,0.8048989793462182
212,8,AdaBoost (Discrete),2,0.85,0.9292786421499293,0.8511303953743646,130.04973697662354,0.8511303953743646
213,8,AdaBoost (Real),2,0.85,0.8528995756718529,0.9119242062767432,136.59267234802246,0.9119242062767432
214,8,Logistic Regression (Penalty = L2),2,0.85,0.9476661951909476,0.9090230606538516,0.7750039100646973,0.9090230606538516
215,8,Naive Bayes,2,0.85,0.884016973125884,0.9346045088864806,0.18561553955078125,0.9346045088864806
