,feat_set_id,classifier,fold_id,feat_th,score,geo_score,exec_t,geo_score_woz
0,0,KNeighbors Classifier,0,0.15,0.9388059701492537,0.9376258075060179,0.38953089714050293,0.9376258075060179
1,0,SVC Classifier,0,0.15,0.835820895522388,0.8327255881523451,1.5479578971862793,0.8327255881523451
2,0,Decision Tree,0,0.15,0.7671641791044777,0.7619841598340062,0.0546875,0.7619841598340062
3,0,RandomForest,0,0.15,0.6776119402985075,0.6476320474657201,0.528120756149292,0.6476320474657201
4,0,AdaBoost (Discrete),0,0.15,0.8805970149253731,0.8789441961394345,50.51635241508484,0.8789441961394345
5,0,AdaBoost (Real),0,0.15,0.8388059701492537,0.8335398334082998,59.69413089752197,0.8335398334082998
6,0,Logistic Regression (Penalty = L2),0,0.15,0.8701492537313433,0.8692323902343694,0.5323848724365234,0.8692323902343694
7,0,Naive Bayes,0,0.15,0.8731343283582089,0.8719638034543165,0.1252727508544922,0.8719638034543165
8,0,KNeighbors Classifier,1,0.15,0.9432835820895522,0.9426246523981345,0.3613133430480957,0.9426246523981345
9,0,SVC Classifier,1,0.15,0.8298507462686567,0.8242047832430682,1.5179693698883057,0.8242047832430682
10,0,Decision Tree,1,0.15,0.7776119402985074,0.7684914371663116,0.0545353889465332,0.7684914371663116
11,0,RandomForest,1,0.15,0.6746268656716418,0.556878887039229,0.5215950012207031,0.556878887039229
12,0,AdaBoost (Discrete),1,0.15,0.8761194029850746,0.8745333511773399,50.029184341430664,0.8745333511773399
13,0,AdaBoost (Real),1,0.15,0.8343283582089552,0.8264472111700016,58.915900468826294,0.8264472111700016
14,0,Logistic Regression (Penalty = L2),1,0.15,0.891044776119403,0.8888893269603925,0.5097987651824951,0.8888893269603925
15,0,Naive Bayes,1,0.15,0.8641791044776119,0.8623874644365604,0.12009143829345703,0.8623874644365604
16,0,KNeighbors Classifier,2,0.15,0.9545454545454546,0.9540555697750261,0.42035412788391113,0.9540555697750261
17,0,SVC Classifier,2,0.15,0.843939393939394,0.8416307117609663,1.5726029872894287,0.8416307117609663
18,0,Decision Tree,2,0.15,0.8151515151515152,0.811631273400533,0.10347604751586914,0.811631273400533
19,0,RandomForest,2,0.15,0.6212121212121212,0.6704749324570197,0.43808984756469727,0.0
20,0,AdaBoost (Discrete),2,0.15,0.8863636363636364,0.8846352687161687,48.669283628463745,0.8846352687161687
21,0,AdaBoost (Real),2,0.15,0.853030303030303,0.8390993190639485,55.58827996253967,0.8390993190639485
22,0,Logistic Regression (Penalty = L2),2,0.15,0.9030303030303031,0.9020289612805347,0.5476019382476807,0.9020289612805347
23,0,Naive Bayes,2,0.15,0.8909090909090909,0.8898174983780677,0.13941335678100586,0.8898174983780677
24,1,KNeighbors Classifier,0,0.15,0.9238805970149254,0.9223133047808131,0.42590904235839844,0.9223133047808131
25,1,SVC Classifier,0,0.15,0.7656716417910447,0.7545806508823063,1.613980770111084,0.7545806508823063
26,1,Decision Tree,0,0.15,0.7208955223880597,0.7139584605000883,0.10257577896118164,0.7139584605000883
27,1,RandomForest,0,0.15,0.5835820895522388,0.5578804969016254,0.4019906520843506,0.5578804969016254
28,1,AdaBoost (Discrete),0,0.15,0.8134328358208955,0.8086731412386451,50.82433891296387,0.8086731412386451
29,1,AdaBoost (Real),0,0.15,0.7671641791044777,0.7631046469920462,57.80612087249756,0.7631046469920462
30,1,Logistic Regression (Penalty = L2),0,0.15,0.8208955223880597,0.8137113690896752,0.4800539016723633,0.8137113690896752
31,1,Naive Bayes,0,0.15,0.8522388059701492,0.8497138845753653,0.07934904098510742,0.8497138845753653
32,1,KNeighbors Classifier,1,0.15,0.9134328358208955,0.9106893421315729,0.3835573196411133,0.9106893421315729
33,1,SVC Classifier,1,0.15,0.7925373134328358,0.7860575786444349,1.403552532196045,0.7860575786444349
34,1,Decision Tree,1,0.15,0.735820895522388,0.7295024527039601,0.09603309631347656,0.7295024527039601
35,1,RandomForest,1,0.15,0.5716417910447761,0.5314218803930513,0.44974613189697266,0.5314218803930513
36,1,AdaBoost (Discrete),1,0.15,0.8313432835820895,0.8290177237309563,47.811421394348145,0.8290177237309563
37,1,AdaBoost (Real),1,0.15,0.46119402985074626,0.29447093664474694,53.62262558937073,0.29447093664474694
38,1,Logistic Regression (Penalty = L2),1,0.15,0.8671641791044776,0.8642173020320969,0.428025484085083,0.8642173020320969
39,1,Naive Bayes,1,0.15,0.8611940298507462,0.8588486904510537,0.13301587104797363,0.8588486904510537
40,1,KNeighbors Classifier,2,0.15,0.9378787878787879,0.9365552110019612,0.3874952793121338,0.9365552110019612
41,1,SVC Classifier,2,0.15,0.7787878787878788,0.7661063135745672,1.3420147895812988,0.7661063135745672
42,1,Decision Tree,2,0.15,0.7545454545454545,0.7504114677493754,0.09853720664978027,0.7504114677493754
43,1,RandomForest,2,0.15,0.5878787878787879,0.49981103807080085,0.45151591300964355,0.49981103807080085
44,1,AdaBoost (Discrete),2,0.15,0.8681818181818182,0.8655080350746037,51.61150026321411,0.8655080350746037
45,1,AdaBoost (Real),2,0.15,0.8242424242424242,0.8228487802257969,59.410179138183594,0.8228487802257969
46,1,Logistic Regression (Penalty = L2),2,0.15,0.8666666666666667,0.8647865970946926,0.5230400562286377,0.8647865970946926
47,1,Naive Bayes,2,0.15,0.8803030303030303,0.8789406889268979,0.11622476577758789,0.8789406889268979
48,2,KNeighbors Classifier,0,0.15,0.8776119402985074,0.8756596747512493,0.45270800590515137,0.8756596747512493
49,2,SVC Classifier,0,0.15,0.753731343283582,0.7334229951778328,1.5598368644714355,0.7334229951778328
50,2,Decision Tree,0,0.15,0.7,0.6965045791418217,0.09615850448608398,0.6965045791418217
51,2,RandomForest,0,0.15,0.6582089552238806,0.6361696282961626,0.5183167457580566,0.6361696282961626
52,2,AdaBoost (Discrete),0,0.15,0.8044776119402985,0.8030932413933596,60.166144371032715,0.8030932413933596
53,2,AdaBoost (Real),0,0.15,0.7388059701492538,0.7336864999739868,80.06234240531921,0.7336864999739868
54,2,Logistic Regression (Penalty = L2),0,0.15,0.7985074626865671,0.7935235098193378,0.6262006759643555,0.7935235098193378
55,2,Naive Bayes,0,0.15,0.817910447761194,0.8153760164209146,0.12403488159179688,0.8153760164209146
56,2,KNeighbors Classifier,1,0.15,0.9074626865671642,0.9055268368947141,0.5340726375579834,0.9055268368947141
57,2,SVC Classifier,1,0.15,0.7671641791044777,0.7516221766041349,2.0504770278930664,0.7516221766041349
58,2,Decision Tree,1,0.15,0.7223880597014926,0.7134163562573528,0.13586163520812988,0.7134163562573528
59,2,RandomForest,1,0.15,0.6238805970149254,0.5458254096527477,0.682603120803833,0.5458254096527477
60,2,AdaBoost (Discrete),1,0.15,0.8059701492537313,0.804312909088967,66.67713904380798,0.804312909088967
61,2,AdaBoost (Real),1,0.15,0.46567164179104475,0.4207367028534255,71.8215479850769,0.4207367028534255
62,2,Logistic Regression (Penalty = L2),1,0.15,0.8283582089552238,0.8245233817786481,0.6528534889221191,0.8245233817786481
63,2,Naive Bayes,1,0.15,0.8343283582089552,0.8314310603140936,0.18105173110961914,0.8314310603140936
64,2,KNeighbors Classifier,2,0.15,0.8803030303030303,0.878998637047696,0.6339056491851807,0.878998637047696
65,2,SVC Classifier,2,0.15,0.7863636363636364,0.776037481366033,1.908484935760498,0.776037481366033
66,2,Decision Tree,2,0.15,0.7666666666666667,0.7610221671132089,0.1318497657775879,0.7610221671132089
67,2,RandomForest,2,0.15,0.6106060606060606,0.5186773349777065,0.5761263370513916,0.5186773349777065
68,2,AdaBoost (Discrete),2,0.15,0.8484848484848485,0.8467929121597393,62.567081928253174,0.8467929121597393
69,2,AdaBoost (Real),2,0.15,0.7666666666666667,0.7542625693994925,73.03944683074951,0.7542625693994925
70,2,Logistic Regression (Penalty = L2),2,0.15,0.8363636363636363,0.8350850268713349,0.6236777305603027,0.8350850268713349
71,2,Naive Bayes,2,0.15,0.85,0.8487190900584655,0.16868829727172852,0.8487190900584655
72,3,KNeighbors Classifier,0,0.15,0.9059701492537313,0.9030387089669687,0.5440258979797363,0.9030387089669687
73,3,SVC Classifier,0,0.15,0.8134328358208955,0.8083453936728254,2.025770664215088,0.8083453936728254
74,3,Decision Tree,0,0.15,0.7477611940298508,0.741501566055701,0.12214779853820801,0.741501566055701
75,3,RandomForest,0,0.15,0.6567164179104478,0.6418013505056652,0.5195724964141846,0.6418013505056652
76,3,AdaBoost (Discrete),0,0.15,0.8298507462686567,0.8263472072799518,63.06069326400757,0.8263472072799518
77,3,AdaBoost (Real),0,0.15,0.7731343283582089,0.7649960315736314,73.46762466430664,0.7649960315736314
78,3,Logistic Regression (Penalty = L2),0,0.15,0.8373134328358209,0.8343532043480545,0.6374411582946777,0.8343532043480545
79,3,Naive Bayes,0,0.15,0.835820895522388,0.8335882226244619,0.13144588470458984,0.8335882226244619
80,3,KNeighbors Classifier,1,0.15,0.9164179104477612,0.9148243879081153,0.543424129486084,0.9148243879081153
81,3,SVC Classifier,1,0.15,0.8029850746268656,0.7957219395577529,1.9617629051208496,0.7957219395577529
82,3,Decision Tree,1,0.15,0.7179104477611941,0.7124578679412795,0.12782812118530273,0.7124578679412795
83,3,RandomForest,1,0.15,0.6925373134328359,0.6617489189223749,0.576103687286377,0.6617489189223749
84,3,AdaBoost (Discrete),1,0.15,0.8164179104477612,0.8100135108476638,62.39600205421448,0.8100135108476638
85,3,AdaBoost (Real),1,0.15,0.44477611940298506,0.34681174405289494,71.62301540374756,0.34681174405289494
86,3,Logistic Regression (Penalty = L2),1,0.15,0.8492537313432836,0.847673686268644,0.5998244285583496,0.847673686268644
87,3,Naive Bayes,1,0.15,0.8611940298507462,0.8593392250093642,0.18437433242797852,0.8593392250093642
88,3,KNeighbors Classifier,2,0.15,0.9227272727272727,0.9217188173796865,0.49229884147644043,0.9217188173796865
89,3,SVC Classifier,2,0.15,0.85,0.8467034263960204,1.9361703395843506,0.8467034263960204
90,3,Decision Tree,2,0.15,0.7712121212121212,0.7680913791565219,0.12761926651000977,0.7680913791565219
91,3,RandomForest,2,0.15,0.6984848484848485,0.6774868363733241,0.5759217739105225,0.6774868363733241
92,3,AdaBoost (Discrete),2,0.15,0.8545454545454545,0.8514664162060356,62.75814461708069,0.8514664162060356
93,3,AdaBoost (Real),2,0.15,0.49696969696969695,0.41001870495250353,74.0665328502655,0.41001870495250353
94,3,Logistic Regression (Penalty = L2),2,0.15,0.8621212121212121,0.8599760488850565,0.5775864124298096,0.8599760488850565
95,3,Naive Bayes,2,0.15,0.8893939393939394,0.8880673489278046,0.17385005950927734,0.8880673489278046
96,4,KNeighbors Classifier,0,0.15,0.8313432835820895,0.8247634321333255,0.2547481060028076,0.8247634321333255
97,4,SVC Classifier,0,0.15,0.6776119402985075,0.6449188854602654,1.6613001823425293,0.6449188854602654
98,4,Decision Tree,0,0.15,0.6925373134328359,0.684779277803986,0.06128430366516113,0.684779277803986
99,4,RandomForest,0,0.15,0.5432835820895522,0.43444547686951696,0.514263391494751,0.43444547686951696
100,4,AdaBoost (Discrete),0,0.15,0.7492537313432835,0.7442397593367057,48.66710186004639,0.7442397593367057
101,4,AdaBoost (Real),0,0.15,0.6805970149253732,0.6605178780820548,58.82566428184509,0.6605178780820548
102,4,Logistic Regression (Penalty = L2),0,0.15,0.7492537313432835,0.7386963257278634,0.4914226531982422,0.7386963257278634
103,4,Naive Bayes,0,0.15,0.7776119402985074,0.7726780769874726,0.1323378086090088,0.7726780769874726
104,4,KNeighbors Classifier,1,0.15,0.8507462686567164,0.8431581673558403,0.2664811611175537,0.8431581673558403
105,4,SVC Classifier,1,0.15,0.6985074626865672,0.6587087814572318,1.6765806674957275,0.6587087814572318
106,4,Decision Tree,1,0.15,0.7044776119402985,0.6969012355611112,0.12625479698181152,0.6969012355611112
107,4,RandomForest,1,0.15,0.5611940298507463,0.4370583444824668,0.5805411338806152,0.4370583444824668
108,4,AdaBoost (Discrete),1,0.15,0.7268656716417911,0.7175362523198298,45.587666273117065,0.7175362523198298
109,4,AdaBoost (Real),1,0.15,0.5328358208955224,0.4626061240012398,57.693941593170166,0.4626061240012398
110,4,Logistic Regression (Penalty = L2),1,0.15,0.7626865671641792,0.744571510300221,0.46481823921203613,0.744571510300221
111,4,Naive Bayes,1,0.15,0.7835820895522388,0.766171111519815,0.06231069564819336,0.766171111519815
112,4,KNeighbors Classifier,2,0.15,0.8681818181818182,0.8639420001452959,0.24393868446350098,0.8639420001452959
113,4,SVC Classifier,2,0.15,0.7015151515151515,0.6745968187636951,1.511423110961914,0.6745968187636951
114,4,Decision Tree,2,0.15,0.6863636363636364,0.6773673248512551,0.0653231143951416,0.6773673248512551
115,4,RandomForest,2,0.15,0.5272727272727272,0.41021564618341083,0.5079209804534912,0.0
116,4,AdaBoost (Discrete),2,0.15,0.7636363636363637,0.7524519302142472,48.448954343795776,0.7524519302142472
117,4,AdaBoost (Real),2,0.15,0.6424242424242425,0.5812588514187613,62.5444700717926,0.5812588514187613
118,4,Logistic Regression (Penalty = L2),2,0.15,0.7772727272727272,0.7673142506963319,0.6371579170227051,0.7673142506963319
119,4,Naive Bayes,2,0.15,0.7924242424242425,0.7817911840488485,0.23698854446411133,0.7817911840488485
120,5,KNeighbors Classifier,0,0.15,0.8791044776119403,0.8771485383420451,0.4541177749633789,0.8771485383420451
121,5,SVC Classifier,0,0.15,0.7313432835820896,0.7073796287610502,1.91371488571167,0.7073796287610502
122,5,Decision Tree,0,0.15,0.6611940298507463,0.6525542232716314,0.15343117713928223,0.6525542232716314
123,5,RandomForest,0,0.15,0.655223880597015,0.6121229150723758,0.6007633209228516,0.6121229150723758
124,5,AdaBoost (Discrete),0,0.15,0.7477611940298508,0.7431843133155167,61.787314891815186,0.7431843133155167
125,5,AdaBoost (Real),0,0.15,0.691044776119403,0.6762123370558039,74.30684733390808,0.6762123370558039
126,5,Logistic Regression (Penalty = L2),0,0.15,0.7820895522388059,0.7749188573445365,0.6925392150878906,0.7749188573445365
127,5,Naive Bayes,0,0.15,0.8,0.7953104249603314,0.16400671005249023,0.7953104249603314
128,5,KNeighbors Classifier,1,0.15,0.8895522388059701,0.8878274124328646,0.3679969310760498,0.8878274124328646
129,5,SVC Classifier,1,0.15,0.7582089552238805,0.7369181172843355,1.9943108558654785,0.7369181172843355
130,5,Decision Tree,1,0.15,0.7432835820895523,0.738326179172679,0.0968780517578125,0.738326179172679
131,5,RandomForest,1,0.15,0.6223880597014926,0.5327158906811883,0.6234161853790283,0.5327158906811883
132,5,AdaBoost (Discrete),1,0.15,0.7805970149253731,0.77790856478715,61.324767112731934,0.77790856478715
133,5,AdaBoost (Real),1,0.15,0.408955223880597,0.34803680061245124,77.64689350128174,0.34803680061245124
134,5,Logistic Regression (Penalty = L2),1,0.15,0.8074626865671641,0.802314343374642,0.6370229721069336,0.802314343374642
135,5,Naive Bayes,1,0.15,0.8238805970149253,0.8214988401342117,0.13799786567687988,0.8214988401342117
136,5,KNeighbors Classifier,2,0.15,0.8954545454545455,0.8942969661462631,0.49363255500793457,0.8942969661462631
137,5,SVC Classifier,2,0.15,0.759090909090909,0.7408865491035728,2.1978633403778076,0.7408865491035728
138,5,Decision Tree,2,0.15,0.7439393939393939,0.7422868069516814,0.15758228302001953,0.7422868069516814
139,5,RandomForest,2,0.15,0.646969696969697,0.5429827574688737,0.8016469478607178,0.5429827574688737
140,5,AdaBoost (Discrete),2,0.15,0.7833333333333333,0.77743279253883,62.41756319999695,0.77743279253883
141,5,AdaBoost (Real),2,0.15,0.7727272727272727,0.75190472387907,71.42057228088379,0.75190472387907
142,5,Logistic Regression (Penalty = L2),2,0.15,0.8318181818181818,0.8285267058249621,0.5768496990203857,0.8285267058249621
143,5,Naive Bayes,2,0.15,0.8409090909090909,0.8393537063679521,0.15978455543518066,0.8393537063679521
144,6,KNeighbors Classifier,0,0.15,0.8716417910447761,0.8681841572814382,0.38709139823913574,0.8681841572814382
145,6,SVC Classifier,0,0.15,0.7597014925373134,0.7443069436730714,2.1298739910125732,0.7443069436730714
146,6,Decision Tree,0,0.15,0.7,0.691038366821636,0.15010857582092285,0.691038366821636
147,6,RandomForest,0,0.15,0.6477611940298508,0.5685527718094701,0.5737640857696533,0.5685527718094701
148,6,AdaBoost (Discrete),0,0.15,0.7820895522388059,0.777262049895297,61.25067949295044,0.777262049895297
149,6,AdaBoost (Real),0,0.15,0.7611940298507462,0.7563717653233852,75.82091903686523,0.7563717653233852
150,6,Logistic Regression (Penalty = L2),0,0.15,0.7805970149253731,0.7759229233943467,0.5562644004821777,0.7759229233943467
151,6,Naive Bayes,0,0.15,0.808955223880597,0.8051747824136619,0.15047335624694824,0.8051747824136619
152,6,KNeighbors Classifier,1,0.15,0.8701492537313433,0.8660714372661146,0.3586151599884033,0.8660714372661146
153,6,SVC Classifier,1,0.15,0.7238805970149254,0.7070588214628415,2.004319667816162,0.7070588214628415
154,6,Decision Tree,1,0.15,0.7074626865671642,0.6984998264458457,0.07832026481628418,0.6984998264458457
155,6,RandomForest,1,0.15,0.682089552238806,0.6727970101512488,0.6789076328277588,0.6727970101512488
156,6,AdaBoost (Discrete),1,0.15,0.7597014925373134,0.7490312506550609,59.42235350608826,0.7490312506550609
157,6,AdaBoost (Real),1,0.15,0.4746268656716418,0.3366586455487918,74.420645236969,0.3366586455487918
158,6,Logistic Regression (Penalty = L2),1,0.15,0.8014925373134328,0.7978217889830759,0.871403694152832,0.7978217889830759
159,6,Naive Bayes,1,0.15,0.8134328358208955,0.8101692389505312,0.23714041709899902,0.8101692389505312
160,6,KNeighbors Classifier,2,0.15,0.8893939393939394,0.8882589347374541,0.37569522857666016,0.8882589347374541
161,6,SVC Classifier,2,0.15,0.7787878787878788,0.7723041417014579,2.0504393577575684,0.7723041417014579
162,6,Decision Tree,2,0.15,0.6803030303030303,0.6755309167606137,0.1381990909576416,0.6755309167606137
163,6,RandomForest,2,0.15,0.6666666666666666,0.544323110878327,0.5939750671386719,0.544323110878327
164,6,AdaBoost (Discrete),2,0.15,0.8151515151515152,0.8128122576294418,62.57715058326721,0.8128122576294418
165,6,AdaBoost (Real),2,0.15,0.7454545454545455,0.7272731601952462,75.80155634880066,0.7272731601952462
166,6,Logistic Regression (Penalty = L2),2,0.15,0.8166666666666667,0.814541991331678,0.5454814434051514,0.814541991331678
167,6,Naive Bayes,2,0.15,0.8590909090909091,0.8579267327373958,0.14626836776733398,0.8579267327373958
168,7,KNeighbors Classifier,0,0.15,0.6671641791044776,0.6394655284342662,0.15498948097229004,0.6394655284342662
169,7,SVC Classifier,0,0.15,0.6029850746268657,0.49212346768077175,1.753723382949829,0.49212346768077175
170,7,Decision Tree,0,0.15,0.5940298507462687,0.5676937716096772,0.16535091400146484,0.5676937716096772
171,7,RandomForest,0,0.15,0.47313432835820896,0.5100806929797908,0.6824686527252197,0.0
172,7,AdaBoost (Discrete),0,0.15,0.5328358208955224,0.4995003289767963,47.81352424621582,0.4995003289767963
173,7,AdaBoost (Real),0,0.15,0.48656716417910445,0.43004121502014475,62.966673851013184,0.43004121502014475
174,7,Logistic Regression (Penalty = L2),0,0.15,0.6358208955223881,0.5975116435920753,0.45065760612487793,0.5975116435920753
175,7,Naive Bayes,0,0.15,0.6492537313432836,0.6293606898863424,0.1511247158050537,0.6293606898863424
176,7,KNeighbors Classifier,1,0.15,0.6611940298507463,0.6296359459757609,0.29276132583618164,0.6296359459757609
177,7,SVC Classifier,1,0.15,0.5970149253731343,0.47960389292586236,1.8429291248321533,0.47960389292586236
178,7,Decision Tree,1,0.15,0.6134328358208955,0.5901232253565,0.07781314849853516,0.5901232253565
179,7,RandomForest,1,0.15,0.5044776119402985,0.30621433017785343,0.6109118461608887,0.30621433017785343
180,7,AdaBoost (Discrete),1,0.15,0.5343283582089552,0.5003009039051285,48.73234724998474,0.5003009039051285
181,7,AdaBoost (Real),1,0.15,0.39104477611940297,0.31112590423454856,63.05007338523865,0.31112590423454856
182,7,Logistic Regression (Penalty = L2),1,0.15,0.6268656716417911,0.586415942822197,0.3267326354980469,0.586415942822197
183,7,Naive Bayes,1,0.15,0.6701492537313433,0.6469838077081498,0.14748573303222656,0.6469838077081498
184,7,KNeighbors Classifier,2,0.15,0.6803030303030303,0.6411865192734315,0.2276146411895752,0.6411865192734315
185,7,SVC Classifier,2,0.15,0.6090909090909091,0.5223775635440364,1.8505775928497314,0.5223775635440364
186,7,Decision Tree,2,0.15,0.6363636363636364,0.612692143406505,0.14992332458496094,0.612692143406505
187,7,RandomForest,2,0.15,0.4984848484848485,0.23860081172983846,0.6678171157836914,0.23860081172983846
188,7,AdaBoost (Discrete),2,0.15,0.6212121212121212,0.5745128085424575,48.66842198371887,0.5745128085424575
189,7,AdaBoost (Real),2,0.15,0.4893939393939394,0.36775728134766006,62.636579275131226,0.36775728134766006
190,7,Logistic Regression (Penalty = L2),2,0.15,0.6424242424242425,0.6028145886759874,0.38078951835632324,0.6028145886759874
191,7,Naive Bayes,2,0.15,0.6757575757575758,0.64859094920235,0.15030598640441895,0.64859094920235
192,8,KNeighbors Classifier,0,0.15,0.8716417910447761,0.8696452193404428,0.30489420890808105,0.8696452193404428
193,8,SVC Classifier,0,0.15,0.7402985074626866,0.730186703507722,1.8928120136260986,0.730186703507722
194,8,Decision Tree,0,0.15,0.6805970149253732,0.6731798029305054,0.07245588302612305,0.6731798029305054
195,8,RandomForest,0,0.15,0.6417910447761194,0.592204441776428,0.6101024150848389,0.592204441776428
196,8,AdaBoost (Discrete),0,0.15,0.7746268656716417,0.7719910270815726,60.713465213775635,0.7719910270815726
197,8,AdaBoost (Real),0,0.15,0.6358208955223881,0.6167766869101868,75.43681144714355,0.6167766869101868
198,8,Logistic Regression (Penalty = L2),0,0.15,0.7597014925373134,0.7519570592965257,0.5950045585632324,0.7519570592965257
199,8,Naive Bayes,0,0.15,0.8074626865671641,0.8059462402897469,0.07753872871398926,0.8059462402897469
200,8,KNeighbors Classifier,1,0.15,0.8835820895522388,0.8818594532868271,0.3762998580932617,0.8818594532868271
201,8,SVC Classifier,1,0.15,0.7343283582089553,0.7238772862285202,1.9838364124298096,0.7238772862285202
202,8,Decision Tree,1,0.15,0.691044776119403,0.6875404263491471,0.08542490005493164,0.6875404263491471
203,8,RandomForest,1,0.15,0.6507462686567164,0.6158223244008163,0.582003116607666,0.6158223244008163
204,8,AdaBoost (Discrete),1,0.15,0.7701492537313432,0.7664861765797943,61.33786630630493,0.7664861765797943
205,8,AdaBoost (Real),1,0.15,0.5671641791044776,0.5230019426742305,73.86571407318115,0.5230019426742305
206,8,Logistic Regression (Penalty = L2),1,0.15,0.7910447761194029,0.7864311257508825,0.5638213157653809,0.7864311257508825
207,8,Naive Bayes,1,0.15,0.8283582089552238,0.8268571150013315,0.15472197532653809,0.8268571150013315
208,8,KNeighbors Classifier,2,0.15,0.9015151515151515,0.9005107973702058,0.37065696716308594,0.9005107973702058
209,8,SVC Classifier,2,0.15,0.7545454545454545,0.7449199686765308,1.9730350971221924,0.7449199686765308
210,8,Decision Tree,2,0.15,0.7166666666666667,0.712369454503891,0.0771491527557373,0.712369454503891
211,8,RandomForest,2,0.15,0.6090909090909091,0.5277772954233526,0.5328824520111084,0.5277772954233526
212,8,AdaBoost (Discrete),2,0.15,0.8196969696969697,0.8174865277010517,61.47404336929321,0.8174865277010517
213,8,AdaBoost (Real),2,0.15,0.5484848484848485,0.5191731687332747,75.08302068710327,0.5191731687332747
214,8,Logistic Regression (Penalty = L2),2,0.15,0.793939393939394,0.7877814442266121,0.5825388431549072,0.7877814442266121
215,8,Naive Bayes,2,0.15,0.8469696969696969,0.8461601669028089,0.1548905372619629,0.8461601669028089
216,9,KNeighbors Classifier,0,0.15,0.8044776119402985,0.7938821391723216,0.30574488639831543,0.7938821391723216
217,9,SVC Classifier,0,0.15,0.6865671641791045,0.6374006557378522,1.9438247680664062,0.6374006557378522
218,9,Decision Tree,0,0.15,0.6447761194029851,0.6304438822405747,0.15013504028320312,0.6304438822405747
219,9,RandomForest,0,0.15,0.5776119402985075,0.6087049291922765,0.6869478225708008,0.0
220,9,AdaBoost (Discrete),0,0.15,0.6686567164179105,0.6583419977191037,57.72194457054138,0.6583419977191037
221,9,AdaBoost (Real),0,0.15,0.5791044776119403,0.5577415564901393,70.65565657615662,0.5577415564901393
222,9,Logistic Regression (Penalty = L2),0,0.15,0.7343283582089553,0.7199249527373978,0.5071015357971191,0.7199249527373978
223,9,Naive Bayes,0,0.15,0.7477611940298508,0.7353630667978085,0.15241074562072754,0.7353630667978085
224,9,KNeighbors Classifier,1,0.15,0.8253731343283582,0.820642201167232,0.30448269844055176,0.820642201167232
225,9,SVC Classifier,1,0.15,0.7134328358208956,0.6816601382321461,1.9527547359466553,0.6816601382321461
226,9,Decision Tree,1,0.15,0.664179104477612,0.6514396056326172,0.14669227600097656,0.6514396056326172
227,9,RandomForest,1,0.15,0.5761194029850746,0.4186273683111126,0.6733300685882568,0.4186273683111126
228,9,AdaBoost (Discrete),1,0.15,0.6850746268656717,0.6609119569786087,57.535624742507935,0.6609119569786087
229,9,AdaBoost (Real),1,0.15,0.46417910447761196,0.40394041617466747,71.1466658115387,0.40394041617466747
230,9,Logistic Regression (Penalty = L2),1,0.15,0.753731343283582,0.7464903268058527,0.6058101654052734,0.7464903268058527
231,9,Naive Bayes,1,0.15,0.764179104477612,0.7531816496964523,0.13724899291992188,0.7531816496964523
232,9,KNeighbors Classifier,2,0.15,0.8333333333333334,0.8285226721316116,0.3662080764770508,0.8285226721316116
233,9,SVC Classifier,2,0.15,0.7181818181818181,0.6923333739916464,1.7652297019958496,0.6923333739916464
234,9,Decision Tree,2,0.15,0.6909090909090909,0.6775995752549445,0.15402603149414062,0.6775995752549445
235,9,RandomForest,2,0.15,0.5772727272727273,0.5357300068704025,0.6831860542297363,0.5357300068704025
236,9,AdaBoost (Discrete),2,0.15,0.7166666666666667,0.709586427530862,58.34488868713379,0.709586427530862
237,9,AdaBoost (Real),2,0.15,0.5257575757575758,0.4547877295456238,65.01547431945801,0.4547877295456238
238,9,Logistic Regression (Penalty = L2),2,0.15,0.7636363636363637,0.7552957596741416,0.6267147064208984,0.7552957596741416
239,9,Naive Bayes,2,0.15,0.806060606060606,0.8022110714433658,0.14019131660461426,0.8022110714433658
240,10,KNeighbors Classifier,0,0.15,0.9492537313432836,0.9486787712249094,0.6021292209625244,0.9486787712249094
241,10,SVC Classifier,0,0.15,0.8432835820895522,0.8423787160997458,2.1488723754882812,0.8423787160997458
242,10,Decision Tree,0,0.15,0.753731343283582,0.7483543231597796,0.13068485260009766,0.7483543231597796
243,10,RandomForest,0,0.15,0.6701492537313433,0.6423168105085584,0.6174139976501465,0.6423168105085584
244,10,AdaBoost (Discrete),0,0.15,0.9,0.8988838269621179,70.55116987228394,0.8988838269621179
245,10,AdaBoost (Real),0,0.15,0.8671641791044776,0.8635115315609955,82.54452347755432,0.8635115315609955
246,10,Logistic Regression (Penalty = L2),0,0.15,0.8791044776119403,0.8784524539944204,0.6737246513366699,0.8784524539944204
247,10,Naive Bayes,0,0.15,0.8820895522388059,0.8811260141875419,0.2129983901977539,0.8811260141875419
248,10,KNeighbors Classifier,1,0.15,0.9432835820895522,0.9422157328661769,0.5299952030181885,0.9422157328661769
249,10,SVC Classifier,1,0.15,0.8522388059701492,0.8511387065675639,2.0012357234954834,0.8511387065675639
250,10,Decision Tree,1,0.15,0.8313432835820895,0.8301286226996019,0.13545513153076172,0.8301286226996019
251,10,RandomForest,1,0.15,0.6626865671641791,0.604775722620671,0.6184356212615967,0.604775722620671
252,10,AdaBoost (Discrete),1,0.15,0.8925373134328358,0.8916824934569448,77.28866457939148,0.8916824934569448
253,10,AdaBoost (Real),1,0.15,0.5686567164179105,0.4877820055227022,90.3558418750763,0.4877820055227022
254,10,Logistic Regression (Penalty = L2),1,0.15,0.9059701492537313,0.9050388256610494,0.7363061904907227,0.9050388256610494
255,10,Naive Bayes,1,0.15,0.8955223880597015,0.8949814023503926,0.13245511054992676,0.8949814023503926
256,10,KNeighbors Classifier,2,0.15,0.956060606060606,0.9556604105188218,0.6552293300628662,0.9556604105188218
257,10,SVC Classifier,2,0.15,0.8545454545454545,0.852690900433346,2.273735284805298,0.852690900433346
258,10,Decision Tree,2,0.15,0.7833333333333333,0.7788198430713578,0.14721393585205078,0.7788198430713578
259,10,RandomForest,2,0.15,0.7,0.6390495481033315,0.7556097507476807,0.6390495481033315
260,10,AdaBoost (Discrete),2,0.15,0.8984848484848484,0.8967570533384059,78.74109053611755,0.8967570533384059
261,10,AdaBoost (Real),2,0.15,0.8681818181818182,0.8649515055758311,87.07103872299194,0.8649515055758311
262,10,Logistic Regression (Penalty = L2),2,0.15,0.9045454545454545,0.9040627037653027,0.719977617263794,0.9040627037653027
263,10,Naive Bayes,2,0.15,0.9136363636363637,0.9129546561634297,0.21605801582336426,0.9129546561634297
264,11,KNeighbors Classifier,0,0.15,0.9537313432835821,0.9528239070648639,1.3860962390899658,0.9528239070648639
265,11,SVC Classifier,0,0.15,0.8731343283582089,0.8725454548295282,2.7640085220336914,0.8725454548295282
266,11,Decision Tree,0,0.15,0.7686567164179104,0.7627476003074407,0.13941073417663574,0.7627476003074407
267,11,RandomForest,0,0.15,0.6776119402985075,0.6505819210870167,0.6592655181884766,0.6505819210870167
268,11,AdaBoost (Discrete),0,0.15,0.9104477611940298,0.909370900770827,100.22386336326599,0.909370900770827
269,11,AdaBoost (Real),0,0.15,0.608955223880597,0.5742526291720336,104.679692029953,0.5742526291720336
270,11,Logistic Regression (Penalty = L2),0,0.15,0.9238805970149254,0.9229468334580594,0.8588335514068604,0.9229468334580594
271,11,Naive Bayes,0,0.15,0.9134328358208955,0.9128711988026046,0.1364281177520752,0.9128711988026046
272,11,KNeighbors Classifier,1,0.15,0.9582089552238806,0.9575946621387744,1.305896282196045,0.9575946621387744
273,11,SVC Classifier,1,0.15,0.8985074626865671,0.8966057893164525,2.694915294647217,0.8966057893164525
274,11,Decision Tree,1,0.15,0.744776119402985,0.7384907801800736,0.13638043403625488,0.7384907801800736
275,11,RandomForest,1,0.15,0.6850746268656717,0.6519166348423836,0.6025748252868652,0.6519166348423836
276,11,AdaBoost (Discrete),1,0.15,0.9119402985074627,0.9112614810729682,99.28177070617676,0.9112614810729682
277,11,AdaBoost (Real),1,0.15,0.8716417910447761,0.8695557024399397,107.73462772369385,0.8695557024399397
278,11,Logistic Regression (Penalty = L2),1,0.15,0.926865671641791,0.9254268285487285,0.8093657493591309,0.9254268285487285
279,11,Naive Bayes,1,0.15,0.9194029850746268,0.9185129922429998,0.14159941673278809,0.9185129922429998
280,11,KNeighbors Classifier,2,0.15,0.956060606060606,0.9555414350392067,1.0931410789489746,0.9555414350392067
281,11,SVC Classifier,2,0.15,0.8909090909090909,0.8900821207729446,2.6406264305114746,0.8900821207729446
282,11,Decision Tree,2,0.15,0.7757575757575758,0.7715899891598637,0.13314461708068848,0.7715899891598637
283,11,RandomForest,2,0.15,0.6712121212121213,0.6260114256119291,0.6636195182800293,0.6260114256119291
284,11,AdaBoost (Discrete),2,0.15,0.9242424242424242,0.9233010040240198,92.37519192695618,0.9233010040240198
285,11,AdaBoost (Real),2,0.15,0.7757575757575758,0.7687414711422491,98.80536603927612,0.7687414711422491
286,11,Logistic Regression (Penalty = L2),2,0.15,0.9348484848484848,0.9343277629566134,0.7698013782501221,0.9343277629566134
287,11,Naive Bayes,2,0.15,0.9272727272727272,0.9270318832057973,0.20174407958984375,0.9270318832057973
288,12,KNeighbors Classifier,0,0.15,0.6671641791044776,0.6394655284342662,0.1895301342010498,0.6394655284342662
289,12,SVC Classifier,0,0.15,0.6029850746268657,0.49212346768077175,1.4653279781341553,0.49212346768077175
290,12,Decision Tree,0,0.15,0.6104477611940299,0.5964196131848226,0.06969189643859863,0.5964196131848226
291,12,RandomForest,0,0.15,0.47313432835820896,0.5100806929797908,0.5088648796081543,0.0
292,12,AdaBoost (Discrete),0,0.15,0.5313432835820896,0.49694478694622035,42.602495431900024,0.49694478694622035
293,12,AdaBoost (Real),0,0.15,0.5208955223880597,0.4714245511504954,55.05762267112732,0.4714245511504954
294,12,Logistic Regression (Penalty = L2),0,0.15,0.6358208955223881,0.5975116435920753,0.25750231742858887,0.5975116435920753
295,12,Naive Bayes,0,0.15,0.6492537313432836,0.6293606898863424,0.16815543174743652,0.6293606898863424
296,12,KNeighbors Classifier,1,0.15,0.6611940298507463,0.6296359459757609,0.18826031684875488,0.6296359459757609
297,12,SVC Classifier,1,0.15,0.5970149253731343,0.47960389292586236,1.5194623470306396,0.47960389292586236
298,12,Decision Tree,1,0.15,0.6208955223880597,0.5954915299598638,0.12633752822875977,0.5954915299598638
299,12,RandomForest,1,0.15,0.5044776119402985,0.30621433017785343,0.4535510540008545,0.30621433017785343
300,12,AdaBoost (Discrete),1,0.15,0.5343283582089552,0.5003009039051285,41.71203660964966,0.5003009039051285
301,12,AdaBoost (Real),1,0.15,0.43283582089552236,0.24968015433876264,54.443681478500366,0.24968015433876264
302,12,Logistic Regression (Penalty = L2),1,0.15,0.6268656716417911,0.586415942822197,0.33060741424560547,0.586415942822197
303,12,Naive Bayes,1,0.15,0.6701492537313433,0.6469838077081498,0.06326889991760254,0.6469838077081498
304,12,KNeighbors Classifier,2,0.15,0.6803030303030303,0.6411865192734315,0.1828296184539795,0.6411865192734315
305,12,SVC Classifier,2,0.15,0.6090909090909091,0.5223775635440364,1.498363971710205,0.5223775635440364
306,12,Decision Tree,2,0.15,0.6303030303030303,0.6069236673231121,0.12665748596191406,0.6069236673231121
307,12,RandomForest,2,0.15,0.4984848484848485,0.23860081172983846,0.5716369152069092,0.23860081172983846
308,12,AdaBoost (Discrete),2,0.15,0.6212121212121212,0.5745128085424575,41.25598382949829,0.5745128085424575
309,12,AdaBoost (Real),2,0.15,0.5303030303030303,0.4619777609651317,53.6063506603241,0.4619777609651317
310,12,Logistic Regression (Penalty = L2),2,0.15,0.6424242424242425,0.6028145886759874,0.31444644927978516,0.6028145886759874
311,12,Naive Bayes,2,0.15,0.6757575757575758,0.64859094920235,0.1340792179107666,0.64859094920235
