,feat_set_id,classifier,fold_id,feat_th,score,geo_score,exec_t,geo_score_woz
0,0,KNeighbors Classifier,0,0.35,0.7825,0.5602481653534351,5.1387717723846436,0.5602481653534351
1,0,SVC Classifier,0,0.35,0.7795,0.09014398837291854,41.965245962142944,0.09014398837291854
2,0,Decision Tree,0,0.35,0.7803,0.5440882365790437,0.15573811531066895,0.5440882365790437
3,0,RandomForest,0,0.35,0.8038,0.5066299639507097,0.41718029975891113,0.5066299639507097
4,0,AdaBoost (Discrete),0,0.35,0.8079,0.573225762637389,34.53914713859558,0.573225762637389
5,0,AdaBoost (Real),0,0.35,0.8047,0.5609272388497902,60.9680335521698,0.5609272388497902
6,0,Logistic Regression (Penalty = L2),0,0.35,0.8051,0.480605755967715,0.29770350456237793,0.480605755967715
7,0,Naive Bayes,0,0.35,0.7932,0.5935682178379559,0.09603500366210938,0.5935682178379559
8,0,KNeighbors Classifier,1,0.35,0.7889,0.6045515109088854,5.69689416885376,0.6045515109088854
9,0,SVC Classifier,1,0.35,0.7788,1.0,37.3392174243927,0.0
10,0,Decision Tree,1,0.35,0.7892,0.5789398693196651,0.15526199340820312,0.5789398693196651
11,0,RandomForest,1,0.35,0.81,0.5067584459467913,0.3200113773345947,0.5067584459467913
12,0,AdaBoost (Discrete),1,0.35,0.8238,0.6161323959596238,32.675644636154175,0.6161323959596238
13,0,AdaBoost (Real),1,0.35,0.8215,0.6071899153555673,66.04596018791199,0.6071899153555673
14,0,Logistic Regression (Penalty = L2),1,0.35,0.8116,0.4847937205126173,0.33469414710998535,0.4847937205126173
15,0,Naive Bayes,1,0.35,0.8022,0.6323733631805873,0.11843729019165039,0.6323733631805873
16,0,KNeighbors Classifier,2,0.35,0.7879,0.5600868188177232,5.265210390090942,0.5600868188177232
17,0,SVC Classifier,2,0.35,0.7788,1.0,37.60067057609558,0.0
18,0,Decision Tree,2,0.35,0.7995,0.5430386849010669,0.1581437587738037,0.5430386849010669
19,0,RandomForest,2,0.35,0.8075,0.4458266630000269,0.35402369499206543,0.4458266630000269
20,0,AdaBoost (Discrete),2,0.35,0.8239,0.5710011911922247,34.319289207458496,0.5710011911922247
21,0,AdaBoost (Real),2,0.35,0.8187,0.5662768022436657,51.92176270484924,0.5662768022436657
22,0,Logistic Regression (Penalty = L2),2,0.35,0.8086,0.44986931834316546,0.25580763816833496,0.44986931834316546
23,0,Naive Bayes,2,0.35,0.8107,0.6106154984540911,0.09542322158813477,0.6106154984540911
24,1,KNeighbors Classifier,0,0.35,0.7694,0.5717060253718432,4.859025478363037,0.5717060253718432
25,1,SVC Classifier,0,0.35,0.7788,1.0,37.08726692199707,0.0
26,1,Decision Tree,0,0.35,0.7179,0.5379639615890849,0.3409445285797119,0.5379639615890849
27,1,RandomForest,0,0.35,0.7788,1.0,0.498187780380249,0.0
28,1,AdaBoost (Discrete),0,0.35,0.8092,0.5550771870349153,87.72257328033447,0.5550771870349153
29,1,AdaBoost (Real),0,0.35,0.781,0.542313451230935,99.79620480537415,0.542313451230935
30,1,Logistic Regression (Penalty = L2),0,0.35,0.8054,0.4931581216856179,0.30640149116516113,0.4931581216856179
31,1,Naive Bayes,0,0.35,0.5402,0.5970995195216536,0.12322449684143066,0.5970995195216536
32,1,KNeighbors Classifier,1,0.35,0.7764,0.5988311169208722,3.440272331237793,0.5988311169208722
33,1,SVC Classifier,1,0.35,0.7788,1.0,34.58860516548157,0.0
34,1,Decision Tree,1,0.35,0.7384,0.5894537399383116,0.3353610038757324,0.5894537399383116
35,1,RandomForest,1,0.35,0.7788,1.0,0.5155603885650635,0.0
36,1,AdaBoost (Discrete),1,0.35,0.8237,0.6052914579339254,89.53450417518616,0.6052914579339254
37,1,AdaBoost (Real),1,0.35,0.8002,0.5980239209312849,100.88824653625488,0.5980239209312849
38,1,Logistic Regression (Penalty = L2),1,0.35,0.8164,0.5233710550963532,0.30620265007019043,0.5233710550963532
39,1,Naive Bayes,1,0.35,0.4318,0.5171341238966672,0.11167073249816895,0.5171341238966672
40,1,KNeighbors Classifier,2,0.35,0.7808,0.560223608859772,5.757993459701538,0.560223608859772
41,1,SVC Classifier,2,0.35,0.7788,1.0,29.08053421974182,0.0
42,1,Decision Tree,2,0.35,0.7346,0.5603044236420094,0.3158144950866699,0.5603044236420094
43,1,RandomForest,2,0.35,0.7788,1.0,0.4715921878814697,0.0
44,1,AdaBoost (Discrete),2,0.35,0.8207,0.5590386445580249,86.79598379135132,0.5590386445580249
45,1,AdaBoost (Real),2,0.35,0.7934,0.5449542886536559,102.59741854667664,0.5449542886536559
46,1,Logistic Regression (Penalty = L2),2,0.35,0.8104,0.46448088497497425,0.2834353446960449,0.46448088497497425
47,1,Naive Bayes,2,0.35,0.6268,0.6498351596510372,0.08407974243164062,0.6498351596510372
48,2,KNeighbors Classifier,0,0.35,0.7843,0.564859384998893,6.713446140289307,0.564859384998893
49,2,SVC Classifier,0,0.35,0.7795,0.09014398837291854,35.09124302864075,0.09014398837291854
50,2,Decision Tree,0,0.35,0.7785,0.5348228908565146,0.1293315887451172,0.5348228908565146
51,2,RandomForest,0,0.35,0.8038,0.5066299639507097,0.3231961727142334,0.5066299639507097
52,2,AdaBoost (Discrete),0,0.35,0.8099,0.5799237497269382,31.12587285041809,0.5799237497269382
53,2,AdaBoost (Real),0,0.35,0.8089,0.5692919577727494,49.68602466583252,0.5692919577727494
54,2,Logistic Regression (Penalty = L2),0,0.35,0.8062,0.48264378743112635,0.24132108688354492,0.48264378743112635
55,2,Naive Bayes,0,0.35,0.7924,0.5901824698105739,0.10717272758483887,0.5901824698105739
56,2,KNeighbors Classifier,1,0.35,0.7861,0.595977309915284,6.81983757019043,0.595977309915284
57,2,SVC Classifier,1,0.35,0.7788,1.0,39.005624294281006,0.0
58,2,Decision Tree,1,0.35,0.7907,0.5836157607899337,0.16231489181518555,0.5836157607899337
59,2,RandomForest,1,0.35,0.81,0.5067584459467913,0.4137294292449951,0.5067584459467913
60,2,AdaBoost (Discrete),1,0.35,0.8228,0.6042963835154198,34.42308259010315,0.6042963835154198
61,2,AdaBoost (Real),1,0.35,0.8198,0.605557381710865,51.790302991867065,0.605557381710865
62,2,Logistic Regression (Penalty = L2),1,0.35,0.8134,0.4920678313051229,0.29599905014038086,0.4920678313051229
63,2,Naive Bayes,1,0.35,0.8018,0.6321937881767734,0.09710121154785156,0.6321937881767734
64,2,KNeighbors Classifier,2,0.35,0.7888,0.5607704353529218,5.844135522842407,0.5607704353529218
65,2,SVC Classifier,2,0.35,0.7788,1.0,37.43185496330261,0.0
66,2,Decision Tree,2,0.35,0.7921,0.5496288706448432,0.1564960479736328,0.5496288706448432
67,2,RandomForest,2,0.35,0.8075,0.4458266630000269,0.2905402183532715,0.4458266630000269
68,2,AdaBoost (Discrete),2,0.35,0.8236,0.5604722324946355,31.82453417778015,0.5604722324946355
69,2,AdaBoost (Real),2,0.35,0.8173,0.5616036307302124,48.910502433776855,0.5616036307302124
70,2,Logistic Regression (Penalty = L2),2,0.35,0.8101,0.44798762263749936,0.19821572303771973,0.44798762263749936
71,2,Naive Bayes,2,0.35,0.8109,0.6103991870363227,0.12993454933166504,0.6103991870363227
72,3,KNeighbors Classifier,0,0.35,0.7742,0.5414024872919567,7.23614239692688,0.5414024872919567
73,3,SVC Classifier,0,0.35,0.7795,0.09014398837291854,36.83249640464783,0.09014398837291854
74,3,Decision Tree,0,0.35,0.7319,0.5416569100119709,0.3806638717651367,0.5416569100119709
75,3,RandomForest,0,0.35,0.8053,0.45890720292822146,0.35629892349243164,0.45890720292822146
76,3,AdaBoost (Discrete),0,0.35,0.8089,0.5729557241380573,65.56832599639893,0.5729557241380573
77,3,AdaBoost (Real),0,0.35,0.7818,0.5339718784424045,75.58979177474976,0.5339718784424045
78,3,Logistic Regression (Penalty = L2),0,0.35,0.8038,0.4611318067733601,0.27410197257995605,0.4611318067733601
79,3,Naive Bayes,0,0.35,0.7968,0.5785486479933727,0.10883092880249023,0.5785486479933727
80,3,KNeighbors Classifier,1,0.35,0.7823,0.6037171090779009,5.728932857513428,0.6037171090779009
81,3,SVC Classifier,1,0.35,0.7788,1.0,36.8850417137146,0.0
82,3,Decision Tree,1,0.35,0.7364,0.5709630672602048,0.2590467929840088,0.5709630672602048
83,3,RandomForest,1,0.35,0.8119,0.4806445252251398,0.3472013473510742,0.4806445252251398
84,3,AdaBoost (Discrete),1,0.35,0.8247,0.6119150813915301,59.90229511260986,0.6119150813915301
85,3,AdaBoost (Real),1,0.35,0.7927,0.5778427172902475,76.368412733078,0.5778427172902475
86,3,Logistic Regression (Penalty = L2),1,0.35,0.809,0.47240988329613653,0.2505912780761719,0.47240988329613653
87,3,Naive Bayes,1,0.35,0.8033,0.6224058163181664,0.11430907249450684,0.6224058163181664
88,3,KNeighbors Classifier,2,0.35,0.7887,0.5530714394017892,6.032312870025635,0.5530714394017892
89,3,SVC Classifier,2,0.35,0.7788,1.0,35.686816692352295,0.0
90,3,Decision Tree,2,0.35,0.7383,0.5510797747841529,0.28017544746398926,0.5510797747841529
91,3,RandomForest,2,0.35,0.8085,0.4376000180955942,0.4490194320678711,0.4376000180955942
92,3,AdaBoost (Discrete),2,0.35,0.8232,0.5669497299353519,63.361440658569336,0.5669497299353519
93,3,AdaBoost (Real),2,0.35,0.7961,0.5321460663039035,76.83123230934143,0.5321460663039035
94,3,Logistic Regression (Penalty = L2),2,0.35,0.8079,0.43550774762123384,0.2785308361053467,0.43550774762123384
95,3,Naive Bayes,2,0.35,0.8105,0.5992359781836801,0.10907268524169922,0.5992359781836801
96,4,KNeighbors Classifier,0,0.35,0.7754,0.5544959059842633,1.250838041305542,0.5544959059842633
97,4,SVC Classifier,0,0.35,0.7788,1.0,22.276480436325073,0.0
98,4,Decision Tree,0,0.35,0.8069,0.5279673699585627,0.06581306457519531,0.5279673699585627
99,4,RandomForest,0,0.35,0.8098,0.5374868162767433,0.29079389572143555,0.5374868162767433
100,4,AdaBoost (Discrete),0,0.35,0.808,0.5401004716124015,19.371796369552612,0.5401004716124015
101,4,AdaBoost (Real),0,0.35,0.8083,0.5329128055258378,43.737553358078,0.5329128055258378
102,4,Logistic Regression (Penalty = L2),0,0.35,0.8033,0.4808728501494443,0.1566770076751709,0.4808728501494443
103,4,Naive Bayes,0,0.35,0.8091,0.5265039313839054,0.030137062072753906,0.5265039313839054
104,4,KNeighbors Classifier,1,0.35,0.7715,0.5765606719283625,1.0044434070587158,0.5765606719283625
105,4,SVC Classifier,1,0.35,0.7788,1.0,19.887715578079224,0.0
106,4,Decision Tree,1,0.35,0.8231,0.5864552876160657,0.0941007137298584,0.5864552876160657
107,4,RandomForest,1,0.35,0.8249,0.5865063598458912,0.3394927978515625,0.5865063598458912
108,4,AdaBoost (Discrete),1,0.35,0.8243,0.5839577141581999,19.853492736816406,0.5839577141581999
109,4,AdaBoost (Real),1,0.35,0.8241,0.5832161802537993,46.08202242851257,0.5832161802537993
110,4,Logistic Regression (Penalty = L2),1,0.35,0.8162,0.5186741436441986,0.1568763256072998,0.5186741436441986
111,4,Naive Bayes,1,0.35,0.8235,0.577636643671305,0.06469488143920898,0.577636643671305
112,4,KNeighbors Classifier,2,0.35,0.7881,0.5614818576181884,1.208982229232788,0.5614818576181884
113,4,SVC Classifier,2,0.35,0.7788,1.0,20.27559757232666,0.0
114,4,Decision Tree,2,0.35,0.821,0.5415237911450433,0.09251713752746582,0.5415237911450433
115,4,RandomForest,2,0.35,0.8241,0.5578316001828668,0.3113241195678711,0.5578316001828668
116,4,AdaBoost (Discrete),2,0.35,0.8234,0.5625030862220924,19.428232192993164,0.5625030862220924
117,4,AdaBoost (Real),2,0.35,0.8229,0.5513148333272477,54.116355419158936,0.5513148333272477
118,4,Logistic Regression (Penalty = L2),2,0.35,0.8106,0.4640961168663208,0.06783080101013184,0.4640961168663208
119,4,Naive Bayes,2,0.35,0.8219,0.5444174858660226,0.09322738647460938,0.5444174858660226
120,5,KNeighbors Classifier,0,0.35,0.7348,0.571687037994404,6.339484691619873,0.571687037994404
121,5,SVC Classifier,0,0.35,0.7795,0.09014398837291854,36.725021839141846,0.09014398837291854
122,5,Decision Tree,0,0.35,0.7891,0.5433304304015758,0.12596487998962402,0.5433304304015758
123,5,RandomForest,0,0.35,0.8015,0.45730681469807516,0.29572033882141113,0.45730681469807516
124,5,AdaBoost (Discrete),0,0.35,0.8088,0.5758875341186446,29.475149869918823,0.5758875341186446
125,5,AdaBoost (Real),0,0.35,0.8062,0.5645505407359442,50.74669575691223,0.5645505407359442
126,5,Logistic Regression (Penalty = L2),0,0.35,0.8065,0.48400016608889235,0.22013187408447266,0.48400016608889235
127,5,Naive Bayes,0,0.35,0.7925,0.5896110375509549,0.09525036811828613,0.5896110375509549
128,5,KNeighbors Classifier,1,0.35,0.7853,0.5994800418671907,5.792206048965454,0.5994800418671907
129,5,SVC Classifier,1,0.35,0.7788,1.0,36.26904511451721,0.0
130,5,Decision Tree,1,0.35,0.7968,0.588616476247928,0.1289675235748291,0.588616476247928
131,5,RandomForest,1,0.35,0.8052,0.4725228550231333,0.3736119270324707,0.4725228550231333
132,5,AdaBoost (Discrete),1,0.35,0.8228,0.6132735323684662,27.58697772026062,0.6132735323684662
133,5,AdaBoost (Real),1,0.35,0.8209,0.6044545242864733,49.133997201919556,0.6044545242864733
134,5,Logistic Regression (Penalty = L2),1,0.35,0.8131,0.4907239931165043,0.2216167449951172,0.4907239931165043
135,5,Naive Bayes,1,0.35,0.8024,0.6332975605634849,0.13633131980895996,0.6332975605634849
136,5,KNeighbors Classifier,2,0.35,0.7757,0.5724592749038283,6.487205982208252,0.5724592749038283
137,5,SVC Classifier,2,0.35,0.7788,1.0,34.03015422821045,0.0
138,5,Decision Tree,2,0.35,0.7996,0.5538587320463978,0.12412619590759277,0.5538587320463978
139,5,RandomForest,2,0.35,0.8077,0.44070682628694996,0.2781820297241211,0.44070682628694996
140,5,AdaBoost (Discrete),2,0.35,0.8224,0.5575555114389655,27.992196321487427,0.5575555114389655
141,5,AdaBoost (Real),2,0.35,0.8187,0.5621315601310294,46.50872445106506,0.5621315601310294
142,5,Logistic Regression (Penalty = L2),2,0.35,0.8082,0.4375142506068217,0.19660115242004395,0.4375142506068217
143,5,Naive Bayes,2,0.35,0.8109,0.6103991870363227,0.10469484329223633,0.6103991870363227
144,6,KNeighbors Classifier,0,0.35,0.7874,0.5935406389028242,7.383690357208252,0.5935406389028242
145,6,SVC Classifier,0,0.35,0.7795,0.09014398837291854,29.426007986068726,0.09014398837291854
146,6,Decision Tree,0,0.35,0.8064,0.5554075515693307,0.09313082695007324,0.5554075515693307
147,6,RandomForest,0,0.35,0.8031,0.45913508545692633,0.34798359870910645,0.45913508545692633
148,6,AdaBoost (Discrete),0,0.35,0.8093,0.5734437466764926,20.45237421989441,0.5734437466764926
149,6,AdaBoost (Real),0,0.35,0.8073,0.5602190497298205,54.57791996002197,0.5602190497298205
150,6,Logistic Regression (Penalty = L2),0,0.35,0.8048,0.46936216865858615,0.2272477149963379,0.46936216865858615
151,6,Naive Bayes,0,0.35,0.7972,0.5780714623506594,0.10416531562805176,0.5780714623506594
152,6,KNeighbors Classifier,1,0.35,0.7728,0.5354208683364595,8.906365394592285,0.5354208683364595
153,6,SVC Classifier,1,0.35,0.7788,1.0,30.270588397979736,0.0
154,6,Decision Tree,1,0.35,0.8212,0.6070660032597179,0.07958579063415527,0.6070660032597179
155,6,RandomForest,1,0.35,0.8122,0.49333270929884543,0.3524341583251953,0.49333270929884543
156,6,AdaBoost (Discrete),1,0.35,0.8265,0.584486606616563,22.018919944763184,0.584486606616563
157,6,AdaBoost (Real),1,0.35,0.8228,0.6148000430118514,60.583560943603516,0.6148000430118514
158,6,Logistic Regression (Penalty = L2),1,0.35,0.8076,0.45734882824095485,0.22428297996520996,0.45734882824095485
159,6,Naive Bayes,1,0.35,0.8035,0.6222065719478789,0.09242653846740723,0.6222065719478789
160,6,KNeighbors Classifier,2,0.35,0.7889,0.5624541690603174,7.433083534240723,0.5624541690603174
161,6,SVC Classifier,2,0.35,0.7788,1.0,33.40109992027283,0.0
162,6,Decision Tree,2,0.35,0.8194,0.5449726629466666,0.09079360961914062,0.5449726629466666
163,6,RandomForest,2,0.35,0.8125,0.4691135785254244,0.39087915420532227,0.4691135785254244
164,6,AdaBoost (Discrete),2,0.35,0.8251,0.5826094208439243,23.130398750305176,0.5826094208439243
165,6,AdaBoost (Real),2,0.35,0.8219,0.5545294569855478,62.62634992599487,0.5545294569855478
166,6,Logistic Regression (Penalty = L2),2,0.35,0.807,0.43138056976610795,0.23397088050842285,0.43138056976610795
167,6,Naive Bayes,2,0.35,0.8114,0.6014641652923668,0.09757208824157715,0.6014641652923668
168,7,KNeighbors Classifier,0,0.35,0.7754,0.5544959059842633,1.2211887836456299,0.5544959059842633
169,7,SVC Classifier,0,0.35,0.7788,1.0,25.8194580078125,0.0
170,7,Decision Tree,0,0.35,0.8068,0.5283040290961378,0.09129619598388672,0.5283040290961378
171,7,RandomForest,0,0.35,0.8098,0.5374868162767433,0.3092954158782959,0.5374868162767433
172,7,AdaBoost (Discrete),0,0.35,0.808,0.5401004716124015,21.41821026802063,0.5401004716124015
173,7,AdaBoost (Real),0,0.35,0.8083,0.5329128055258378,49.86700773239136,0.5329128055258378
174,7,Logistic Regression (Penalty = L2),0,0.35,0.8033,0.4808728501494443,0.12972617149353027,0.4808728501494443
175,7,Naive Bayes,0,0.35,0.8091,0.5265039313839054,0.06295490264892578,0.5265039313839054
176,7,KNeighbors Classifier,1,0.35,0.7715,0.5765606719283625,1.220789909362793,0.5765606719283625
177,7,SVC Classifier,1,0.35,0.7788,1.0,22.487748622894287,0.0
178,7,Decision Tree,1,0.35,0.8234,0.5865736080626679,0.06777834892272949,0.5865736080626679
179,7,RandomForest,1,0.35,0.8249,0.5865063598458912,0.31856822967529297,0.5865063598458912
180,7,AdaBoost (Discrete),1,0.35,0.8243,0.5839577141581999,19.237580060958862,0.5839577141581999
181,7,AdaBoost (Real),1,0.35,0.8241,0.5832161802537993,44.342002391815186,0.5832161802537993
182,7,Logistic Regression (Penalty = L2),1,0.35,0.8162,0.5186741436441986,0.10862231254577637,0.5186741436441986
183,7,Naive Bayes,1,0.35,0.8235,0.577636643671305,0.03655672073364258,0.577636643671305
184,7,KNeighbors Classifier,2,0.35,0.7881,0.5614818576181884,1.0637996196746826,0.5614818576181884
185,7,SVC Classifier,2,0.35,0.7788,1.0,19.58294653892517,0.0
186,7,Decision Tree,2,0.35,0.8212,0.5415956065145182,0.06635594367980957,0.5415956065145182
187,7,RandomForest,2,0.35,0.8241,0.5578316001828668,0.35467958450317383,0.5578316001828668
188,7,AdaBoost (Discrete),2,0.35,0.8234,0.5625030862220924,22.012361764907837,0.5625030862220924
189,7,AdaBoost (Real),2,0.35,0.8229,0.5513148333272477,53.555737018585205,0.5513148333272477
190,7,Logistic Regression (Penalty = L2),2,0.35,0.8106,0.4640961168663208,0.1639096736907959,0.4640961168663208
191,7,Naive Bayes,2,0.35,0.8219,0.5444174858660226,0.058661460876464844,0.5444174858660226
192,8,KNeighbors Classifier,0,0.35,0.3898,0.4465368785977873,5.926372051239014,0.4465368785977873
193,8,SVC Classifier,0,0.35,0.7788,1.0,18.913737773895264,0.0
194,8,Decision Tree,0,0.35,0.8091,0.5331998579600798,0.03641319274902344,0.5331998579600798
195,8,RandomForest,0,0.35,0.8098,0.5374868162767433,0.3162801265716553,0.5374868162767433
196,8,AdaBoost (Discrete),0,0.35,0.8091,0.5331998579600798,16.378990173339844,0.5331998579600798
197,8,AdaBoost (Real),0,0.35,0.8097,0.5359881800938336,346.6255178451538,0.5359881800938336
198,8,Logistic Regression (Penalty = L2),0,0.35,0.8098,0.5374868162767433,0.1522386074066162,0.5374868162767433
199,8,Naive Bayes,0,0.35,0.8098,0.5374868162767433,0.08279824256896973,0.5374868162767433
200,8,KNeighbors Classifier,1,0.35,0.7373,0.4167498066475552,5.384360074996948,0.4167498066475552
201,8,SVC Classifier,1,0.35,0.7788,1.0,18.005624055862427,0.0
202,8,Decision Tree,1,0.35,0.8245,0.584698307625315,0.03163003921508789,0.584698307625315
203,8,RandomForest,1,0.35,0.8249,0.5865063598458912,0.28409862518310547,0.5865063598458912
204,8,AdaBoost (Discrete),1,0.35,0.8245,0.584698307625315,15.934163570404053,0.584698307625315
205,8,AdaBoost (Real),1,0.35,0.8245,0.584698307625315,337.73571825027466,0.584698307625315
206,8,Logistic Regression (Penalty = L2),1,0.35,0.8249,0.5865063598458912,0.17380356788635254,0.5865063598458912
207,8,Naive Bayes,1,0.35,0.8249,0.5865063598458912,0.06777572631835938,0.5865063598458912
208,8,KNeighbors Classifier,2,0.35,0.7875,0.23526314858897693,6.038477182388306,0.23526314858897693
209,8,SVC Classifier,2,0.35,0.7788,1.0,16.08354663848877,0.0
210,8,Decision Tree,2,0.35,0.824,0.5545891737925498,0.03272128105163574,0.5545891737925498
211,8,RandomForest,2,0.35,0.8241,0.5578316001828668,0.235870361328125,0.5578316001828668
212,8,AdaBoost (Discrete),2,0.35,0.8241,0.5578316001828668,15.968744277954102,0.5578316001828668
213,8,AdaBoost (Real),2,0.35,0.8241,0.5553406581675171,355.80933690071106,0.5553406581675171
214,8,Logistic Regression (Penalty = L2),2,0.35,0.8241,0.5578316001828668,0.17712903022766113,0.5578316001828668
215,8,Naive Bayes,2,0.35,0.8241,0.5578316001828668,0.0471193790435791,0.5578316001828668
216,9,KNeighbors Classifier,0,0.35,0.7874,0.5935406389028242,8.373730659484863,0.5935406389028242
217,9,SVC Classifier,0,0.35,0.7795,0.09014398837291854,30.538706302642822,0.09014398837291854
218,9,Decision Tree,0,0.35,0.8061,0.5535617868647619,0.06774497032165527,0.5535617868647619
219,9,RandomForest,0,0.35,0.8031,0.45913508545692633,0.31903076171875,0.45913508545692633
220,9,AdaBoost (Discrete),0,0.35,0.8093,0.5734437466764926,21.320935249328613,0.5734437466764926
221,9,AdaBoost (Real),0,0.35,0.8073,0.5602190497298205,50.53078007698059,0.5602190497298205
222,9,Logistic Regression (Penalty = L2),0,0.35,0.8048,0.46936216865858615,0.16948199272155762,0.46936216865858615
223,9,Naive Bayes,0,0.35,0.7972,0.5780714623506594,0.0940709114074707,0.5780714623506594
224,9,KNeighbors Classifier,1,0.35,0.7728,0.5354208683364595,8.515871524810791,0.5354208683364595
225,9,SVC Classifier,1,0.35,0.7788,1.0,30.13875460624695,0.0
226,9,Decision Tree,1,0.35,0.8207,0.6062391796247798,0.07122611999511719,0.6062391796247798
227,9,RandomForest,1,0.35,0.8122,0.49333270929884543,0.2894289493560791,0.49333270929884543
228,9,AdaBoost (Discrete),1,0.35,0.8265,0.584486606616563,21.90290331840515,0.584486606616563
229,9,AdaBoost (Real),1,0.35,0.8229,0.6148419159928645,56.06598615646362,0.6148419159928645
230,9,Logistic Regression (Penalty = L2),1,0.35,0.8076,0.45734882824095485,0.2178025245666504,0.45734882824095485
231,9,Naive Bayes,1,0.35,0.8035,0.6222065719478789,0.08852982521057129,0.6222065719478789
232,9,KNeighbors Classifier,2,0.35,0.7889,0.5624541690603174,9.148574829101562,0.5624541690603174
233,9,SVC Classifier,2,0.35,0.7788,1.0,32.53310561180115,0.0
234,9,Decision Tree,2,0.35,0.8201,0.5459539089080923,0.06665468215942383,0.5459539089080923
235,9,RandomForest,2,0.35,0.8125,0.4691135785254244,0.33098530769348145,0.4691135785254244
236,9,AdaBoost (Discrete),2,0.35,0.8251,0.5826094208439243,22.80284357070923,0.5826094208439243
237,9,AdaBoost (Real),2,0.35,0.8219,0.5545294569855478,63.41280150413513,0.5545294569855478
238,9,Logistic Regression (Penalty = L2),2,0.35,0.807,0.43138056976610795,0.2609882354736328,0.43138056976610795
239,9,Naive Bayes,2,0.35,0.8114,0.6014641652923668,0.09426021575927734,0.6014641652923668
240,10,KNeighbors Classifier,0,0.35,0.7348,0.571687037994404,5.3376784324646,0.571687037994404
241,10,SVC Classifier,0,0.35,0.7795,0.09014398837291854,33.47866415977478,0.09014398837291854
242,10,Decision Tree,0,0.35,0.7876,0.5462010572052455,0.1299266815185547,0.5462010572052455
243,10,RandomForest,0,0.35,0.8015,0.45730681469807516,0.31723904609680176,0.45730681469807516
244,10,AdaBoost (Discrete),0,0.35,0.8088,0.5758875341186446,29.287199020385742,0.5758875341186446
245,10,AdaBoost (Real),0,0.35,0.8062,0.5645505407359442,47.291829109191895,0.5645505407359442
246,10,Logistic Regression (Penalty = L2),0,0.35,0.8065,0.48400016608889235,0.19483661651611328,0.48400016608889235
247,10,Naive Bayes,0,0.35,0.7925,0.5896110375509549,0.1219785213470459,0.5896110375509549
248,10,KNeighbors Classifier,1,0.35,0.7853,0.5994800418671907,5.4476096630096436,0.5994800418671907
249,10,SVC Classifier,1,0.35,0.7788,1.0,32.32999587059021,0.0
250,10,Decision Tree,1,0.35,0.7981,0.5882194539099705,0.08608388900756836,0.5882194539099705
251,10,RandomForest,1,0.35,0.8052,0.4725228550231333,0.29000258445739746,0.4725228550231333
252,10,AdaBoost (Discrete),1,0.35,0.8228,0.6132735323684662,28.367302656173706,0.6132735323684662
253,10,AdaBoost (Real),1,0.35,0.8209,0.6044545242864733,51.71531891822815,0.6044545242864733
254,10,Logistic Regression (Penalty = L2),1,0.35,0.8131,0.4907239931165043,0.20041775703430176,0.4907239931165043
255,10,Naive Bayes,1,0.35,0.8024,0.6332975605634849,0.14228034019470215,0.6332975605634849
256,10,KNeighbors Classifier,2,0.35,0.7757,0.5724592749038283,5.923146724700928,0.5724592749038283
257,10,SVC Classifier,2,0.35,0.7788,1.0,33.00887489318848,0.0
258,10,Decision Tree,2,0.35,0.8008,0.551214271712395,0.16315531730651855,0.551214271712395
259,10,RandomForest,2,0.35,0.8077,0.44070682628694996,0.30048441886901855,0.44070682628694996
260,10,AdaBoost (Discrete),2,0.35,0.8224,0.5575555114389655,29.2383451461792,0.5575555114389655
261,10,AdaBoost (Real),2,0.35,0.8187,0.5621315601310294,47.59993934631348,0.5621315601310294
262,10,Logistic Regression (Penalty = L2),2,0.35,0.8082,0.4375142506068217,0.28496217727661133,0.4375142506068217
263,10,Naive Bayes,2,0.35,0.8109,0.6103991870363227,0.1115257740020752,0.6103991870363227
264,11,KNeighbors Classifier,0,0.35,0.768,0.5560697274337554,13.916855096817017,0.5560697274337554
265,11,SVC Classifier,0,0.35,0.7795,0.09014398837291854,57.9346604347229,0.09014398837291854
266,11,Decision Tree,0,0.35,0.7205,0.5573879179744993,0.4580540657043457,0.5573879179744993
267,11,RandomForest,0,0.35,0.8021,0.4689559069710053,0.6040666103363037,0.4689559069710053
268,11,AdaBoost (Discrete),0,0.35,0.806,0.5671612218179286,146.6886179447174,0.5671612218179286
269,11,AdaBoost (Real),0,0.35,0.785,0.5661075865707427,156.56348085403442,0.5661075865707427
270,11,Logistic Regression (Penalty = L2),0,0.35,0.8058,0.48544776714875587,0.3622598648071289,0.48544776714875587
271,11,Naive Bayes,0,0.35,0.7646,0.6570992357359464,0.1814100742340088,0.6570992357359464
272,11,KNeighbors Classifier,1,0.35,0.7728,0.5998418383783187,12.76691746711731,0.5998418383783187
273,11,SVC Classifier,1,0.35,0.7788,1.0,57.01207423210144,0.0
274,11,Decision Tree,1,0.35,0.7334,0.5941352090814132,0.4715397357940674,0.5941352090814132
275,11,RandomForest,1,0.35,0.808,0.48824111272007964,0.6472017765045166,0.48824111272007964
276,11,AdaBoost (Discrete),1,0.35,0.8222,0.6090271287746837,144.03091716766357,0.6090271287746837
277,11,AdaBoost (Real),1,0.35,0.7962,0.6002706294430753,157.53921222686768,0.6002706294430753
278,11,Logistic Regression (Penalty = L2),1,0.35,0.8099,0.47355916527624403,0.3601038455963135,0.47355916527624403
279,11,Naive Bayes,1,0.35,0.7669,0.7073628636815409,0.1622610092163086,0.7073628636815409
280,11,KNeighbors Classifier,2,0.35,0.7864,0.5711589971955792,13.739055156707764,0.5711589971955792
281,11,SVC Classifier,2,0.35,0.7788,1.0,66.52553606033325,0.0
282,11,Decision Tree,2,0.35,0.738,0.5647067571731405,0.39400148391723633,0.5647067571731405
283,11,RandomForest,2,0.35,0.8053,0.4149868711304859,0.6620287895202637,0.4149868711304859
284,11,AdaBoost (Discrete),2,0.35,0.8234,0.5775979527141852,145.47960090637207,0.5775979527141852
285,11,AdaBoost (Real),2,0.35,0.7949,0.5517236301339475,156.85089707374573,0.5517236301339475
286,11,Logistic Regression (Penalty = L2),2,0.35,0.8096,0.45247181622222005,0.5836570262908936,0.45247181622222005
287,11,Naive Bayes,2,0.35,0.7909,0.6692820076219247,0.17528557777404785,0.6692820076219247
288,12,KNeighbors Classifier,0,0.35,0.3898,0.4465368785977873,5.649632215499878,0.4465368785977873
289,12,SVC Classifier,0,0.35,0.7788,1.0,19.622218370437622,0.0
290,12,Decision Tree,0,0.35,0.8091,0.5331998579600798,0.04394245147705078,0.5331998579600798
291,12,RandomForest,0,0.35,0.8098,0.5374868162767433,0.29863500595092773,0.5374868162767433
292,12,AdaBoost (Discrete),0,0.35,0.8091,0.5331998579600798,17.829136610031128,0.5331998579600798
293,12,AdaBoost (Real),0,0.35,0.8097,0.5359881800938336,337.33490538597107,0.5359881800938336
294,12,Logistic Regression (Penalty = L2),0,0.35,0.8098,0.5374868162767433,0.15384364128112793,0.5374868162767433
295,12,Naive Bayes,0,0.35,0.8098,0.5374868162767433,0.06265735626220703,0.5374868162767433
296,12,KNeighbors Classifier,1,0.35,0.7373,0.4167498066475552,5.573683023452759,0.4167498066475552
297,12,SVC Classifier,1,0.35,0.7788,1.0,17.42570734024048,0.0
298,12,Decision Tree,1,0.35,0.8245,0.584698307625315,0.07159852981567383,0.584698307625315
299,12,RandomForest,1,0.35,0.8249,0.5865063598458912,0.3408503532409668,0.5865063598458912
300,12,AdaBoost (Discrete),1,0.35,0.8245,0.584698307625315,17.66946816444397,0.584698307625315
301,12,AdaBoost (Real),1,0.35,0.8245,0.584698307625315,324.886456489563,0.584698307625315
302,12,Logistic Regression (Penalty = L2),1,0.35,0.8249,0.5865063598458912,0.15393543243408203,0.5865063598458912
303,12,Naive Bayes,1,0.35,0.8249,0.5865063598458912,0.06195640563964844,0.5865063598458912
304,12,KNeighbors Classifier,2,0.35,0.7875,0.23526314858897693,5.6164162158966064,0.23526314858897693
305,12,SVC Classifier,2,0.35,0.7788,1.0,16.716485500335693,0.0
306,12,Decision Tree,2,0.35,0.824,0.5545891737925498,0.02767324447631836,0.5545891737925498
307,12,RandomForest,2,0.35,0.8241,0.5578316001828668,0.2242426872253418,0.5578316001828668
308,12,AdaBoost (Discrete),2,0.35,0.8241,0.5578316001828668,16.51388454437256,0.5578316001828668
309,12,AdaBoost (Real),2,0.35,0.8241,0.5553406581675171,348.26346135139465,0.5553406581675171
310,12,Logistic Regression (Penalty = L2),2,0.35,0.8241,0.5578316001828668,0.1666569709777832,0.5578316001828668
311,12,Naive Bayes,2,0.35,0.8241,0.5578316001828668,0.04870438575744629,0.5578316001828668
