,feat_set_id,classifier,fold_id,feat_th,score,geo_score,exec_t,geo_score_woz
0,0,KNeighbors Classifier,0,0.35,0.9845070422535211,0.9764095103624777,0.7187933921813965,0.9764095103624777
1,0,SVC Classifier,0,0.35,0.9098591549295775,0.4530153324120529,0.775395393371582,0.4530153324120529
2,0,Decision Tree,0,0.35,0.9774647887323944,0.9655975286241347,0.10461950302124023,0.9655975286241347
3,0,RandomForest,0,0.35,0.8732394366197183,0.8287754140107481,0.9000108242034912,0.0
4,0,AdaBoost (Discrete),0,0.35,0.9845070422535211,0.9705393645157323,47.54812526702881,0.9705393645157323
5,0,AdaBoost (Real),0,0.35,0.9661971830985916,0.9657301250182015,60.677143812179565,0.9657301250182015
6,0,Logistic Regression (Penalty = L2),0,0.35,0.9845070422535211,0.973489723170078,0.505958080291748,0.973489723170078
7,0,Naive Bayes,0,0.35,0.9788732394366197,0.9711153485635676,0.10344052314758301,0.9711153485635676
8,0,KNeighbors Classifier,1,0.35,0.9605077574047954,0.9338867784502106,0.6160399913787842,0.9338867784502106
9,0,SVC Classifier,1,0.35,0.9760225669957687,0.9369604361556937,0.7814311981201172,0.9369604361556937
10,0,Decision Tree,1,0.35,0.9576868829337094,0.942079790169839,0.08706068992614746,0.942079790169839
11,0,RandomForest,1,0.35,0.8236953455571228,0.33634233212671266,0.7024896144866943,0.33634233212671266
12,0,AdaBoost (Discrete),1,0.35,0.9703808180535967,0.9184735248681712,47.047017335891724,0.9184735248681712
13,0,AdaBoost (Real),1,0.35,0.923836389280677,0.926923049086617,59.52965188026428,0.926923049086617
14,0,Logistic Regression (Penalty = L2),1,0.35,0.9717912552891397,0.9479132502113985,0.3860163688659668,0.9479132502113985
15,0,Naive Bayes,1,0.35,0.7997179125528914,0.8601037713919562,0.09700703620910645,0.8601037713919562
16,0,KNeighbors Classifier,2,0.35,0.9660537482319661,0.9625121172657743,0.5458850860595703,0.9625121172657743
17,0,SVC Classifier,2,0.35,0.9547383309759547,0.8765417770945656,0.8149745464324951,0.8765417770945656
18,0,Decision Tree,2,0.35,0.7821782178217822,0.8797278906928535,0.10355496406555176,0.8797278906928535
19,0,RandomForest,2,0.35,0.5855728429985856,0.6462925242237408,0.6423442363739014,0.6462925242237408
20,0,AdaBoost (Discrete),2,0.35,0.8585572842998586,0.903442650460876,51.33845782279968,0.903442650460876
21,0,AdaBoost (Real),2,0.35,0.8231966053748232,0.9079728827660015,62.99028921127319,0.9079728827660015
22,0,Logistic Regression (Penalty = L2),2,0.35,0.9533239038189534,0.9628984329631445,0.47688865661621094,0.9628984329631445
23,0,Naive Bayes,2,0.35,0.9547383309759547,0.9635105745348659,0.10362672805786133,0.9635105745348659
24,1,KNeighbors Classifier,0,0.35,0.9830985915492958,0.9728972155841619,0.5482475757598877,0.9728972155841619
25,1,SVC Classifier,0,0.35,0.9098591549295775,0.4530153324120529,0.7430980205535889,0.4530153324120529
26,1,Decision Tree,0,0.35,0.9619718309859155,0.8975041998406905,0.10341906547546387,0.8975041998406905
27,1,RandomForest,0,0.35,0.7859154929577464,0.31889640207164033,0.810276985168457,0.0
28,1,AdaBoost (Discrete),0,0.35,0.8901408450704226,0.4236090741960986,49.443968057632446,0.4236090741960986
29,1,AdaBoost (Real),0,0.35,0.9323943661971831,0.9510678151057695,63.74240970611572,0.9510678151057695
30,1,Logistic Regression (Penalty = L2),0,0.35,0.9845070422535211,0.9705393645157323,0.33009910583496094,0.9705393645157323
31,1,Naive Bayes,0,0.35,0.9492957746478873,0.9750961659762587,0.11252593994140625,0.9750961659762587
32,1,KNeighbors Classifier,1,0.35,0.9746121297602257,0.9331360652822656,0.6410748958587646,0.9331360652822656
33,1,SVC Classifier,1,0.35,0.9760225669957687,0.9369604361556937,0.8715019226074219,0.9369604361556937
34,1,Decision Tree,1,0.35,0.9788434414668548,0.9489570229708282,0.10739636421203613,0.9489570229708282
35,1,RandomForest,1,0.35,0.7997179125528914,0.5042194840896107,0.6497511863708496,0.0
36,1,AdaBoost (Discrete),1,0.35,0.8998589562764457,0.6621963893509659,51.12084364891052,0.6621963893509659
37,1,AdaBoost (Real),1,0.35,0.8321579689703809,0.9027145533529721,62.39965295791626,0.9027145533529721
38,1,Logistic Regression (Penalty = L2),1,0.35,0.9760225669957687,0.9369604361556937,0.21268606185913086,0.9369604361556937
39,1,Naive Bayes,1,0.35,0.8702397743300423,0.9338451038203882,0.11243510246276855,0.9338451038203882
40,1,KNeighbors Classifier,2,0.35,0.9773691654879774,0.9732008344513453,0.5767872333526611,0.9732008344513453
41,1,SVC Classifier,2,0.35,0.9915134370579916,0.9791605716903751,0.9492611885070801,0.9791605716903751
42,1,Decision Tree,2,0.35,0.9660537482319661,0.950392894348382,0.10328245162963867,0.950392894348382
43,1,RandomForest,2,0.35,0.8486562942008486,0.7071067811865476,0.6555500030517578,0.0
44,1,AdaBoost (Discrete),2,0.35,0.8458274398868458,0.9190976999002275,53.628217458724976,0.9190976999002275
45,1,AdaBoost (Real),2,0.35,0.9618104667609618,0.9423841267991937,57.89342212677002,0.9423841267991937
46,1,Logistic Regression (Penalty = L2),2,0.35,0.9915134370579916,0.9791605716903751,0.315004825592041,0.9791605716903751
47,1,Naive Bayes,2,0.35,0.8458274398868458,0.9190976999002275,0.21306467056274414,0.9190976999002275
48,2,KNeighbors Classifier,0,0.35,0.9845070422535211,0.9705393645157323,0.5422153472900391,0.9705393645157323
49,2,SVC Classifier,0,0.35,0.9014084507042254,0.9561361361937124,0.8645534515380859,0.0
50,2,Decision Tree,0,0.35,0.9816901408450704,0.9693593762828783,0.11217236518859863,0.9693593762828783
51,2,RandomForest,0,0.35,0.8985915492957747,0.945570771714881,0.750948429107666,0.0
52,2,AdaBoost (Discrete),0,0.35,0.9549295774647887,0.9368849558186243,45.93901085853577,0.9368849558186243
53,2,AdaBoost (Real),0,0.35,0.8929577464788733,0.6469290948388514,58.59502124786377,0.6469290948388514
54,2,Logistic Regression (Penalty = L2),0,0.35,0.9845070422535211,0.9705393645157323,0.28441739082336426,0.9705393645157323
55,2,Naive Bayes,0,0.35,0.9605633802816902,0.9773746456826605,0.10425257682800293,0.9773746456826605
56,2,KNeighbors Classifier,1,0.35,0.9760225669957687,0.9369604361556937,0.5400190353393555,0.9369604361556937
57,2,SVC Classifier,1,0.35,0.9153737658674189,0.5969560271087193,0.8927373886108398,0.5969560271087193
58,2,Decision Tree,1,0.35,0.9661495063469676,0.9049649815126958,0.0028395652770996094,0.9049649815126958
59,2,RandomForest,1,0.35,0.8913963328631875,0.9035079029052513,0.7519075870513916,0.0
60,2,AdaBoost (Discrete),1,0.35,0.9534555712270804,0.8623521818620125,50.557520627975464,0.8623521818620125
61,2,AdaBoost (Real),1,0.35,0.9506346967559943,0.8523524753007152,59.56537914276123,0.8523524753007152
62,2,Logistic Regression (Penalty = L2),1,0.35,0.9760225669957687,0.9369604361556937,0.33646488189697266,0.9369604361556937
63,2,Naive Bayes,1,0.35,0.8716502115655853,0.9025094468855485,0.24923038482666016,0.9025094468855485
64,2,KNeighbors Classifier,2,0.35,0.9915134370579916,0.9791605716903751,0.9071135520935059,0.9791605716903751
65,2,SVC Classifier,2,0.35,0.9094766619519095,0.9689042833036098,1.0089962482452393,0.0
66,2,Decision Tree,2,0.35,0.9872701555869873,0.9723212704368941,0.1348586082458496,0.9723212704368941
67,2,RandomForest,2,0.35,0.8882602545968883,0.8864052604279183,0.8337211608886719,0.0
68,2,AdaBoost (Discrete),2,0.35,0.7015558698727016,0.8269569436890288,54.24460196495056,0.8269569436890288
69,2,AdaBoost (Real),2,0.35,0.9024045261669024,0.7839787819606675,70.94120240211487,0.7839787819606675
70,2,Logistic Regression (Penalty = L2),2,0.35,0.9915134370579916,0.9791605716903751,0.6102571487426758,0.9791605716903751
71,2,Naive Bayes,2,0.35,0.8500707213578501,0.9211538537326226,0.1588740348815918,0.9211538537326226
72,3,KNeighbors Classifier,0,0.35,0.9873239436619718,0.9804934871626615,1.5713415145874023,0.9804934871626615
73,3,SVC Classifier,0,0.35,0.9098591549295775,0.4530153324120529,1.389277696609497,0.4530153324120529
74,3,Decision Tree,0,0.35,0.9887323943661972,0.981089531982508,0.1955420970916748,0.981089531982508
75,3,RandomForest,0,0.35,0.7859154929577464,0.31889640207164033,1.476487636566162,0.0
76,3,AdaBoost (Discrete),0,0.35,0.8901408450704226,0.4236090741960986,97.35359287261963,0.4236090741960986
77,3,AdaBoost (Real),0,0.35,0.923943661971831,0.9528850693943325,121.93313550949097,0.9528850693943325
78,3,Logistic Regression (Penalty = L2),0,0.35,0.9859154929577465,0.9740815103815855,0.6125259399414062,0.9740815103815855
79,3,Naive Bayes,0,0.35,0.9492957746478873,0.9750961659762587,0.24821043014526367,0.9750961659762587
80,3,KNeighbors Classifier,1,0.35,0.9703808180535967,0.9379047796485408,1.2439086437225342,0.9379047796485408
81,3,SVC Classifier,1,0.35,0.9760225669957687,0.9369604361556937,1.759850025177002,0.9369604361556937
82,3,Decision Tree,1,0.35,0.9830747531734838,0.9582237683311887,0.21973156929016113,0.9582237683311887
83,3,RandomForest,1,0.35,0.8208744710860366,0.7130740328122925,1.5172793865203857,0.0
84,3,AdaBoost (Discrete),1,0.35,0.9760225669957687,0.9369604361556937,95.03907346725464,0.9369604361556937
85,3,AdaBoost (Real),1,0.35,0.9294781382228491,0.9361317072285414,111.22301197052002,0.9361317072285414
86,3,Logistic Regression (Penalty = L2),1,0.35,0.9788434414668548,0.9445168950318586,0.45104408264160156,0.9445168950318586
87,3,Naive Bayes,1,0.35,0.8716502115655853,0.9345183881948081,0.22528290748596191,0.9345183881948081
88,3,KNeighbors Classifier,2,0.35,0.9872701555869873,0.9773802758147523,1.7890081405639648,0.9773802758147523
89,3,SVC Classifier,2,0.35,0.9915134370579916,0.9791605716903751,1.3707702159881592,0.9791605716903751
90,3,Decision Tree,2,0.35,0.9900990099009901,0.9844120303570822,0.22234106063842773,0.9844120303570822
91,3,RandomForest,2,0.35,0.8288543140028288,0.7768193328323317,1.5703802108764648,0.0
92,3,AdaBoost (Discrete),2,0.35,0.9660537482319661,0.9683799463048004,90.2648413181305,0.9683799463048004
93,3,AdaBoost (Real),2,0.35,0.9816124469589816,0.9720458266428861,114.19593596458435,0.9720458266428861
94,3,Logistic Regression (Penalty = L2),2,0.35,0.9915134370579916,0.9850104572706427,0.5844240188598633,0.9850104572706427
95,3,Naive Bayes,2,0.35,0.8472418670438473,0.9223454219396696,0.232161283493042,0.9223454219396696
96,4,KNeighbors Classifier,0,0.35,0.9845070422535211,0.9705393645157323,1.3602886199951172,0.9705393645157323
97,4,SVC Classifier,0,0.35,0.9098591549295775,0.4530153324120529,1.4434592723846436,0.4530153324120529
98,4,Decision Tree,0,0.35,0.9845070422535211,0.9705393645157323,0.21898579597473145,0.9705393645157323
99,4,RandomForest,0,0.35,0.8901408450704226,0.4236090741960986,1.5145645141601562,0.4236090741960986
100,4,AdaBoost (Discrete),0,0.35,0.8901408450704226,0.4236090741960986,82.50641798973083,0.4236090741960986
101,4,AdaBoost (Real),0,0.35,0.9845070422535211,0.9705393645157323,61.951584339141846,0.9705393645157323
102,4,Logistic Regression (Penalty = L2),0,0.35,0.9845070422535211,0.9705393645157323,0.3242926597595215,0.9705393645157323
103,4,Naive Bayes,0,0.35,0.9845070422535211,0.9705393645157323,0.10857725143432617,0.9705393645157323
104,4,KNeighbors Classifier,1,0.35,0.8208744710860366,0.9096412491918122,0.7422759532928467,0.9096412491918122
105,4,SVC Classifier,1,0.35,0.9760225669957687,0.9369604361556937,0.5586364269256592,0.9369604361556937
106,4,Decision Tree,1,0.35,0.9760225669957687,0.9369604361556937,0.11093926429748535,0.9369604361556937
107,4,RandomForest,1,0.35,0.9337094499294781,0.7927843292491847,0.5455548763275146,0.7927843292491847
108,4,AdaBoost (Discrete),1,0.35,0.9760225669957687,0.9369604361556937,46.47089600563049,0.9369604361556937
109,4,AdaBoost (Real),1,0.35,0.9760225669957687,0.9369604361556937,65.08212423324585,0.9369604361556937
110,4,Logistic Regression (Penalty = L2),1,0.35,0.9760225669957687,0.9369604361556937,0.24109888076782227,0.9369604361556937
111,4,Naive Bayes,1,0.35,0.7997179125528914,0.8601037713919562,0.2447500228881836,0.8601037713919562
112,4,KNeighbors Classifier,2,0.35,0.8161244695898161,0.9069233755262746,0.7032637596130371,0.9069233755262746
113,4,SVC Classifier,2,0.35,0.9391796322489392,0.8248573930653896,0.61212158203125,0.8248573930653896
114,4,Decision Tree,2,0.35,0.9915134370579916,0.9791605716903751,0.11815476417541504,0.9791605716903751
115,4,RandomForest,2,0.35,0.9391796322489392,0.8248573930653896,0.7225875854492188,0.8248573930653896
116,4,AdaBoost (Discrete),2,0.35,0.9391796322489392,0.8248573930653896,50.11114239692688,0.8248573930653896
117,4,AdaBoost (Real),2,0.35,0.9915134370579916,0.9791605716903751,63.16865849494934,0.9791605716903751
118,4,Logistic Regression (Penalty = L2),2,0.35,0.9915134370579916,0.9791605716903751,0.23848700523376465,0.9791605716903751
119,4,Naive Bayes,2,0.35,0.8118811881188119,0.897274522572626,0.11995053291320801,0.897274522572626
120,5,KNeighbors Classifier,0,0.35,0.976056338028169,0.9364568572363935,0.5948796272277832,0.9364568572363935
121,5,SVC Classifier,0,0.35,0.9014084507042254,0.9561361361937124,0.7405164241790771,0.0
122,5,Decision Tree,0,0.35,0.976056338028169,0.9364568572363935,0.11891889572143555,0.9364568572363935
123,5,RandomForest,0,0.35,0.8816901408450705,0.864566219253764,0.9606695175170898,0.0
124,5,AdaBoost (Discrete),0,0.35,0.976056338028169,0.9364568572363935,50.71528959274292,0.9364568572363935
125,5,AdaBoost (Real),0,0.35,0.976056338028169,0.9364568572363935,62.47818946838379,0.9364568572363935
126,5,Logistic Regression (Penalty = L2),0,0.35,0.976056338028169,0.9364568572363935,0.12173676490783691,0.9364568572363935
127,5,Naive Bayes,0,0.35,0.8309859154929577,0.901515639968813,0.12053275108337402,0.901515639968813
128,5,KNeighbors Classifier,1,0.35,0.9167842031029619,0.6099373790634576,0.9630031585693359,0.6099373790634576
129,5,SVC Classifier,1,0.35,0.9153737658674189,0.5969560271087193,0.6011345386505127,0.5969560271087193
130,5,Decision Tree,1,0.35,0.9167842031029619,0.6099373790634576,0.14233756065368652,0.6099373790634576
131,5,RandomForest,1,0.35,0.8730606488011283,0.8268454930564446,0.9988117218017578,0.0
132,5,AdaBoost (Discrete),1,0.35,0.9167842031029619,0.6099373790634576,52.70687294006348,0.6099373790634576
133,5,AdaBoost (Real),1,0.35,0.9167842031029619,0.6099373790634576,58.52118253707886,0.6099373790634576
134,5,Logistic Regression (Penalty = L2),1,0.35,0.9167842031029619,0.6099373790634576,0.24005556106567383,0.6099373790634576
135,5,Naive Bayes,1,0.35,0.7997179125528914,0.8601037713919562,0.12011098861694336,0.8601037713919562
136,5,KNeighbors Classifier,2,0.35,0.8118811881188119,0.897274522572626,0.9544918537139893,0.897274522572626
137,5,SVC Classifier,2,0.35,0.8571428571428571,0.7491491772643939,0.7211086750030518,0.0
138,5,Decision Tree,2,0.35,0.9151343705799151,0.43228644490786433,0.0029070377349853516,0.43228644490786433
139,5,RandomForest,2,0.35,0.8571428571428571,0.7491491772643939,0.8383309841156006,0.0
140,5,AdaBoost (Discrete),2,0.35,0.9165487977369166,0.4325482780699497,50.43126201629639,0.4325482780699497
141,5,AdaBoost (Real),2,0.35,0.9165487977369166,0.4325482780699497,59.05041861534119,0.4325482780699497
142,5,Logistic Regression (Penalty = L2),2,0.35,0.9165487977369166,0.4325482780699497,0.22936320304870605,0.4325482780699497
143,5,Naive Bayes,2,0.35,0.8118811881188119,0.897274522572626,0.11704444885253906,0.897274522572626
144,6,KNeighbors Classifier,0,0.35,0.8352112676056338,0.9113154907768575,0.9154903888702393,0.9113154907768575
145,6,SVC Classifier,0,0.35,0.9098591549295775,0.4530153324120529,0.6444497108459473,0.4530153324120529
146,6,Decision Tree,0,0.35,0.9845070422535211,0.9705393645157323,0.10684871673583984,0.9705393645157323
147,6,RandomForest,0,0.35,0.9014084507042254,0.9561361361937124,0.7841315269470215,0.0
148,6,AdaBoost (Discrete),0,0.35,0.8901408450704226,0.4236090741960986,46.72553110122681,0.4236090741960986
149,6,AdaBoost (Real),0,0.35,0.9845070422535211,0.9705393645157323,57.68751549720764,0.9705393645157323
150,6,Logistic Regression (Penalty = L2),0,0.35,0.9845070422535211,0.9705393645157323,0.206559419631958,0.9705393645157323
151,6,Naive Bayes,0,0.35,0.9845070422535211,0.9705393645157323,0.10881233215332031,0.9705393645157323
152,6,KNeighbors Classifier,1,0.35,0.9760225669957687,0.9369604361556937,0.7312417030334473,0.9369604361556937
153,6,SVC Classifier,1,0.35,0.9760225669957687,0.9369604361556937,0.7273604869842529,0.9369604361556937
154,6,Decision Tree,1,0.35,0.9760225669957687,0.9369604361556937,0.10343408584594727,0.9369604361556937
155,6,RandomForest,1,0.35,0.8942172073342737,0.9147320339189784,0.7919211387634277,0.0
156,6,AdaBoost (Discrete),1,0.35,0.9633286318758815,0.9355650414077324,44.251877307891846,0.9355650414077324
157,6,AdaBoost (Real),1,0.35,0.9746121297602257,0.927942991644796,56.375351428985596,0.927942991644796
158,6,Logistic Regression (Penalty = L2),1,0.35,0.9788434414668548,0.9445168950318586,0.216264009475708,0.9445168950318586
159,6,Naive Bayes,1,0.35,0.7997179125528914,0.8601037713919562,0.12022852897644043,0.8601037713919562
160,6,KNeighbors Classifier,2,0.35,0.9915134370579916,0.9791605716903751,0.6980695724487305,0.9791605716903751
161,6,SVC Classifier,2,0.35,0.9391796322489392,0.8248573930653896,0.6257340908050537,0.8248573930653896
162,6,Decision Tree,2,0.35,0.9929278642149929,0.9826954780586864,0.10294318199157715,0.9826954780586864
163,6,RandomForest,2,0.35,0.8571428571428571,0.7491491772643939,0.8367116451263428,0.0
164,6,AdaBoost (Discrete),2,0.35,0.9391796322489392,0.8248573930653896,43.80612111091614,0.8248573930653896
165,6,AdaBoost (Real),2,0.35,0.9915134370579916,0.9791605716903751,58.29509425163269,0.9791605716903751
166,6,Logistic Regression (Penalty = L2),2,0.35,0.9915134370579916,0.9791605716903751,0.20799469947814941,0.9791605716903751
167,6,Naive Bayes,2,0.35,0.8118811881188119,0.897274522572626,0.1049489974975586,0.897274522572626
168,7,KNeighbors Classifier,0,0.35,0.9845070422535211,0.9705393645157323,0.5068809986114502,0.9705393645157323
169,7,SVC Classifier,0,0.35,0.9014084507042254,0.9561361361937124,0.7496578693389893,0.0
170,7,Decision Tree,0,0.35,0.9830985915492958,0.9699497292767263,0.10245108604431152,0.9699497292767263
171,7,RandomForest,0,0.35,0.8985915492957747,0.945570771714881,0.6169290542602539,0.0
172,7,AdaBoost (Discrete),0,0.35,0.9112676056338028,0.938875132421968,45.78408646583557,0.938875132421968
173,7,AdaBoost (Real),0,0.35,0.847887323943662,0.5668961904507401,57.207831382751465,0.5668961904507401
174,7,Logistic Regression (Penalty = L2),0,0.35,0.9845070422535211,0.9705393645157323,0.3243558406829834,0.9705393645157323
175,7,Naive Bayes,0,0.35,0.9492957746478873,0.9750961659762587,0.003028392791748047,0.9750961659762587
176,7,KNeighbors Classifier,1,0.35,0.9760225669957687,0.9369604361556937,0.6166589260101318,0.9369604361556937
177,7,SVC Classifier,1,0.35,0.9153737658674189,0.5969560271087193,0.7549545764923096,0.5969560271087193
178,7,Decision Tree,1,0.35,0.9576868829337094,0.866766343390965,0.10631489753723145,0.866766343390965
179,7,RandomForest,1,0.35,0.8730606488011283,0.8268454930564446,0.7413294315338135,0.0
180,7,AdaBoost (Discrete),1,0.35,0.9548660084626234,0.8627059466787352,46.847625732421875,0.8627059466787352
181,7,AdaBoost (Real),1,0.35,0.9562764456981664,0.8601811287047711,57.12301206588745,0.8601811287047711
182,7,Logistic Regression (Penalty = L2),1,0.35,0.9760225669957687,0.9369604361556937,0.3029921054840088,0.9369604361556937
183,7,Naive Bayes,1,0.35,0.8617771509167842,0.9004645697475525,0.10826301574707031,0.9004645697475525
184,7,KNeighbors Classifier,2,0.35,0.9915134370579916,0.9791605716903751,0.532193660736084,0.9791605716903751
185,7,SVC Classifier,2,0.35,0.9094766619519095,0.9689042833036098,0.7485170364379883,0.0
186,7,Decision Tree,2,0.35,0.9915134370579916,0.9791605716903751,0.10701918601989746,0.9791605716903751
187,7,RandomForest,2,0.35,0.85997171145686,0.762648446573665,0.8635463714599609,0.0
188,7,AdaBoost (Discrete),2,0.35,0.9915134370579916,0.9791605716903751,44.491554737091064,0.9791605716903751
189,7,AdaBoost (Real),2,0.35,0.9222065063649222,0.7598842795900652,58.40824890136719,0.7598842795900652
190,7,Logistic Regression (Penalty = L2),2,0.35,0.9915134370579916,0.9791605716903751,0.38095879554748535,0.9791605716903751
191,7,Naive Bayes,2,0.35,0.8458274398868458,0.9190976999002275,0.10367298126220703,0.9190976999002275
192,8,KNeighbors Classifier,0,0.35,0.9830985915492958,0.9758141385621988,0.4336681365966797,0.9758141385621988
193,8,SVC Classifier,0,0.35,0.9098591549295775,0.4530153324120529,0.8795526027679443,0.4530153324120529
194,8,Decision Tree,0,0.35,0.9859154929577465,0.9740815103815855,0.07451939582824707,0.9740815103815855
195,8,RandomForest,0,0.35,0.7859154929577464,0.31889640207164033,0.72328782081604,0.0
196,8,AdaBoost (Discrete),0,0.35,0.8901408450704226,0.4236090741960986,48.236995697021484,0.4236090741960986
197,8,AdaBoost (Real),0,0.35,0.9154929577464789,0.943564008868173,57.77392339706421,0.943564008868173
198,8,Logistic Regression (Penalty = L2),0,0.35,0.9845070422535211,0.9705393645157323,0.42168617248535156,0.9705393645157323
199,8,Naive Bayes,0,0.35,0.9492957746478873,0.9750961659762587,0.10423517227172852,0.9750961659762587
200,8,KNeighbors Classifier,1,0.35,0.9732016925246827,0.9358274720081465,0.5210185050964355,0.9358274720081465
201,8,SVC Classifier,1,0.35,0.9760225669957687,0.9369604361556937,0.8376791477203369,0.9369604361556937
202,8,Decision Tree,1,0.35,0.9844851904090268,0.9623154932950356,0.09802770614624023,0.9623154932950356
203,8,RandomForest,1,0.35,0.8603667136812412,0.9914892069294688,0.8142919540405273,0.0
204,8,AdaBoost (Discrete),1,0.35,0.8998589562764457,0.6621963893509659,46.79162287712097,0.6621963893509659
205,8,AdaBoost (Real),1,0.35,0.8095909732016925,0.8990948496553218,58.193655014038086,0.8990948496553218
206,8,Logistic Regression (Penalty = L2),1,0.35,0.9760225669957687,0.9369604361556937,0.3137972354888916,0.9369604361556937
207,8,Naive Bayes,1,0.35,0.8688293370944993,0.9306249227191036,0.09635090827941895,0.9306249227191036
208,8,KNeighbors Classifier,2,0.35,0.9801980198019802,0.9743986213026035,0.41181325912475586,0.9743986213026035
209,8,SVC Classifier,2,0.35,0.9915134370579916,0.9791605716903751,0.7296478748321533,0.9791605716903751
210,8,Decision Tree,2,0.35,0.983026874115983,0.9755934705944337,0.10704445838928223,0.9755934705944337
211,8,RandomForest,2,0.35,0.8571428571428571,0.9737945687202026,0.7257125377655029,0.0
212,8,AdaBoost (Discrete),2,0.35,0.8415841584158416,0.9065479622142673,46.733367681503296,0.9065479622142673
213,8,AdaBoost (Real),2,0.35,0.9717114568599717,0.9678662167939021,58.445098876953125,0.9678662167939021
214,8,Logistic Regression (Penalty = L2),2,0.35,0.9915134370579916,0.9791605716903751,0.30146098136901855,0.9791605716903751
215,8,Naive Bayes,2,0.35,0.8472418670438473,0.9223454219396696,0.10910320281982422,0.9223454219396696
216,9,KNeighbors Classifier,0,0.35,0.9492957746478873,0.9750961659762587,0.6573333740234375,0.9750961659762587
217,9,SVC Classifier,0,0.35,0.9014084507042254,0.9561361361937124,0.7728471755981445,0.0
218,9,Decision Tree,0,0.35,0.9845070422535211,0.9705393645157323,0.0029082298278808594,0.9705393645157323
219,9,RandomForest,0,0.35,0.9014084507042254,0.9561361361937124,0.6718878746032715,0.0
220,9,AdaBoost (Discrete),0,0.35,0.9845070422535211,0.9705393645157323,43.26568293571472,0.9705393645157323
221,9,AdaBoost (Real),0,0.35,0.9845070422535211,0.9705393645157323,55.70995306968689,0.9705393645157323
222,9,Logistic Regression (Penalty = L2),0,0.35,0.9845070422535211,0.9705393645157323,0.2683064937591553,0.9705393645157323
223,9,Naive Bayes,0,0.35,0.9492957746478873,0.9750961659762587,0.11208367347717285,0.9750961659762587
224,9,KNeighbors Classifier,1,0.35,0.8702397743300423,0.9338451038203882,0.7395853996276855,0.9338451038203882
225,9,SVC Classifier,1,0.35,0.9153737658674189,0.5969560271087193,0.6524405479431152,0.5969560271087193
226,9,Decision Tree,1,0.35,0.9760225669957687,0.9369604361556937,0.0018780231475830078,0.9369604361556937
227,9,RandomForest,1,0.35,0.8942172073342737,0.9147320339189784,0.8683106899261475,0.0
228,9,AdaBoost (Discrete),1,0.35,0.9760225669957687,0.9369604361556937,44.89163374900818,0.9369604361556937
229,9,AdaBoost (Real),1,0.35,0.9760225669957687,0.9369604361556937,54.09754824638367,0.9369604361556937
230,9,Logistic Regression (Penalty = L2),1,0.35,0.9760225669957687,0.9369604361556937,0.29929423332214355,0.9369604361556937
231,9,Naive Bayes,1,0.35,0.8702397743300423,0.9338451038203882,0.11613035202026367,0.9338451038203882
232,9,KNeighbors Classifier,2,0.35,0.8472418670438473,0.9223454219396696,0.6586599349975586,0.9223454219396696
233,9,SVC Classifier,2,0.35,0.9094766619519095,0.9689042833036098,0.7300772666931152,0.0
234,9,Decision Tree,2,0.35,0.9915134370579916,0.9791605716903751,0.1035151481628418,0.9791605716903751
235,9,RandomForest,2,0.35,0.9094766619519095,0.9689042833036098,0.7257027626037598,0.0
236,9,AdaBoost (Discrete),2,0.35,0.9915134370579916,0.9791605716903751,43.106365442276,0.9791605716903751
237,9,AdaBoost (Real),2,0.35,0.8613861386138614,1.0,59.49725914001465,0.0
238,9,Logistic Regression (Penalty = L2),2,0.35,0.9915134370579916,0.9791605716903751,0.34636425971984863,0.9791605716903751
239,9,Naive Bayes,2,0.35,0.8472418670438473,0.9223454219396696,0.1808319091796875,0.9223454219396696
240,10,KNeighbors Classifier,0,0.35,0.9845070422535211,0.9764095103624777,1.103682518005371,0.9764095103624777
241,10,SVC Classifier,0,0.35,0.9098591549295775,0.4530153324120529,0.8106887340545654,0.4530153324120529
242,10,Decision Tree,0,0.35,0.9422535211267605,0.7705733699663344,0.002372264862060547,0.7705733699663344
243,10,RandomForest,0,0.35,0.7845070422535211,0.291111254869791,0.6768202781677246,0.0
244,10,AdaBoost (Discrete),0,0.35,0.8901408450704226,0.4236090741960986,47.34488081932068,0.4236090741960986
245,10,AdaBoost (Real),0,0.35,0.9183098591549296,0.9476025633424181,56.598835706710815,0.9476025633424181
246,10,Logistic Regression (Penalty = L2),0,0.35,0.9859154929577465,0.9740815103815855,0.31984472274780273,0.9740815103815855
247,10,Naive Bayes,0,0.35,0.9492957746478873,0.9750961659762587,0.09686493873596191,0.9750961659762587
248,10,KNeighbors Classifier,1,0.35,0.9717912552891397,0.9320077255296441,0.8201394081115723,0.9320077255296441
249,10,SVC Classifier,1,0.35,0.9760225669957687,0.9369604361556937,0.9137835502624512,0.9369604361556937
250,10,Decision Tree,1,0.35,0.9703808180535967,0.902814765238624,0.09857583045959473,0.902814765238624
251,10,RandomForest,1,0.35,0.8815232722143864,0.502124020906261,0.6996364593505859,0.502124020906261
252,10,AdaBoost (Discrete),1,0.35,0.9760225669957687,0.9369604361556937,46.76247501373291,0.9369604361556937
253,10,AdaBoost (Real),1,0.35,0.9703808180535967,0.9534492813263334,54.989206314086914,0.9534492813263334
254,10,Logistic Regression (Penalty = L2),1,0.35,0.9788434414668548,0.9445168950318586,0.3536338806152344,0.9445168950318586
255,10,Naive Bayes,1,0.35,0.8702397743300423,0.9338451038203882,0.08487153053283691,0.9338451038203882
256,10,KNeighbors Classifier,2,0.35,0.9872701555869873,0.9773802758147523,1.1163160800933838,0.9773802758147523
257,10,SVC Classifier,2,0.35,0.9915134370579916,0.9791605716903751,0.8225054740905762,0.9791605716903751
258,10,Decision Tree,2,0.35,0.9745403111739745,0.9749054911502069,0.09911441802978516,0.9749054911502069
259,10,RandomForest,2,0.35,0.7864214992927864,0.29361010975735174,0.7561984062194824,0.0
260,10,AdaBoost (Discrete),2,0.35,0.8458274398868458,0.9190976999002275,41.997413635253906,0.9190976999002275
261,10,AdaBoost (Real),2,0.35,0.9731258840169731,0.9470322124854477,50.61210060119629,0.9470322124854477
262,10,Logistic Regression (Penalty = L2),2,0.35,0.9886845827439887,0.9779744281044379,0.44792604446411133,0.9779744281044379
263,10,Naive Bayes,2,0.35,0.8458274398868458,0.9190976999002275,0.17272639274597168,0.9190976999002275
264,11,KNeighbors Classifier,0,0.35,0.9845070422535211,0.9792992186394924,1.068937063217163,0.9792992186394924
265,11,SVC Classifier,0,0.35,0.9098591549295775,0.4530153324120529,0.8422255516052246,0.4530153324120529
266,11,Decision Tree,0,0.35,0.952112676056338,0.858196915285834,0.16421914100646973,0.858196915285834
267,11,RandomForest,0,0.35,0.823943661971831,0.28832365613754857,0.5907814502716064,0.28832365613754857
268,11,AdaBoost (Discrete),0,0.35,0.9845070422535211,0.9705393645157323,42.912182569503784,0.9705393645157323
269,11,AdaBoost (Real),0,0.35,0.967605633802817,0.9692165455989482,47.405426025390625,0.9692165455989482
270,11,Logistic Regression (Penalty = L2),0,0.35,0.9859154929577465,0.9740815103815855,0.2615671157836914,0.9740815103815855
271,11,Naive Bayes,0,0.35,0.9605633802816902,0.9746212105531656,0.08498716354370117,0.9746212105531656
272,11,KNeighbors Classifier,1,0.35,0.9619181946403385,0.9376223653311077,0.7070250511169434,0.9376223653311077
273,11,SVC Classifier,1,0.35,0.9760225669957687,0.9369604361556937,0.7195496559143066,0.9369604361556937
274,11,Decision Tree,1,0.35,0.9464033850493653,0.9003522389132301,0.07194185256958008,0.9003522389132301
275,11,RandomForest,1,0.35,0.8913963328631875,0.5426643535239394,0.5615613460540771,0.5426643535239394
276,11,AdaBoost (Discrete),1,0.35,0.9703808180535967,0.9184735248681712,37.940309286117554,0.9184735248681712
277,11,AdaBoost (Real),1,0.35,0.8730606488011283,0.8933176088098207,38.404547691345215,0.8933176088098207
278,11,Logistic Regression (Penalty = L2),1,0.35,0.9689703808180536,0.952862543158879,0.22280621528625488,0.952862543158879
279,11,Naive Bayes,1,0.35,0.9055007052186178,0.9451072564148725,0.08098268508911133,0.9451072564148725
280,11,KNeighbors Classifier,2,0.35,0.9660537482319661,0.9625121172657743,0.6253020763397217,0.9625121172657743
281,11,SVC Classifier,2,0.35,0.9915134370579916,0.9791605716903751,0.5361125469207764,0.9791605716903751
282,11,Decision Tree,2,0.35,0.7949080622347949,0.8445523257846713,0.05936121940612793,0.8445523257846713
283,11,RandomForest,2,0.35,0.8925035360678925,0.6414247741349381,0.4678654670715332,0.6414247741349381
284,11,AdaBoost (Discrete),2,0.35,0.768033946251768,0.8490118293125583,34.29007291793823,0.8490118293125583
285,11,AdaBoost (Real),2,0.35,0.7708628005657708,0.8688906717146181,38.34495568275452,0.8688906717146181
286,11,Logistic Regression (Penalty = L2),2,0.35,0.8783592644978784,0.9292737868297294,0.226165771484375,0.9292737868297294
287,11,Naive Bayes,2,0.35,0.8514851485148515,0.9218372025394211,0.1128392219543457,0.9218372025394211
288,12,KNeighbors Classifier,0,0.35,0.976056338028169,0.9364568572363935,0.23557209968566895,0.9364568572363935
289,12,SVC Classifier,0,0.35,0.9014084507042254,0.9561361361937124,0.36083555221557617,0.0
290,12,Decision Tree,0,0.35,0.976056338028169,0.9364568572363935,0.06181192398071289,0.9364568572363935
291,12,RandomForest,0,0.35,0.9014084507042254,0.9561361361937124,0.3561861515045166,0.0
292,12,AdaBoost (Discrete),0,0.35,0.976056338028169,0.9364568572363935,25.681546926498413,0.9364568572363935
293,12,AdaBoost (Real),0,0.35,0.976056338028169,0.9364568572363935,29.732605934143066,0.9364568572363935
294,12,Logistic Regression (Penalty = L2),0,0.35,0.976056338028169,0.9364568572363935,0.09537029266357422,0.9364568572363935
295,12,Naive Bayes,0,0.35,0.8309859154929577,0.901515639968813,0.05238938331604004,0.901515639968813
296,12,KNeighbors Classifier,1,0.35,0.7997179125528914,0.8601037713919562,0.3610241413116455,0.8601037713919562
297,12,SVC Classifier,1,0.35,0.9153737658674189,0.5969560271087193,0.34035515785217285,0.5969560271087193
298,12,Decision Tree,1,0.35,0.9153737658674189,0.5969560271087193,0.054758548736572266,0.5969560271087193
299,12,RandomForest,1,0.35,0.9153737658674189,0.5969560271087193,0.3774449825286865,0.5969560271087193
300,12,AdaBoost (Discrete),1,0.35,0.9153737658674189,0.5969560271087193,22.66203999519348,0.5969560271087193
301,12,AdaBoost (Real),1,0.35,0.9153737658674189,0.5969560271087193,28.59382462501526,0.5969560271087193
302,12,Logistic Regression (Penalty = L2),1,0.35,0.9153737658674189,0.5969560271087193,0.11438608169555664,0.5969560271087193
303,12,Naive Bayes,1,0.35,0.7997179125528914,0.8601037713919562,0.055837392807006836,0.8601037713919562
304,12,KNeighbors Classifier,2,0.35,0.8118811881188119,0.897274522572626,0.2786383628845215,0.897274522572626
305,12,SVC Classifier,2,0.35,0.8571428571428571,0.7491491772643939,0.33774280548095703,0.0
306,12,Decision Tree,2,0.35,0.9094766619519095,0.9689042833036098,0.0016779899597167969,0.0
307,12,RandomForest,2,0.35,0.9094766619519095,0.9689042833036098,0.42479848861694336,0.0
308,12,AdaBoost (Discrete),2,0.35,0.9094766619519095,0.9689042833036098,23.611612796783447,0.0
309,12,AdaBoost (Real),2,0.35,0.9094766619519095,0.9689042833036098,26.253251791000366,0.0
310,12,Logistic Regression (Penalty = L2),2,0.35,0.9094766619519095,0.9689042833036098,0.10364222526550293,0.0
311,12,Naive Bayes,2,0.35,0.8118811881188119,0.897274522572626,0.05125308036804199,0.897274522572626
