,feat_set_id,classifier,fold_id,feat_th,score,geo_score,exec_t,geo_score_woz
0,0,KNeighbors Classifier,0,0.85,0.5214257108530236,0.5236309614231948,7.934458255767822,0.5236309614231948
1,0,SVC Classifier,0,0.85,0.55126151381658,1.0,66.44563460350037,0.0
2,0,Decision Tree,0,0.85,0.486784140969163,0.48800448761723336,0.40076780319213867,0.48800448761723336
3,0,RandomForest,0,0.85,0.4969963956748098,0.4941670617539058,0.8347761631011963,0.4941670617539058
4,0,AdaBoost (Discrete),0,0.85,0.4645574689627553,0.4380776367537127,122.3746931552887,0.4380776367537127
5,0,AdaBoost (Real),0,0.85,0.4819783740488586,0.4662465319751723,141.22457313537598,0.4662465319751723
6,0,Logistic Regression (Penalty = L2),0,0.85,0.5186223468161795,0.5052013904948605,0.5703542232513428,0.5052013904948605
7,0,Naive Bayes,0,0.85,0.47196635963155786,0.24414817802906397,0.20717597007751465,0.24414817802906397
8,0,KNeighbors Classifier,1,0.85,0.42439415181253753,0.42651076335156507,10.914884567260742,0.42651076335156507
9,0,SVC Classifier,1,0.85,0.5509713599038654,0.9996366279069767,68.30908179283142,0.0
10,0,Decision Tree,1,0.85,0.46044462247146006,0.46272266316391986,0.39104294776916504,0.46272266316391986
11,0,RandomForest,1,0.85,0.5025035049068696,0.48299439597427285,0.7713110446929932,0.48299439597427285
12,0,AdaBoost (Discrete),1,0.85,0.4854796715401562,0.4880183911760762,125.90349674224854,0.4880183911760762
13,0,AdaBoost (Real),1,0.85,0.4780692970158221,0.48057051186448835,158.08953285217285,0.48057051186448835
14,0,Logistic Regression (Penalty = L2),1,0.85,0.5021029441217705,0.4900346779102695,0.46124815940856934,0.4900346779102695
15,0,Naive Bayes,1,0.85,0.5173242539555377,0.41403742224325424,0.12027645111083984,0.41403742224325424
16,0,KNeighbors Classifier,2,0.85,0.43100340476667337,0.39111493861618474,7.264188051223755,0.39111493861618474
17,0,SVC Classifier,2,0.85,0.5513719206889646,0.021124141684149264,70.88805103302002,0.021124141684149264
18,0,Decision Tree,2,0.85,0.4998998598037252,0.46965944512613544,0.40915918350219727,0.46965944512613544
19,0,RandomForest,2,0.85,0.5535750050070098,0.4458607132610479,0.839449405670166,0.4458607132610479
20,0,AdaBoost (Discrete),2,0.85,0.49829761666332867,0.45242845294945894,112.48214221000671,0.45242845294945894
21,0,AdaBoost (Real),2,0.85,0.4974964950931304,0.44308690082323937,128.27969431877136,0.44308690082323937
22,0,Logistic Regression (Penalty = L2),2,0.85,0.5443621069497296,0.3075934957897839,0.3146476745605469,0.3075934957897839
23,0,Naive Bayes,2,0.85,0.40817144001602246,0.12317977768287787,0.13124704360961914,0.12317977768287787
24,1,KNeighbors Classifier,0,0.85,0.5246295554665599,0.5217727036760167,6.956884384155273,0.5217727036760167
25,1,SVC Classifier,0,0.85,0.55126151381658,1.0,70.30218744277954,0.0
26,1,Decision Tree,0,0.85,0.5220264317180616,0.5185464201279011,0.3624227046966553,0.5185464201279011
27,1,RandomForest,0,0.85,0.5168201842210652,0.5184429450840827,0.6812608242034912,0.5184429450840827
28,1,AdaBoost (Discrete),0,0.85,0.4667601121345615,0.4513720069885362,94.87114548683167,0.4513720069885362
29,1,AdaBoost (Real),0,0.85,0.48338005606728074,0.47426451400518305,105.1425244808197,0.47426451400518305
30,1,Logistic Regression (Penalty = L2),0,0.85,0.5112134561473769,0.42722545163851244,0.2464768886566162,0.42722545163851244
31,1,Naive Bayes,0,0.85,0.46635963155786947,0.2056417736494864,0.10872602462768555,0.2056417736494864
32,1,KNeighbors Classifier,1,0.85,0.4077708792309233,0.407390079389101,6.692641973495483,0.407390079389101
33,1,SVC Classifier,1,0.85,0.551171640296415,1.0,58.4644501209259,0.0
34,1,Decision Tree,1,0.85,0.46404966953735227,0.4645238208818375,0.25635552406311035,0.4645238208818375
35,1,RandomForest,1,0.85,0.4536350891247747,0.4430276130861943,0.683687686920166,0.4430276130861943
36,1,AdaBoost (Discrete),1,0.85,0.46044462247146006,0.4628330323159161,97.96221542358398,0.4628330323159161
37,1,AdaBoost (Real),1,0.85,0.45703985579811734,0.4594126710083582,137.50692343711853,0.4594126710083582
38,1,Logistic Regression (Penalty = L2),1,0.85,0.5399559383136391,0.43865135229781305,0.31658434867858887,0.43865135229781305
39,1,Naive Bayes,1,0.85,0.4968956539154817,0.4970368962612653,0.14172744750976562,0.4970368962612653
40,1,KNeighbors Classifier,2,0.85,0.4822751852593631,0.4041605224075346,7.171654224395752,0.4041605224075346
41,1,SVC Classifier,2,0.85,0.5513719206889646,0.021124141684149264,62.66160273551941,0.021124141684149264
42,1,Decision Tree,2,0.85,0.5199278990586822,0.4935810575369222,0.37833213806152344,0.4935810575369222
43,1,RandomForest,2,0.85,0.5856198678149409,0.3764674803595276,0.6766366958618164,0.3764674803595276
44,1,AdaBoost (Discrete),2,0.85,0.4810735029040657,0.44242550293090016,117.24141335487366,0.44242550293090016
45,1,AdaBoost (Real),2,0.85,0.4984978970558782,0.4500287387899235,138.2594916820526,0.4500287387899235
46,1,Logistic Regression (Penalty = L2),2,0.85,0.4464249949929902,0.16696216138537154,0.5671548843383789,0.16696216138537154
47,1,Naive Bayes,2,0.85,0.3977568596034448,0.12769819648187028,0.2072458267211914,0.12769819648187028
48,2,KNeighbors Classifier,0,0.85,0.5146175410492592,0.5154098613184495,8.891551733016968,0.5154098613184495
49,2,SVC Classifier,0,0.85,0.55126151381658,1.0,73.69375729560852,0.0
50,2,Decision Tree,0,0.85,0.4911894273127753,0.49366726006465994,0.47374391555786133,0.49366726006465994
51,2,RandomForest,0,0.85,0.5190228273928714,0.5158933117021456,0.8049640655517578,0.5158933117021456
52,2,AdaBoost (Discrete),0,0.85,0.46615939126952344,0.444052341733547,135.17643451690674,0.444052341733547
53,2,AdaBoost (Real),0,0.85,0.48618342010412496,0.46601772524879,152.62677597999573,0.46601772524879
54,2,Logistic Regression (Penalty = L2),0,0.85,0.539247096515819,0.5194115512354388,0.49123072624206543,0.5194115512354388
55,2,Naive Bayes,0,0.85,0.40869042851421705,0.3531574934255595,0.1994478702545166,0.3531574934255595
56,2,KNeighbors Classifier,1,0.85,0.4233927498497897,0.42562594648676993,11.265905380249023,0.42562594648676993
57,2,SVC Classifier,1,0.85,0.5509713599038654,0.9996366279069767,72.68031024932861,0.0
58,2,Decision Tree,1,0.85,0.4410174243941518,0.44329855188574957,0.3940601348876953,0.44329855188574957
59,2,RandomForest,1,0.85,0.47146004406168635,0.36985512133536247,0.8405916690826416,0.36985512133536247
60,2,AdaBoost (Discrete),1,0.85,0.47546565191267776,0.47580464094986374,123.19869542121887,0.47580464094986374
61,2,AdaBoost (Real),1,0.85,0.46645303424794715,0.466986899625706,139.9731900691986,0.466986899625706
62,2,Logistic Regression (Penalty = L2),1,0.85,0.4588423793310635,0.43124386984861196,0.515702486038208,0.43124386984861196
63,2,Naive Bayes,1,0.85,0.5015021029441218,0.5041028430587734,0.13016891479492188,0.5041028430587734
64,2,KNeighbors Classifier,2,0.85,0.4233927498497897,0.37101333436249095,8.650483131408691,0.37101333436249095
65,2,SVC Classifier,2,0.85,0.5513719206889646,0.021124141684149264,62.58323335647583,0.021124141684149264
66,2,Decision Tree,2,0.85,0.4932906068495894,0.4693517315538322,0.3534846305847168,0.4693517315538322
67,2,RandomForest,2,0.85,0.5227318245543762,0.4377397733121814,0.6855723857879639,0.4377397733121814
68,2,AdaBoost (Discrete),2,0.85,0.45063088323653117,0.41943988539605853,147.7911856174469,0.41943988539605853
69,2,AdaBoost (Real),2,0.85,0.4592429401161626,0.4186059753636234,181.671728849411,0.4186059753636234
70,2,Logistic Regression (Penalty = L2),2,0.85,0.5293410775085119,0.2439134869373321,0.6342730522155762,0.2439134869373321
71,2,Naive Bayes,2,0.85,0.39274984978970556,0.1580611630282655,0.1603848934173584,0.1580611630282655
72,3,KNeighbors Classifier,0,0.85,0.5580696836203444,0.5577443484847793,7.828468561172485,0.5577443484847793
73,3,SVC Classifier,0,0.85,0.55126151381658,1.0,76.43956923484802,0.0
74,3,Decision Tree,0,0.85,0.5040048057669203,0.5063856636136725,0.4318108558654785,0.5063856636136725
75,3,RandomForest,0,0.85,0.49839807769323186,0.49053353158312485,0.8696420192718506,0.49053353158312485
76,3,AdaBoost (Discrete),0,0.85,0.4985983179815779,0.4859658393851135,134.8142545223236,0.4859658393851135
77,3,AdaBoost (Real),0,0.85,0.5218261914297156,0.5193336860302868,148.92933559417725,0.5193336860302868
78,3,Logistic Regression (Penalty = L2),0,0.85,0.5504605526631958,0.5281211900202165,0.501624345779419,0.5281211900202165
79,3,Naive Bayes,0,0.85,0.46796155386463756,0.2217829336900429,0.16606879234313965,0.2217829336900429
80,3,KNeighbors Classifier,1,0.85,0.4750650911275786,0.4775345605390683,11.483238935470581,0.4775345605390683
81,3,SVC Classifier,1,0.85,0.5509713599038654,0.9996366279069767,83.36896586418152,0.0
82,3,Decision Tree,1,0.85,0.4594432205087122,0.4609827100832227,0.45135974884033203,0.4609827100832227
83,3,RandomForest,1,0.85,0.5067093931504105,0.43431163859714783,0.8545269966125488,0.43431163859714783
84,3,AdaBoost (Discrete),1,0.85,0.4772681754456239,0.47814519199910477,115.55388975143433,0.47814519199910477
85,3,AdaBoost (Real),1,0.85,0.48267574604446223,0.48407116882248363,127.75028991699219,0.48407116882248363
86,3,Logistic Regression (Penalty = L2),1,0.85,0.5349489284998998,0.4877448673998486,0.3831143379211426,0.4877448673998486
87,3,Naive Bayes,1,0.85,0.5517724814740637,0.09417779545515251,0.17316198348999023,0.09417779545515251
88,3,KNeighbors Classifier,2,0.85,0.4141798517925095,0.3846211969284279,6.388334035873413,0.3846211969284279
89,3,SVC Classifier,2,0.85,0.5513719206889646,0.021124141684149264,64.07805156707764,0.021124141684149264
90,3,Decision Tree,2,0.85,0.5277388343681153,0.5059295904320752,0.29137468338012695,0.5059295904320752
91,3,RandomForest,2,0.85,0.5617865011015422,0.43893441256298094,0.592526912689209,0.43893441256298094
92,3,AdaBoost (Discrete),2,0.85,0.4968956539154817,0.4762117054312448,110.10286808013916,0.4762117054312448
93,3,AdaBoost (Real),2,0.85,0.4864810735029041,0.47047868608246785,124.58500480651855,0.47047868608246785
94,3,Logistic Regression (Penalty = L2),2,0.85,0.5485679951932706,0.25328812707115655,0.3684554100036621,0.25328812707115655
95,3,Naive Bayes,2,0.85,0.40656919687562587,0.14915297239988537,0.15458416938781738,0.14915297239988537
96,4,KNeighbors Classifier,0,0.85,0.5274329195034041,0.5286028271969386,3.803257465362549,0.5286028271969386
97,4,SVC Classifier,0,0.85,0.55126151381658,1.0,48.405425786972046,0.0
98,4,Decision Tree,0,0.85,0.500600720865038,0.5030771400652373,0.2873117923736572,0.5030771400652373
99,4,RandomForest,0,0.85,0.513816579895875,0.5163235722603751,0.5367317199707031,0.5163235722603751
100,4,AdaBoost (Discrete),0,0.85,0.48658390068081697,0.45900604894504216,68.52867412567139,0.45900604894504216
101,4,AdaBoost (Real),0,0.85,0.4911894273127753,0.47072287812064434,84.95686864852905,0.47072287812064434
102,4,Logistic Regression (Penalty = L2),0,0.85,0.5662795354425311,0.3698181855216561,0.26342177391052246,0.3698181855216561
103,4,Naive Bayes,0,0.85,0.4683620344413296,0.21652654612227437,0.12549757957458496,0.21652654612227437
104,4,KNeighbors Classifier,1,0.85,0.41638293611055477,0.41589815805839214,3.367751359939575,0.41589815805839214
105,4,SVC Classifier,1,0.85,0.551171640296415,1.0,45.952770471572876,0.0
106,4,Decision Tree,1,0.85,0.4528339675545764,0.45455018332566993,0.2682187557220459,0.45455018332566993
107,4,RandomForest,1,0.85,0.46785499699579414,0.3823981225755566,0.4788932800292969,0.3823981225755566
108,4,AdaBoost (Discrete),1,0.85,0.47606649309032645,0.47782970884936654,69.85549068450928,0.47782970884936654
109,4,AdaBoost (Real),1,0.85,0.4734628479871821,0.4756170015624047,81.10177969932556,0.4756170015624047
110,4,Logistic Regression (Penalty = L2),1,0.85,0.5261365912277188,0.46041112559794845,0.26059412956237793,0.46041112559794845
111,4,Naive Bayes,1,0.85,0.5245343480873222,0.44345818370445866,0.08894944190979004,0.44345818370445866
112,4,KNeighbors Classifier,2,0.85,0.47746845583817343,0.4215537930413507,3.366948366165161,0.4215537930413507
113,4,SVC Classifier,2,0.85,0.5513719206889646,0.021124141684149264,38.93250298500061,0.021124141684149264
114,4,Decision Tree,2,0.85,0.4932906068495894,0.4668170780566714,0.2698197364807129,0.4668170780566714
115,4,RandomForest,2,0.85,0.5802122972161026,0.46159328277840267,0.4814643859863281,0.46159328277840267
116,4,AdaBoost (Discrete),2,0.85,0.48467854996995796,0.4364255899219753,63.776432514190674,0.4364255899219753
117,4,AdaBoost (Real),2,0.85,0.5171239735629882,0.4575127230164495,74.94974446296692,0.4575127230164495
118,4,Logistic Regression (Penalty = L2),2,0.85,0.4384137792910074,0.24214810677176535,0.29802489280700684,0.24214810677176535
119,4,Naive Bayes,2,0.85,0.4061686360905267,0.09858554150642983,0.11085295677185059,0.09858554150642983
120,5,KNeighbors Classifier,0,0.85,0.5214257108530236,0.5236309614231948,4.05253267288208,0.5236309614231948
121,5,SVC Classifier,0,0.85,0.55126151381658,1.0,39.30184197425842,0.0
122,5,Decision Tree,0,0.85,0.4855826992390869,0.4854909818588783,0.22058844566345215,0.4854909818588783
123,5,RandomForest,0,0.85,0.5178213856627953,0.5076703111021978,0.5073988437652588,0.5076703111021978
124,5,AdaBoost (Discrete),0,0.85,0.46235482579094916,0.4262279885897238,61.40788507461548,0.4262279885897238
125,5,AdaBoost (Real),0,0.85,0.4893872647176612,0.4661156251560123,65.5372998714447,0.4661156251560123
126,5,Logistic Regression (Penalty = L2),0,0.85,0.5082098518221866,0.5035159379234624,0.26880478858947754,0.5035159379234624
127,5,Naive Bayes,0,0.85,0.460752903484181,0.22218380395078896,0.07529854774475098,0.22218380395078896
128,5,KNeighbors Classifier,1,0.85,0.4127778890446625,0.41473744712434313,3.835984468460083,0.41473744712434313
129,5,SVC Classifier,1,0.85,0.5509713599038654,0.9996366279069767,34.75670623779297,0.0
130,5,Decision Tree,1,0.85,0.45103144402163026,0.45340348627473576,0.18486595153808594,0.45340348627473576
131,5,RandomForest,1,0.85,0.4932906068495894,0.4685208298488356,0.3613753318786621,0.4685208298488356
132,5,AdaBoost (Discrete),1,0.85,0.4816743440817144,0.4839284523438892,56.99881029129028,0.4839284523438892
133,5,AdaBoost (Real),1,0.85,0.47987182054876826,0.4821989414031461,66.25100135803223,0.4821989414031461
134,5,Logistic Regression (Penalty = L2),1,0.85,0.5049068696174644,0.49057141751362765,0.19825482368469238,0.49057141751362765
135,5,Naive Bayes,1,0.85,0.514920889244943,0.43429409111223566,0.09567618370056152,0.43429409111223566
136,5,KNeighbors Classifier,2,0.85,0.43100340476667337,0.39111493861618474,3.1605112552642822,0.39111493861618474
137,5,SVC Classifier,2,0.85,0.5513719206889646,0.021124141684149264,36.59423494338989,0.021124141684149264
138,5,Decision Tree,2,0.85,0.4824754656519127,0.44387701258303275,0.19031214714050293,0.44387701258303275
139,5,RandomForest,2,0.85,0.6094532345283397,0.5369950895703985,0.4001631736755371,0.5369950895703985
140,5,AdaBoost (Discrete),2,0.85,0.4288003204486281,0.4016748962910557,55.75476026535034,0.4016748962910557
141,5,AdaBoost (Real),2,0.85,0.45563789305027036,0.41171523299625656,64.80779075622559,0.41171523299625656
142,5,Logistic Regression (Penalty = L2),2,0.85,0.5447626677348287,0.3083093205747504,0.18485355377197266,0.3083093205747504
143,5,Naive Bayes,2,0.85,0.4057680753054276,0.13490099186644341,0.06499624252319336,0.13490099186644341
144,6,KNeighbors Classifier,0,0.85,0.5482579094913896,0.5507795962589257,2.0474395751953125,0.5507795962589257
145,6,SVC Classifier,0,0.85,0.55126151381658,1.0,33.513206005096436,0.0
146,6,Decision Tree,0,0.85,0.5362434921906287,0.5390045911669705,0.20766901969909668,0.5390045911669705
147,6,RandomForest,0,0.85,0.4937925510612735,0.49634300071755916,0.3778722286224365,0.49634300071755916
148,6,AdaBoost (Discrete),0,0.85,0.4919903884661594,0.46894444936961494,57.86343050003052,0.46894444936961494
149,6,AdaBoost (Real),0,0.85,0.5328394072887465,0.5244747258589525,58.918152809143066,0.5244747258589525
150,6,Logistic Regression (Penalty = L2),0,0.85,0.540048057669203,0.5204914100959595,0.16541600227355957,0.5204914100959595
151,6,Naive Bayes,0,0.85,0.4685622747296756,0.2321781887231847,0.10930061340332031,0.2321781887231847
152,6,KNeighbors Classifier,1,0.85,0.4582415381534148,0.46064614533949017,3.582831621170044,0.46064614533949017
153,6,SVC Classifier,1,0.85,0.5509713599038654,0.9996366279069767,35.51292181015015,0.0
154,6,Decision Tree,1,0.85,0.46705387542559584,0.4693424037507497,0.15760469436645508,0.4693424037507497
155,6,RandomForest,1,0.85,0.4594432205087122,0.39011993164406417,0.40994787216186523,0.39011993164406417
156,6,AdaBoost (Discrete),1,0.85,0.49569397156018424,0.49738225161388655,49.631444692611694,0.49738225161388655
157,6,AdaBoost (Real),1,0.85,0.46945724013619067,0.4718856561785732,58.60448503494263,0.4718856561785732
158,6,Logistic Regression (Penalty = L2),1,0.85,0.5411576206689365,0.5082132429607304,0.15558767318725586,0.5082132429607304
159,6,Naive Bayes,1,0.85,0.5509713599038654,0.9996366279069767,0.09284687042236328,0.0
160,6,KNeighbors Classifier,2,0.85,0.44802723813338674,0.43003107142792574,2.7245824337005615,0.43003107142792574
161,6,SVC Classifier,2,0.85,0.5513719206889646,0.021124141684149264,29.016034603118896,0.021124141684149264
162,6,Decision Tree,2,0.85,0.49208892449429203,0.4767844126983462,0.17820191383361816,0.4767844126983462
163,6,RandomForest,2,0.85,0.5493691167634689,0.47551590807035404,0.3702094554901123,0.47551590807035404
164,6,AdaBoost (Discrete),2,0.85,0.5285399559383136,0.487897767148323,46.18781924247742,0.487897767148323
165,6,AdaBoost (Real),2,0.85,0.5193270578810334,0.48210259145644474,48.867318630218506,0.48210259145644474
166,6,Logistic Regression (Penalty = L2),2,0.85,0.543761265772081,0.32878273986716033,0.1656932830810547,0.32878273986716033
167,6,Naive Bayes,2,0.85,0.4123773282595634,0.1251069714445916,0.05911612510681152,0.1251069714445916
168,7,KNeighbors Classifier,0,0.85,0.5246295554665599,0.5217727036760167,2.5047316551208496,0.5217727036760167
169,7,SVC Classifier,0,0.85,0.55126151381658,1.0,28.234559774398804,0.0
170,7,Decision Tree,0,0.85,0.5300360432519022,0.5285077616396391,0.15951132774353027,0.5285077616396391
171,7,RandomForest,0,0.85,0.5214257108530236,0.5112031316871196,0.3179965019226074,0.5112031316871196
172,7,AdaBoost (Discrete),0,0.85,0.4769723668402083,0.46084129984369226,42.89871025085449,0.46084129984369226
173,7,AdaBoost (Real),0,0.85,0.49839807769323186,0.48700270558119,50.60009574890137,0.48700270558119
174,7,Logistic Regression (Penalty = L2),0,0.85,0.5508610332398879,0.2895500850424376,0.1228482723236084,0.2895500850424376
175,7,Naive Bayes,0,0.85,0.47416900280336405,0.26022919957372914,0.05003190040588379,0.26022919957372914
176,7,KNeighbors Classifier,1,0.85,0.40817144001602246,0.4077045887177747,2.5139927864074707,0.4077045887177747
177,7,SVC Classifier,1,0.85,0.5509713599038654,0.9996366279069767,25.420514583587646,0.0
178,7,Decision Tree,1,0.85,0.468856398958542,0.47085695229287483,0.18547773361206055,0.47085695229287483
179,7,RandomForest,1,0.85,0.5183256559182856,0.40954975463975285,0.31346726417541504,0.40954975463975285
180,7,AdaBoost (Discrete),1,0.85,0.45063088323653117,0.45270862970685705,42.70884990692139,0.45270862970685705
181,7,AdaBoost (Real),1,0.85,0.4554376126577208,0.45732502417229765,47.29184293746948,0.45732502417229765
182,7,Logistic Regression (Penalty = L2),1,0.85,0.5447626677348287,0.4411019375793534,0.1057288646697998,0.4411019375793534
183,7,Naive Bayes,1,0.85,0.49829761666332867,0.49681941779470074,0.0989835262298584,0.49681941779470074
184,7,KNeighbors Classifier,2,0.85,0.4822751852593631,0.4041605224075346,2.4717559814453125,0.4041605224075346
185,7,SVC Classifier,2,0.85,0.5513719206889646,0.021124141684149264,21.7352454662323,0.021124141684149264
186,7,Decision Tree,2,0.85,0.4868816342880032,0.45443245036556174,0.11706876754760742,0.45443245036556174
187,7,RandomForest,2,0.85,0.49509313038253555,0.40279998575396686,0.30156612396240234,0.40279998575396686
188,7,AdaBoost (Discrete),2,0.85,0.48527939114760665,0.4395586430627166,40.34035634994507,0.4395586430627166
189,7,AdaBoost (Real),2,0.85,0.48848387742839977,0.42943150592725604,45.21332621574402,0.42943150592725604
190,7,Logistic Regression (Penalty = L2),2,0.85,0.4652513518926497,0.17463108276599568,0.2340691089630127,0.17463108276599568
191,7,Naive Bayes,2,0.85,0.3909473262567595,0.14206845873084992,0.0794973373413086,0.14206845873084992
192,8,KNeighbors Classifier,0,0.85,0.5492591109331197,0.5495070919163143,1.6067287921905518,0.5495070919163143
193,8,SVC Classifier,0,0.85,0.55126151381658,1.0,20.780646324157715,0.0
194,8,Decision Tree,0,0.85,0.5448538245895074,0.542789670525811,0.12905359268188477,0.542789670525811
195,8,RandomForest,0,0.85,0.5192230676812175,0.520307643296827,0.29192066192626953,0.520307643296827
196,8,AdaBoost (Discrete),0,0.85,0.48918702442931516,0.48107152878170256,32.247780084609985,0.48107152878170256
197,8,AdaBoost (Real),0,0.85,0.4777733279935923,0.4771267277614886,37.95885896682739,0.4771267277614886
198,8,Logistic Regression (Penalty = L2),0,0.85,0.5470564677613136,0.9923719578641482,0.10405373573303223,0.0
199,8,Naive Bayes,0,0.85,0.4633560272326792,0.1912355429581322,0.09250950813293457,0.1912355429581322
200,8,KNeighbors Classifier,1,0.85,0.4494292008812337,0.4512779814799299,1.8874449729919434,0.4512779814799299
201,8,SVC Classifier,1,0.85,0.551171640296415,1.0,26.458431243896484,0.0
202,8,Decision Tree,1,0.85,0.4642499499299019,0.4663792160639522,0.1289081573486328,0.4663792160639522
203,8,RandomForest,1,0.85,0.5115161225716003,0.400155606816365,0.2222442626953125,0.400155606816365
204,8,AdaBoost (Discrete),1,0.85,0.47626677348287605,0.47808669068938436,34.04091763496399,0.47808669068938436
205,8,AdaBoost (Real),1,0.85,0.4772681754456239,0.47968603203654714,39.425482749938965,0.47968603203654714
206,8,Logistic Regression (Penalty = L2),1,0.85,0.5057079911876627,0.14165354929684126,0.11191725730895996,0.14165354929684126
207,8,Naive Bayes,1,0.85,0.551171640296415,0.021120303373645306,0.05817103385925293,0.021120303373645306
208,8,KNeighbors Classifier,2,0.85,0.5283396755457641,0.46396795721221595,2.2449121475219727,0.46396795721221595
209,8,SVC Classifier,2,0.85,0.5513719206889646,0.021124141684149264,20.166741847991943,0.021124141684149264
210,8,Decision Tree,2,0.85,0.5291407971159624,0.4962005598963796,0.12063050270080566,0.4962005598963796
211,8,RandomForest,2,0.85,0.5531744442219106,0.4800712292655969,0.2206423282623291,0.4800712292655969
212,8,AdaBoost (Discrete),2,0.85,0.5211295814139796,0.4921351294277682,30.083935022354126,0.4921351294277682
213,8,AdaBoost (Real),2,0.85,0.52092930102143,0.4947168948982601,35.526816844940186,0.4947168948982601
214,8,Logistic Regression (Penalty = L2),2,0.85,0.5279391147606649,0.1621231468010727,0.08606076240539551,0.1621231468010727
215,8,Naive Bayes,2,0.85,0.4043661125575806,0.1287830506965729,0.057004451751708984,0.1287830506965729
216,9,KNeighbors Classifier,0,0.85,0.5580696836203444,0.5577443484847793,1.745161771774292,0.5577443484847793
217,9,SVC Classifier,0,0.85,0.55126151381658,1.0,19.96004056930542,0.0
218,9,Decision Tree,0,0.85,0.540048057669203,0.5421451623662265,0.09482789039611816,0.5421451623662265
219,9,RandomForest,0,0.85,0.5312374849819784,0.5340151397542598,0.19473838806152344,0.5340151397542598
220,9,AdaBoost (Discrete),0,0.85,0.4945935122146576,0.4801244915193482,30.217131853103638,0.4801244915193482
221,9,AdaBoost (Real),0,0.85,0.5166199439327193,0.5106662046942072,30.159706354141235,0.5106662046942072
222,9,Logistic Regression (Penalty = L2),0,0.85,0.5540648778534241,0.5290834132149943,0.09568285942077637,0.5290834132149943
223,9,Naive Bayes,0,0.85,0.55126151381658,1.0,0.029546499252319336,0.0
224,9,KNeighbors Classifier,1,0.85,0.4622471460044062,0.4641590831415588,1.7166862487792969,0.4641590831415588
225,9,SVC Classifier,1,0.85,0.5509713599038654,0.9996366279069767,18.33545160293579,0.0
226,9,Decision Tree,1,0.85,0.45864209893851393,0.45985011425472955,0.07580137252807617,0.45985011425472955
227,9,RandomForest,1,0.85,0.46044462247146006,0.45713299182111755,0.2294628620147705,0.45713299182111755
228,9,AdaBoost (Discrete),1,0.85,0.48207490486681354,0.48415825210328595,25.978386878967285,0.48415825210328595
229,9,AdaBoost (Real),1,0.85,0.47626677348287605,0.4775267508041512,27.79912042617798,0.4775267508041512
230,9,Logistic Regression (Penalty = L2),1,0.85,0.5319447226116564,0.4088388643746229,0.12305140495300293,0.4088388643746229
231,9,Naive Bayes,1,0.85,0.5513719206889646,0.09645058182773511,0.04899287223815918,0.09645058182773511
232,9,KNeighbors Classifier,2,0.85,0.4141798517925095,0.3846211969284279,1.696972131729126,0.3846211969284279
233,9,SVC Classifier,2,0.85,0.5513719206889646,0.021124141684149264,14.815053224563599,0.021124141684149264
234,9,Decision Tree,2,0.85,0.496294812737833,0.4727456297693827,0.05518746376037598,0.4727456297693827
235,9,RandomForest,2,0.85,0.5269377127979171,0.416921095383584,0.12273764610290527,0.416921095383584
236,9,AdaBoost (Discrete),2,0.85,0.4750650911275786,0.4646529556202014,22.782928228378296,0.4646529556202014
237,9,AdaBoost (Real),2,0.85,0.46645303424794715,0.4449522429085278,26.42215919494629,0.4449522429085278
238,9,Logistic Regression (Penalty = L2),2,0.85,0.5471660324454236,0.25449421536988903,0.12135744094848633,0.25449421536988903
239,9,Naive Bayes,2,0.85,0.3991588223512918,0.1575278463109149,0.03512263298034668,0.1575278463109149
240,10,KNeighbors Classifier,0,0.85,0.5146175410492592,0.5154098613184495,2.071622371673584,0.5154098613184495
241,10,SVC Classifier,0,0.85,0.55126151381658,1.0,13.789915084838867,0.0
242,10,Decision Tree,0,0.85,0.5558670404485383,0.5582892744259041,0.06838607788085938,0.5582892744259041
243,10,RandomForest,0,0.85,0.5298358029635563,0.5149664046790728,0.12735438346862793,0.5149664046790728
244,10,AdaBoost (Discrete),0,0.85,0.46896275530636766,0.44537776226873704,25.693613529205322,0.44537776226873704
245,10,AdaBoost (Real),0,0.85,0.4945935122146576,0.47868501610238884,27.043511629104614,0.47868501610238884
246,10,Logistic Regression (Penalty = L2),0,0.85,0.5406487785342411,0.5197271056887202,0.08259844779968262,0.5197271056887202
247,10,Naive Bayes,0,0.85,0.46876251501802163,0.22644995595286435,0.033545732498168945,0.22644995595286435
248,10,KNeighbors Classifier,1,0.85,0.44081714400160227,0.4426585331897457,2.3986806869506836,0.4426585331897457
249,10,SVC Classifier,1,0.85,0.5509713599038654,0.9996366279069767,12.363201379776001,0.0
250,10,Decision Tree,1,0.85,0.4562387342279191,0.45754249252703943,0.053048133850097656,0.45754249252703943
251,10,RandomForest,1,0.85,0.5095133186461045,0.4200193559261955,0.12630271911621094,0.4200193559261955
252,10,AdaBoost (Discrete),1,0.85,0.47846985780092127,0.4781604520332152,22.47349762916565,0.4781604520332152
253,10,AdaBoost (Real),1,0.85,0.47386340877228117,0.47564512662199154,24.521442890167236,0.47564512662199154
254,10,Logistic Regression (Penalty = L2),1,0.85,0.4690566793510915,0.45022920349376694,0.08966064453125,0.45022920349376694
255,10,Naive Bayes,1,0.85,0.5017023833366714,0.5042290769166725,0.03411579132080078,0.5042290769166725
256,10,KNeighbors Classifier,2,0.85,0.4233927498497897,0.37101333436249095,1.3034815788269043,0.37101333436249095
257,10,SVC Classifier,2,0.85,0.5513719206889646,0.021124141684149264,9.241196393966675,0.021124141684149264
258,10,Decision Tree,2,0.85,0.4582415381534148,0.43576357008522176,0.06855893135070801,0.43576357008522176
259,10,RandomForest,2,0.85,0.5701982775886241,0.38726006697576243,0.13611602783203125,0.38726006697576243
260,10,AdaBoost (Discrete),2,0.85,0.4634488283597036,0.42678876830410734,16.98809242248535,0.42678876830410734
261,10,AdaBoost (Real),2,0.85,0.4902864009613459,0.4491516239348051,19.661521196365356,0.4491516239348051
262,10,Logistic Regression (Penalty = L2),2,0.85,0.5319447226116564,0.2559532148514081,0.15093374252319336,0.2559532148514081
263,10,Naive Bayes,2,0.85,0.4007610654916884,0.15006769743483475,0.01211404800415039,0.15006769743483475
264,11,KNeighbors Classifier,0,0.85,0.5146175410492592,0.5154098613184495,1.4443228244781494,0.5154098613184495
265,11,SVC Classifier,0,0.85,0.55126151381658,1.0,8.433631658554077,0.0
266,11,Decision Tree,0,0.85,0.5024028834601522,0.5031716950965277,0.06729722023010254,0.5031716950965277
267,11,RandomForest,0,0.85,0.5298358029635563,0.5149664046790728,0.14072179794311523,0.5149664046790728
268,11,AdaBoost (Discrete),0,0.85,0.46936323588305967,0.4459433215597815,16.879942893981934,0.4459433215597815
269,11,AdaBoost (Real),0,0.85,0.4945935122146576,0.47868501610238884,16.900620222091675,0.47868501610238884
270,11,Logistic Regression (Penalty = L2),0,0.85,0.5406487785342411,0.5197271056887202,0.03753471374511719,0.5197271056887202
271,11,Naive Bayes,0,0.85,0.46876251501802163,0.22644995595286435,0.01425027847290039,0.22644995595286435
272,11,KNeighbors Classifier,1,0.85,0.44081714400160227,0.4426585331897457,1.7066490650177002,0.4426585331897457
273,11,SVC Classifier,1,0.85,0.5509713599038654,0.9996366279069767,8.514312028884888,0.0
274,11,Decision Tree,1,0.85,0.464650510715001,0.4662999399623635,0.028567075729370117,0.4662999399623635
275,11,RandomForest,1,0.85,0.5095133186461045,0.4200193559261955,0.059539794921875,0.4200193559261955
276,11,AdaBoost (Discrete),1,0.85,0.47846985780092127,0.4781604520332152,15.505027532577515,0.4781604520332152
277,11,AdaBoost (Real),1,0.85,0.47386340877228117,0.47564512662199154,17.281667947769165,0.47564512662199154
278,11,Logistic Regression (Penalty = L2),1,0.85,0.4690566793510915,0.45022920349376694,0.06228446960449219,0.45022920349376694
279,11,Naive Bayes,1,0.85,0.5017023833366714,0.5042290769166725,0.012980937957763672,0.5042290769166725
280,11,KNeighbors Classifier,2,0.85,0.4233927498497897,0.37101333436249095,0.9121999740600586,0.37101333436249095
281,11,SVC Classifier,2,0.85,0.5513719206889646,0.021124141684149264,8.697784900665283,0.021124141684149264
282,11,Decision Tree,2,0.85,0.5513719206889646,0.5293118852665571,0.0357058048248291,0.5293118852665571
283,11,RandomForest,2,0.85,0.5701982775886241,0.38726006697576243,0.06112408638000488,0.38726006697576243
284,11,AdaBoost (Discrete),2,0.85,0.4634488283597036,0.42678876830410734,14.89365029335022,0.42678876830410734
285,11,AdaBoost (Real),2,0.85,0.4902864009613459,0.4491516239348051,15.35123085975647,0.4491516239348051
286,11,Logistic Regression (Penalty = L2),2,0.85,0.5319447226116564,0.2559532148514081,0.03679347038269043,0.2559532148514081
287,11,Naive Bayes,2,0.85,0.4007610654916884,0.15006769743483475,0.011982917785644531,0.15006769743483475
288,12,KNeighbors Classifier,0,0.85,0.5106127352823389,0.5123312986728005,0.30046606063842773,0.5123312986728005
289,12,SVC Classifier,0,0.85,0.55126151381658,1.0,4.747239589691162,0.0
290,12,Decision Tree,0,0.85,0.5360432519022827,0.5352808679718791,0.02714085578918457,0.5352808679718791
291,12,RandomForest,0,0.85,0.5903083700440529,0.5826301086297644,0.05662345886230469,0.5826301086297644
292,12,AdaBoost (Discrete),0,0.85,0.5238285943131759,0.5079553471072593,7.974590301513672,0.5079553471072593
293,12,AdaBoost (Real),0,0.85,0.5468562274729676,0.548866927945506,10.317888259887695,0.548866927945506
294,12,Logistic Regression (Penalty = L2),0,0.85,0.5482579094913896,0.06649640230283534,0.020043373107910156,0.06649640230283534
295,12,Naive Bayes,0,0.85,0.55126151381658,1.0,0.010954856872558594,0.0
296,12,KNeighbors Classifier,1,0.85,0.46685359503304624,0.46918725865654853,0.2512855529785156,0.46918725865654853
297,12,SVC Classifier,1,0.85,0.5509713599038654,0.9996366279069767,5.897713661193848,0.0
298,12,Decision Tree,1,0.85,0.5249349088724213,0.5276059077944282,0.023986101150512695,0.5276059077944282
299,12,RandomForest,1,0.85,0.44582415381534146,0.4251733134757058,0.055416107177734375,0.4251733134757058
300,12,AdaBoost (Discrete),1,0.85,0.4680552773883437,0.4703759711855556,7.6213109493255615,0.4703759711855556
301,12,AdaBoost (Real),1,0.85,0.47025836170638896,0.4724661813494304,9.08144736289978,0.4724661813494304
302,12,Logistic Regression (Penalty = L2),1,0.85,0.5291407971159624,0.9600290697674418,0.028917551040649414,0.0
303,12,Naive Bayes,1,0.85,0.5509713599038654,0.9996366279069767,0.017673015594482422,0.0
304,12,KNeighbors Classifier,2,0.85,0.5413579010614861,0.5089645375980157,0.2966179847717285,0.5089645375980157
305,12,SVC Classifier,2,0.85,0.551171640296415,1.0,5.971704959869385,0.0
306,12,Decision Tree,2,0.85,0.552573603044262,0.5260004499382118,0.026796579360961914,0.5260004499382118
307,12,RandomForest,2,0.85,0.5555778089325055,0.45074589356852773,0.05166006088256836,0.45074589356852773
308,12,AdaBoost (Discrete),2,0.85,0.5317444422191068,0.4849409635574279,8.601637125015259,0.4849409635574279
309,12,AdaBoost (Real),2,0.85,0.5413579010614861,0.5018996762048402,9.932096004486084,0.5018996762048402
310,12,Logistic Regression (Penalty = L2),2,0.85,0.5695974364109754,0.3294845181253243,0.03439831733703613,0.3294845181253243
311,12,Naive Bayes,2,0.85,0.40857200080112155,0.10962161439572447,0.01622152328491211,0.10962161439572447
