,feat_set_id,classifier,fold_id,feat_th,score,geo_score,exec_t,geo_score_woz
0,0,KNeighbors Classifier,0,1.0,0.9791044776119403,0.9789394329847532,5.661001920700073,0.9789394329847532
1,0,SVC Classifier,0,1.0,0.9761194029850746,0.9759541111282376,2.334542751312256,0.9759541111282376
2,0,Decision Tree,0,1.0,0.8313432835820895,0.8307055085643683,0.05768084526062012,0.8307055085643683
3,0,RandomForest,0,1.0,0.6880597014925374,0.7461311211476899,0.3124725818634033,0.0
4,0,AdaBoost (Discrete),0,1.0,0.9298507462686567,0.9278820352482705,57.455366373062134,0.9278820352482705
5,0,AdaBoost (Real),0,1.0,0.9074626865671642,0.9057650990628743,47.894001722335815,0.9057650990628743
6,0,Logistic Regression (Penalty = L2),0,1.0,0.9492537313432836,0.9486524157422167,1.6675057411193848,0.9486524157422167
7,0,Naive Bayes,0,1.0,0.926865671641791,0.9258686660127934,0.164384126663208,0.9258686660127934
8,0,KNeighbors Classifier,1,1.0,0.9671641791044776,0.9669381419417639,4.009562253952026,0.9669381419417639
9,0,SVC Classifier,1,1.0,0.9686567164179104,0.9684850354938194,1.2508535385131836,0.9684850354938194
10,0,Decision Tree,1,1.0,0.8208955223880597,0.8186913540240743,0.045960187911987305,0.8186913540240743
11,0,RandomForest,1,1.0,0.7074626865671642,0.5045868422145746,0.13239741325378418,0.5045868422145746
12,0,AdaBoost (Discrete),1,1.0,0.9417910447761194,0.9410332533173178,34.7958984375,0.9410332533173178
13,0,AdaBoost (Real),1,1.0,0.6940298507462687,0.6248560471900177,31.36551284790039,0.6248560471900177
14,0,Logistic Regression (Penalty = L2),1,1.0,0.9477611940298507,0.9468369241411904,1.0383484363555908,0.9468369241411904
15,0,Naive Bayes,1,1.0,0.9134328358208955,0.9127727890226641,0.17841839790344238,0.9127727890226641
16,0,KNeighbors Classifier,2,1.0,0.9757575757575757,0.9756109786668183,2.91878080368042,0.9756109786668183
17,0,SVC Classifier,2,1.0,0.9666666666666667,0.9666239453637299,1.0680348873138428,0.9666239453637299
18,0,Decision Tree,2,1.0,0.8636363636363636,0.8610931790514708,0.025232553482055664,0.8610931790514708
19,0,RandomForest,2,1.0,0.7348484848484849,0.5398333026058275,0.11899518966674805,0.5398333026058275
20,0,AdaBoost (Discrete),2,1.0,0.9409090909090909,0.9398517820003452,23.285327434539795,0.9398517820003452
21,0,AdaBoost (Real),2,1.0,0.6090909090909091,0.5471709858028373,23.37584161758423,0.5471709858028373
22,0,Logistic Regression (Penalty = L2),2,1.0,0.9515151515151515,0.951054592445935,0.8634963035583496,0.951054592445935
23,0,Naive Bayes,2,1.0,0.9242424242424242,0.9239434547016669,0.15806245803833008,0.9239434547016669
