,feat_set_id,classifier,fold_id,feat_th,score,geo_score,exec_t,geo_score_woz
0,0,KNeighbors Classifier,0,0.15,0.6845753899480069,0.8129520829107402,0.22708964347839355,0.0
1,0,SVC Classifier,0,0.15,0.6845753899480069,0.8129520829107402,0.38879990577697754,0.0
2,0,Decision Tree,0,0.15,0.6845753899480069,0.8129520829107402,0.00180816650390625,0.0
3,0,RandomForest,0,0.15,0.7417677642980935,0.7407118766149331,0.4533510208129883,0.0
4,0,AdaBoost (Discrete),0,0.15,0.6845753899480069,0.8129520829107402,29.35167121887207,0.0
5,0,AdaBoost (Real),0,0.15,0.6845753899480069,0.8129520829107402,114.1916332244873,0.0
6,0,Logistic Regression (Penalty = L2),0,0.15,0.6845753899480069,0.8129520829107402,0.2648441791534424,0.0
7,0,Naive Bayes,0,0.15,0.5805892547660312,0.6192878878744241,0.08016800880432129,0.0
8,0,KNeighbors Classifier,1,0.15,0.8038194444444444,0.7744915485716632,0.34220290184020996,0.0
9,0,SVC Classifier,1,0.15,0.7690972222222222,0.8841027752029671,0.4226961135864258,0.0
10,0,Decision Tree,1,0.15,0.8038194444444444,0.7744915485716632,0.0014834403991699219,0.0
11,0,RandomForest,1,0.15,0.6996527777777778,1.0,0.5682790279388428,0.0
12,0,AdaBoost (Discrete),1,0.15,0.8038194444444444,0.7744915485716632,41.800225496292114,0.0
13,0,AdaBoost (Real),1,0.15,0.8038194444444444,0.7744915485716632,75.07359290122986,0.0
14,0,Logistic Regression (Penalty = L2),1,0.15,0.8038194444444444,0.7744915485716632,0.3352837562561035,0.0
15,0,Naive Bayes,1,0.15,0.6666666666666666,0.6596260502202088,0.10912466049194336,0.0
16,0,KNeighbors Classifier,2,0.15,0.7843478260869565,0.6339634597648305,0.6384015083312988,0.6339634597648305
17,0,SVC Classifier,2,0.15,0.7617391304347826,0.5617326583032773,1.355841875076294,0.0
18,0,Decision Tree,2,0.15,0.7391304347826086,0.42805277352697846,0.002464771270751953,0.42805277352697846
19,0,RandomForest,2,0.15,0.7513043478260869,0.5052262532742322,0.9957332611083984,0.0
20,0,AdaBoost (Discrete),2,0.15,0.4052173913043478,0.3597128593712998,47.34215211868286,0.3597128593712998
21,0,AdaBoost (Real),2,0.15,0.48869565217391303,0.3804495695891552,58.06261992454529,0.3804495695891552
22,0,Logistic Regression (Penalty = L2),2,0.15,0.7391304347826086,0.42805277352697846,0.22397232055664062,0.42805277352697846
23,0,Naive Bayes,2,0.15,0.4504347826086956,0.5309694241041965,0.11272335052490234,0.5309694241041965
24,1,KNeighbors Classifier,0,0.15,0.4506065857885615,0.5116223467974931,0.22408676147460938,0.0
25,1,SVC Classifier,0,0.15,0.7001733102253033,1.0,0.677659273147583,0.0
26,1,Decision Tree,0,0.15,0.5753899480069324,0.8217821782178217,0.0986332893371582,0.0
27,1,RandomForest,0,0.15,0.7001733102253033,1.0,0.9121546745300293,0.0
28,1,AdaBoost (Discrete),0,0.15,0.7001733102253033,1.0,46.983372926712036,0.0
29,1,AdaBoost (Real),0,0.15,0.7001733102253033,1.0,121.56962037086487,0.0
30,1,Logistic Regression (Penalty = L2),0,0.15,0.7001733102253033,1.0,0.36040472984313965,0.0
31,1,Naive Bayes,0,0.15,0.41594454072790293,0.5598055961226205,0.2646760940551758,0.0
32,1,KNeighbors Classifier,1,0.15,0.6770833333333334,0.9542902992203705,0.3813204765319824,0.0
33,1,SVC Classifier,1,0.15,0.6996527777777778,1.0,0.8034722805023193,0.0
34,1,Decision Tree,1,0.15,0.6371527777777778,0.9106699751861043,0.18604230880737305,0.0
35,1,RandomForest,1,0.15,0.5225694444444444,0.5010070503656899,0.8520514965057373,0.0
36,1,AdaBoost (Discrete),1,0.15,0.6371527777777778,0.9106699751861043,55.78244686126709,0.0
37,1,AdaBoost (Real),1,0.15,0.6371527777777778,0.9106699751861043,112.05176663398743,0.0
38,1,Logistic Regression (Penalty = L2),1,0.15,0.5225694444444444,0.5010070503656899,0.3706982135772705,0.0
39,1,Naive Bayes,1,0.15,0.5208333333333334,0.6857142164790785,0.1394486427307129,0.0
40,1,KNeighbors Classifier,2,0.15,0.35478260869565215,0.6701727491084987,0.4999501705169678,0.0
41,1,SVC Classifier,2,0.15,0.7008695652173913,1.0,0.8053691387176514,0.0
42,1,Decision Tree,2,0.15,0.542608695652174,0.8468303183574204,0.13423490524291992,0.0
43,1,RandomForest,2,0.15,0.542608695652174,0.8468303183574204,0.9525983333587646,0.0
44,1,AdaBoost (Discrete),2,0.15,0.2921739130434783,0.5998345512170393,52.67180371284485,0.0
45,1,AdaBoost (Real),2,0.15,0.542608695652174,0.8468303183574204,159.30375027656555,0.0
46,1,Logistic Regression (Penalty = L2),2,0.15,0.542608695652174,0.8468303183574204,0.3750181198120117,0.0
47,1,Naive Bayes,2,0.15,0.1808695652173913,0.4483219332480461,0.12350320816040039,0.0
48,2,KNeighbors Classifier,0,0.15,0.7001733102253033,0.6798915172639858,0.3664674758911133,0.0
49,2,SVC Classifier,0,0.15,0.6845753899480069,0.8129520829107402,0.8831319808959961,0.0
50,2,Decision Tree,0,0.15,0.7140381282495667,0.8384332394589941,0.0014967918395996094,0.0
51,2,RandomForest,0,0.15,0.6169844020797227,0.6288249295942455,1.1212272644042969,0.0
52,2,AdaBoost (Discrete),0,0.15,0.7140381282495667,0.8384332394589941,58.14257621765137,0.0
53,2,AdaBoost (Real),0,0.15,0.7140381282495667,0.8384332394589941,89.0988085269928,0.0
54,2,Logistic Regression (Penalty = L2),0,0.15,0.6169844020797227,0.6288249295942455,0.38176989555358887,0.0
55,2,Naive Bayes,0,0.15,0.5996533795493935,0.6612555313096259,0.2531580924987793,0.0
56,2,KNeighbors Classifier,1,0.15,0.8229166666666666,0.9265855567861313,0.5080142021179199,0.0
57,2,SVC Classifier,1,0.15,0.7274305555555556,0.7636780043269571,1.0088403224945068,0.0
58,2,Decision Tree,1,0.15,0.8229166666666666,0.9265855567861313,0.12696027755737305,0.0
59,2,RandomForest,1,0.15,0.78125,0.7990572919580082,1.0410008430480957,0.0
60,2,AdaBoost (Discrete),1,0.15,0.8229166666666666,0.9265855567861313,54.79779124259949,0.0
61,2,AdaBoost (Real),1,0.15,0.8229166666666666,0.9265855567861313,72.41758680343628,0.0
62,2,Logistic Regression (Penalty = L2),1,0.15,0.78125,0.7990572919580082,0.2760732173919678,0.0
63,2,Naive Bayes,1,0.15,0.7395833333333334,0.8130041017960279,0.13213634490966797,0.0
64,2,KNeighbors Classifier,2,0.15,0.76,0.641347040372881,0.37468624114990234,0.0
65,2,SVC Classifier,2,0.15,0.8382608695652174,0.8340051055773173,0.6952781677246094,0.0
66,2,Decision Tree,2,0.15,0.76,0.641347040372881,0.15806102752685547,0.0
67,2,RandomForest,2,0.15,0.7008695652173913,1.0,1.0838186740875244,0.0
68,2,AdaBoost (Discrete),2,0.15,0.76,0.641347040372881,56.9221830368042,0.0
69,2,AdaBoost (Real),2,0.15,0.76,0.641347040372881,129.02275729179382,0.0
70,2,Logistic Regression (Penalty = L2),2,0.15,0.8382608695652174,0.8340051055773173,0.37739014625549316,0.0
71,2,Naive Bayes,2,0.15,0.76,0.641347040372881,0.13564443588256836,0.0
72,3,KNeighbors Classifier,0,0.15,0.7001733102253033,1.0,0.41321611404418945,0.0
73,3,SVC Classifier,0,0.15,0.7001733102253033,1.0,0.6853699684143066,0.0
74,3,Decision Tree,0,0.15,0.7001733102253033,1.0,0.13443803787231445,0.0
75,3,RandomForest,0,0.15,0.7001733102253033,1.0,0.9478640556335449,0.0
76,3,AdaBoost (Discrete),0,0.15,0.7001733102253033,1.0,54.449227809906006,0.0
77,3,AdaBoost (Real),0,0.15,0.7001733102253033,1.0,67.65671467781067,0.0
78,3,Logistic Regression (Penalty = L2),0,0.15,0.7001733102253033,1.0,0.264024019241333,0.0
79,3,Naive Bayes,0,0.15,0.5025996533795494,0.6332377902572627,0.002777099609375,0.0
80,3,KNeighbors Classifier,1,0.15,0.6996527777777778,1.0,0.3956913948059082,0.0
81,3,SVC Classifier,1,0.15,0.6996527777777778,1.0,0.6585690975189209,0.0
82,3,Decision Tree,1,0.15,0.6996527777777778,1.0,0.0023064613342285156,0.0
83,3,RandomForest,1,0.15,0.6996527777777778,1.0,0.9142177104949951,0.0
84,3,AdaBoost (Discrete),1,0.15,0.6996527777777778,1.0,52.811410665512085,0.0
85,3,AdaBoost (Real),1,0.15,0.6996527777777778,1.0,154.1043565273285,0.0
86,3,Logistic Regression (Penalty = L2),1,0.15,0.6996527777777778,1.0,0.28369927406311035,0.0
87,3,Naive Bayes,1,0.15,0.5503472222222222,0.6848230649393702,0.002664804458618164,0.0
88,3,KNeighbors Classifier,2,0.15,0.5391304347826087,0.8468303183574204,0.29699277877807617,0.0
89,3,SVC Classifier,2,0.15,0.7008695652173913,1.0,0.7873034477233887,0.0
90,3,Decision Tree,2,0.15,0.542608695652174,0.8468303183574204,0.0018565654754638672,0.0
91,3,RandomForest,2,0.15,0.542608695652174,0.8468303183574204,1.03106689453125,0.0
92,3,AdaBoost (Discrete),2,0.15,0.2921739130434783,0.5998345512170393,59.94111466407776,0.0
93,3,AdaBoost (Real),2,0.15,0.542608695652174,0.8468303183574204,116.28054451942444,0.0
94,3,Logistic Regression (Penalty = L2),2,0.15,0.542608695652174,0.8468303183574204,0.2762925624847412,0.0
95,3,Naive Bayes,2,0.15,0.4991304347826087,0.5540862458931088,0.13998770713806152,0.0
96,4,KNeighbors Classifier,0,0.15,0.6845753899480069,0.8129520829107402,0.41805315017700195,0.0
97,4,SVC Classifier,0,0.15,0.6845753899480069,0.8129520829107402,0.718468427658081,0.0
98,4,Decision Tree,0,0.15,0.6845753899480069,0.8129520829107402,0.0013835430145263672,0.0
99,4,RandomForest,0,0.15,0.6845753899480069,0.8129520829107402,0.8861846923828125,0.0
100,4,AdaBoost (Discrete),0,0.15,0.6845753899480069,0.8129520829107402,52.48848628997803,0.0
101,4,AdaBoost (Real),0,0.15,0.6845753899480069,0.8129520829107402,114.47873568534851,0.0
102,4,Logistic Regression (Penalty = L2),0,0.15,0.6845753899480069,0.8129520829107402,0.30716514587402344,0.0
103,4,Naive Bayes,0,0.15,0.6845753899480069,0.8129520829107402,0.30579543113708496,0.0
104,4,KNeighbors Classifier,1,0.15,0.6996527777777778,1.0,0.5369672775268555,0.0
105,4,SVC Classifier,1,0.15,0.7690972222222222,0.8841027752029671,0.843515157699585,0.0
106,4,Decision Tree,1,0.15,0.7690972222222222,0.8841027752029671,0.1376957893371582,0.0
107,4,RandomForest,1,0.15,0.7690972222222222,0.8841027752029671,1.0235323905944824,0.0
108,4,AdaBoost (Discrete),1,0.15,0.7690972222222222,0.8841027752029671,52.487931966781616,0.0
109,4,AdaBoost (Real),1,0.15,0.7690972222222222,0.8841027752029671,100.74672245979309,0.0
110,4,Logistic Regression (Penalty = L2),1,0.15,0.7690972222222222,0.8841027752029671,0.1335444450378418,0.0
111,4,Naive Bayes,1,0.15,0.7690972222222222,0.8841027752029671,0.14978599548339844,0.0
112,4,KNeighbors Classifier,2,0.15,0.88,0.9684860662631681,0.3758554458618164,0.0
113,4,SVC Classifier,2,0.15,0.7008695652173913,1.0,0.624366044998169,0.0
114,4,Decision Tree,2,0.15,0.88,0.9684860662631681,0.0023758411407470703,0.0
115,4,RandomForest,2,0.15,0.88,0.9684860662631681,0.908839225769043,0.0
116,4,AdaBoost (Discrete),2,0.15,0.88,0.9684860662631681,52.564727783203125,0.0
117,4,AdaBoost (Real),2,0.15,0.88,0.9684860662631681,64.1586639881134,0.0
118,4,Logistic Regression (Penalty = L2),2,0.15,0.88,0.9684860662631681,0.24436140060424805,0.0
119,4,Naive Bayes,2,0.15,0.88,0.9684860662631681,0.12438416481018066,0.0
120,5,KNeighbors Classifier,0,0.15,0.7001733102253033,1.0,0.44206786155700684,0.0
121,5,SVC Classifier,0,0.15,0.7001733102253033,1.0,0.7258307933807373,0.0
122,5,Decision Tree,0,0.15,0.7001733102253033,1.0,0.11845684051513672,0.0
123,5,RandomForest,0,0.15,0.7001733102253033,1.0,0.785083532333374,0.0
124,5,AdaBoost (Discrete),0,0.15,0.7001733102253033,1.0,51.77075242996216,0.0
125,5,AdaBoost (Real),0,0.15,0.7001733102253033,1.0,107.82087469100952,0.0
126,5,Logistic Regression (Penalty = L2),0,0.15,0.7001733102253033,1.0,0.2452106475830078,0.0
127,5,Naive Bayes,0,0.15,0.41767764298093585,0.5598055961226205,0.12425065040588379,0.0
128,5,KNeighbors Classifier,1,0.15,0.6996527777777778,1.0,0.5386569499969482,0.0
129,5,SVC Classifier,1,0.15,0.6996527777777778,1.0,0.6949048042297363,0.0
130,5,Decision Tree,1,0.15,0.5225694444444444,0.5010070503656899,0.002156496047973633,0.0
131,5,RandomForest,1,0.15,0.5225694444444444,0.5010070503656899,0.8259117603302002,0.0
132,5,AdaBoost (Discrete),1,0.15,0.5225694444444444,0.5010070503656899,49.95110368728638,0.0
133,5,AdaBoost (Real),1,0.15,0.5225694444444444,0.5010070503656899,79.93166255950928,0.0
134,5,Logistic Regression (Penalty = L2),1,0.15,0.5225694444444444,0.5010070503656899,0.24861431121826172,0.0
135,5,Naive Bayes,1,0.15,0.4583333333333333,0.5754179127433576,0.24030327796936035,0.0
136,5,KNeighbors Classifier,2,0.15,0.7008695652173913,1.0,0.3678145408630371,0.0
137,5,SVC Classifier,2,0.15,0.7008695652173913,1.0,0.7358543872833252,0.0
138,5,Decision Tree,2,0.15,0.7008695652173913,1.0,0.001684427261352539,0.0
139,5,RandomForest,2,0.15,0.7008695652173913,1.0,0.8672261238098145,0.0
140,5,AdaBoost (Discrete),2,0.15,0.7008695652173913,1.0,49.66159534454346,0.0
141,5,AdaBoost (Real),2,0.15,0.7008695652173913,1.0,179.49924159049988,0.0
142,5,Logistic Regression (Penalty = L2),2,0.15,0.7008695652173913,1.0,0.32242298126220703,0.0
143,5,Naive Bayes,2,0.15,0.43130434782608695,0.7472032220800768,0.1696779727935791,0.0
144,6,KNeighbors Classifier,0,0.15,0.6169844020797227,0.6288249295942455,0.7041020393371582,0.0
145,6,SVC Classifier,0,0.15,0.6845753899480069,0.8129520829107402,1.2354021072387695,0.0
146,6,Decision Tree,0,0.15,0.6169844020797227,0.6288249295942455,0.0022292137145996094,0.0
147,6,RandomForest,0,0.15,0.6845753899480069,0.8129520829107402,1.8617897033691406,0.0
148,6,AdaBoost (Discrete),0,0.15,0.6169844020797227,0.6288249295942455,64.3487479686737,0.0
149,6,AdaBoost (Real),0,0.15,0.6169844020797227,0.6288249295942455,72.57409620285034,0.0
150,6,Logistic Regression (Penalty = L2),0,0.15,0.6169844020797227,0.6288249295942455,0.4136490821838379,0.0
151,6,Naive Bayes,0,0.15,0.5979202772963604,0.6612555313096259,0.0028667449951171875,0.0
152,6,KNeighbors Classifier,1,0.15,0.6996527777777778,1.0,0.4359557628631592,0.0
153,6,SVC Classifier,1,0.15,0.7690972222222222,0.8841027752029671,0.8624165058135986,0.0
154,6,Decision Tree,1,0.15,0.6736111111111112,0.5819876952473779,0.13867425918579102,0.0
155,6,RandomForest,1,0.15,0.7690972222222222,0.8841027752029671,1.11588716506958,0.0
156,6,AdaBoost (Discrete),1,0.15,0.6736111111111112,0.5819876952473779,56.44048023223877,0.0
157,6,AdaBoost (Real),1,0.15,0.6736111111111112,0.5819876952473779,121.27629137039185,0.0
158,6,Logistic Regression (Penalty = L2),1,0.15,0.6736111111111112,0.5819876952473779,0.13551020622253418,0.0
159,6,Naive Bayes,1,0.15,0.6770833333333334,0.682233373706832,0.13268518447875977,0.0
160,6,KNeighbors Classifier,2,0.15,0.7095652173913043,0.977412393820056,0.5437169075012207,0.0
161,6,SVC Classifier,2,0.15,0.7008695652173913,1.0,0.6740427017211914,0.0
162,6,Decision Tree,2,0.15,0.34782608695652173,0.47077084523309237,0.002277374267578125,0.0
163,6,RandomForest,2,0.15,0.8243478260869566,0.815019238153796,0.8784787654876709,0.0
164,6,AdaBoost (Discrete),2,0.15,0.34782608695652173,0.47077084523309237,57.80525779724121,0.0
165,6,AdaBoost (Real),2,0.15,0.7652173913043478,0.6586890801376318,76.58073925971985,0.0
166,6,Logistic Regression (Penalty = L2),2,0.15,0.7652173913043478,0.6586890801376318,0.37759900093078613,0.0
167,6,Naive Bayes,2,0.15,0.43130434782608695,0.520020955762976,0.12848973274230957,0.0
168,7,KNeighbors Classifier,0,0.15,0.7209705372616985,0.8020317640187635,0.38524532318115234,0.0
169,7,SVC Classifier,0,0.15,0.6845753899480069,0.8129520829107402,1.0336973667144775,0.0
170,7,Decision Tree,0,0.15,0.6395147313691508,0.6832394989103653,0.1304481029510498,0.0
171,7,RandomForest,0,0.15,0.7001733102253033,1.0,0.9015872478485107,0.0
172,7,AdaBoost (Discrete),0,0.15,0.634315424610052,0.4793056549750786,56.43273591995239,0.0
173,7,AdaBoost (Real),0,0.15,0.19930675909878684,0.3175579569779725,68.6542820930481,0.0
174,7,Logistic Regression (Penalty = L2),0,0.15,0.6395147313691508,0.6832394989103653,0.3357200622558594,0.0
175,7,Naive Bayes,0,0.15,0.6429809358752167,0.7508927762297288,0.24506020545959473,0.0
176,7,KNeighbors Classifier,1,0.15,0.6597222222222222,0.42855214441831263,0.6230754852294922,0.0
177,7,SVC Classifier,1,0.15,0.7274305555555556,0.7636780043269571,0.8578388690948486,0.0
178,7,Decision Tree,1,0.15,0.7447916666666666,0.5391710342763355,0.0021715164184570312,0.0
179,7,RandomForest,1,0.15,0.7274305555555556,0.6082431071696208,1.0034565925598145,0.0
180,7,AdaBoost (Discrete),1,0.15,0.7638888888888888,0.6001589219225056,64.15219449996948,0.0
181,7,AdaBoost (Real),1,0.15,0.7413194444444444,0.6489745986945415,138.8938479423523,0.0
182,7,Logistic Regression (Penalty = L2),1,0.15,0.7378472222222222,0.4118389072852186,0.4028952121734619,0.0
183,7,Naive Bayes,1,0.15,0.8003472222222222,0.6468642383840276,0.15296387672424316,0.6468642383840276
184,7,KNeighbors Classifier,2,0.15,0.6452173913043479,0.7005098326638468,0.9794063568115234,0.0
185,7,SVC Classifier,2,0.15,0.8434782608695652,0.837206672457254,1.257232904434204,0.0
186,7,Decision Tree,2,0.15,0.5930434782608696,0.5816729453208916,0.14225125312805176,0.0
187,7,RandomForest,2,0.15,0.7008695652173913,1.0,0.8386001586914062,0.0
188,7,AdaBoost (Discrete),2,0.15,0.35130434782608694,0.5266346172369097,60.80407691001892,0.5266346172369097
189,7,AdaBoost (Real),2,0.15,0.19652173913043477,0.4725728113579319,78.94607782363892,0.0
190,7,Logistic Regression (Penalty = L2),2,0.15,0.6678260869565218,0.4161061631504778,0.33972620964050293,0.4161061631504778
191,7,Naive Bayes,2,0.15,0.528695652173913,0.7234770261807716,0.11685848236083984,0.0
192,8,KNeighbors Classifier,0,0.15,0.7001733102253033,1.0,0.3479790687561035,0.0
193,8,SVC Classifier,0,0.15,0.7001733102253033,1.0,0.6982252597808838,0.0
194,8,Decision Tree,0,0.15,0.7001733102253033,1.0,0.1185610294342041,0.0
195,8,RandomForest,0,0.15,0.7001733102253033,1.0,0.9384016990661621,0.0
196,8,AdaBoost (Discrete),0,0.15,0.7001733102253033,1.0,46.66598677635193,0.0
197,8,AdaBoost (Real),0,0.15,0.7001733102253033,1.0,164.63285994529724,0.0
198,8,Logistic Regression (Penalty = L2),0,0.15,0.7001733102253033,1.0,0.33696770668029785,0.0
199,8,Naive Bayes,0,0.15,0.5025996533795494,0.6332377902572627,0.12044501304626465,0.0
200,8,KNeighbors Classifier,1,0.15,0.6996527777777778,1.0,0.36380600929260254,0.0
201,8,SVC Classifier,1,0.15,0.6996527777777778,1.0,0.6798012256622314,0.0
202,8,Decision Tree,1,0.15,0.6996527777777778,1.0,0.11383271217346191,0.0
203,8,RandomForest,1,0.15,0.6996527777777778,1.0,0.8175234794616699,0.0
204,8,AdaBoost (Discrete),1,0.15,0.6996527777777778,1.0,48.71982479095459,0.0
205,8,AdaBoost (Real),1,0.15,0.6996527777777778,1.0,170.65555453300476,0.0
206,8,Logistic Regression (Penalty = L2),1,0.15,0.6996527777777778,1.0,0.33538079261779785,0.0
207,8,Naive Bayes,1,0.15,0.5503472222222222,0.6848230649393702,0.1273794174194336,0.0
208,8,KNeighbors Classifier,2,0.15,0.7008695652173913,1.0,0.38385438919067383,0.0
209,8,SVC Classifier,2,0.15,0.7008695652173913,1.0,0.6404175758361816,0.0
210,8,Decision Tree,2,0.15,0.7008695652173913,1.0,0.0022749900817871094,0.0
211,8,RandomForest,2,0.15,0.7008695652173913,1.0,1.0109176635742188,0.0
212,8,AdaBoost (Discrete),2,0.15,0.7008695652173913,1.0,51.77934145927429,0.0
213,8,AdaBoost (Real),2,0.15,0.7008695652173913,1.0,71.06851744651794,0.0
214,8,Logistic Regression (Penalty = L2),2,0.15,0.7008695652173913,1.0,0.19329380989074707,0.0
215,8,Naive Bayes,2,0.15,0.6139130434782609,0.7472032220800768,0.002950906753540039,0.0
