,feat_set_id,classifier,fold_id,feat_th,score,geo_score,exec_t,geo_score_woz
0,0,KNeighbors Classifier,0,0.35,0.2002791346824843,0.24725841186399117,1.0661358833312988,0.0
1,0,SVC Classifier,0,0.35,0.17864619678995114,0.11337191700951768,18.88098669052124,0.0
2,0,Decision Tree,0,0.35,0.21912072575017447,0.3344168556548884,0.13944792747497559,0.0
3,0,RandomForest,0,0.35,0.24982554082344732,0.30718879639731483,1.7172558307647705,0.0
4,0,AdaBoost (Discrete),0,0.35,0.19050942079553385,0.18142894934360124,97.82849836349487,0.0
5,0,AdaBoost (Real),0,0.35,0.14305652477320308,0.15478401177631057,473.2872459888458,0.0
6,0,Logistic Regression (Penalty = L2),0,0.35,0.23866015352407538,0.2921736616479392,3.9899768829345703,0.0
7,0,Naive Bayes,0,0.35,0.05722260990928123,0.3018056141499027,0.03516960144042969,0.0
8,0,KNeighbors Classifier,1,0.35,0.22433192686357242,0.28321223403739904,0.03183937072753906,0.0
9,0,SVC Classifier,1,0.35,0.1828410689170183,0.5991328754445572,5.821542024612427,0.0
10,0,Decision Tree,1,0.35,0.229957805907173,0.3389049529391865,0.2664616107940674,0.0
11,0,RandomForest,1,0.35,0.2489451476793249,0.1695638468433391,0.9847269058227539,0.0
12,0,AdaBoost (Discrete),1,0.35,0.21870604781997188,0.1475828304072129,86.33295178413391,0.0
13,0,AdaBoost (Real),1,0.35,0.17580872011251758,0.1980801382623598,202.8673255443573,0.0
14,0,Logistic Regression (Penalty = L2),1,0.35,0.23417721518987342,0.18317021369920444,4.608413219451904,0.0
15,0,Naive Bayes,1,0.35,0.08790436005625879,0.5473148372425565,0.6009411811828613,0.0
16,0,KNeighbors Classifier,2,0.35,0.20538243626062322,0.35913154163067085,0.7152202129364014,0.0
17,0,SVC Classifier,2,0.35,0.19475920679886685,0.6422002450787708,15.666600704193115,0.0
18,0,Decision Tree,2,0.35,0.2245042492917847,0.33228434247834815,0.23235011100769043,0.0
19,0,RandomForest,2,0.35,0.24645892351274787,0.3373558643088899,1.2518303394317627,0.0
20,0,AdaBoost (Discrete),2,0.35,0.20679886685552407,0.18637195988239877,84.97037100791931,0.0
21,0,AdaBoost (Real),2,0.35,0.11968838526912182,0.12465539447675478,230.04867506027222,0.0
22,0,Logistic Regression (Penalty = L2),2,0.35,0.24858356940509915,0.36471773630864923,4.033905267715454,0.0
23,0,Naive Bayes,2,0.35,0.06869688385269122,0.3265271302873107,0.4689300060272217,0.0
24,1,KNeighbors Classifier,0,0.35,0.21284019539427773,0.29773785630371424,0.5755081176757812,0.0
25,1,SVC Classifier,0,0.35,0.16050244242847173,1.0,16.437755346298218,0.0
26,1,Decision Tree,0,0.35,0.19888346127006282,0.26649204684716765,0.5068213939666748,0.0
27,1,RandomForest,0,0.35,0.2449406838799721,0.30410263448227576,1.5870559215545654,0.0
28,1,AdaBoost (Discrete),0,0.35,0.16957431960921143,0.20890159423450888,119.40996503829956,0.0
29,1,AdaBoost (Real),0,0.35,0.1688764829030007,0.1938757234865298,257.6961290836334,0.0
30,1,Logistic Regression (Penalty = L2),0,0.35,0.23517096999302164,0.2049908288087232,5.494485378265381,0.0
31,1,Naive Bayes,0,0.35,0.19120725750174458,0.3729663148621351,0.6196999549865723,0.0
32,1,KNeighbors Classifier,1,0.35,0.22362869198312235,0.3008552347689894,0.6021804809570312,0.0
33,1,SVC Classifier,1,0.35,0.1617440225035162,1.0,17.035661220550537,0.0
34,1,Decision Tree,1,0.35,0.22081575246132207,0.30599025883244485,0.48594093322753906,0.0
35,1,RandomForest,1,0.35,0.2580872011251758,0.19677253895131294,1.6036806106567383,0.0
36,1,AdaBoost (Discrete),1,0.35,0.21729957805907174,0.25603779517140646,128.75640439987183,0.0
37,1,AdaBoost (Real),1,0.35,0.19338959212376933,0.22769287000709398,302.6630837917328,0.0
38,1,Logistic Regression (Penalty = L2),1,0.35,0.2489451476793249,0.16638619257964266,6.155018091201782,0.0
39,1,Naive Bayes,1,0.35,0.2538677918424754,0.5724403438049817,0.6931064128875732,0.0
40,1,KNeighbors Classifier,2,0.35,0.2528328611898017,0.3890716060023199,0.8631298542022705,0.0
41,1,SVC Classifier,2,0.35,0.1621813031161473,1.0,20.38361096382141,0.0
42,1,Decision Tree,2,0.35,0.21600566572237961,0.30348817245952536,0.552168607711792,0.0
43,1,RandomForest,2,0.35,0.26487252124645894,0.2955049076361219,1.902649164199829,0.0
44,1,AdaBoost (Discrete),2,0.35,0.20325779036827196,0.23949893291067295,142.28684258460999,0.0
45,1,AdaBoost (Real),2,0.35,0.19688385269121814,0.3282474409509493,328.8488805294037,0.0
46,1,Logistic Regression (Penalty = L2),2,0.35,0.24220963172804533,0.17023044808687282,6.664777755737305,0.0
47,1,Naive Bayes,2,0.35,0.26062322946175637,0.5390836938606488,0.7721261978149414,0.0
48,2,KNeighbors Classifier,0,0.35,0.23517096999302164,0.31896166696900374,0.7860801219940186,0.0
49,2,SVC Classifier,0,0.35,0.16050244242847173,1.0,20.790712594985962,0.0
50,2,Decision Tree,0,0.35,0.19818562456385205,0.2548199033444835,0.6066575050354004,0.0
51,2,RandomForest,0,0.35,0.23935799023028612,0.33178030355834665,1.7274389266967773,0.0
52,2,AdaBoost (Discrete),0,0.35,0.19120725750174458,0.22133912206728984,135.30919480323792,0.0
53,2,AdaBoost (Real),0,0.35,0.17306350314026517,0.1882980418266038,322.388623714447,0.0
54,2,Logistic Regression (Penalty = L2),0,0.35,0.22819260293091417,0.23105913056721838,6.953826904296875,0.0
55,2,Naive Bayes,0,0.35,0.2107466852756455,0.3604063667018723,0.67940354347229,0.0
56,2,KNeighbors Classifier,1,0.35,0.2271448663853727,0.2974200297966054,1.0342497825622559,0.0
57,2,SVC Classifier,1,0.35,0.1617440225035162,1.0,23.386446952819824,0.0
58,2,Decision Tree,1,0.35,0.19198312236286919,0.29489798482964186,0.5481626987457275,0.0
59,2,RandomForest,1,0.35,0.2559774964838256,0.30130695958603276,2.0233147144317627,0.0
60,2,AdaBoost (Discrete),1,0.35,0.18424753867791843,0.23654882144725178,147.67874360084534,0.0
61,2,AdaBoost (Real),1,0.35,0.24824191279887484,0.2739889163044151,345.94083738327026,0.0
62,2,Logistic Regression (Penalty = L2),1,0.35,0.24120956399437413,0.16956046701069744,7.145706415176392,0.0
63,2,Naive Bayes,1,0.35,0.26441631504922647,0.5417402777714584,0.814295768737793,0.0
64,2,KNeighbors Classifier,2,0.35,0.23937677053824363,0.3766260539888574,1.1467573642730713,0.0
65,2,SVC Classifier,2,0.35,0.1621813031161473,1.0,23.05515456199646,0.0
66,2,Decision Tree,2,0.35,0.20538243626062322,0.2899611032890673,0.4700005054473877,0.0
67,2,RandomForest,2,0.35,0.2719546742209632,0.32598092612735496,2.149085283279419,0.0
68,2,AdaBoost (Discrete),2,0.35,0.19688385269121814,0.23417660453415556,159.8557481765747,0.0
69,2,AdaBoost (Real),2,0.35,0.23796033994334279,0.3687361373187293,317.65945863723755,0.0
70,2,Logistic Regression (Penalty = L2),2,0.35,0.23725212464589235,0.365718758549617,6.375128984451294,0.0
71,2,Naive Bayes,2,0.35,0.26203966005665724,0.5164465761446146,0.6293315887451172,0.0
72,3,KNeighbors Classifier,0,0.35,0.21423586880669923,0.29185429485599906,0.619457483291626,0.0
73,3,SVC Classifier,0,0.35,0.16050244242847173,1.0,19.00090503692627,0.0
74,3,Decision Tree,0,0.35,0.2198185624563852,0.34765790303008515,0.28409552574157715,0.0
75,3,RandomForest,0,0.35,0.23447313328681088,0.27895610607479004,1.7237274646759033,0.0
76,3,AdaBoost (Discrete),0,0.35,0.1688764829030007,0.20492884217791482,113.55909466743469,0.0
77,3,AdaBoost (Real),0,0.35,0.15701325889741802,0.1679521937782571,276.344957113266,0.0
78,3,Logistic Regression (Penalty = L2),0,0.35,0.2274947662247034,0.2435869884677564,3.1514039039611816,0.0
79,3,Naive Bayes,0,0.35,0.2449406838799721,0.39425783055700653,0.42518091201782227,0.0
80,3,KNeighbors Classifier,1,0.35,0.21378340365682139,0.2621346894449708,0.43865203857421875,0.0
81,3,SVC Classifier,1,0.35,0.1617440225035162,1.0,15.695136308670044,0.0
82,3,Decision Tree,1,0.35,0.24472573839662448,0.2891820304215893,0.2832682132720947,0.0
83,3,RandomForest,1,0.35,0.24331926863572434,0.213922202885528,1.3629043102264404,0.0
84,3,AdaBoost (Discrete),1,0.35,0.2060478199718706,0.1288554306798215,93.71826195716858,0.0
85,3,AdaBoost (Real),1,0.35,0.22925457102672292,0.2236480626605215,258.4186444282532,0.0
86,3,Logistic Regression (Penalty = L2),1,0.35,0.23417721518987342,0.22162512864590636,4.127839803695679,0.0
87,3,Naive Bayes,1,0.35,0.2805907172995781,0.5105831687665247,0.4479951858520508,0.0
88,3,KNeighbors Classifier,2,0.35,0.22096317280453256,0.3029558721793172,0.44524574279785156,0.0
89,3,SVC Classifier,2,0.35,0.1621813031161473,1.0,17.972774267196655,0.0
90,3,Decision Tree,2,0.35,0.21600566572237961,0.2813182068625159,0.15691518783569336,0.0
91,3,RandomForest,2,0.35,0.25991501416430596,0.4444884031336144,1.7493081092834473,0.0
92,3,AdaBoost (Discrete),2,0.35,0.21246458923512748,0.28803174226478734,105.14017105102539,0.0
93,3,AdaBoost (Real),2,0.35,0.20042492917847027,0.21596777015230664,278.5383298397064,0.0
94,3,Logistic Regression (Penalty = L2),2,0.35,0.23725212464589235,0.30159776382289627,4.341000080108643,0.0
95,3,Naive Bayes,2,0.35,0.29674220963172804,0.5425511427483857,0.4600996971130371,0.0
96,4,KNeighbors Classifier,0,0.35,0.21423586880669923,0.29185429485599906,0.4570424556732178,0.0
97,4,SVC Classifier,0,0.35,0.16050244242847173,1.0,18.3057701587677,0.0
98,4,Decision Tree,0,0.35,0.2198185624563852,0.34765790303008515,0.285891056060791,0.0
99,4,RandomForest,0,0.35,0.23447313328681088,0.27895610607479004,1.7936835289001465,0.0
100,4,AdaBoost (Discrete),0,0.35,0.1688764829030007,0.20492884217791482,109.60001134872437,0.0
101,4,AdaBoost (Real),0,0.35,0.15701325889741802,0.1679521937782571,251.3288767337799,0.0
102,4,Logistic Regression (Penalty = L2),0,0.35,0.2274947662247034,0.2435869884677564,3.575868606567383,0.0
103,4,Naive Bayes,0,0.35,0.2449406838799721,0.39425783055700653,0.6334042549133301,0.0
104,4,KNeighbors Classifier,1,0.35,0.21378340365682139,0.2621346894449708,0.46672797203063965,0.0
105,4,SVC Classifier,1,0.35,0.1617440225035162,1.0,17.206371307373047,0.0
106,4,Decision Tree,1,0.35,0.24472573839662448,0.2891820304215893,0.14575910568237305,0.0
107,4,RandomForest,1,0.35,0.24331926863572434,0.213922202885528,1.442826747894287,0.0
108,4,AdaBoost (Discrete),1,0.35,0.2060478199718706,0.1288554306798215,100.28668737411499,0.0
109,4,AdaBoost (Real),1,0.35,0.22925457102672292,0.2236480626605215,258.25072264671326,0.0
110,4,Logistic Regression (Penalty = L2),1,0.35,0.23417721518987342,0.22162512864590636,3.4898736476898193,0.0
111,4,Naive Bayes,1,0.35,0.2805907172995781,0.5105831687665247,0.40962743759155273,0.0
112,4,KNeighbors Classifier,2,0.35,0.22096317280453256,0.3029558721793172,0.6277785301208496,0.0
113,4,SVC Classifier,2,0.35,0.1621813031161473,1.0,20.062138080596924,0.0
114,4,Decision Tree,2,0.35,0.21600566572237961,0.2813182068625159,0.384920597076416,0.0
115,4,RandomForest,2,0.35,0.25991501416430596,0.4444884031336144,1.5806729793548584,0.0
116,4,AdaBoost (Discrete),2,0.35,0.21246458923512748,0.28803174226478734,110.80405974388123,0.0
117,4,AdaBoost (Real),2,0.35,0.20042492917847027,0.21596777015230664,251.62970185279846,0.0
118,4,Logistic Regression (Penalty = L2),2,0.35,0.23725212464589235,0.30159776382289627,3.9933114051818848,0.0
119,4,Naive Bayes,2,0.35,0.29674220963172804,0.5425511427483857,0.47997570037841797,0.0
120,5,KNeighbors Classifier,0,0.35,0.21702721563154223,0.32626539731785764,0.7719507217407227,0.0
121,5,SVC Classifier,0,0.35,0.16050244242847173,1.0,21.139621019363403,0.0
122,5,Decision Tree,0,0.35,0.20237264480111655,0.3127551509015684,0.41727232933044434,0.0
123,5,RandomForest,0,0.35,0.2226099092812282,0.36747225500153996,1.7921764850616455,0.0
124,5,AdaBoost (Discrete),0,0.35,0.16957431960921143,0.20449508842142664,125.06467986106873,0.0
125,5,AdaBoost (Real),0,0.35,0.18492672714584787,0.14123398003392076,291.85637497901917,0.0
126,5,Logistic Regression (Penalty = L2),0,0.35,0.23447313328681088,0.222178850587473,5.4214255809783936,0.0
127,5,Naive Bayes,0,0.35,0.2030704815073273,0.35108587135709163,0.5752522945404053,0.0
128,5,KNeighbors Classifier,1,0.35,0.21167369901547117,0.27761226948702405,0.7234022617340088,0.0
129,5,SVC Classifier,1,0.35,0.1617440225035162,1.0,19.163561582565308,0.0
130,5,Decision Tree,1,0.35,0.22573839662447256,0.27597637835210515,0.3098568916320801,0.0
131,5,RandomForest,1,0.35,0.26652601969057665,0.2992558196654735,1.6201307773590088,0.0
132,5,AdaBoost (Discrete),1,0.35,0.16455696202531644,0.2009567877779056,118.31747341156006,0.0
133,5,AdaBoost (Real),1,0.35,0.2468354430379747,0.38404445647195457,272.93212151527405,0.0
134,5,Logistic Regression (Penalty = L2),1,0.35,0.24964838255977498,0.3265501040375636,4.723400115966797,0.0
135,5,Naive Bayes,1,0.35,0.26933895921237694,0.5459682269188599,0.6788225173950195,0.0
136,5,KNeighbors Classifier,2,0.35,0.23371104815864022,0.3772299836661614,0.6822810173034668,0.0
137,5,SVC Classifier,2,0.35,0.1621813031161473,1.0,18.43999409675598,0.0
138,5,Decision Tree,2,0.35,0.20042492917847027,0.29332815700634174,0.2611734867095947,0.0
139,5,RandomForest,2,0.35,0.2556657223796034,0.3077369500082707,1.3098948001861572,0.0
140,5,AdaBoost (Discrete),2,0.35,0.19688385269121814,0.19900115728191223,126.25397109985352,0.0
141,5,AdaBoost (Real),2,0.35,0.19759206798866855,0.3850170419275805,1300.8197736740112,0.0
142,5,Logistic Regression (Penalty = L2),2,0.35,0.2415014164305949,0.2248434548459382,4.64080548286438,0.0
143,5,Naive Bayes,2,0.35,0.2698300283286119,0.5517834373534724,0.4693911075592041,0.0
144,6,KNeighbors Classifier,0,0.35,0.21702721563154223,0.32626539731785764,0.713050127029419,0.0
145,6,SVC Classifier,0,0.35,0.16050244242847173,1.0,14.973829507827759,0.0
146,6,Decision Tree,0,0.35,0.209351011863224,0.3048610290353443,0.2329394817352295,0.0
147,6,RandomForest,0,0.35,0.2226099092812282,0.36747225500153996,1.1762115955352783,0.0
148,6,AdaBoost (Discrete),0,0.35,0.16957431960921143,0.20449508842142664,96.09496831893921,0.0
149,6,AdaBoost (Real),0,0.35,0.18283321702721564,0.1405156549196836,212.75593829154968,0.0
150,6,Logistic Regression (Penalty = L2),0,0.35,0.23447313328681088,0.222178850587473,4.527922630310059,0.0
151,6,Naive Bayes,0,0.35,0.2030704815073273,0.35108587135709163,0.4291982650756836,0.0
152,6,KNeighbors Classifier,1,0.35,0.21167369901547117,0.27761226948702405,0.44275403022766113,0.0
153,6,SVC Classifier,1,0.35,0.1617440225035162,1.0,14.316318273544312,0.0
154,6,Decision Tree,1,0.35,0.21448663853727146,0.265196315395414,0.22222638130187988,0.0
155,6,RandomForest,1,0.35,0.26652601969057665,0.2992558196654735,1.256241798400879,0.0
156,6,AdaBoost (Discrete),1,0.35,0.16385372714486637,0.201016738765163,95.89398264884949,0.0
157,6,AdaBoost (Real),1,0.35,0.2468354430379747,0.38404445647195457,211.51797771453857,0.0
158,6,Logistic Regression (Penalty = L2),1,0.35,0.24964838255977498,0.3265501040375636,3.660480260848999,0.0
159,6,Naive Bayes,1,0.35,0.26933895921237694,0.5459682269188599,0.4419369697570801,0.0
160,6,KNeighbors Classifier,2,0.35,0.23371104815864022,0.3772299836661614,0.5046851634979248,0.0
161,6,SVC Classifier,2,0.35,0.1621813031161473,1.0,13.809237718582153,0.0
162,6,Decision Tree,2,0.35,0.20325779036827196,0.29327670777527143,0.21729826927185059,0.0
163,6,RandomForest,2,0.35,0.2556657223796034,0.3077369500082707,1.1960692405700684,0.0
164,6,AdaBoost (Discrete),2,0.35,0.19688385269121814,0.19900115728191223,87.81946659088135,0.0
165,6,AdaBoost (Real),2,0.35,0.19759206798866855,0.3850170419275805,191.43308472633362,0.0
166,6,Logistic Regression (Penalty = L2),2,0.35,0.2415014164305949,0.2248434548459382,3.4113316535949707,0.0
167,6,Naive Bayes,2,0.35,0.2698300283286119,0.5517834373534724,0.36498117446899414,0.0
168,7,KNeighbors Classifier,0,0.35,0.21004884856943476,0.3076635320003892,1.1993300914764404,0.0
169,7,SVC Classifier,0,0.35,0.19539427773900908,0.43949230244228793,14.885907649993896,0.0
170,7,Decision Tree,0,0.35,0.19678995115143055,0.3099966393102642,0.28266072273254395,0.0
171,7,RandomForest,0,0.35,0.23098394975575715,0.367738441027422,1.0567505359649658,0.0
172,7,AdaBoost (Discrete),0,0.35,0.15631542219120725,0.19351416732702537,95.17079186439514,0.0
173,7,AdaBoost (Real),0,0.35,0.17376133984647593,0.13100013322839266,203.4981083869934,0.0
174,7,Logistic Regression (Penalty = L2),0,0.35,0.24075366364270762,0.1699372590313409,5.8779520988464355,0.0
175,7,Naive Bayes,0,0.35,0.09839497557571528,0.40851115852220554,0.5097455978393555,0.0
176,7,KNeighbors Classifier,1,0.35,0.22292545710267228,0.3531045651440139,1.3164079189300537,0.0
177,7,SVC Classifier,1,0.35,0.20464135021097046,0.459423176883338,15.91512656211853,0.0
178,7,Decision Tree,1,0.35,0.2158931082981716,0.3213548163621473,0.2876780033111572,0.0
179,7,RandomForest,1,0.35,0.2559774964838256,0.2814551943670131,1.0586931705474854,0.0
180,7,AdaBoost (Discrete),1,0.35,0.18354430379746836,0.21790130768250465,98.21295738220215,0.0
181,7,AdaBoost (Real),1,0.35,0.24824191279887484,0.2739889163044151,189.788081407547,0.0
182,7,Logistic Regression (Penalty = L2),1,0.35,0.2489451476793249,0.2758113321834166,5.400759220123291,0.0
183,7,Naive Bayes,1,0.35,0.11673699015471167,0.334785510561329,0.5169477462768555,0.0
184,7,KNeighbors Classifier,2,0.35,0.2415014164305949,0.3471840695710379,1.2952079772949219,0.0
185,7,SVC Classifier,2,0.35,0.2103399433427762,0.37878989651237976,14.889503240585327,0.0
186,7,Decision Tree,2,0.35,0.2245042492917847,0.34245437891232666,0.16646671295166016,0.0
187,7,RandomForest,2,0.35,0.2577903682719547,0.26166041147164715,1.0659687519073486,0.0
188,7,AdaBoost (Discrete),2,0.35,0.20113314447592068,0.22278973985916528,96.03618240356445,0.0
189,7,AdaBoost (Real),2,0.35,0.23796033994334279,0.3687361373187293,181.25072741508484,0.0
190,7,Logistic Regression (Penalty = L2),2,0.35,0.24008498583569404,0.196244128204179,4.803269624710083,0.0
191,7,Naive Bayes,2,0.35,0.09773371104815864,0.43388068716559697,0.5056335926055908,0.0
192,8,KNeighbors Classifier,0,0.35,0.21423586880669923,0.29185429485599906,0.34314417839050293,0.0
193,8,SVC Classifier,0,0.35,0.16050244242847173,1.0,10.319275379180908,0.0
194,8,Decision Tree,0,0.35,0.2198185624563852,0.34765790303008515,0.16757607460021973,0.0
195,8,RandomForest,0,0.35,0.23447313328681088,0.27895610607479004,0.9731166362762451,0.0
196,8,AdaBoost (Discrete),0,0.35,0.1688764829030007,0.20492884217791482,58.88326549530029,0.0
197,8,AdaBoost (Real),0,0.35,0.15701325889741802,0.1679521937782571,140.1619577407837,0.0
198,8,Logistic Regression (Penalty = L2),0,0.35,0.2274947662247034,0.2435869884677564,1.8379950523376465,0.0
199,8,Naive Bayes,0,0.35,0.2449406838799721,0.39425783055700653,0.2784106731414795,0.0
200,8,KNeighbors Classifier,1,0.35,0.21378340365682139,0.2621346894449708,0.22579741477966309,0.0
201,8,SVC Classifier,1,0.35,0.1617440225035162,1.0,9.17379879951477,0.0
202,8,Decision Tree,1,0.35,0.24472573839662448,0.2891820304215893,0.0750112533569336,0.0
203,8,RandomForest,1,0.35,0.24331926863572434,0.213922202885528,0.7923071384429932,0.0
204,8,AdaBoost (Discrete),1,0.35,0.2060478199718706,0.1288554306798215,52.97947144508362,0.0
205,8,AdaBoost (Real),1,0.35,0.22925457102672292,0.2236480626605215,136.1735429763794,0.0
206,8,Logistic Regression (Penalty = L2),1,0.35,0.23417721518987342,0.22162512864590636,2.1632089614868164,0.0
207,8,Naive Bayes,1,0.35,0.2805907172995781,0.5105831687665247,0.3088984489440918,0.0
208,8,KNeighbors Classifier,2,0.35,0.22096317280453256,0.3029558721793172,0.31204652786254883,0.0
209,8,SVC Classifier,2,0.35,0.1621813031161473,1.0,9.677732944488525,0.0
210,8,Decision Tree,2,0.35,0.21600566572237961,0.2813182068625159,0.15454983711242676,0.0
211,8,RandomForest,2,0.35,0.25991501416430596,0.4444884031336144,0.8424468040466309,0.0
212,8,AdaBoost (Discrete),2,0.35,0.21246458923512748,0.28803174226478734,51.79885172843933,0.0
213,8,AdaBoost (Real),2,0.35,0.20042492917847027,0.21596777015230664,127.51775765419006,0.0
214,8,Logistic Regression (Penalty = L2),2,0.35,0.23725212464589235,0.30159776382289627,1.7401018142700195,0.0
215,8,Naive Bayes,2,0.35,0.29674220963172804,0.5425511427483857,0.21339988708496094,0.0
