,feat_set_id,classifier,fold_id,feat_th,score,geo_score,exec_t,geo_score_woz
0,0,KNeighbors Classifier,0,1.0,0.30400736987563337,0.20606384085864732,13.758682012557983,0.0
1,0,SVC Classifier,0,1.0,0.5287885766927684,0.643494937720922,41.21574854850769,0.0
2,0,Decision Tree,0,1.0,0.308152924919392,0.3162403473217046,0.5999128818511963,0.0
3,0,RandomForest,0,1.0,0.48687240902809764,0.6421364736725443,1.786761999130249,0.0
4,0,AdaBoost (Discrete),0,1.0,0.1966835559649931,0.2269574290211049,183.28302264213562,0.2269574290211049
5,0,AdaBoost (Real),0,1.0,0.11377245508982035,0.09392096720415886,320.1228003501892,0.09392096720415886
6,0,Logistic Regression (Penalty = L2),0,1.0,0.38415476738830034,0.1946101550567088,3.7654612064361572,0.0
7,0,Naive Bayes,0,1.0,0.190234914785813,0.3052917468849531,0.5605025291442871,0.0
8,0,KNeighbors Classifier,1,1.0,0.42738589211618255,0.28729692813960656,7.6745994091033936,0.0
9,0,SVC Classifier,1,1.0,0.4412171507607192,0.14948380152256274,39.013206481933594,0.0
10,0,Decision Tree,1,1.0,0.42000922083909636,0.18789393743725083,0.5131266117095947,0.0
11,0,RandomForest,1,1.0,0.4831719686491471,0.5810555082644082,2.081378698348999,0.0
12,0,AdaBoost (Discrete),1,1.0,0.3900414937759336,0.3922616972541294,163.25474882125854,0.0
13,0,AdaBoost (Real),1,1.0,0.38819732595666206,0.18063839716441826,231.95111656188965,0.0
14,0,Logistic Regression (Penalty = L2),1,1.0,0.5020746887966805,0.34662859352294384,3.5780649185180664,0.0
15,0,Naive Bayes,1,1.0,0.4476717381281697,0.3755129818879039,0.25085902214050293,0.0
16,0,KNeighbors Classifier,2,1.0,0.41762805722196583,0.2598729725606528,6.871981859207153,0.0
17,0,SVC Classifier,2,1.0,0.4360867558837102,1.0,35.19111132621765,0.0
18,0,Decision Tree,2,1.0,0.41716658975542226,0.32017913372370643,0.49129700660705566,0.0
19,0,RandomForest,2,1.0,0.4688509460083064,0.35370048999243775,1.6840510368347168,0.0
20,0,AdaBoost (Discrete),2,1.0,0.3613290263036456,0.3581483494682314,157.57535099983215,0.0
21,0,AdaBoost (Real),2,1.0,0.3124134748500231,0.2840888716641332,225.62185072898865,0.0
22,0,Logistic Regression (Penalty = L2),2,1.0,0.509460083064144,0.18909016338736234,4.018839120864868,0.0
23,0,Naive Bayes,2,1.0,0.3511767420396862,0.18731636249094755,0.4219357967376709,0.0
24,1,KNeighbors Classifier,0,1.0,0.30400736987563337,0.20606384085864732,12.947481870651245,0.0
25,1,SVC Classifier,0,1.0,0.5287885766927684,0.643494937720922,43.253249406814575,0.0
26,1,Decision Tree,0,1.0,0.22339935513588208,0.21205603946540708,0.9285004138946533,0.21205603946540708
27,1,RandomForest,0,1.0,0.48687240902809764,0.6421364736725443,2.492684841156006,0.0
28,1,AdaBoost (Discrete),0,1.0,0.1966835559649931,0.2269574290211049,173.0906686782837,0.2269574290211049
29,1,AdaBoost (Real),0,1.0,0.11377245508982035,0.09392096720415886,240.54658031463623,0.09392096720415886
30,1,Logistic Regression (Penalty = L2),0,1.0,0.38415476738830034,0.1946101550567088,3.972561836242676,0.0
31,1,Naive Bayes,0,1.0,0.190234914785813,0.3052917468849531,0.4162912368774414,0.0
32,1,KNeighbors Classifier,1,1.0,0.42738589211618255,0.28729692813960656,8.347269773483276,0.0
33,1,SVC Classifier,1,1.0,0.4412171507607192,0.14948380152256274,40.307844400405884,0.0
34,1,Decision Tree,1,1.0,0.42047026279391425,0.3045796379556431,0.499713659286499,0.0
35,1,RandomForest,1,1.0,0.4831719686491471,0.5810555082644082,1.6080148220062256,0.0
36,1,AdaBoost (Discrete),1,1.0,0.3900414937759336,0.3922616972541294,176.77259612083435,0.0
37,1,AdaBoost (Real),1,1.0,0.3835869064084832,0.16481032132982265,254.68982696533203,0.0
38,1,Logistic Regression (Penalty = L2),1,1.0,0.5020746887966805,0.34662859352294384,3.267825126647949,0.0
39,1,Naive Bayes,1,1.0,0.4476717381281697,0.3755129818879039,0.36446142196655273,0.0
40,1,KNeighbors Classifier,2,1.0,0.41762805722196583,0.2598729725606528,8.966673135757446,0.0
41,1,SVC Classifier,2,1.0,0.4360867558837102,1.0,42.020917654037476,0.0
42,1,Decision Tree,2,1.0,0.4153207198892478,0.2743598351103983,0.45239782333374023,0.0
43,1,RandomForest,2,1.0,0.4688509460083064,0.35370048999243775,0.8955061435699463,0.0
44,1,AdaBoost (Discrete),2,1.0,0.3613290263036456,0.3581483494682314,144.41546869277954,0.0
45,1,AdaBoost (Real),2,1.0,0.3124134748500231,0.2840888716641332,203.2774121761322,0.0
46,1,Logistic Regression (Penalty = L2),2,1.0,0.509460083064144,0.18909016338736234,3.919783592224121,0.0
47,1,Naive Bayes,2,1.0,0.3511767420396862,0.18731636249094755,0.42438435554504395,0.0
48,2,KNeighbors Classifier,0,1.0,0.30400736987563337,0.20606384085864732,11.616143226623535,0.0
49,2,SVC Classifier,0,1.0,0.5287885766927684,0.643494937720922,37.83929681777954,0.0
50,2,Decision Tree,0,1.0,0.308152924919392,0.2681295968152606,0.41423463821411133,0.0
51,2,RandomForest,0,1.0,0.48687240902809764,0.6421364736725443,1.773547887802124,0.0
52,2,AdaBoost (Discrete),0,1.0,0.1971441731920774,0.22786032623644464,168.0020616054535,0.22786032623644464
53,2,AdaBoost (Real),0,1.0,0.11377245508982035,0.09392096720415886,209.7666530609131,0.09392096720415886
54,2,Logistic Regression (Penalty = L2),0,1.0,0.38415476738830034,0.1946101550567088,2.9124386310577393,0.0
55,2,Naive Bayes,0,1.0,0.190234914785813,0.3052917468849531,0.34084463119506836,0.0
56,2,KNeighbors Classifier,1,1.0,0.42738589211618255,0.28729692813960656,6.209558486938477,0.0
57,2,SVC Classifier,1,1.0,0.4412171507607192,0.14948380152256274,31.204024076461792,0.0
58,2,Decision Tree,1,1.0,0.4144767173812817,0.3335983014666414,0.5745162963867188,0.0
59,2,RandomForest,1,1.0,0.4831719686491471,0.5810555082644082,1.3789944648742676,0.0
60,2,AdaBoost (Discrete),1,1.0,0.3900414937759336,0.3922616972541294,159.92657256126404,0.0
61,2,AdaBoost (Real),1,1.0,0.3835869064084832,0.16481032132982265,240.94275617599487,0.0
62,2,Logistic Regression (Penalty = L2),1,1.0,0.5020746887966805,0.34662859352294384,3.761784553527832,0.0
63,2,Naive Bayes,1,1.0,0.4476717381281697,0.3755129818879039,0.4237184524536133,0.0
64,2,KNeighbors Classifier,2,1.0,0.41762805722196583,0.2598729725606528,8.236592054367065,0.0
65,2,SVC Classifier,2,1.0,0.4360867558837102,1.0,42.018495082855225,0.0
66,2,Decision Tree,2,1.0,0.3894785417628057,0.29419204003800176,0.588238000869751,0.0
67,2,RandomForest,2,1.0,0.4688509460083064,0.35370048999243775,1.613602638244629,0.0
68,2,AdaBoost (Discrete),2,1.0,0.3613290263036456,0.3581483494682314,185.4556746482849,0.0
69,2,AdaBoost (Real),2,1.0,0.3124134748500231,0.2840888716641332,256.47682094573975,0.0
70,2,Logistic Regression (Penalty = L2),2,1.0,0.509460083064144,0.18909016338736234,3.8941640853881836,0.0
71,2,Naive Bayes,2,1.0,0.3511767420396862,0.18731636249094755,0.4171006679534912,0.0
72,3,KNeighbors Classifier,0,1.0,0.30400736987563337,0.20606384085864732,12.426265478134155,0.0
73,3,SVC Classifier,0,1.0,0.5287885766927684,0.643494937720922,40.706149101257324,0.0
74,3,Decision Tree,0,1.0,0.2528788576692768,0.2987019925106609,0.3794984817504883,0.0
75,3,RandomForest,0,1.0,0.48687240902809764,0.6421364736725443,1.544844388961792,0.0
76,3,AdaBoost (Discrete),0,1.0,0.19806540764624597,0.2281893691613356,163.52817821502686,0.2281893691613356
77,3,AdaBoost (Real),0,1.0,0.11377245508982035,0.09392096720415886,256.9857656955719,0.09392096720415886
78,3,Logistic Regression (Penalty = L2),0,1.0,0.38415476738830034,0.1946101550567088,3.7167651653289795,0.0
79,3,Naive Bayes,0,1.0,0.190234914785813,0.3052917468849531,0.4309535026550293,0.0
80,3,KNeighbors Classifier,1,1.0,0.42738589211618255,0.28729692813960656,8.169946670532227,0.0
81,3,SVC Classifier,1,1.0,0.4412171507607192,0.14948380152256274,39.131447076797485,0.0
82,3,Decision Tree,1,1.0,0.41770401106500693,0.27569263733359584,0.5762979984283447,0.0
83,3,RandomForest,1,1.0,0.4831719686491471,0.5810555082644082,1.6023035049438477,0.0
84,3,AdaBoost (Discrete),1,1.0,0.3900414937759336,0.3922616972541294,196.60186648368835,0.0
85,3,AdaBoost (Real),1,1.0,0.3831258644536653,0.16422793813377337,282.2784996032715,0.0
86,3,Logistic Regression (Penalty = L2),1,1.0,0.5020746887966805,0.34662859352294384,4.288041591644287,0.0
87,3,Naive Bayes,1,1.0,0.4476717381281697,0.3755129818879039,0.5055065155029297,0.0
88,3,KNeighbors Classifier,2,1.0,0.41762805722196583,0.2598729725606528,10.092668294906616,0.0
89,3,SVC Classifier,2,1.0,0.4360867558837102,1.0,52.76064896583557,0.0
90,3,Decision Tree,2,1.0,0.3885556068297185,0.28641258384911283,1.245502233505249,0.0
91,3,RandomForest,2,1.0,0.4688509460083064,0.35370048999243775,0.800081729888916,0.0
92,3,AdaBoost (Discrete),2,1.0,0.3613290263036456,0.3581483494682314,210.5147843360901,0.0
93,3,AdaBoost (Real),2,1.0,0.3124134748500231,0.2840888716641332,297.8326094150543,0.0
94,3,Logistic Regression (Penalty = L2),2,1.0,0.509460083064144,0.18909016338736234,4.722041606903076,0.0
95,3,Naive Bayes,2,1.0,0.3511767420396862,0.18731636249094755,0.4920785427093506,0.0
96,4,KNeighbors Classifier,0,1.0,0.30400736987563337,0.20606384085864732,14.33070993423462,0.0
97,4,SVC Classifier,0,1.0,0.5287885766927684,0.643494937720922,45.77751278877258,0.0
98,4,Decision Tree,0,1.0,0.3371718102257024,0.25986722811793916,0.6416037082672119,0.0
99,4,RandomForest,0,1.0,0.48687240902809764,0.6421364736725443,1.942239761352539,0.0
100,4,AdaBoost (Discrete),0,1.0,0.19760479041916168,0.22728351997192991,204.52950406074524,0.22728351997192991
101,4,AdaBoost (Real),0,1.0,0.11377245508982035,0.09392096720415886,287.9296250343323,0.09392096720415886
102,4,Logistic Regression (Penalty = L2),0,1.0,0.38415476738830034,0.1946101550567088,4.210900545120239,0.0
103,4,Naive Bayes,0,1.0,0.190234914785813,0.3052917468849531,0.30698680877685547,0.0
104,4,KNeighbors Classifier,1,1.0,0.42738589211618255,0.28729692813960656,9.367819547653198,0.0
105,4,SVC Classifier,1,1.0,0.4412171507607192,0.14948380152256274,43.20182394981384,0.0
106,4,Decision Tree,1,1.0,0.37667127708621484,0.2645871691673059,0.6210203170776367,0.0
107,4,RandomForest,1,1.0,0.4831719686491471,0.5810555082644082,1.9508686065673828,0.0
108,4,AdaBoost (Discrete),1,1.0,0.3900414937759336,0.3922616972541294,192.69046807289124,0.0
109,4,AdaBoost (Real),1,1.0,0.3831258644536653,0.16314984721810677,277.3368761539459,0.0
110,4,Logistic Regression (Penalty = L2),1,1.0,0.5020746887966805,0.34662859352294384,3.8530352115631104,0.0
111,4,Naive Bayes,1,1.0,0.4476717381281697,0.3755129818879039,0.40358448028564453,0.0
112,4,KNeighbors Classifier,2,1.0,0.41762805722196583,0.2598729725606528,8.08446216583252,0.0
113,4,SVC Classifier,2,1.0,0.4360867558837102,1.0,40.545764684677124,0.0
114,4,Decision Tree,2,1.0,0.373788647900323,0.24242009454770574,0.6655819416046143,0.0
115,4,RandomForest,2,1.0,0.4688509460083064,0.35370048999243775,1.6536891460418701,0.0
116,4,AdaBoost (Discrete),2,1.0,0.3613290263036456,0.3581483494682314,191.48652052879333,0.0
117,4,AdaBoost (Real),2,1.0,0.3124134748500231,0.2840888716641332,270.8560495376587,0.0
118,4,Logistic Regression (Penalty = L2),2,1.0,0.509460083064144,0.18909016338736234,3.994100570678711,0.0
119,4,Naive Bayes,2,1.0,0.3511767420396862,0.18731636249094755,0.4564173221588135,0.0
120,5,KNeighbors Classifier,0,1.0,0.30400736987563337,0.20606384085864732,12.919427394866943,0.0
121,5,SVC Classifier,0,1.0,0.5287885766927684,0.643494937720922,41.36849570274353,0.0
122,5,Decision Tree,0,1.0,0.2745278673422386,0.18358252114267484,0.6936507225036621,0.18358252114267484
123,5,RandomForest,0,1.0,0.48687240902809764,0.6421364736725443,1.7629215717315674,0.0
124,5,AdaBoost (Discrete),0,1.0,0.1971441731920774,0.22786032623644464,194.69424200057983,0.22786032623644464
125,5,AdaBoost (Real),0,1.0,0.11377245508982035,0.09392096720415886,273.38261556625366,0.09392096720415886
126,5,Logistic Regression (Penalty = L2),0,1.0,0.38415476738830034,0.1946101550567088,3.5293922424316406,0.0
127,5,Naive Bayes,0,1.0,0.190234914785813,0.3052917468849531,0.3994925022125244,0.0
128,5,KNeighbors Classifier,1,1.0,0.42738589211618255,0.28729692813960656,8.415767431259155,0.0
129,5,SVC Classifier,1,1.0,0.4412171507607192,0.14948380152256274,41.779975175857544,0.0
130,5,Decision Tree,1,1.0,0.3983402489626556,0.31035294999522617,0.7382996082305908,0.0
131,5,RandomForest,1,1.0,0.4831719686491471,0.5810555082644082,1.9580974578857422,0.0
132,5,AdaBoost (Discrete),1,1.0,0.3900414937759336,0.3922616972541294,182.28618741035461,0.0
133,5,AdaBoost (Real),1,1.0,0.3835869064084832,0.16481032132982265,273.34768176078796,0.0
134,5,Logistic Regression (Penalty = L2),1,1.0,0.5020746887966805,0.34662859352294384,4.025335073471069,0.0
135,5,Naive Bayes,1,1.0,0.4476717381281697,0.3755129818879039,0.42147231101989746,0.0
136,5,KNeighbors Classifier,2,1.0,0.41762805722196583,0.2598729725606528,9.222347736358643,0.0
137,5,SVC Classifier,2,1.0,0.4360867558837102,1.0,38.17255353927612,0.0
138,5,Decision Tree,2,1.0,0.3890170742962621,0.3096029029777675,0.7664947509765625,0.0
139,5,RandomForest,2,1.0,0.4688509460083064,0.35370048999243775,1.6706187725067139,0.0
140,5,AdaBoost (Discrete),2,1.0,0.3613290263036456,0.3581483494682314,187.722660779953,0.0
141,5,AdaBoost (Real),2,1.0,0.3124134748500231,0.2840888716641332,255.26860547065735,0.0
142,5,Logistic Regression (Penalty = L2),2,1.0,0.509460083064144,0.18909016338736234,3.7844839096069336,0.0
143,5,Naive Bayes,2,1.0,0.3511767420396862,0.18731636249094755,0.5094609260559082,0.0
144,6,KNeighbors Classifier,0,1.0,0.30400736987563337,0.20606384085864732,10.686447858810425,0.0
145,6,SVC Classifier,0,1.0,0.5287885766927684,0.643494937720922,32.73181343078613,0.0
146,6,Decision Tree,0,1.0,0.2690004606172271,0.2453592981920613,0.49115753173828125,0.0
147,6,RandomForest,0,1.0,0.48687240902809764,0.6421364736725443,1.4713845252990723,0.0
148,6,AdaBoost (Discrete),0,1.0,0.1971441731920774,0.22786032623644464,171.80486035346985,0.22786032623644464
149,6,AdaBoost (Real),0,1.0,0.11377245508982035,0.09392096720415886,247.262793302536,0.09392096720415886
150,6,Logistic Regression (Penalty = L2),0,1.0,0.38415476738830034,0.1946101550567088,3.844902276992798,0.0
151,6,Naive Bayes,0,1.0,0.190234914785813,0.3052917468849531,0.47699761390686035,0.0
152,6,KNeighbors Classifier,1,1.0,0.42738589211618255,0.28729692813960656,10.38435411453247,0.0
153,6,SVC Classifier,1,1.0,0.4412171507607192,0.14948380152256274,1085.8543915748596,0.0
154,6,Decision Tree,1,1.0,0.4153988012909175,0.2863467945450788,0.4834580421447754,0.0
155,6,RandomForest,1,1.0,0.4831719686491471,0.5810555082644082,0.4856295585632324,0.0
156,6,AdaBoost (Discrete),1,1.0,0.3900414937759336,0.3922616972541294,144.394024848938,0.0
157,6,AdaBoost (Real),1,1.0,0.3831258644536653,0.16422793813377337,198.74237608909607,0.0
158,6,Logistic Regression (Penalty = L2),1,1.0,0.5020746887966805,0.34662859352294384,2.9819419384002686,0.0
159,6,Naive Bayes,1,1.0,0.4476717381281697,0.3755129818879039,0.45310115814208984,0.0
160,6,KNeighbors Classifier,2,1.0,0.41762805722196583,0.2598729725606528,5.847938776016235,0.0
161,6,SVC Classifier,2,1.0,0.4360867558837102,1.0,31.416452169418335,0.0
162,6,Decision Tree,2,1.0,0.39455468389478543,0.28296560224909606,0.4985623359680176,0.28296560224909606
163,6,RandomForest,2,1.0,0.4688509460083064,0.35370048999243775,1.27130126953125,0.0
164,6,AdaBoost (Discrete),2,1.0,0.3613290263036456,0.3581483494682314,141.35374522209167,0.0
165,6,AdaBoost (Real),2,1.0,0.3124134748500231,0.2840888716641332,180.20541214942932,0.0
166,6,Logistic Regression (Penalty = L2),2,1.0,0.509460083064144,0.18909016338736234,2.9148812294006348,0.0
167,6,Naive Bayes,2,1.0,0.3511767420396862,0.18731636249094755,0.3058431148529053,0.0
168,7,KNeighbors Classifier,0,1.0,0.30400736987563337,0.20606384085864732,9.111885786056519,0.0
169,7,SVC Classifier,0,1.0,0.5287885766927684,0.643494937720922,30.68178129196167,0.0
170,7,Decision Tree,0,1.0,0.2630124366651313,0.2469771239516501,0.4214057922363281,0.0
171,7,RandomForest,0,1.0,0.48687240902809764,0.6421364736725443,1.2599716186523438,0.0
172,7,AdaBoost (Discrete),0,1.0,0.19760479041916168,0.22728351997192991,129.32354354858398,0.22728351997192991
173,7,AdaBoost (Real),0,1.0,0.11377245508982035,0.09392096720415886,169.07106804847717,0.09392096720415886
174,7,Logistic Regression (Penalty = L2),0,1.0,0.38415476738830034,0.1946101550567088,2.17653751373291,0.0
175,7,Naive Bayes,0,1.0,0.190234914785813,0.3052917468849531,0.27489614486694336,0.0
176,7,KNeighbors Classifier,1,1.0,0.42738589211618255,0.28729692813960656,5.1800572872161865,0.0
177,7,SVC Classifier,1,1.0,0.4412171507607192,0.14948380152256274,26.385990142822266,0.0
178,7,Decision Tree,1,1.0,0.40848317196864914,0.3009424623478492,0.369091272354126,0.0
179,7,RandomForest,1,1.0,0.4831719686491471,0.5810555082644082,1.1241095066070557,0.0
180,7,AdaBoost (Discrete),1,1.0,0.3900414937759336,0.3922616972541294,115.46343636512756,0.0
181,7,AdaBoost (Real),1,1.0,0.3835869064084832,0.16481032132982265,163.45548582077026,0.0
182,7,Logistic Regression (Penalty = L2),1,1.0,0.5020746887966805,0.34662859352294384,2.3507862091064453,0.0
183,7,Naive Bayes,1,1.0,0.4476717381281697,0.3755129818879039,0.19074416160583496,0.0
184,7,KNeighbors Classifier,2,1.0,0.41762805722196583,0.2598729725606528,4.95006537437439,0.0
185,7,SVC Classifier,2,1.0,0.4360867558837102,1.0,26.446919202804565,0.0
186,7,Decision Tree,2,1.0,0.4093216428241809,0.2789872589451589,0.3690760135650635,0.0
187,7,RandomForest,2,1.0,0.4688509460083064,0.35370048999243775,1.1046836376190186,0.0
188,7,AdaBoost (Discrete),2,1.0,0.3613290263036456,0.3581483494682314,115.16434979438782,0.0
189,7,AdaBoost (Real),2,1.0,0.3124134748500231,0.2840888716641332,170.77686429023743,0.0
190,7,Logistic Regression (Penalty = L2),2,1.0,0.509460083064144,0.18909016338736234,2.6993532180786133,0.0
191,7,Naive Bayes,2,1.0,0.3511767420396862,0.18731636249094755,0.27913761138916016,0.0
192,8,KNeighbors Classifier,0,1.0,0.30400736987563337,0.20606384085864732,8.090667009353638,0.0
193,8,SVC Classifier,0,1.0,0.5287885766927684,0.643494937720922,25.177495002746582,0.0
194,8,Decision Tree,0,1.0,0.3390142791340396,0.2881327751802236,0.3526284694671631,0.0
195,8,RandomForest,0,1.0,0.48687240902809764,0.6421364736725443,1.0195684432983398,0.0
196,8,AdaBoost (Discrete),0,1.0,0.1971441731920774,0.22786032623644464,112.94488000869751,0.22786032623644464
197,8,AdaBoost (Real),0,1.0,0.11377245508982035,0.09392096720415886,149.97858309745789,0.09392096720415886
198,8,Logistic Regression (Penalty = L2),0,1.0,0.38415476738830034,0.1946101550567088,2.0528368949890137,0.0
199,8,Naive Bayes,0,1.0,0.190234914785813,0.3052917468849531,0.3291611671447754,0.0
200,8,KNeighbors Classifier,1,1.0,0.42738589211618255,0.28729692813960656,4.3179771900177,0.0
201,8,SVC Classifier,1,1.0,0.4412171507607192,0.14948380152256274,23.419169902801514,0.0
202,8,Decision Tree,1,1.0,0.3812816966343937,0.2981011562448936,0.32036828994750977,0.0
203,8,RandomForest,1,1.0,0.4831719686491471,0.5810555082644082,0.905902624130249,0.0
204,8,AdaBoost (Discrete),1,1.0,0.3900414937759336,0.3922616972541294,99.31924033164978,0.0
205,8,AdaBoost (Real),1,1.0,0.3831258644536653,0.16314984721810677,141.4165370464325,0.0
206,8,Logistic Regression (Penalty = L2),1,1.0,0.5020746887966805,0.34662859352294384,2.122342348098755,0.0
207,8,Naive Bayes,1,1.0,0.4476717381281697,0.3755129818879039,0.24229645729064941,0.0
208,8,KNeighbors Classifier,2,1.0,0.41762805722196583,0.2598729725606528,4.496946096420288,0.0
209,8,SVC Classifier,2,1.0,0.4360867558837102,1.0,22.55840015411377,0.0
210,8,Decision Tree,2,1.0,0.3862482694970005,0.2598696940581663,0.35395288467407227,0.0
211,8,RandomForest,2,1.0,0.4688509460083064,0.35370048999243775,0.9903652667999268,0.0
212,8,AdaBoost (Discrete),2,1.0,0.3613290263036456,0.3581483494682314,95.29979014396667,0.0
213,8,AdaBoost (Real),2,1.0,0.31195200738347945,0.2836446325720748,127.91223216056824,0.0
214,8,Logistic Regression (Penalty = L2),2,1.0,0.509460083064144,0.18909016338736234,1.9950103759765625,0.0
215,8,Naive Bayes,2,1.0,0.3511767420396862,0.18731636249094755,0.21986937522888184,0.0
