,feat_set_id,classifier,fold_id,feat_th,score,geo_score,exec_t,geo_score_woz
0,0,KNeighbors Classifier,0,0.1,0.8955223880597015,0.8921364294818387,0.633490800857544,0.8921364294818387
1,0,SVC Classifier,0,0.1,0.7208955223880597,0.6999328882119261,4.034466981887817,0.6999328882119261
2,0,Decision Tree,0,0.1,0.7253731343283583,0.7142513145661111,0.27529215812683105,0.7142513145661111
3,0,RandomForest,0,0.1,0.6970149253731344,0.686298045429377,1.395700454711914,0.686298045429377
4,0,AdaBoost (Discrete),0,0.1,0.8119402985074626,0.80209425556416,114.9108772277832,0.80209425556416
5,0,AdaBoost (Real),0,0.1,0.7820895522388059,0.7708161920688771,168.18132066726685,0.7708161920688771
6,0,Logistic Regression (Penalty = L2),0,0.1,0.8014925373134328,0.7980141606627333,1.4930641651153564,0.7980141606627333
7,0,Naive Bayes,0,0.1,0.8059701492537313,0.7997613142011858,0.23603081703186035,0.7997613142011858
8,0,KNeighbors Classifier,1,0.1,0.9134328358208955,0.909631083832492,0.608252763748169,0.909631083832492
9,0,SVC Classifier,1,0.1,0.746268656716418,0.7309584111931826,3.0206875801086426,0.7309584111931826
10,0,Decision Tree,1,0.1,0.7701492537313432,0.7595398380576988,0.1137385368347168,0.7595398380576988
11,0,RandomForest,1,0.1,0.6940298507462687,0.6755189993158826,1.1980314254760742,0.6755189993158826
12,0,AdaBoost (Discrete),1,0.1,0.7970149253731343,0.7878736849219217,111.25873136520386,0.7878736849219217
13,0,AdaBoost (Real),1,0.1,0.755223880597015,0.7315763706543928,155.18603610992432,0.7315763706543928
14,0,Logistic Regression (Penalty = L2),1,0.1,0.8208955223880597,0.8157520351575644,1.2591583728790283,0.8157520351575644
15,0,Naive Bayes,1,0.1,0.8238805970149253,0.8193859458841581,0.12279295921325684,0.8193859458841581
16,0,KNeighbors Classifier,2,0.1,0.9212121212121213,0.9182313739108355,0.4898347854614258,0.9182313739108355
17,0,SVC Classifier,2,0.1,0.759090909090909,0.752875637916791,3.0995163917541504,0.752875637916791
18,0,Decision Tree,2,0.1,0.7712121212121212,0.7665573341719318,0.23863887786865234,0.7665573341719318
19,0,RandomForest,2,0.1,0.6984848484848485,0.5700515418777701,0.9732277393341064,0.5700515418777701
20,0,AdaBoost (Discrete),2,0.1,0.803030303030303,0.7928924232759783,103.11184668540955,0.7928924232759783
21,0,AdaBoost (Real),2,0.1,0.7272727272727273,0.6671173081420357,128.9733920097351,0.6671173081420357
22,0,Logistic Regression (Penalty = L2),2,0.1,0.8363636363636363,0.8317521129932296,1.2728581428527832,0.8317521129932296
23,0,Naive Bayes,2,0.1,0.85,0.8467168270626654,0.14240384101867676,0.8467168270626654
24,1,KNeighbors Classifier,0,0.1,0.8761194029850746,0.8729380662043154,0.7049241065979004,0.8729380662043154
25,1,SVC Classifier,0,0.1,0.7238805970149254,0.7122217225359083,3.6840295791625977,0.7122217225359083
26,1,Decision Tree,0,0.1,0.7223880597014926,0.7160550882756191,0.14656591415405273,0.7160550882756191
27,1,RandomForest,0,0.1,0.6238805970149254,0.5838064619802831,1.2704434394836426,0.5838064619802831
28,1,AdaBoost (Discrete),0,0.1,0.7507462686567165,0.7444361032116089,113.34506106376648,0.7444361032116089
29,1,AdaBoost (Real),0,0.1,0.5388059701492537,0.4120505423650026,158.7454867362976,0.4120505423650026
30,1,Logistic Regression (Penalty = L2),0,0.1,0.7805970149253731,0.7734304463891729,1.7661983966827393,0.7734304463891729
31,1,Naive Bayes,0,0.1,0.8074626865671641,0.8033086604013904,0.32018399238586426,0.8033086604013904
32,1,KNeighbors Classifier,1,0.1,0.8671641791044776,0.8638536270703121,0.9455537796020508,0.8638536270703121
33,1,SVC Classifier,1,0.1,0.744776119402985,0.7346326301337595,4.9121387004852295,0.7346326301337595
34,1,Decision Tree,1,0.1,0.7283582089552239,0.7214568276927804,0.32659149169921875,0.7214568276927804
35,1,RandomForest,1,0.1,0.6373134328358209,0.5979184050450707,1.6237878799438477,0.5979184050450707
36,1,AdaBoost (Discrete),1,0.1,0.7731343283582089,0.7669460902715345,148.07661390304565,0.7669460902715345
37,1,AdaBoost (Real),1,0.1,0.5656716417910448,0.5365444333076023,164.40530490875244,0.5365444333076023
38,1,Logistic Regression (Penalty = L2),1,0.1,0.7925373134328358,0.7886404873260403,1.4435875415802002,0.7886404873260403
39,1,Naive Bayes,1,0.1,0.8164179104477612,0.8118624693059349,0.2955198287963867,0.8118624693059349
40,1,KNeighbors Classifier,2,0.1,0.8893939393939394,0.8883084870585749,0.6113102436065674,0.8883084870585749
41,1,SVC Classifier,2,0.1,0.7575757575757576,0.7491250637085896,3.89174222946167,0.7491250637085896
42,1,Decision Tree,2,0.1,0.7151515151515152,0.711112824194003,0.14887022972106934,0.711112824194003
43,1,RandomForest,2,0.1,0.5924242424242424,0.45432512210654324,1.3673326969146729,0.45432512210654324
44,1,AdaBoost (Discrete),2,0.1,0.7803030303030303,0.7681427781474207,129.46709370613098,0.7681427781474207
45,1,AdaBoost (Real),2,0.1,0.693939393939394,0.6515674146847913,159.1975178718567,0.6515674146847913
46,1,Logistic Regression (Penalty = L2),2,0.1,0.8181818181818182,0.8149164100335956,1.4229817390441895,0.8149164100335956
47,1,Naive Bayes,2,0.1,0.8318181818181818,0.8305208169863284,0.2540459632873535,0.8305208169863284
48,2,KNeighbors Classifier,0,0.1,0.8746268656716418,0.8720965192817735,0.8270301818847656,0.8720965192817735
49,2,SVC Classifier,0,0.1,0.7134328358208956,0.688260836691021,4.418527364730835,0.688260836691021
50,2,Decision Tree,0,0.1,0.6791044776119403,0.671852473034054,0.32225632667541504,0.671852473034054
51,2,RandomForest,0,0.1,0.6253731343283582,0.5203816519569218,1.3674545288085938,0.5203816519569218
52,2,AdaBoost (Discrete),0,0.1,0.7686567164179104,0.765828078917889,126.08989357948303,0.765828078917889
53,2,AdaBoost (Real),0,0.1,0.7089552238805971,0.6955423106935933,158.47135519981384,0.6955423106935933
54,2,Logistic Regression (Penalty = L2),0,0.1,0.7835820895522388,0.7795296626989109,1.642812728881836,0.7795296626989109
55,2,Naive Bayes,0,0.1,0.8,0.7953779845883985,0.3401966094970703,0.7953779845883985
56,2,KNeighbors Classifier,1,0.1,0.8656716417910447,0.8635734215441635,0.8584375381469727,0.8635734215441635
57,2,SVC Classifier,1,0.1,0.7492537313432835,0.7323715462084551,5.021141290664673,0.7323715462084551
58,2,Decision Tree,1,0.1,0.7029850746268657,0.6981426713604892,0.350024938583374,0.6981426713604892
59,2,RandomForest,1,0.1,0.6253731343283582,0.5807297583365125,1.5088074207305908,0.5807297583365125
60,2,AdaBoost (Discrete),1,0.1,0.7731343283582089,0.7688455474781997,114.02841901779175,0.7688455474781997
61,2,AdaBoost (Real),1,0.1,0.6313432835820896,0.6085320747740894,158.19093704223633,0.6085320747740894
62,2,Logistic Regression (Penalty = L2),1,0.1,0.7955223880597015,0.7900304055718106,2.0771291255950928,0.7900304055718106
63,2,Naive Bayes,1,0.1,0.8134328358208955,0.8101949976650618,0.5293235778808594,0.8101949976650618
64,2,KNeighbors Classifier,2,0.1,0.8863636363636364,0.8848817161380818,1.010162591934204,0.8848817161380818
65,2,SVC Classifier,2,0.1,0.7636363636363637,0.7483131749961924,7.523143291473389,0.7483131749961924
66,2,Decision Tree,2,0.1,0.7196969696969697,0.7140517491184991,0.6073076725006104,0.7140517491184991
67,2,RandomForest,2,0.1,0.6318181818181818,0.570051113993622,2.0532007217407227,0.570051113993622
68,2,AdaBoost (Discrete),2,0.1,0.8075757575757576,0.8059154030086999,133.0344042778015,0.8059154030086999
69,2,AdaBoost (Real),2,0.1,0.7,0.6865470617526545,167.95558857917786,0.6865470617526545
70,2,Logistic Regression (Penalty = L2),2,0.1,0.8136363636363636,0.8120191737711918,1.4065344333648682,0.8120191737711918
71,2,Naive Bayes,2,0.1,0.8393939393939394,0.8381843179096776,0.3595874309539795,0.8381843179096776
72,3,KNeighbors Classifier,0,0.1,0.7970149253731343,0.7903941668319687,0.6448473930358887,0.7903941668319687
73,3,SVC Classifier,0,0.1,0.6149253731343284,0.5081507903675316,4.098156452178955,0.5081507903675316
74,3,Decision Tree,0,0.1,0.6835820895522388,0.6722184834456172,0.16132831573486328,0.6722184834456172
75,3,RandomForest,0,0.1,0.573134328358209,0.4514902055297369,2.078845977783203,0.0
76,3,AdaBoost (Discrete),0,0.1,0.7,0.6903187921346292,120.50025796890259,0.6903187921346292
77,3,AdaBoost (Real),0,0.1,0.6074626865671642,0.5950269924849917,127.6590166091919,0.5950269924849917
78,3,Logistic Regression (Penalty = L2),0,0.1,0.6835820895522388,0.6539744621636788,1.4735939502716064,0.6539744621636788
79,3,Naive Bayes,0,0.1,0.7119402985074627,0.6960090020314842,0.49251508712768555,0.6960090020314842
80,3,KNeighbors Classifier,1,0.1,0.8074626865671641,0.7934980150985737,0.6536965370178223,0.7934980150985737
81,3,SVC Classifier,1,0.1,0.6537313432835821,0.5901441269980205,3.8367133140563965,0.5901441269980205
82,3,Decision Tree,1,0.1,0.6850746268656717,0.67164953251012,0.32993197441101074,0.67164953251012
83,3,RandomForest,1,0.1,0.5671641791044776,0.3764444932716448,1.4516866207122803,0.3764444932716448
84,3,AdaBoost (Discrete),1,0.1,0.6970149253731344,0.6754431393340647,121.63592457771301,0.6754431393340647
85,3,AdaBoost (Real),1,0.1,0.48955223880597015,0.4523259842661849,142.39369225502014,0.4523259842661849
86,3,Logistic Regression (Penalty = L2),1,0.1,0.7164179104477612,0.6960645083844959,1.171633243560791,0.6960645083844959
87,3,Naive Bayes,1,0.1,0.7388059701492538,0.7152327269320178,0.2637505531311035,0.7152327269320178
88,3,KNeighbors Classifier,2,0.1,0.8136363636363636,0.805038547232045,0.5264167785644531,0.805038547232045
89,3,SVC Classifier,2,0.1,0.6590909090909091,0.5745525475591831,3.381678819656372,0.5745525475591831
90,3,Decision Tree,2,0.1,0.6954545454545454,0.6863012294415113,0.2625913619995117,0.6863012294415113
91,3,RandomForest,2,0.1,0.5742424242424242,0.4468024220952895,1.4183156490325928,0.0
92,3,AdaBoost (Discrete),2,0.1,0.7454545454545455,0.737379412366122,105.28361797332764,0.737379412366122
93,3,AdaBoost (Real),2,0.1,0.5969696969696969,0.5439798296587129,145.66144347190857,0.5439798296587129
94,3,Logistic Regression (Penalty = L2),2,0.1,0.7196969696969697,0.7066092323318155,1.1549036502838135,0.7066092323318155
95,3,Naive Bayes,2,0.1,0.75,0.7371574737911483,0.1576840877532959,0.7371574737911483
96,4,KNeighbors Classifier,0,0.1,0.753731343283582,0.738701444220783,0.46443915367126465,0.738701444220783
97,4,SVC Classifier,0,0.1,0.5940298507462687,0.49808402455332784,3.8085203170776367,0.49808402455332784
98,4,Decision Tree,0,0.1,0.6955223880597015,0.6818271360124823,0.15322232246398926,0.6818271360124823
99,4,RandomForest,0,0.1,0.47761194029850745,0.490150873515276,1.4023714065551758,0.0
100,4,AdaBoost (Discrete),0,0.1,0.6776119402985075,0.661044804037828,106.25153493881226,0.661044804037828
101,4,AdaBoost (Real),0,0.1,0.6029850746268657,0.5333585822645068,138.73487186431885,0.5333585822645068
102,4,Logistic Regression (Penalty = L2),0,0.1,0.6776119402985075,0.6584574225247044,0.9296057224273682,0.6584574225247044
103,4,Naive Bayes,0,0.1,0.7,0.6799471865110048,0.3112649917602539,0.6799471865110048
104,4,KNeighbors Classifier,1,0.1,0.7820895522388059,0.7637472759273031,0.5110552310943604,0.7637472759273031
105,4,SVC Classifier,1,0.1,0.6283582089552239,0.5505047693922192,3.4884262084960938,0.5505047693922192
106,4,Decision Tree,1,0.1,0.6656716417910448,0.6398684623498209,0.26968932151794434,0.6398684623498209
107,4,RandomForest,1,0.1,0.508955223880597,0.2977963628051328,1.278017282485962,0.0
108,4,AdaBoost (Discrete),1,0.1,0.6522388059701493,0.6181322853566487,105.82037019729614,0.6181322853566487
109,4,AdaBoost (Real),1,0.1,0.5208955223880597,0.445450120778538,123.50771832466125,0.445450120778538
110,4,Logistic Regression (Penalty = L2),1,0.1,0.7029850746268657,0.6834465518424343,0.9376554489135742,0.6834465518424343
111,4,Naive Bayes,1,0.1,0.7283582089552239,0.7109654346519281,0.29863476753234863,0.7109654346519281
112,4,KNeighbors Classifier,2,0.1,0.7924242424242425,0.7811834532612878,0.4045577049255371,0.7811834532612878
113,4,SVC Classifier,2,0.1,0.6287878787878788,0.5529447012315238,3.1386208534240723,0.5529447012315238
114,4,Decision Tree,2,0.1,0.7378787878787879,0.7327287776949775,0.27880239486694336,0.7327287776949775
115,4,RandomForest,2,0.1,0.5833333333333334,0.44816015415023125,1.287672996520996,0.44816015415023125
116,4,AdaBoost (Discrete),2,0.1,0.65,0.6231309635828249,97.78937005996704,0.6231309635828249
117,4,AdaBoost (Real),2,0.1,0.5712121212121212,0.49699883380805454,136.89191436767578,0.49699883380805454
118,4,Logistic Regression (Penalty = L2),2,0.1,0.7439393939393939,0.7307090336096294,0.9384176731109619,0.7307090336096294
119,4,Naive Bayes,2,0.1,0.7560606060606061,0.7497981608231633,0.30963730812072754,0.7497981608231633
120,5,KNeighbors Classifier,0,0.1,0.6029850746268657,0.5549842706746237,0.4935283660888672,0.5549842706746237
121,5,SVC Classifier,0,0.1,0.5402985074626866,0.4189552968818468,3.6404049396514893,0.4189552968818468
122,5,Decision Tree,0,0.1,0.5283582089552239,0.49175342988300763,0.3129920959472656,0.49175342988300763
123,5,RandomForest,0,0.1,0.5328358208955224,0.3772015293256681,1.3998122215270996,0.3772015293256681
124,5,AdaBoost (Discrete),0,0.1,0.5253731343283582,0.4780989406526451,101.57148504257202,0.4780989406526451
125,5,AdaBoost (Real),0,0.1,0.4417910447761194,0.27333969878968917,123.80422163009644,0.27333969878968917
126,5,Logistic Regression (Penalty = L2),0,0.1,0.5791044776119403,0.5049315553415608,0.6403865814208984,0.5049315553415608
127,5,Naive Bayes,0,0.1,0.6283582089552239,0.5862357066012905,0.13406968116760254,0.5862357066012905
128,5,KNeighbors Classifier,1,0.1,0.5955223880597015,0.5314019257645025,0.25719571113586426,0.5314019257645025
129,5,SVC Classifier,1,0.1,0.5343283582089552,0.3998471204073284,3.066317558288574,0.3998471204073284
130,5,Decision Tree,1,0.1,0.5582089552238806,0.522894452561513,0.12805962562561035,0.522894452561513
131,5,RandomForest,1,0.1,0.5194029850746269,0.43922456986029307,1.231104850769043,0.0
132,5,AdaBoost (Discrete),1,0.1,0.5358208955223881,0.4996080354624559,93.09854936599731,0.4996080354624559
133,5,AdaBoost (Real),1,0.1,0.4164179104477612,0.2985907371037497,131.7899272441864,0.2985907371037497
134,5,Logistic Regression (Penalty = L2),1,0.1,0.5791044776119403,0.49193042885351834,0.9297316074371338,0.49193042885351834
135,5,Naive Bayes,1,0.1,0.6074626865671642,0.5443101065365451,0.1375899314880371,0.5443101065365451
136,5,KNeighbors Classifier,2,0.1,0.6257575757575757,0.5759959685955558,0.4056522846221924,0.5759959685955558
137,5,SVC Classifier,2,0.1,0.5772727272727273,0.48466318957930454,3.1122193336486816,0.48466318957930454
138,5,Decision Tree,2,0.1,0.5681818181818182,0.531467880542812,0.2689542770385742,0.531467880542812
139,5,RandomForest,2,0.1,0.49242424242424243,0.3399381305902176,1.2818355560302734,0.0
140,5,AdaBoost (Discrete),2,0.1,0.5272727272727272,0.4497424919070475,94.91532230377197,0.4497424919070475
141,5,AdaBoost (Real),2,0.1,0.4106060606060606,0.2620353995292068,121.1581060886383,0.2620353995292068
142,5,Logistic Regression (Penalty = L2),2,0.1,0.5969696969696969,0.5444637417840335,0.5704832077026367,0.5444637417840335
143,5,Naive Bayes,2,0.1,0.6439393939393939,0.5961980181354385,0.30562305450439453,0.5961980181354385
144,6,KNeighbors Classifier,0,0.1,0.9164179104477612,0.914859425544935,0.9022853374481201,0.914859425544935
145,6,SVC Classifier,0,0.1,0.7761194029850746,0.769777561274998,3.667289972305298,0.769777561274998
146,6,Decision Tree,0,0.1,0.7014925373134329,0.6971301470962865,0.3093860149383545,0.6971301470962865
147,6,RandomForest,0,0.1,0.6014925373134329,0.5100574594879481,1.1214163303375244,0.5100574594879481
148,6,AdaBoost (Discrete),0,0.1,0.8537313432835821,0.8514052535509005,124.36335587501526,0.8514052535509005
149,6,AdaBoost (Real),0,0.1,0.8059701492537313,0.7999038078782572,161.0041971206665,0.7999038078782572
150,6,Logistic Regression (Penalty = L2),0,0.1,0.826865671641791,0.8245856889238449,1.5703351497650146,0.8245856889238449
151,6,Naive Bayes,0,0.1,0.8328358208955224,0.8293171031290334,0.2970902919769287,0.8293171031290334
152,6,KNeighbors Classifier,1,0.1,0.9313432835820895,0.9305522315762641,0.8893954753875732,0.9305522315762641
153,6,SVC Classifier,1,0.1,0.7910447761194029,0.7820377090191177,4.712710380554199,0.7820377090191177
154,6,Decision Tree,1,0.1,0.7611940298507462,0.7556839141972393,0.10331559181213379,0.7556839141972393
155,6,RandomForest,1,0.1,0.5716417910447761,0.550318823990151,1.6669001579284668,0.0
156,6,AdaBoost (Discrete),1,0.1,0.8582089552238806,0.8540604309813116,132.8197102546692,0.8540604309813116
157,6,AdaBoost (Real),1,0.1,0.5238805970149254,0.40490553741182034,151.02590584754944,0.40490553741182034
158,6,Logistic Regression (Penalty = L2),1,0.1,0.8582089552238806,0.8546943247152148,1.1542246341705322,0.8546943247152148
159,6,Naive Bayes,1,0.1,0.8477611940298507,0.8456443737615749,0.3215067386627197,0.8456443737615749
160,6,KNeighbors Classifier,2,0.1,0.9378787878787879,0.9362819837921068,0.6895818710327148,0.9362819837921068
161,6,SVC Classifier,2,0.1,0.803030303030303,0.7983108310504157,3.564192771911621,0.7983108310504157
162,6,Decision Tree,2,0.1,0.7621212121212121,0.7563218915736616,0.12509870529174805,0.7563218915736616
163,6,RandomForest,2,0.1,0.5727272727272728,0.5512625950297648,0.8897533416748047,0.0
164,6,AdaBoost (Discrete),2,0.1,0.853030303030303,0.8483812989917054,121.28194451332092,0.8483812989917054
165,6,AdaBoost (Real),2,0.1,0.793939393939394,0.7671486956238084,133.90040850639343,0.7671486956238084
166,6,Logistic Regression (Penalty = L2),2,0.1,0.8712121212121212,0.868945811128225,1.1967403888702393,0.868945811128225
167,6,Naive Bayes,2,0.1,0.8787878787878788,0.8763322607830687,0.292055606842041,0.8763322607830687
168,7,KNeighbors Classifier,0,0.1,0.9432835820895522,0.9424130062249542,1.1111860275268555,0.9424130062249542
169,7,SVC Classifier,0,0.1,0.8328358208955224,0.8307864882843431,4.693772315979004,0.8307864882843431
170,7,Decision Tree,0,0.1,0.7611940298507462,0.7567213314324321,0.28319835662841797,0.7567213314324321
171,7,RandomForest,0,0.1,0.6582089552238806,0.6235069939250362,1.5978212356567383,0.6235069939250362
172,7,AdaBoost (Discrete),0,0.1,0.8776119402985074,0.8756485044967082,157.66859102249146,0.8756485044967082
173,7,AdaBoost (Real),0,0.1,0.8417910447761194,0.8390674636198093,162.4612958431244,0.8390674636198093
174,7,Logistic Regression (Penalty = L2),0,0.1,0.8761194029850746,0.8753274042283055,1.3419528007507324,0.8753274042283055
175,7,Naive Bayes,0,0.1,0.8701492537313433,0.8685418441447821,0.23508596420288086,0.8685418441447821
176,7,KNeighbors Classifier,1,0.1,0.9432835820895522,0.9423135055027607,0.9957253932952881,0.9423135055027607
177,7,SVC Classifier,1,0.1,0.844776119402985,0.8420052146113352,3.749683141708374,0.8420052146113352
178,7,Decision Tree,1,0.1,0.744776119402985,0.741432695188259,0.23481011390686035,0.741432695188259
179,7,RandomForest,1,0.1,0.6522388059701493,0.5808220211792748,1.023926019668579,0.5808220211792748
180,7,AdaBoost (Discrete),1,0.1,0.8865671641791045,0.8858172225279914,134.10221552848816,0.8858172225279914
181,7,AdaBoost (Real),1,0.1,0.5552238805970149,0.4302981427345916,161.62109565734863,0.4302981427345916
182,7,Logistic Regression (Penalty = L2),1,0.1,0.8805970149253731,0.8792288772001927,1.596862554550171,0.8792288772001927
183,7,Naive Bayes,1,0.1,0.8686567164179104,0.8672657997328392,0.2680811882019043,0.8672657997328392
184,7,KNeighbors Classifier,2,0.1,0.953030303030303,0.9527302399574344,1.4771177768707275,0.9527302399574344
185,7,SVC Classifier,2,0.1,0.8424242424242424,0.8402271113765908,4.61405348777771,0.8402271113765908
186,7,Decision Tree,2,0.1,0.7818181818181819,0.7789744194000767,0.27585434913635254,0.7789744194000767
187,7,RandomForest,2,0.1,0.6757575757575758,0.6157804195421727,1.315690040588379,0.6157804195421727
188,7,AdaBoost (Discrete),2,0.1,0.9015151515151515,0.8993820594350255,142.32002067565918,0.8993820594350255
189,7,AdaBoost (Real),2,0.1,0.8242424242424242,0.8102792627476052,182.53670406341553,0.8102792627476052
190,7,Logistic Regression (Penalty = L2),2,0.1,0.8924242424242425,0.8916737185676196,1.687523365020752,0.8916737185676196
191,7,Naive Bayes,2,0.1,0.8954545454545455,0.894366680182988,0.34279775619506836,0.894366680182988
192,8,KNeighbors Classifier,0,0.1,0.5149253731343284,0.44657098403222484,0.27191996574401855,0.44657098403222484
193,8,SVC Classifier,0,0.1,0.4746268656716418,0.3313237571553249,2.757978677749634,0.3313237571553249
194,8,Decision Tree,0,0.1,0.4716417910447761,0.4299548203651892,0.16873717308044434,0.4299548203651892
195,8,RandomForest,0,0.1,0.4597014925373134,0.38229791903680893,1.0022177696228027,0.0
196,8,AdaBoost (Discrete),0,0.1,0.41492537313432837,0.3337999831672961,60.74248647689819,0.3337999831672961
197,8,AdaBoost (Real),0,0.1,0.3582089552238806,0.24547800093769648,85.26070237159729,0.24547800093769648
198,8,Logistic Regression (Penalty = L2),0,0.1,0.5134328358208955,0.4180803321269178,0.45211219787597656,0.4180803321269178
199,8,Naive Bayes,0,0.1,0.5388059701492537,0.4591054691056695,0.2131204605102539,0.4591054691056695
200,8,KNeighbors Classifier,1,0.1,0.5358208955223881,0.4710431176962348,0.29160356521606445,0.4710431176962348
201,8,SVC Classifier,1,0.1,0.46119402985074626,0.41797057797451215,2.424018383026123,0.0
202,8,Decision Tree,1,0.1,0.491044776119403,0.45067922657342463,0.2363905906677246,0.45067922657342463
203,8,RandomForest,1,0.1,0.4701492537313433,0.2691121932627864,0.8379735946655273,0.2691121932627864
204,8,AdaBoost (Discrete),1,0.1,0.41940298507462687,0.3559292477651553,61.02032971382141,0.3559292477651553
205,8,AdaBoost (Real),1,0.1,0.2791044776119403,0.2130989747609805,81.47114539146423,0.2130989747609805
206,8,Logistic Regression (Penalty = L2),1,0.1,0.5253731343283582,0.4334284440866441,0.4331073760986328,0.4334284440866441
207,8,Naive Bayes,1,0.1,0.5567164179104478,0.4715822828196598,0.2501406669616699,0.4715822828196598
208,8,KNeighbors Classifier,2,0.1,0.5272727272727272,0.4695248257854968,0.09745430946350098,0.4695248257854968
209,8,SVC Classifier,2,0.1,0.48484848484848486,0.34500466954758224,2.1969573497772217,0.34500466954758224
210,8,Decision Tree,2,0.1,0.4818181818181818,0.44962218404465015,0.1548914909362793,0.44962218404465015
211,8,RandomForest,2,0.1,0.47575757575757577,0.44924703864989707,0.7681384086608887,0.0
212,8,AdaBoost (Discrete),2,0.1,0.4393939393939394,0.392566623544459,58.364625215530396,0.392566623544459
213,8,AdaBoost (Real),2,0.1,0.3575757575757576,0.2610187765566002,83.09628510475159,0.0
214,8,Logistic Regression (Penalty = L2),2,0.1,0.5545454545454546,0.4836379801192642,0.556239128112793,0.4836379801192642
215,8,Naive Bayes,2,0.1,0.5454545454545454,0.4530493212336337,0.21069741249084473,0.4530493212336337
