,feat_set_id,classifier,fold_id,feat_th,score,geo_score,exec_t,geo_score_woz
0,0,KNeighbors Classifier,0,0.95,0.8666666666666667,0.8271943805075725,0.31378889083862305,0.8271943805075725
1,0,SVC Classifier,0,0.95,0.8083333333333333,1.0,0.32045912742614746,0.0
2,0,Decision Tree,0,0.95,0.7916666666666666,0.7356658695306584,0.08192658424377441,0.7356658695306584
3,0,RandomForest,0,0.95,0.775,0.6538773475378148,0.6398360729217529,0.0
4,0,AdaBoost (Discrete),0,0.95,0.8166666666666667,0.7406381167867305,35.530410051345825,0.7406381167867305
5,0,AdaBoost (Real),0,0.95,0.7666666666666667,0.8339947279394198,46.10857033729553,0.0
6,0,Logistic Regression (Penalty = L2),0,0.95,0.975,0.9696654978825953,0.43421053886413574,0.9696654978825953
7,0,Naive Bayes,0,0.95,0.7916666666666666,0.7569682576589495,0.08080863952636719,0.7569682576589495
8,0,KNeighbors Classifier,1,0.95,0.8833333333333333,0.8566742080849569,0.25714707374572754,0.8566742080849569
9,0,SVC Classifier,1,0.95,0.8083333333333333,1.0,0.34302854537963867,0.0
10,0,Decision Tree,1,0.95,0.9,0.8513878374196596,0.0822758674621582,0.8513878374196596
11,0,RandomForest,1,0.95,0.825,0.7994535998298657,0.6807243824005127,0.0
12,0,AdaBoost (Discrete),1,0.95,0.325,1.0,39.123440980911255,0.0
13,0,AdaBoost (Real),1,0.95,0.8333333333333334,0.9748970527428702,53.13161897659302,0.0
14,0,Logistic Regression (Penalty = L2),1,0.95,0.9416666666666667,0.9381678405381247,0.24012088775634766,0.9381678405381247
15,0,Naive Bayes,1,0.95,0.7666666666666667,0.683113982346698,0.18327665328979492,0.683113982346698
16,0,KNeighbors Classifier,2,0.95,0.847457627118644,0.7852089012375099,0.40761256217956543,0.7852089012375099
17,0,SVC Classifier,2,0.95,0.8135593220338984,1.0,0.4704623222351074,0.0
18,0,Decision Tree,2,0.95,0.923728813559322,0.9102350785218809,0.002462625503540039,0.9102350785218809
19,0,RandomForest,2,0.95,0.788135593220339,0.6662233691872482,0.8293037414550781,0.0
20,0,AdaBoost (Discrete),2,0.95,0.923728813559322,0.7922561070581773,46.66540789604187,0.7922561070581773
21,0,AdaBoost (Real),2,0.95,0.864406779661017,1.0,51.280117988586426,0.0
22,0,Logistic Regression (Penalty = L2),2,0.95,0.9576271186440678,0.9518558056141587,0.24480557441711426,0.9518558056141587
23,0,Naive Bayes,2,0.95,0.7627118644067796,0.6740030772986388,0.09287381172180176,0.6740030772986388
24,1,KNeighbors Classifier,0,0.95,0.85,0.8309674453266357,0.27285027503967285,0.8309674453266357
25,1,SVC Classifier,0,0.95,0.8083333333333333,1.0,0.27700233459472656,0.0
26,1,Decision Tree,0,0.95,0.875,0.6559917340802237,0.08998847007751465,0.6559917340802237
27,1,RandomForest,0,0.95,0.7166666666666667,0.4632658605641188,0.5550615787506104,0.0
28,1,AdaBoost (Discrete),0,0.95,0.8416666666666667,0.7627433009661261,41.67124080657959,0.7627433009661261
29,1,AdaBoost (Real),0,0.95,0.7666666666666667,0.8339947279394198,53.25368070602417,0.0
30,1,Logistic Regression (Penalty = L2),0,0.95,0.975,0.9696654978825953,0.3288252353668213,0.9696654978825953
31,1,Naive Bayes,0,0.95,0.7916666666666666,0.7569682576589495,0.18143296241760254,0.7569682576589495
32,1,KNeighbors Classifier,1,0.95,0.8666666666666667,0.8472470631056911,0.4260563850402832,0.8472470631056911
33,1,SVC Classifier,1,0.95,0.8083333333333333,1.0,0.43453073501586914,0.0
34,1,Decision Tree,1,0.95,0.875,0.8768635117853246,0.001535177230834961,0.8768635117853246
35,1,RandomForest,1,0.95,0.8583333333333333,0.8593859637937393,0.8633701801300049,0.0
36,1,AdaBoost (Discrete),1,0.95,0.325,1.0,48.78028631210327,0.0
37,1,AdaBoost (Real),1,0.95,0.8333333333333334,0.9748970527428702,54.807628870010376,0.0
38,1,Logistic Regression (Penalty = L2),1,0.95,0.95,0.944846175074216,0.2857191562652588,0.944846175074216
39,1,Naive Bayes,1,0.95,0.7666666666666667,0.683113982346698,0.10639357566833496,0.683113982346698
40,1,KNeighbors Classifier,2,0.95,0.847457627118644,0.7905694150420949,0.4343991279602051,0.7905694150420949
41,1,SVC Classifier,2,0.95,0.8135593220338984,1.0,0.32576632499694824,0.0
42,1,Decision Tree,2,0.95,0.8559322033898306,0.8084956347869159,0.11068916320800781,0.8084956347869159
43,1,RandomForest,2,0.95,0.8305084745762712,0.8113355557998021,0.64817214012146,0.0
44,1,AdaBoost (Discrete),2,0.95,0.923728813559322,0.7922561070581773,50.98277187347412,0.7922561070581773
45,1,AdaBoost (Real),2,0.95,0.8559322033898306,0.9641925040026272,55.19946074485779,0.0
46,1,Logistic Regression (Penalty = L2),2,0.95,0.9491525423728814,0.9422865815358938,0.33394527435302734,0.9422865815358938
47,1,Naive Bayes,2,0.95,0.7627118644067796,0.6740030772986388,0.1218726634979248,0.6740030772986388
48,2,KNeighbors Classifier,0,0.95,0.875,0.8539061940747412,0.33768630027770996,0.8539061940747412
49,2,SVC Classifier,0,0.95,0.8083333333333333,1.0,0.4424281120300293,0.0
50,2,Decision Tree,0,0.95,0.8166666666666667,0.6962069778644464,0.11048388481140137,0.6962069778644464
51,2,RandomForest,0,0.95,0.7416666666666667,0.8549909799879015,0.9338712692260742,0.0
52,2,AdaBoost (Discrete),0,0.95,0.825,0.7481595356833938,53.61044144630432,0.7481595356833938
53,2,AdaBoost (Real),0,0.95,0.7666666666666667,0.8339947279394198,58.13641047477722,0.0
54,2,Logistic Regression (Penalty = L2),0,0.95,0.975,0.9696654978825953,0.29436302185058594,0.9696654978825953
55,2,Naive Bayes,0,0.95,0.7833333333333333,0.743791857938213,0.11413002014160156,0.743791857938213
56,2,KNeighbors Classifier,1,0.95,0.8833333333333333,0.8566742080849569,0.35273003578186035,0.8566742080849569
57,2,SVC Classifier,1,0.95,0.8083333333333333,1.0,0.34922313690185547,0.0
58,2,Decision Tree,1,0.95,0.8916666666666667,0.8974971960607847,0.11455106735229492,0.8974971960607847
59,2,RandomForest,1,0.95,0.7916666666666666,0.6304636370330817,0.7864046096801758,0.0
60,2,AdaBoost (Discrete),1,0.95,0.325,1.0,51.63480067253113,0.0
61,2,AdaBoost (Real),1,0.95,0.8333333333333334,0.9748970527428702,57.53325414657593,0.0
62,2,Logistic Regression (Penalty = L2),1,0.95,0.9416666666666667,0.9381678405381247,0.37016916275024414,0.9381678405381247
63,2,Naive Bayes,1,0.95,0.7666666666666667,0.683113982346698,0.11665534973144531,0.683113982346698
64,2,KNeighbors Classifier,2,0.95,0.8559322033898306,0.8032279079814331,0.24283266067504883,0.8032279079814331
65,2,SVC Classifier,2,0.95,0.8135593220338984,1.0,0.47506022453308105,0.0
66,2,Decision Tree,2,0.95,0.9152542372881356,0.8757705492637583,0.11063742637634277,0.8757705492637583
67,2,RandomForest,2,0.95,0.864406779661017,0.8759247405254413,0.962151050567627,0.0
68,2,AdaBoost (Discrete),2,0.95,0.923728813559322,0.7922561070581773,58.89230179786682,0.7922561070581773
69,2,AdaBoost (Real),2,0.95,0.8559322033898306,0.9641925040026272,61.322712898254395,0.0
70,2,Logistic Regression (Penalty = L2),2,0.95,0.9576271186440678,0.9518558056141587,0.2947995662689209,0.9518558056141587
71,2,Naive Bayes,2,0.95,0.7627118644067796,0.6740030772986388,0.24625825881958008,0.6740030772986388
72,3,KNeighbors Classifier,0,0.95,0.85,0.8095162077061976,0.375896692276001,0.8095162077061976
73,3,SVC Classifier,0,0.95,0.8083333333333333,1.0,0.3721885681152344,0.0
74,3,Decision Tree,0,0.95,0.8333333333333334,0.8196887780824966,0.001506805419921875,0.8196887780824966
75,3,RandomForest,0,0.95,0.7416666666666667,0.5692332932256202,0.9902269840240479,0.0
76,3,AdaBoost (Discrete),0,0.95,0.8333333333333334,0.7550752681421514,58.67830443382263,0.7550752681421514
77,3,AdaBoost (Real),0,0.95,0.7666666666666667,0.8339947279394198,61.25897526741028,0.0
78,3,Logistic Regression (Penalty = L2),0,0.95,0.975,0.9696654978825953,0.29086852073669434,0.9696654978825953
79,3,Naive Bayes,0,0.95,0.8,0.7703780795498101,0.12949252128601074,0.7703780795498101
80,3,KNeighbors Classifier,1,0.95,0.875,0.8512343650594763,0.40545177459716797,0.8512343650594763
81,3,SVC Classifier,1,0.95,0.8083333333333333,1.0,0.5107192993164062,0.0
82,3,Decision Tree,1,0.95,0.9166666666666666,0.9232182646669358,0.12255644798278809,0.9232182646669358
83,3,RandomForest,1,0.95,0.7083333333333334,0.8077365005379291,0.8875131607055664,0.0
84,3,AdaBoost (Discrete),1,0.95,0.325,1.0,58.80927634239197,0.0
85,3,AdaBoost (Real),1,0.95,0.8333333333333334,0.9748970527428702,65.98229217529297,0.0
86,3,Logistic Regression (Penalty = L2),1,0.95,0.95,0.944846175074216,0.4021322727203369,0.944846175074216
87,3,Naive Bayes,1,0.95,0.7666666666666667,0.683113982346698,0.13440179824829102,0.683113982346698
88,3,KNeighbors Classifier,2,0.95,0.8389830508474576,0.7565428747114508,0.518535852432251,0.7565428747114508
89,3,SVC Classifier,2,0.95,0.8135593220338984,1.0,0.3943328857421875,0.0
90,3,Decision Tree,2,0.95,0.8898305084745762,0.7585003329974503,0.1373763084411621,0.7585003329974503
91,3,RandomForest,2,0.95,0.8983050847457628,0.928642293623991,0.9080538749694824,0.0
92,3,AdaBoost (Discrete),2,0.95,0.923728813559322,0.7922561070581773,57.16424775123596,0.7922561070581773
93,3,AdaBoost (Real),2,0.95,0.8559322033898306,0.9641925040026272,65.11958694458008,0.0
94,3,Logistic Regression (Penalty = L2),2,0.95,0.9491525423728814,0.9422865815358938,0.3395993709564209,0.9422865815358938
95,3,Naive Bayes,2,0.95,0.7627118644067796,0.6740030772986388,0.14192724227905273,0.6740030772986388
96,4,KNeighbors Classifier,0,0.95,0.8666666666666667,0.8271943805075725,0.40820860862731934,0.8271943805075725
97,4,SVC Classifier,0,0.95,0.8083333333333333,1.0,0.4555180072784424,0.0
98,4,Decision Tree,0,0.95,0.9,0.6831427064456109,0.1341991424560547,0.6831427064456109
99,4,RandomForest,0,0.95,0.7916666666666666,0.9714573096172799,0.9438672065734863,0.0
100,4,AdaBoost (Discrete),0,0.95,0.825,0.7481595356833938,59.48808789253235,0.7481595356833938
101,4,AdaBoost (Real),0,0.95,0.7666666666666667,0.8339947279394198,62.649824380874634,0.0
102,4,Logistic Regression (Penalty = L2),0,0.95,0.975,0.9696654978825953,0.33083486557006836,0.9696654978825953
103,4,Naive Bayes,0,0.95,0.7916666666666666,0.7569682576589495,0.25367093086242676,0.7569682576589495
104,4,KNeighbors Classifier,1,0.95,0.8833333333333333,0.8566742080849569,0.3845980167388916,0.8566742080849569
105,4,SVC Classifier,1,0.95,0.8083333333333333,1.0,0.4857335090637207,0.0
106,4,Decision Tree,1,0.95,0.8166666666666667,0.8488616195210507,0.0015077590942382812,0.8488616195210507
107,4,RandomForest,1,0.95,0.775,0.9420254600938036,0.7731056213378906,0.0
108,4,AdaBoost (Discrete),1,0.95,0.325,1.0,58.88149452209473,0.0
109,4,AdaBoost (Real),1,0.95,0.8333333333333334,0.9748970527428702,66.7183587551117,0.0
110,4,Logistic Regression (Penalty = L2),1,0.95,0.9416666666666667,0.9381678405381247,0.3597867488861084,0.9381678405381247
111,4,Naive Bayes,1,0.95,0.7666666666666667,0.683113982346698,0.2417600154876709,0.683113982346698
112,4,KNeighbors Classifier,2,0.95,0.847457627118644,0.7852089012375099,0.3995354175567627,0.7852089012375099
113,4,SVC Classifier,2,0.95,0.8135593220338984,1.0,0.412189245223999,0.0
114,4,Decision Tree,2,0.95,0.9491525423728814,0.9422865815358938,0.002132415771484375,0.9422865815358938
115,4,RandomForest,2,0.95,0.8813559322033898,0.6763233056407796,0.9622116088867188,0.6763233056407796
116,4,AdaBoost (Discrete),2,0.95,0.923728813559322,0.7922561070581773,66.13907480239868,0.7922561070581773
117,4,AdaBoost (Real),2,0.95,0.864406779661017,1.0,67.20298719406128,0.0
118,4,Logistic Regression (Penalty = L2),2,0.95,0.9576271186440678,0.9518558056141587,0.44077157974243164,0.9518558056141587
119,4,Naive Bayes,2,0.95,0.7627118644067796,0.6740030772986388,0.273958683013916,0.6740030772986388
120,5,KNeighbors Classifier,0,0.95,0.85,0.8309674453266357,0.42096972465515137,0.8309674453266357
121,5,SVC Classifier,0,0.95,0.8083333333333333,1.0,0.42110300064086914,0.0
122,5,Decision Tree,0,0.95,0.8583333333333333,0.7585979206937663,0.002117633819580078,0.7585979206937663
123,5,RandomForest,0,0.95,0.7583333333333333,0.5248945231621426,0.9838814735412598,0.0
124,5,AdaBoost (Discrete),0,0.95,0.8333333333333334,0.7550752681421514,62.67305874824524,0.7550752681421514
125,5,AdaBoost (Real),0,0.95,0.7666666666666667,0.8339947279394198,51.32106375694275,0.0
126,5,Logistic Regression (Penalty = L2),0,0.95,0.975,0.9696654978825953,0.3095123767852783,0.9696654978825953
127,5,Naive Bayes,0,0.95,0.7916666666666666,0.7569682576589495,0.12035465240478516,0.7569682576589495
128,5,KNeighbors Classifier,1,0.95,0.875,0.8512343650594763,0.37685298919677734,0.8512343650594763
129,5,SVC Classifier,1,0.95,0.8083333333333333,1.0,0.48544859886169434,0.0
130,5,Decision Tree,1,0.95,0.7916666666666666,0.7407966458379908,0.0015230178833007812,0.7407966458379908
131,5,RandomForest,1,0.95,0.7916666666666666,0.8593859637937393,0.7300982475280762,0.0
132,5,AdaBoost (Discrete),1,0.95,0.325,1.0,47.01877427101135,0.0
133,5,AdaBoost (Real),1,0.95,0.8333333333333334,0.9748970527428702,60.105645418167114,0.0
134,5,Logistic Regression (Penalty = L2),1,0.95,0.95,0.944846175074216,0.5150666236877441,0.944846175074216
135,5,Naive Bayes,1,0.95,0.7666666666666667,0.683113982346698,0.1441960334777832,0.683113982346698
136,5,KNeighbors Classifier,2,0.95,0.847457627118644,0.7905694150420949,0.5364186763763428,0.7905694150420949
137,5,SVC Classifier,2,0.95,0.8135593220338984,1.0,0.3108053207397461,0.0
138,5,Decision Tree,2,0.95,0.8813559322033898,0.8196184698270887,0.0016503334045410156,0.8196184698270887
139,5,RandomForest,2,0.95,0.8983050847457628,0.8401053634281663,0.9346625804901123,0.8401053634281663
140,5,AdaBoost (Discrete),2,0.95,0.923728813559322,0.7922561070581773,56.98328614234924,0.7922561070581773
141,5,AdaBoost (Real),2,0.95,0.8559322033898306,0.9641925040026272,63.12106275558472,0.0
142,5,Logistic Regression (Penalty = L2),2,0.95,0.9491525423728814,0.9422865815358938,0.49126267433166504,0.9422865815358938
143,5,Naive Bayes,2,0.95,0.7627118644067796,0.6740030772986388,0.12820672988891602,0.6740030772986388
144,6,KNeighbors Classifier,0,0.95,0.875,0.8539061940747412,0.38654398918151855,0.8539061940747412
145,6,SVC Classifier,0,0.95,0.8083333333333333,1.0,0.5147383213043213,0.0
146,6,Decision Tree,0,0.95,0.825,0.6031197029482682,0.0023899078369140625,0.6031197029482682
147,6,RandomForest,0,0.95,0.7416666666666667,0.8549909799879015,1.053917646408081,0.0
148,6,AdaBoost (Discrete),0,0.95,0.825,0.7481595356833938,54.795700550079346,0.7481595356833938
149,6,AdaBoost (Real),0,0.95,0.8,0.8532982640620798,61.543477058410645,0.0
150,6,Logistic Regression (Penalty = L2),0,0.95,0.975,0.9696654978825953,0.244187593460083,0.9696654978825953
151,6,Naive Bayes,0,0.95,0.7833333333333333,0.743791857938213,0.12304019927978516,0.743791857938213
152,6,KNeighbors Classifier,1,0.95,0.8833333333333333,0.8566742080849569,0.3704376220703125,0.8566742080849569
153,6,SVC Classifier,1,0.95,0.8083333333333333,1.0,0.377530574798584,0.0
154,6,Decision Tree,1,0.95,0.9166666666666666,0.9204623175158616,0.12311387062072754,0.9204623175158616
155,6,RandomForest,1,0.95,0.7916666666666666,0.6304636370330817,0.9069547653198242,0.0
156,6,AdaBoost (Discrete),1,0.95,0.325,1.0,53.21929621696472,0.0
157,6,AdaBoost (Real),1,0.95,0.8333333333333334,0.9748970527428702,61.29326105117798,0.0
158,6,Logistic Regression (Penalty = L2),1,0.95,0.9416666666666667,0.9381678405381247,0.3285489082336426,0.9381678405381247
159,6,Naive Bayes,1,0.95,0.7666666666666667,0.683113982346698,0.2652699947357178,0.683113982346698
160,6,KNeighbors Classifier,2,0.95,0.8559322033898306,0.8032279079814331,0.49314403533935547,0.8032279079814331
161,6,SVC Classifier,2,0.95,0.8135593220338984,1.0,0.49489665031433105,0.0
162,6,Decision Tree,2,0.95,0.8898305084745762,0.8009728372225151,0.0016164779663085938,0.8009728372225151
163,6,RandomForest,2,0.95,0.864406779661017,0.8759247405254413,0.7384188175201416,0.0
164,6,AdaBoost (Discrete),2,0.95,0.923728813559322,0.7922561070581773,63.363107681274414,0.7922561070581773
165,6,AdaBoost (Real),2,0.95,0.8559322033898306,0.9641925040026272,65.86474680900574,0.0
166,6,Logistic Regression (Penalty = L2),2,0.95,0.9576271186440678,0.9518558056141587,0.3941075801849365,0.9518558056141587
167,6,Naive Bayes,2,0.95,0.7627118644067796,0.6740030772986388,0.13655996322631836,0.6740030772986388
168,7,KNeighbors Classifier,0,0.95,0.875,0.8539061940747412,0.5161840915679932,0.8539061940747412
169,7,SVC Classifier,0,0.95,0.8083333333333333,1.0,0.5595719814300537,0.0
170,7,Decision Tree,0,0.95,0.825,0.712880199197191,0.1343860626220703,0.712880199197191
171,7,RandomForest,0,0.95,0.8,0.6358114348177182,0.9455428123474121,0.0
172,7,AdaBoost (Discrete),0,0.95,0.825,0.7481595356833938,59.08612823486328,0.7481595356833938
173,7,AdaBoost (Real),0,0.95,0.7666666666666667,0.8339947279394198,64.30448365211487,0.0
174,7,Logistic Regression (Penalty = L2),0,0.95,0.975,0.9696654978825953,0.25894999504089355,0.9696654978825953
175,7,Naive Bayes,0,0.95,0.7833333333333333,0.743791857938213,0.134202241897583,0.743791857938213
176,7,KNeighbors Classifier,1,0.95,0.875,0.8526614251383757,0.5435583591461182,0.8526614251383757
177,7,SVC Classifier,1,0.95,0.8083333333333333,1.0,0.5320627689361572,0.0
178,7,Decision Tree,1,0.95,0.825,0.7987571918421159,0.12627124786376953,0.7987571918421159
179,7,RandomForest,1,0.95,0.8416666666666667,0.9665910224658814,0.8339953422546387,0.0
180,7,AdaBoost (Discrete),1,0.95,0.325,1.0,58.3995041847229,0.0
181,7,AdaBoost (Real),1,0.95,0.8333333333333334,0.9748970527428702,65.99977016448975,0.0
182,7,Logistic Regression (Penalty = L2),1,0.95,0.9416666666666667,0.9381678405381247,0.46903347969055176,0.9381678405381247
183,7,Naive Bayes,1,0.95,0.7666666666666667,0.683113982346698,0.13204503059387207,0.683113982346698
184,7,KNeighbors Classifier,2,0.95,0.8559322033898306,0.8032279079814331,0.6118004322052002,0.8032279079814331
185,7,SVC Classifier,2,0.95,0.8135593220338984,1.0,0.5002162456512451,0.0
186,7,Decision Tree,2,0.95,0.9322033898305084,0.9043044717058228,0.14986395835876465,0.9043044717058228
187,7,RandomForest,2,0.95,0.8135593220338984,0.5099122256638764,1.2791597843170166,0.5099122256638764
188,7,AdaBoost (Discrete),2,0.95,0.923728813559322,0.7922561070581773,72.517493724823,0.7922561070581773
189,7,AdaBoost (Real),2,0.95,0.864406779661017,1.0,58.89870882034302,0.0
190,7,Logistic Regression (Penalty = L2),2,0.95,0.9576271186440678,0.9518558056141587,0.2911033630371094,0.9518558056141587
191,7,Naive Bayes,2,0.95,0.7627118644067796,0.6740030772986388,0.2985367774963379,0.6740030772986388
192,8,KNeighbors Classifier,0,0.95,0.85,0.8095162077061976,0.7018027305603027,0.8095162077061976
193,8,SVC Classifier,0,0.95,0.8083333333333333,1.0,0.8273143768310547,0.0
194,8,Decision Tree,0,0.95,0.7916666666666666,0.6406807680878588,0.002221345901489258,0.6406807680878588
195,8,RandomForest,0,0.95,0.7416666666666667,0.5692332932256202,1.194836139678955,0.0
196,8,AdaBoost (Discrete),0,0.95,0.8333333333333334,0.7550752681421514,64.88625049591064,0.7550752681421514
197,8,AdaBoost (Real),0,0.95,0.7666666666666667,0.8339947279394198,71.23412346839905,0.0
198,8,Logistic Regression (Penalty = L2),0,0.95,0.975,0.9696654978825953,0.2960786819458008,0.9696654978825953
199,8,Naive Bayes,0,0.95,0.8,0.7703780795498101,0.2941710948944092,0.7703780795498101
200,8,KNeighbors Classifier,1,0.95,0.875,0.8512343650594763,0.4220845699310303,0.8512343650594763
201,8,SVC Classifier,1,0.95,0.8083333333333333,1.0,0.5631530284881592,0.0
202,8,Decision Tree,1,0.95,0.825,0.8221430001725661,0.002094745635986328,0.8221430001725661
203,8,RandomForest,1,0.95,0.7083333333333334,0.8077365005379291,1.0394644737243652,0.0
204,8,AdaBoost (Discrete),1,0.95,0.325,1.0,65.84795880317688,0.0
205,8,AdaBoost (Real),1,0.95,0.8333333333333334,0.9748970527428702,69.85984563827515,0.0
206,8,Logistic Regression (Penalty = L2),1,0.95,0.95,0.944846175074216,0.5117785930633545,0.944846175074216
207,8,Naive Bayes,1,0.95,0.7666666666666667,0.683113982346698,0.14162731170654297,0.683113982346698
208,8,KNeighbors Classifier,2,0.95,0.8389830508474576,0.7565428747114508,0.44460630416870117,0.7565428747114508
209,8,SVC Classifier,2,0.95,0.8135593220338984,1.0,0.44022512435913086,0.0
210,8,Decision Tree,2,0.95,0.9576271186440678,0.9533988533647133,0.14658379554748535,0.9533988533647133
211,8,RandomForest,2,0.95,0.8983050847457628,0.928642293623991,1.193446159362793,0.0
212,8,AdaBoost (Discrete),2,0.95,0.923728813559322,0.7922561070581773,63.63849925994873,0.7922561070581773
213,8,AdaBoost (Real),2,0.95,0.8559322033898306,0.9641925040026272,68.97734451293945,0.0
214,8,Logistic Regression (Penalty = L2),2,0.95,0.9491525423728814,0.9422865815358938,0.323150634765625,0.9422865815358938
215,8,Naive Bayes,2,0.95,0.7627118644067796,0.6740030772986388,0.13239264488220215,0.6740030772986388
