,feat_set_id,classifier,fold_id,feat_th,score,geo_score,exec_t,geo_score_woz
0,0,KNeighbors Classifier,0,0.45,0.9731343283582089,0.9727215076064242,1.5419154167175293,0.9727215076064242
1,0,SVC Classifier,0,0.45,0.9104477611940298,0.9092929779078811,2.222965717315674,0.9092929779078811
2,0,Decision Tree,0,0.45,0.7179104477611941,0.7131460793462613,0.14208984375,0.7131460793462613
3,0,RandomForest,0,0.45,0.7104477611940299,0.6936678058676554,0.4768557548522949,0.6936678058676554
4,0,AdaBoost (Discrete),0,0.45,0.9238805970149254,0.9228206094737671,105.55453991889954,0.9228206094737671
5,0,AdaBoost (Real),0,0.45,0.8940298507462686,0.8928940081078957,114.18134617805481,0.8928940081078957
6,0,Logistic Regression (Penalty = L2),0,0.45,0.9432835820895522,0.9422107686673737,0.8753113746643066,0.9422107686673737
7,0,Naive Bayes,0,0.45,0.9373134328358209,0.9364875439464742,0.17423725128173828,0.9364875439464742
8,0,KNeighbors Classifier,1,0.45,0.9626865671641791,0.96244823591297,1.4768850803375244,0.96244823591297
9,0,SVC Classifier,1,0.45,0.9298507462686567,0.9293975557391989,2.292687177658081,0.9293975557391989
10,0,Decision Tree,1,0.45,0.7865671641791044,0.7830714111541505,0.09743571281433105,0.7830714111541505
11,0,RandomForest,1,0.45,0.7373134328358208,0.7182858708949137,0.5580801963806152,0.7182858708949137
12,0,AdaBoost (Discrete),1,0.45,0.9313432835820895,0.9309085436240743,109.80539059638977,0.9309085436240743
13,0,AdaBoost (Real),1,0.45,0.8641791044776119,0.8621372210576662,125.23744797706604,0.8621372210576662
14,0,Logistic Regression (Penalty = L2),1,0.45,0.9552238805970149,0.9549460722304838,0.9136078357696533,0.9549460722304838
15,0,Naive Bayes,1,0.45,0.9417910447761194,0.9414511458901552,0.14952659606933594,0.9414511458901552
16,0,KNeighbors Classifier,2,0.45,0.9742424242424242,0.9740289201464911,1.755192756652832,0.9740289201464911
17,0,SVC Classifier,2,0.45,0.9318181818181818,0.9308348853356181,2.455030918121338,0.9308348853356181
18,0,Decision Tree,2,0.45,0.7924242424242425,0.7878689317633304,0.17072653770446777,0.7878689317633304
19,0,RandomForest,2,0.45,0.7333333333333333,0.717804668866175,0.5125110149383545,0.717804668866175
20,0,AdaBoost (Discrete),2,0.45,0.9454545454545454,0.9448330118939096,107.08003687858582,0.9448330118939096
21,0,AdaBoost (Real),2,0.45,0.8575757575757575,0.8560636287482779,104.44665670394897,0.8560636287482779
22,0,Logistic Regression (Penalty = L2),2,0.45,0.9515151515151515,0.951301522136389,0.8695178031921387,0.951301522136389
23,0,Naive Bayes,2,0.45,0.95,0.9497087918440698,0.1730794906616211,0.9497087918440698
24,1,KNeighbors Classifier,0,0.45,0.9731343283582089,0.9729339414724576,1.6102900505065918,0.9729339414724576
25,1,SVC Classifier,0,0.45,0.9223880597014925,0.921381049904874,3.051785707473755,0.921381049904874
26,1,Decision Tree,0,0.45,0.6865671641791045,0.6806098211956396,0.21418166160583496,0.6806098211956396
27,1,RandomForest,0,0.45,0.7328358208955223,0.7115429090835852,0.6546573638916016,0.7115429090835852
28,1,AdaBoost (Discrete),0,0.45,0.9313432835820895,0.9307669380503361,144.93021607398987,0.9307669380503361
29,1,AdaBoost (Real),0,0.45,0.7701492537313432,0.7670682515334707,154.021080493927,0.7670682515334707
30,1,Logistic Regression (Penalty = L2),0,0.45,0.9462686567164179,0.9455043185088051,1.2426493167877197,0.9455043185088051
31,1,Naive Bayes,0,0.45,0.935820895522388,0.9351081745718679,0.17781591415405273,0.9351081745718679
32,1,KNeighbors Classifier,1,0.45,0.9656716417910448,0.9653679189123489,2.2963364124298096,0.9653679189123489
33,1,SVC Classifier,1,0.45,0.9208955223880597,0.9198265337724075,3.3962721824645996,0.9198265337724075
34,1,Decision Tree,1,0.45,0.7597014925373134,0.7529539987797791,0.1450028419494629,0.7529539987797791
35,1,RandomForest,1,0.45,0.7656716417910447,0.7479055422115957,0.648810863494873,0.7479055422115957
36,1,AdaBoost (Discrete),1,0.45,0.9298507462686567,0.9285839447015092,149.033465385437,0.9285839447015092
37,1,AdaBoost (Real),1,0.45,0.8611940298507462,0.8599248197055868,154.93030762672424,0.8599248197055868
38,1,Logistic Regression (Penalty = L2),1,0.45,0.9477611940298507,0.9472583244804009,1.4100921154022217,0.9472583244804009
39,1,Naive Bayes,1,0.45,0.9402985074626866,0.9399681770511893,0.15226149559020996,0.9399681770511893
40,1,KNeighbors Classifier,2,0.45,0.9712121212121212,0.9709628383586548,2.328705310821533,0.9709628383586548
41,1,SVC Classifier,2,0.45,0.9181818181818182,0.9173924489512628,3.458383083343506,0.9173924489512628
42,1,Decision Tree,2,0.45,0.7348484848484849,0.7277107151077687,0.21483683586120605,0.7277107151077687
43,1,RandomForest,2,0.45,0.7303030303030303,0.7166892174257268,0.669964075088501,0.7166892174257268
44,1,AdaBoost (Discrete),2,0.45,0.9257575757575758,0.9248069316697645,147.10197758674622,0.9248069316697645
45,1,AdaBoost (Real),2,0.45,0.8681818181818182,0.8619794895325716,150.53679180145264,0.8619794895325716
46,1,Logistic Regression (Penalty = L2),2,0.45,0.9590909090909091,0.9588022217464637,1.2956445217132568,0.9588022217464637
47,1,Naive Bayes,2,0.45,0.9378787878787879,0.9375984174977255,0.13365912437438965,0.9375984174977255
48,2,KNeighbors Classifier,0,0.45,0.9462686567164179,0.9450376230295047,2.435300588607788,0.9450376230295047
49,2,SVC Classifier,0,0.45,0.9014925373134328,0.8994638594158852,3.4356610774993896,0.8994638594158852
50,2,Decision Tree,0,0.45,0.7059701492537314,0.6989917571760111,0.2114865779876709,0.6989917571760111
51,2,RandomForest,0,0.45,0.6402985074626866,0.5707012435126882,0.7991406917572021,0.5707012435126882
52,2,AdaBoost (Discrete),0,0.45,0.9029850746268657,0.9015170929270703,140.66369199752808,0.9015170929270703
53,2,AdaBoost (Real),0,0.45,0.8462686567164179,0.8420634581233369,158.12115597724915,0.8420634581233369
54,2,Logistic Regression (Penalty = L2),0,0.45,0.9328358208955224,0.9315823830065028,1.2690532207489014,0.9315823830065028
55,2,Naive Bayes,0,0.45,0.9134328358208955,0.9123401614652156,0.15370845794677734,0.9123401614652156
56,2,KNeighbors Classifier,1,0.45,0.9388059701492537,0.9369624858384971,2.5762181282043457,0.9369624858384971
57,2,SVC Classifier,1,0.45,0.891044776119403,0.8881408362284554,3.709547996520996,0.8881408362284554
58,2,Decision Tree,1,0.45,0.7507462686567165,0.7445457223386076,0.22621822357177734,0.7445457223386076
59,2,RandomForest,1,0.45,0.7164179104477612,0.6958136873925967,0.7466812133789062,0.6958136873925967
60,2,AdaBoost (Discrete),1,0.45,0.8955223880597015,0.8942189021542953,164.77625131607056,0.8942189021542953
61,2,AdaBoost (Real),1,0.45,0.8328358208955224,0.8291070204476907,187.0631880760193,0.8291070204476907
62,2,Logistic Regression (Penalty = L2),1,0.45,0.9328358208955224,0.9322801522376899,1.4672372341156006,0.9322801522376899
63,2,Naive Bayes,1,0.45,0.9104477611940298,0.909427668922655,0.2355048656463623,0.909427668922655
64,2,KNeighbors Classifier,2,0.45,0.9484848484848485,0.9478420574382109,2.5660934448242188,0.9478420574382109
65,2,SVC Classifier,2,0.45,0.906060606060606,0.9036204367830334,3.997394323348999,0.9036204367830334
66,2,Decision Tree,2,0.45,0.7045454545454546,0.7017956475769862,0.23970961570739746,0.7017956475769862
67,2,RandomForest,2,0.45,0.7227272727272728,0.7080160578793387,0.7823629379272461,0.7080160578793387
68,2,AdaBoost (Discrete),2,0.45,0.9030303030303031,0.90231599033664,174.36315751075745,0.90231599033664
69,2,AdaBoost (Real),2,0.45,0.8560606060606061,0.8541474648082878,184.63545036315918,0.8541474648082878
70,2,Logistic Regression (Penalty = L2),2,0.45,0.9348484848484848,0.9340649117883635,1.3084819316864014,0.9340649117883635
71,2,Naive Bayes,2,0.45,0.9272727272727272,0.9269288281251764,0.23077011108398438,0.9269288281251764
72,3,KNeighbors Classifier,0,0.45,0.9447761194029851,0.9437320939636766,2.641664743423462,0.9437320939636766
73,3,SVC Classifier,0,0.45,0.8626865671641791,0.8610414189726738,3.829418420791626,0.8610414189726738
74,3,Decision Tree,0,0.45,0.6656716417910448,0.6557721618884286,0.23918700218200684,0.6557721618884286
75,3,RandomForest,0,0.45,0.6970149253731344,0.6779763328015431,0.955949068069458,0.6779763328015431
76,3,AdaBoost (Discrete),0,0.45,0.8805970149253731,0.8790098625411082,160.68774247169495,0.8790098625411082
77,3,AdaBoost (Real),0,0.45,0.8388059701492537,0.8377191342162662,168.04425168037415,0.8377191342162662
78,3,Logistic Regression (Penalty = L2),0,0.45,0.9059701492537313,0.9045688348530628,1.4261021614074707,0.9045688348530628
79,3,Naive Bayes,0,0.45,0.891044776119403,0.8899975350967929,0.22721648216247559,0.8899975350967929
80,3,KNeighbors Classifier,1,0.45,0.9388059701492537,0.9370435545483431,2.6959855556488037,0.9370435545483431
81,3,SVC Classifier,1,0.45,0.8552238805970149,0.8520683024100144,4.238125324249268,0.8520683024100144
82,3,Decision Tree,1,0.45,0.6776119402985075,0.6658798083730454,0.1574695110321045,0.6658798083730454
83,3,RandomForest,1,0.45,0.7343283582089553,0.7189528033599313,0.7270824909210205,0.7189528033599313
84,3,AdaBoost (Discrete),1,0.45,0.8686567164179104,0.8661400540467002,160.82109832763672,0.8661400540467002
85,3,AdaBoost (Real),1,0.45,0.6253731343283582,0.5962550010758628,161.82953190803528,0.5962550010758628
86,3,Logistic Regression (Penalty = L2),1,0.45,0.9134328358208955,0.9120902142656733,1.526798963546753,0.9120902142656733
87,3,Naive Bayes,1,0.45,0.8940298507462686,0.8922280550655228,0.22580718994140625,0.8922280550655228
88,3,KNeighbors Classifier,2,0.45,0.95,0.9493895804085606,2.492626428604126,0.9493895804085606
89,3,SVC Classifier,2,0.45,0.8636363636363636,0.8605735609608349,3.972259759902954,0.8605735609608349
90,3,Decision Tree,2,0.45,0.6954545454545454,0.6912092365225713,0.17963910102844238,0.6912092365225713
91,3,RandomForest,2,0.45,0.7212121212121212,0.7037416121165402,0.8189704418182373,0.7037416121165402
92,3,AdaBoost (Discrete),2,0.45,0.8833333333333333,0.881048414691023,159.2932231426239,0.881048414691023
93,3,AdaBoost (Real),2,0.45,0.8545454545454545,0.8530308791620641,161.9671914577484,0.8530308791620641
94,3,Logistic Regression (Penalty = L2),2,0.45,0.9166666666666666,0.9157113423043477,1.3201751708984375,0.9157113423043477
95,3,Naive Bayes,2,0.45,0.9075757575757576,0.9069081217338477,0.2263195514678955,0.9069081217338477
96,4,KNeighbors Classifier,0,0.45,0.9641791044776119,0.963641107258534,1.6911582946777344,0.963641107258534
97,4,SVC Classifier,0,0.45,0.9074626865671642,0.9061795388478501,2.965689182281494,0.9061795388478501
98,4,Decision Tree,0,0.45,0.7373134328358208,0.7314359136213415,0.15159916877746582,0.7314359136213415
99,4,RandomForest,0,0.45,0.664179104477612,0.5946004348505478,0.7538468837738037,0.5946004348505478
100,4,AdaBoost (Discrete),0,0.45,0.9149253731343283,0.913995207166431,119.10888648033142,0.913995207166431
101,4,AdaBoost (Real),0,0.45,0.9074626865671642,0.9065261485236171,144.27546858787537,0.9065261485236171
102,4,Logistic Regression (Penalty = L2),0,0.45,0.9313432835820895,0.9300408183806977,1.087817907333374,0.9300408183806977
103,4,Naive Bayes,0,0.45,0.9208955223880597,0.9201651494603978,0.23877573013305664,0.9201651494603978
104,4,KNeighbors Classifier,1,0.45,0.9611940298507463,0.9606973168020676,1.6763317584991455,0.9606973168020676
105,4,SVC Classifier,1,0.45,0.9164179104477612,0.9155730255795783,3.0619759559631348,0.9155730255795783
106,4,Decision Tree,1,0.45,0.7522388059701492,0.7496441774789662,0.22562003135681152,0.7496441774789662
107,4,RandomForest,1,0.45,0.6507462686567164,0.5630623645338236,0.7585127353668213,0.5630623645338236
108,4,AdaBoost (Discrete),1,0.45,0.9223880597014925,0.9217575606821743,125.86097288131714,0.9217575606821743
109,4,AdaBoost (Real),1,0.45,0.8507462686567164,0.8491178125935724,126.66280698776245,0.8491178125935724
110,4,Logistic Regression (Penalty = L2),1,0.45,0.9447761194029851,0.9442278530454532,1.0387580394744873,0.9442278530454532
111,4,Naive Bayes,1,0.45,0.9388059701492537,0.9384653984515626,0.2114708423614502,0.9384653984515626
112,4,KNeighbors Classifier,2,0.45,0.9696969696969697,0.9694601578750573,1.6968035697937012,0.9694601578750573
113,4,SVC Classifier,2,0.45,0.9272727272727272,0.9267124135645831,3.245091438293457,0.9267124135645831
114,4,Decision Tree,2,0.45,0.7712121212121212,0.7660623210697394,0.21343398094177246,0.7660623210697394
115,4,RandomForest,2,0.45,0.6590909090909091,0.576581804778432,0.7182431221008301,0.576581804778432
116,4,AdaBoost (Discrete),2,0.45,0.9363636363636364,0.9357443815847459,118.96420741081238,0.9357443815847459
117,4,AdaBoost (Real),2,0.45,0.8954545454545455,0.8943167266821123,118.86487054824829,0.8943167266821123
118,4,Logistic Regression (Penalty = L2),2,0.45,0.9545454545454546,0.9543770616330284,0.9947760105133057,0.9543770616330284
119,4,Naive Bayes,2,0.45,0.9454545454545454,0.9450663870846061,0.1866590976715088,0.9450663870846061
120,5,KNeighbors Classifier,0,0.45,0.9582089552238806,0.9576784434128577,1.0302114486694336,0.9576784434128577
121,5,SVC Classifier,0,0.45,0.8656716417910447,0.8611227794315978,2.3584022521972656,0.8611227794315978
122,5,Decision Tree,0,0.45,0.7298507462686568,0.7237490118467537,0.12903928756713867,0.7237490118467537
123,5,RandomForest,0,0.45,0.6761194029850747,0.6323348187715124,0.7146797180175781,0.6323348187715124
124,5,AdaBoost (Discrete),0,0.45,0.8880597014925373,0.8869066619603615,91.58116030693054,0.8869066619603615
125,5,AdaBoost (Real),0,0.45,0.8641791044776119,0.8622204867920373,105.93234729766846,0.8622204867920373
126,5,Logistic Regression (Penalty = L2),0,0.45,0.9328358208955224,0.9321336360816327,0.8631782531738281,0.9321336360816327
127,5,Naive Bayes,0,0.45,0.9044776119402985,0.9034768030568999,0.1521768569946289,0.9034768030568999
128,5,KNeighbors Classifier,1,0.45,0.9507462686567164,0.9504353934355558,1.2221214771270752,0.9504353934355558
129,5,SVC Classifier,1,0.45,0.8686567164179104,0.8651548037371838,2.852242946624756,0.8651548037371838
130,5,Decision Tree,1,0.45,0.7373134328358208,0.731509558453985,0.14104628562927246,0.731509558453985
131,5,RandomForest,1,0.45,0.6850746268656717,0.6440904221301212,0.652651309967041,0.6440904221301212
132,5,AdaBoost (Discrete),1,0.45,0.9059701492537313,0.9049994083796409,94.55690789222717,0.9049994083796409
133,5,AdaBoost (Real),1,0.45,0.8477611940298507,0.8464488389137768,103.1203441619873,0.8464488389137768
134,5,Logistic Regression (Penalty = L2),1,0.45,0.926865671641791,0.9262514426861275,0.960953950881958,0.9262514426861275
135,5,Naive Bayes,1,0.45,0.9059701492537313,0.9050260575983564,0.1329491138458252,0.9050260575983564
136,5,KNeighbors Classifier,2,0.45,0.9590909090909091,0.9588490794393557,1.2313895225524902,0.9588490794393557
137,5,SVC Classifier,2,0.45,0.8939393939393939,0.8918631591736418,2.7165791988372803,0.8918631591736418
138,5,Decision Tree,2,0.45,0.759090909090909,0.7504969655831477,0.13274765014648438,0.7504969655831477
139,5,RandomForest,2,0.45,0.5818181818181818,0.4426366484650092,0.6475212574005127,0.0
140,5,AdaBoost (Discrete),2,0.45,0.9106060606060606,0.9096091828571563,93.9862060546875,0.9096091828571563
141,5,AdaBoost (Real),2,0.45,0.8833333333333333,0.8816444847456141,100.24668455123901,0.8816444847456141
142,5,Logistic Regression (Penalty = L2),2,0.45,0.9166666666666666,0.9160887521272134,0.8143033981323242,0.9160887521272134
143,5,Naive Bayes,2,0.45,0.9136363636363637,0.9132077541726277,0.13347673416137695,0.9132077541726277
144,6,KNeighbors Classifier,0,0.45,0.9462686567164179,0.9453211092596009,1.069899559020996,0.9453211092596009
145,6,SVC Classifier,0,0.45,0.8388059701492537,0.8312236448460991,2.335461378097534,0.8312236448460991
146,6,Decision Tree,0,0.45,0.746268656716418,0.741329329902757,0.13017892837524414,0.741329329902757
147,6,RandomForest,0,0.45,0.655223880597015,0.6083566542951158,0.7102861404418945,0.6083566542951158
148,6,AdaBoost (Discrete),0,0.45,0.8686567164179104,0.8661671729609658,83.37863564491272,0.8661671729609658
149,6,AdaBoost (Real),0,0.45,0.8492537313432836,0.8479091004032152,93.54183101654053,0.8479091004032152
150,6,Logistic Regression (Penalty = L2),0,0.45,0.8895522388059701,0.8867816419065302,0.7781519889831543,0.8867816419065302
151,6,Naive Bayes,0,0.45,0.9014925373134328,0.8998918822111059,0.1276535987854004,0.8998918822111059
152,6,KNeighbors Classifier,1,0.45,0.9492537313432836,0.948255883516519,1.0258126258850098,0.948255883516519
153,6,SVC Classifier,1,0.45,0.8313432835820895,0.8253510765467987,2.367375135421753,0.8253510765467987
154,6,Decision Tree,1,0.45,0.7343283582089553,0.730763409388927,0.13543128967285156,0.730763409388927
155,6,RandomForest,1,0.45,0.6716417910447762,0.6435104613901401,0.5207521915435791,0.6435104613901401
156,6,AdaBoost (Discrete),1,0.45,0.8417910447761194,0.8357143623291134,83.76402950286865,0.8357143623291134
157,6,AdaBoost (Real),1,0.45,0.6149253731343284,0.5904185889984176,94.54295825958252,0.5904185889984176
158,6,Logistic Regression (Penalty = L2),1,0.45,0.9014925373134328,0.8995806345615411,0.796057939529419,0.8995806345615411
159,6,Naive Bayes,1,0.45,0.9,0.8985682751158264,0.13697552680969238,0.8985682751158264
160,6,KNeighbors Classifier,2,0.45,0.9606060606060606,0.959635603841152,1.0680079460144043,0.959635603841152
161,6,SVC Classifier,2,0.45,0.8560606060606061,0.8508760583285147,2.536297082901001,0.8508760583285147
162,6,Decision Tree,2,0.45,0.7666666666666667,0.7594146699220689,0.13208889961242676,0.7594146699220689
163,6,RandomForest,2,0.45,0.7318181818181818,0.7136623023849583,0.6039988994598389,0.7136623023849583
164,6,AdaBoost (Discrete),2,0.45,0.8606060606060606,0.8560484242801724,88.73693776130676,0.8560484242801724
165,6,AdaBoost (Real),2,0.45,0.4893939393939394,0.44814398066616645,100.2800178527832,0.44814398066616645
166,6,Logistic Regression (Penalty = L2),2,0.45,0.9106060606060606,0.9097456627597804,0.8073008060455322,0.9097456627597804
167,6,Naive Bayes,2,0.45,0.9121212121212121,0.9111676461219596,0.2051541805267334,0.9111676461219596
168,7,KNeighbors Classifier,0,0.45,0.9537313432835821,0.9531397934251573,1.2214126586914062,0.9531397934251573
169,7,SVC Classifier,0,0.45,0.8537313432835821,0.8486423618259097,2.6805429458618164,0.8486423618259097
170,7,Decision Tree,0,0.45,0.7477611940298508,0.7421649488466194,0.1372542381286621,0.7421649488466194
171,7,RandomForest,0,0.45,0.682089552238806,0.5723765564030356,0.6846892833709717,0.5723765564030356
172,7,AdaBoost (Discrete),0,0.45,0.8776119402985074,0.8763143952684631,94.05278372764587,0.8763143952684631
173,7,AdaBoost (Real),0,0.45,0.8716417910447761,0.8704056509970918,100.46716737747192,0.8704056509970918
174,7,Logistic Regression (Penalty = L2),0,0.45,0.9208955223880597,0.9195719217195436,0.864774227142334,0.9195719217195436
175,7,Naive Bayes,0,0.45,0.8940298507462686,0.8931680775330357,0.19782257080078125,0.8931680775330357
176,7,KNeighbors Classifier,1,0.45,0.9477611940298507,0.9470323725903009,1.1493191719055176,0.9470323725903009
177,7,SVC Classifier,1,0.45,0.8656716417910447,0.861897291143913,2.3838424682617188,0.861897291143913
178,7,Decision Tree,1,0.45,0.7268656716417911,0.7217300331214186,0.12932658195495605,0.7217300331214186
179,7,RandomForest,1,0.45,0.6895522388059702,0.6451739504778691,0.5779502391815186,0.6451739504778691
180,7,AdaBoost (Discrete),1,0.45,0.8850746268656716,0.8836819003553336,89.0117700099945,0.8836819003553336
181,7,AdaBoost (Real),1,0.45,0.8477611940298507,0.8448258976090476,99.9525830745697,0.8448258976090476
182,7,Logistic Regression (Penalty = L2),1,0.45,0.926865671641791,0.9259644132942793,0.8069643974304199,0.9259644132942793
183,7,Naive Bayes,1,0.45,0.8970149253731343,0.8959962614991844,0.1217958927154541,0.8959962614991844
184,7,KNeighbors Classifier,2,0.45,0.9515151515151515,0.9511358970832331,1.0393109321594238,0.9511358970832331
185,7,SVC Classifier,2,0.45,0.8893939393939394,0.886621352711599,2.466961622238159,0.886621352711599
186,7,Decision Tree,2,0.45,0.7424242424242424,0.7379179719300996,0.1210947036743164,0.7379179719300996
187,7,RandomForest,2,0.45,0.7303030303030303,0.7091886263396228,0.4939694404602051,0.7091886263396228
188,7,AdaBoost (Discrete),2,0.45,0.906060606060606,0.903205488929377,86.64294719696045,0.903205488929377
189,7,AdaBoost (Real),2,0.45,0.85,0.8439873760091399,92.64812779426575,0.8439873760091399
190,7,Logistic Regression (Penalty = L2),2,0.45,0.9227272727272727,0.9219415791929115,0.7183585166931152,0.9219415791929115
191,7,Naive Bayes,2,0.45,0.9212121212121213,0.9207004804232845,0.15912413597106934,0.9207004804232845
192,8,KNeighbors Classifier,0,0.45,0.9402985074626866,0.9387838451590005,0.9854369163513184,0.9387838451590005
193,8,SVC Classifier,0,0.45,0.8373134328358209,0.8323845677303505,2.2111668586730957,0.8323845677303505
194,8,Decision Tree,0,0.45,0.7104477611940299,0.7001022420148164,0.11120438575744629,0.7001022420148164
195,8,RandomForest,0,0.45,0.6791044776119403,0.6597331702226759,0.606081485748291,0.6597331702226759
196,8,AdaBoost (Discrete),0,0.45,0.8656716417910447,0.8640663039483117,79.81791186332703,0.8640663039483117
197,8,AdaBoost (Real),0,0.45,0.826865671641791,0.8231024470641958,96.51187181472778,0.8231024470641958
198,8,Logistic Regression (Penalty = L2),0,0.45,0.891044776119403,0.8887722251171049,0.758617639541626,0.8887722251171049
199,8,Naive Bayes,0,0.45,0.8835820895522388,0.8825277368078557,0.22674202919006348,0.8825277368078557
200,8,KNeighbors Classifier,1,0.45,0.9462686567164179,0.9451740347674886,1.0826032161712646,0.9451740347674886
201,8,SVC Classifier,1,0.45,0.844776119402985,0.8412290746610619,2.4512925148010254,0.8412290746610619
202,8,Decision Tree,1,0.45,0.746268656716418,0.7413332398301359,0.12384915351867676,0.7413332398301359
203,8,RandomForest,1,0.45,0.691044776119403,0.6773852210693486,0.5695242881774902,0.6773852210693486
204,8,AdaBoost (Discrete),1,0.45,0.8686567164179104,0.8625053713517016,87.030832529068,0.8625053713517016
205,8,AdaBoost (Real),1,0.45,0.6223880597014926,0.6073484511232172,91.53403973579407,0.6073484511232172
206,8,Logistic Regression (Penalty = L2),1,0.45,0.9074626865671642,0.9063642059827014,0.6960089206695557,0.9063642059827014
207,8,Naive Bayes,1,0.45,0.8925373134328358,0.8910741485703747,0.1332080364227295,0.8910741485703747
208,8,KNeighbors Classifier,2,0.45,0.9424242424242424,0.9417478496834012,1.1457431316375732,0.9417478496834012
209,8,SVC Classifier,2,0.45,0.85,0.846579614557117,2.3693034648895264,0.846579614557117
210,8,Decision Tree,2,0.45,0.740909090909091,0.7376139403749419,0.12900996208190918,0.7376139403749419
211,8,RandomForest,2,0.45,0.6742424242424242,0.6519510427048795,0.5729038715362549,0.6519510427048795
212,8,AdaBoost (Discrete),2,0.45,0.8727272727272727,0.8672628216154187,86.67130398750305,0.8672628216154187
213,8,AdaBoost (Real),2,0.45,0.7863636363636364,0.7819630909413766,92.00446081161499,0.7819630909413766
214,8,Logistic Regression (Penalty = L2),2,0.45,0.9045454545454545,0.9036554260143879,0.7140376567840576,0.9036554260143879
215,8,Naive Bayes,2,0.45,0.9090909090909091,0.9084180560007536,0.12145042419433594,0.9084180560007536
216,9,KNeighbors Classifier,0,0.45,0.9373134328358209,0.9353780044328066,1.1993169784545898,0.9353780044328066
217,9,SVC Classifier,0,0.45,0.8522388059701492,0.8492074534931384,2.315272569656372,0.8492074534931384
218,9,Decision Tree,0,0.45,0.7059701492537314,0.6957720228015906,0.12166571617126465,0.6957720228015906
219,9,RandomForest,0,0.45,0.6268656716417911,0.5756961289620725,0.5993146896362305,0.5756961289620725
220,9,AdaBoost (Discrete),0,0.45,0.8701492537313433,0.867889746250976,85.1536762714386,0.867889746250976
221,9,AdaBoost (Real),0,0.45,0.7865671641791044,0.7808222941565753,89.3722939491272,0.7808222941565753
222,9,Logistic Regression (Penalty = L2),0,0.45,0.9014925373134328,0.8998400191650658,0.723947286605835,0.8998400191650658
223,9,Naive Bayes,0,0.45,0.8820895522388059,0.8811908007762612,0.16633248329162598,0.8811908007762612
224,9,KNeighbors Classifier,1,0.45,0.9223880597014925,0.9194708935201982,1.1763582229614258,0.9194708935201982
225,9,SVC Classifier,1,0.45,0.8283582089552238,0.821996630025241,2.2837443351745605,0.821996630025241
226,9,Decision Tree,1,0.45,0.7268656716417911,0.7173954157582173,0.16571450233459473,0.7173954157582173
227,9,RandomForest,1,0.45,0.6835820895522388,0.654165530626623,0.6150500774383545,0.654165530626623
228,9,AdaBoost (Discrete),1,0.45,0.8597014925373134,0.8546805840991949,85.01525235176086,0.8546805840991949
229,9,AdaBoost (Real),1,0.45,0.735820895522388,0.7268912635796752,88.80785536766052,0.7268912635796752
230,9,Logistic Regression (Penalty = L2),1,0.45,0.8955223880597015,0.8938027716168664,0.6978950500488281,0.8938027716168664
231,9,Naive Bayes,1,0.45,0.8731343283582089,0.8710392981705838,0.15787124633789062,0.8710392981705838
232,9,KNeighbors Classifier,2,0.45,0.9409090909090909,0.9401630506417564,1.218477725982666,0.9401630506417564
233,9,SVC Classifier,2,0.45,0.8696969696969697,0.8670029336948666,2.187127113342285,0.8670029336948666
234,9,Decision Tree,2,0.45,0.7318181818181818,0.7254737441864183,0.11398482322692871,0.7254737441864183
235,9,RandomForest,2,0.45,0.7045454545454546,0.6824760180298458,0.5630271434783936,0.6824760180298458
236,9,AdaBoost (Discrete),2,0.45,0.8787878787878788,0.8756284395408475,77.7355637550354,0.8756284395408475
237,9,AdaBoost (Real),2,0.45,0.6121212121212121,0.5760805270951157,85.69023823738098,0.5760805270951157
238,9,Logistic Regression (Penalty = L2),2,0.45,0.9030303030303031,0.9019966442344912,0.6781611442565918,0.9019966442344912
239,9,Naive Bayes,2,0.45,0.896969696969697,0.895974254569465,0.1420605182647705,0.895974254569465
240,10,KNeighbors Classifier,0,0.45,0.9671641791044776,0.9667549165654789,1.9547357559204102,0.9667549165654789
241,10,SVC Classifier,0,0.45,0.9134328358208955,0.9124605507752844,2.8233418464660645,0.9124605507752844
242,10,Decision Tree,0,0.45,0.7567164179104477,0.7430751880871953,0.147613525390625,0.7430751880871953
243,10,RandomForest,0,0.45,0.7059701492537314,0.6853713933863947,0.5544300079345703,0.6853713933863947
244,10,AdaBoost (Discrete),0,0.45,0.9208955223880597,0.9200348621945033,117.06480598449707,0.9200348621945033
245,10,AdaBoost (Real),0,0.45,0.8940298507462686,0.8925188519788287,123.41123819351196,0.8925188519788287
246,10,Logistic Regression (Penalty = L2),0,0.45,0.9417910447761194,0.9406453507589788,1.2291748523712158,0.9406453507589788
247,10,Naive Bayes,0,0.45,0.9343283582089552,0.9337545083090554,0.10619616508483887,0.9337545083090554
248,10,KNeighbors Classifier,1,0.45,0.9626865671641791,0.9622365510785857,2.051706552505493,0.9622365510785857
249,10,SVC Classifier,1,0.45,0.917910447761194,0.9170481808496519,2.8692872524261475,0.9170481808496519
250,10,Decision Tree,1,0.45,0.7388059701492538,0.7333098763643789,0.19633173942565918,0.7333098763643789
251,10,RandomForest,1,0.45,0.7,0.6838231038060409,0.5433506965637207,0.6838231038060409
252,10,AdaBoost (Discrete),1,0.45,0.9223880597014925,0.9217176462185368,121.31124353408813,0.9217176462185368
253,10,AdaBoost (Real),1,0.45,0.8776119402985074,0.8765600743487515,135.7253303527832,0.8765600743487515
254,10,Logistic Regression (Penalty = L2),1,0.45,0.9477611940298507,0.9474510986164482,1.1734726428985596,0.9474510986164482
255,10,Naive Bayes,1,0.45,0.935820895522388,0.935561374782954,0.10841536521911621,0.935561374782954
256,10,KNeighbors Classifier,2,0.45,0.9727272727272728,0.9725897280802638,2.0483031272888184,0.9725897280802638
257,10,SVC Classifier,2,0.45,0.9303030303030303,0.9296051043203506,3.1036853790283203,0.9296051043203506
258,10,Decision Tree,2,0.45,0.75,0.7455416203266995,0.16733098030090332,0.7455416203266995
259,10,RandomForest,2,0.45,0.7045454545454546,0.6586783773159963,0.6135306358337402,0.6586783773159963
260,10,AdaBoost (Discrete),2,0.45,0.943939393939394,0.9430853718115249,126.65904641151428,0.9430853718115249
261,10,AdaBoost (Real),2,0.45,0.8909090909090909,0.8899065392049207,106.52987289428711,0.8899065392049207
262,10,Logistic Regression (Penalty = L2),2,0.45,0.956060606060606,0.9558578932898256,0.9182841777801514,0.9558578932898256
263,10,Naive Bayes,2,0.45,0.9424242424242424,0.9421841534127294,0.17309784889221191,0.9421841534127294
264,11,KNeighbors Classifier,0,0.45,0.9761194029850746,0.975863096101836,2.69716215133667,0.975863096101836
265,11,SVC Classifier,0,0.45,0.9253731343283582,0.9247529120654323,3.350374937057495,0.9247529120654323
266,11,Decision Tree,0,0.45,0.6791044776119403,0.6730192881721399,0.0990140438079834,0.6730192881721399
267,11,RandomForest,0,0.45,0.6776119402985075,0.6653676543823186,0.5678162574768066,0.6653676543823186
268,11,AdaBoost (Discrete),0,0.45,0.9253731343283582,0.9241794590567716,139.24873542785645,0.9241794590567716
269,11,AdaBoost (Real),0,0.45,0.8985074626865671,0.8967590738953529,148.7922432422638,0.8967590738953529
270,11,Logistic Regression (Penalty = L2),0,0.45,0.9492537313432836,0.9485632395517017,1.2836024761199951,0.9485632395517017
271,11,Naive Bayes,0,0.45,0.9432835820895522,0.9426991208271543,0.1628127098083496,0.9426991208271543
272,11,KNeighbors Classifier,1,0.45,0.9567164179104478,0.9562583445241254,2.534121036529541,0.9562583445241254
273,11,SVC Classifier,1,0.45,0.926865671641791,0.9257580692289248,3.192227602005005,0.9257580692289248
274,11,Decision Tree,1,0.45,0.6985074626865672,0.6872196448473835,0.14474701881408691,0.6872196448473835
275,11,RandomForest,1,0.45,0.746268656716418,0.7361143901088869,0.5273222923278809,0.7361143901088869
276,11,AdaBoost (Discrete),1,0.45,0.9283582089552239,0.9276810737971827,137.58757710456848,0.9276810737971827
277,11,AdaBoost (Real),1,0.45,0.8791044776119403,0.8784472511997776,163.21979641914368,0.8784472511997776
278,11,Logistic Regression (Penalty = L2),1,0.45,0.9492537313432836,0.9489443539348054,1.1927459239959717,0.9489443539348054
279,11,Naive Bayes,1,0.45,0.9343283582089552,0.9339455943100841,0.16760015487670898,0.9339455943100841
280,11,KNeighbors Classifier,2,0.45,0.9681818181818181,0.9677629231995319,2.6277647018432617,0.9677629231995319
281,11,SVC Classifier,2,0.45,0.9287878787878788,0.9275734613957723,3.2919209003448486,0.9275734613957723
282,11,Decision Tree,2,0.45,0.7666666666666667,0.7625269937737549,0.14592695236206055,0.7625269937737549
283,11,RandomForest,2,0.45,0.75,0.7418550679420592,0.6030704975128174,0.7418550679420592
284,11,AdaBoost (Discrete),2,0.45,0.9348484848484848,0.9342045387754739,145.0347559452057,0.9342045387754739
285,11,AdaBoost (Real),2,0.45,0.8818181818181818,0.8807768820246902,137.38410305976868,0.8807768820246902
286,11,Logistic Regression (Penalty = L2),2,0.45,0.95,0.9495564963090193,1.0576725006103516,0.9495564963090193
287,11,Naive Bayes,2,0.45,0.9393939393939394,0.9390744880057833,0.16936850547790527,0.9390744880057833
288,12,KNeighbors Classifier,0,0.45,0.926865671641791,0.9244699214150908,0.39870500564575195,0.9244699214150908
289,12,SVC Classifier,0,0.45,0.8208955223880597,0.8147599250808226,1.239140272140503,0.8147599250808226
290,12,Decision Tree,0,0.45,0.7417910447761195,0.7385072871635814,0.07973504066467285,0.7385072871635814
291,12,RandomForest,0,0.45,0.5537313432835821,0.5619114977781693,0.33358240127563477,0.0
292,12,AdaBoost (Discrete),0,0.45,0.8626865671641791,0.8614944710663587,40.35628628730774,0.8614944710663587
293,12,AdaBoost (Real),0,0.45,0.8313432835820895,0.8298953157193381,44.707093477249146,0.8298953157193381
294,12,Logistic Regression (Penalty = L2),0,0.45,0.8865671641791045,0.8836193288016068,0.3632040023803711,0.8836193288016068
295,12,Naive Bayes,0,0.45,0.8731343283582089,0.8709450080643216,0.09297513961791992,0.8709450080643216
296,12,KNeighbors Classifier,1,0.45,0.9388059701492537,0.9372120868920506,0.35894155502319336,0.9372120868920506
297,12,SVC Classifier,1,0.45,0.8104477611940298,0.8052077588524709,1.1738882064819336,0.8052077588524709
298,12,Decision Tree,1,0.45,0.7597014925373134,0.7541201665032375,0.07835245132446289,0.7541201665032375
299,12,RandomForest,1,0.45,0.6,0.4112473089579126,0.36194777488708496,0.4112473089579126
300,12,AdaBoost (Discrete),1,0.45,0.826865671641791,0.8180157621893944,41.43121409416199,0.8180157621893944
301,12,AdaBoost (Real),1,0.45,0.7029850746268657,0.6832411128246562,46.77192258834839,0.6832411128246562
302,12,Logistic Regression (Penalty = L2),1,0.45,0.8746268656716418,0.8718726423624061,0.3598935604095459,0.8718726423624061
303,12,Naive Bayes,1,0.45,0.8880597014925373,0.8863142652281056,0.08875679969787598,0.8863142652281056
304,12,KNeighbors Classifier,2,0.45,0.9303030303030303,0.929384310770984,0.38403916358947754,0.929384310770984
305,12,SVC Classifier,2,0.45,0.8363636363636363,0.8332152629705832,1.1529181003570557,0.8332152629705832
306,12,Decision Tree,2,0.45,0.753030303030303,0.7502042031914774,0.07852363586425781,0.7502042031914774
307,12,RandomForest,2,0.45,0.5803030303030303,0.44336820810962263,0.38486337661743164,0.44336820810962263
308,12,AdaBoost (Discrete),2,0.45,0.8469696969696969,0.8428567572220309,41.5008978843689,0.8428567572220309
309,12,AdaBoost (Real),2,0.45,0.8196969696969697,0.8143352416823288,47.41996455192566,0.8143352416823288
310,12,Logistic Regression (Penalty = L2),2,0.45,0.8878787878787879,0.8867787340373292,0.3703935146331787,0.8867787340373292
311,12,Naive Bayes,2,0.45,0.8984848484848484,0.8977206782001266,0.10926175117492676,0.8977206782001266
