,feat_set_id,classifier,fold_id,feat_th,score,geo_score,exec_t,geo_score_woz
0,0,KNeighbors Classifier,0,0.55,0.9166666666666666,0.8913996456294653,0.21599149703979492,0.8913996456294653
1,0,SVC Classifier,0,0.55,0.8083333333333333,1.0,0.2268691062927246,0.0
2,0,Decision Tree,0,0.55,0.8416666666666667,0.6232207179196086,0.0028285980224609375,0.6232207179196086
3,0,RandomForest,0,0.55,0.775,0.9373175393324713,0.5798513889312744,0.0
4,0,AdaBoost (Discrete),0,0.55,0.8166666666666667,0.7406381167867305,34.30451798439026,0.7406381167867305
5,0,AdaBoost (Real),0,0.55,0.7666666666666667,0.8339947279394198,45.06645083427429,0.0
6,0,Logistic Regression (Penalty = L2),0,0.55,0.975,0.9696654978825953,0.5233199596405029,0.9696654978825953
7,0,Naive Bayes,0,0.55,0.875,0.8512343650594763,0.14992094039916992,0.8512343650594763
8,0,KNeighbors Classifier,1,0.55,0.95,0.9463543206299694,0.2486264705657959,0.9463543206299694
9,0,SVC Classifier,1,0.55,0.8083333333333333,1.0,0.2581307888031006,0.0
10,0,Decision Tree,1,0.55,0.85,0.8735005158014777,0.002324342727661133,0.8735005158014777
11,0,RandomForest,1,0.55,0.75,0.9000514359196271,0.6438794136047363,0.0
12,0,AdaBoost (Discrete),1,0.55,0.325,1.0,35.44830870628357,0.0
13,0,AdaBoost (Real),1,0.55,0.8333333333333334,0.9748970527428702,45.74760580062866,0.0
14,0,Logistic Regression (Penalty = L2),1,0.55,0.95,0.9407645434840275,0.31730127334594727,0.9407645434840275
15,0,Naive Bayes,1,0.55,0.8416666666666667,0.7955333886740301,0.1224374771118164,0.7955333886740301
16,0,KNeighbors Classifier,2,0.55,0.9576271186440678,0.9531842929969365,0.2900111675262451,0.9531842929969365
17,0,SVC Classifier,2,0.55,0.8135593220338984,1.0,0.3262336254119873,0.0
18,0,Decision Tree,2,0.55,0.9322033898305084,0.90286333835828,0.002094745635986328,0.90286333835828
19,0,RandomForest,2,0.55,0.8135593220338984,1.0,0.4719672203063965,0.0
20,0,AdaBoost (Discrete),2,0.55,0.9322033898305084,0.8476452619160645,40.51625180244446,0.8476452619160645
21,0,AdaBoost (Real),2,0.55,0.864406779661017,1.0,46.6037163734436,0.0
22,0,Logistic Regression (Penalty = L2),2,0.55,0.9576271186440678,0.9518558056141587,0.21671605110168457,0.9518558056141587
23,0,Naive Bayes,2,0.55,0.847457627118644,0.8001809685900729,0.10447168350219727,0.8001809685900729
24,1,KNeighbors Classifier,0,0.55,0.925,0.9184289895459613,0.19300389289855957,0.9184289895459613
25,1,SVC Classifier,0,0.55,0.8083333333333333,1.0,0.28642797470092773,0.0
26,1,Decision Tree,0,0.55,0.8916666666666667,0.8714506813066025,0.00141143798828125,0.8714506813066025
27,1,RandomForest,0,0.55,0.8083333333333333,0.6446455349660464,0.6633005142211914,0.0
28,1,AdaBoost (Discrete),0,0.55,0.8666666666666667,0.7833588094940039,38.47775101661682,0.7833588094940039
29,1,AdaBoost (Real),0,0.55,0.7916666666666666,0.8596600845125375,47.39420771598816,0.0
30,1,Logistic Regression (Penalty = L2),0,0.55,0.975,0.9696654978825953,0.27823305130004883,0.9696654978825953
31,1,Naive Bayes,0,0.55,0.8583333333333333,0.8486818711397807,0.2773630619049072,0.8486818711397807
32,1,KNeighbors Classifier,1,0.55,0.9416666666666667,0.9282799895328512,0.2880666255950928,0.9282799895328512
33,1,SVC Classifier,1,0.55,0.8083333333333333,1.0,0.25792622566223145,0.0
34,1,Decision Tree,1,0.55,0.9083333333333333,0.8871473712499641,0.13394761085510254,0.8871473712499641
35,1,RandomForest,1,0.55,0.8333333333333334,0.8106130830989491,0.9179275035858154,0.0
36,1,AdaBoost (Discrete),1,0.55,0.3333333333333333,0.4518010018049224,49.35408592224121,0.0
37,1,AdaBoost (Real),1,0.55,0.65,0.5207307092599317,57.12518072128296,0.0
38,1,Logistic Regression (Penalty = L2),1,0.55,0.95,0.9489329985228542,0.2749948501586914,0.9489329985228542
39,1,Naive Bayes,1,0.55,0.8,0.7070072097126217,0.13308405876159668,0.7070072097126217
40,1,KNeighbors Classifier,2,0.55,0.8898305084745762,0.8486770926198123,0.3646659851074219,0.8486770926198123
41,1,SVC Classifier,2,0.55,0.8135593220338984,1.0,0.2371361255645752,0.0
42,1,Decision Tree,2,0.55,0.940677966101695,0.9134879752113328,0.0014111995697021484,0.9134879752113328
43,1,RandomForest,2,0.55,0.8898305084745762,0.919208143626272,0.8248569965362549,0.0
44,1,AdaBoost (Discrete),2,0.55,0.9576271186440678,0.9574531686334609,46.86648201942444,0.9574531686334609
45,1,AdaBoost (Real),2,0.55,0.8389830508474576,0.9468082697114729,55.17205357551575,0.0
46,1,Logistic Regression (Penalty = L2),2,0.55,0.9576271186440678,0.9518558056141587,0.3370361328125,0.9518558056141587
47,1,Naive Bayes,2,0.55,0.7966101694915254,0.7147246858740046,0.12998175621032715,0.7147246858740046
48,2,KNeighbors Classifier,0,0.55,0.9416666666666667,0.9286472253802204,0.36639928817749023,0.9286472253802204
49,2,SVC Classifier,0,0.55,0.7666666666666667,0.9105801434189359,0.37124109268188477,0.0
50,2,Decision Tree,0,0.55,0.7916666666666666,0.6963544325015202,0.001461029052734375,0.6963544325015202
51,2,RandomForest,0,0.55,0.8333333333333334,0.5789765329106292,0.8618731498718262,0.5789765329106292
52,2,AdaBoost (Discrete),0,0.55,0.775,0.6676127396202685,49.273916244506836,0.6676127396202685
53,2,AdaBoost (Real),0,0.55,0.75,0.8236313257055741,56.37821173667908,0.0
54,2,Logistic Regression (Penalty = L2),0,0.55,0.9583333333333334,0.9631191489525488,0.2371358871459961,0.9631191489525488
55,2,Naive Bayes,0,0.55,0.8,0.7365208012745865,0.2334887981414795,0.7365208012745865
56,2,KNeighbors Classifier,1,0.55,0.9333333333333333,0.9217187476325251,0.24064970016479492,0.9217187476325251
57,2,SVC Classifier,1,0.55,0.7666666666666667,0.9207558025289108,0.3678600788116455,0.0
58,2,Decision Tree,1,0.55,0.925,0.9284942986945327,0.002022266387939453,0.9284942986945327
59,2,RandomForest,1,0.55,0.85,0.5905353923651137,0.8093273639678955,0.5905353923651137
60,2,AdaBoost (Discrete),1,0.55,0.325,1.0,47.985591888427734,0.0
61,2,AdaBoost (Real),1,0.55,0.8333333333333334,0.9748970527428702,54.65408945083618,0.0
62,2,Logistic Regression (Penalty = L2),1,0.55,0.95,0.9383904453535417,0.22325754165649414,0.9383904453535417
63,2,Naive Bayes,1,0.55,0.7416666666666667,0.6973182502463962,0.12012553215026855,0.6973182502463962
64,2,KNeighbors Classifier,2,0.55,0.9491525423728814,0.9246555971486619,0.2400224208831787,0.9246555971486619
65,2,SVC Classifier,2,0.55,0.7542372881355932,0.8660254037844386,0.37119007110595703,0.0
66,2,Decision Tree,2,0.55,0.940677966101695,0.9085602964160698,0.1216423511505127,0.9085602964160698
67,2,RandomForest,2,0.55,0.8220338983050848,0.6988271187715792,0.9530584812164307,0.0
68,2,AdaBoost (Discrete),2,0.55,0.8559322033898306,0.9641925040026272,47.43766212463379,0.0
69,2,AdaBoost (Real),2,0.55,0.847457627118644,0.9518269693579392,57.860915184020996,0.0
70,2,Logistic Regression (Penalty = L2),2,0.55,0.940677966101695,0.9167845175938242,0.3177525997161865,0.9167845175938242
71,2,Naive Bayes,2,0.55,0.7288135593220338,0.606727044661076,0.10986590385437012,0.606727044661076
72,3,KNeighbors Classifier,0,0.55,0.9583333333333334,0.9533988533647133,0.23971986770629883,0.9533988533647133
73,3,SVC Classifier,0,0.55,0.8083333333333333,1.0,0.24416065216064453,0.0
74,3,Decision Tree,0,0.55,0.85,0.70210882939071,0.11882901191711426,0.70210882939071
75,3,RandomForest,0,0.55,0.6833333333333333,0.6789530343585221,0.8236372470855713,0.0
76,3,AdaBoost (Discrete),0,0.55,0.8666666666666667,0.7833588094940039,51.394397497177124,0.7833588094940039
77,3,AdaBoost (Real),0,0.55,0.7833333333333333,0.8504142777123846,70.51131296157837,0.0
78,3,Logistic Regression (Penalty = L2),0,0.55,0.975,0.9696654978825953,0.1463773250579834,0.9696654978825953
79,3,Naive Bayes,0,0.55,0.9166666666666666,0.9067608920006777,0.2974369525909424,0.9067608920006777
80,3,KNeighbors Classifier,1,0.55,0.9416666666666667,0.9379934436731555,0.2878420352935791,0.9379934436731555
81,3,SVC Classifier,1,0.55,0.8083333333333333,1.0,0.3271172046661377,0.0
82,3,Decision Tree,1,0.55,0.85,0.8735005158014777,0.0021026134490966797,0.8735005158014777
83,3,RandomForest,1,0.55,0.7333333333333333,0.8301821713362141,1.1680355072021484,0.0
84,3,AdaBoost (Discrete),1,0.55,0.3333333333333333,0.4518010018049224,55.601571798324585,0.0
85,3,AdaBoost (Real),1,0.55,0.65,0.5207307092599317,60.50878071784973,0.0
86,3,Logistic Regression (Penalty = L2),1,0.55,0.95,0.9407645434840275,0.27053308486938477,0.9407645434840275
87,3,Naive Bayes,1,0.55,0.8166666666666667,0.6601547141004708,0.1369023323059082,0.6601547141004708
88,3,KNeighbors Classifier,2,0.55,0.9322033898305084,0.90286333835828,0.2716102600097656,0.90286333835828
89,3,SVC Classifier,2,0.55,0.8135593220338984,1.0,0.26726245880126953,0.0
90,3,Decision Tree,2,0.55,0.940677966101695,0.919159933187494,0.0013382434844970703,0.919159933187494
91,3,RandomForest,2,0.55,0.7711864406779662,0.9105801434189359,0.9841949939727783,0.0
92,3,AdaBoost (Discrete),2,0.55,0.9491525423728814,0.9229728591375894,53.872456550598145,0.9229728591375894
93,3,AdaBoost (Real),2,0.55,0.6694915254237288,1.0,59.15330195426941,0.0
94,3,Logistic Regression (Penalty = L2),2,0.55,0.9576271186440678,0.9518558056141587,0.1330704689025879,0.9518558056141587
95,3,Naive Bayes,2,0.55,0.8559322033898306,0.8109272646615148,0.12753009796142578,0.8109272646615148
96,4,KNeighbors Classifier,0,0.55,0.9583333333333334,0.9190679574072336,0.2746553421020508,0.9190679574072336
97,4,SVC Classifier,0,0.55,0.7666666666666667,0.9105801434189359,0.24160313606262207,0.0
98,4,Decision Tree,0,0.55,0.9166666666666666,0.8522236012200123,0.12995600700378418,0.8522236012200123
99,4,RandomForest,0,0.55,0.775,0.7605457914475936,0.9410247802734375,0.0
100,4,AdaBoost (Discrete),0,0.55,0.775,0.6676127396202685,54.25789403915405,0.6676127396202685
101,4,AdaBoost (Real),0,0.55,0.75,0.8236313257055741,62.735668897628784,0.0
102,4,Logistic Regression (Penalty = L2),0,0.55,0.9583333333333334,0.9565886490430052,0.14414167404174805,0.9565886490430052
103,4,Naive Bayes,0,0.55,0.8583333333333333,0.8029355592213285,0.14443731307983398,0.8029355592213285
104,4,KNeighbors Classifier,1,0.55,0.95,0.9408184110566893,0.14914393424987793,0.9408184110566893
105,4,SVC Classifier,1,0.55,0.7666666666666667,0.9207558025289108,0.2837035655975342,0.0
106,4,Decision Tree,1,0.55,0.9083333333333333,0.9031602944121249,0.002054929733276367,0.9031602944121249
107,4,RandomForest,1,0.55,0.775,0.8984135769992829,0.8627562522888184,0.0
108,4,AdaBoost (Discrete),1,0.55,0.325,1.0,55.0386757850647,0.0
109,4,AdaBoost (Real),1,0.55,0.8333333333333334,0.9748970527428702,61.5426299571991,0.0
110,4,Logistic Regression (Penalty = L2),1,0.55,0.95,0.9383904453535417,0.1450183391571045,0.9383904453535417
111,4,Naive Bayes,1,0.55,0.8,0.6822834450466173,0.2768592834472656,0.6822834450466173
112,4,KNeighbors Classifier,2,0.55,0.9067796610169492,0.8871473712499641,0.29477548599243164,0.8871473712499641
113,4,SVC Classifier,2,0.55,0.7542372881355932,0.8660254037844386,0.2742445468902588,0.0
114,4,Decision Tree,2,0.55,0.9661016949152542,0.9406435214747787,0.14189362525939941,0.9406435214747787
115,4,RandomForest,2,0.55,0.9491525423728814,0.9113430992280004,0.9883430004119873,0.9113430992280004
116,4,AdaBoost (Discrete),2,0.55,0.8559322033898306,0.9641925040026272,54.36409258842468,0.0
117,4,AdaBoost (Real),2,0.55,0.847457627118644,0.9518269693579392,62.403799057006836,0.0
118,4,Logistic Regression (Penalty = L2),2,0.55,0.9576271186440678,0.9394610603061287,0.16788601875305176,0.9394610603061287
119,4,Naive Bayes,2,0.55,0.8220338983050848,0.7406240171018427,0.0032188892364501953,0.7406240171018427
120,5,KNeighbors Classifier,0,0.55,0.95,0.9284013888705659,0.17837810516357422,0.9284013888705659
121,5,SVC Classifier,0,0.55,0.7666666666666667,0.9105801434189359,0.18208527565002441,0.0
122,5,Decision Tree,0,0.55,0.9166666666666666,0.8187964651379644,0.1697375774383545,0.8187964651379644
123,5,RandomForest,0,0.55,0.675,0.3229985024889083,1.118833303451538,0.0
124,5,AdaBoost (Discrete),0,0.55,0.7916666666666666,0.6947983105209848,59.14399337768555,0.6947983105209848
125,5,AdaBoost (Real),0,0.55,0.7666666666666667,0.839507921181157,62.34237504005432,0.0
126,5,Logistic Regression (Penalty = L2),0,0.55,0.9583333333333334,0.9591027302398184,0.14136338233947754,0.9591027302398184
127,5,Naive Bayes,0,0.55,0.8333333333333334,0.7907260268931731,0.14063453674316406,0.7907260268931731
128,5,KNeighbors Classifier,1,0.55,0.9083333333333333,0.8918243301108079,0.27585935592651367,0.8918243301108079
129,5,SVC Classifier,1,0.55,0.775,0.9306048591020996,0.2917163372039795,0.0
130,5,Decision Tree,1,0.55,0.875,0.8772436826036308,0.0018563270568847656,0.8772436826036308
131,5,RandomForest,1,0.55,0.7583333333333333,0.6210755969015077,0.9859609603881836,0.0
132,5,AdaBoost (Discrete),1,0.55,0.4583333333333333,0.9859136166167861,52.74458146095276,0.0
133,5,AdaBoost (Real),1,0.55,0.65,0.5207307092599317,48.812100648880005,0.0
134,5,Logistic Regression (Penalty = L2),1,0.55,0.9583333333333334,0.9450703644988706,0.1351151466369629,0.9450703644988706
135,5,Naive Bayes,1,0.55,0.7833333333333333,0.7337673400384576,0.11520266532897949,0.7337673400384576
136,5,KNeighbors Classifier,2,0.55,0.9491525423728814,0.9246555971486619,0.23672080039978027,0.9246555971486619
137,5,SVC Classifier,2,0.55,0.7542372881355932,0.8660254037844386,0.23505115509033203,0.0
138,5,Decision Tree,2,0.55,0.9576271186440678,0.9246555971486619,0.0022428035736083984,0.9246555971486619
139,5,RandomForest,2,0.55,0.7457627118644068,0.4321171111784573,0.7502524852752686,0.4321171111784573
140,5,AdaBoost (Discrete),2,0.55,0.9661016949152542,0.9577625008329119,43.00594735145569,0.9577625008329119
141,5,AdaBoost (Real),2,0.55,0.864406779661017,1.0,61.63492727279663,0.0
142,5,Logistic Regression (Penalty = L2),2,0.55,0.9491525423728814,0.9246555971486619,0.13161206245422363,0.9246555971486619
143,5,Naive Bayes,2,0.55,0.7711864406779662,0.5547426800907697,0.1316699981689453,0.5547426800907697
144,6,KNeighbors Classifier,0,0.55,0.9583333333333334,0.9407645434840275,0.2806260585784912,0.9407645434840275
145,6,SVC Classifier,0,0.55,0.8083333333333333,1.0,0.2943100929260254,0.0
146,6,Decision Tree,0,0.55,0.95,0.9242699220427442,0.0019431114196777344,0.9242699220427442
147,6,RandomForest,0,0.55,0.7916666666666666,0.9714573096172799,1.0044429302215576,0.0
148,6,AdaBoost (Discrete),0,0.55,0.825,0.7481595356833938,44.42828440666199,0.7481595356833938
149,6,AdaBoost (Real),0,0.55,0.7666666666666667,0.8339947279394198,59.03227257728577,0.0
150,6,Logistic Regression (Penalty = L2),0,0.55,0.9833333333333333,0.9808798513677408,0.3407247066497803,0.9808798513677408
151,6,Naive Bayes,0,0.55,0.8666666666666667,0.8472470631056911,0.25745081901550293,0.8472470631056911
152,6,KNeighbors Classifier,1,0.55,0.95,0.9416721128364367,0.4060332775115967,0.9416721128364367
153,6,SVC Classifier,1,0.55,0.8083333333333333,1.0,0.2532777786254883,0.0
154,6,Decision Tree,1,0.55,0.8583333333333333,0.8639660702000845,0.0014190673828125,0.8639660702000845
155,6,RandomForest,1,0.55,0.7916666666666666,0.9714573096172799,0.6416370868682861,0.0
156,6,AdaBoost (Discrete),1,0.55,0.325,1.0,50.1611442565918,0.0
157,6,AdaBoost (Real),1,0.55,0.8333333333333334,0.9748970527428702,57.381157636642456,0.0
158,6,Logistic Regression (Penalty = L2),1,0.55,0.9583333333333334,0.9533988533647133,0.27461934089660645,0.9533988533647133
159,6,Naive Bayes,1,0.55,0.8,0.7123439965826995,0.12947988510131836,0.7123439965826995
160,6,KNeighbors Classifier,2,0.55,0.9491525423728814,0.9401714290217257,0.22833800315856934,0.9401714290217257
161,6,SVC Classifier,2,0.55,0.8135593220338984,1.0,0.2538142204284668,0.0
162,6,Decision Tree,2,0.55,0.9067796610169492,0.8871473712499642,0.0017626285552978516,0.8871473712499642
163,6,RandomForest,2,0.55,0.847457627118644,0.8218759147586129,1.0045523643493652,0.0
164,6,AdaBoost (Discrete),2,0.55,0.9322033898305084,0.8476452619160645,50.627126693725586,0.8476452619160645
165,6,AdaBoost (Real),2,0.55,0.864406779661017,1.0,52.03562378883362,0.0
166,6,Logistic Regression (Penalty = L2),2,0.55,0.9576271186440678,0.9518558056141587,0.10963582992553711,0.9518558056141587
167,6,Naive Bayes,2,0.55,0.8220338983050848,0.7667031185081937,0.11261510848999023,0.7667031185081937
168,7,KNeighbors Classifier,0,0.55,0.9,0.9033709932194878,0.33367037773132324,0.9033709932194878
169,7,SVC Classifier,0,0.55,0.8083333333333333,1.0,0.3413701057434082,0.0
170,7,Decision Tree,0,0.55,0.8916666666666667,0.8290435138747908,0.12559270858764648,0.8290435138747908
171,7,RandomForest,0,0.55,0.7583333333333333,0.911613134465346,0.7841925621032715,0.0
172,7,AdaBoost (Discrete),0,0.55,0.825,0.7481595356833938,48.24509596824646,0.7481595356833938
173,7,AdaBoost (Real),0,0.55,0.7666666666666667,0.8339947279394198,58.19071555137634,0.0
174,7,Logistic Regression (Penalty = L2),0,0.55,0.9833333333333333,0.9808798513677408,0.4568490982055664,0.9808798513677408
175,7,Naive Bayes,0,0.55,0.7916666666666666,0.7569682576589495,0.11793112754821777,0.7569682576589495
176,7,KNeighbors Classifier,1,0.55,0.8833333333333333,0.859229222700853,0.35786890983581543,0.859229222700853
177,7,SVC Classifier,1,0.55,0.8083333333333333,1.0,0.47463297843933105,0.0
178,7,Decision Tree,1,0.55,0.875,0.869936182624507,0.002391815185546875,0.869936182624507
179,7,RandomForest,1,0.55,0.6833333333333333,0.6147881529512643,0.8439726829528809,0.0
180,7,AdaBoost (Discrete),1,0.55,0.325,1.0,52.478195667266846,0.0
181,7,AdaBoost (Real),1,0.55,0.8333333333333334,0.9748970527428702,60.96622157096863,0.0
182,7,Logistic Regression (Penalty = L2),1,0.55,0.9583333333333334,0.9533988533647133,0.3294682502746582,0.9533988533647133
183,7,Naive Bayes,1,0.55,0.775,0.6930926100197101,0.12473297119140625,0.6930926100197101
184,7,KNeighbors Classifier,2,0.55,0.847457627118644,0.7892462754950907,0.4773590564727783,0.7892462754950907
185,7,SVC Classifier,2,0.55,0.8135593220338984,1.0,0.3658180236816406,0.0
186,7,Decision Tree,2,0.55,0.8898305084745762,0.8452129358093436,0.11414933204650879,0.8452129358093436
187,7,RandomForest,2,0.55,0.8813559322033898,0.9021739713555064,0.8491368293762207,0.0
188,7,AdaBoost (Discrete),2,0.55,0.923728813559322,0.7922561070581773,53.44708871841431,0.7922561070581773
189,7,AdaBoost (Real),2,0.55,0.9745762711864406,0.9659853980285168,55.464691162109375,0.9659853980285168
190,7,Logistic Regression (Penalty = L2),2,0.55,0.9491525423728814,0.9422865815358938,0.24808931350708008,0.9422865815358938
191,7,Naive Bayes,2,0.55,0.7711864406779662,0.6859431568581424,0.10825109481811523,0.6859431568581424
192,8,KNeighbors Classifier,0,0.55,0.95,0.9284013888705659,0.21849489212036133,0.9284013888705659
193,8,SVC Classifier,0,0.55,0.7666666666666667,0.9105801434189359,0.13151955604553223,0.0
194,8,Decision Tree,0,0.55,0.9,0.8291769615329834,0.0020723342895507812,0.8291769615329834
195,8,RandomForest,0,0.55,0.7416666666666667,0.677610913400481,0.6805014610290527,0.0
196,8,AdaBoost (Discrete),0,0.55,0.7916666666666666,0.6947983105209848,49.463576316833496,0.6947983105209848
197,8,AdaBoost (Real),0,0.55,0.7666666666666667,0.839507921181157,61.90903878211975,0.0
198,8,Logistic Regression (Penalty = L2),0,0.55,0.95,0.9475190695520908,0.14471936225891113,0.9475190695520908
199,8,Naive Bayes,0,0.55,0.85,0.7972602732151357,0.143418550491333,0.7972602732151357
200,8,KNeighbors Classifier,1,0.55,0.9333333333333333,0.9235385486526049,0.14634037017822266,0.9235385486526049
201,8,SVC Classifier,1,0.55,0.775,0.9306048591020996,0.28691649436950684,0.0
202,8,Decision Tree,1,0.55,0.9416666666666667,0.9475190695520908,0.0013136863708496094,0.9475190695520908
203,8,RandomForest,1,0.55,0.75,0.9000514359196271,0.8623836040496826,0.0
204,8,AdaBoost (Discrete),1,0.55,0.4583333333333333,0.9859136166167861,60.31414175033569,0.0
205,8,AdaBoost (Real),1,0.55,0.65,0.5207307092599317,69.52590155601501,0.0
206,8,Logistic Regression (Penalty = L2),1,0.55,0.9583333333333334,0.9450703644988706,0.15238285064697266,0.9450703644988706
207,8,Naive Bayes,1,0.55,0.8166666666666667,0.6987516044802313,0.14798951148986816,0.6987516044802313
208,8,KNeighbors Classifier,2,0.55,0.9067796610169492,0.8871473712499641,0.3147704601287842,0.8871473712499641
209,8,SVC Classifier,2,0.55,0.7542372881355932,0.8660254037844386,0.27922821044921875,0.0
210,8,Decision Tree,2,0.55,0.9661016949152542,0.9406435214747787,0.0013897418975830078,0.9406435214747787
211,8,RandomForest,2,0.55,0.788135593220339,0.9494144610579709,1.0525972843170166,0.0
212,8,AdaBoost (Discrete),2,0.55,0.9661016949152542,0.9577625008329119,56.55538749694824,0.9577625008329119
213,8,AdaBoost (Real),2,0.55,0.864406779661017,1.0,62.526246309280396,0.0
214,8,Logistic Regression (Penalty = L2),2,0.55,0.9576271186440678,0.9394610603061287,0.13654279708862305,0.9394610603061287
215,8,Naive Bayes,2,0.55,0.8135593220338984,0.6516324217382471,0.2691209316253662,0.6516324217382471
