,feat_set_id,classifier,fold_id,feat_th,score,geo_score,exec_t,geo_score_woz
0,0,KNeighbors Classifier,0,0.8,0.6011560693641619,0.46804088014592204,0.22829842567443848,0.0
1,0,SVC Classifier,0,0.8,0.49710982658959535,1.0,0.25722217559814453,0.0
2,0,Decision Tree,0,0.8,0.5895953757225434,0.6071377632740809,0.028052330017089844,0.0
3,0,RandomForest,0,0.8,0.5317919075144508,0.4088823739025936,0.06947755813598633,0.0
4,0,AdaBoost (Discrete),0,0.8,0.6994219653179191,0.6299347151688885,15.613962411880493,0.0
5,0,AdaBoost (Real),0,0.8,0.5838150289017341,0.5177662229377571,17.518319606781006,0.0
6,0,Logistic Regression (Penalty = L2),0,0.8,0.6820809248554913,0.5235591624536262,0.44555139541625977,0.0
7,0,Naive Bayes,0,0.8,0.23121387283236994,0.38259785858810896,0.0820012092590332,0.0
8,0,KNeighbors Classifier,1,0.8,0.6190476190476191,0.5726862468993734,0.18115711212158203,0.0
9,0,SVC Classifier,1,0.8,0.5119047619047619,1.0,0.2630910873413086,0.0
10,0,Decision Tree,1,0.8,0.6011904761904762,0.571104467946097,0.003381967544555664,0.0
11,0,RandomForest,1,0.8,0.5773809523809523,0.8218759147586129,0.1268923282623291,0.0
12,0,AdaBoost (Discrete),1,0.8,0.7440476190476191,0.7081659424976678,15.095568895339966,0.0
13,0,AdaBoost (Real),1,0.8,0.625,0.7405300576904412,16.067042112350464,0.0
14,0,Logistic Regression (Penalty = L2),1,0.8,0.7023809523809523,0.7673653924161533,0.36340761184692383,0.0
15,0,Naive Bayes,1,0.8,0.25595238095238093,0.4410714231202338,0.0867612361907959,0.0
16,0,KNeighbors Classifier,2,0.8,0.6257668711656442,0.7595258047502624,0.21828961372375488,0.0
17,0,SVC Classifier,2,0.8,0.5153374233128835,1.0,0.2595179080963135,0.0
18,0,Decision Tree,2,0.8,0.5460122699386503,0.5573982400224954,0.004942655563354492,0.0
19,0,RandomForest,2,0.8,0.5766871165644172,0.3316060316314412,0.09560608863830566,0.0
20,0,AdaBoost (Discrete),2,0.8,0.7116564417177914,0.6396048870201145,15.001014709472656,0.0
21,0,AdaBoost (Real),2,0.8,0.6012269938650306,0.6876754270649906,16.468119859695435,0.0
22,0,Logistic Regression (Penalty = L2),2,0.8,0.6932515337423313,0.6412023191837368,0.3505668640136719,0.0
23,0,Naive Bayes,2,0.8,0.26380368098159507,0.477667372412877,0.08590316772460938,0.0
24,1,KNeighbors Classifier,0,0.8,0.5838150289017341,0.4916252785782054,0.2880842685699463,0.0
25,1,SVC Classifier,0,0.8,0.49710982658959535,1.0,0.21943378448486328,0.0
26,1,Decision Tree,0,0.8,0.6473988439306358,0.596276220090412,0.0279080867767334,0.0
27,1,RandomForest,0,0.8,0.5202312138728323,0.44179182268315764,0.09840226173400879,0.0
28,1,AdaBoost (Discrete),0,0.8,0.7167630057803468,0.5921717501155788,17.168029069900513,0.0
29,1,AdaBoost (Real),0,0.8,0.6242774566473989,0.6648096245581889,18.111876487731934,0.0
30,1,Logistic Regression (Penalty = L2),0,0.8,0.6358381502890174,0.5094668756558539,0.35503268241882324,0.0
31,1,Naive Bayes,0,0.8,0.23121387283236994,0.421076555895163,0.07800626754760742,0.0
32,1,KNeighbors Classifier,1,0.8,0.625,0.47725710393395043,0.20836639404296875,0.0
33,1,SVC Classifier,1,0.8,0.5119047619047619,1.0,0.24717974662780762,0.0
34,1,Decision Tree,1,0.8,0.5773809523809523,0.5930779295527094,0.018289566040039062,0.0
35,1,RandomForest,1,0.8,0.5595238095238095,0.6389431042462725,0.11540007591247559,0.0
36,1,AdaBoost (Discrete),1,0.8,0.7023809523809523,0.685920977037751,17.065510749816895,0.0
37,1,AdaBoost (Real),1,0.8,0.6726190476190477,0.7567955342055793,18.939626932144165,0.0
38,1,Logistic Regression (Penalty = L2),1,0.8,0.6904761904761905,0.6004878638932739,0.4154660701751709,0.0
39,1,Naive Bayes,1,0.8,0.25595238095238093,0.4410714231202338,0.09993314743041992,0.0
40,1,KNeighbors Classifier,2,0.8,0.6380368098159509,0.6735896711080995,0.22002172470092773,0.0
41,1,SVC Classifier,2,0.8,0.5153374233128835,1.0,0.23345136642456055,0.0
42,1,Decision Tree,2,0.8,0.5398773006134969,0.5162888996575167,0.003739595413208008,0.0
43,1,RandomForest,2,0.8,0.5705521472392638,0.6309573444801932,0.11751079559326172,0.0
44,1,AdaBoost (Discrete),2,0.8,0.7116564417177914,0.7051347386255976,18.650268077850342,0.0
45,1,AdaBoost (Real),2,0.8,0.6257668711656442,0.698807907670866,19.374320030212402,0.0
46,1,Logistic Regression (Penalty = L2),2,0.8,0.6809815950920245,0.7454595575650553,0.4026172161102295,0.0
47,1,Naive Bayes,2,0.8,0.26993865030674846,0.4671017061378148,0.08012104034423828,0.0
48,2,KNeighbors Classifier,0,0.8,0.6416184971098265,0.4854183838936154,0.2841823101043701,0.0
49,2,SVC Classifier,0,0.8,0.5028901734104047,0.5227579585747102,0.3177649974822998,0.0
50,2,Decision Tree,0,0.8,0.6416184971098265,0.5711759089440117,0.029784440994262695,0.0
51,2,RandomForest,0,0.8,0.5375722543352601,0.7311104457090247,0.09401702880859375,0.0
52,2,AdaBoost (Discrete),0,0.8,0.7167630057803468,0.5676031479408895,21.472806692123413,0.0
53,2,AdaBoost (Real),0,0.8,0.6242774566473989,0.7244007043050418,22.75097131729126,0.0
54,2,Logistic Regression (Penalty = L2),0,0.8,0.6936416184971098,0.6164751047171951,0.5160157680511475,0.0
55,2,Naive Bayes,0,0.8,0.2543352601156069,0.47940824030713286,0.08047032356262207,0.0
56,2,KNeighbors Classifier,1,0.8,0.6130952380952381,0.4648742216504246,0.2649714946746826,0.0
57,2,SVC Classifier,1,0.8,0.5238095238095238,0.6933612743506347,0.32822275161743164,0.0
58,2,Decision Tree,1,0.8,0.625,0.6438937461323653,0.030828237533569336,0.0
59,2,RandomForest,1,0.8,0.5714285714285714,0.4554974654853728,0.12825417518615723,0.0
60,2,AdaBoost (Discrete),1,0.8,0.7380952380952381,0.7191990613580159,21.52289080619812,0.0
61,2,AdaBoost (Real),1,0.8,0.6547619047619048,0.7541912785069493,23.321571826934814,0.0
62,2,Logistic Regression (Penalty = L2),1,0.8,0.7380952380952381,0.7424447892866327,0.45243167877197266,0.0
63,2,Naive Bayes,1,0.8,0.25595238095238093,0.4410714231202338,0.10349464416503906,0.0
64,2,KNeighbors Classifier,2,0.8,0.6809815950920245,0.761806343235413,0.2747821807861328,0.0
65,2,SVC Classifier,2,0.8,0.5337423312883436,0.7937005259840998,0.32335329055786133,0.0
66,2,Decision Tree,2,0.8,0.6257668711656442,0.6227904846701883,0.006623029708862305,0.0
67,2,RandomForest,2,0.8,0.5705521472392638,0.6803749333171202,0.13814735412597656,0.0
68,2,AdaBoost (Discrete),2,0.8,0.7423312883435583,0.7664449318838749,21.055974006652832,0.0
69,2,AdaBoost (Real),2,0.8,0.6073619631901841,0.8355569772352616,21.144283294677734,0.0
70,2,Logistic Regression (Penalty = L2),2,0.8,0.7300613496932515,0.7233955248932324,0.525435209274292,0.0
71,2,Naive Bayes,2,0.8,0.27607361963190186,0.4585964912915911,0.08416080474853516,0.0
72,3,KNeighbors Classifier,0,0.8,0.6416184971098265,0.507323182041408,0.17013168334960938,0.0
73,3,SVC Classifier,0,0.8,0.5028901734104047,0.5227579585747102,0.23921465873718262,0.0
74,3,Decision Tree,0,0.8,0.5780346820809249,0.5633729717623862,0.02988147735595703,0.0
75,3,RandomForest,0,0.8,0.5780346820809249,0.542660503101091,0.10096931457519531,0.0
76,3,AdaBoost (Discrete),0,0.8,0.7225433526011561,0.5563914603234474,19.02440357208252,0.0
77,3,AdaBoost (Real),0,0.8,0.6242774566473989,0.7244007043050418,19.886667251586914,0.0
78,3,Logistic Regression (Penalty = L2),0,0.8,0.6994219653179191,0.651875333316438,0.34914302825927734,0.0
79,3,Naive Bayes,0,0.8,0.24277456647398843,0.403174114659548,0.07726001739501953,0.0
80,3,KNeighbors Classifier,1,0.8,0.6547619047619048,0.6717481582191184,0.17619657516479492,0.0
81,3,SVC Classifier,1,0.8,0.5178571428571429,0.5503212081491045,0.18901658058166504,0.0
82,3,Decision Tree,1,0.8,0.6488095238095238,0.6288854099663452,0.020418643951416016,0.0
83,3,RandomForest,1,0.8,0.5476190476190477,0.5578503998237555,0.09287667274475098,0.0
84,3,AdaBoost (Discrete),1,0.8,0.7083333333333334,0.6398466285038684,17.961209297180176,0.0
85,3,AdaBoost (Real),1,0.8,0.6607142857142857,0.6671125599275987,19.44163417816162,0.0
86,3,Logistic Regression (Penalty = L2),1,0.8,0.7559523809523809,0.748380643218145,0.38106274604797363,0.0
87,3,Naive Bayes,1,0.8,0.2619047619047619,0.4103843085204526,0.07054448127746582,0.4103843085204526
88,3,KNeighbors Classifier,2,0.8,0.6503067484662577,0.657933224657568,0.1876220703125,0.0
89,3,SVC Classifier,2,0.8,0.5153374233128835,1.0,0.2615201473236084,0.0
90,3,Decision Tree,2,0.8,0.5705521472392638,0.6375964720842193,0.004587888717651367,0.0
91,3,RandomForest,2,0.8,0.5705521472392638,0.7682383980720594,0.07645463943481445,0.0
92,3,AdaBoost (Discrete),2,0.8,0.7607361963190185,0.7149086989041444,18.914793491363525,0.0
93,3,AdaBoost (Real),2,0.8,0.6134969325153374,0.8055605500859584,19.451454639434814,0.0
94,3,Logistic Regression (Penalty = L2),2,0.8,0.754601226993865,0.6560045136564611,0.44693756103515625,0.0
95,3,Naive Bayes,2,0.8,0.27607361963190186,0.4468791677069805,0.08259391784667969,0.0
96,4,KNeighbors Classifier,0,0.8,0.6069364161849711,0.49465131156610986,0.1864607334136963,0.0
97,4,SVC Classifier,0,0.8,0.49710982658959535,1.0,0.18686938285827637,0.0
98,4,Decision Tree,0,0.8,0.5722543352601156,0.5475066145164659,0.003560304641723633,0.0
99,4,RandomForest,0,0.8,0.5491329479768786,0.7952707287670506,0.09958553314208984,0.0
100,4,AdaBoost (Discrete),0,0.8,0.7167630057803468,0.6052773455798847,12.896612405776978,0.0
101,4,AdaBoost (Real),0,0.8,0.6589595375722543,0.7290022275036606,14.44320297241211,0.0
102,4,Logistic Regression (Penalty = L2),0,0.8,0.653179190751445,0.5438245259395813,0.2806377410888672,0.0
103,4,Naive Bayes,0,0.8,0.21965317919075145,0.381053892672676,0.06876397132873535,0.0
104,4,KNeighbors Classifier,1,0.8,0.6428571428571429,0.5409869360113657,0.16907572746276855,0.0
105,4,SVC Classifier,1,0.8,0.5119047619047619,1.0,0.17729425430297852,0.0
106,4,Decision Tree,1,0.8,0.6488095238095238,0.6239545804681371,0.019483089447021484,0.0
107,4,RandomForest,1,0.8,0.5535714285714286,0.4065851364889782,0.09174036979675293,0.0
108,4,AdaBoost (Discrete),1,0.8,0.6964285714285714,0.5816815582749387,12.233867883682251,0.0
109,4,AdaBoost (Real),1,0.8,0.6130952380952381,0.627160082198851,13.0781729221344,0.0
110,4,Logistic Regression (Penalty = L2),1,0.8,0.6845238095238095,0.6241046796236606,0.25305652618408203,0.0
111,4,Naive Bayes,1,0.8,0.25595238095238093,0.4410714231202338,0.08672714233398438,0.0
112,4,KNeighbors Classifier,2,0.8,0.656441717791411,0.6487319249520168,0.12970185279846191,0.0
113,4,SVC Classifier,2,0.8,0.5153374233128835,1.0,0.09945821762084961,0.0
114,4,Decision Tree,2,0.8,0.5950920245398773,0.6354701442995312,0.01703786849975586,0.0
115,4,RandomForest,2,0.8,0.588957055214724,0.7311846378041618,0.0614473819732666,0.0
116,4,AdaBoost (Discrete),2,0.8,0.7361963190184049,0.8765775085156663,11.875921249389648,0.0
117,4,AdaBoost (Real),2,0.8,0.5337423312883436,0.6812920690579614,13.723775386810303,0.0
118,4,Logistic Regression (Penalty = L2),2,0.8,0.6932515337423313,0.5974428308362809,0.26566267013549805,0.0
119,4,Naive Bayes,2,0.8,0.25766871165644173,0.4198548231432729,0.05171060562133789,0.0
120,5,KNeighbors Classifier,0,0.8,0.6184971098265896,0.5359654376867975,0.3077991008758545,0.0
121,5,SVC Classifier,0,0.8,0.49710982658959535,1.0,0.18931269645690918,0.0
122,5,Decision Tree,0,0.8,0.6127167630057804,0.6241628440909326,0.018491506576538086,0.0
123,5,RandomForest,0,0.8,0.5664739884393064,0.6034176336545163,0.07008767127990723,0.0
124,5,AdaBoost (Discrete),0,0.8,0.6994219653179191,0.5800521268915344,12.978381156921387,0.0
125,5,AdaBoost (Real),0,0.8,0.6242774566473989,0.5947027506115736,13.67393183708191,0.0
126,5,Logistic Regression (Penalty = L2),0,0.8,0.6705202312138728,0.493636014093141,0.2584655284881592,0.0
127,5,Naive Bayes,0,0.8,0.2254335260115607,0.40583805298744546,0.08739995956420898,0.0
128,5,KNeighbors Classifier,1,0.8,0.6190476190476191,0.5690738191526042,0.21301770210266113,0.0
129,5,SVC Classifier,1,0.8,0.5119047619047619,1.0,0.19209718704223633,0.0
130,5,Decision Tree,1,0.8,0.6130952380952381,0.6371423737030194,0.021368980407714844,0.0
131,5,RandomForest,1,0.8,0.5595238095238095,0.3656467468215549,0.09150815010070801,0.0
132,5,AdaBoost (Discrete),1,0.8,0.7321428571428571,0.6603390116699737,12.912126779556274,0.0
133,5,AdaBoost (Real),1,0.8,0.625,0.7405300576904412,13.16688346862793,0.0
134,5,Logistic Regression (Penalty = L2),1,0.8,0.6964285714285714,0.677412309569415,0.3265519142150879,0.0
135,5,Naive Bayes,1,0.8,0.25,0.4181698984778722,0.10437369346618652,0.0
136,5,KNeighbors Classifier,2,0.8,0.6687116564417178,0.6150198811587813,0.20975470542907715,0.0
137,5,SVC Classifier,2,0.8,0.5153374233128835,1.0,0.2093954086303711,0.0
138,5,Decision Tree,2,0.8,0.5950920245398773,0.5022288233902962,0.019970178604125977,0.5022288233902962
139,5,RandomForest,2,0.8,0.5766871165644172,0.5898945623563898,0.0754389762878418,0.0
140,5,AdaBoost (Discrete),2,0.8,0.7239263803680982,0.6601312312743821,12.794490098953247,0.0
141,5,AdaBoost (Real),2,0.8,0.6319018404907976,0.8545334378938858,13.212068319320679,0.0
142,5,Logistic Regression (Penalty = L2),2,0.8,0.7055214723926381,0.7708973291694818,0.28480052947998047,0.0
143,5,Naive Bayes,2,0.8,0.25766871165644173,0.41646579662658867,0.06751084327697754,0.0
144,6,KNeighbors Classifier,0,0.8,0.6011560693641619,0.46804088014592204,0.09598493576049805,0.0
145,6,SVC Classifier,0,0.8,0.49710982658959535,1.0,0.09020495414733887,0.0
146,6,Decision Tree,0,0.8,0.6358381502890174,0.5238686959311604,0.003226757049560547,0.0
147,6,RandomForest,0,0.8,0.5549132947976878,0.48438841363348917,0.09371399879455566,0.0
148,6,AdaBoost (Discrete),0,0.8,0.6936416184971098,0.6390086740037302,10.226008653640747,0.0
149,6,AdaBoost (Real),0,0.8,0.5780346820809249,0.5034557559509837,11.16543173789978,0.0
150,6,Logistic Regression (Penalty = L2),0,0.8,0.6820809248554913,0.5235591624536262,0.23833489418029785,0.0
151,6,Naive Bayes,0,0.8,0.2254335260115607,0.36235486721428556,0.061402082443237305,0.0
152,6,KNeighbors Classifier,1,0.8,0.6190476190476191,0.5726862468993734,0.1463789939880371,0.0
153,6,SVC Classifier,1,0.8,0.5119047619047619,1.0,0.15631937980651855,0.0
154,6,Decision Tree,1,0.8,0.625,0.6999352053910909,0.00551605224609375,0.0
155,6,RandomForest,1,0.8,0.5714285714285714,0.757508443356907,0.07286405563354492,0.0
156,6,AdaBoost (Discrete),1,0.8,0.7261904761904762,0.7503007476698033,9.775604009628296,0.0
157,6,AdaBoost (Real),1,0.8,0.625,0.7405300576904412,10.739378690719604,0.0
158,6,Logistic Regression (Penalty = L2),1,0.8,0.7083333333333334,0.7683417000572449,0.23501062393188477,0.0
159,6,Naive Bayes,1,0.8,0.25595238095238093,0.44508579130490383,0.05798912048339844,0.0
160,6,KNeighbors Classifier,2,0.8,0.6257668711656442,0.7595258047502624,0.11117386817932129,0.0
161,6,SVC Classifier,2,0.8,0.5153374233128835,1.0,0.14124512672424316,0.0
162,6,Decision Tree,2,0.8,0.5705521472392638,0.5784049564077357,0.02051997184753418,0.0
163,6,RandomForest,2,0.8,0.6012269938650306,0.573861375250308,0.0904388427734375,0.0
164,6,AdaBoost (Discrete),2,0.8,0.7361963190184049,0.627404401752292,9.308052062988281,0.0
165,6,AdaBoost (Real),2,0.8,0.5828220858895705,0.810908927640115,10.840083599090576,0.0
166,6,Logistic Regression (Penalty = L2),2,0.8,0.6932515337423313,0.6412023191837368,0.21771240234375,0.0
167,6,Naive Bayes,2,0.8,0.25766871165644173,0.4715705532707429,0.05774426460266113,0.0
168,7,KNeighbors Classifier,0,0.8,0.5838150289017341,0.4916252785782054,0.16994142532348633,0.0
169,7,SVC Classifier,0,0.8,0.49710982658959535,1.0,0.1670067310333252,0.0
170,7,Decision Tree,0,0.8,0.5606936416184971,0.6071377632740809,0.004439830780029297,0.0
171,7,RandomForest,0,0.8,0.5606936416184971,0.6964705665515708,0.07095837593078613,0.0
172,7,AdaBoost (Discrete),0,0.8,0.7109826589595376,0.5881676905727509,11.474473476409912,0.0
173,7,AdaBoost (Real),0,0.8,0.5838150289017341,0.6427062487216478,12.225451946258545,0.0
174,7,Logistic Regression (Penalty = L2),0,0.8,0.6358381502890174,0.5094668756558539,0.18544650077819824,0.0
175,7,Naive Bayes,0,0.8,0.23121387283236994,0.38259785858810896,0.0852518081665039,0.0
176,7,KNeighbors Classifier,1,0.8,0.625,0.47725710393395043,0.1300673484802246,0.0
177,7,SVC Classifier,1,0.8,0.5119047619047619,1.0,0.11705613136291504,0.0
178,7,Decision Tree,1,0.8,0.5238095238095238,0.5625426289969612,0.0052835941314697266,0.0
179,7,RandomForest,1,0.8,0.5476190476190477,0.4705355686715127,0.05058860778808594,0.0
180,7,AdaBoost (Discrete),1,0.8,0.7083333333333334,0.5795025468664925,11.780161380767822,0.0
181,7,AdaBoost (Real),1,0.8,0.625,0.6698836330177814,13.325974702835083,0.0
182,7,Logistic Regression (Penalty = L2),1,0.8,0.6964285714285714,0.6059531451373878,0.18834590911865234,0.0
183,7,Naive Bayes,1,0.8,0.25595238095238093,0.4410714231202338,0.06030440330505371,0.0
184,7,KNeighbors Classifier,2,0.8,0.6380368098159509,0.6735896711080995,0.18354272842407227,0.0
185,7,SVC Classifier,2,0.8,0.5153374233128835,1.0,0.16435837745666504,0.0
186,7,Decision Tree,2,0.8,0.5521472392638037,0.5799176887520191,0.005358219146728516,0.0
187,7,RandomForest,2,0.8,0.5644171779141104,0.5946035575013605,0.09260225296020508,0.0
188,7,AdaBoost (Discrete),2,0.8,0.7239263803680982,0.7410986487919189,11.049460649490356,0.0
189,7,AdaBoost (Real),2,0.8,0.6012269938650306,0.810908927640115,12.021032333374023,0.0
190,7,Logistic Regression (Penalty = L2),2,0.8,0.6809815950920245,0.7454595575650553,0.2494511604309082,0.0
191,7,Naive Bayes,2,0.8,0.2822085889570552,0.4563837694016583,0.05608081817626953,0.4563837694016583
192,8,KNeighbors Classifier,0,0.8,0.5953757225433526,0.5242864758103631,0.09812784194946289,0.0
193,8,SVC Classifier,0,0.8,0.49710982658959535,1.0,0.09614181518554688,0.0
194,8,Decision Tree,0,0.8,0.5491329479768786,0.5752470502567986,0.005705833435058594,0.0
195,8,RandomForest,0,0.8,0.5317919075144508,0.6147881529512644,0.0740516185760498,0.0
196,8,AdaBoost (Discrete),0,0.8,0.6994219653179191,0.6521038354151493,10.094724893569946,0.0
197,8,AdaBoost (Real),0,0.8,0.6069364161849711,0.6228320241980703,11.231026887893677,0.0
198,8,Logistic Regression (Penalty = L2),0,0.8,0.6473988439306358,0.5178454741015073,0.1779792308807373,0.0
199,8,Naive Bayes,0,0.8,0.23699421965317918,0.3328603644992991,0.04841113090515137,0.3328603644992991
200,8,KNeighbors Classifier,1,0.8,0.6428571428571429,0.47886154517953805,0.15370583534240723,0.0
201,8,SVC Classifier,1,0.8,0.5119047619047619,1.0,0.16449785232543945,0.0
202,8,Decision Tree,1,0.8,0.6011904761904762,0.49394465476673827,0.0057065486907958984,0.0
203,8,RandomForest,1,0.8,0.5476190476190477,0.48549177170732344,0.056140899658203125,0.0
204,8,AdaBoost (Discrete),1,0.8,0.7321428571428571,0.6049678189678818,9.219540119171143,0.0
205,8,AdaBoost (Real),1,0.8,0.6428571428571429,0.7464511478221134,10.303442001342773,0.0
206,8,Logistic Regression (Penalty = L2),1,0.8,0.6964285714285714,0.6004250644835433,0.22162723541259766,0.0
207,8,Naive Bayes,1,0.8,0.25595238095238093,0.4410714231202338,0.06775069236755371,0.0
208,8,KNeighbors Classifier,2,0.8,0.6319018404907976,0.6726830736903975,0.11921048164367676,0.0
209,8,SVC Classifier,2,0.8,0.5153374233128835,1.0,0.051779985427856445,0.0
210,8,Decision Tree,2,0.8,0.5950920245398773,0.6128867728182547,0.018108367919921875,0.0
211,8,RandomForest,2,0.8,0.5644171779141104,0.6293916741966012,0.06792354583740234,0.0
212,8,AdaBoost (Discrete),2,0.8,0.7239263803680982,0.7847646188770528,9.53787112236023,0.0
213,8,AdaBoost (Real),2,0.8,0.5950920245398773,0.790340583937144,9.859138250350952,0.0
214,8,Logistic Regression (Penalty = L2),2,0.8,0.6871165644171779,0.7607362097125698,0.17284560203552246,0.0
215,8,Naive Bayes,2,0.8,0.26380368098159507,0.4331562927212616,0.02444767951965332,0.0
216,9,KNeighbors Classifier,0,0.8,0.6358381502890174,0.484863612776099,0.16027522087097168,0.0
217,9,SVC Classifier,0,0.8,0.5028901734104047,0.5227579585747102,0.18024206161499023,0.0
218,9,Decision Tree,0,0.8,0.6473988439306358,0.642606448940291,0.004228115081787109,0.0
219,9,RandomForest,0,0.8,0.5491329479768786,0.3301352998405312,0.05038762092590332,0.0
220,9,AdaBoost (Discrete),0,0.8,0.7398843930635838,0.6153418945066687,9.83796215057373,0.0
221,9,AdaBoost (Real),0,0.8,0.6242774566473989,0.7244007043050418,10.686933040618896,0.0
222,9,Logistic Regression (Penalty = L2),0,0.8,0.7052023121387283,0.6676919023492872,0.19155573844909668,0.0
223,9,Naive Bayes,0,0.8,0.23699421965317918,0.39709480348007326,0.04169178009033203,0.0
224,9,KNeighbors Classifier,1,0.8,0.6130952380952381,0.572644300980233,0.10031747817993164,0.0
225,9,SVC Classifier,1,0.8,0.5178571428571429,0.5503212081491045,0.17189860343933105,0.0
226,9,Decision Tree,1,0.8,0.6428571428571429,0.7291843095253308,0.02180647850036621,0.0
227,9,RandomForest,1,0.8,0.5833333333333334,0.4554974654853728,0.05723905563354492,0.0
228,9,AdaBoost (Discrete),1,0.8,0.7619047619047619,0.7221964512727851,10.298693418502808,0.0
229,9,AdaBoost (Real),1,0.8,0.6547619047619048,0.7541912785069493,10.411405324935913,0.0
230,9,Logistic Regression (Penalty = L2),1,0.8,0.7559523809523809,0.7677013115936593,0.10701274871826172,0.0
231,9,Naive Bayes,1,0.8,0.2619047619047619,0.4550450582744784,0.04009652137756348,0.0
232,9,KNeighbors Classifier,2,0.8,0.6625766871165644,0.7588627488076594,0.11139702796936035,0.0
233,9,SVC Classifier,2,0.8,0.5153374233128835,1.0,0.08652091026306152,0.0
234,9,Decision Tree,2,0.8,0.6441717791411042,0.6030018297044807,0.017798900604248047,0.0
235,9,RandomForest,2,0.8,0.6196319018404908,0.5891070424518202,0.05031466484069824,0.0
236,9,AdaBoost (Discrete),2,0.8,0.7177914110429447,0.7358647460210398,8.8211030960083,0.0
237,9,AdaBoost (Real),2,0.8,0.6257668711656442,0.8228020420406904,10.153149604797363,0.0
238,9,Logistic Regression (Penalty = L2),2,0.8,0.7484662576687117,0.734494962836458,0.25272464752197266,0.0
239,9,Naive Bayes,2,0.8,0.26380368098159507,0.4296598980605766,0.04653286933898926,0.0
240,10,KNeighbors Classifier,0,0.8,0.6416184971098265,0.507323182041408,0.17211389541625977,0.0
241,10,SVC Classifier,0,0.8,0.5028901734104047,0.5227579585747102,0.14766716957092285,0.0
242,10,Decision Tree,0,0.8,0.6705202312138728,0.6082854013118251,0.005486726760864258,0.0
243,10,RandomForest,0,0.8,0.5491329479768786,0.7952707287670506,0.05224323272705078,0.0
244,10,AdaBoost (Discrete),0,0.8,0.7398843930635838,0.5998410373161958,9.495147228240967,0.0
245,10,AdaBoost (Real),0,0.8,0.6242774566473989,0.7244007043050418,9.680220603942871,0.0
246,10,Logistic Regression (Penalty = L2),0,0.8,0.7167630057803468,0.677061474604885,0.11023616790771484,0.0
247,10,Naive Bayes,0,0.8,0.26011560693641617,0.44572384648725094,0.01699066162109375,0.0
248,10,KNeighbors Classifier,1,0.8,0.6488095238095238,0.6709063553195257,0.10258769989013672,0.0
249,10,SVC Classifier,1,0.8,0.5178571428571429,0.5503212081491045,0.1606137752532959,0.0
250,10,Decision Tree,1,0.8,0.6428571428571429,0.6669553313723208,0.01677727699279785,0.0
251,10,RandomForest,1,0.8,0.5476190476190477,0.4705355686715127,0.05059409141540527,0.0
252,10,AdaBoost (Discrete),1,0.8,0.7202380952380952,0.6844203349767279,9.389585018157959,0.0
253,10,AdaBoost (Real),1,0.8,0.6607142857142857,0.6671125599275987,9.998398542404175,0.0
254,10,Logistic Regression (Penalty = L2),1,0.8,0.7380952380952381,0.7424447892866327,0.28940343856811523,0.0
255,10,Naive Bayes,1,0.8,0.25595238095238093,0.4410714231202338,0.043760061264038086,0.0
256,10,KNeighbors Classifier,2,0.8,0.656441717791411,0.6587587498472814,0.1449739933013916,0.0
257,10,SVC Classifier,2,0.8,0.5214723926380368,0.5503212081491045,0.19765114784240723,0.0
258,10,Decision Tree,2,0.8,0.558282208588957,0.6877079538303092,0.01824498176574707,0.0
259,10,RandomForest,2,0.8,0.6012269938650306,0.5112523636007517,0.07780718803405762,0.0
260,10,AdaBoost (Discrete),2,0.8,0.7239263803680982,0.6419087968420757,8.964296817779541,0.0
261,10,AdaBoost (Real),2,0.8,0.6196319018404908,0.783610617602281,9.769311666488647,0.0
262,10,Logistic Regression (Penalty = L2),2,0.8,0.7300613496932515,0.7373478822704576,0.16190791130065918,0.0
263,10,Naive Bayes,2,0.8,0.2883435582822086,0.49453559168067723,0.08712553977966309,0.0
264,11,KNeighbors Classifier,0,0.8,0.6416184971098265,0.49771148228661405,0.18201255798339844,0.0
265,11,SVC Classifier,0,0.8,0.5028901734104047,0.5227579585747102,0.09799432754516602,0.0
266,11,Decision Tree,0,0.8,0.6011560693641619,0.5175017315232949,0.006485462188720703,0.0
267,11,RandomForest,0,0.8,0.5260115606936416,0.2863424630911014,0.03409576416015625,0.0
268,11,AdaBoost (Discrete),0,0.8,0.7225433526011561,0.5619921735989805,7.541095733642578,0.0
269,11,AdaBoost (Real),0,0.8,0.6242774566473989,0.7244007043050418,6.9862730503082275,0.0
270,11,Logistic Regression (Penalty = L2),0,0.8,0.6936416184971098,0.6226764059032338,0.1704998016357422,0.0
271,11,Naive Bayes,0,0.8,0.26011560693641617,0.44572384648725094,0.018528461456298828,0.0
272,11,KNeighbors Classifier,1,0.8,0.6488095238095238,0.6474380034053117,0.0667104721069336,0.0
273,11,SVC Classifier,1,0.8,0.5238095238095238,0.6933612743506347,0.08424806594848633,0.0
274,11,Decision Tree,1,0.8,0.6190476190476191,0.6697113932840388,0.006405830383300781,0.0
275,11,RandomForest,1,0.8,0.5476190476190477,0.48549177170732344,0.03451681137084961,0.0
276,11,AdaBoost (Discrete),1,0.8,0.7440476190476191,0.7299790169008447,7.607871770858765,0.0
277,11,AdaBoost (Real),1,0.8,0.6607142857142857,0.6671125599275987,7.656273126602173,0.0
278,11,Logistic Regression (Penalty = L2),1,0.8,0.7321428571428571,0.7038952103609406,0.16971421241760254,0.0
279,11,Naive Bayes,1,0.8,0.25595238095238093,0.4410714231202338,0.09029817581176758,0.0
280,11,KNeighbors Classifier,2,0.8,0.656441717791411,0.6549050373521691,0.11532998085021973,0.0
281,11,SVC Classifier,2,0.8,0.5337423312883436,0.7937005259840998,0.08133244514465332,0.0
282,11,Decision Tree,2,0.8,0.6073619631901841,0.6429710364225372,0.005596637725830078,0.0
283,11,RandomForest,2,0.8,0.5705521472392638,0.3891852707755854,0.03145742416381836,0.0
284,11,AdaBoost (Discrete),2,0.8,0.7852760736196319,0.7026949634359029,6.420567512512207,0.0
285,11,AdaBoost (Real),2,0.8,0.6257668711656442,0.81230224581063,7.094417095184326,0.0
286,11,Logistic Regression (Penalty = L2),2,0.8,0.7239263803680982,0.6951415456598962,0.13792967796325684,0.0
287,11,Naive Bayes,2,0.8,0.2883435582822086,0.49453559168067723,0.032099008560180664,0.0
288,12,KNeighbors Classifier,0,0.8,0.6069364161849711,0.5033402266085599,0.061875343322753906,0.0
289,12,SVC Classifier,0,0.8,0.49710982658959535,1.0,0.06572222709655762,0.0
290,12,Decision Tree,0,0.8,0.6184971098265896,0.6042705638395099,0.004282236099243164,0.0
291,12,RandomForest,0,0.8,0.5549132947976878,0.5395235269400727,0.027204275131225586,0.0
292,12,AdaBoost (Discrete),0,0.8,0.6994219653179191,0.6480265882705674,3.380661725997925,0.0
293,12,AdaBoost (Real),0,0.8,0.630057803468208,0.7037680762075332,3.406052827835083,0.0
294,12,Logistic Regression (Penalty = L2),0,0.8,0.653179190751445,0.5438245259395813,0.08517909049987793,0.0
295,12,Naive Bayes,0,0.8,0.2254335260115607,0.3402713005569563,0.023729801177978516,0.0
296,12,KNeighbors Classifier,1,0.8,0.6428571428571429,0.5409869360113657,0.059404611587524414,0.0
297,12,SVC Classifier,1,0.8,0.5119047619047619,1.0,0.06961894035339355,0.0
298,12,Decision Tree,1,0.8,0.6190476190476191,0.6080164386836575,0.004846334457397461,0.0
299,12,RandomForest,1,0.8,0.5535714285714286,0.7952707287670506,0.025529146194458008,0.0
300,12,AdaBoost (Discrete),1,0.8,0.7261904761904762,0.7347923800123133,3.4017984867095947,0.0
301,12,AdaBoost (Real),1,0.8,0.6130952380952381,0.627160082198851,3.8182787895202637,0.0
302,12,Logistic Regression (Penalty = L2),1,0.8,0.6904761904761905,0.6329122635005974,0.07569742202758789,0.0
303,12,Naive Bayes,1,0.8,0.24404761904761904,0.4240759390680204,0.01842975616455078,0.0
304,12,KNeighbors Classifier,2,0.8,0.6503067484662577,0.7136377197298973,0.05302023887634277,0.0
305,12,SVC Classifier,2,0.8,0.5153374233128835,1.0,0.0813760757446289,0.0
306,12,Decision Tree,2,0.8,0.5950920245398773,0.5553049625903951,0.0035772323608398438,0.0
307,12,RandomForest,2,0.8,0.5828220858895705,0.7293240929736556,0.031141281127929688,0.0
308,12,AdaBoost (Discrete),2,0.8,0.7361963190184049,0.7008916138776513,3.20080828666687,0.0
309,12,AdaBoost (Real),2,0.8,0.5828220858895705,0.810908927640115,3.6676559448242188,0.0
310,12,Logistic Regression (Penalty = L2),2,0.8,0.6871165644171779,0.6804351706467535,0.07620048522949219,0.0
311,12,Naive Bayes,2,0.8,0.25766871165644173,0.3981935373846922,0.027917861938476562,0.3981935373846922
