,feat_set_id,classifier,fold_id,feat_th,score,geo_score,exec_t,geo_score_woz
0,0,KNeighbors Classifier,0,0.45,0.31736526946107785,0.327845125942889,0.16920113563537598,0.0
1,0,SVC Classifier,0,0.45,0.3093812375249501,1.0,0.5071282386779785,0.0
2,0,Decision Tree,0,0.45,0.32335329341317365,0.31468492657377384,0.05578160285949707,0.0
3,0,RandomForest,0,0.45,0.37924151696606784,0.43791323726815484,0.2798330783843994,0.0
4,0,AdaBoost (Discrete),0,0.45,0.26746506986027946,0.27900127411439535,18.329692363739014,0.0
5,0,AdaBoost (Real),0,0.45,0.3373253493013972,0.16504743828255009,25.354546308517456,0.0
6,0,Logistic Regression (Penalty = L2),0,0.45,0.34331337325349304,0.37512063826575737,0.22249484062194824,0.0
7,0,Naive Bayes,0,0.45,0.05788423153692615,0.49775775714949005,0.05157947540283203,0.0
8,0,KNeighbors Classifier,1,0.45,0.3353413654618474,0.350069626640913,0.1201479434967041,0.0
9,0,SVC Classifier,1,0.45,0.3092369477911647,1.0,0.4411590099334717,0.0
10,0,Decision Tree,1,0.45,0.29116465863453816,0.29127249752316,0.04199957847595215,0.0
11,0,RandomForest,1,0.45,0.39357429718875503,0.4120748705602752,0.3419928550720215,0.0
12,0,AdaBoost (Discrete),1,0.45,0.28313253012048195,0.29084974485112025,20.13808822631836,0.0
13,0,AdaBoost (Real),1,0.45,0.23293172690763053,0.27964505066882756,30.56685519218445,0.0
14,0,Logistic Regression (Penalty = L2),1,0.45,0.3755020080321285,0.216031753865228,0.13713479042053223,0.0
15,0,Naive Bayes,1,0.45,0.1465863453815261,0.4987592899129482,0.046233415603637695,0.0
16,0,KNeighbors Classifier,2,0.45,0.3212121212121212,0.3095507055198985,0.10904932022094727,0.0
17,0,SVC Classifier,2,0.45,0.3111111111111111,1.0,0.5139079093933105,0.0
18,0,Decision Tree,2,0.45,0.30505050505050507,0.294951473435909,0.039244651794433594,0.294951473435909
19,0,RandomForest,2,0.45,0.36363636363636365,0.34447548483442947,0.38045573234558105,0.0
20,0,AdaBoost (Discrete),2,0.45,0.2828282828282828,0.31988569384883553,20.314133882522583,0.0
21,0,AdaBoost (Real),2,0.45,0.14545454545454545,0.1816978972795412,29.863261699676514,0.0
22,0,Logistic Regression (Penalty = L2),2,0.45,0.37777777777777777,0.29135505200267614,0.2000119686126709,0.0
23,0,Naive Bayes,2,0.45,0.0707070707070707,0.6760089784203515,0.04133200645446777,0.0
24,1,KNeighbors Classifier,0,0.45,0.48502994011976047,0.42499605993025497,0.09650850296020508,0.0
25,1,SVC Classifier,0,0.45,0.3093812375249501,1.0,0.49636101722717285,0.0
26,1,Decision Tree,0,0.45,0.45708582834331335,0.4415908792391356,0.04386329650878906,0.0
27,1,RandomForest,0,0.45,0.4471057884231537,0.5790767574398362,0.33986949920654297,0.0
28,1,AdaBoost (Discrete),0,0.45,0.40718562874251496,0.37583020915334586,25.199506759643555,0.0
29,1,AdaBoost (Real),0,0.45,0.31137724550898205,0.34160244988272553,40.20274806022644,0.0
30,1,Logistic Regression (Penalty = L2),0,0.45,0.499001996007984,0.4469907831523838,0.26929664611816406,0.0
31,1,Naive Bayes,0,0.45,0.42115768463073855,0.4655288215899717,0.1311197280883789,0.0
32,1,KNeighbors Classifier,1,0.45,0.4779116465863454,0.3910084245275943,0.1922304630279541,0.3910084245275943
33,1,SVC Classifier,1,0.45,0.3092369477911647,1.0,0.7694425582885742,0.0
34,1,Decision Tree,1,0.45,0.39558232931726905,0.30101594068282966,0.06378531455993652,0.30101594068282966
35,1,RandomForest,1,0.45,0.4919678714859438,0.35802439176015693,0.507697343826294,0.0
36,1,AdaBoost (Discrete),1,0.45,0.43775100401606426,0.4113025266123467,30.954652070999146,0.0
37,1,AdaBoost (Real),1,0.45,0.2971887550200803,0.27864133156543547,55.53082203865051,0.27864133156543547
38,1,Logistic Regression (Penalty = L2),1,0.45,0.5100401606425703,0.37845032592933314,0.35964345932006836,0.0
39,1,Naive Bayes,1,0.45,0.39959839357429716,0.5123609550485542,0.1306304931640625,0.0
40,1,KNeighbors Classifier,2,0.45,0.4585858585858586,0.467673496961777,0.20018553733825684,0.0
41,1,SVC Classifier,2,0.45,0.3111111111111111,1.0,0.8112413883209229,0.0
42,1,Decision Tree,2,0.45,0.46464646464646464,0.3677705702972666,0.07973217964172363,0.3677705702972666
43,1,RandomForest,2,0.45,0.48484848484848486,0.5338206414961549,0.5373902320861816,0.0
44,1,AdaBoost (Discrete),2,0.45,0.402020202020202,0.30534221577645276,35.366342544555664,0.0
45,1,AdaBoost (Real),2,0.45,0.25656565656565655,0.27809147127642814,49.01539993286133,0.0
46,1,Logistic Regression (Penalty = L2),2,0.45,0.501010101010101,0.3819604353297352,0.38968944549560547,0.0
47,1,Naive Bayes,2,0.45,0.4121212121212121,0.5791140111812374,0.14682316780090332,0.0
48,2,KNeighbors Classifier,0,0.45,0.32335329341317365,0.24578072251375319,0.22791242599487305,0.0
49,2,SVC Classifier,0,0.45,0.3093812375249501,1.0,0.8274006843566895,0.0
50,2,Decision Tree,0,0.45,0.32934131736526945,0.28946982775785174,0.0747842788696289,0.0
51,2,RandomForest,0,0.45,0.3852295409181637,0.28999061997484266,0.5122799873352051,0.0
52,2,AdaBoost (Discrete),0,0.45,0.2375249500998004,0.23646283971539853,33.423192262649536,0.23646283971539853
53,2,AdaBoost (Real),0,0.45,0.19760479041916168,0.14518308763027504,58.889559507369995,0.0
54,2,Logistic Regression (Penalty = L2),0,0.45,0.3932135728542914,0.4525226304311618,0.3755459785461426,0.0
55,2,Naive Bayes,0,0.45,0.09780439121756487,0.4996942827603989,0.0929107666015625,0.0
56,2,KNeighbors Classifier,1,0.45,0.36947791164658633,0.32650369388786027,0.28049802780151367,0.0
57,2,SVC Classifier,1,0.45,0.3092369477911647,1.0,0.9603450298309326,0.0
58,2,Decision Tree,1,0.45,0.3514056224899598,0.2603063340385092,0.09112811088562012,0.0
59,2,RandomForest,1,0.45,0.42168674698795183,0.24394326788611775,0.5223886966705322,0.0
60,2,AdaBoost (Discrete),1,0.45,0.1746987951807229,0.2305171334597489,40.673306703567505,0.0
61,2,AdaBoost (Real),1,0.45,0.1566265060240964,0.22315939500822482,58.01304364204407,0.0
62,2,Logistic Regression (Penalty = L2),1,0.45,0.42168674698795183,0.4239204912161995,0.3722500801086426,0.0
63,2,Naive Bayes,1,0.45,0.13654618473895583,0.2661208479397261,0.11290240287780762,0.0
64,2,KNeighbors Classifier,2,0.45,0.3616161616161616,0.2851434430334042,0.39733195304870605,0.0
65,2,SVC Classifier,2,0.45,0.3111111111111111,1.0,1.1038343906402588,0.0
66,2,Decision Tree,2,0.45,0.3797979797979798,0.28605603554191955,0.002036571502685547,0.0
67,2,RandomForest,2,0.45,0.4080808080808081,0.3138959469188004,0.689133882522583,0.0
68,2,AdaBoost (Discrete),2,0.45,0.22828282828282828,0.25678184078166455,42.214359283447266,0.0
69,2,AdaBoost (Real),2,0.45,0.15151515151515152,0.18927551629822922,64.05407762527466,0.0
70,2,Logistic Regression (Penalty = L2),2,0.45,0.4222222222222222,0.42972031584591963,0.39841294288635254,0.0
71,2,Naive Bayes,2,0.45,0.09292929292929293,0.35642890484125284,0.19866037368774414,0.0
72,3,KNeighbors Classifier,0,0.45,0.4151696606786427,0.2557683415467516,0.2985038757324219,0.0
73,3,SVC Classifier,0,0.45,0.3093812375249501,1.0,0.9984827041625977,0.0
74,3,Decision Tree,0,0.45,0.32934131736526945,0.30339664669671457,0.10436511039733887,0.0
75,3,RandomForest,0,0.45,0.4471057884231537,0.3955952307466828,0.8930487632751465,0.0
76,3,AdaBoost (Discrete),0,0.45,0.3253493013972056,0.24986490221997237,44.490910053253174,0.0
77,3,AdaBoost (Real),0,0.45,0.25149700598802394,0.17772051115827803,64.95559358596802,0.0
78,3,Logistic Regression (Penalty = L2),0,0.45,0.46506986027944114,0.48272466689705706,0.4975547790527344,0.0
79,3,Naive Bayes,0,0.45,0.19760479041916168,0.3937627394360542,0.10097527503967285,0.0
80,3,KNeighbors Classifier,1,0.45,0.42369477911646586,0.3241048787198733,0.4150099754333496,0.0
81,3,SVC Classifier,1,0.45,0.3092369477911647,1.0,1.0909686088562012,0.0
82,3,Decision Tree,1,0.45,0.3755020080321285,0.3111780286154622,0.2412099838256836,0.0
83,3,RandomForest,1,0.45,0.4859437751004016,0.4640120272115203,0.7916257381439209,0.0
84,3,AdaBoost (Discrete),1,0.45,0.3072289156626506,0.23897253375858557,48.17565131187439,0.0
85,3,AdaBoost (Real),1,0.45,0.20682730923694778,0.21890366782590356,61.52517366409302,0.0
86,3,Logistic Regression (Penalty = L2),1,0.45,0.463855421686747,0.5240496373845555,0.4979877471923828,0.0
87,3,Naive Bayes,1,0.45,0.2429718875502008,0.23511302119343866,0.1882164478302002,0.0
88,3,KNeighbors Classifier,2,0.45,0.3939393939393939,0.291248113020071,0.20145153999328613,0.0
89,3,SVC Classifier,2,0.45,0.3111111111111111,1.0,1.176666021347046,0.0
90,3,Decision Tree,2,0.45,0.35353535353535354,0.2861874620405011,0.09991025924682617,0.0
91,3,RandomForest,2,0.45,0.4626262626262626,0.4384135410951417,0.8338158130645752,0.0
92,3,AdaBoost (Discrete),2,0.45,0.37373737373737376,0.30096950556479696,46.024375200271606,0.0
93,3,AdaBoost (Real),2,0.45,0.31717171717171716,0.24431759354201665,65.7031180858612,0.0
94,3,Logistic Regression (Penalty = L2),2,0.45,0.46060606060606063,0.4053028285865964,0.657318115234375,0.0
95,3,Naive Bayes,2,0.45,0.2101010101010101,0.36198522578214226,0.2541487216949463,0.0
96,4,KNeighbors Classifier,0,0.45,0.2994011976047904,0.2240821698910423,0.2902653217315674,0.0
97,4,SVC Classifier,0,0.45,0.3093812375249501,1.0,1.2991325855255127,0.0
98,4,Decision Tree,0,0.45,0.3213572854291417,0.18477210470325955,0.13475966453552246,0.0
99,4,RandomForest,0,0.45,0.3313373253493014,0.469992537681907,1.0114378929138184,0.0
100,4,AdaBoost (Discrete),0,0.45,0.3213572854291417,0.20384667962062747,46.42635369300842,0.0
101,4,AdaBoost (Real),0,0.45,0.3213572854291417,0.20165799898379705,66.85015106201172,0.0
102,4,Logistic Regression (Penalty = L2),0,0.45,0.34530938123752497,0.535199448207674,0.4292137622833252,0.0
103,4,Naive Bayes,0,0.45,0.34530938123752497,0.4253413401531345,0.2153000831604004,0.0
104,4,KNeighbors Classifier,1,0.45,0.28112449799196787,0.19412684414881373,0.3226807117462158,0.0
105,4,SVC Classifier,1,0.45,0.3092369477911647,1.0,1.1702783107757568,0.0
106,4,Decision Tree,1,0.45,0.3373493975903614,0.15845910140892536,0.0024945735931396484,0.0
107,4,RandomForest,1,0.45,0.3674698795180723,0.46404125671301116,0.7646188735961914,0.0
108,4,AdaBoost (Discrete),1,0.45,0.2469879518072289,0.24878112982630066,46.63376808166504,0.0
109,4,AdaBoost (Real),1,0.45,0.27710843373493976,0.2189292610526927,69.18593335151672,0.0
110,4,Logistic Regression (Penalty = L2),1,0.45,0.3534136546184739,0.4752258806114754,0.15577268600463867,0.0
111,4,Naive Bayes,1,0.45,0.3152610441767068,0.5469762671293027,0.1269235610961914,0.0
112,4,KNeighbors Classifier,2,0.45,0.30303030303030304,0.24507406378477473,0.20343732833862305,0.0
113,4,SVC Classifier,2,0.45,0.3111111111111111,1.0,1.1171672344207764,0.0
114,4,Decision Tree,2,0.45,0.3151515151515151,0.1924864756108704,0.1283280849456787,0.0
115,4,RandomForest,2,0.45,0.3595959595959596,0.5269759346176005,1.2495191097259521,0.0
116,4,AdaBoost (Discrete),2,0.45,0.2787878787878788,0.157316126554135,53.10900115966797,0.0
117,4,AdaBoost (Real),2,0.45,0.24444444444444444,0.2262247438062594,75.77108001708984,0.0
118,4,Logistic Regression (Penalty = L2),2,0.45,0.3393939393939394,0.4146664754389491,0.23060274124145508,0.0
119,4,Naive Bayes,2,0.45,0.3191919191919192,0.4628518551463132,0.1126708984375,0.0
120,5,KNeighbors Classifier,0,0.45,0.3213572854291417,0.2551588868288165,0.21970772743225098,0.0
121,5,SVC Classifier,0,0.45,0.3093812375249501,1.0,1.1895880699157715,0.0
122,5,Decision Tree,0,0.45,0.3333333333333333,0.2591807405759255,0.0016646385192871094,0.0
123,5,RandomForest,0,0.45,0.3393213572854291,0.27779264246746055,0.782217264175415,0.0
124,5,AdaBoost (Discrete),0,0.45,0.3153692614770459,0.3523493998388824,63.97821283340454,0.0
125,5,AdaBoost (Real),0,0.45,0.1996007984031936,0.18727225448924695,129.50503754615784,0.0
126,5,Logistic Regression (Penalty = L2),0,0.45,0.36127744510978044,0.34423104331110727,0.821258544921875,0.0
127,5,Naive Bayes,0,0.45,0.0658682634730539,0.6411393332844587,0.18950128555297852,0.0
128,5,KNeighbors Classifier,1,0.45,0.26305220883534136,0.2543030694164076,0.5393710136413574,0.0
129,5,SVC Classifier,1,0.45,0.3092369477911647,1.0,1.8540165424346924,0.0
130,5,Decision Tree,1,0.45,0.3393574297188755,0.21458499137572537,0.181915283203125,0.0
131,5,RandomForest,1,0.45,0.3232931726907631,0.7523119751664583,1.1751916408538818,0.0
132,5,AdaBoost (Discrete),1,0.45,0.2991967871485944,0.23906902066829658,81.36495208740234,0.0
133,5,AdaBoost (Real),1,0.45,0.3453815261044177,0.28951629750323954,120.1080641746521,0.0
134,5,Logistic Regression (Penalty = L2),1,0.45,0.3493975903614458,0.34320957492758686,0.6290273666381836,0.0
135,5,Naive Bayes,1,0.45,0.1465863453815261,0.7839874343080118,0.20269298553466797,0.0
136,5,KNeighbors Classifier,2,0.45,0.32323232323232326,0.3531281410658663,0.39325618743896484,0.0
137,5,SVC Classifier,2,0.45,0.3111111111111111,1.0,2.2420260906219482,0.0
138,5,Decision Tree,2,0.45,0.35555555555555557,0.31744684058764094,0.0017316341400146484,0.0
139,5,RandomForest,2,0.45,0.3292929292929293,0.3327908851027896,1.3472850322723389,0.0
140,5,AdaBoost (Discrete),2,0.45,0.2505050505050505,0.2215148328930133,91.88805365562439,0.0
141,5,AdaBoost (Real),2,0.45,0.3292929292929293,0.2139982222267029,121.53787398338318,0.0
142,5,Logistic Regression (Penalty = L2),2,0.45,0.3575757575757576,0.41041135694212855,0.6538681983947754,0.0
143,5,Naive Bayes,2,0.45,0.06262626262626263,0.5741559890331686,0.22510504722595215,0.0
144,6,KNeighbors Classifier,0,0.45,0.3153692614770459,0.2040338306559649,0.4396336078643799,0.0
145,6,SVC Classifier,0,0.45,0.3093812375249501,1.0,2.2606377601623535,0.0
146,6,Decision Tree,0,0.45,0.32934131736526945,0.21680305566104785,0.0027174949645996094,0.0
147,6,RandomForest,0,0.45,0.3333333333333333,0.8939547954421855,1.7528557777404785,0.0
148,6,AdaBoost (Discrete),0,0.45,0.27345309381237526,0.21663531839744496,89.98878192901611,0.0
149,6,AdaBoost (Real),0,0.45,0.2934131736526946,0.21613429740843212,107.01572966575623,0.0
150,6,Logistic Regression (Penalty = L2),0,0.45,0.3473053892215569,0.5836931180563317,0.49720239639282227,0.0
151,6,Naive Bayes,0,0.45,0.18762475049900199,0.8868715542977685,0.1951744556427002,0.0
152,6,KNeighbors Classifier,1,0.45,0.3172690763052209,0.24031648874101386,0.22075629234313965,0.0
153,6,SVC Classifier,1,0.45,0.3092369477911647,1.0,1.1370501518249512,0.0
154,6,Decision Tree,1,0.45,0.3453815261044177,0.2057744396761098,0.10671138763427734,0.0
155,6,RandomForest,1,0.45,0.3674698795180723,0.6750133557968111,0.8750956058502197,0.0
156,6,AdaBoost (Discrete),1,0.45,0.3273092369477912,0.25998104753459395,43.824384689331055,0.0
157,6,AdaBoost (Real),1,0.45,0.2248995983935743,0.24819965845093128,63.70350766181946,0.0
158,6,Logistic Regression (Penalty = L2),1,0.45,0.3514056224899598,0.6044670652237618,0.32384729385375977,0.0
159,6,Naive Bayes,1,0.45,0.22088353413654618,0.7749276830302825,0.21495366096496582,0.0
160,6,KNeighbors Classifier,2,0.45,0.29494949494949496,0.2645381581312955,0.21675777435302734,0.0
161,6,SVC Classifier,2,0.45,0.3111111111111111,1.0,1.0652611255645752,0.0
162,6,Decision Tree,2,0.45,0.3212121212121212,0.23965715815494576,0.10680770874023438,0.0
163,6,RandomForest,2,0.45,0.36363636363636365,0.6266835308824592,0.9648079872131348,0.0
164,6,AdaBoost (Discrete),2,0.45,0.37373737373737376,0.2803541560451935,45.359580516815186,0.0
165,6,AdaBoost (Real),2,0.45,0.2,0.2727759148949948,65.70513319969177,0.0
166,6,Logistic Regression (Penalty = L2),2,0.45,0.34949494949494947,0.2608508792083711,0.3230719566345215,0.0
167,6,Naive Bayes,2,0.45,0.18787878787878787,0.45633741230850866,0.21863031387329102,0.0
168,7,KNeighbors Classifier,0,0.45,0.16766467065868262,0.6506496351610378,0.3357095718383789,0.0
169,7,SVC Classifier,0,0.45,0.3093812375249501,1.0,1.070561408996582,0.0
170,7,Decision Tree,0,0.45,0.313373253493014,0.6525384675349823,0.10167956352233887,0.0
171,7,RandomForest,0,0.45,0.313373253493014,0.6525384675349823,0.7674109935760498,0.0
172,7,AdaBoost (Discrete),0,0.45,0.313373253493014,0.6525384675349823,43.128026485443115,0.0
173,7,AdaBoost (Real),0,0.45,0.313373253493014,0.6525384675349823,76.50500249862671,0.0
174,7,Logistic Regression (Penalty = L2),0,0.45,0.31736526946107785,0.842423539174232,0.40128397941589355,0.0
175,7,Naive Bayes,0,0.45,0.31736526946107785,0.842423539174232,0.21424436569213867,0.0
176,7,KNeighbors Classifier,1,0.45,0.3152610441767068,0.6546536707079771,0.3252406120300293,0.0
177,7,SVC Classifier,1,0.45,0.3092369477911647,1.0,1.0730226039886475,0.0
178,7,Decision Tree,1,0.45,0.3152610441767068,0.6546536707079771,0.001222848892211914,0.0
179,7,RandomForest,1,0.45,0.3152610441767068,0.6546536707079771,0.8599226474761963,0.0
180,7,AdaBoost (Discrete),1,0.45,0.3152610441767068,0.6546536707079771,44.107255935668945,0.0
181,7,AdaBoost (Real),1,0.45,0.3152610441767068,0.6546536707079771,71.63461470603943,0.0
182,7,Logistic Regression (Penalty = L2),1,0.45,0.3152610441767068,0.6546536707079771,0.2888212203979492,0.0
183,7,Naive Bayes,1,0.45,0.2931726907630522,0.6546536707079771,0.25048160552978516,0.0
184,7,KNeighbors Classifier,2,0.45,0.31717171717171716,0.7071067811865476,0.3284313678741455,0.0
185,7,SVC Classifier,2,0.45,0.3111111111111111,1.0,0.8252639770507812,0.0
186,7,Decision Tree,2,0.45,0.31717171717171716,0.7071067811865476,0.0019369125366210938,0.0
187,7,RandomForest,2,0.45,0.31717171717171716,0.7071067811865476,0.7860534191131592,0.0
188,7,AdaBoost (Discrete),2,0.45,0.31717171717171716,0.7071067811865476,45.27322864532471,0.0
189,7,AdaBoost (Real),2,0.45,0.31717171717171716,0.7071067811865476,73.13958549499512,0.0
190,7,Logistic Regression (Penalty = L2),2,0.45,0.31717171717171716,0.7071067811865476,0.3407738208770752,0.0
191,7,Naive Bayes,2,0.45,0.29494949494949496,0.7071067811865476,0.10575103759765625,0.0
192,8,KNeighbors Classifier,0,0.45,0.3473053892215569,0.24795834891375693,0.11282968521118164,0.0
193,8,SVC Classifier,0,0.45,0.3093812375249501,1.0,1.136552333831787,0.0
194,8,Decision Tree,0,0.45,0.3413173652694611,0.26525865937937265,0.11949038505554199,0.0
195,8,RandomForest,0,0.45,0.42115768463073855,0.2827043138802381,0.8031830787658691,0.0
196,8,AdaBoost (Discrete),0,0.45,0.27345309381237526,0.18622039775226853,48.366724491119385,0.0
197,8,AdaBoost (Real),0,0.45,0.1536926147704591,0.13976645137130783,67.29991388320923,0.0
198,8,Logistic Regression (Penalty = L2),0,0.45,0.40119760479041916,0.3764842691574713,0.33709192276000977,0.0
199,8,Naive Bayes,0,0.45,0.4171656686626746,0.40199594434826724,0.1096034049987793,0.0
200,8,KNeighbors Classifier,1,0.45,0.3273092369477912,0.2613904913289118,0.11128950119018555,0.0
201,8,SVC Classifier,1,0.45,0.3092369477911647,1.0,1.2250614166259766,0.0
202,8,Decision Tree,1,0.45,0.3293172690763052,0.28555966199336136,0.003295421600341797,0.0
203,8,RandomForest,1,0.45,0.39156626506024095,0.45849159324792266,0.748100757598877,0.0
204,8,AdaBoost (Discrete),1,0.45,0.285140562248996,0.2122921141794665,45.819786071777344,0.0
205,8,AdaBoost (Real),1,0.45,0.18674698795180722,0.20235509605405896,61.49603891372681,0.0
206,8,Logistic Regression (Penalty = L2),1,0.45,0.41164658634538154,0.29728399278100004,0.4037818908691406,0.0
207,8,Naive Bayes,1,0.45,0.41566265060240964,0.367719859996693,0.10614848136901855,0.0
208,8,KNeighbors Classifier,2,0.45,0.3474747474747475,0.2614070775079268,0.19925856590270996,0.0
209,8,SVC Classifier,2,0.45,0.3111111111111111,1.0,0.9473989009857178,0.0
210,8,Decision Tree,2,0.45,0.30707070707070705,0.24666558997340224,0.003259420394897461,0.0
211,8,RandomForest,2,0.45,0.397979797979798,0.43739072643000115,0.5802569389343262,0.0
212,8,AdaBoost (Discrete),2,0.45,0.32727272727272727,0.27069591288537714,43.597721338272095,0.0
213,8,AdaBoost (Real),2,0.45,0.2202020202020202,0.1853453551993587,63.933059215545654,0.0
214,8,Logistic Regression (Penalty = L2),2,0.45,0.40606060606060607,0.27658803499071904,0.31367063522338867,0.0
215,8,Naive Bayes,2,0.45,0.4222222222222222,0.3731775712602366,0.20671486854553223,0.0
216,9,KNeighbors Classifier,0,0.45,0.2834331337325349,0.34728689490324366,0.3132750988006592,0.0
217,9,SVC Classifier,0,0.45,0.3093812375249501,1.0,1.1345126628875732,0.0
218,9,Decision Tree,0,0.45,0.3473053892215569,0.14205180678266077,0.0023200511932373047,0.0
219,9,RandomForest,0,0.45,0.35528942115768464,0.403488548212987,0.725715160369873,0.0
220,9,AdaBoost (Discrete),0,0.45,0.35728542914171657,0.6032144034431141,42.259685039520264,0.0
221,9,AdaBoost (Real),0,0.45,0.3473053892215569,0.2729552411569331,58.0239462852478,0.0
222,9,Logistic Regression (Penalty = L2),0,0.45,0.36726546906187624,0.6794992529040834,0.26250267028808594,0.0
223,9,Naive Bayes,0,0.45,0.18762475049900199,0.3658086754000065,0.17288517951965332,0.0
224,9,KNeighbors Classifier,1,0.45,0.2791164658634538,0.46346522446688937,0.26218438148498535,0.0
225,9,SVC Classifier,1,0.45,0.3092369477911647,1.0,0.6996352672576904,0.0
226,9,Decision Tree,1,0.45,0.3674698795180723,0.32681375254426265,0.08614253997802734,0.0
227,9,RandomForest,1,0.45,0.42168674698795183,0.7810786503997581,0.62404465675354,0.0
228,9,AdaBoost (Discrete),1,0.45,0.3614457831325301,0.7018624984863101,33.96136498451233,0.0
229,9,AdaBoost (Real),1,0.45,0.39959839357429716,0.30842997727994753,51.11102771759033,0.0
230,9,Logistic Regression (Penalty = L2),1,0.45,0.3815261044176707,0.3593231454216049,0.2859773635864258,0.0
231,9,Naive Bayes,1,0.45,0.17269076305220885,0.18664086559049414,0.09241318702697754,0.0
232,9,KNeighbors Classifier,2,0.45,0.1919191919191919,0.43441457373722936,0.2822244167327881,0.0
233,9,SVC Classifier,2,0.45,0.3111111111111111,1.0,0.7416002750396729,0.0
234,9,Decision Tree,2,0.45,0.3656565656565657,0.6946915826572034,0.08634734153747559,0.0
235,9,RandomForest,2,0.45,0.3878787878787879,0.624143834212414,0.5732450485229492,0.0
236,9,AdaBoost (Discrete),2,0.45,0.37575757575757573,0.7191327175877457,34.92470645904541,0.0
237,9,AdaBoost (Real),2,0.45,0.31313131313131315,0.2980467360991687,50.24036502838135,0.0
238,9,Logistic Regression (Penalty = L2),2,0.45,0.402020202020202,0.7462807420380804,0.3104100227355957,0.0
239,9,Naive Bayes,2,0.45,0.17373737373737375,0.1761139981563524,0.08907270431518555,0.0
240,10,KNeighbors Classifier,0,0.45,0.4251497005988024,0.34936845158258906,0.3825719356536865,0.0
241,10,SVC Classifier,0,0.45,0.3093812375249501,1.0,1.0579802989959717,0.0
242,10,Decision Tree,0,0.45,0.3652694610778443,0.3214115275818535,0.09172773361206055,0.0
243,10,RandomForest,0,0.45,0.4291417165668663,0.4739175132590012,0.4942812919616699,0.0
244,10,AdaBoost (Discrete),0,0.45,0.37325349301397204,0.3333599280635683,41.5645797252655,0.0
245,10,AdaBoost (Real),0,0.45,0.2694610778443114,0.2335440867914182,56.639403343200684,0.2335440867914182
246,10,Logistic Regression (Penalty = L2),0,0.45,0.4810379241516966,0.3199516003910818,0.37220335006713867,0.0
247,10,Naive Bayes,0,0.45,0.10578842315369262,0.37399140575169865,0.20320796966552734,0.0
248,10,KNeighbors Classifier,1,0.45,0.46987951807228917,0.39287448955291693,0.4315943717956543,0.0
249,10,SVC Classifier,1,0.45,0.3092369477911647,1.0,1.0131113529205322,0.0
250,10,Decision Tree,1,0.45,0.39759036144578314,0.33956277695868997,0.08800983428955078,0.0
251,10,RandomForest,1,0.45,0.463855421686747,0.3627472112726169,0.4443941116333008,0.0
252,10,AdaBoost (Discrete),1,0.45,0.39959839357429716,0.40759892048030505,38.196199893951416,0.0
253,10,AdaBoost (Real),1,0.45,0.3032128514056225,0.21621055570870482,54.37446141242981,0.21621055570870482
254,10,Logistic Regression (Penalty = L2),1,0.45,0.4859437751004016,0.5356135840066911,0.46248626708984375,0.0
255,10,Naive Bayes,1,0.45,0.1606425702811245,0.23599544653732488,0.09327912330627441,0.0
256,10,KNeighbors Classifier,2,0.45,0.4444444444444444,0.387940723351094,0.2811145782470703,0.0
257,10,SVC Classifier,2,0.45,0.3111111111111111,1.0,1.0955488681793213,0.0
258,10,Decision Tree,2,0.45,0.3515151515151515,0.2650282199530569,0.09098362922668457,0.2650282199530569
259,10,RandomForest,2,0.45,0.45656565656565656,0.5275533998817807,0.6439166069030762,0.0
260,10,AdaBoost (Discrete),2,0.45,0.39191919191919194,0.26654305800622136,38.80531072616577,0.26654305800622136
261,10,AdaBoost (Real),2,0.45,0.25656565656565655,0.26568064803471314,63.672067642211914,0.0
262,10,Logistic Regression (Penalty = L2),2,0.45,0.494949494949495,0.30228750364954954,0.33014774322509766,0.0
263,10,Naive Bayes,2,0.45,0.10909090909090909,0.43054414058955415,0.1099863052368164,0.0
264,11,KNeighbors Classifier,0,0.45,0.5209580838323353,0.5414107704758029,0.324110746383667,0.0
265,11,SVC Classifier,0,0.45,0.3093812375249501,1.0,1.1800086498260498,0.0
266,11,Decision Tree,0,0.45,0.5089820359281437,0.48950490141989816,0.11203360557556152,0.0
267,11,RandomForest,0,0.45,0.45109780439121755,0.2768168689779958,0.860081672668457,0.0
268,11,AdaBoost (Discrete),0,0.45,0.49500998003992014,0.5007797604527435,47.016236543655396,0.0
269,11,AdaBoost (Real),0,0.45,0.3532934131736527,0.290969103484263,66.17631888389587,0.290969103484263
270,11,Logistic Regression (Penalty = L2),0,0.45,0.5768463073852296,0.5246904905780504,0.4040491580963135,0.0
271,11,Naive Bayes,0,0.45,0.12375249500998003,0.2945802783794665,0.21506094932556152,0.0
272,11,KNeighbors Classifier,1,0.45,0.5461847389558233,0.5351543757773826,0.5409433841705322,0.0
273,11,SVC Classifier,1,0.45,0.3092369477911647,1.0,1.2316126823425293,0.0
274,11,Decision Tree,1,0.45,0.4879518072289157,0.4864013973817834,0.10268378257751465,0.0
275,11,RandomForest,1,0.45,0.5622489959839357,0.5895941436874921,0.778104305267334,0.0
276,11,AdaBoost (Discrete),1,0.45,0.4939759036144578,0.5180354666040494,47.60927367210388,0.0
277,11,AdaBoost (Real),1,0.45,0.41164658634538154,0.363854651348592,67.90209650993347,0.0
278,11,Logistic Regression (Penalty = L2),1,0.45,0.5903614457831325,0.5848712434206008,0.47087526321411133,0.0
279,11,Naive Bayes,1,0.45,0.21285140562248997,0.3860491600499613,0.22654008865356445,0.0
280,11,KNeighbors Classifier,2,0.45,0.5494949494949495,0.5135003813236351,0.5692996978759766,0.0
281,11,SVC Classifier,2,0.45,0.3111111111111111,1.0,1.2815089225769043,0.0
282,11,Decision Tree,2,0.45,0.4868686868686869,0.4706415990484708,0.1267385482788086,0.0
283,11,RandomForest,2,0.45,0.4686868686868687,0.3817159181209077,0.7877473831176758,0.0
284,11,AdaBoost (Discrete),2,0.45,0.46464646464646464,0.42751461723393436,44.34641146659851,0.0
285,11,AdaBoost (Real),2,0.45,0.4222222222222222,0.4532012887188125,63.23345398902893,0.0
286,11,Logistic Regression (Penalty = L2),2,0.45,0.5757575757575758,0.5091462651866212,0.46326303482055664,0.0
287,11,Naive Bayes,2,0.45,0.12525252525252525,0.5057380642056387,0.07959961891174316,0.0
