,feat_set_id,classifier,fold_id,feat_th,score,geo_score,exec_t,geo_score_woz
0,0,KNeighbors Classifier,0,0.5,0.808955223880597,0.7813121581645848,5.194708347320557,0.7813121581645848
1,0,SVC Classifier,0,0.5,0.7791044776119403,0.7560439242221172,6.920862197875977,0.7560439242221172
2,0,Decision Tree,0,0.5,0.7149253731343284,0.6986917175050662,0.42495036125183105,0.6986917175050662
3,0,RandomForest,0,0.5,0.608955223880597,0.4416338431294548,1.386885404586792,0.4416338431294548
4,0,AdaBoost (Discrete),0,0.5,0.764179104477612,0.751898585309748,345.7297432422638,0.751898585309748
5,0,AdaBoost (Real),0,0.5,0.5328358208955224,0.34108615761380573,419.4956455230713,0.34108615761380573
6,0,Logistic Regression (Penalty = L2),0,0.5,0.808955223880597,0.7950051392504147,3.645324230194092,0.7950051392504147
7,0,Naive Bayes,0,0.5,0.7880597014925373,0.7678052828421869,0.45629119873046875,0.7678052828421869
8,0,KNeighbors Classifier,1,0.5,0.817910447761194,0.7815917477095586,6.552386999130249,0.7815917477095586
9,0,SVC Classifier,1,0.5,0.7791044776119403,0.748945100376459,8.253470182418823,0.748945100376459
10,0,Decision Tree,1,0.5,0.682089552238806,0.6640678167710827,0.43814635276794434,0.6640678167710827
11,0,RandomForest,1,0.5,0.6194029850746269,0.5796275861752088,1.78057861328125,0.5796275861752088
12,0,AdaBoost (Discrete),1,0.5,0.7970149253731343,0.778422720742849,382.55545687675476,0.778422720742849
13,0,AdaBoost (Real),1,0.5,0.6417910447761194,0.584989675614935,418.63790345191956,0.584989675614935
14,0,Logistic Regression (Penalty = L2),1,0.5,0.8029850746268656,0.7850815985013595,4.568903684616089,0.7850815985013595
15,0,Naive Bayes,1,0.5,0.7686567164179104,0.7417779248189899,0.4700756072998047,0.7417779248189899
16,0,KNeighbors Classifier,2,0.5,0.8242424242424242,0.7889240973628994,7.32887864112854,0.7889240973628994
17,0,SVC Classifier,2,0.5,0.7984848484848485,0.7785874033996377,9.260274648666382,0.7785874033996377
18,0,Decision Tree,2,0.5,0.7424242424242424,0.7161226200824791,0.4917171001434326,0.7161226200824791
19,0,RandomForest,2,0.5,0.6606060606060606,0.5551018820643254,1.971806526184082,0.5551018820643254
20,0,AdaBoost (Discrete),2,0.5,0.7666666666666667,0.7487710591356542,431.93184757232666,0.7487710591356542
21,0,AdaBoost (Real),2,0.5,0.5393939393939394,0.3169214971270461,401.2649064064026,0.3169214971270461
22,0,Logistic Regression (Penalty = L2),2,0.5,0.8333333333333334,0.8112886014013254,3.6297333240509033,0.8112886014013254
23,0,Naive Bayes,2,0.5,0.7833333333333333,0.7628266870406127,0.4798264503479004,0.7628266870406127
24,1,KNeighbors Classifier,0,0.5,0.8253731343283582,0.8003348246874216,6.332373142242432,0.8003348246874216
25,1,SVC Classifier,0,0.5,0.7671641791044777,0.7424004925818761,8.1928870677948,0.7424004925818761
26,1,Decision Tree,0,0.5,0.6507462686567164,0.6259887822725247,0.4720335006713867,0.6259887822725247
27,1,RandomForest,0,0.5,0.6149253731343284,0.476565840542483,1.738220453262329,0.476565840542483
28,1,AdaBoost (Discrete),0,0.5,0.7925373134328358,0.7769631269547,338.2365548610687,0.7769631269547
29,1,AdaBoost (Real),0,0.5,0.5328358208955224,0.34108615761380573,398.0911886692047,0.34108615761380573
30,1,Logistic Regression (Penalty = L2),0,0.5,0.8074626865671641,0.7893557294144328,3.4947664737701416,0.7893557294144328
31,1,Naive Bayes,0,0.5,0.7761194029850746,0.7492093470708738,0.46473050117492676,0.7492093470708738
32,1,KNeighbors Classifier,1,0.5,0.835820895522388,0.8083770138450425,6.24607253074646,0.8083770138450425
33,1,SVC Classifier,1,0.5,0.7776119402985074,0.7512999358698064,7.815044403076172,0.7512999358698064
34,1,Decision Tree,1,0.5,0.6805970149253732,0.656386576634949,0.46925997734069824,0.656386576634949
35,1,RandomForest,1,0.5,0.6223880597014926,0.5839728285886455,1.7189922332763672,0.5839728285886455
36,1,AdaBoost (Discrete),1,0.5,0.7716417910447761,0.7607848738758693,374.671875,0.7607848738758693
37,1,AdaBoost (Real),1,0.5,0.664179104477612,0.6426670161215235,375.35783338546753,0.6426670161215235
38,1,Logistic Regression (Penalty = L2),1,0.5,0.8164179104477612,0.79999270556981,4.1390297412872314,0.79999270556981
39,1,Naive Bayes,1,0.5,0.7731343283582089,0.7511481792586935,0.48633837699890137,0.7511481792586935
40,1,KNeighbors Classifier,2,0.5,0.8318181818181818,0.8034844097715507,7.209899425506592,0.8034844097715507
41,1,SVC Classifier,2,0.5,0.7909090909090909,0.7682331577820245,9.292315244674683,0.7682331577820245
42,1,Decision Tree,2,0.5,0.7075757575757575,0.6900909806119349,0.48210835456848145,0.6900909806119349
43,1,RandomForest,2,0.5,0.6606060606060606,0.5551018820643254,1.7294881343841553,0.5551018820643254
44,1,AdaBoost (Discrete),2,0.5,0.8136363636363636,0.8048048082323804,403.6010568141937,0.8048048082323804
45,1,AdaBoost (Real),2,0.5,0.5878787878787879,0.4502207407707242,377.1487236022949,0.4502207407707242
46,1,Logistic Regression (Penalty = L2),2,0.5,0.85,0.8360945553335496,3.3974339962005615,0.8360945553335496
47,1,Naive Bayes,2,0.5,0.7878787878787878,0.769979441088992,0.42281603813171387,0.769979441088992
48,2,KNeighbors Classifier,0,0.5,0.8059701492537313,0.7792998612617009,6.674185037612915,0.7792998612617009
49,2,SVC Classifier,0,0.5,0.7671641791044777,0.7451433689983418,8.122755289077759,0.7451433689983418
50,2,Decision Tree,0,0.5,0.6985074626865672,0.6780504092575058,0.4537949562072754,0.6780504092575058
51,2,RandomForest,0,0.5,0.6417910447761194,0.5292878559568769,1.8173260688781738,0.5292878559568769
52,2,AdaBoost (Discrete),0,0.5,0.7507462686567165,0.7295415749953569,368.6696791648865,0.7295415749953569
53,2,AdaBoost (Real),0,0.5,0.5328358208955224,0.34108615761380573,377.78003120422363,0.34108615761380573
54,2,Logistic Regression (Penalty = L2),0,0.5,0.8044776119402985,0.7887761495889221,2.9110286235809326,0.7887761495889221
55,2,Naive Bayes,0,0.5,0.7611940298507462,0.7367760032908737,0.2930903434753418,0.7367760032908737
56,2,KNeighbors Classifier,1,0.5,0.8253731343283582,0.795574232380529,5.632420301437378,0.795574232380529
57,2,SVC Classifier,1,0.5,0.7716417910447761,0.7222041628060044,7.590293645858765,0.7222041628060044
58,2,Decision Tree,1,0.5,0.7044776119402985,0.6837978839084621,0.4345412254333496,0.6837978839084621
59,2,RandomForest,1,0.5,0.6432835820895523,0.5685736720996825,1.4607362747192383,0.5685736720996825
60,2,AdaBoost (Discrete),1,0.5,0.746268656716418,0.728407113893398,1414.6430177688599,0.728407113893398
61,2,AdaBoost (Real),1,0.5,0.6895522388059702,0.669835078808121,267.2225253582001,0.669835078808121
62,2,Logistic Regression (Penalty = L2),1,0.5,0.8044776119402985,0.784705424298008,2.4288673400878906,0.784705424298008
63,2,Naive Bayes,1,0.5,0.7865671641791044,0.7641981588352317,0.32239627838134766,0.7641981588352317
64,2,KNeighbors Classifier,2,0.5,0.8196969696969697,0.7836247940634475,5.2402870655059814,0.7836247940634475
65,2,SVC Classifier,2,0.5,0.7954545454545454,0.7719640964291565,6.141730070114136,0.7719640964291565
66,2,Decision Tree,2,0.5,0.7348484848484849,0.7219004941658105,0.32415342330932617,0.7219004941658105
67,2,RandomForest,2,0.5,0.6924242424242424,0.5592351761065174,1.0896189212799072,0.5592351761065174
68,2,AdaBoost (Discrete),2,0.5,0.7515151515151515,0.7182122769724527,276.6420331001282,0.7182122769724527
69,2,AdaBoost (Real),2,0.5,0.5303030303030303,0.30425823173009175,273.255455493927,0.30425823173009175
70,2,Logistic Regression (Penalty = L2),2,0.5,0.8151515151515152,0.7899939268821284,2.537766456604004,0.7899939268821284
71,2,Naive Bayes,2,0.5,0.7833333333333333,0.7627528580944654,0.3071901798248291,0.7627528580944654
72,3,KNeighbors Classifier,0,0.5,0.8253731343283582,0.8020633876774682,3.5668020248413086,0.8020633876774682
73,3,SVC Classifier,0,0.5,0.7746268656716417,0.7525265768010608,5.025416135787964,0.7525265768010608
74,3,Decision Tree,0,0.5,0.7134328358208956,0.6938304921598291,0.30047082901000977,0.6938304921598291
75,3,RandomForest,0,0.5,0.6298507462686567,0.5559102331581891,1.0919432640075684,0.0
76,3,AdaBoost (Discrete),0,0.5,0.7701492537313432,0.7587234966613391,218.5910828113556,0.7587234966613391
77,3,AdaBoost (Real),0,0.5,0.5328358208955224,0.34108615761380573,228.31552171707153,0.34108615761380573
78,3,Logistic Regression (Penalty = L2),0,0.5,0.8194029850746268,0.8034153741640859,1.98598313331604,0.8034153741640859
79,3,Naive Bayes,0,0.5,0.7865671641791044,0.7668718858554715,0.20571208000183105,0.7668718858554715
80,3,KNeighbors Classifier,1,0.5,0.8343283582089552,0.8069474861917909,3.48952317237854,0.8069474861917909
81,3,SVC Classifier,1,0.5,0.7791044776119403,0.7362680606270116,4.660614490509033,0.7362680606270116
82,3,Decision Tree,1,0.5,0.6880597014925374,0.6753053530255527,0.3258695602416992,0.6753053530255527
83,3,RandomForest,1,0.5,0.6014925373134329,0.4195136534884812,1.0555195808410645,0.4195136534884812
84,3,AdaBoost (Discrete),1,0.5,0.7611940298507462,0.7349183592417037,203.7788290977478,0.7349183592417037
85,3,AdaBoost (Real),1,0.5,0.5955223880597015,0.5155682460467809,191.74483942985535,0.5155682460467809
86,3,Logistic Regression (Penalty = L2),1,0.5,0.8104477611940298,0.791754399174201,1.8550734519958496,0.791754399174201
87,3,Naive Bayes,1,0.5,0.7791044776119403,0.7562270202241163,0.18948125839233398,0.7562270202241163
88,3,KNeighbors Classifier,2,0.5,0.8318181818181818,0.8003189865457967,2.9592907428741455,0.8003189865457967
89,3,SVC Classifier,2,0.5,0.7954545454545454,0.7770097552484193,4.813832521438599,0.7770097552484193
90,3,Decision Tree,2,0.5,0.7136363636363636,0.6761295956598532,0.2840399742126465,0.6761295956598532
91,3,RandomForest,2,0.5,0.6318181818181818,0.4442739201492387,1.087202548980713,0.4442739201492387
92,3,AdaBoost (Discrete),2,0.5,0.75,0.724935597380281,202.0155816078186,0.724935597380281
93,3,AdaBoost (Real),2,0.5,0.5848484848484848,0.44424884105997986,188.7823896408081,0.44424884105997986
94,3,Logistic Regression (Penalty = L2),2,0.5,0.8409090909090909,0.8277725620540185,1.5920257568359375,0.8277725620540185
95,3,Naive Bayes,2,0.5,0.7833333333333333,0.7636924862421252,0.15861821174621582,0.7636924862421252
96,4,KNeighbors Classifier,0,0.5,0.8432835820895522,0.8221615915033185,1.8377997875213623,0.8221615915033185
97,4,SVC Classifier,0,0.5,0.7686567164179104,0.7384023045655395,3.1091365814208984,0.7384023045655395
98,4,Decision Tree,0,0.5,0.7074626865671642,0.6871017196016153,0.3129432201385498,0.6871017196016153
99,4,RandomForest,0,0.5,0.5805970149253732,0.5045822406386995,0.8856551647186279,0.5045822406386995
100,4,AdaBoost (Discrete),0,0.5,0.7880597014925373,0.7790958275645689,151.3673610687256,0.7790958275645689
101,4,AdaBoost (Real),0,0.5,0.5328358208955224,0.34108615761380573,154.60781979560852,0.34108615761380573
102,4,Logistic Regression (Penalty = L2),0,0.5,0.8074626865671641,0.7942372077562668,1.3095767498016357,0.7942372077562668
103,4,Naive Bayes,0,0.5,0.7820895522388059,0.7616950757031865,0.1324295997619629,0.7616950757031865
104,4,KNeighbors Classifier,1,0.5,0.8313432835820895,0.8015142090686282,1.8225326538085938,0.8015142090686282
105,4,SVC Classifier,1,0.5,0.7791044776119403,0.7449461119598848,3.1311538219451904,0.7449461119598848
106,4,Decision Tree,1,0.5,0.6955223880597015,0.6694932488244111,0.23197221755981445,0.6694932488244111
107,4,RandomForest,1,0.5,0.582089552238806,0.41283915720592107,0.790428638458252,0.41283915720592107
108,4,AdaBoost (Discrete),1,0.5,0.7850746268656716,0.7725237311248943,133.93437004089355,0.7725237311248943
109,4,AdaBoost (Real),1,0.5,0.6074626865671642,0.4898611348856517,143.1333453655243,0.4898611348856517
110,4,Logistic Regression (Penalty = L2),1,0.5,0.826865671641791,0.8098007560531347,1.151322841644287,0.8098007560531347
111,4,Naive Bayes,1,0.5,0.7850746268656716,0.7598640300464371,0.20296120643615723,0.7598640300464371
112,4,KNeighbors Classifier,2,0.5,0.8212121212121212,0.7906662539789565,1.8816027641296387,0.7906662539789565
113,4,SVC Classifier,2,0.5,0.7954545454545454,0.7719215904101397,2.9809036254882812,0.7719215904101397
114,4,Decision Tree,2,0.5,0.7015151515151515,0.6861149101920213,0.21108078956604004,0.6861149101920213
115,4,RandomForest,2,0.5,0.553030303030303,0.38406631801633,0.7201242446899414,0.38406631801633
116,4,AdaBoost (Discrete),2,0.5,0.7772727272727272,0.7597250339529994,134.01508688926697,0.7597250339529994
117,4,AdaBoost (Real),2,0.5,0.5257575757575758,0.37004960358754896,152.63918781280518,0.0
118,4,Logistic Regression (Penalty = L2),2,0.5,0.8363636363636363,0.8217421141036633,1.3983933925628662,0.8217421141036633
119,4,Naive Bayes,2,0.5,0.7893939393939394,0.7708040938828818,0.2691371440887451,0.7708040938828818
120,5,KNeighbors Classifier,0,0.5,0.844776119402985,0.8244699598825893,1.7238106727600098,0.8244699598825893
121,5,SVC Classifier,0,0.5,0.7686567164179104,0.7386947994200622,3.3220200538635254,0.7386947994200622
122,5,Decision Tree,0,0.5,0.7238805970149254,0.70850929870033,0.2501816749572754,0.70850929870033
123,5,RandomForest,0,0.5,0.5880597014925373,0.4824960295770113,0.8709490299224854,0.4824960295770113
124,5,AdaBoost (Discrete),0,0.5,0.7716417910447761,0.7516666647632243,146.00286221504211,0.7516666647632243
125,5,AdaBoost (Real),0,0.5,0.5328358208955224,0.34108615761380573,153.45123267173767,0.34108615761380573
126,5,Logistic Regression (Penalty = L2),0,0.5,0.8134328358208955,0.8006601752691181,1.3791732788085938,0.8006601752691181
127,5,Naive Bayes,0,0.5,0.7791044776119403,0.7583663892498457,0.17759227752685547,0.7583663892498457
128,5,KNeighbors Classifier,1,0.5,0.8253731343283582,0.7956979171533941,1.9146981239318848,0.7956979171533941
129,5,SVC Classifier,1,0.5,0.7865671641791044,0.7573645424117532,3.304854393005371,0.7573645424117532
130,5,Decision Tree,1,0.5,0.7089552238805971,0.6808367069870452,0.1689465045928955,0.6808367069870452
131,5,RandomForest,1,0.5,0.6582089552238806,0.6907287177446018,0.8401172161102295,0.0
132,5,AdaBoost (Discrete),1,0.5,0.7746268656716417,0.7476150455053822,138.9272060394287,0.7476150455053822
133,5,AdaBoost (Real),1,0.5,0.5447761194029851,0.47096917572874897,138.91296339035034,0.47096917572874897
134,5,Logistic Regression (Penalty = L2),1,0.5,0.826865671641791,0.8100938153208681,1.1653931140899658,0.8100938153208681
135,5,Naive Bayes,1,0.5,0.7835820895522388,0.75934640951509,0.1300487518310547,0.75934640951509
136,5,KNeighbors Classifier,2,0.5,0.8287878787878787,0.7989793096080454,1.5522229671478271,0.7989793096080454
137,5,SVC Classifier,2,0.5,0.7954545454545454,0.7741148356519723,2.8736202716827393,0.7741148356519723
138,5,Decision Tree,2,0.5,0.6984848484848485,0.6784097135776019,0.2458043098449707,0.6784097135776019
139,5,RandomForest,2,0.5,0.6439393939393939,0.49613517912061533,0.7681491374969482,0.49613517912061533
140,5,AdaBoost (Discrete),2,0.5,0.7757575757575758,0.7554644709382782,139.79712915420532,0.7554644709382782
141,5,AdaBoost (Real),2,0.5,0.6287878787878788,0.49641853928783697,148.59120774269104,0.49641853928783697
142,5,Logistic Regression (Penalty = L2),2,0.5,0.8424242424242424,0.8300576325281368,1.5300250053405762,0.8300576325281368
143,5,Naive Bayes,2,0.5,0.7954545454545454,0.7780808476136731,0.26239538192749023,0.7780808476136731
144,6,KNeighbors Classifier,0,0.5,0.8283582089552238,0.8037224834754112,2.6284639835357666,0.8037224834754112
145,6,SVC Classifier,0,0.5,0.7731343283582089,0.750874421950529,3.525465965270996,0.750874421950529
146,6,Decision Tree,0,0.5,0.6880597014925374,0.6692877673432697,0.22703862190246582,0.6692877673432697
147,6,RandomForest,0,0.5,0.591044776119403,0.5087008369499966,0.777254581451416,0.5087008369499966
148,6,AdaBoost (Discrete),0,0.5,0.7701492537313432,0.7574079350196731,187.02816915512085,0.7574079350196731
149,6,AdaBoost (Real),0,0.5,0.5328358208955224,0.34108615761380573,189.84825611114502,0.34108615761380573
150,6,Logistic Regression (Penalty = L2),0,0.5,0.8164179104477612,0.7999794015490523,1.711484432220459,0.7999794015490523
151,6,Naive Bayes,0,0.5,0.7865671641791044,0.7667031387995926,0.1975862979888916,0.7667031387995926
152,6,KNeighbors Classifier,1,0.5,0.8253731343283582,0.7960401542165694,2.792949676513672,0.7960401542165694
153,6,SVC Classifier,1,0.5,0.7776119402985074,0.7299659735126612,3.730299949645996,0.7299659735126612
154,6,Decision Tree,1,0.5,0.7,0.6836831879464387,0.22887873649597168,0.6836831879464387
155,6,RandomForest,1,0.5,0.6283582089552239,0.4829291806176948,0.8744471073150635,0.4829291806176948
156,6,AdaBoost (Discrete),1,0.5,0.7582089552238805,0.7428623712549643,189.91722226142883,0.7428623712549643
157,6,AdaBoost (Real),1,0.5,0.608955223880597,0.5103044360789635,215.7139060497284,0.5103044360789635
158,6,Logistic Regression (Penalty = L2),1,0.5,0.8119402985074626,0.7931055941154024,2.0000200271606445,0.7931055941154024
159,6,Naive Bayes,1,0.5,0.7805970149253731,0.7556928933095396,0.21462535858154297,0.7556928933095396
160,6,KNeighbors Classifier,2,0.5,0.8242424242424242,0.7941570554056415,3.345283269882202,0.7941570554056415
161,6,SVC Classifier,2,0.5,0.793939393939394,0.7745705546379474,4.7531211376190186,0.7745705546379474
162,6,Decision Tree,2,0.5,0.6818181818181818,0.6556128799644567,0.3889141082763672,0.6556128799644567
163,6,RandomForest,2,0.5,0.6575757575757576,0.5368263217789389,1.1084389686584473,0.5368263217789389
164,6,AdaBoost (Discrete),2,0.5,0.7681818181818182,0.7481632687737322,201.93942523002625,0.7481632687737322
165,6,AdaBoost (Real),2,0.5,0.5212121212121212,0.2887197521733292,193.37735056877136,0.2887197521733292
166,6,Logistic Regression (Penalty = L2),2,0.5,0.8424242424242424,0.8289556175782558,1.6861212253570557,0.8289556175782558
167,6,Naive Bayes,2,0.5,0.7833333333333333,0.7630596779739094,0.21606206893920898,0.7630596779739094
168,7,KNeighbors Classifier,0,0.5,0.8044776119402985,0.7775984617405225,5.69469690322876,0.7775984617405225
169,7,SVC Classifier,0,0.5,0.755223880597015,0.7280173914498276,6.327110528945923,0.7280173914498276
170,7,Decision Tree,0,0.5,0.6358208955223881,0.6061361075810517,0.2657582759857178,0.6061361075810517
171,7,RandomForest,0,0.5,0.582089552238806,0.46595748385996927,1.0521509647369385,0.46595748385996927
172,7,AdaBoost (Discrete),0,0.5,0.7820895522388059,0.7623862067773821,295.3566155433655,0.7623862067773821
173,7,AdaBoost (Real),0,0.5,0.5313432835820896,0.34048298349319206,299.05169653892517,0.34048298349319206
174,7,Logistic Regression (Penalty = L2),0,0.5,0.808955223880597,0.7932780021940214,2.5238113403320312,0.7932780021940214
175,7,Naive Bayes,0,0.5,0.7522388059701492,0.7264296965573243,0.28203868865966797,0.7264296965573243
176,7,KNeighbors Classifier,1,0.5,0.808955223880597,0.772416369772465,5.055664300918579,0.772416369772465
177,7,SVC Classifier,1,0.5,0.7701492537313432,0.7409016379647432,5.867639780044556,0.7409016379647432
178,7,Decision Tree,1,0.5,0.6716417910447762,0.6452584593476992,0.32047343254089355,0.6452584593476992
179,7,RandomForest,1,0.5,0.6373134328358209,0.5764316979398699,0.9659936428070068,0.5764316979398699
180,7,AdaBoost (Discrete),1,0.5,0.7686567164179104,0.7454991183801137,304.40306067466736,0.7454991183801137
181,7,AdaBoost (Real),1,0.5,0.5164179104477612,0.44027965992253737,306.2888798713684,0.44027965992253737
182,7,Logistic Regression (Penalty = L2),1,0.5,0.8059701492537313,0.7873915691698876,2.5949745178222656,0.7873915691698876
183,7,Naive Bayes,1,0.5,0.7686567164179104,0.7453896739823938,0.3211991786956787,0.7453896739823938
184,7,KNeighbors Classifier,2,0.5,0.8181818181818182,0.7885933076854335,5.074920654296875,0.7885933076854335
185,7,SVC Classifier,2,0.5,0.7863636363636364,0.7458314683874832,5.919300317764282,0.7458314683874832
186,7,Decision Tree,2,0.5,0.6166666666666667,0.593723449090247,0.31812477111816406,0.593723449090247
187,7,RandomForest,2,0.5,0.5909090909090909,0.41851838162905686,1.0584747791290283,0.41851838162905686
188,7,AdaBoost (Discrete),2,0.5,0.7818181818181819,0.7623111645147044,285.95122241973877,0.7623111645147044
189,7,AdaBoost (Real),2,0.5,0.6409090909090909,0.6070825416702892,260.10497426986694,0.6070825416702892
190,7,Logistic Regression (Penalty = L2),2,0.5,0.8257575757575758,0.8070317963130909,2.3028652667999268,0.8070317963130909
191,7,Naive Bayes,2,0.5,0.7893939393939394,0.7704936045525524,0.20897555351257324,0.7704936045525524
192,8,KNeighbors Classifier,0,0.5,0.844776119402985,0.8244699598825893,1.5163025856018066,0.8244699598825893
193,8,SVC Classifier,0,0.5,0.7686567164179104,0.7386947994200622,2.7202606201171875,0.7386947994200622
194,8,Decision Tree,0,0.5,0.6970149253731344,0.6809640117811363,0.202392578125,0.6809640117811363
195,8,RandomForest,0,0.5,0.5880597014925373,0.4824960295770113,0.6129138469696045,0.4824960295770113
196,8,AdaBoost (Discrete),0,0.5,0.7716417910447761,0.7516666647632243,130.7660882472992,0.7516666647632243
197,8,AdaBoost (Real),0,0.5,0.5328358208955224,0.34108615761380573,140.08534979820251,0.34108615761380573
198,8,Logistic Regression (Penalty = L2),0,0.5,0.8134328358208955,0.8006601752691181,1.2401533126831055,0.8006601752691181
199,8,Naive Bayes,0,0.5,0.7791044776119403,0.7583663892498457,0.20159029960632324,0.7583663892498457
200,8,KNeighbors Classifier,1,0.5,0.8253731343283582,0.7956979171533941,1.738220453262329,0.7956979171533941
201,8,SVC Classifier,1,0.5,0.7865671641791044,0.7573645424117532,2.8310835361480713,0.7573645424117532
202,8,Decision Tree,1,0.5,0.6805970149253732,0.6554254965592977,0.2148149013519287,0.6554254965592977
203,8,RandomForest,1,0.5,0.6582089552238806,0.6907287177446018,0.8000125885009766,0.0
204,8,AdaBoost (Discrete),1,0.5,0.7746268656716417,0.7476150455053822,132.62147641181946,0.7476150455053822
205,8,AdaBoost (Real),1,0.5,0.6358208955223881,0.5680765755266262,124.6266736984253,0.5680765755266262
206,8,Logistic Regression (Penalty = L2),1,0.5,0.826865671641791,0.8100938153208681,1.2614715099334717,0.8100938153208681
207,8,Naive Bayes,1,0.5,0.7835820895522388,0.75934640951509,0.2096264362335205,0.75934640951509
208,8,KNeighbors Classifier,2,0.5,0.8287878787878787,0.7989793096080454,1.6858866214752197,0.7989793096080454
209,8,SVC Classifier,2,0.5,0.7954545454545454,0.7741148356519723,2.7803428173065186,0.7741148356519723
210,8,Decision Tree,2,0.5,0.7121212121212122,0.6951456882031812,0.20666265487670898,0.6951456882031812
211,8,RandomForest,2,0.5,0.6439393939393939,0.49613517912061533,0.684922456741333,0.49613517912061533
212,8,AdaBoost (Discrete),2,0.5,0.7742424242424243,0.7539083618927936,123.22194361686707,0.7539083618927936
213,8,AdaBoost (Real),2,0.5,0.5848484848484848,0.44424884105997986,127.84971475601196,0.44424884105997986
214,8,Logistic Regression (Penalty = L2),2,0.5,0.8424242424242424,0.8300576325281368,1.1852717399597168,0.8300576325281368
215,8,Naive Bayes,2,0.5,0.7954545454545454,0.7780808476136731,0.14571666717529297,0.7780808476136731
