,feat_set_id,classifier,fold_id,feat_th,score,geo_score,exec_t,geo_score_woz
0,0,KNeighbors Classifier,0,0.7,0.7930413917216557,0.7922968573931717,30.096811056137085,0.7922968573931717
1,0,SVC Classifier,0,0.7,0.8464307138572286,0.8407331008993647,23.41301441192627,0.8407331008993647
2,0,Decision Tree,0,0.7,0.7192561487702459,0.7190676089127079,0.8047468662261963,0.7190676089127079
3,0,RandomForest,0,0.7,0.7876424715056989,0.7827608821244267,2.172231435775757,0.7827608821244267
4,0,AdaBoost (Discrete),0,0.7,0.8398320335932813,0.839774833737578,432.95683097839355,0.839774833737578
5,0,AdaBoost (Real),0,0.7,0.8248350329934013,0.8243176679938085,452.27601528167725,0.8243176679938085
6,0,Logistic Regression (Penalty = L2),0,0.7,0.871625674865027,0.8714769679262423,1.4965424537658691,0.8714769679262423
7,0,Naive Bayes,0,0.7,0.8014397120575885,0.7770100281985559,0.4998900890350342,0.7770100281985559
8,0,KNeighbors Classifier,1,0.7,0.7948410317936413,0.7947851104889339,7.928945779800415,0.7947851104889339
9,0,SVC Classifier,1,0.7,0.8470305938812237,0.841719507171669,15.286038637161255,0.841719507171669
10,0,Decision Tree,1,0.7,0.7300539892021596,0.7293742484396831,0.5113487243652344,0.7293742484396831
11,0,RandomForest,1,0.7,0.7648470305938813,0.7574892424265629,1.885166883468628,0.7574892424265629
12,0,AdaBoost (Discrete),1,0.7,0.8176364727054589,0.8172663683518581,335.3181507587433,0.8172663683518581
13,0,AdaBoost (Real),1,0.7,0.8182363527294542,0.8168841929158428,387.82692074775696,0.8168841929158428
14,0,Logistic Regression (Penalty = L2),1,0.7,0.8584283143371326,0.8584273439762035,0.5086379051208496,0.8584273439762035
15,0,Naive Bayes,1,0.7,0.7966406718656269,0.7723599896342752,0.15467286109924316,0.7723599896342752
16,0,KNeighbors Classifier,2,0.7,0.826530612244898,0.8262227257284379,21.716533184051514,0.8262227257284379
17,0,SVC Classifier,2,0.7,0.8637454981992797,0.8577886384966786,19.322937965393066,0.8577886384966786
18,0,Decision Tree,2,0.7,0.741296518607443,0.7411189110400856,0.6963748931884766,0.7411189110400856
19,0,RandomForest,2,0.7,0.7923169267707083,0.7837178941626575,1.625342607498169,0.7837178941626575
20,0,AdaBoost (Discrete),2,0.7,0.8475390156062425,0.8465507549221505,324.08431243896484,0.8465507549221505
21,0,AdaBoost (Real),2,0.7,0.8493397358943577,0.8470339104557729,414.00158071517944,0.8470339104557729
22,0,Logistic Regression (Penalty = L2),2,0.7,0.8703481392557023,0.8702887375630611,1.763887882232666,0.8702887375630611
23,0,Naive Bayes,2,0.7,0.8055222088835534,0.7786717052100363,0.3414885997772217,0.7786717052100363
24,1,KNeighbors Classifier,0,0.7,0.79124175164967,0.7910927421758148,31.617839097976685,0.7910927421758148
25,1,SVC Classifier,0,0.7,0.8512297540491902,0.8459946572729397,26.32740616798401,0.8459946572729397
26,1,Decision Tree,0,0.7,0.7438512297540492,0.7438578896435512,0.8388411998748779,0.7438578896435512
27,1,RandomForest,0,0.7,0.7654469106178764,0.7618378498274366,2.0198564529418945,0.7618378498274366
28,1,AdaBoost (Discrete),0,0.7,0.829634073185363,0.829560548976424,407.89820432662964,0.829560548976424
29,1,AdaBoost (Real),0,0.7,0.8350329934013198,0.83436118280926,414.9513280391693,0.83436118280926
30,1,Logistic Regression (Penalty = L2),0,0.7,0.8686262747450509,0.8684211279170478,1.5368859767913818,0.8684211279170478
31,1,Naive Bayes,0,0.7,0.7984403119376124,0.7745157258699482,0.2663536071777344,0.7745157258699482
32,1,KNeighbors Classifier,1,0.7,0.8020395920815837,0.8020547224421665,28.840035438537598,0.8020547224421665
33,1,SVC Classifier,1,0.7,0.8464307138572286,0.8405546455562402,24.470852613449097,0.8405546455562402
34,1,Decision Tree,1,0.7,0.7198560287942412,0.7194858086702847,0.9028997421264648,0.7194858086702847
35,1,RandomForest,1,0.7,0.7558488302339532,0.7539602483076133,2.2245311737060547,0.7539602483076133
36,1,AdaBoost (Discrete),1,0.7,0.8344331133773245,0.8341862511691455,453.1423041820526,0.8341862511691455
37,1,AdaBoost (Real),1,0.7,0.8158368326334733,0.8151761388454294,389.07881259918213,0.8151761388454294
38,1,Logistic Regression (Penalty = L2),1,0.7,0.8632273545290942,0.8632201513921447,2.198333740234375,0.8632201513921447
39,1,Naive Bayes,1,0.7,0.7954409118176364,0.7709963799707369,0.6533279418945312,0.7709963799707369
40,1,KNeighbors Classifier,2,0.7,0.8043217286914766,0.8038962292394807,37.092514514923096,0.8038962292394807
41,1,SVC Classifier,2,0.7,0.8625450180072028,0.8566853721492818,27.903200387954712,0.8566853721492818
42,1,Decision Tree,2,0.7,0.7430972388955582,0.7430983471778987,0.9713330268859863,0.7430983471778987
43,1,RandomForest,2,0.7,0.7947178871548619,0.7869252085596598,2.2264907360076904,0.7869252085596598
44,1,AdaBoost (Discrete),2,0.7,0.8469387755102041,0.8464405533598597,458.3677899837494,0.8464405533598597
45,1,AdaBoost (Real),2,0.7,0.8475390156062425,0.8455010236610824,463.4607849121094,0.8455010236610824
46,1,Logistic Regression (Penalty = L2),2,0.7,0.8757503001200481,0.8756642150086149,1.7328953742980957,0.8756642150086149
47,1,Naive Bayes,2,0.7,0.8073229291716687,0.7812890679997853,0.46273064613342285,0.7812890679997853
48,2,KNeighbors Classifier,0,0.7,0.7732453509298141,0.7730324551555908,35.18262815475464,0.7730324551555908
49,2,SVC Classifier,0,0.7,0.829634073185363,0.8181268922105017,28.66898202896118,0.8181268922105017
50,2,Decision Tree,0,0.7,0.7234553089382123,0.7233225458624184,0.940150260925293,0.7233225458624184
51,2,RandomForest,0,0.7,0.7408518296340731,0.7159708977295985,2.239522695541382,0.7159708977295985
52,2,AdaBoost (Discrete),0,0.7,0.8164367126574685,0.8163104070950928,418.316606760025,0.8163104070950928
53,2,AdaBoost (Real),0,0.7,0.8098380323935213,0.8086278456124247,457.2473735809326,0.8086278456124247
54,2,Logistic Regression (Penalty = L2),0,0.7,0.859628074385123,0.8592664842589185,1.7228899002075195,0.8592664842589185
55,2,Naive Bayes,0,0.7,0.7864427114577085,0.755419350578808,0.2700777053833008,0.755419350578808
56,2,KNeighbors Classifier,1,0.7,0.7684463107378524,0.7679050221810663,30.12844729423523,0.7679050221810663
57,2,SVC Classifier,1,0.7,0.8428314337132573,0.834026269873046,27.592933654785156,0.834026269873046
58,2,Decision Tree,1,0.7,0.6964607078584283,0.6962746683519935,0.9865176677703857,0.6962746683519935
59,2,RandomForest,1,0.7,0.752249550089982,0.7399817276283792,1.8788161277770996,0.7399817276283792
60,2,AdaBoost (Discrete),1,0.7,0.8164367126574685,0.8160200642399176,391.30868339538574,0.8160200642399176
61,2,AdaBoost (Real),1,0.7,0.8134373125374925,0.8118096561366192,429.41710567474365,0.8118096561366192
62,2,Logistic Regression (Penalty = L2),1,0.7,0.8512297540491902,0.8511848255895064,2.0107715129852295,0.8511848255895064
63,2,Naive Bayes,1,0.7,0.7822435512897421,0.7497163310072583,0.3386657238006592,0.7497163310072583
64,2,KNeighbors Classifier,2,0.7,0.7869147659063626,0.7864340515375006,29.287837982177734,0.7864340515375006
65,2,SVC Classifier,2,0.7,0.8433373349339736,0.8338869482904512,21.682328462600708,0.8338869482904512
66,2,Decision Tree,2,0.7,0.7148859543817527,0.7147835704172386,0.8459358215332031,0.7147835704172386
67,2,RandomForest,2,0.7,0.7851140456182473,0.7748985133732464,1.9121246337890625,0.7748985133732464
68,2,AdaBoost (Discrete),2,0.7,0.8337334933973589,0.8328578778101224,397.68711161613464,0.8328578778101224
69,2,AdaBoost (Real),2,0.7,0.8313325330132053,0.8308627802601655,405.48903727531433,0.8308627802601655
70,2,Logistic Regression (Penalty = L2),2,0.7,0.8619447779111644,0.8619262936690637,1.6919503211975098,0.8619262936690637
71,2,Naive Bayes,2,0.7,0.7935174069627852,0.7593048264270206,0.3222932815551758,0.7593048264270206
72,3,KNeighbors Classifier,0,0.7,0.8008398320335933,0.8008347225195708,25.6351535320282,0.8008347225195708
73,3,SVC Classifier,0,0.7,0.8470305938812237,0.8412109440832634,20.425858974456787,0.8412109440832634
74,3,Decision Tree,0,0.7,0.7252549490101979,0.7252852850418757,0.7530124187469482,0.7252852850418757
75,3,RandomForest,0,0.7,0.7396520695860828,0.7152733379498805,2.1487531661987305,0.7152733379498805
76,3,AdaBoost (Discrete),0,0.7,0.8344331133773245,0.83427584516673,1321.538255929947,0.83427584516673
77,3,AdaBoost (Real),0,0.7,0.8278344331133773,0.82720711017215,261.33358454704285,0.82720711017215
78,3,Logistic Regression (Penalty = L2),0,0.7,0.8722255548890222,0.872105952532333,1.2278356552124023,0.872105952532333
79,3,Naive Bayes,0,0.7,0.7978404319136173,0.773282025588021,0.2188889980316162,0.773282025588021
80,3,KNeighbors Classifier,1,0.7,0.7900419916016796,0.7900576522727124,19.668092727661133,0.7900576522727124
81,3,SVC Classifier,1,0.7,0.850629874025195,0.8450368394156651,16.36535382270813,0.8450368394156651
82,3,Decision Tree,1,0.7,0.7264547090581883,0.7262226176591964,0.560511589050293,0.7262226176591964
83,3,RandomForest,1,0.7,0.749250149970006,0.7327222646818632,1.5869808197021484,0.7327222646818632
84,3,AdaBoost (Discrete),1,0.7,0.829634073185363,0.8294558823683452,247.64276599884033,0.8294558823683452
85,3,AdaBoost (Real),1,0.7,0.8326334733053389,0.8324420547730323,236.57200932502747,0.8324420547730323
86,3,Logistic Regression (Penalty = L2),1,0.7,0.8602279544091181,0.8602271886392777,0.8720102310180664,0.8602271886392777
87,3,Naive Bayes,1,0.7,0.7972405518896221,0.7732229624075557,0.18872761726379395,0.7732229624075557
88,3,KNeighbors Classifier,2,0.7,0.8277310924369747,0.8273653565125061,14.377020120620728,0.8273653565125061
89,3,SVC Classifier,2,0.7,0.8607442977190877,0.854869232211324,14.123204231262207,0.854869232211324
90,3,Decision Tree,2,0.7,0.7304921968787516,0.730527070280373,0.48876237869262695,0.730527070280373
91,3,RandomForest,2,0.7,0.7737094837935174,0.7486269953605383,1.144543170928955,0.7486269953605383
92,3,AdaBoost (Discrete),2,0.7,0.8445378151260504,0.8437044944842748,215.36848092079163,0.8437044944842748
93,3,AdaBoost (Real),2,0.7,0.8607442977190877,0.8596382891070521,231.4562349319458,0.8596382891070521
94,3,Logistic Regression (Penalty = L2),2,0.7,0.8727490996398559,0.8726500188757407,0.8815960884094238,0.8726500188757407
95,3,Naive Bayes,2,0.7,0.8061224489795918,0.7799211664204778,0.28115391731262207,0.7799211664204778
96,4,KNeighbors Classifier,0,0.7,0.8008398320335933,0.800555938565233,10.698124885559082,0.800555938565233
97,4,SVC Classifier,0,0.7,0.8344331133773245,0.8240139021919226,11.421164989471436,0.8240139021919226
98,4,Decision Tree,0,0.7,0.7354529094181164,0.7349070698612945,0.27866458892822266,0.7349070698612945
99,4,RandomForest,0,0.7,0.7144571085782844,0.6861523697762445,1.0083582401275635,0.6861523697762445
100,4,AdaBoost (Discrete),0,0.7,0.8068386322735452,0.806092988158382,175.51931047439575,0.806092988158382
101,4,AdaBoost (Real),0,0.7,0.8128374325134973,0.8116660507750189,208.37334156036377,0.8116660507750189
102,4,Logistic Regression (Penalty = L2),0,0.7,0.8614277144571085,0.8611138796689995,0.812021017074585,0.8611138796689995
103,4,Naive Bayes,0,0.7,0.7870425914817036,0.7567269174728852,0.20001912117004395,0.7567269174728852
104,4,KNeighbors Classifier,1,0.7,0.7708458308338332,0.7702976036050802,11.81678318977356,0.7702976036050802
105,4,SVC Classifier,1,0.7,0.8440311937612478,0.8350627350069749,13.6456880569458,0.8350627350069749
106,4,Decision Tree,1,0.7,0.734253149370126,0.7339856980495628,0.4202413558959961,0.7339856980495628
107,4,RandomForest,1,0.7,0.7216556688662268,0.6912130482767813,1.0718042850494385,0.6912130482767813
108,4,AdaBoost (Discrete),1,0.7,0.8068386322735452,0.8051873585060736,176.8218080997467,0.8051873585060736
109,4,AdaBoost (Real),1,0.7,0.8260347930413917,0.8247007891490807,173.94174933433533,0.8247007891490807
110,4,Logistic Regression (Penalty = L2),1,0.7,0.8548290341931614,0.8548049537610822,0.7571511268615723,0.8548049537610822
111,4,Naive Bayes,1,0.7,0.7822435512897421,0.7497050882697238,0.1609182357788086,0.7497050882697238
112,4,KNeighbors Classifier,2,0.7,0.8067226890756303,0.8064298834269027,9.662397146224976,0.8064298834269027
113,4,SVC Classifier,2,0.7,0.8475390156062425,0.838660750067986,10.077217102050781,0.838660750067986
114,4,Decision Tree,2,0.7,0.748499399759904,0.7481021033424524,0.40460205078125,0.7481021033424524
115,4,RandomForest,2,0.7,0.751500600240096,0.7105547045982156,0.7816171646118164,0.7105547045982156
116,4,AdaBoost (Discrete),2,0.7,0.8217286914765907,0.8187951453666307,147.57312750816345,0.8187951453666307
117,4,AdaBoost (Real),2,0.7,0.8277310924369747,0.8257939514180441,166.90511512756348,0.8257939514180441
118,4,Logistic Regression (Penalty = L2),2,0.7,0.8613445378151261,0.8612936640716088,0.7353405952453613,0.8612936640716088
119,4,Naive Bayes,2,0.7,0.7917166866746699,0.7578629535161447,0.15970754623413086,0.7578629535161447
120,5,KNeighbors Classifier,0,0.7,0.7918416316736653,0.7914171567903419,10.808225870132446,0.7914171567903419
121,5,SVC Classifier,0,0.7,0.8356328734253149,0.8240799358892588,10.622623443603516,0.8240799358892588
122,5,Decision Tree,0,0.7,0.7348530293941212,0.7347667265691903,0.3871150016784668,0.7347667265691903
123,5,RandomForest,0,0.7,0.7456508698260348,0.7379906180724438,0.8668897151947021,0.7379906180724438
124,5,AdaBoost (Discrete),0,0.7,0.8068386322735452,0.8064741907910854,149.5611400604248,0.8064741907910854
125,5,AdaBoost (Real),0,0.7,0.8056388722255549,0.8043155017263895,164.42294931411743,0.8043155017263895
126,5,Logistic Regression (Penalty = L2),0,0.7,0.862627474505099,0.8621452500411655,0.7631773948669434,0.8621452500411655
127,5,Naive Bayes,0,0.7,0.788242351529694,0.7569301933048641,0.16818618774414062,0.7569301933048641
128,5,KNeighbors Classifier,1,0.7,0.7894421115776845,0.7889927867973977,10.011535882949829,0.7889927867973977
129,5,SVC Classifier,1,0.7,0.8434313137372526,0.8345605597500368,11.382741689682007,0.8345605597500368
130,5,Decision Tree,1,0.7,0.7120575884823035,0.7118947299848712,0.2694542407989502,0.7118947299848712
131,5,RandomForest,1,0.7,0.737252549490102,0.7294186327469663,1.0203447341918945,0.7294186327469663
132,5,AdaBoost (Discrete),1,0.7,0.8110377924415118,0.8104352893695944,159.1954207420349,0.8104352893695944
133,5,AdaBoost (Real),1,0.7,0.8074385122975405,0.8060493698708026,172.91414713859558,0.8060493698708026
134,5,Logistic Regression (Penalty = L2),1,0.7,0.8524295140971806,0.852444002531938,0.7714030742645264,0.852444002531938
135,5,Naive Bayes,1,0.7,0.7792441511697661,0.7450657053026937,0.1608753204345703,0.7450657053026937
136,5,KNeighbors Classifier,2,0.7,0.7977190876350541,0.796867422416779,10.503268957138062,0.796867422416779
137,5,SVC Classifier,2,0.7,0.8421368547418968,0.8324345115057038,10.693847894668579,0.8324345115057038
138,5,Decision Tree,2,0.7,0.7292917166866747,0.728303783771604,0.24274849891662598,0.728303783771604
139,5,RandomForest,2,0.7,0.7797118847539015,0.7727766530052517,0.8012034893035889,0.7727766530052517
140,5,AdaBoost (Discrete),2,0.7,0.8235294117647058,0.821608084660269,150.27809929847717,0.821608084660269
141,5,AdaBoost (Real),2,0.7,0.8337334933973589,0.832808706204438,164.55292201042175,0.832808706204438
142,5,Logistic Regression (Penalty = L2),2,0.7,0.865546218487395,0.8654624981007394,0.7663888931274414,0.8654624981007394
143,5,Naive Bayes,2,0.7,0.7917166866746699,0.7578795473595569,0.1611347198486328,0.7578795473595569
144,6,KNeighbors Classifier,0,0.7,0.8056388722255549,0.8055157890805862,14.836591482162476,0.8055157890805862
145,6,SVC Classifier,0,0.7,0.8482303539292142,0.842289164390584,13.314001560211182,0.842289164390584
146,6,Decision Tree,0,0.7,0.7444511097780444,0.7443410970258917,0.46239185333251953,0.7443410970258917
147,6,RandomForest,0,0.7,0.7876424715056989,0.7827608821244267,0.9998867511749268,0.7827608821244267
148,6,AdaBoost (Discrete),0,0.7,0.8320335932813437,0.832020518104093,194.82317423820496,0.832020518104093
149,6,AdaBoost (Real),0,0.7,0.8350329934013198,0.8347689043180144,232.79859495162964,0.8347689043180144
150,6,Logistic Regression (Penalty = L2),0,0.7,0.8704259148170366,0.8702379138148456,0.8784873485565186,0.8702379138148456
151,6,Naive Bayes,0,0.7,0.7984403119376124,0.7733956904812913,0.18212270736694336,0.7733956904812913
152,6,KNeighbors Classifier,1,0.7,0.7870425914817036,0.7866173249397206,15.709046125411987,0.7866173249397206
153,6,SVC Classifier,1,0.7,0.8458308338332333,0.8406199376544866,14.04451870918274,0.8406199376544866
154,6,Decision Tree,1,0.7,0.7150569886022795,0.7148259778127416,0.5469193458557129,0.7148259778127416
155,6,RandomForest,1,0.7,0.7648470305938813,0.7574892424265629,1.047234296798706,0.7574892424265629
156,6,AdaBoost (Discrete),1,0.7,0.8248350329934013,0.8245813847799349,209.330970287323,0.8245813847799349
157,6,AdaBoost (Real),1,0.7,0.8176364727054589,0.8168779728850422,219.33670020103455,0.8168779728850422
158,6,Logistic Regression (Penalty = L2),1,0.7,0.862627474505099,0.8626240046891362,0.910637617111206,0.8626240046891362
159,6,Naive Bayes,1,0.7,0.7966406718656269,0.7723599896342752,0.34102487564086914,0.7723599896342752
160,6,KNeighbors Classifier,2,0.7,0.8055222088835534,0.8047634347416662,17.32316827774048,0.8047634347416662
161,6,SVC Classifier,2,0.7,0.858343337334934,0.8520193995030733,14.320684671401978,0.8520193995030733
162,6,Decision Tree,2,0.7,0.7256902761104442,0.7252969057198658,0.4645509719848633,0.7252969057198658
163,6,RandomForest,2,0.7,0.7923169267707083,0.7837178941626575,1.1994235515594482,0.7837178941626575
164,6,AdaBoost (Discrete),2,0.7,0.8547418967587035,0.853667947111467,217.62622356414795,0.853667947111467
165,6,AdaBoost (Real),2,0.7,0.8427370948379351,0.8402940597452615,242.232568025589,0.8402940597452615
166,6,Logistic Regression (Penalty = L2),2,0.7,0.8709483793517407,0.8708367583851978,0.9296731948852539,0.8708367583851978
167,6,Naive Bayes,2,0.7,0.8073229291716687,0.7809292922634837,0.19630718231201172,0.7809292922634837
168,7,KNeighbors Classifier,0,0.7,0.7804439112177565,0.7804570008791327,24.593860387802124,0.7804570008791327
169,7,SVC Classifier,0,0.7,0.847630473905219,0.8416402528886457,20.113811254501343,0.8416402528886457
170,7,Decision Tree,0,0.7,0.7174565086982604,0.7174903378262462,0.6889791488647461,0.7174903378262462
171,7,RandomForest,0,0.7,0.7558488302339532,0.7416803548853452,1.1019287109375,0.7416803548853452
172,7,AdaBoost (Discrete),0,0.7,0.8176364727054589,0.8175275243051628,297.0107135772705,0.8175275243051628
173,7,AdaBoost (Real),0,0.7,0.8248350329934013,0.8247278529898606,297.62639331817627,0.8247278529898606
174,7,Logistic Regression (Penalty = L2),0,0.7,0.8680263947210558,0.8678226438197003,1.0542387962341309,0.8678226438197003
175,7,Naive Bayes,0,0.7,0.8008398320335933,0.7757503066734448,0.2597682476043701,0.7757503066734448
176,7,KNeighbors Classifier,1,0.7,0.7816436712657469,0.7811130967369349,21.89585256576538,0.7811130967369349
177,7,SVC Classifier,1,0.7,0.8470305938812237,0.8420256592322198,18.56015419960022,0.8420256592322198
178,7,Decision Tree,1,0.7,0.6784643071385723,0.6776389908264832,0.5937063694000244,0.6776389908264832
179,7,RandomForest,1,0.7,0.7360527894421116,0.73439172545114,1.1593575477600098,0.73439172545114
180,7,AdaBoost (Discrete),1,0.7,0.8242351529694061,0.8238568851535584,281.42037057876587,0.8238568851535584
181,7,AdaBoost (Real),1,0.7,0.8206358728254349,0.8201513517537115,309.8233280181885,0.8201513517537115
182,7,Logistic Regression (Penalty = L2),1,0.7,0.859628074385123,0.8596331089001539,1.4866907596588135,0.8596331089001539
183,7,Naive Bayes,1,0.7,0.7960407918416317,0.7722216985465098,0.18996715545654297,0.7722216985465098
184,7,KNeighbors Classifier,2,0.7,0.790516206482593,0.7903132197691718,23.95213747024536,0.7903132197691718
185,7,SVC Classifier,2,0.7,0.8607442977190877,0.8550294067812961,18.842179536819458,0.8550294067812961
186,7,Decision Tree,2,0.7,0.709483793517407,0.7094977090051042,0.6129028797149658,0.7094977090051042
187,7,RandomForest,2,0.7,0.7725090036014406,0.752410639773807,1.1462674140930176,0.752410639773807
188,7,AdaBoost (Discrete),2,0.7,0.8565426170468188,0.855423137620962,272.0098638534546,0.855423137620962
189,7,AdaBoost (Real),2,0.7,0.8547418967587035,0.8537845269728237,289.037202835083,0.8537845269728237
190,7,Logistic Regression (Penalty = L2),2,0.7,0.8733493397358943,0.8733039226580316,1.0828642845153809,0.8733039226580316
191,7,Naive Bayes,2,0.7,0.8055222088835534,0.7779008581081963,0.2246861457824707,0.7779008581081963
192,8,KNeighbors Classifier,0,0.7,0.7948410317936413,0.7942208952857788,7.776474237442017,0.7942208952857788
193,8,SVC Classifier,0,0.7,0.8356328734253149,0.8249712191844579,9.730892896652222,0.8249712191844579
194,8,Decision Tree,0,0.7,0.7414517096580684,0.7411931226541962,0.3002946376800537,0.7411931226541962
195,8,RandomForest,0,0.7,0.7846430713857229,0.7795034811363429,1.0494768619537354,0.7795034811363429
196,8,AdaBoost (Discrete),0,0.7,0.8176364727054589,0.8172258695228348,132.86782264709473,0.8172258695228348
197,8,AdaBoost (Real),0,0.7,0.8050389922015597,0.8041229847689196,148.41951417922974,0.8041229847689196
198,8,Logistic Regression (Penalty = L2),0,0.7,0.8632273545290942,0.8629143757660573,0.6710736751556396,0.8629143757660573
199,8,Naive Bayes,0,0.7,0.7888422315536893,0.7578399660474749,0.19243097305297852,0.7578399660474749
200,8,KNeighbors Classifier,1,0.7,0.7822435512897421,0.7819575674691756,7.585892200469971,0.7819575674691756
201,8,SVC Classifier,1,0.7,0.8440311937612478,0.8352861139885125,9.131982564926147,0.8352861139885125
202,8,Decision Tree,1,0.7,0.7204559088182364,0.7203273590185707,0.3704702854156494,0.7203273590185707
203,8,RandomForest,1,0.7,0.7528494301139772,0.7463734467708243,0.9435384273529053,0.7463734467708243
204,8,AdaBoost (Discrete),1,0.7,0.8158368326334733,0.815241822626379,134.34036660194397,0.815241822626379
205,8,AdaBoost (Real),1,0.7,0.8020395920815837,0.7999029372020982,143.52737188339233,0.7999029372020982
206,8,Logistic Regression (Penalty = L2),1,0.7,0.8524295140971806,0.8523852753040261,0.556464672088623,0.8523852753040261
207,8,Naive Bayes,1,0.7,0.7792441511697661,0.7459750535280124,0.12888145446777344,0.7459750535280124
208,8,KNeighbors Classifier,2,0.7,0.8025210084033614,0.801954739470831,7.40285849571228,0.801954739470831
209,8,SVC Classifier,2,0.7,0.8445378151260504,0.8349642325323743,8.503379583358765,0.8349642325323743
210,8,Decision Tree,2,0.7,0.7382953181272509,0.7379285623914411,0.30443620681762695,0.7379285623914411
211,8,RandomForest,2,0.7,0.7707082833133253,0.7554668026782576,0.8888373374938965,0.7554668026782576
212,8,AdaBoost (Discrete),2,0.7,0.82953181272509,0.8275111163114173,135.41791152954102,0.8275111163114173
213,8,AdaBoost (Real),2,0.7,0.84093637454982,0.8406274780850047,149.0609631538391,0.8406274780850047
214,8,Logistic Regression (Penalty = L2),2,0.7,0.8595438175270108,0.8594823525152984,0.6262791156768799,0.8594823525152984
215,8,Naive Bayes,2,0.7,0.7899159663865546,0.7555324903993502,0.15979743003845215,0.7555324903993502
