,feat_set_id,classifier,fold_id,feat_th,score,geo_score,exec_t,geo_score_woz
0,0,KNeighbors Classifier,0,0.8,0.6481802426343154,0.4902670648096713,0.7222552299499512,0.0
1,0,SVC Classifier,0,0.8,0.6845753899480069,0.8129520829107402,0.7847456932067871,0.0
2,0,Decision Tree,0,0.8,0.7400346620450606,0.7666541510331166,0.0705723762512207,0.0
3,0,RandomForest,0,0.8,0.7001733102253033,1.0,0.505413293838501,0.0
4,0,AdaBoost (Discrete),0,0.8,0.733102253032929,0.688101238767842,31.90946912765503,0.0
5,0,AdaBoost (Real),0,0.8,0.729636048526863,0.621434847685018,40.22141098976135,0.0
6,0,Logistic Regression (Penalty = L2),0,0.8,0.6897746967071057,0.36350868153368643,0.541095495223999,0.0
7,0,Naive Bayes,0,0.8,0.6672443674176777,0.7914018355435688,0.1737220287322998,0.0
8,0,KNeighbors Classifier,1,0.8,0.6145833333333334,0.47076554387900943,0.6557409763336182,0.0
9,0,SVC Classifier,1,0.8,0.7274305555555556,0.7636780043269571,0.7598426342010498,0.0
10,0,Decision Tree,1,0.8,0.8055555555555556,0.5781619241852185,0.07032203674316406,0.0
11,0,RandomForest,1,0.8,0.7065972222222222,0.1767766952966369,0.4654567241668701,0.0
12,0,AdaBoost (Discrete),1,0.8,0.7708333333333334,0.5020406861119822,37.07387447357178,0.0
13,0,AdaBoost (Real),1,0.8,0.7795138888888888,0.642962530926536,45.95999264717102,0.0
14,0,Logistic Regression (Penalty = L2),1,0.8,0.7517361111111112,0.6690300108831205,0.29941558837890625,0.0
15,0,Naive Bayes,1,0.8,0.7829861111111112,0.6820345298093242,0.1619257926940918,0.0
16,0,KNeighbors Classifier,2,0.8,0.7982608695652174,0.40007118488356924,0.7693512439727783,0.40007118488356924
17,0,SVC Classifier,2,0.8,0.7321739130434782,0.5996729360851237,0.8980331420898438,0.0
18,0,Decision Tree,2,0.8,0.7443478260869565,0.5719623376493559,0.0019469261169433594,0.0
19,0,RandomForest,2,0.8,0.7008695652173913,1.0,0.6586623191833496,0.0
20,0,AdaBoost (Discrete),2,0.8,0.3652173913043478,0.5073092952412455,39.65304613113403,0.5073092952412455
21,0,AdaBoost (Real),2,0.8,0.46608695652173915,0.4793535394383853,52.763115882873535,0.4793535394383853
22,0,Logistic Regression (Penalty = L2),2,0.8,0.5878260869565217,0.4939689121928252,0.3690156936645508,0.4939689121928252
23,0,Naive Bayes,2,0.8,0.5478260869565217,0.8392974277582299,0.0965878963470459,0.0
24,1,KNeighbors Classifier,0,0.8,0.6412478336221837,0.488107269999566,0.8628191947937012,0.0
25,1,SVC Classifier,0,0.8,0.6845753899480069,0.8129520829107402,0.9704301357269287,0.0
26,1,Decision Tree,0,0.8,0.830155979202773,0.6805843742031554,0.0021224021911621094,0.0
27,1,RandomForest,0,0.8,0.7001733102253033,1.0,0.6837606430053711,0.0
28,1,AdaBoost (Discrete),0,0.8,0.7279029462738301,0.6280157282391217,45.317551612854004,0.0
29,1,AdaBoost (Real),0,0.8,0.7209705372616985,0.587723421417095,52.72412300109863,0.0
30,1,Logistic Regression (Penalty = L2),0,0.8,0.6707105719237435,0.7161557248791828,0.4005727767944336,0.0
31,1,Naive Bayes,0,0.8,0.6672443674176777,0.7914018355435688,0.19367218017578125,0.0
32,1,KNeighbors Classifier,1,0.8,0.609375,0.44418555449968833,0.9453203678131104,0.0
33,1,SVC Classifier,1,0.8,0.7274305555555556,0.7636780043269571,1.1000149250030518,0.0
34,1,Decision Tree,1,0.8,0.7725694444444444,0.2941321709967729,0.001994609832763672,0.2941321709967729
35,1,RandomForest,1,0.8,0.7065972222222222,0.1767766952966369,0.692779541015625,0.0
36,1,AdaBoost (Discrete),1,0.8,0.7795138888888888,0.478822839758879,44.32533121109009,0.0
37,1,AdaBoost (Real),1,0.8,0.7847222222222222,0.6061641068973983,62.99382925033569,0.0
38,1,Logistic Regression (Penalty = L2),1,0.8,0.7586805555555556,0.5355979162087265,0.48994016647338867,0.0
39,1,Naive Bayes,1,0.8,0.7829861111111112,0.6820345298093242,0.23770642280578613,0.0
40,1,KNeighbors Classifier,2,0.8,0.7965217391304348,0.46903481915164585,1.307941198348999,0.46903481915164585
41,1,SVC Classifier,2,0.8,0.76,0.6431303330664584,1.438798427581787,0.0
42,1,Decision Tree,2,0.8,0.5130434782608696,0.41140352943428593,0.11182069778442383,0.0
43,1,RandomForest,2,0.8,0.7008695652173913,1.0,1.0691940784454346,0.0
44,1,AdaBoost (Discrete),2,0.8,0.3269565217391304,0.46560751180639165,56.4299430847168,0.46560751180639165
45,1,AdaBoost (Real),2,0.8,0.24347826086956523,0.3638135403885287,62.54140853881836,0.0
46,1,Logistic Regression (Penalty = L2),2,0.8,0.577391304347826,0.4912817649531679,0.7258875370025635,0.4912817649531679
47,1,Naive Bayes,2,0.8,0.5478260869565217,0.8392974277582299,0.11383461952209473,0.0
48,2,KNeighbors Classifier,0,0.8,0.6568457538994801,0.635797814864237,1.692936897277832,0.0
49,2,SVC Classifier,0,0.8,0.6845753899480069,0.8129520829107402,1.5805001258850098,0.0
50,2,Decision Tree,0,0.8,0.6325823223570191,0.4524081805497754,0.11964201927185059,0.4524081805497754
51,2,RandomForest,0,0.8,0.7001733102253033,1.0,0.943202018737793,0.0
52,2,AdaBoost (Discrete),0,0.8,0.7521663778162911,0.6944144468157013,55.39665150642395,0.0
53,2,AdaBoost (Real),0,0.8,0.7383015597920277,0.6306125149226676,66.60022616386414,0.0
54,2,Logistic Regression (Penalty = L2),0,0.8,0.6863084922010398,0.7210131717325844,0.578688383102417,0.0
55,2,Naive Bayes,0,0.8,0.6672443674176777,0.7914018355435688,0.12027645111083984,0.0
56,2,KNeighbors Classifier,1,0.8,0.6961805555555556,0.3630128918050201,1.6394367218017578,0.0
57,2,SVC Classifier,1,0.8,0.7274305555555556,0.7636780043269571,1.5626730918884277,0.0
58,2,Decision Tree,1,0.8,0.4965277777777778,0.566234312864157,0.11506009101867676,0.0
59,2,RandomForest,1,0.8,0.6996527777777778,1.0,0.9389255046844482,0.0
60,2,AdaBoost (Discrete),1,0.8,0.7517361111111112,0.43129654708987847,55.39267086982727,0.0
61,2,AdaBoost (Real),1,0.8,0.7569444444444444,0.5746095133749713,62.44107627868652,0.0
62,2,Logistic Regression (Penalty = L2),1,0.8,0.7482638888888888,0.6268843050507011,0.41175055503845215,0.0
63,2,Naive Bayes,1,0.8,0.7829861111111112,0.6820345298093242,0.11245131492614746,0.0
64,2,KNeighbors Classifier,2,0.8,0.8330434782608696,0.7552608308349611,1.7385368347167969,0.7552608308349611
65,2,SVC Classifier,2,0.8,0.7356521739130435,0.6012871326420459,1.4145548343658447,0.0
66,2,Decision Tree,2,0.8,0.5930434782608696,0.48551328267446486,0.002053976058959961,0.48551328267446486
67,2,RandomForest,2,0.8,0.7008695652173913,1.0,0.9479663372039795,0.0
68,2,AdaBoost (Discrete),2,0.8,0.36,0.49713216183188524,54.45363664627075,0.49713216183188524
69,2,AdaBoost (Real),2,0.8,0.5095652173913043,0.5866533413844934,71.4765145778656,0.5866533413844934
70,2,Logistic Regression (Penalty = L2),2,0.8,0.6052173913043478,0.52602626583304,0.5506203174591064,0.52602626583304
71,2,Naive Bayes,2,0.8,0.5478260869565217,0.8392974277582299,0.22991275787353516,0.0
72,3,KNeighbors Classifier,0,0.8,0.6412478336221837,0.5317673138783903,1.1375441551208496,0.0
73,3,SVC Classifier,0,0.8,0.6845753899480069,0.8129520829107402,1.455458641052246,0.0
74,3,Decision Tree,0,0.8,0.6481802426343154,0.654376206944733,0.11470961570739746,0.0
75,3,RandomForest,0,0.8,0.7001733102253033,1.0,0.9087507724761963,0.0
76,3,AdaBoost (Discrete),0,0.8,0.7435008665511266,0.6235309029471434,57.18413853645325,0.0
77,3,AdaBoost (Real),0,0.8,0.7209705372616985,0.587723421417095,76.96166348457336,0.0
78,3,Logistic Regression (Penalty = L2),0,0.8,0.6741767764298093,0.7213751564454057,0.49492955207824707,0.0
79,3,Naive Bayes,0,0.8,0.6672443674176777,0.7914018355435688,0.0035347938537597656,0.0
80,3,KNeighbors Classifier,1,0.8,0.5798611111111112,0.4289100916671341,1.2280769348144531,0.0
81,3,SVC Classifier,1,0.8,0.7274305555555556,0.7636780043269571,1.4944424629211426,0.0
82,3,Decision Tree,1,0.8,0.7864583333333334,0.6367554760767903,0.13841629028320312,0.0
83,3,RandomForest,1,0.8,0.6996527777777778,0.2148885971408009,0.958442211151123,0.0
84,3,AdaBoost (Discrete),1,0.8,0.7864583333333334,0.3832603266531163,59.232141733169556,0.0
85,3,AdaBoost (Real),1,0.8,0.7465277777777778,0.5900726018390628,70.1396210193634,0.0
86,3,Logistic Regression (Penalty = L2),1,0.8,0.7604166666666666,0.5555347616516378,0.4360616207122803,0.0
87,3,Naive Bayes,1,0.8,0.7829861111111112,0.6820345298093242,0.26552891731262207,0.0
88,3,KNeighbors Classifier,2,0.8,0.7930434782608695,0.49624985883569067,1.241119384765625,0.0
89,3,SVC Classifier,2,0.8,0.76,0.6431303330664584,1.5624041557312012,0.0
90,3,Decision Tree,2,0.8,0.7878260869565218,0.5796643446996921,0.0019369125366210938,0.5796643446996921
91,3,RandomForest,2,0.8,0.7060869565217391,0.15309310892394862,0.9463198184967041,0.0
92,3,AdaBoost (Discrete),2,0.8,0.3582608695652174,0.4782634801856082,57.99198842048645,0.4782634801856082
93,3,AdaBoost (Real),2,0.8,0.24521739130434783,0.3651269580627894,69.84875679016113,0.0
94,3,Logistic Regression (Penalty = L2),2,0.8,0.5878260869565217,0.4939689121928252,0.4750216007232666,0.4939689121928252
95,3,Naive Bayes,2,0.8,0.5478260869565217,0.8392974277582299,0.14867520332336426,0.0
96,4,KNeighbors Classifier,0,0.8,0.6481802426343154,0.4902670648096713,1.4208509922027588,0.0
97,4,SVC Classifier,0,0.8,0.6845753899480069,0.8129520829107402,1.436344861984253,0.0
98,4,Decision Tree,0,0.8,0.7590987868284229,0.6354687344238958,0.1429426670074463,0.0
99,4,RandomForest,0,0.8,0.7001733102253033,1.0,0.8627240657806396,0.0
100,4,AdaBoost (Discrete),0,0.8,0.7348353552859619,0.6904103206332113,59.78128385543823,0.0
101,4,AdaBoost (Real),0,0.8,0.729636048526863,0.621434847685018,72.13423323631287,0.0
102,4,Logistic Regression (Penalty = L2),0,0.8,0.6897746967071057,0.36350868153368643,0.4741172790527344,0.0
103,4,Naive Bayes,0,0.8,0.6672443674176777,0.7914018355435688,0.13600754737854004,0.0
104,4,KNeighbors Classifier,1,0.8,0.6145833333333334,0.47076554387900943,1.4892184734344482,0.0
105,4,SVC Classifier,1,0.8,0.7274305555555556,0.7636780043269571,1.661191701889038,0.0
106,4,Decision Tree,1,0.8,0.6961805555555556,0.5079378309344008,0.0028581619262695312,0.0
107,4,RandomForest,1,0.8,0.7065972222222222,0.1767766952966369,0.953270673751831,0.0
108,4,AdaBoost (Discrete),1,0.8,0.7708333333333334,0.5020406861119822,58.82173037528992,0.0
109,4,AdaBoost (Real),1,0.8,0.7673611111111112,0.6306023131477454,69.38518619537354,0.0
110,4,Logistic Regression (Penalty = L2),1,0.8,0.7517361111111112,0.6690300108831205,0.44684529304504395,0.0
111,4,Naive Bayes,1,0.8,0.7829861111111112,0.6820345298093242,0.13231205940246582,0.0
112,4,KNeighbors Classifier,2,0.8,0.7982608695652174,0.40007118488356924,1.310459852218628,0.40007118488356924
113,4,SVC Classifier,2,0.8,0.7321739130434782,0.5996729360851237,1.3286972045898438,0.0
114,4,Decision Tree,2,0.8,0.7913043478260869,0.6228638830134386,0.0021386146545410156,0.6228638830134386
115,4,RandomForest,2,0.8,0.7008695652173913,1.0,0.9076473712921143,0.0
116,4,AdaBoost (Discrete),2,0.8,0.38782608695652177,0.5080436411370455,68.69349241256714,0.5080436411370455
117,4,AdaBoost (Real),2,0.8,0.34608695652173915,0.4898194027948563,71.28293895721436,0.4898194027948563
118,4,Logistic Regression (Penalty = L2),2,0.8,0.5878260869565217,0.4939689121928252,0.4993622303009033,0.4939689121928252
119,4,Naive Bayes,2,0.8,0.5478260869565217,0.8392974277582299,0.12490439414978027,0.0
120,5,KNeighbors Classifier,0,0.8,0.6412478336221837,0.488107269999566,1.0730993747711182,0.0
121,5,SVC Classifier,0,0.8,0.6845753899480069,0.8129520829107402,1.3643639087677002,0.0
122,5,Decision Tree,0,0.8,0.8388214904679376,0.8537195147930279,0.12654566764831543,0.0
123,5,RandomForest,0,0.8,0.7001733102253033,1.0,0.6669557094573975,0.0
124,5,AdaBoost (Discrete),0,0.8,0.7279029462738301,0.6280157282391217,59.31601619720459,0.0
125,5,AdaBoost (Real),0,0.8,0.707105719237435,0.582920563852312,59.13994002342224,0.0
126,5,Logistic Regression (Penalty = L2),0,0.8,0.6707105719237435,0.7161557248791828,0.5078585147857666,0.0
127,5,Naive Bayes,0,0.8,0.6672443674176777,0.7914018355435688,0.12185025215148926,0.0
128,5,KNeighbors Classifier,1,0.8,0.609375,0.44418555449968833,1.2423577308654785,0.0
129,5,SVC Classifier,1,0.8,0.7274305555555556,0.7636780043269571,1.2401454448699951,0.0
130,5,Decision Tree,1,0.8,0.7291666666666666,0.47631926638283584,0.12255716323852539,0.0
131,5,RandomForest,1,0.8,0.7065972222222222,0.1767766952966369,0.7168989181518555,0.0
132,5,AdaBoost (Discrete),1,0.8,0.7795138888888888,0.478822839758879,57.188143253326416,0.0
133,5,AdaBoost (Real),1,0.8,0.7690972222222222,0.5976087243015554,65.88447546958923,0.0
134,5,Logistic Regression (Penalty = L2),1,0.8,0.7586805555555556,0.5355979162087265,0.31067705154418945,0.0
135,5,Naive Bayes,1,0.8,0.7829861111111112,0.6820345298093242,0.16162323951721191,0.0
136,5,KNeighbors Classifier,2,0.8,0.7965217391304348,0.46903481915164585,1.390319585800171,0.46903481915164585
137,5,SVC Classifier,2,0.8,0.76,0.6431303330664584,1.118032455444336,0.0
138,5,Decision Tree,2,0.8,0.7739130434782608,0.6354606847204594,0.03976011276245117,0.6354606847204594
139,5,RandomForest,2,0.8,0.7008695652173913,1.0,0.38677167892456055,0.0
140,5,AdaBoost (Discrete),2,0.8,0.36,0.48263163655669833,54.07447934150696,0.48263163655669833
141,5,AdaBoost (Real),2,0.8,0.38956521739130434,0.35188095049659673,70.53485226631165,0.35188095049659673
142,5,Logistic Regression (Penalty = L2),2,0.8,0.577391304347826,0.4912817649531679,0.4121675491333008,0.4912817649531679
143,5,Naive Bayes,2,0.8,0.5478260869565217,0.8392974277582299,0.12793350219726562,0.0
144,6,KNeighbors Classifier,0,0.8,0.6447140381282496,0.4224977729790333,1.4117696285247803,0.0
145,6,SVC Classifier,0,0.8,0.6845753899480069,0.8129520829107402,1.5332601070404053,0.0
146,6,Decision Tree,0,0.8,0.8318890814558059,0.6542229008228333,0.0022344589233398438,0.0
147,6,RandomForest,0,0.8,0.7261698440207972,0.5648671314898963,1.0098869800567627,0.0
148,6,AdaBoost (Discrete),0,0.8,0.7175043327556326,0.6075665456619013,58.304696559906006,0.0
149,6,AdaBoost (Real),0,0.8,0.729636048526863,0.621434847685018,68.06026363372803,0.0
150,6,Logistic Regression (Penalty = L2),0,0.8,0.6880415944540728,0.2869599175073888,0.5262486934661865,0.0
151,6,Naive Bayes,0,0.8,0.6672443674176777,0.7914018355435688,0.14078640937805176,0.0
152,6,KNeighbors Classifier,1,0.8,0.6857638888888888,0.5284134209839263,1.3740026950836182,0.0
153,6,SVC Classifier,1,0.8,0.7274305555555556,0.7636780043269571,1.2881805896759033,0.0
154,6,Decision Tree,1,0.8,0.609375,0.4085289703216219,0.0021142959594726562,0.0
155,6,RandomForest,1,0.8,0.7152777777777778,0.3504693768635238,0.8691956996917725,0.0
156,6,AdaBoost (Discrete),1,0.8,0.7795138888888888,0.5470927187396201,55.58662486076355,0.0
157,6,AdaBoost (Real),1,0.8,0.8038194444444444,0.6532149565741712,69.3646411895752,0.0
158,6,Logistic Regression (Penalty = L2),1,0.8,0.7465277777777778,0.6237020964135888,0.6663813591003418,0.0
159,6,Naive Bayes,1,0.8,0.7829861111111112,0.6820345298093242,0.2658202648162842,0.0
160,6,KNeighbors Classifier,2,0.8,0.7982608695652174,0.5361136739493405,1.670450210571289,0.5361136739493405
161,6,SVC Classifier,2,0.8,0.7321739130434782,0.5996729360851237,1.4522218704223633,0.0
162,6,Decision Tree,2,0.8,0.8139130434782609,0.6985254033973093,0.0031096935272216797,0.6985254033973093
163,6,RandomForest,2,0.8,0.7182608695652174,0.2795084971874737,1.0435051918029785,0.0
164,6,AdaBoost (Discrete),2,0.8,0.4,0.4905874051126575,61.24483132362366,0.4905874051126575
165,6,AdaBoost (Real),2,0.8,0.4973913043478261,0.536060659282854,73.88464736938477,0.536060659282854
166,6,Logistic Regression (Penalty = L2),2,0.8,0.5460869565217391,0.5096429924082122,0.6730866432189941,0.5096429924082122
167,6,Naive Bayes,2,0.8,0.5478260869565217,0.8392974277582299,0.2508096694946289,0.0
168,7,KNeighbors Classifier,0,0.8,0.6568457538994801,0.635797814864237,1.855334997177124,0.0
169,7,SVC Classifier,0,0.8,0.6845753899480069,0.8129520829107402,1.6894574165344238,0.0
170,7,Decision Tree,0,0.8,0.6880415944540728,0.42779935882138503,0.1316821575164795,0.42779935882138503
171,7,RandomForest,0,0.8,0.7001733102253033,1.0,1.0040321350097656,0.0
172,7,AdaBoost (Discrete),0,0.8,0.7521663778162911,0.6944144468157013,62.82859778404236,0.0
173,7,AdaBoost (Real),0,0.8,0.733102253032929,0.6227431354364964,76.01980376243591,0.0
174,7,Logistic Regression (Penalty = L2),0,0.8,0.6863084922010398,0.7210131717325844,0.483691930770874,0.0
175,7,Naive Bayes,0,0.8,0.6672443674176777,0.7914018355435688,0.15673327445983887,0.0
176,7,KNeighbors Classifier,1,0.8,0.6961805555555556,0.3630128918050201,2.1228692531585693,0.0
177,7,SVC Classifier,1,0.8,0.7274305555555556,0.7636780043269571,1.9583804607391357,0.0
178,7,Decision Tree,1,0.8,0.8107638888888888,0.5283713398002663,0.17432785034179688,0.0
179,7,RandomForest,1,0.8,0.6996527777777778,1.0,1.182075023651123,0.0
180,7,AdaBoost (Discrete),1,0.8,0.7482638888888888,0.43045169370794734,69.00300812721252,0.0
181,7,AdaBoost (Real),1,0.8,0.7708333333333334,0.5895609442641179,93.37053203582764,0.0
182,7,Logistic Regression (Penalty = L2),1,0.8,0.7482638888888888,0.6268843050507011,0.6819615364074707,0.0
183,7,Naive Bayes,1,0.8,0.7829861111111112,0.6820345298093242,0.2634851932525635,0.0
184,7,KNeighbors Classifier,2,0.8,0.8330434782608696,0.7552608308349611,2.6187288761138916,0.7552608308349611
185,7,SVC Classifier,2,0.8,0.7356521739130435,0.6012871326420459,2.2615764141082764,0.0
186,7,Decision Tree,2,0.8,0.5165217391304348,0.49007057220672723,0.12324643135070801,0.0
187,7,RandomForest,2,0.8,0.7008695652173913,1.0,1.3106253147125244,0.0
188,7,AdaBoost (Discrete),2,0.8,0.3652173913043478,0.49979308913426346,73.28482699394226,0.49979308913426346
189,7,AdaBoost (Real),2,0.8,0.5704347826086956,0.5929134378210238,81.66645455360413,0.5929134378210238
190,7,Logistic Regression (Penalty = L2),2,0.8,0.6052173913043478,0.52602626583304,0.5197412967681885,0.52602626583304
191,7,Naive Bayes,2,0.8,0.5478260869565217,0.8392974277582299,0.2652318477630615,0.0
192,8,KNeighbors Classifier,0,0.8,0.6412478336221837,0.5317673138783903,1.3084745407104492,0.0
193,8,SVC Classifier,0,0.8,0.6845753899480069,0.8129520829107402,1.3183372020721436,0.0
194,8,Decision Tree,0,0.8,0.7105719237435009,0.6017533285035538,0.0028505325317382812,0.0
195,8,RandomForest,0,0.8,0.7001733102253033,1.0,0.9664082527160645,0.0
196,8,AdaBoost (Discrete),0,0.8,0.7504332755632582,0.626070771729737,60.79201102256775,0.0
197,8,AdaBoost (Real),0,0.8,0.7209705372616985,0.587723421417095,73.76843476295471,0.0
198,8,Logistic Regression (Penalty = L2),0,0.8,0.6741767764298093,0.7213751564454057,0.5717248916625977,0.0
199,8,Naive Bayes,0,0.8,0.6672443674176777,0.7914018355435688,0.14181900024414062,0.0
200,8,KNeighbors Classifier,1,0.8,0.5798611111111112,0.4289100916671341,1.390458583831787,0.0
201,8,SVC Classifier,1,0.8,0.7274305555555556,0.7636780043269571,1.430988073348999,0.0
202,8,Decision Tree,1,0.8,0.7430555555555556,0.5263943958820321,0.1626603603363037,0.0
203,8,RandomForest,1,0.8,0.6996527777777778,0.2148885971408009,1.1434071063995361,0.0
204,8,AdaBoost (Discrete),1,0.8,0.7864583333333334,0.3832603266531163,63.77238869667053,0.0
205,8,AdaBoost (Real),1,0.8,0.7465277777777778,0.5900726018390628,73.67384505271912,0.0
206,8,Logistic Regression (Penalty = L2),1,0.8,0.7604166666666666,0.5555347616516378,0.41127514839172363,0.0
207,8,Naive Bayes,1,0.8,0.7829861111111112,0.6820345298093242,0.12775397300720215,0.0
208,8,KNeighbors Classifier,2,0.8,0.7930434782608695,0.49624985883569067,1.2696125507354736,0.0
209,8,SVC Classifier,2,0.8,0.76,0.6431303330664584,1.5403122901916504,0.0
210,8,Decision Tree,2,0.8,0.76,0.5343613467184225,0.1272578239440918,0.5343613467184225
211,8,RandomForest,2,0.8,0.7060869565217391,0.15309310892394862,1.0073738098144531,0.0
212,8,AdaBoost (Discrete),2,0.8,0.3582608695652174,0.4782634801856082,61.75412344932556,0.4782634801856082
213,8,AdaBoost (Real),2,0.8,0.3373913043478261,0.46782235598037986,72.08675694465637,0.46782235598037986
214,8,Logistic Regression (Penalty = L2),2,0.8,0.5878260869565217,0.4939689121928252,0.5228304862976074,0.4939689121928252
215,8,Naive Bayes,2,0.8,0.5478260869565217,0.8392974277582299,0.25751471519470215,0.0
