,feat_set_id,classifier,fold_id,feat_th,score,geo_score,exec_t,geo_score_woz
0,0,KNeighbors Classifier,0,1.0,0.21048901488306165,0.32473667583796356,1.1920826435089111,0.0
1,0,SVC Classifier,0,1.0,0.19631467044649184,0.43374535059637953,13.507583141326904,0.0
2,0,Decision Tree,0,1.0,0.19773210489014884,0.26595733477389927,0.2792026996612549,0.0
3,0,RandomForest,0,1.0,0.23387668320340185,0.3112441209271001,0.9765205383300781,0.0
4,0,AdaBoost (Discrete),0,1.0,0.184975194897236,0.22496124135411114,96.38222241401672,0.0
5,0,AdaBoost (Real),0,1.0,0.20978029766123316,0.2256869911640142,320.7708296775818,0.0
6,0,Logistic Regression (Penalty = L2),0,1.0,0.25584691708008506,0.26152248242221937,6.298577785491943,0.0
7,0,Naive Bayes,0,1.0,0.0885896527285613,0.3109733177195326,0.35437488555908203,0.0
8,0,KNeighbors Classifier,1,1.0,0.2147458840372226,0.29397343503821965,1.218130350112915,0.0
9,0,SVC Classifier,1,1.0,0.21045096635647817,0.46640548688179284,14.418997049331665,0.0
10,0,Decision Tree,1,1.0,0.2125984251968504,0.3252151700853126,0.2918663024902344,0.0
11,0,RandomForest,1,1.0,0.2648532569792412,0.3733293624689494,0.9430341720581055,0.0
12,0,AdaBoost (Discrete),1,1.0,0.20901932712956334,0.2560397065850056,90.54011464118958,0.0
13,0,AdaBoost (Real),1,1.0,0.25196850393700787,0.3673063952035098,177.31752943992615,0.0
14,0,Logistic Regression (Penalty = L2),1,1.0,0.25697924123120974,0.1978530366217609,4.508311033248901,0.0
15,0,Naive Bayes,1,1.0,0.11882605583392986,0.3808541542719384,0.31067419052124023,0.0
16,0,KNeighbors Classifier,2,1.0,0.21654676258992805,0.3143517536764661,0.9141130447387695,0.0
17,0,SVC Classifier,2,1.0,0.2143884892086331,0.45368823166620964,11.33269214630127,0.0
18,0,Decision Tree,2,1.0,0.21510791366906476,0.2835858686063843,0.22957420349121094,0.0
19,0,RandomForest,2,1.0,0.25971223021582734,0.3818117530171415,0.820427656173706,0.0
20,0,AdaBoost (Discrete),2,1.0,0.20359712230215826,0.277552019321644,70.4267213344574,0.0
21,0,AdaBoost (Real),2,1.0,0.25323741007194245,0.31684278993912,138.42104196548462,0.0
22,0,Logistic Regression (Penalty = L2),2,1.0,0.26618705035971224,0.19854019800882877,4.052605628967285,0.0
23,0,Naive Bayes,2,1.0,0.11654676258992806,0.5264717575272626,0.35132527351379395,0.0
24,1,KNeighbors Classifier,0,1.0,0.21048901488306165,0.32473667583796356,1.0104584693908691,0.0
25,1,SVC Classifier,0,1.0,0.19631467044649184,0.43374535059637953,10.680870056152344,0.0
26,1,Decision Tree,0,1.0,0.19560595322466337,0.27151448723243515,0.13448667526245117,0.0
27,1,RandomForest,0,1.0,0.23387668320340185,0.3112441209271001,0.6987640857696533,0.0
28,1,AdaBoost (Discrete),0,1.0,0.184975194897236,0.22496124135411114,59.196813106536865,0.0
29,1,AdaBoost (Real),0,1.0,0.2090715804394047,0.22318955400942014,117.57728552818298,0.0
30,1,Logistic Regression (Penalty = L2),0,1.0,0.25584691708008506,0.26152248242221937,3.638278007507324,0.0
31,1,Naive Bayes,0,1.0,0.0885896527285613,0.3109733177195326,0.3064289093017578,0.0
32,1,KNeighbors Classifier,1,1.0,0.2147458840372226,0.29397343503821965,0.7249577045440674,0.0
33,1,SVC Classifier,1,1.0,0.21045096635647817,0.46640548688179284,8.07268762588501,0.0
34,1,Decision Tree,1,1.0,0.20615604867573373,0.32421036501480255,0.16216015815734863,0.0
35,1,RandomForest,1,1.0,0.2648532569792412,0.3733293624689494,0.5402417182922363,0.0
36,1,AdaBoost (Discrete),1,1.0,0.20901932712956334,0.2560397065850056,49.96189475059509,0.0
37,1,AdaBoost (Real),1,1.0,0.25196850393700787,0.3673063952035098,94.41524314880371,0.0
38,1,Logistic Regression (Penalty = L2),1,1.0,0.25697924123120974,0.1978530366217609,2.9865851402282715,0.0
39,1,Naive Bayes,1,1.0,0.11882605583392986,0.3808541542719384,0.23352670669555664,0.0
40,1,KNeighbors Classifier,2,1.0,0.21654676258992805,0.3143517536764661,0.5610916614532471,0.0
41,1,SVC Classifier,2,1.0,0.2143884892086331,0.45368823166620964,6.186095476150513,0.0
42,1,Decision Tree,2,1.0,0.19352517985611511,0.29642546202135656,0.12543797492980957,0.0
43,1,RandomForest,2,1.0,0.25971223021582734,0.3818117530171415,0.44002246856689453,0.0
44,1,AdaBoost (Discrete),2,1.0,0.20431654676258992,0.27897626009255155,44.35322833061218,0.0
45,1,AdaBoost (Real),2,1.0,0.25323741007194245,0.31684278993912,85.19292283058167,0.0
46,1,Logistic Regression (Penalty = L2),2,1.0,0.26618705035971224,0.19854019800882877,2.804208755493164,0.0
47,1,Naive Bayes,2,1.0,0.11654676258992806,0.5264717575272626,0.21964192390441895,0.0
48,2,KNeighbors Classifier,0,1.0,0.21048901488306165,0.32473667583796356,0.6549668312072754,0.0
49,2,SVC Classifier,0,1.0,0.19631467044649184,0.43374535059637953,6.152076482772827,0.0
50,2,Decision Tree,0,1.0,0.18426647767540752,0.23923874790366312,0.10754656791687012,0.0
51,2,RandomForest,0,1.0,0.23387668320340185,0.3112441209271001,0.4320666790008545,0.0
52,2,AdaBoost (Discrete),0,1.0,0.184975194897236,0.22496124135411114,39.977020025253296,0.0
53,2,AdaBoost (Real),0,1.0,0.2090715804394047,0.23344296906414883,75.15904712677002,0.0
54,2,Logistic Regression (Penalty = L2),0,1.0,0.25584691708008506,0.26152248242221937,2.2838730812072754,0.0
55,2,Naive Bayes,0,1.0,0.0885896527285613,0.3109733177195326,0.1669323444366455,0.0
56,2,KNeighbors Classifier,1,1.0,0.2147458840372226,0.29397343503821965,0.533355712890625,0.0
57,2,SVC Classifier,1,1.0,0.21045096635647817,0.46640548688179284,5.408399343490601,0.0
58,2,Decision Tree,1,1.0,0.21045096635647817,0.32714449484631297,0.1336803436279297,0.0
59,2,RandomForest,1,1.0,0.2648532569792412,0.3733293624689494,0.3287827968597412,0.0
60,2,AdaBoost (Discrete),1,1.0,0.20830350751610593,0.25530161485401354,35.66471195220947,0.0
61,2,AdaBoost (Real),1,1.0,0.25196850393700787,0.3673063952035098,98.81332421302795,0.0
62,2,Logistic Regression (Penalty = L2),1,1.0,0.25697924123120974,0.1978530366217609,3.652231454849243,0.0
63,2,Naive Bayes,1,1.0,0.11882605583392986,0.3808541542719384,0.3529636859893799,0.0
64,2,KNeighbors Classifier,2,1.0,0.21654676258992805,0.3143517536764661,0.7127861976623535,0.0
65,2,SVC Classifier,2,1.0,0.2143884892086331,0.45368823166620964,7.944188594818115,0.0
66,2,Decision Tree,2,1.0,0.20287769784172663,0.2795275664518063,0.14467215538024902,0.0
67,2,RandomForest,2,1.0,0.25971223021582734,0.3818117530171415,0.5252768993377686,0.0
68,2,AdaBoost (Discrete),2,1.0,0.20431654676258992,0.27897626009255155,52.84772062301636,0.0
69,2,AdaBoost (Real),2,1.0,0.25323741007194245,0.31684278993912,103.8281500339508,0.0
70,2,Logistic Regression (Penalty = L2),2,1.0,0.26618705035971224,0.19854019800882877,3.2346701622009277,0.0
71,2,Naive Bayes,2,1.0,0.11654676258992806,0.5264717575272626,0.2492961883544922,0.0
72,3,KNeighbors Classifier,0,1.0,0.21048901488306165,0.32473667583796356,0.8673291206359863,0.0
73,3,SVC Classifier,0,1.0,0.19631467044649184,0.43374535059637953,8.170861721038818,0.0
74,3,Decision Tree,0,1.0,0.2012756909992913,0.28126132744884336,0.13891267776489258,0.0
75,3,RandomForest,0,1.0,0.23387668320340185,0.3112441209271001,0.46998047828674316,0.0
76,3,AdaBoost (Discrete),0,1.0,0.184975194897236,0.22496124135411114,51.86602187156677,0.0
77,3,AdaBoost (Real),0,1.0,0.2083628632175762,0.22992297013564655,102.76586818695068,0.0
78,3,Logistic Regression (Penalty = L2),0,1.0,0.25584691708008506,0.26152248242221937,3.2211713790893555,0.0
79,3,Naive Bayes,0,1.0,0.0885896527285613,0.3109733177195326,0.2617518901824951,0.0
80,3,KNeighbors Classifier,1,1.0,0.2147458840372226,0.29397343503821965,0.5714123249053955,0.0
81,3,SVC Classifier,1,1.0,0.21045096635647817,0.46640548688179284,7.191974878311157,0.0
82,3,Decision Tree,1,1.0,0.2040085898353615,0.25440384599054855,0.13312530517578125,0.0
83,3,RandomForest,1,1.0,0.2648532569792412,0.3733293624689494,0.48927903175354004,0.0
84,3,AdaBoost (Discrete),1,1.0,0.20901932712956334,0.2560397065850056,47.4668288230896,0.0
85,3,AdaBoost (Real),1,1.0,0.25196850393700787,0.3673063952035098,97.33566522598267,0.0
86,3,Logistic Regression (Penalty = L2),1,1.0,0.25697924123120974,0.1978530366217609,2.969898223876953,0.0
87,3,Naive Bayes,1,1.0,0.11882605583392986,0.3808541542719384,0.30024051666259766,0.0
88,3,KNeighbors Classifier,2,1.0,0.21654676258992805,0.3143517536764661,0.7042207717895508,0.0
89,3,SVC Classifier,2,1.0,0.2143884892086331,0.45368823166620964,7.207503080368042,0.0
90,3,Decision Tree,2,1.0,0.1920863309352518,0.3537484414948617,0.12803173065185547,0.0
91,3,RandomForest,2,1.0,0.25971223021582734,0.3818117530171415,0.48068737983703613,0.0
92,3,AdaBoost (Discrete),2,1.0,0.20359712230215826,0.277552019321644,47.125773906707764,0.0
93,3,AdaBoost (Real),2,1.0,0.25323741007194245,0.31684278993912,92.70816707611084,0.0
94,3,Logistic Regression (Penalty = L2),2,1.0,0.26618705035971224,0.19854019800882877,2.9434237480163574,0.0
95,3,Naive Bayes,2,1.0,0.11654676258992806,0.5264717575272626,0.25385475158691406,0.0
96,4,KNeighbors Classifier,0,1.0,0.21048901488306165,0.32473667583796356,0.5825748443603516,0.0
97,4,SVC Classifier,0,1.0,0.19631467044649184,0.43374535059637953,6.861302614212036,0.0
98,4,Decision Tree,0,1.0,0.19631467044649184,0.2983195688642687,0.1349184513092041,0.0
99,4,RandomForest,0,1.0,0.23387668320340185,0.3112441209271001,0.4744434356689453,0.0
100,4,AdaBoost (Discrete),0,1.0,0.184975194897236,0.22496124135411114,46.77610778808594,0.0
101,4,AdaBoost (Real),0,1.0,0.2083628632175762,0.22992297013564655,91.98277997970581,0.0
102,4,Logistic Regression (Penalty = L2),0,1.0,0.25584691708008506,0.26152248242221937,2.7504751682281494,0.0
103,4,Naive Bayes,0,1.0,0.0885896527285613,0.3109733177195326,0.24394559860229492,0.0
104,4,KNeighbors Classifier,1,1.0,0.2147458840372226,0.29397343503821965,0.5534069538116455,0.0
105,4,SVC Classifier,1,1.0,0.21045096635647817,0.46640548688179284,6.397674560546875,0.0
106,4,Decision Tree,1,1.0,0.20042949176807445,0.3060323568105039,0.1220698356628418,0.0
107,4,RandomForest,1,1.0,0.2648532569792412,0.3733293624689494,0.43747615814208984,0.0
108,4,AdaBoost (Discrete),1,1.0,0.20830350751610593,0.25530161485401354,44.06780791282654,0.0
109,4,AdaBoost (Real),1,1.0,0.25196850393700787,0.3673063952035098,90.77066779136658,0.0
110,4,Logistic Regression (Penalty = L2),1,1.0,0.25697924123120974,0.1978530366217609,2.676727533340454,0.0
111,4,Naive Bayes,1,1.0,0.11882605583392986,0.3808541542719384,0.19527411460876465,0.0
112,4,KNeighbors Classifier,2,1.0,0.21654676258992805,0.3143517536764661,0.60345458984375,0.0
113,4,SVC Classifier,2,1.0,0.2143884892086331,0.45368823166620964,6.459177017211914,0.0
114,4,Decision Tree,2,1.0,0.20215827338129497,0.24199749318447436,0.109100341796875,0.0
115,4,RandomForest,2,1.0,0.25971223021582734,0.3818117530171415,0.36391592025756836,0.0
116,4,AdaBoost (Discrete),2,1.0,0.20359712230215826,0.277552019321644,43.17139554023743,0.0
117,4,AdaBoost (Real),2,1.0,0.25323741007194245,0.31684278993912,83.35339379310608,0.0
118,4,Logistic Regression (Penalty = L2),2,1.0,0.26618705035971224,0.19854019800882877,2.749317169189453,0.0
119,4,Naive Bayes,2,1.0,0.11654676258992806,0.5264717575272626,0.25115394592285156,0.0
120,5,KNeighbors Classifier,0,1.0,0.21048901488306165,0.32473667583796356,0.502539873123169,0.0
121,5,SVC Classifier,0,1.0,0.19631467044649184,0.43374535059637953,6.009572982788086,0.0
122,5,Decision Tree,0,1.0,0.19631467044649184,0.26563555126129107,0.11977601051330566,0.0
123,5,RandomForest,0,1.0,0.23387668320340185,0.3112441209271001,0.4401845932006836,0.0
124,5,AdaBoost (Discrete),0,1.0,0.184975194897236,0.22496124135411114,42.45940065383911,0.0
125,5,AdaBoost (Real),0,1.0,0.20978029766123316,0.2256869911640142,85.07307863235474,0.0
126,5,Logistic Regression (Penalty = L2),0,1.0,0.25584691708008506,0.26152248242221937,2.6145920753479004,0.0
127,5,Naive Bayes,0,1.0,0.0885896527285613,0.3109733177195326,0.21731948852539062,0.0
128,5,KNeighbors Classifier,1,1.0,0.2147458840372226,0.29397343503821965,0.5382509231567383,0.0
129,5,SVC Classifier,1,1.0,0.21045096635647817,0.46640548688179284,6.471520900726318,0.0
130,5,Decision Tree,1,1.0,0.2204724409448819,0.28484649167927156,0.1594254970550537,0.0
131,5,RandomForest,1,1.0,0.2648532569792412,0.3733293624689494,0.48229193687438965,0.0
132,5,AdaBoost (Discrete),1,1.0,0.20830350751610593,0.25530161485401354,41.26088047027588,0.0
133,5,AdaBoost (Real),1,1.0,0.25196850393700787,0.3673063952035098,86.33701610565186,0.0
134,5,Logistic Regression (Penalty = L2),1,1.0,0.25697924123120974,0.1978530366217609,2.6630287170410156,0.0
135,5,Naive Bayes,1,1.0,0.11882605583392986,0.3808541542719384,0.1878952980041504,0.0
136,5,KNeighbors Classifier,2,1.0,0.21654676258992805,0.3143517536764661,0.5473651885986328,0.0
137,5,SVC Classifier,2,1.0,0.2143884892086331,0.45368823166620964,6.27217173576355,0.0
138,5,Decision Tree,2,1.0,0.20431654676258992,0.28338493548784927,0.1335768699645996,0.0
139,5,RandomForest,2,1.0,0.25971223021582734,0.3818117530171415,0.43569231033325195,0.0
140,5,AdaBoost (Discrete),2,1.0,0.20431654676258992,0.27897626009255155,42.420642614364624,0.0
141,5,AdaBoost (Real),2,1.0,0.25323741007194245,0.31684278993912,104.66236901283264,0.0
142,5,Logistic Regression (Penalty = L2),2,1.0,0.26618705035971224,0.19854019800882877,3.3204917907714844,0.0
143,5,Naive Bayes,2,1.0,0.11654676258992806,0.5264717575272626,0.3057076930999756,0.0
144,6,KNeighbors Classifier,0,1.0,0.21048901488306165,0.32473667583796356,0.6274340152740479,0.0
145,6,SVC Classifier,0,1.0,0.19631467044649184,0.43374535059637953,7.646289587020874,0.0
146,6,Decision Tree,0,1.0,0.20340184266477676,0.27682628272100096,0.19310379028320312,0.0
147,6,RandomForest,0,1.0,0.23387668320340185,0.3112441209271001,0.5300734043121338,0.0
148,6,AdaBoost (Discrete),0,1.0,0.18426647767540752,0.22381276021917795,50.78128743171692,0.0
149,6,AdaBoost (Real),0,1.0,0.2083628632175762,0.22992297013564655,103.13514399528503,0.0
150,6,Logistic Regression (Penalty = L2),0,1.0,0.25584691708008506,0.26152248242221937,3.267016649246216,0.0
151,6,Naive Bayes,0,1.0,0.0885896527285613,0.3109733177195326,0.30300140380859375,0.0
152,6,KNeighbors Classifier,1,1.0,0.2147458840372226,0.29397343503821965,0.8026800155639648,0.0
153,6,SVC Classifier,1,1.0,0.21045096635647817,0.46640548688179284,8.521427631378174,0.0
154,6,Decision Tree,1,1.0,0.20257695060844666,0.3345235404756886,0.20296478271484375,0.0
155,6,RandomForest,1,1.0,0.2648532569792412,0.3733293624689494,0.5557637214660645,0.0
156,6,AdaBoost (Discrete),1,1.0,0.20830350751610593,0.25530161485401354,52.73497772216797,0.0
157,6,AdaBoost (Real),1,1.0,0.25196850393700787,0.3673063952035098,103.23821067810059,0.0
158,6,Logistic Regression (Penalty = L2),1,1.0,0.25697924123120974,0.1978530366217609,3.322742462158203,0.0
159,6,Naive Bayes,1,1.0,0.11882605583392986,0.3808541542719384,0.24066686630249023,0.0
160,6,KNeighbors Classifier,2,1.0,0.21654676258992805,0.3143517536764661,0.6817784309387207,0.0
161,6,SVC Classifier,2,1.0,0.2143884892086331,0.45368823166620964,7.519721508026123,0.0
162,6,Decision Tree,2,1.0,0.21366906474820144,0.25999741173403107,0.14614081382751465,0.0
163,6,RandomForest,2,1.0,0.25971223021582734,0.3818117530171415,0.5724368095397949,0.0
164,6,AdaBoost (Discrete),2,1.0,0.20359712230215826,0.277552019321644,52.693079710006714,0.0
165,6,AdaBoost (Real),2,1.0,0.25323741007194245,0.31684278993912,103.3648271560669,0.0
166,6,Logistic Regression (Penalty = L2),2,1.0,0.26618705035971224,0.19854019800882877,3.3050034046173096,0.0
167,6,Naive Bayes,2,1.0,0.11654676258992806,0.5264717575272626,0.26309657096862793,0.0
168,7,KNeighbors Classifier,0,1.0,0.21048901488306165,0.32473667583796356,0.7214481830596924,0.0
169,7,SVC Classifier,0,1.0,0.19631467044649184,0.43374535059637953,8.111640691757202,0.0
170,7,Decision Tree,0,1.0,0.1913536498936924,0.2708075896699926,0.1558980941772461,0.0
171,7,RandomForest,0,1.0,0.23387668320340185,0.3112441209271001,0.5036096572875977,0.0
172,7,AdaBoost (Discrete),0,1.0,0.184975194897236,0.22496124135411114,52.61809968948364,0.0
173,7,AdaBoost (Real),0,1.0,0.2083628632175762,0.22992297013564655,101.68500685691833,0.0
174,7,Logistic Regression (Penalty = L2),0,1.0,0.25584691708008506,0.26152248242221937,2.923205852508545,0.0
175,7,Naive Bayes,0,1.0,0.0885896527285613,0.3109733177195326,0.2815837860107422,0.0
176,7,KNeighbors Classifier,1,1.0,0.2147458840372226,0.29397343503821965,0.5789060592651367,0.0
177,7,SVC Classifier,1,1.0,0.21045096635647817,0.46640548688179284,7.7729651927948,0.0
178,7,Decision Tree,1,1.0,0.2211882605583393,0.2607664975523039,0.15050125122070312,0.0
179,7,RandomForest,1,1.0,0.2648532569792412,0.3733293624689494,0.5193827152252197,0.0
180,7,AdaBoost (Discrete),1,1.0,0.20901932712956334,0.2560397065850056,49.75593972206116,0.0
181,7,AdaBoost (Real),1,1.0,0.25196850393700787,0.3673063952035098,96.4612307548523,0.0
182,7,Logistic Regression (Penalty = L2),1,1.0,0.25697924123120974,0.1978530366217609,2.96577787399292,0.0
183,7,Naive Bayes,1,1.0,0.11882605583392986,0.3808541542719384,0.26119565963745117,0.0
184,7,KNeighbors Classifier,2,1.0,0.21654676258992805,0.3143517536764661,0.7023818492889404,0.0
185,7,SVC Classifier,2,1.0,0.2143884892086331,0.45368823166620964,7.25729513168335,0.0
186,7,Decision Tree,2,1.0,0.2079136690647482,0.32175200896433714,0.1329503059387207,0.0
187,7,RandomForest,2,1.0,0.25971223021582734,0.3818117530171415,0.484189510345459,0.0
188,7,AdaBoost (Discrete),2,1.0,0.20431654676258992,0.27897626009255155,47.11478638648987,0.0
189,7,AdaBoost (Real),2,1.0,0.25323741007194245,0.31684278993912,94.57802414894104,0.0
190,7,Logistic Regression (Penalty = L2),2,1.0,0.26618705035971224,0.19854019800882877,3.1858444213867188,0.0
191,7,Naive Bayes,2,1.0,0.11654676258992806,0.5264717575272626,0.26412487030029297,0.0
192,8,KNeighbors Classifier,0,1.0,0.21048901488306165,0.32473667583796356,0.6611645221710205,0.0
193,8,SVC Classifier,0,1.0,0.19631467044649184,0.43374535059637953,7.180221796035767,0.0
194,8,Decision Tree,0,1.0,0.19489723600283487,0.3024074221292138,0.19511842727661133,0.0
195,8,RandomForest,0,1.0,0.23387668320340185,0.3112441209271001,0.5312502384185791,0.0
196,8,AdaBoost (Discrete),0,1.0,0.18426647767540752,0.22381276021917795,48.1018762588501,0.0
197,8,AdaBoost (Real),0,1.0,0.2090715804394047,0.23344296906414883,91.70256352424622,0.0
198,8,Logistic Regression (Penalty = L2),0,1.0,0.25584691708008506,0.26152248242221937,2.56634259223938,0.0
199,8,Naive Bayes,0,1.0,0.0885896527285613,0.3109733177195326,0.2652740478515625,0.0
200,8,KNeighbors Classifier,1,1.0,0.2147458840372226,0.29397343503821965,0.6036839485168457,0.0
201,8,SVC Classifier,1,1.0,0.21045096635647817,0.46640548688179284,6.829646348953247,0.0
202,8,Decision Tree,1,1.0,0.2032927702219041,0.29988348910028234,0.17379021644592285,0.0
203,8,RandomForest,1,1.0,0.2648532569792412,0.3733293624689494,0.4567220211029053,0.0
204,8,AdaBoost (Discrete),1,1.0,0.20830350751610593,0.25530161485401354,56.65422582626343,0.0
205,8,AdaBoost (Real),1,1.0,0.25196850393700787,0.3673063952035098,120.54481291770935,0.0
206,8,Logistic Regression (Penalty = L2),1,1.0,0.25697924123120974,0.1978530366217609,3.610663890838623,0.0
207,8,Naive Bayes,1,1.0,0.11882605583392986,0.3808541542719384,0.26432180404663086,0.0
208,8,KNeighbors Classifier,2,1.0,0.21654676258992805,0.3143517536764661,0.6805408000946045,0.0
209,8,SVC Classifier,2,1.0,0.2143884892086331,0.45368823166620964,9.037445783615112,0.0
210,8,Decision Tree,2,1.0,0.21151079136690648,0.26215176987091615,0.21024227142333984,0.0
211,8,RandomForest,2,1.0,0.25971223021582734,0.3818117530171415,0.6245832443237305,0.0
212,8,AdaBoost (Discrete),2,1.0,0.20431654676258992,0.27897626009255155,58.44357872009277,0.0
213,8,AdaBoost (Real),2,1.0,0.25323741007194245,0.31684278993912,112.46580457687378,0.0
214,8,Logistic Regression (Penalty = L2),2,1.0,0.26618705035971224,0.19854019800882877,3.573864698410034,0.0
215,8,Naive Bayes,2,1.0,0.11654676258992806,0.5264717575272626,0.26021242141723633,0.0
216,9,KNeighbors Classifier,0,1.0,0.21048901488306165,0.32473667583796356,0.8830909729003906,0.0
217,9,SVC Classifier,0,1.0,0.19631467044649184,0.43374535059637953,8.598419427871704,0.0
218,9,Decision Tree,0,1.0,0.21615875265768958,0.3012712916237052,0.15981531143188477,0.0
219,9,RandomForest,0,1.0,0.23387668320340185,0.3112441209271001,0.644669771194458,0.0
220,9,AdaBoost (Discrete),0,1.0,0.184975194897236,0.22496124135411114,55.90565466880798,0.0
221,9,AdaBoost (Real),0,1.0,0.2090715804394047,0.23344296906414883,104.64502167701721,0.0
222,9,Logistic Regression (Penalty = L2),0,1.0,0.25584691708008506,0.26152248242221937,3.432267189025879,0.0
223,9,Naive Bayes,0,1.0,0.0885896527285613,0.3109733177195326,0.32709312438964844,0.0
224,9,KNeighbors Classifier,1,1.0,0.2147458840372226,0.29397343503821965,0.6843400001525879,0.0
225,9,SVC Classifier,1,1.0,0.21045096635647817,0.46640548688179284,8.248544216156006,0.0
226,9,Decision Tree,1,1.0,0.21546170365068004,0.34005904520978064,0.14548873901367188,0.0
227,9,RandomForest,1,1.0,0.2648532569792412,0.3733293624689494,0.5957281589508057,0.0
228,9,AdaBoost (Discrete),1,1.0,0.20830350751610593,0.25530161485401354,54.211150884628296,0.0
229,9,AdaBoost (Real),1,1.0,0.25196850393700787,0.3673063952035098,104.80571961402893,0.0
230,9,Logistic Regression (Penalty = L2),1,1.0,0.25697924123120974,0.1978530366217609,3.362691879272461,0.0
231,9,Naive Bayes,1,1.0,0.11882605583392986,0.3808541542719384,0.3093831539154053,0.0
232,9,KNeighbors Classifier,2,1.0,0.21654676258992805,0.3143517536764661,0.7551467418670654,0.0
233,9,SVC Classifier,2,1.0,0.2143884892086331,0.45368823166620964,8.172181606292725,0.0
234,9,Decision Tree,2,1.0,0.22589928057553957,0.28145540808466535,0.162109375,0.0
235,9,RandomForest,2,1.0,0.25971223021582734,0.3818117530171415,0.6821982860565186,0.0
236,9,AdaBoost (Discrete),2,1.0,0.20431654676258992,0.27897626009255155,55.25572323799133,0.0
237,9,AdaBoost (Real),2,1.0,0.25323741007194245,0.31684278993912,103.40889239311218,0.0
238,9,Logistic Regression (Penalty = L2),2,1.0,0.26618705035971224,0.19854019800882877,2.923853635787964,0.0
239,9,Naive Bayes,2,1.0,0.11654676258992806,0.5264717575272626,0.23033404350280762,0.0
240,10,KNeighbors Classifier,0,1.0,0.21048901488306165,0.32473667583796356,0.6758270263671875,0.0
241,10,SVC Classifier,0,1.0,0.19631467044649184,0.43374535059637953,7.371945858001709,0.0
242,10,Decision Tree,0,1.0,0.20340184266477676,0.30824794764784474,0.13335013389587402,0.0
243,10,RandomForest,0,1.0,0.23387668320340185,0.3112441209271001,0.4995415210723877,0.0
244,10,AdaBoost (Discrete),0,1.0,0.184975194897236,0.22496124135411114,48.139201402664185,0.0
245,10,AdaBoost (Real),0,1.0,0.2083628632175762,0.22034082197579732,93.8353168964386,0.0
246,10,Logistic Regression (Penalty = L2),0,1.0,0.25584691708008506,0.26152248242221937,2.7231452465057373,0.0
247,10,Naive Bayes,0,1.0,0.0885896527285613,0.3109733177195326,0.19799137115478516,0.0
248,10,KNeighbors Classifier,1,1.0,0.2147458840372226,0.29397343503821965,0.6034207344055176,0.0
249,10,SVC Classifier,1,1.0,0.21045096635647817,0.46640548688179284,6.914630174636841,0.0
250,10,Decision Tree,1,1.0,0.21116678596993557,0.2800524861134606,0.11769843101501465,0.0
251,10,RandomForest,1,1.0,0.2648532569792412,0.3733293624689494,0.4839670658111572,0.0
252,10,AdaBoost (Discrete),1,1.0,0.20830350751610593,0.25530161485401354,46.67245435714722,0.0
253,10,AdaBoost (Real),1,1.0,0.25196850393700787,0.3673063952035098,94.22187447547913,0.0
254,10,Logistic Regression (Penalty = L2),1,1.0,0.25697924123120974,0.1978530366217609,2.825780153274536,0.0
255,10,Naive Bayes,1,1.0,0.11882605583392986,0.3808541542719384,0.2790076732635498,0.0
256,10,KNeighbors Classifier,2,1.0,0.21654676258992805,0.3143517536764661,0.6016132831573486,0.0
257,10,SVC Classifier,2,1.0,0.2143884892086331,0.45368823166620964,6.745568037033081,0.0
258,10,Decision Tree,2,1.0,0.18633093525179856,0.2599269784746577,0.1324450969696045,0.0
259,10,RandomForest,2,1.0,0.25971223021582734,0.3818117530171415,0.48009276390075684,0.0
260,10,AdaBoost (Discrete),2,1.0,0.20359712230215826,0.277552019321644,44.78053402900696,0.0
261,10,AdaBoost (Real),2,1.0,0.25323741007194245,0.31684278993912,89.78699350357056,0.0
262,10,Logistic Regression (Penalty = L2),2,1.0,0.26618705035971224,0.19854019800882877,2.908189058303833,0.0
263,10,Naive Bayes,2,1.0,0.11654676258992806,0.5264717575272626,0.2188420295715332,0.0
264,11,KNeighbors Classifier,0,1.0,0.21048901488306165,0.32473667583796356,0.5989060401916504,0.0
265,11,SVC Classifier,0,1.0,0.19631467044649184,0.43374535059637953,6.412659406661987,0.0
266,11,Decision Tree,0,1.0,0.20552799433026223,0.2903048819922059,0.176544189453125,0.0
267,11,RandomForest,0,1.0,0.23387668320340185,0.3112441209271001,0.39646315574645996,0.0
268,11,AdaBoost (Discrete),0,1.0,0.18426647767540752,0.22381276021917795,39.454808950424194,0.0
269,11,AdaBoost (Real),0,1.0,0.2083628632175762,0.22992297013564655,75.90329551696777,0.0
270,11,Logistic Regression (Penalty = L2),0,1.0,0.25584691708008506,0.26152248242221937,2.140623092651367,0.0
271,11,Naive Bayes,0,1.0,0.0885896527285613,0.3109733177195326,0.20628046989440918,0.0
272,11,KNeighbors Classifier,1,1.0,0.2147458840372226,0.29397343503821965,0.5035920143127441,0.0
273,11,SVC Classifier,1,1.0,0.21045096635647817,0.46640548688179284,5.464052200317383,0.0
274,11,Decision Tree,1,1.0,0.19899785254115962,0.24934787461197752,0.10810661315917969,0.0
275,11,RandomForest,1,1.0,0.2648532569792412,0.3733293624689494,0.43477511405944824,0.0
276,11,AdaBoost (Discrete),1,1.0,0.20901932712956334,0.2560397065850056,35.59589719772339,0.0
277,11,AdaBoost (Real),1,1.0,0.25196850393700787,0.3673063952035098,67.58831596374512,0.0
278,11,Logistic Regression (Penalty = L2),1,1.0,0.25697924123120974,0.1978530366217609,2.039139986038208,0.0
279,11,Naive Bayes,1,1.0,0.11882605583392986,0.3808541542719384,0.19141006469726562,0.0
280,11,KNeighbors Classifier,2,1.0,0.21654676258992805,0.3143517536764661,0.49796199798583984,0.0
281,11,SVC Classifier,2,1.0,0.2143884892086331,0.45368823166620964,5.210404396057129,0.0
282,11,Decision Tree,2,1.0,0.20215827338129497,0.32040533634215457,0.08630871772766113,0.0
283,11,RandomForest,2,1.0,0.25971223021582734,0.3818117530171415,0.3328213691711426,0.0
284,11,AdaBoost (Discrete),2,1.0,0.20431654676258992,0.27897626009255155,33.01616358757019,0.0
285,11,AdaBoost (Real),2,1.0,0.25323741007194245,0.31684278993912,67.7903892993927,0.0
286,11,Logistic Regression (Penalty = L2),2,1.0,0.26618705035971224,0.19854019800882877,2.186291456222534,0.0
287,11,Naive Bayes,2,1.0,0.11654676258992806,0.5264717575272626,0.19132781028747559,0.0
288,12,KNeighbors Classifier,0,1.0,0.21048901488306165,0.32473667583796356,0.5394585132598877,0.0
289,12,SVC Classifier,0,1.0,0.19631467044649184,0.43374535059637953,5.302120208740234,0.0
290,12,Decision Tree,0,1.0,0.19702338766832034,0.27447413771959805,0.09711766242980957,0.0
291,12,RandomForest,0,1.0,0.23387668320340185,0.3112441209271001,0.3567781448364258,0.0
292,12,AdaBoost (Discrete),0,1.0,0.184975194897236,0.22496124135411114,32.982633113861084,0.0
293,12,AdaBoost (Real),0,1.0,0.2076541459957477,0.21701838540651694,61.43143343925476,0.0
294,12,Logistic Regression (Penalty = L2),0,1.0,0.25584691708008506,0.26152248242221937,1.8122470378875732,0.0
295,12,Naive Bayes,0,1.0,0.0885896527285613,0.3109733177195326,0.17792034149169922,0.0
296,12,KNeighbors Classifier,1,1.0,0.2147458840372226,0.29397343503821965,0.3768734931945801,0.0
297,12,SVC Classifier,1,1.0,0.21045096635647817,0.46640548688179284,4.792942523956299,0.0
298,12,Decision Tree,1,1.0,0.22190408017179672,0.26588808547431925,0.08471155166625977,0.0
299,12,RandomForest,1,1.0,0.2648532569792412,0.3733293624689494,0.30681777000427246,0.0
300,12,AdaBoost (Discrete),1,1.0,0.20901932712956334,0.2560397065850056,32.32169032096863,0.0
301,12,AdaBoost (Real),1,1.0,0.25196850393700787,0.3673063952035098,56.8488028049469,0.0
302,12,Logistic Regression (Penalty = L2),1,1.0,0.25697924123120974,0.1978530366217609,1.6984894275665283,0.0
303,12,Naive Bayes,1,1.0,0.11882605583392986,0.3808541542719384,0.1762545108795166,0.0
304,12,KNeighbors Classifier,2,1.0,0.21654676258992805,0.3143517536764661,0.3367476463317871,0.0
305,12,SVC Classifier,2,1.0,0.2143884892086331,0.45368823166620964,4.094985246658325,0.0
306,12,Decision Tree,2,1.0,0.19352517985611511,0.2780767234119356,0.11024761199951172,0.0
307,12,RandomForest,2,1.0,0.25971223021582734,0.3818117530171415,0.30851268768310547,0.0
308,12,AdaBoost (Discrete),2,1.0,0.20431654676258992,0.27897626009255155,30.679721355438232,0.0
309,12,AdaBoost (Real),2,1.0,0.25323741007194245,0.31684278993912,57.93583869934082,0.0
310,12,Logistic Regression (Penalty = L2),2,1.0,0.26618705035971224,0.19854019800882877,1.9064385890960693,0.0
311,12,Naive Bayes,2,1.0,0.11654676258992806,0.5264717575272626,0.16165709495544434,0.0
