,feat_set_id,classifier,fold_id,feat_th,score,geo_score,exec_t,geo_score_woz
0,0,KNeighbors Classifier,0,1.0,0.6094674556213018,0.6786044041487267,0.9450962543487549,0.6786044041487267
1,0,SVC Classifier,0,1.0,0.6035502958579881,0.41251924070608303,0.8183102607727051,0.41251924070608303
2,0,Decision Tree,0,1.0,0.5266272189349113,0.5588293019985543,0.009578466415405273,0.5588293019985543
3,0,RandomForest,0,1.0,0.5798816568047337,0.24124271543573797,0.09061336517333984,0.24124271543573797
4,0,AdaBoost (Discrete),0,1.0,0.46153846153846156,0.47119893871100926,21.47857356071472,0.47119893871100926
5,0,AdaBoost (Real),0,1.0,0.621301775147929,0.6850986207942019,21.447913646697998,0.6850986207942019
6,0,Logistic Regression (Penalty = L2),0,1.0,0.6094674556213018,0.6742049002196551,0.23463034629821777,0.6742049002196551
7,0,Naive Bayes,0,1.0,0.4556213017751479,0.5163666337264373,0.12179946899414062,0.5163666337264373
8,0,KNeighbors Classifier,1,1.0,0.5773809523809523,0.6748132389880844,1.0353105068206787,0.6748132389880844
9,0,SVC Classifier,1,1.0,0.5892857142857143,0.9947780321927768,0.9949142932891846,0.0
10,0,Decision Tree,1,1.0,0.6071428571428571,0.7042360188939408,0.06451082229614258,0.7042360188939408
11,0,RandomForest,1,1.0,0.5952380952380952,1.0,0.18676471710205078,0.0
12,0,AdaBoost (Discrete),1,1.0,0.5654761904761905,0.6816950328847992,19.164048194885254,0.6816950328847992
13,0,AdaBoost (Real),1,1.0,0.5178571428571429,0.5901885640626392,18.998349905014038,0.5901885640626392
14,0,Logistic Regression (Penalty = L2),1,1.0,0.5773809523809523,0.6615467691941467,0.07128167152404785,0.6615467691941467
15,0,Naive Bayes,1,1.0,0.44642857142857145,0.5267316437316311,0.037568092346191406,0.5267316437316311
16,0,KNeighbors Classifier,2,1.0,0.5389221556886228,0.6325234519700399,0.6793732643127441,0.6325234519700399
17,0,SVC Classifier,2,1.0,0.6107784431137725,0.46206375934610827,0.6906914710998535,0.46206375934610827
18,0,Decision Tree,2,1.0,0.5089820359281437,0.5811072957477805,0.005833864212036133,0.5811072957477805
19,0,RandomForest,2,1.0,0.5988023952095808,0.24499865251482233,0.12328505516052246,0.24499865251482233
20,0,AdaBoost (Discrete),2,1.0,0.4311377245508982,0.5135200123124198,13.162597179412842,0.5135200123124198
21,0,AdaBoost (Real),2,1.0,0.5868263473053892,0.6551853485522242,13.476824283599854,0.6551853485522242
22,0,Logistic Regression (Penalty = L2),2,1.0,0.5449101796407185,0.6435609748144865,0.07067513465881348,0.6435609748144865
23,0,Naive Bayes,2,1.0,0.46107784431137727,0.5489690621400171,0.05478048324584961,0.5489690621400171
