,feat_set_id,classifier,fold_id,feat_th,score,geo_score,exec_t,geo_score_woz
0,0,KNeighbors Classifier,0,0.25,0.9522388059701492,0.9513935256842967,0.645104169845581,0.9513935256842967
1,0,SVC Classifier,0,0.25,0.8985074626865671,0.8967174593902132,1.7267982959747314,0.8967174593902132
2,0,Decision Tree,0,0.25,0.753731343283582,0.7515662978775852,0.0968332290649414,0.7515662978775852
3,0,RandomForest,0,0.25,0.6850746268656717,0.6025440785680191,0.48340797424316406,0.6025440785680191
4,0,AdaBoost (Discrete),0,0.25,0.917910447761194,0.9172388765709942,63.443132400512695,0.9172388765709942
5,0,AdaBoost (Real),0,0.25,0.9074626865671642,0.9070499795815485,72.52586126327515,0.9070499795815485
6,0,Logistic Regression (Penalty = L2),0,0.25,0.9238805970149254,0.9230811050093858,0.6819338798522949,0.9230811050093858
7,0,Naive Bayes,0,0.25,0.9194029850746268,0.9183901022362393,0.11925745010375977,0.9183901022362393
8,0,KNeighbors Classifier,1,0.25,0.9611940298507463,0.9610261550726269,0.7498915195465088,0.9610261550726269
9,0,SVC Classifier,1,0.25,0.8985074626865671,0.8970126835430626,1.7982311248779297,0.8970126835430626
10,0,Decision Tree,1,0.25,0.7522388059701492,0.7483777492035658,0.10331583023071289,0.7483777492035658
11,0,RandomForest,1,0.25,0.6970149253731344,0.6833179710259871,0.41838574409484863,0.6833179710259871
12,0,AdaBoost (Discrete),1,0.25,0.908955223880597,0.9084525501041313,63.24678039550781,0.9084525501041313
13,0,AdaBoost (Real),1,0.25,0.8552238805970149,0.8545717011538976,72.954598903656,0.8545717011538976
14,0,Logistic Regression (Penalty = L2),1,0.25,0.9343283582089552,0.93401404281576,0.7549264430999756,0.93401404281576
15,0,Naive Bayes,1,0.25,0.9223880597014925,0.9220580532613958,0.10130572319030762,0.9220580532613958
16,0,KNeighbors Classifier,2,0.25,0.9575757575757575,0.9574352770855671,0.7412636280059814,0.9574352770855671
17,0,SVC Classifier,2,0.25,0.8954545454545455,0.8939879189164619,1.8138513565063477,0.8939879189164619
18,0,Decision Tree,2,0.25,0.7818181818181819,0.7792591887548692,0.10392427444458008,0.7792591887548692
19,0,RandomForest,2,0.25,0.7075757575757575,0.6832004920631428,0.5332322120666504,0.6832004920631428
20,0,AdaBoost (Discrete),2,0.25,0.9303030303030303,0.9291969001018457,62.29908227920532,0.9291969001018457
21,0,AdaBoost (Real),2,0.25,0.8272727272727273,0.8109977853544585,65.98921322822571,0.8109977853544585
22,0,Logistic Regression (Penalty = L2),2,0.25,0.9272727272727272,0.9262997153102238,0.5301916599273682,0.9262997153102238
23,0,Naive Bayes,2,0.25,0.9363636363636364,0.9359750503258601,0.1053311824798584,0.9359750503258601
24,1,KNeighbors Classifier,0,0.25,0.9582089552238806,0.9574865832832727,0.6362166404724121,0.9574865832832727
25,1,SVC Classifier,0,0.25,0.8776119402985074,0.8758801380932965,1.6354668140411377,0.8758801380932965
26,1,Decision Tree,0,0.25,0.7716417910447761,0.765778733738877,0.13621258735656738,0.765778733738877
27,1,RandomForest,0,0.25,0.6537313432835821,0.5548152099622032,0.4452633857727051,0.5548152099622032
28,1,AdaBoost (Discrete),0,0.25,0.8970149253731343,0.8956745119860271,64.56602907180786,0.8956745119860271
29,1,AdaBoost (Real),0,0.25,0.8776119402985074,0.8767346470682503,74.779057264328,0.8767346470682503
30,1,Logistic Regression (Penalty = L2),0,0.25,0.9164179104477612,0.9153511444861161,0.7178206443786621,0.9153511444861161
31,1,Naive Bayes,0,0.25,0.9238805970149254,0.922592091825539,0.15372610092163086,0.922592091825539
32,1,KNeighbors Classifier,1,0.25,0.9537313432835821,0.9527398454016794,0.6483888626098633,0.9527398454016794
33,1,SVC Classifier,1,0.25,0.8835820895522388,0.8812117557633214,1.7481143474578857,0.8812117557633214
34,1,Decision Tree,1,0.25,0.746268656716418,0.7430164313332804,0.09554433822631836,0.7430164313332804
35,1,RandomForest,1,0.25,0.6268656716417911,0.49870311146723245,0.43224644660949707,0.49870311146723245
36,1,AdaBoost (Discrete),1,0.25,0.908955223880597,0.9077633112630543,59.004178285598755,0.9077633112630543
37,1,AdaBoost (Real),1,0.25,0.8597014925373134,0.8573758988625267,65.83560013771057,0.8573758988625267
38,1,Logistic Regression (Penalty = L2),1,0.25,0.9238805970149254,0.9228997558471029,0.6778876781463623,0.9228997558471029
39,1,Naive Bayes,1,0.25,0.9044776119402985,0.9034786302533362,0.08858418464660645,0.9034786302533362
40,1,KNeighbors Classifier,2,0.25,0.9575757575757575,0.957436025220627,0.6301975250244141,0.957436025220627
41,1,SVC Classifier,2,0.25,0.8939393939393939,0.8930394790235485,1.9520766735076904,0.8930394790235485
42,1,Decision Tree,2,0.25,0.7666666666666667,0.7650159765462119,0.12447261810302734,0.7650159765462119
43,1,RandomForest,2,0.25,0.6666666666666666,0.6085710290213109,0.6221075057983398,0.6085710290213109
44,1,AdaBoost (Discrete),2,0.25,0.9196969696969697,0.9192085020916544,78.78776454925537,0.9192085020916544
45,1,AdaBoost (Real),2,0.25,0.8454545454545455,0.84212148348889,86.59969592094421,0.84212148348889
46,1,Logistic Regression (Penalty = L2),2,0.25,0.9287878787878788,0.9285163531474188,0.8172895908355713,0.9285163531474188
47,1,Naive Bayes,2,0.25,0.9151515151515152,0.914847526395797,0.20090198516845703,0.914847526395797
48,2,KNeighbors Classifier,0,0.25,0.9164179104477612,0.9152925204655581,1.0056226253509521,0.9152925204655581
49,2,SVC Classifier,0,0.25,0.8164179104477612,0.8069296300569557,2.3955631256103516,0.8069296300569557
50,2,Decision Tree,0,0.25,0.7119402985074627,0.7047283699031696,0.13582301139831543,0.7047283699031696
51,2,RandomForest,0,0.25,0.6208955223880597,0.5540929072663277,0.5497031211853027,0.5540929072663277
52,2,AdaBoost (Discrete),0,0.25,0.8402985074626865,0.8385745135894146,80.31740188598633,0.8385745135894146
53,2,AdaBoost (Real),0,0.25,0.7970149253731343,0.792110071967371,88.02460241317749,0.792110071967371
54,2,Logistic Regression (Penalty = L2),0,0.25,0.8522388059701492,0.8479303074372865,0.7637944221496582,0.8479303074372865
55,2,Naive Bayes,0,0.25,0.8507462686567164,0.8486758850621118,0.13198113441467285,0.8486758850621118
56,2,KNeighbors Classifier,1,0.25,0.9134328358208955,0.9111165014891961,1.037877082824707,0.9111165014891961
57,2,SVC Classifier,1,0.25,0.8328358208955224,0.8222096260061507,2.198678493499756,0.8222096260061507
58,2,Decision Tree,1,0.25,0.7074626865671642,0.7023681668299759,0.13187742233276367,0.7023681668299759
59,2,RandomForest,1,0.25,0.6358208955223881,0.5819219307955655,0.5859124660491943,0.5819219307955655
60,2,AdaBoost (Discrete),1,0.25,0.8492537313432836,0.8471615547050695,77.84333920478821,0.8471615547050695
61,2,AdaBoost (Real),1,0.25,0.7805970149253731,0.7764657086423085,87.34320020675659,0.7764657086423085
62,2,Logistic Regression (Penalty = L2),1,0.25,0.8537313432835821,0.8503837873643119,0.7405688762664795,0.8503837873643119
63,2,Naive Bayes,1,0.25,0.8656716417910447,0.8636663088738361,0.19778776168823242,0.8636663088738361
64,2,KNeighbors Classifier,2,0.25,0.9121212121212121,0.9098961303991981,1.041642427444458,0.9098961303991981
65,2,SVC Classifier,2,0.25,0.8363636363636363,0.8328534690830532,2.3629279136657715,0.8328534690830532
66,2,Decision Tree,2,0.25,0.7181818181818181,0.7108228393073203,0.18976473808288574,0.7108228393073203
67,2,RandomForest,2,0.25,0.6803030303030303,0.6406797716024797,0.5741007328033447,0.6406797716024797
68,2,AdaBoost (Discrete),2,0.25,0.8636363636363636,0.8616818988980032,79.34718632698059,0.8616818988980032
69,2,AdaBoost (Real),2,0.25,0.8257575757575758,0.8229233038192835,88.53039765357971,0.8229233038192835
70,2,Logistic Regression (Penalty = L2),2,0.25,0.8787878787878788,0.8776839358442692,0.7439901828765869,0.8776839358442692
71,2,Naive Bayes,2,0.25,0.8757575757575757,0.8747034232133437,0.18143916130065918,0.8747034232133437
72,3,KNeighbors Classifier,0,0.25,0.9238805970149254,0.9222169815703434,1.0223398208618164,0.9222169815703434
73,3,SVC Classifier,0,0.25,0.8402985074626865,0.8386583849187212,2.2407352924346924,0.8386583849187212
74,3,Decision Tree,0,0.25,0.7283582089552239,0.7202954811789671,0.1314866542816162,0.7202954811789671
75,3,RandomForest,0,0.25,0.6223880597014926,0.5209211121024967,0.5312485694885254,0.5209211121024967
76,3,AdaBoost (Discrete),0,0.25,0.8522388059701492,0.850471247289177,78.85203266143799,0.850471247289177
77,3,AdaBoost (Real),0,0.25,0.7805970149253731,0.7738453699794614,84.7899842262268,0.7738453699794614
78,3,Logistic Regression (Penalty = L2),0,0.25,0.8611940298507462,0.8594315318933922,0.759427547454834,0.8594315318933922
79,3,Naive Bayes,0,0.25,0.8656716417910447,0.8646321781293023,0.10337114334106445,0.8646321781293023
80,3,KNeighbors Classifier,1,0.25,0.9134328358208955,0.9117666488978401,0.8852643966674805,0.9117666488978401
81,3,SVC Classifier,1,0.25,0.8343283582089552,0.8301309400036242,1.9347352981567383,0.8301309400036242
82,3,Decision Tree,1,0.25,0.7477611940298508,0.742576826869487,0.14725017547607422,0.742576826869487
83,3,RandomForest,1,0.25,0.6597014925373135,0.6062328404000779,0.47922301292419434,0.6062328404000779
84,3,AdaBoost (Discrete),1,0.25,0.8014925373134328,0.7922223292398016,72.75704073905945,0.7922223292398016
85,3,AdaBoost (Real),1,0.25,0.5074626865671642,0.3588346531774209,85.3154444694519,0.3588346531774209
86,3,Logistic Regression (Penalty = L2),1,0.25,0.8507462686567164,0.8483900770185363,0.7859675884246826,0.8483900770185363
87,3,Naive Bayes,1,0.25,0.8686567164179104,0.8673986781595399,0.1275014877319336,0.8673986781595399
88,3,KNeighbors Classifier,2,0.25,0.9363636363636364,0.9353983539098805,1.0673630237579346,0.9353983539098805
89,3,SVC Classifier,2,0.25,0.853030303030303,0.8494062889880493,2.319699764251709,0.8494062889880493
90,3,Decision Tree,2,0.25,0.75,0.7462007486739985,0.1320514678955078,0.7462007486739985
91,3,RandomForest,2,0.25,0.6893939393939394,0.6647389043735058,0.5106465816497803,0.6647389043735058
92,3,AdaBoost (Discrete),2,0.25,0.8515151515151516,0.8472472414557218,78.89926385879517,0.8472472414557218
93,3,AdaBoost (Real),2,0.25,0.6136363636363636,0.5614110551043687,98.59737825393677,0.5614110551043687
94,3,Logistic Regression (Penalty = L2),2,0.25,0.8772727272727273,0.8753173328199175,0.8902273178100586,0.8753173328199175
95,3,Naive Bayes,2,0.25,0.8924242424242425,0.8916946149665761,0.15604615211486816,0.8916946149665761
96,4,KNeighbors Classifier,0,0.25,0.926865671641791,0.9254359961536359,0.6345758438110352,0.9254359961536359
97,4,SVC Classifier,0,0.25,0.8059701492537313,0.7975835276049532,2.2385215759277344,0.7975835276049532
98,4,Decision Tree,0,0.25,0.7761194029850746,0.773280314772848,0.08347201347351074,0.773280314772848
99,4,RandomForest,0,0.25,0.6656716417910448,0.6097440454546337,0.6615066528320312,0.6097440454546337
100,4,AdaBoost (Discrete),0,0.25,0.8686567164179104,0.8671768483355838,72.8375403881073,0.8671768483355838
101,4,AdaBoost (Real),0,0.25,0.8656716417910447,0.8628094848104587,87.1845371723175,0.8628094848104587
102,4,Logistic Regression (Penalty = L2),0,0.25,0.8820895522388059,0.8811167913856262,0.7438945770263672,0.8811167913856262
103,4,Naive Bayes,0,0.25,0.8671641791044776,0.8646524044231061,0.07482290267944336,0.8646524044231061
104,4,KNeighbors Classifier,1,0.25,0.9313432835820895,0.9299532540819186,0.48462796211242676,0.9299532540819186
105,4,SVC Classifier,1,0.25,0.8044776119402985,0.7943743985887717,2.233123540878296,0.7943743985887717
106,4,Decision Tree,1,0.25,0.7880597014925373,0.7842312151090168,0.08692646026611328,0.7842312151090168
107,4,RandomForest,1,0.25,0.6761194029850747,0.6012785444199399,0.7690777778625488,0.6012785444199399
108,4,AdaBoost (Discrete),1,0.25,0.8611940298507462,0.8593057876311504,72.1345362663269,0.8593057876311504
109,4,AdaBoost (Real),1,0.25,0.6119402985074627,0.5596599818140524,83.91389846801758,0.5596599818140524
110,4,Logistic Regression (Penalty = L2),1,0.25,0.9014925373134328,0.8992506691529568,0.7310807704925537,0.8992506691529568
111,4,Naive Bayes,1,0.25,0.8746268656716418,0.8729740850568625,0.1441340446472168,0.8729740850568625
112,4,KNeighbors Classifier,2,0.25,0.943939393939394,0.9433378012066893,0.48966121673583984,0.9433378012066893
113,4,SVC Classifier,2,0.25,0.8287878787878787,0.8235805225319318,2.379514217376709,0.8235805225319318
114,4,Decision Tree,2,0.25,0.803030303030303,0.8003115890573371,0.15947604179382324,0.8003115890573371
115,4,RandomForest,2,0.25,0.6060606060606061,0.6414934647953375,0.6387779712677002,0.0
116,4,AdaBoost (Discrete),2,0.25,0.8787878787878788,0.8763973926924697,74.07456803321838,0.8763973926924697
117,4,AdaBoost (Real),2,0.25,0.8378787878787879,0.8301358156549262,82.0246889591217,0.8301358156549262
118,4,Logistic Regression (Penalty = L2),2,0.25,0.9015151515151515,0.9005927561931693,0.7155654430389404,0.9005927561931693
119,4,Naive Bayes,2,0.25,0.9075757575757576,0.9072371218715201,0.12064576148986816,0.9072371218715201
120,5,KNeighbors Classifier,0,0.25,0.8940298507462686,0.8919474426554387,0.5307676792144775,0.8919474426554387
121,5,SVC Classifier,0,0.25,0.7716417910447761,0.7549813456075753,1.9043586254119873,0.7549813456075753
122,5,Decision Tree,0,0.25,0.7253731343283583,0.7193252694750853,0.07447075843811035,0.7193252694750853
123,5,RandomForest,0,0.25,0.6194029850746269,0.5913429207745772,0.6340711116790771,0.5913429207745772
124,5,AdaBoost (Discrete),0,0.25,0.8044776119402985,0.8021957954640414,65.59244751930237,0.8021957954640414
125,5,AdaBoost (Real),0,0.25,0.744776119402985,0.7364860098850317,79.02884650230408,0.7364860098850317
126,5,Logistic Regression (Penalty = L2),0,0.25,0.8164179104477612,0.8111007372678287,0.7777323722839355,0.8111007372678287
127,5,Naive Bayes,0,0.25,0.8313432835820895,0.828126406624036,0.12852764129638672,0.828126406624036
128,5,KNeighbors Classifier,1,0.25,0.9149253731343283,0.9131288911783129,0.45912742614746094,0.9131288911783129
129,5,SVC Classifier,1,0.25,0.7985074626865671,0.7855226264835,1.900284767150879,0.7855226264835
130,5,Decision Tree,1,0.25,0.7492537313432835,0.7452235386092534,0.15059757232666016,0.7452235386092534
131,5,RandomForest,1,0.25,0.6582089552238806,0.6431903150901259,0.7040026187896729,0.6431903150901259
132,5,AdaBoost (Discrete),1,0.25,0.8238805970149253,0.8227368573573617,67.3029100894928,0.8227368573573617
133,5,AdaBoost (Real),1,0.25,0.5686567164179105,0.520003559096455,80.40500140190125,0.520003559096455
134,5,Logistic Regression (Penalty = L2),1,0.25,0.8373134328358209,0.8338696028796799,0.6556482315063477,0.8338696028796799
135,5,Naive Bayes,1,0.25,0.8626865671641791,0.8609356302977677,0.14716839790344238,0.8609356302977677
136,5,KNeighbors Classifier,2,0.25,0.9166666666666666,0.915176024213466,0.4801056385040283,0.915176024213466
137,5,SVC Classifier,2,0.25,0.7863636363636364,0.77554776264295,2.2542779445648193,0.77554776264295
138,5,Decision Tree,2,0.25,0.7666666666666667,0.7630828659027662,0.0820322036743164,0.7630828659027662
139,5,RandomForest,2,0.25,0.6242424242424243,0.5975367744555691,0.624812126159668,0.5975367744555691
140,5,AdaBoost (Discrete),2,0.25,0.8303030303030303,0.8279369925225761,68.78600597381592,0.8279369925225761
141,5,AdaBoost (Real),2,0.25,0.746969696969697,0.7342374556607373,77.74239897727966,0.7342374556607373
142,5,Logistic Regression (Penalty = L2),2,0.25,0.853030303030303,0.8502086505861517,0.6305127143859863,0.8502086505861517
143,5,Naive Bayes,2,0.25,0.8469696969696969,0.8447706292554962,0.16745805740356445,0.8447706292554962
144,6,KNeighbors Classifier,0,0.25,0.9074626865671642,0.9058162207478092,0.45056772232055664,0.9058162207478092
145,6,SVC Classifier,0,0.25,0.7761194029850746,0.7673186205945781,2.1509439945220947,0.7673186205945781
146,6,Decision Tree,0,0.25,0.7268656716417911,0.7240709196305459,0.1581883430480957,0.7240709196305459
147,6,RandomForest,0,0.25,0.664179104477612,0.627029307609129,0.6257927417755127,0.627029307609129
148,6,AdaBoost (Discrete),0,0.25,0.7955223880597015,0.7916400160768774,65.32826948165894,0.7916400160768774
149,6,AdaBoost (Real),0,0.25,0.7283582089552239,0.7156517178837927,77.92577338218689,0.7156517178837927
150,6,Logistic Regression (Penalty = L2),0,0.25,0.8283582089552238,0.8262552930287725,0.7623357772827148,0.8262552930287725
151,6,Naive Bayes,0,0.25,0.8402985074626865,0.8388594137676693,0.17514729499816895,0.8388594137676693
152,6,KNeighbors Classifier,1,0.25,0.9119402985074627,0.9108198826715695,0.40288853645324707,0.9108198826715695
153,6,SVC Classifier,1,0.25,0.7656716417910447,0.756810432245272,2.1974055767059326,0.756810432245272
154,6,Decision Tree,1,0.25,0.744776119402985,0.7411807877166934,0.1516721248626709,0.7411807877166934
155,6,RandomForest,1,0.25,0.7029850746268657,0.6910790615181104,0.6767909526824951,0.6910790615181104
156,6,AdaBoost (Discrete),1,0.25,0.8253731343283582,0.822029629740154,64.40882444381714,0.822029629740154
157,6,AdaBoost (Real),1,0.25,0.42686567164179107,0.40056852969298196,77.21593451499939,0.0
158,6,Logistic Regression (Penalty = L2),1,0.25,0.8492537313432836,0.8470906736405727,0.5852699279785156,0.8470906736405727
159,6,Naive Bayes,1,0.25,0.8477611940298507,0.845263775273556,0.18013858795166016,0.845263775273556
160,6,KNeighbors Classifier,2,0.25,0.9136363636363637,0.9130249071595132,0.4581449031829834,0.9130249071595132
161,6,SVC Classifier,2,0.25,0.8242424242424242,0.820837785668825,2.019226551055908,0.820837785668825
162,6,Decision Tree,2,0.25,0.7893939393939394,0.7871920952897122,0.16333889961242676,0.7871920952897122
163,6,RandomForest,2,0.25,0.6803030303030303,0.6203592653704444,0.7650110721588135,0.6203592653704444
164,6,AdaBoost (Discrete),2,0.25,0.8363636363636363,0.830643879051682,65.51552486419678,0.830643879051682
165,6,AdaBoost (Real),2,0.25,0.7924242424242425,0.787950046995884,79.5412826538086,0.787950046995884
166,6,Logistic Regression (Penalty = L2),2,0.25,0.8651515151515151,0.8638514635321992,0.6102981567382812,0.8638514635321992
167,6,Naive Bayes,2,0.25,0.8909090909090909,0.889721439091101,0.14420127868652344,0.889721439091101
168,7,KNeighbors Classifier,0,0.25,0.8149253731343283,0.8067820706628155,0.37972092628479004,0.8067820706628155
169,7,SVC Classifier,0,0.25,0.691044776119403,0.6202918889026913,1.8502564430236816,0.6202918889026913
170,7,Decision Tree,0,0.25,0.6671641791044776,0.6552813213480183,0.09038805961608887,0.6552813213480183
171,7,RandomForest,0,0.25,0.6447761194029851,0.5334593015361562,0.5411970615386963,0.5334593015361562
172,7,AdaBoost (Discrete),0,0.25,0.7238805970149254,0.7183355978442723,57.41587042808533,0.7183355978442723
173,7,AdaBoost (Real),0,0.25,0.6850746268656717,0.6683648112012186,70.65348291397095,0.6683648112012186
174,7,Logistic Regression (Penalty = L2),0,0.25,0.7522388059701492,0.7343560275467594,0.6303675174713135,0.7343560275467594
175,7,Naive Bayes,0,0.25,0.7597014925373134,0.7430350111362278,0.15932083129882812,0.7430350111362278
176,7,KNeighbors Classifier,1,0.25,0.8328358208955224,0.8273820699896774,0.4020209312438965,0.8273820699896774
177,7,SVC Classifier,1,0.25,0.7089552238805971,0.6491020234574975,1.8194475173950195,0.6491020234574975
178,7,Decision Tree,1,0.25,0.6671641791044776,0.6566156667437666,0.1500847339630127,0.6566156667437666
179,7,RandomForest,1,0.25,0.5880597014925373,0.47369686568795755,0.6237673759460449,0.47369686568795755
180,7,AdaBoost (Discrete),1,0.25,0.735820895522388,0.7285799147272813,57.70171785354614,0.7285799147272813
181,7,AdaBoost (Real),1,0.25,0.5417910447761194,0.4975263066157119,69.94044375419617,0.4975263066157119
182,7,Logistic Regression (Penalty = L2),1,0.25,0.764179104477612,0.7454637005398148,0.5389204025268555,0.7454637005398148
183,7,Naive Bayes,1,0.25,0.7761194029850746,0.7615977178244447,0.16349482536315918,0.7615977178244447
184,7,KNeighbors Classifier,2,0.25,0.8424242424242424,0.8385639578910554,0.38371849060058594,0.8385639578910554
185,7,SVC Classifier,2,0.25,0.7075757575757575,0.6654608016456206,1.861675500869751,0.6654608016456206
186,7,Decision Tree,2,0.25,0.6606060606060606,0.6479647444409473,0.07654380798339844,0.6479647444409473
187,7,RandomForest,2,0.25,0.5621212121212121,0.43385908085881897,0.615211009979248,0.43385908085881897
188,7,AdaBoost (Discrete),2,0.25,0.7742424242424243,0.7690783749823354,57.762025356292725,0.7690783749823354
189,7,AdaBoost (Real),2,0.25,0.6909090909090909,0.669395802547399,69.53093981742859,0.669395802547399
190,7,Logistic Regression (Penalty = L2),2,0.25,0.7848484848484848,0.7741976793173131,0.5834212303161621,0.7741976793173131
191,7,Naive Bayes,2,0.25,0.7727272727272727,0.7626964760352568,0.1479642391204834,0.7626964760352568
192,8,KNeighbors Classifier,0,0.25,0.9044776119402985,0.9015503752388687,0.512871265411377,0.9015503752388687
193,8,SVC Classifier,0,0.25,0.7940298507462686,0.7841034823366086,2.1290318965911865,0.7841034823366086
194,8,Decision Tree,0,0.25,0.6955223880597015,0.6883836748970967,0.07767105102539062,0.6883836748970967
195,8,RandomForest,0,0.25,0.6626865671641791,0.604847458733136,0.6841850280761719,0.604847458733136
196,8,AdaBoost (Discrete),0,0.25,0.8149253731343283,0.8123442232723257,70.07962894439697,0.8123442232723257
197,8,AdaBoost (Real),0,0.25,0.6522388059701493,0.6313080060923649,82.79080319404602,0.6313080060923649
198,8,Logistic Regression (Penalty = L2),0,0.25,0.8208955223880597,0.8157111749996673,0.6252639293670654,0.8157111749996673
199,8,Naive Bayes,0,0.25,0.8507462686567164,0.848289697461899,0.15304994583129883,0.848289697461899
200,8,KNeighbors Classifier,1,0.25,0.9074626865671642,0.9063533739677091,0.6301250457763672,0.9063533739677091
201,8,SVC Classifier,1,0.25,0.7955223880597015,0.7876105142177797,1.9663941860198975,0.7876105142177797
202,8,Decision Tree,1,0.25,0.7104477611940299,0.7035683920566916,0.15060925483703613,0.7035683920566916
203,8,RandomForest,1,0.25,0.6761194029850747,0.6452267798335558,0.6983380317687988,0.6452267798335558
204,8,AdaBoost (Discrete),1,0.25,0.8029850746268656,0.798603199945036,70.92736315727234,0.798603199945036
205,8,AdaBoost (Real),1,0.25,0.44328358208955226,0.4491458524066684,81.51630115509033,0.0
206,8,Logistic Regression (Penalty = L2),1,0.25,0.8253731343283582,0.8224179353805563,0.6767723560333252,0.8224179353805563
207,8,Naive Bayes,1,0.25,0.8507462686567164,0.8480773948407879,0.15568280220031738,0.8480773948407879
208,8,KNeighbors Classifier,2,0.25,0.9136363636363637,0.9127851815866549,0.5344843864440918,0.9127851815866549
209,8,SVC Classifier,2,0.25,0.8151515151515152,0.8110198507314262,2.2311623096466064,0.8110198507314262
210,8,Decision Tree,2,0.25,0.7212121212121212,0.7139402763759062,0.13803505897521973,0.7139402763759062
211,8,RandomForest,2,0.25,0.6530303030303031,0.5951235112944666,0.6482658386230469,0.5951235112944666
212,8,AdaBoost (Discrete),2,0.25,0.8348484848484848,0.8290677855694808,70.64164018630981,0.8290677855694808
213,8,AdaBoost (Real),2,0.25,0.7272727272727273,0.7155092792203175,82.54698038101196,0.7155092792203175
214,8,Logistic Regression (Penalty = L2),2,0.25,0.8348484848484848,0.8320770581377505,0.6723668575286865,0.8320770581377505
215,8,Naive Bayes,2,0.25,0.8787878787878788,0.8780476314858481,0.16420865058898926,0.8780476314858481
216,9,KNeighbors Classifier,0,0.25,0.844776119402985,0.8368754657722227,0.6138875484466553,0.8368754657722227
217,9,SVC Classifier,0,0.25,0.744776119402985,0.6954193090861013,2.02768611907959,0.6954193090861013
218,9,Decision Tree,0,0.25,0.6611940298507463,0.6568891045161562,0.15601706504821777,0.6568891045161562
219,9,RandomForest,0,0.25,0.5597014925373134,0.5060853710130494,0.7549951076507568,0.5060853710130494
220,9,AdaBoost (Discrete),0,0.25,0.7582089552238805,0.7487236641512599,66.64638710021973,0.7487236641512599
221,9,AdaBoost (Real),0,0.25,0.7059701492537314,0.6948177277519303,78.64953351020813,0.6948177277519303
222,9,Logistic Regression (Penalty = L2),0,0.25,0.7671641791044777,0.752692158893589,0.5984804630279541,0.752692158893589
223,9,Naive Bayes,0,0.25,0.7925373134328358,0.78084216881882,0.2130908966064453,0.78084216881882
224,9,KNeighbors Classifier,1,0.25,0.8522388059701492,0.8471532644212489,0.4724924564361572,0.8471532644212489
225,9,SVC Classifier,1,0.25,0.7686567164179104,0.7270951859745429,2.0063018798828125,0.7270951859745429
226,9,Decision Tree,1,0.25,0.6761194029850747,0.6680236959247161,0.15044856071472168,0.6680236959247161
227,9,RandomForest,1,0.25,0.6179104477611941,0.5871948013541186,0.6808643341064453,0.5871948013541186
228,9,AdaBoost (Discrete),1,0.25,0.7164179104477612,0.6992602890541668,66.76873755455017,0.6992602890541668
229,9,AdaBoost (Real),1,0.25,0.6686567164179105,0.6486801619194797,77.67555093765259,0.6486801619194797
230,9,Logistic Regression (Penalty = L2),1,0.25,0.7865671641791044,0.7728587665728684,0.6071524620056152,0.7728587665728684
231,9,Naive Bayes,1,0.25,0.8119402985074626,0.802808064329113,0.14835476875305176,0.802808064329113
232,9,KNeighbors Classifier,2,0.25,0.8454545454545455,0.8418758136868952,0.6070866584777832,0.8418758136868952
233,9,SVC Classifier,2,0.25,0.7515151515151515,0.7256247129393143,2.195882797241211,0.7256247129393143
234,9,Decision Tree,2,0.25,0.7242424242424242,0.7160962085495017,0.15220165252685547,0.7160962085495017
235,9,RandomForest,2,0.25,0.6545454545454545,0.619928653560279,0.6842548847198486,0.619928653560279
236,9,AdaBoost (Discrete),2,0.25,0.8090909090909091,0.8047347893993043,67.26320338249207,0.8047347893993043
237,9,AdaBoost (Real),2,0.25,0.48484848484848486,0.37581326676570165,77.59513115882874,0.37581326676570165
238,9,Logistic Regression (Penalty = L2),2,0.25,0.7984848484848485,0.7906203007034835,0.6470015048980713,0.7906203007034835
239,9,Naive Bayes,2,0.25,0.8272727272727273,0.8198950458374505,0.14760303497314453,0.8198950458374505
240,10,KNeighbors Classifier,0,0.25,0.9537313432835821,0.9529924994860821,1.0649092197418213,0.9529924994860821
241,10,SVC Classifier,0,0.25,0.8746268656716418,0.8730914801489201,2.699862480163574,0.8730914801489201
242,10,Decision Tree,0,0.25,0.7179104477611941,0.716102014236454,0.15228962898254395,0.716102014236454
243,10,RandomForest,0,0.25,0.6582089552238806,0.622119663874186,0.6842119693756104,0.622119663874186
244,10,AdaBoost (Discrete),0,0.25,0.9104477611940298,0.908859504083978,97.95347905158997,0.908859504083978
245,10,AdaBoost (Real),0,0.25,0.8880597014925373,0.8868518440501955,106.32497787475586,0.8868518440501955
246,10,Logistic Regression (Penalty = L2),0,0.25,0.9208955223880597,0.9203192434079255,0.8662326335906982,0.9203192434079255
247,10,Naive Bayes,0,0.25,0.9029850746268657,0.9021561160268208,0.2089686393737793,0.9021561160268208
248,10,KNeighbors Classifier,1,0.25,0.9597014925373134,0.9593489809636385,1.0724525451660156,0.9593489809636385
249,10,SVC Classifier,1,0.25,0.8776119402985074,0.8754831487606671,2.53421688079834,0.8754831487606671
250,10,Decision Tree,1,0.25,0.7671641791044777,0.7633613022329993,0.12894558906555176,0.7633613022329993
251,10,RandomForest,1,0.25,0.6701492537313433,0.6205709271747387,0.6573874950408936,0.6205709271747387
252,10,AdaBoost (Discrete),1,0.25,0.9074626865671642,0.9065444975839576,93.51441264152527,0.9065444975839576
253,10,AdaBoost (Real),1,0.25,0.8582089552238806,0.8566093948280744,106.04035520553589,0.8566093948280744
254,10,Logistic Regression (Penalty = L2),1,0.25,0.9253731343283582,0.9243443291501865,0.9112598896026611,0.9243443291501865
255,10,Naive Bayes,1,0.25,0.9074626865671642,0.9064069665432959,0.14021682739257812,0.9064069665432959
256,10,KNeighbors Classifier,2,0.25,0.9590909090909091,0.9587055487980704,1.1484646797180176,0.9587055487980704
257,10,SVC Classifier,2,0.25,0.8924242424242425,0.8909526952687821,2.534048557281494,0.8909526952687821
258,10,Decision Tree,2,0.25,0.7727272727272727,0.7693283386898526,0.20903229713439941,0.7693283386898526
259,10,RandomForest,2,0.25,0.6378787878787879,0.5344133103257618,0.6500005722045898,0.5344133103257618
260,10,AdaBoost (Discrete),2,0.25,0.906060606060606,0.9046033974776427,94.70872974395752,0.9046033974776427
261,10,AdaBoost (Real),2,0.25,0.8606060606060606,0.8582315310359853,101.97403645515442,0.8582315310359853
262,10,Logistic Regression (Penalty = L2),2,0.25,0.9212121212121213,0.9206179813747197,0.8886582851409912,0.9206179813747197
263,10,Naive Bayes,2,0.25,0.9227272727272727,0.9222723757853579,0.14514374732971191,0.9222723757853579
264,11,KNeighbors Classifier,0,0.25,0.9701492537313433,0.9698262205796493,2.3185250759124756,0.9698262205796493
265,11,SVC Classifier,0,0.25,0.917910447761194,0.9173202439834804,3.480947971343994,0.9173202439834804
266,11,Decision Tree,0,0.25,0.7343283582089553,0.7271122925417599,0.14722418785095215,0.7271122925417599
267,11,RandomForest,0,0.25,0.6477611940298508,0.573720487463853,0.7264273166656494,0.573720487463853
268,11,AdaBoost (Discrete),0,0.25,0.9238805970149254,0.9232357511539399,133.73849081993103,0.9232357511539399
269,11,AdaBoost (Real),0,0.25,0.8850746268656716,0.884677604622106,133.09809732437134,0.884677604622106
270,11,Logistic Regression (Penalty = L2),0,0.25,0.9417910447761194,0.9409988812092909,1.2182366847991943,0.9409988812092909
271,11,Naive Bayes,0,0.25,0.9432835820895522,0.9428397277767901,0.1870424747467041,0.9428397277767901
272,11,KNeighbors Classifier,1,0.25,0.9567164179104478,0.9561376886071324,2.1240785121917725,0.9561376886071324
273,11,SVC Classifier,1,0.25,0.9104477611940298,0.9093810152216848,3.10593843460083,0.9093810152216848
274,11,Decision Tree,1,0.25,0.764179104477612,0.7568956475310815,0.1285383701324463,0.7568956475310815
275,11,RandomForest,1,0.25,0.6835820895522388,0.6467965016754191,0.6874253749847412,0.6467965016754191
276,11,AdaBoost (Discrete),1,0.25,0.926865671641791,0.9263761315979071,128.10780239105225,0.9263761315979071
277,11,AdaBoost (Real),1,0.25,0.37910447761194027,0.3084757831224543,129.03621172904968,0.0
278,11,Logistic Regression (Penalty = L2),1,0.25,0.935820895522388,0.9346080827410735,1.0913355350494385,0.9346080827410735
279,11,Naive Bayes,1,0.25,0.935820895522388,0.9351965303042574,0.1448228359222412,0.9351965303042574
280,11,KNeighbors Classifier,2,0.25,0.9621212121212122,0.9617799257477707,1.9503259658813477,0.9617799257477707
281,11,SVC Classifier,2,0.25,0.9151515151515152,0.9137693535836586,2.8840436935424805,0.9137693535836586
282,11,Decision Tree,2,0.25,0.7212121212121212,0.7167182371129354,0.17360806465148926,0.7167182371129354
283,11,RandomForest,2,0.25,0.693939393939394,0.6596062060383472,0.5975711345672607,0.6596062060383472
284,11,AdaBoost (Discrete),2,0.25,0.9409090909090909,0.940326764949791,120.99280953407288,0.940326764949791
285,11,AdaBoost (Real),2,0.25,0.8909090909090909,0.8897450789472053,127.45071125030518,0.8897450789472053
286,11,Logistic Regression (Penalty = L2),2,0.25,0.946969696969697,0.9467707905532424,1.1456482410430908,0.9467707905532424
287,11,Naive Bayes,2,0.25,0.9363636363636364,0.9361245884820678,0.16349315643310547,0.9361245884820678
288,12,KNeighbors Classifier,0,0.25,0.7089552238805971,0.6852862396964207,0.18745660781860352,0.6852862396964207
289,12,SVC Classifier,0,0.25,0.6059701492537314,0.5127250787881816,1.3414480686187744,0.5127250787881816
290,12,Decision Tree,0,0.25,0.6417910447761194,0.630021607289353,0.11832880973815918,0.630021607289353
291,12,RandomForest,0,0.25,0.5208955223880597,0.583655839496986,0.5382139682769775,0.0
292,12,AdaBoost (Discrete),0,0.25,0.6477611940298508,0.630512632625876,39.71038103103638,0.630512632625876
293,12,AdaBoost (Real),0,0.25,0.49850746268656715,0.4314151643797278,50.861109018325806,0.4314151643797278
294,12,Logistic Regression (Penalty = L2),0,0.25,0.6850746268656717,0.6586969494592391,0.4737582206726074,0.6586969494592391
295,12,Naive Bayes,0,0.25,0.6880597014925374,0.6666301983199645,0.06521725654602051,0.6666301983199645
296,12,KNeighbors Classifier,1,0.25,0.7089552238805971,0.6856247138188102,0.17751002311706543,0.6856247138188102
297,12,SVC Classifier,1,0.25,0.6402985074626866,0.5779250696065511,1.2242016792297363,0.5779250696065511
298,12,Decision Tree,1,0.25,0.6074626865671642,0.5899365475478188,0.06062769889831543,0.5899365475478188
299,12,RandomForest,1,0.25,0.5656716417910448,0.4465024607898642,0.42120814323425293,0.0
300,12,AdaBoost (Discrete),1,0.25,0.6119402985074627,0.5848564457979286,39.97966527938843,0.5848564457979286
301,12,AdaBoost (Real),1,0.25,0.42388059701492536,0.3593828804090912,50.20573592185974,0.3593828804090912
302,12,Logistic Regression (Penalty = L2),1,0.25,0.6746268656716418,0.6486773451702557,0.487499475479126,0.6486773451702557
303,12,Naive Bayes,1,0.25,0.7059701492537314,0.685803740372568,0.12228775024414062,0.685803740372568
304,12,KNeighbors Classifier,2,0.25,0.7560606060606061,0.7368179906758393,0.1862480640411377,0.7368179906758393
305,12,SVC Classifier,2,0.25,0.6530303030303031,0.5997069820133321,1.330418586730957,0.5997069820133321
306,12,Decision Tree,2,0.25,0.6484848484848484,0.6228783497567479,0.11753225326538086,0.6228783497567479
307,12,RandomForest,2,0.25,0.509090909090909,0.34521437099405156,0.42946910858154297,0.0
308,12,AdaBoost (Discrete),2,0.25,0.6954545454545454,0.6829624637655832,40.17043447494507,0.6829624637655832
309,12,AdaBoost (Real),2,0.25,0.5227272727272727,0.46792657607172816,52.00546717643738,0.46792657607172816
310,12,Logistic Regression (Penalty = L2),2,0.25,0.6848484848484848,0.6609776502307186,0.45612144470214844,0.6609776502307186
311,12,Naive Bayes,2,0.25,0.7181818181818181,0.7040604683823851,0.13580560684204102,0.7040604683823851
