,feat_set_id,classifier,fold_id,feat_th,score,geo_score,exec_t,geo_score_woz
0,0,KNeighbors Classifier,0,0.6,0.808955223880597,0.784325049132902,6.543318510055542,0.784325049132902
1,0,SVC Classifier,0,0.6,0.764179104477612,0.7359646151202635,7.986274480819702,0.7359646151202635
2,0,Decision Tree,0,0.6,0.6955223880597015,0.6767172943080605,0.40523600578308105,0.6767172943080605
3,0,RandomForest,0,0.6,0.6447761194029851,0.5621909406980756,1.520399570465088,0.5621909406980756
4,0,AdaBoost (Discrete),0,0.6,0.7626865671641792,0.7476222563592074,416.59381580352783,0.7476222563592074
5,0,AdaBoost (Real),0,0.6,0.5313432835820896,0.34048298349319206,474.33670258522034,0.34048298349319206
6,0,Logistic Regression (Penalty = L2),0,0.6,0.8,0.7784030373014326,4.226425647735596,0.7784030373014326
7,0,Naive Bayes,0,0.6,0.7776119402985074,0.7553382611657645,0.601588249206543,0.7553382611657645
8,0,KNeighbors Classifier,1,0.6,0.826865671641791,0.7933867905400419,7.945078611373901,0.7933867905400419
9,0,SVC Classifier,1,0.6,0.7701492537313432,0.7414187298351547,9.60854959487915,0.7414187298351547
10,0,Decision Tree,1,0.6,0.6611940298507463,0.6407007867862786,0.4593198299407959,0.6407007867862786
11,0,RandomForest,1,0.6,0.6164179104477612,0.5543872039035859,1.7987675666809082,0.5543872039035859
12,0,AdaBoost (Discrete),1,0.6,0.7582089552238805,0.7450841097584372,469.35479736328125,0.7450841097584372
13,0,AdaBoost (Real),1,0.6,0.5358208955223881,0.47889850553161817,508.59664130210876,0.47889850553161817
14,0,Logistic Regression (Penalty = L2),1,0.6,0.8074626865671641,0.7926298897777809,4.529799699783325,0.7926298897777809
15,0,Naive Bayes,1,0.6,0.7597014925373134,0.7294307320522215,0.610537052154541,0.7294307320522215
16,0,KNeighbors Classifier,2,0.6,0.8151515151515152,0.784192393992467,9.070573091506958,0.784192393992467
17,0,SVC Classifier,2,0.6,0.7984848484848485,0.7778244916773007,8.054019689559937,0.7778244916773007
18,0,Decision Tree,2,0.6,0.6515151515151515,0.6254379623372247,0.41082239151000977,0.6254379623372247
19,0,RandomForest,2,0.6,0.6439393939393939,0.4998275277149559,1.4878110885620117,0.4998275277149559
20,0,AdaBoost (Discrete),2,0.6,0.7606060606060606,0.7462971310212181,491.7902410030365,0.7462971310212181
21,0,AdaBoost (Real),2,0.6,0.5227272727272727,0.3659573059248257,480.01880264282227,0.0
22,0,Logistic Regression (Penalty = L2),2,0.6,0.8136363636363636,0.7893114535427849,4.893102407455444,0.7893114535427849
23,0,Naive Bayes,2,0.6,0.7818181818181819,0.7615447196326811,0.613680362701416,0.7615447196326811
24,1,KNeighbors Classifier,0,0.6,0.8074626865671641,0.7773289766487305,8.30489706993103,0.7773289766487305
25,1,SVC Classifier,0,0.6,0.7597014925373134,0.7348632136119025,9.532195568084717,0.7348632136119025
26,1,Decision Tree,0,0.6,0.6805970149253732,0.6599870217157608,0.4651796817779541,0.6599870217157608
27,1,RandomForest,0,0.6,0.6447761194029851,0.5621909406980756,1.9911134243011475,0.5621909406980756
28,1,AdaBoost (Discrete),0,0.6,0.7686567164179104,0.7543262654825464,468.67886900901794,0.7543262654825464
29,1,AdaBoost (Real),0,0.6,0.5313432835820896,0.34048298349319206,465.4170091152191,0.34048298349319206
30,1,Logistic Regression (Penalty = L2),0,0.6,0.808955223880597,0.7912963751005396,4.020824193954468,0.7912963751005396
31,1,Naive Bayes,0,0.6,0.7656716417910447,0.7418310840984773,0.4801630973815918,0.7418310840984773
32,1,KNeighbors Classifier,1,0.6,0.835820895522388,0.8129482155276093,7.496121168136597,0.8129482155276093
33,1,SVC Classifier,1,0.6,0.7716417910447761,0.7397957912175477,8.869993209838867,0.7397957912175477
34,1,Decision Tree,1,0.6,0.6626865671641791,0.6394070981126351,0.5580723285675049,0.6394070981126351
35,1,RandomForest,1,0.6,0.5985074626865672,0.5390057026553728,1.6194696426391602,0.5390057026553728
36,1,AdaBoost (Discrete),1,0.6,0.7388059701492538,0.7211413874928844,430.28410029411316,0.7211413874928844
37,1,AdaBoost (Real),1,0.6,0.6970149253731344,0.6763946933562804,445.63570618629456,0.6763946933562804
38,1,Logistic Regression (Penalty = L2),1,0.6,0.8104477611940298,0.7932437306639151,4.178220510482788,0.7932437306639151
39,1,Naive Bayes,1,0.6,0.7611940298507462,0.7372353140693066,0.44083690643310547,0.7372353140693066
40,1,KNeighbors Classifier,2,0.6,0.8212121212121212,0.7904964299739407,8.172022104263306,0.7904964299739407
41,1,SVC Classifier,2,0.6,0.793939393939394,0.7733557632902612,9.267255544662476,0.7733557632902612
42,1,Decision Tree,2,0.6,0.7166666666666667,0.6968860405334951,0.4279446601867676,0.6968860405334951
43,1,RandomForest,2,0.6,0.6439393939393939,0.4998275277149559,1.7704582214355469,0.4998275277149559
44,1,AdaBoost (Discrete),2,0.6,0.7727272727272727,0.7407610691045011,421.9587559700012,0.7407610691045011
45,1,AdaBoost (Real),2,0.6,0.5924242424242424,0.531339783974768,363.0372579097748,0.531339783974768
46,1,Logistic Regression (Penalty = L2),2,0.6,0.8348484848484848,0.8147824893370037,4.110378265380859,0.8147824893370037
47,1,Naive Bayes,2,0.6,0.7818181818181819,0.7635505870115996,0.2668018341064453,0.7635505870115996
48,2,KNeighbors Classifier,0,0.6,0.7955223880597015,0.7657930937621003,7.003735780715942,0.7657930937621003
49,2,SVC Classifier,0,0.6,0.7597014925373134,0.7378827152048278,8.295752763748169,0.7378827152048278
50,2,Decision Tree,0,0.6,0.6597014925373135,0.6369220028935183,0.4078378677368164,0.6369220028935183
51,2,RandomForest,0,0.6,0.6283582089552239,0.6212206826286458,1.4611945152282715,0.0
52,2,AdaBoost (Discrete),0,0.6,0.7671641791044777,0.7481749947937953,1464.98881483078,0.7481749947937953
53,2,AdaBoost (Real),0,0.6,0.5328358208955224,0.34108615761380573,341.0699415206909,0.34108615761380573
54,2,Logistic Regression (Penalty = L2),0,0.6,0.8149253731343283,0.8027196553128494,3.002169132232666,0.8027196553128494
55,2,Naive Bayes,0,0.6,0.7611940298507462,0.7365829619298112,0.30530238151550293,0.7365829619298112
56,2,KNeighbors Classifier,1,0.6,0.8164179104477612,0.7839041897532982,5.583148002624512,0.7839041897532982
57,2,SVC Classifier,1,0.6,0.7701492537313432,0.7335241207063734,7.055596590042114,0.7335241207063734
58,2,Decision Tree,1,0.6,0.6447761194029851,0.625809136271405,0.33088064193725586,0.625809136271405
59,2,RandomForest,1,0.6,0.6432835820895523,0.6306971944516256,1.2099835872650146,0.0
60,2,AdaBoost (Discrete),1,0.6,0.7611940298507462,0.7466576904644371,311.9867706298828,0.7466576904644371
61,2,AdaBoost (Real),1,0.6,0.6865671641791045,0.6552234679358723,287.333669424057,0.6552234679358723
62,2,Logistic Regression (Penalty = L2),1,0.6,0.8059701492537313,0.7863847808676824,2.3913958072662354,0.7863847808676824
63,2,Naive Bayes,1,0.6,0.7746268656716417,0.7503972807774053,0.2752652168273926,0.7503972807774053
64,2,KNeighbors Classifier,2,0.6,0.8196969696969697,0.7826249497336718,4.663163423538208,0.7826249497336718
65,2,SVC Classifier,2,0.6,0.7878787878787878,0.7570127546903956,5.728768825531006,0.7570127546903956
66,2,Decision Tree,2,0.6,0.6848484848484848,0.6620554467457835,0.27634191513061523,0.6620554467457835
67,2,RandomForest,2,0.6,0.6530303030303031,0.361418819882627,1.007155418395996,0.361418819882627
68,2,AdaBoost (Discrete),2,0.6,0.7712121212121212,0.7537735904768237,271.85060477256775,0.7537735904768237
69,2,AdaBoost (Real),2,0.6,0.49696969696969695,0.33938189736743196,270.97280764579773,0.0
70,2,Logistic Regression (Penalty = L2),2,0.6,0.8151515151515152,0.7880426885216705,2.595593214035034,0.7880426885216705
71,2,Naive Bayes,2,0.6,0.7818181818181819,0.7606841816073482,0.2698495388031006,0.7606841816073482
72,3,KNeighbors Classifier,0,0.6,0.808955223880597,0.7803547594312854,3.6183218955993652,0.7803547594312854
73,3,SVC Classifier,0,0.6,0.7716417910447761,0.7480217633100205,4.887395858764648,0.7480217633100205
74,3,Decision Tree,0,0.6,0.6776119402985075,0.6539958937802546,0.2880420684814453,0.6539958937802546
75,3,RandomForest,0,0.6,0.6388059701492538,0.4876546469829893,1.2338180541992188,0.4876546469829893
76,3,AdaBoost (Discrete),0,0.6,0.7626865671641792,0.7413705589140078,227.68561625480652,0.7413705589140078
77,3,AdaBoost (Real),0,0.6,0.5328358208955224,0.34108615761380573,232.38505911827087,0.34108615761380573
78,3,Logistic Regression (Penalty = L2),0,0.6,0.8074626865671641,0.7915104648464465,1.9893779754638672,0.7915104648464465
79,3,Naive Bayes,0,0.6,0.7761194029850746,0.7527188089148061,0.24313569068908691,0.7527188089148061
80,3,KNeighbors Classifier,1,0.6,0.8164179104477612,0.7786831311905308,3.5141632556915283,0.7786831311905308
81,3,SVC Classifier,1,0.6,0.7835820895522388,0.7555074034412509,4.361253499984741,0.7555074034412509
82,3,Decision Tree,1,0.6,0.6373134328358209,0.6090788272740358,0.2557845115661621,0.6090788272740358
83,3,RandomForest,1,0.6,0.6223880597014926,0.4441295757726447,0.9784479141235352,0.4441295757726447
84,3,AdaBoost (Discrete),1,0.6,0.7686567164179104,0.7527976981850687,193.53675079345703,0.7527976981850687
85,3,AdaBoost (Real),1,0.6,0.6970149253731344,0.6755473732704762,180.9889838695526,0.6755473732704762
86,3,Logistic Regression (Penalty = L2),1,0.6,0.8134328358208955,0.7979632900067177,1.9081132411956787,0.7979632900067177
87,3,Naive Bayes,1,0.6,0.7716417910447761,0.7456746886859478,0.251788854598999,0.7456746886859478
88,3,KNeighbors Classifier,2,0.6,0.8181818181818182,0.7768614821493544,3.2689342498779297,0.7768614821493544
89,3,SVC Classifier,2,0.6,0.796969696969697,0.7764053105685749,4.234759092330933,0.7764053105685749
90,3,Decision Tree,2,0.6,0.6909090909090909,0.6657292223064875,0.15931272506713867,0.6657292223064875
91,3,RandomForest,2,0.6,0.6742424242424242,0.6240854194022011,0.7742652893066406,0.6240854194022011
92,3,AdaBoost (Discrete),2,0.6,0.7787878787878788,0.7670098940926392,193.79615902900696,0.7670098940926392
93,3,AdaBoost (Real),2,0.6,0.5893939393939394,0.45295847731206124,180.25426411628723,0.45295847731206124
94,3,Logistic Regression (Penalty = L2),2,0.6,0.8287878787878787,0.8077992240452573,1.7936763763427734,0.8077992240452573
95,3,Naive Bayes,2,0.6,0.7863636363636364,0.7682558850511856,0.21548724174499512,0.7682558850511856
96,4,KNeighbors Classifier,0,0.6,0.8253731343283582,0.7965971950981049,2.0913679599761963,0.7965971950981049
97,4,SVC Classifier,0,0.6,0.7746268656716417,0.7525054566178434,3.141899824142456,0.7525054566178434
98,4,Decision Tree,0,0.6,0.7104477611940299,0.6919800039426459,0.22427940368652344,0.6919800039426459
99,4,RandomForest,0,0.6,0.6776119402985075,0.5594865488829572,0.7729959487915039,0.5594865488829572
100,4,AdaBoost (Discrete),0,0.6,0.7791044776119403,0.7651519694391393,164.85875248908997,0.7651519694391393
101,4,AdaBoost (Real),0,0.6,0.5328358208955224,0.34108615761380573,180.38694620132446,0.34108615761380573
102,4,Logistic Regression (Penalty = L2),0,0.6,0.8059701492537313,0.7907194657778522,1.3572962284088135,0.7907194657778522
103,4,Naive Bayes,0,0.6,0.7791044776119403,0.7566346216595055,0.17358016967773438,0.7566346216595055
104,4,KNeighbors Classifier,1,0.6,0.8298507462686567,0.8030526883157647,2.3590569496154785,0.8030526883157647
105,4,SVC Classifier,1,0.6,0.7761194029850746,0.7420128706136404,3.47808575630188,0.7420128706136404
106,4,Decision Tree,1,0.6,0.691044776119403,0.6654375018442157,0.24333572387695312,0.6654375018442157
107,4,RandomForest,1,0.6,0.6582089552238806,0.4716450929262668,0.7822883129119873,0.4716450929262668
108,4,AdaBoost (Discrete),1,0.6,0.764179104477612,0.7384609130399667,157.76170802116394,0.7384609130399667
109,4,AdaBoost (Real),1,0.6,0.573134328358209,0.47194572658323886,171.64718866348267,0.47194572658323886
110,4,Logistic Regression (Penalty = L2),1,0.6,0.8253731343283582,0.8095937175571354,1.4910922050476074,0.8095937175571354
111,4,Naive Bayes,1,0.6,0.7865671641791044,0.7588993120489195,0.21854400634765625,0.7588993120489195
112,4,KNeighbors Classifier,2,0.6,0.843939393939394,0.821780844303688,2.2529239654541016,0.821780844303688
113,4,SVC Classifier,2,0.6,0.7954545454545454,0.7743234463560933,3.5932557582855225,0.7743234463560933
114,4,Decision Tree,2,0.6,0.6863636363636364,0.6592242045496635,0.23468923568725586,0.6592242045496635
115,4,RandomForest,2,0.6,0.6575757575757576,0.5124512097317016,0.7838959693908691,0.0
116,4,AdaBoost (Discrete),2,0.6,0.7651515151515151,0.7476128664855484,155.84521317481995,0.7476128664855484
117,4,AdaBoost (Real),2,0.6,0.7545454545454545,0.7363474037728814,176.12559008598328,0.7363474037728814
118,4,Logistic Regression (Penalty = L2),2,0.6,0.8393939393939394,0.8264132191954132,1.7266614437103271,0.8264132191954132
119,4,Naive Bayes,2,0.6,0.7924242424242425,0.7757223438147287,0.1653881072998047,0.7757223438147287
120,5,KNeighbors Classifier,0,0.6,0.808955223880597,0.7815876078240853,2.638427495956421,0.7815876078240853
121,5,SVC Classifier,0,0.6,0.7686567164179104,0.7460604740042984,3.6299033164978027,0.7460604740042984
122,5,Decision Tree,0,0.6,0.6701492537313433,0.6499793442972496,0.1618664264678955,0.6499793442972496
123,5,RandomForest,0,0.6,0.6194029850746269,0.4407353980128576,0.8160994052886963,0.4407353980128576
124,5,AdaBoost (Discrete),0,0.6,0.7731343283582089,0.7574999419065344,176.40582060813904,0.7574999419065344
125,5,AdaBoost (Real),0,0.6,0.5328358208955224,0.34108615761380573,190.01843118667603,0.34108615761380573
126,5,Logistic Regression (Penalty = L2),0,0.6,0.8059701492537313,0.7918305507309921,1.4923672676086426,0.7918305507309921
127,5,Naive Bayes,0,0.6,0.7671641791044777,0.7422100659813793,0.2394390106201172,0.7422100659813793
128,5,KNeighbors Classifier,1,0.6,0.8253731343283582,0.7953920362613098,2.744779109954834,0.7953920362613098
129,5,SVC Classifier,1,0.6,0.7805970149253731,0.7428306541154421,3.7664802074432373,0.7428306541154421
130,5,Decision Tree,1,0.6,0.6746268656716418,0.643081066737502,0.15832161903381348,0.643081066737502
131,5,RandomForest,1,0.6,0.6134328358208955,0.4723475703734174,0.8866968154907227,0.4723475703734174
132,5,AdaBoost (Discrete),1,0.6,0.7626865671641792,0.7407298408513898,185.9420952796936,0.7407298408513898
133,5,AdaBoost (Real),1,0.6,0.6925373134328359,0.6628006083466256,205.39189887046814,0.6628006083466256
134,5,Logistic Regression (Penalty = L2),1,0.6,0.8208955223880597,0.8042303650853699,1.7341437339782715,0.8042303650853699
135,5,Naive Bayes,1,0.6,0.7805970149253731,0.758747540832748,0.2978401184082031,0.758747540832748
136,5,KNeighbors Classifier,2,0.6,0.8333333333333334,0.8053557227653669,2.9066598415374756,0.8053557227653669
137,5,SVC Classifier,2,0.6,0.7909090909090909,0.7691065402437833,4.097138166427612,0.7691065402437833
138,5,Decision Tree,2,0.6,0.6772727272727272,0.6546315640897813,0.25957274436950684,0.6546315640897813
139,5,RandomForest,2,0.6,0.656060606060606,0.5413794405649505,0.8683986663818359,0.5413794405649505
140,5,AdaBoost (Discrete),2,0.6,0.793939393939394,0.7792000242458742,198.83728742599487,0.7792000242458742
141,5,AdaBoost (Real),2,0.6,0.6787878787878788,0.6464276494934265,202.24321699142456,0.6464276494934265
142,5,Logistic Regression (Penalty = L2),2,0.6,0.8287878787878787,0.8107556953950159,1.7265284061431885,0.8107556953950159
143,5,Naive Bayes,2,0.6,0.7893939393939394,0.7678477871918499,0.17418956756591797,0.7678477871918499
144,6,KNeighbors Classifier,0,0.6,0.8194029850746268,0.7921434446010974,4.452825307846069,0.7921434446010974
145,6,SVC Classifier,0,0.6,0.7582089552238805,0.7311405854986397,5.197570085525513,0.7311405854986397
146,6,Decision Tree,0,0.6,0.6462686567164179,0.627647777758221,0.26074886322021484,0.627647777758221
147,6,RandomForest,0,0.6,0.655223880597015,0.6977916310180244,0.9042983055114746,0.0
148,6,AdaBoost (Discrete),0,0.6,0.7880597014925373,0.7732159839679159,247.8953981399536,0.7732159839679159
149,6,AdaBoost (Real),0,0.6,0.5313432835820896,0.34048298349319206,258.9623625278473,0.34048298349319206
150,6,Logistic Regression (Penalty = L2),0,0.6,0.8059701492537313,0.7891962833098844,2.5171549320220947,0.7891962833098844
151,6,Naive Bayes,0,0.6,0.7716417910447761,0.7492222128526463,0.3654003143310547,0.7492222128526463
152,6,KNeighbors Classifier,1,0.6,0.8208955223880597,0.797578407336083,4.203679323196411,0.797578407336083
153,6,SVC Classifier,1,0.6,0.7746268656716417,0.746805381274501,5.460119962692261,0.746805381274501
154,6,Decision Tree,1,0.6,0.6597014925373135,0.6331261907138716,0.3639950752258301,0.6331261907138716
155,6,RandomForest,1,0.6,0.6492537313432836,0.6930994943077482,1.0835509300231934,0.0
156,6,AdaBoost (Discrete),1,0.6,0.7611940298507462,0.7496877950047162,247.79926180839539,0.7496877950047162
157,6,AdaBoost (Real),1,0.6,0.7208955223880597,0.698674066640116,232.25421571731567,0.698674066640116
158,6,Logistic Regression (Penalty = L2),1,0.6,0.808955223880597,0.7908112188658388,2.350029468536377,0.7908112188658388
159,6,Naive Bayes,1,0.6,0.7716417910447761,0.747939923042563,0.30994105339050293,0.747939923042563
160,6,KNeighbors Classifier,2,0.6,0.8212121212121212,0.7873356374297086,4.171082258224487,0.7873356374297086
161,6,SVC Classifier,2,0.6,0.7954545454545454,0.7759021376150178,4.998033046722412,0.7759021376150178
162,6,Decision Tree,2,0.6,0.6606060606060606,0.6400161907865087,0.16191720962524414,0.6400161907865087
163,6,RandomForest,2,0.6,0.6909090909090909,0.6277136477783232,0.8126416206359863,0.6277136477783232
164,6,AdaBoost (Discrete),2,0.6,0.7742424242424243,0.7545398158174008,225.97059869766235,0.7545398158174008
165,6,AdaBoost (Real),2,0.6,0.5227272727272727,0.3659573059248257,236.77881002426147,0.0
166,6,Logistic Regression (Penalty = L2),2,0.6,0.8378787878787879,0.8192651576886675,2.1785075664520264,0.8192651576886675
167,6,Naive Bayes,2,0.6,0.7772727272727272,0.7557254942198336,0.29125404357910156,0.7557254942198336
168,7,KNeighbors Classifier,0,0.6,0.7776119402985074,0.7400252705245276,5.896727561950684,0.7400252705245276
169,7,SVC Classifier,0,0.6,0.7597014925373134,0.7335261259231584,6.3630287647247314,0.7335261259231584
170,7,Decision Tree,0,0.6,0.6955223880597015,0.678603400591921,0.4103736877441406,0.678603400591921
171,7,RandomForest,0,0.6,0.5865671641791045,0.5080950528107353,0.9593453407287598,0.5080950528107353
172,7,AdaBoost (Discrete),0,0.6,0.7850746268656716,0.7718016641785652,323.3181073665619,0.7718016641785652
173,7,AdaBoost (Real),0,0.6,0.5328358208955224,0.34108615761380573,316.4873077869415,0.34108615761380573
174,7,Logistic Regression (Penalty = L2),0,0.6,0.8059701492537313,0.7901467064923315,2.997055768966675,0.7901467064923315
175,7,Naive Bayes,0,0.6,0.7477611940298508,0.7209145089685922,0.3377852439880371,0.7209145089685922
176,7,KNeighbors Classifier,1,0.6,0.8059701492537313,0.7632681560674741,4.543761491775513,0.7632681560674741
177,7,SVC Classifier,1,0.6,0.7626865671641792,0.7326700361064767,4.996493577957153,0.7326700361064767
178,7,Decision Tree,1,0.6,0.6358208955223881,0.6101599701801149,0.26691198348999023,0.6101599701801149
179,7,RandomForest,1,0.6,0.5880597014925373,0.43066378292454705,0.8643934726715088,0.43066378292454705
180,7,AdaBoost (Discrete),1,0.6,0.7567164179104477,0.7344968320393424,285.93106961250305,0.7344968320393424
181,7,AdaBoost (Real),1,0.6,0.5194029850746269,0.446037937896442,293.3668518066406,0.446037937896442
182,7,Logistic Regression (Penalty = L2),1,0.6,0.7925373134328358,0.7692430871790092,2.4597067832946777,0.7692430871790092
183,7,Naive Bayes,1,0.6,0.755223880597015,0.7299713994392557,0.20583248138427734,0.7299713994392557
184,7,KNeighbors Classifier,2,0.6,0.8075757575757576,0.7817065988974851,4.814241170883179,0.7817065988974851
185,7,SVC Classifier,2,0.6,0.793939393939394,0.7470529409889869,5.592591285705566,0.7470529409889869
186,7,Decision Tree,2,0.6,0.6727272727272727,0.6431552555212559,0.25920653343200684,0.6431552555212559
187,7,RandomForest,2,0.6,0.6409090909090909,0.5219214455206367,0.9321408271789551,0.5219214455206367
188,7,AdaBoost (Discrete),2,0.6,0.7909090909090909,0.7727157640484037,262.9744064807892,0.7727157640484037
189,7,AdaBoost (Real),2,0.6,0.6409090909090909,0.5861049479148855,238.68170595169067,0.5861049479148855
190,7,Logistic Regression (Penalty = L2),2,0.6,0.8136363636363636,0.7931747410500575,2.3757762908935547,0.7931747410500575
191,7,Naive Bayes,2,0.6,0.7787878787878788,0.7560623635228176,0.2849395275115967,0.7560623635228176
192,8,KNeighbors Classifier,0,0.6,0.8238805970149253,0.7930063851468445,1.4970872402191162,0.7930063851468445
193,8,SVC Classifier,0,0.6,0.7686567164179104,0.7435538483260092,2.5364460945129395,0.7435538483260092
194,8,Decision Tree,0,0.6,0.7149253731343284,0.6915840582739068,0.12111377716064453,0.6915840582739068
195,8,RandomForest,0,0.6,0.6373134328358209,0.493586327976057,0.615056037902832,0.493586327976057
196,8,AdaBoost (Discrete),0,0.6,0.7656716417910447,0.7479461720694864,120.9389295578003,0.7479461720694864
197,8,AdaBoost (Real),0,0.6,0.5328358208955224,0.34108615761380573,126.63656735420227,0.34108615761380573
198,8,Logistic Regression (Penalty = L2),0,0.6,0.8074626865671641,0.7935775065573567,1.1185898780822754,0.7935775065573567
199,8,Naive Bayes,0,0.6,0.7791044776119403,0.757062661309818,0.12241888046264648,0.757062661309818
200,8,KNeighbors Classifier,1,0.6,0.8298507462686567,0.8027039049263672,1.4599151611328125,0.8027039049263672
201,8,SVC Classifier,1,0.6,0.7835820895522388,0.7444992711269884,2.5650250911712646,0.7444992711269884
202,8,Decision Tree,1,0.6,0.6761194029850747,0.6385646451749778,0.1779956817626953,0.6385646451749778
203,8,RandomForest,1,0.6,0.6507462686567164,0.6993744490799678,0.6117851734161377,0.0
204,8,AdaBoost (Discrete),1,0.6,0.7507462686567165,0.7279754320350089,109.70557904243469,0.7279754320350089
205,8,AdaBoost (Real),1,0.6,0.6164179104477612,0.5426112869381389,114.56370687484741,0.5426112869381389
206,8,Logistic Regression (Penalty = L2),1,0.6,0.8208955223880597,0.8030295012905603,1.0682382583618164,0.8030295012905603
207,8,Naive Bayes,1,0.6,0.7850746268656716,0.7590322982841867,0.12262511253356934,0.7590322982841867
208,8,KNeighbors Classifier,2,0.6,0.843939393939394,0.8215562544556285,1.7009170055389404,0.8215562544556285
209,8,SVC Classifier,2,0.6,0.7924242424242425,0.7713296841967106,2.375736713409424,0.7713296841967106
210,8,Decision Tree,2,0.6,0.7227272727272728,0.7022460604212387,0.11348390579223633,0.7022460604212387
211,8,RandomForest,2,0.6,0.6924242424242424,0.587236114396846,0.5577528476715088,0.587236114396846
212,8,AdaBoost (Discrete),2,0.6,0.7818181818181819,0.7672975885858947,108.68469190597534,0.7672975885858947
213,8,AdaBoost (Real),2,0.6,0.6106060606060606,0.48658856530864214,113.31879138946533,0.48658856530864214
214,8,Logistic Regression (Penalty = L2),2,0.6,0.8469696969696969,0.8350216455333066,0.9771578311920166,0.8350216455333066
215,8,Naive Bayes,2,0.6,0.7893939393939394,0.7685668613413905,0.12186884880065918,0.7685668613413905
