,feat_set_id,classifier,fold_id,feat_th,score,geo_score,exec_t,geo_score_woz
0,0,KNeighbors Classifier,0,1.0,0.5508982035928144,0.6186590484482999,0.2582573890686035,0.0
1,0,SVC Classifier,0,1.0,0.3093812375249501,1.0,0.6797122955322266,0.0
2,0,Decision Tree,0,1.0,0.4491017964071856,0.44695237055731124,0.05196738243103027,0.0
3,0,RandomForest,0,1.0,0.4590818363273453,0.39272160931414785,0.3692512512207031,0.0
4,0,AdaBoost (Discrete),0,1.0,0.48502994011976047,0.5015649344329317,26.945169925689697,0.0
5,0,AdaBoost (Real),0,1.0,0.4151696606786427,0.43073485742634726,42.699997663497925,0.0
6,0,Logistic Regression (Penalty = L2),0,1.0,0.5748502994011976,0.5400069756927316,0.44875502586364746,0.0
7,0,Naive Bayes,0,1.0,0.12574850299401197,0.29811083012713,0.09939169883728027,0.0
8,0,KNeighbors Classifier,1,1.0,0.5622489959839357,0.561440033876381,0.28345346450805664,0.0
9,0,SVC Classifier,1,1.0,0.3092369477911647,1.0,0.6306905746459961,0.0
10,0,Decision Tree,1,1.0,0.4899598393574297,0.43683353273441655,0.048198699951171875,0.0
11,0,RandomForest,1,1.0,0.4899598393574297,0.614119889206177,0.3854532241821289,0.0
12,0,AdaBoost (Discrete),1,1.0,0.5020080321285141,0.5358142065989067,24.813485622406006,0.0
13,0,AdaBoost (Real),1,1.0,0.3493975903614458,0.3752474308623361,42.85161113739014,0.0
14,0,Logistic Regression (Penalty = L2),1,1.0,0.570281124497992,0.5630004373262018,0.5080828666687012,0.0
15,0,Naive Bayes,1,1.0,0.21084337349397592,0.391297317223613,0.07486867904663086,0.0
16,0,KNeighbors Classifier,2,1.0,0.5232323232323233,0.5124358806849453,0.38392210006713867,0.0
17,0,SVC Classifier,2,1.0,0.3111111111111111,1.0,0.9625887870788574,0.0
18,0,Decision Tree,2,1.0,0.4686868686868687,0.41558056744003163,0.07517623901367188,0.0
19,0,RandomForest,2,1.0,0.45454545454545453,0.3745822585718079,0.476515531539917,0.0
20,0,AdaBoost (Discrete),2,1.0,0.48282828282828283,0.44127647915732204,34.285561323165894,0.0
21,0,AdaBoost (Real),2,1.0,0.3515151515151515,0.3350090013168959,51.58814477920532,0.3350090013168959
22,0,Logistic Regression (Penalty = L2),2,1.0,0.5717171717171717,0.5317402214183601,0.6391429901123047,0.0
23,0,Naive Bayes,2,1.0,0.13131313131313133,0.5177415417227269,0.16039061546325684,0.0
24,1,KNeighbors Classifier,0,1.0,0.5508982035928144,0.6186590484482999,0.4873378276824951,0.0
25,1,SVC Classifier,0,1.0,0.3093812375249501,1.0,1.1590240001678467,0.0
26,1,Decision Tree,0,1.0,0.5029940119760479,0.5172982559827873,0.08372759819030762,0.0
27,1,RandomForest,0,1.0,0.4590818363273453,0.39272160931414785,0.6706724166870117,0.0
28,1,AdaBoost (Discrete),0,1.0,0.48502994011976047,0.5015649344329317,45.255115032196045,0.0
29,1,AdaBoost (Real),0,1.0,0.3373253493013972,0.35146347212519646,58.96335768699646,0.0
30,1,Logistic Regression (Penalty = L2),0,1.0,0.5748502994011976,0.5400069756927316,0.6585900783538818,0.0
31,1,Naive Bayes,0,1.0,0.12574850299401197,0.29811083012713,0.18809723854064941,0.0
32,1,KNeighbors Classifier,1,1.0,0.5622489959839357,0.561440033876381,0.4827394485473633,0.0
33,1,SVC Classifier,1,1.0,0.3092369477911647,1.0,1.250748872756958,0.0
34,1,Decision Tree,1,1.0,0.4497991967871486,0.3548126179882169,0.08908796310424805,0.3548126179882169
35,1,RandomForest,1,1.0,0.4899598393574297,0.614119889206177,0.8310956954956055,0.0
36,1,AdaBoost (Discrete),1,1.0,0.5020080321285141,0.5358142065989067,48.43565344810486,0.0
37,1,AdaBoost (Real),1,1.0,0.3815261044176707,0.3502136198080944,67.34330582618713,0.3502136198080944
38,1,Logistic Regression (Penalty = L2),1,1.0,0.570281124497992,0.5630004373262018,0.7826666831970215,0.0
39,1,Naive Bayes,1,1.0,0.21084337349397592,0.391297317223613,0.21218132972717285,0.0
40,1,KNeighbors Classifier,2,1.0,0.5232323232323233,0.5124358806849453,0.5933363437652588,0.0
41,1,SVC Classifier,2,1.0,0.3111111111111111,1.0,1.2655184268951416,0.0
42,1,Decision Tree,2,1.0,0.4868686868686869,0.386720699885437,0.0992591381072998,0.386720699885437
43,1,RandomForest,2,1.0,0.45454545454545453,0.3745822585718079,0.7892823219299316,0.0
44,1,AdaBoost (Discrete),2,1.0,0.48282828282828283,0.44127647915732204,50.79673933982849,0.0
45,1,AdaBoost (Real),2,1.0,0.3878787878787879,0.3588792164100115,76.57455635070801,0.3588792164100115
46,1,Logistic Regression (Penalty = L2),2,1.0,0.5717171717171717,0.5317402214183601,0.7389636039733887,0.0
47,1,Naive Bayes,2,1.0,0.13131313131313133,0.5177415417227269,0.22778916358947754,0.0
48,2,KNeighbors Classifier,0,1.0,0.5508982035928144,0.6186590484482999,0.4528536796569824,0.0
49,2,SVC Classifier,0,1.0,0.3093812375249501,1.0,1.5670018196105957,0.0
50,2,Decision Tree,0,1.0,0.47704590818363274,0.42815707111373275,0.11231827735900879,0.0
51,2,RandomForest,0,1.0,0.4590818363273453,0.39272160931414785,1.0157530307769775,0.0
52,2,AdaBoost (Discrete),0,1.0,0.48303393213572854,0.5007968291000807,58.961753606796265,0.0
53,2,AdaBoost (Real),0,1.0,0.3333333333333333,0.3314546866383861,80.03433036804199,0.3314546866383861
54,2,Logistic Regression (Penalty = L2),0,1.0,0.5748502994011976,0.5400069756927316,0.8665158748626709,0.0
55,2,Naive Bayes,0,1.0,0.12574850299401197,0.29811083012713,0.1139833927154541,0.0
56,2,KNeighbors Classifier,1,1.0,0.5622489959839357,0.561440033876381,0.6707851886749268,0.0
57,2,SVC Classifier,1,1.0,0.3092369477911647,1.0,1.580824851989746,0.0
58,2,Decision Tree,1,1.0,0.5200803212851406,0.4410586264629977,0.10698437690734863,0.4410586264629977
59,2,RandomForest,1,1.0,0.4899598393574297,0.614119889206177,0.9205458164215088,0.0
60,2,AdaBoost (Discrete),1,1.0,0.5020080321285141,0.5358142065989067,55.79276967048645,0.0
61,2,AdaBoost (Real),1,1.0,0.44779116465863456,0.3705202751812402,70.42758274078369,0.3705202751812402
62,2,Logistic Regression (Penalty = L2),1,1.0,0.570281124497992,0.5630004373262018,0.7676193714141846,0.0
63,2,Naive Bayes,1,1.0,0.21084337349397592,0.391297317223613,0.2318582534790039,0.0
64,2,KNeighbors Classifier,2,1.0,0.5232323232323233,0.5124358806849453,0.5989933013916016,0.0
65,2,SVC Classifier,2,1.0,0.3111111111111111,1.0,1.5347621440887451,0.0
66,2,Decision Tree,2,1.0,0.501010101010101,0.45863942321005574,0.11609625816345215,0.0
67,2,RandomForest,2,1.0,0.45454545454545453,0.3745822585718079,0.9366931915283203,0.0
68,2,AdaBoost (Discrete),2,1.0,0.48282828282828283,0.44127647915732204,55.97356295585632,0.0
69,2,AdaBoost (Real),2,1.0,0.32323232323232326,0.33310254263332795,74.49769234657288,0.33310254263332795
70,2,Logistic Regression (Penalty = L2),2,1.0,0.5717171717171717,0.5317402214183601,0.8408162593841553,0.0
71,2,Naive Bayes,2,1.0,0.13131313131313133,0.5177415417227269,0.24370217323303223,0.0
72,3,KNeighbors Classifier,0,1.0,0.5508982035928144,0.6186590484482999,0.6213672161102295,0.0
73,3,SVC Classifier,0,1.0,0.3093812375249501,1.0,1.3834073543548584,0.0
74,3,Decision Tree,0,1.0,0.4810379241516966,0.4048976838856289,0.11967802047729492,0.4048976838856289
75,3,RandomForest,0,1.0,0.4590818363273453,0.39272160931414785,0.750281810760498,0.0
76,3,AdaBoost (Discrete),0,1.0,0.48303393213572854,0.5007968291000807,61.809688091278076,0.0
77,3,AdaBoost (Real),0,1.0,0.3912175648702595,0.4364167038322364,84.28381562232971,0.0
78,3,Logistic Regression (Penalty = L2),0,1.0,0.5748502994011976,0.5400069756927316,0.9018912315368652,0.0
79,3,Naive Bayes,0,1.0,0.12574850299401197,0.29811083012713,0.2750551700592041,0.0
80,3,KNeighbors Classifier,1,1.0,0.5622489959839357,0.561440033876381,0.6861884593963623,0.0
81,3,SVC Classifier,1,1.0,0.3092369477911647,1.0,1.8996055126190186,0.0
82,3,Decision Tree,1,1.0,0.46184738955823296,0.3947755134751963,0.1363511085510254,0.3947755134751963
83,3,RandomForest,1,1.0,0.4899598393574297,0.614119889206177,1.067521572113037,0.0
84,3,AdaBoost (Discrete),1,1.0,0.5020080321285141,0.5358142065989067,72.09122776985168,0.0
85,3,AdaBoost (Real),1,1.0,0.35943775100401604,0.3485310392168927,87.97981142997742,0.3485310392168927
86,3,Logistic Regression (Penalty = L2),1,1.0,0.570281124497992,0.5630004373262018,0.815345048904419,0.0
87,3,Naive Bayes,1,1.0,0.21084337349397592,0.391297317223613,0.1456747055053711,0.0
88,3,KNeighbors Classifier,2,1.0,0.5232323232323233,0.5124358806849453,0.5488379001617432,0.0
89,3,SVC Classifier,2,1.0,0.3111111111111111,1.0,1.6209490299224854,0.0
90,3,Decision Tree,2,1.0,0.4888888888888889,0.4760785353503188,0.12786245346069336,0.0
91,3,RandomForest,2,1.0,0.45454545454545453,0.3745822585718079,0.8414039611816406,0.0
92,3,AdaBoost (Discrete),2,1.0,0.48282828282828283,0.44127647915732204,63.786240577697754,0.0
93,3,AdaBoost (Real),2,1.0,0.3797979797979798,0.4022504398675295,83.46681261062622,0.0
94,3,Logistic Regression (Penalty = L2),2,1.0,0.5717171717171717,0.5317402214183601,1.134556531906128,0.0
95,3,Naive Bayes,2,1.0,0.13131313131313133,0.5177415417227269,0.28774571418762207,0.0
96,4,KNeighbors Classifier,0,1.0,0.5508982035928144,0.6186590484482999,0.7237544059753418,0.0
97,4,SVC Classifier,0,1.0,0.3093812375249501,1.0,1.8974072933197021,0.0
98,4,Decision Tree,0,1.0,0.47904191616766467,0.4203753859844769,0.12275433540344238,0.4203753859844769
99,4,RandomForest,0,1.0,0.4590818363273453,0.39272160931414785,1.0120549201965332,0.0
100,4,AdaBoost (Discrete),0,1.0,0.48303393213572854,0.5007968291000807,65.30230593681335,0.0
101,4,AdaBoost (Real),0,1.0,0.38922155688622756,0.36778029106567434,87.5437695980072,0.0
102,4,Logistic Regression (Penalty = L2),0,1.0,0.5748502994011976,0.5400069756927316,1.0189368724822998,0.0
103,4,Naive Bayes,0,1.0,0.12574850299401197,0.29811083012713,0.25095248222351074,0.0
104,4,KNeighbors Classifier,1,1.0,0.5622489959839357,0.561440033876381,0.6906812191009521,0.0
105,4,SVC Classifier,1,1.0,0.3092369477911647,1.0,1.753821849822998,0.0
106,4,Decision Tree,1,1.0,0.4578313253012048,0.4103619845221144,0.14293980598449707,0.0
107,4,RandomForest,1,1.0,0.4899598393574297,0.614119889206177,0.8525662422180176,0.0
108,4,AdaBoost (Discrete),1,1.0,0.5020080321285141,0.5358142065989067,63.294737577438354,0.0
109,4,AdaBoost (Real),1,1.0,0.3855421686746988,0.3266399724218421,85.23905324935913,0.0
110,4,Logistic Regression (Penalty = L2),1,1.0,0.570281124497992,0.5630004373262018,0.9260761737823486,0.0
111,4,Naive Bayes,1,1.0,0.21084337349397592,0.391297317223613,0.2637622356414795,0.0
112,4,KNeighbors Classifier,2,1.0,0.5232323232323233,0.5124358806849453,0.6994881629943848,0.0
113,4,SVC Classifier,2,1.0,0.3111111111111111,1.0,1.992401123046875,0.0
114,4,Decision Tree,2,1.0,0.47878787878787876,0.4252795398536015,0.12411308288574219,0.0
115,4,RandomForest,2,1.0,0.45454545454545453,0.3745822585718079,1.736889123916626,0.0
116,4,AdaBoost (Discrete),2,1.0,0.48282828282828283,0.44127647915732204,67.06221199035645,0.0
117,4,AdaBoost (Real),2,1.0,0.3333333333333333,0.3558800738467179,87.66297650337219,0.0
118,4,Logistic Regression (Penalty = L2),2,1.0,0.5717171717171717,0.5317402214183601,1.4989900588989258,0.0
119,4,Naive Bayes,2,1.0,0.13131313131313133,0.5177415417227269,0.4520907402038574,0.0
120,5,KNeighbors Classifier,0,1.0,0.5508982035928144,0.6186590484482999,1.19962477684021,0.0
121,5,SVC Classifier,0,1.0,0.3093812375249501,1.0,0.40426111221313477,0.0
122,5,Decision Tree,0,1.0,0.437125748502994,0.4308146441936044,0.06328082084655762,0.0
123,5,RandomForest,0,1.0,0.4590818363273453,0.39272160931414785,0.2716846466064453,0.0
124,5,AdaBoost (Discrete),0,1.0,0.48303393213572854,0.5007968291000807,57.86930274963379,0.0
125,5,AdaBoost (Real),0,1.0,0.36127744510978044,0.3731269739888497,75.62544560432434,0.0
126,5,Logistic Regression (Penalty = L2),0,1.0,0.5748502994011976,0.5400069756927316,0.8272817134857178,0.0
127,5,Naive Bayes,0,1.0,0.12574850299401197,0.29811083012713,0.31542086601257324,0.0
128,5,KNeighbors Classifier,1,1.0,0.5622489959839357,0.561440033876381,0.7719907760620117,0.0
129,5,SVC Classifier,1,1.0,0.3092369477911647,1.0,2.2386393547058105,0.0
130,5,Decision Tree,1,1.0,0.4578313253012048,0.4963877909206817,0.002668142318725586,0.0
131,5,RandomForest,1,1.0,0.4899598393574297,0.614119889206177,1.0364301204681396,0.0
132,5,AdaBoost (Discrete),1,1.0,0.5020080321285141,0.5358142065989067,65.16885781288147,0.0
133,5,AdaBoost (Real),1,1.0,0.357429718875502,0.329489304520897,73.5167248249054,0.329489304520897
134,5,Logistic Regression (Penalty = L2),1,1.0,0.570281124497992,0.5630004373262018,0.7774279117584229,0.0
135,5,Naive Bayes,1,1.0,0.21084337349397592,0.391297317223613,0.25095295906066895,0.0
136,5,KNeighbors Classifier,2,1.0,0.5232323232323233,0.5124358806849453,0.7650649547576904,0.0
137,5,SVC Classifier,2,1.0,0.3111111111111111,1.0,1.5335347652435303,0.0
138,5,Decision Tree,2,1.0,0.48282828282828283,0.4287945260849835,0.12284708023071289,0.4287945260849835
139,5,RandomForest,2,1.0,0.45454545454545453,0.3745822585718079,0.905991792678833,0.0
140,5,AdaBoost (Discrete),2,1.0,0.48282828282828283,0.44127647915732204,63.27256894111633,0.0
141,5,AdaBoost (Real),2,1.0,0.3333333333333333,0.3411559039863541,85.61927080154419,0.3411559039863541
142,5,Logistic Regression (Penalty = L2),2,1.0,0.5717171717171717,0.5317402214183601,0.7181346416473389,0.0
143,5,Naive Bayes,2,1.0,0.13131313131313133,0.5177415417227269,0.27796173095703125,0.0
144,6,KNeighbors Classifier,0,1.0,0.5508982035928144,0.6186590484482999,0.6400554180145264,0.0
145,6,SVC Classifier,0,1.0,0.3093812375249501,1.0,1.6378397941589355,0.0
146,6,Decision Tree,0,1.0,0.44510978043912175,0.45752076130960695,0.2523036003112793,0.0
147,6,RandomForest,0,1.0,0.4590818363273453,0.39272160931414785,0.8922381401062012,0.0
148,6,AdaBoost (Discrete),0,1.0,0.48303393213572854,0.5007968291000807,60.67021822929382,0.0
149,6,AdaBoost (Real),0,1.0,0.4111776447105788,0.3629967202603586,81.50259017944336,0.0
150,6,Logistic Regression (Penalty = L2),0,1.0,0.5748502994011976,0.5400069756927316,0.9066135883331299,0.0
151,6,Naive Bayes,0,1.0,0.12574850299401197,0.29811083012713,0.13930034637451172,0.0
152,6,KNeighbors Classifier,1,1.0,0.5622489959839357,0.561440033876381,0.8949191570281982,0.0
153,6,SVC Classifier,1,1.0,0.3092369477911647,1.0,1.7071254253387451,0.0
154,6,Decision Tree,1,1.0,0.46184738955823296,0.46878090571569025,0.13089394569396973,0.0
155,6,RandomForest,1,1.0,0.4899598393574297,0.614119889206177,1.055349349975586,0.0
156,6,AdaBoost (Discrete),1,1.0,0.5020080321285141,0.5358142065989067,65.05685782432556,0.0
157,6,AdaBoost (Real),1,1.0,0.42168674698795183,0.33606646285082276,87.99386262893677,0.33606646285082276
158,6,Logistic Regression (Penalty = L2),1,1.0,0.570281124497992,0.5630004373262018,0.7011139392852783,0.0
159,6,Naive Bayes,1,1.0,0.21084337349397592,0.391297317223613,0.14991068840026855,0.0
160,6,KNeighbors Classifier,2,1.0,0.5232323232323233,0.5124358806849453,0.8006010055541992,0.0
161,6,SVC Classifier,2,1.0,0.3111111111111111,1.0,1.58133864402771,0.0
162,6,Decision Tree,2,1.0,0.4626262626262626,0.43118962355406154,0.2604193687438965,0.43118962355406154
163,6,RandomForest,2,1.0,0.45454545454545453,0.3745822585718079,1.0597236156463623,0.0
164,6,AdaBoost (Discrete),2,1.0,0.48282828282828283,0.44127647915732204,66.32500219345093,0.0
165,6,AdaBoost (Real),2,1.0,0.33535353535353535,0.35608866164842295,91.3893187046051,0.0
166,6,Logistic Regression (Penalty = L2),2,1.0,0.5717171717171717,0.5317402214183601,0.9452285766601562,0.0
167,6,Naive Bayes,2,1.0,0.13131313131313133,0.5177415417227269,0.30348992347717285,0.0
168,7,KNeighbors Classifier,0,1.0,0.5508982035928144,0.6186590484482999,0.7697131633758545,0.0
169,7,SVC Classifier,0,1.0,0.3093812375249501,1.0,1.8337347507476807,0.0
170,7,Decision Tree,0,1.0,0.469061876247505,0.4793428795730348,0.15221381187438965,0.0
171,7,RandomForest,0,1.0,0.4590818363273453,0.39272160931414785,1.0652992725372314,0.0
172,7,AdaBoost (Discrete),0,1.0,0.48502994011976047,0.5015649344329317,72.24352502822876,0.0
173,7,AdaBoost (Real),0,1.0,0.4411177644710579,0.4329266401943526,111.11356401443481,0.0
174,7,Logistic Regression (Penalty = L2),0,1.0,0.5748502994011976,0.5400069756927316,1.0235791206359863,0.0
175,7,Naive Bayes,0,1.0,0.12574850299401197,0.29811083012713,0.2847926616668701,0.0
176,7,KNeighbors Classifier,1,1.0,0.5622489959839357,0.561440033876381,0.9109158515930176,0.0
177,7,SVC Classifier,1,1.0,0.3092369477911647,1.0,1.8635270595550537,0.0
178,7,Decision Tree,1,1.0,0.4738955823293173,0.46336558607455686,0.15204644203186035,0.0
179,7,RandomForest,1,1.0,0.4899598393574297,0.614119889206177,1.0879371166229248,0.0
180,7,AdaBoost (Discrete),1,1.0,0.5020080321285141,0.5358142065989067,71.62038135528564,0.0
181,7,AdaBoost (Real),1,1.0,0.321285140562249,0.32561785285108447,99.08564782142639,0.32561785285108447
182,7,Logistic Regression (Penalty = L2),1,1.0,0.570281124497992,0.5630004373262018,1.093329906463623,0.0
183,7,Naive Bayes,1,1.0,0.21084337349397592,0.391297317223613,0.26221466064453125,0.0
184,7,KNeighbors Classifier,2,1.0,0.5232323232323233,0.5124358806849453,0.8882935047149658,0.0
185,7,SVC Classifier,2,1.0,0.3111111111111111,1.0,2.1187705993652344,0.0
186,7,Decision Tree,2,1.0,0.494949494949495,0.4955829023336457,0.1446974277496338,0.0
187,7,RandomForest,2,1.0,0.45454545454545453,0.3745822585718079,1.0387916564941406,0.0
188,7,AdaBoost (Discrete),2,1.0,0.48282828282828283,0.44127647915732204,71.00243782997131,0.0
189,7,AdaBoost (Real),2,1.0,0.3616161616161616,0.3552901427144422,98.00309157371521,0.0
190,7,Logistic Regression (Penalty = L2),2,1.0,0.5717171717171717,0.5317402214183601,0.9230422973632812,0.0
191,7,Naive Bayes,2,1.0,0.13131313131313133,0.5177415417227269,0.2980051040649414,0.0
192,8,KNeighbors Classifier,0,1.0,0.5508982035928144,0.6186590484482999,0.7195909023284912,0.0
193,8,SVC Classifier,0,1.0,0.3093812375249501,1.0,1.910555124282837,0.0
194,8,Decision Tree,0,1.0,0.4930139720558882,0.5222256395834549,0.14303970336914062,0.0
195,8,RandomForest,0,1.0,0.4590818363273453,0.39272160931414785,0.9932098388671875,0.0
196,8,AdaBoost (Discrete),0,1.0,0.48502994011976047,0.5015649344329317,69.89667630195618,0.0
197,8,AdaBoost (Real),0,1.0,0.34331337325349304,0.319905701987463,88.69648575782776,0.0
198,8,Logistic Regression (Penalty = L2),0,1.0,0.5748502994011976,0.5400069756927316,0.7435553073883057,0.0
199,8,Naive Bayes,0,1.0,0.12574850299401197,0.29811083012713,0.12595105171203613,0.0
200,8,KNeighbors Classifier,1,1.0,0.5622489959839357,0.561440033876381,0.6350853443145752,0.0
201,8,SVC Classifier,1,1.0,0.3092369477911647,1.0,1.694289207458496,0.0
202,8,Decision Tree,1,1.0,0.45582329317269077,0.4901219388466974,0.1274120807647705,0.0
203,8,RandomForest,1,1.0,0.4899598393574297,0.614119889206177,0.8781230449676514,0.0
204,8,AdaBoost (Discrete),1,1.0,0.5020080321285141,0.5358142065989067,65.31540369987488,0.0
205,8,AdaBoost (Real),1,1.0,0.3634538152610442,0.3572857573003903,103.73326301574707,0.0
206,8,Logistic Regression (Penalty = L2),1,1.0,0.570281124497992,0.5630004373262018,0.6885156631469727,0.0
207,8,Naive Bayes,1,1.0,0.21084337349397592,0.391297317223613,0.24379634857177734,0.0
208,8,KNeighbors Classifier,2,1.0,0.5232323232323233,0.5124358806849453,0.8014416694641113,0.0
209,8,SVC Classifier,2,1.0,0.3111111111111111,1.0,2.030524969100952,0.0
210,8,Decision Tree,2,1.0,0.4808080808080808,0.36969248269569055,0.12468695640563965,0.36969248269569055
211,8,RandomForest,2,1.0,0.45454545454545453,0.3745822585718079,0.8133304119110107,0.0
212,8,AdaBoost (Discrete),2,1.0,0.48282828282828283,0.44127647915732204,77.08540177345276,0.0
213,8,AdaBoost (Real),2,1.0,0.3212121212121212,0.3475142294545973,95.31296133995056,0.0
214,8,Logistic Regression (Penalty = L2),2,1.0,0.5717171717171717,0.5317402214183601,0.9026315212249756,0.0
215,8,Naive Bayes,2,1.0,0.13131313131313133,0.5177415417227269,0.2845172882080078,0.0
