,feat_set_id,classifier,fold_id,feat_th,score,geo_score,exec_t,geo_score_woz
0,0,KNeighbors Classifier,0,0.15,0.8298507462686567,0.8231902677864195,0.6707379817962646,0.8231902677864195
1,0,SVC Classifier,0,0.15,0.8134328358208955,0.8040949320835267,0.8552258014678955,0.8040949320835267
2,0,Decision Tree,0,0.15,0.7074626865671642,0.7029762050497298,0.04613089561462402,0.7029762050497298
3,0,RandomForest,0,0.15,0.5358208955223881,0.528317327238029,0.2126178741455078,0.0
4,0,AdaBoost (Discrete),0,0.15,0.7492537313432835,0.7031440185600158,16.647230625152588,0.7031440185600158
5,0,AdaBoost (Real),0,0.15,0.48208955223880595,0.31520539283495075,21.55391216278076,0.31520539283495075
6,0,Logistic Regression (Penalty = L2),0,0.15,0.8432835820895522,0.8396179545001206,0.5731956958770752,0.8396179545001206
7,0,Naive Bayes,0,0.15,0.6925373134328359,0.6581951433776129,0.08833050727844238,0.6581951433776129
8,0,KNeighbors Classifier,1,0.15,0.8522388059701492,0.8497249957484311,0.7333097457885742,0.8497249957484311
9,0,SVC Classifier,1,0.15,0.8238805970149253,0.8203272730662033,0.7413027286529541,0.8203272730662033
10,0,Decision Tree,1,0.15,0.744776119402985,0.7427319629865653,0.024466514587402344,0.7427319629865653
11,0,RandomForest,1,0.15,0.5298507462686567,0.42183052519328734,0.16865110397338867,0.0
12,0,AdaBoost (Discrete),1,0.15,0.7597014925373134,0.7518286646373439,15.337363481521606,0.7518286646373439
13,0,AdaBoost (Real),1,0.15,0.4059701492537313,0.23891371344190349,20.115959644317627,0.23891371344190349
14,0,Logistic Regression (Penalty = L2),1,0.15,0.8343283582089552,0.8325938461153954,0.49770593643188477,0.8325938461153954
15,0,Naive Bayes,1,0.15,0.6686567164179105,0.6286940957640534,0.04987907409667969,0.6286940957640534
16,0,KNeighbors Classifier,2,0.15,0.8818181818181818,0.8793048597935781,0.7389822006225586,0.8793048597935781
17,0,SVC Classifier,2,0.15,0.8590909090909091,0.853988370180213,0.7763400077819824,0.853988370180213
18,0,Decision Tree,2,0.15,0.7757575757575758,0.7711217267920341,0.041628122329711914,0.7711217267920341
19,0,RandomForest,2,0.15,0.5787878787878787,0.5304048175725987,0.19948577880859375,0.0
20,0,AdaBoost (Discrete),2,0.15,0.7803030303030303,0.7681824161574901,15.676809072494507,0.7681824161574901
21,0,AdaBoost (Real),2,0.15,0.6227272727272727,0.5738533404158551,20.288355827331543,0.5738533404158551
22,0,Logistic Regression (Penalty = L2),2,0.15,0.8742424242424243,0.8721423785971957,0.48473143577575684,0.8721423785971957
23,0,Naive Bayes,2,0.15,0.7318181818181818,0.713599583806255,0.05053853988647461,0.713599583806255
24,1,KNeighbors Classifier,0,0.15,0.9238805970149254,0.9208927866384179,0.7750608921051025,0.9208927866384179
25,1,SVC Classifier,0,0.15,0.9044776119402985,0.8989283150772195,0.7233495712280273,0.8989283150772195
26,1,Decision Tree,0,0.15,0.7955223880597015,0.7904074990548716,0.024651288986206055,0.7904074990548716
27,1,RandomForest,0,0.15,0.6716417910447762,0.7183616511231337,0.17202043533325195,0.0
28,1,AdaBoost (Discrete),0,0.15,0.8791044776119403,0.874358962656007,15.70592212677002,0.874358962656007
29,1,AdaBoost (Real),0,0.15,0.6313432835820896,0.5784307479741521,20.43986988067627,0.5784307479741521
30,1,Logistic Regression (Penalty = L2),0,0.15,0.9029850746268657,0.8989820676659613,0.5623109340667725,0.8989820676659613
31,1,Naive Bayes,0,0.15,0.8328358208955224,0.822733647298187,0.08335280418395996,0.822733647298187
32,1,KNeighbors Classifier,1,0.15,0.9283582089552239,0.9263813378388942,0.7756433486938477,0.9263813378388942
33,1,SVC Classifier,1,0.15,0.9119402985074627,0.9095476192969574,0.7236273288726807,0.9095476192969574
34,1,Decision Tree,1,0.15,0.8074626865671641,0.8059111053994719,0.023821592330932617,0.8059111053994719
35,1,RandomForest,1,0.15,0.6253731343283582,0.47400552904199555,0.21266627311706543,0.47400552904199555
36,1,AdaBoost (Discrete),1,0.15,0.8656716417910447,0.8504851538658932,15.468471765518188,0.8504851538658932
37,1,AdaBoost (Real),1,0.15,0.43134328358208956,0.3060323869953499,19.80622124671936,0.0
38,1,Logistic Regression (Penalty = L2),1,0.15,0.9044776119402985,0.9030095025773357,0.5950429439544678,0.9030095025773357
39,1,Naive Bayes,1,0.15,0.8373134328358209,0.8317872392901569,0.05328631401062012,0.8317872392901569
40,1,KNeighbors Classifier,2,0.15,0.9333333333333333,0.9323722081726201,0.7837214469909668,0.9323722081726201
41,1,SVC Classifier,2,0.15,0.9227272727272727,0.9209609218591597,0.7181079387664795,0.9209609218591597
42,1,Decision Tree,2,0.15,0.8303030303030303,0.8288196472785823,0.025495529174804688,0.8288196472785823
43,1,RandomForest,2,0.15,0.696969696969697,0.7572860206018289,0.216569185256958,0.0
44,1,AdaBoost (Discrete),2,0.15,0.8787878787878788,0.876095573542495,15.709994792938232,0.876095573542495
45,1,AdaBoost (Real),2,0.15,0.6212121212121212,0.580826402839446,20.829957962036133,0.580826402839446
46,1,Logistic Regression (Penalty = L2),2,0.15,0.9272727272727272,0.9264022472749415,0.4986739158630371,0.9264022472749415
47,1,Naive Bayes,2,0.15,0.8545454545454545,0.8506002415839163,0.1006476879119873,0.8506002415839163
48,2,KNeighbors Classifier,0,0.15,0.8641791044776119,0.8603985274844029,0.9034316539764404,0.8603985274844029
49,2,SVC Classifier,0,0.15,0.844776119402985,0.8395272883769709,0.8217341899871826,0.8395272883769709
50,2,Decision Tree,0,0.15,0.7895522388059701,0.7851841249985363,0.025880813598632812,0.7851841249985363
51,2,RandomForest,0,0.15,0.5328358208955224,0.6034550474306444,0.14485478401184082,0.0
52,2,AdaBoost (Discrete),0,0.15,0.8791044776119403,0.8774418494537688,15.307847738265991,0.8774418494537688
53,2,AdaBoost (Real),0,0.15,0.3208955223880597,0.23249673423619455,19.54411292076111,0.0
54,2,Logistic Regression (Penalty = L2),0,0.15,0.8820895522388059,0.8796658358083664,0.5596582889556885,0.8796658358083664
55,2,Naive Bayes,0,0.15,0.835820895522388,0.8276998193641666,0.0869598388671875,0.8276998193641666
56,2,KNeighbors Classifier,1,0.15,0.8761194029850746,0.8732375458076626,0.856513261795044,0.8732375458076626
57,2,SVC Classifier,1,0.15,0.8656716417910447,0.8627666939845982,0.791513204574585,0.8627666939845982
58,2,Decision Tree,1,0.15,0.7985074626865671,0.79452510935834,0.049149513244628906,0.79452510935834
59,2,RandomForest,1,0.15,0.5477611940298508,0.5085031808760966,0.19465970993041992,0.0
60,2,AdaBoost (Discrete),1,0.15,0.8597014925373134,0.8580020086724621,15.26210904121399,0.8580020086724621
61,2,AdaBoost (Real),1,0.15,0.7940298507462686,0.7905551355028879,20.629018306732178,0.7905551355028879
62,2,Logistic Regression (Penalty = L2),1,0.15,0.8701492537313433,0.8672031281519444,0.5730721950531006,0.8672031281519444
63,2,Naive Bayes,1,0.15,0.8194029850746268,0.8146843586253735,0.07477974891662598,0.8146843586253735
64,2,KNeighbors Classifier,2,0.15,0.8893939393939394,0.8884353297114055,0.9527621269226074,0.8884353297114055
65,2,SVC Classifier,2,0.15,0.8954545454545455,0.8941528850713161,0.889209508895874,0.8941528850713161
66,2,Decision Tree,2,0.15,0.7803030303030303,0.7766040903535867,0.02524542808532715,0.7766040903535867
67,2,RandomForest,2,0.15,0.5424242424242425,0.6153863699534271,0.16958284378051758,0.0
68,2,AdaBoost (Discrete),2,0.15,0.853030303030303,0.8521774354908453,16.244273900985718,0.8521774354908453
69,2,AdaBoost (Real),2,0.15,0.5166666666666667,0.485935123675389,19.39823293685913,0.0
70,2,Logistic Regression (Penalty = L2),2,0.15,0.9030303030303031,0.9025044693425259,0.49331188201904297,0.9025044693425259
71,2,Naive Bayes,2,0.15,0.8272727272727273,0.8227514990500696,0.09267616271972656,0.8227514990500696
72,3,KNeighbors Classifier,0,0.15,0.9447761194029851,0.9440277727787817,0.77303147315979,0.9440277727787817
73,3,SVC Classifier,0,0.15,0.9238805970149254,0.9224326760271745,0.6467385292053223,0.9224326760271745
74,3,Decision Tree,0,0.15,0.7835820895522388,0.7780734597970174,0.02080988883972168,0.7780734597970174
75,3,RandomForest,0,0.15,0.6462686567164179,0.5754974520578562,0.15561246871948242,0.5754974520578562
76,3,AdaBoost (Discrete),0,0.15,0.8925373134328358,0.8900289743303891,13.968130111694336,0.8900289743303891
77,3,AdaBoost (Real),0,0.15,0.45223880597014926,0.3286480902377771,19.638336181640625,0.3286480902377771
78,3,Logistic Regression (Penalty = L2),0,0.15,0.9164179104477612,0.9156644560813284,0.5763628482818604,0.9156644560813284
79,3,Naive Bayes,0,0.15,0.8850746268656716,0.8814505509067854,0.10122060775756836,0.8814505509067854
80,3,KNeighbors Classifier,1,0.15,0.9492537313432836,0.9489182156701593,0.9778673648834229,0.9489182156701593
81,3,SVC Classifier,1,0.15,0.9313432835820895,0.9304889812716336,0.7933542728424072,0.9304889812716336
82,3,Decision Tree,1,0.15,0.7880597014925373,0.7850893029011251,0.02528548240661621,0.7850893029011251
83,3,RandomForest,1,0.15,0.6776119402985075,0.6457777853962968,0.1897902488708496,0.6457777853962968
84,3,AdaBoost (Discrete),1,0.15,0.9,0.8990684110779851,16.9028160572052,0.8990684110779851
85,3,AdaBoost (Real),1,0.15,0.6014925373134329,0.5178438491770753,21.275269746780396,0.5178438491770753
86,3,Logistic Regression (Penalty = L2),1,0.15,0.9194029850746268,0.9187076648254475,0.5272502899169922,0.9187076648254475
87,3,Naive Bayes,1,0.15,0.8582089552238806,0.8563292059143516,0.09729814529418945,0.8563292059143516
88,3,KNeighbors Classifier,2,0.15,0.95,0.949382324002551,0.9126729965209961,0.949382324002551
89,3,SVC Classifier,2,0.15,0.9454545454545454,0.9448616015576539,0.8625247478485107,0.9448616015576539
90,3,Decision Tree,2,0.15,0.8045454545454546,0.8005569294620052,0.045603275299072266,0.8005569294620052
91,3,RandomForest,2,0.15,0.6909090909090909,0.6259535841056032,0.17127394676208496,0.6259535841056032
92,3,AdaBoost (Discrete),2,0.15,0.9196969696969697,0.919047202356115,16.458805322647095,0.919047202356115
93,3,AdaBoost (Real),2,0.15,0.8287878787878787,0.8274814209467921,19.01641082763672,0.8274814209467921
94,3,Logistic Regression (Penalty = L2),2,0.15,0.9348484848484848,0.9344324444006681,0.5219211578369141,0.9344324444006681
95,3,Naive Bayes,2,0.15,0.8833333333333333,0.8820328947511955,0.06777572631835938,0.8820328947511955
96,4,KNeighbors Classifier,0,0.15,0.7940298507462686,0.7901263519033662,0.24373579025268555,0.7901263519033662
97,4,SVC Classifier,0,0.15,0.753731343283582,0.7463811714862467,0.5500228404998779,0.7463811714862467
98,4,Decision Tree,0,0.15,0.7164179104477612,0.714993167067812,0.023530244827270508,0.714993167067812
99,4,RandomForest,0,0.15,0.5119402985074627,0.4050412710122278,0.1443309783935547,0.0
100,4,AdaBoost (Discrete),0,0.15,0.7507462686567165,0.7437352378010817,12.273866653442383,0.7437352378010817
101,4,AdaBoost (Real),0,0.15,0.5537313432835821,0.4262489470838776,15.718862056732178,0.4262489470838776
102,4,Logistic Regression (Penalty = L2),0,0.15,0.8074626865671641,0.8002704962804476,0.2981579303741455,0.8002704962804476
103,4,Naive Bayes,0,0.15,0.6417910447761194,0.6041311494672804,0.06378674507141113,0.6041311494672804
104,4,KNeighbors Classifier,1,0.15,0.8134328358208955,0.8118123487239483,0.2621736526489258,0.8118123487239483
105,4,SVC Classifier,1,0.15,0.7671641791044777,0.7634377797056909,0.48061490058898926,0.7634377797056909
106,4,Decision Tree,1,0.15,0.735820895522388,0.7319914256984279,0.03514885902404785,0.7319914256984279
107,4,RandomForest,1,0.15,0.5507462686567164,0.39931564467756164,0.16531634330749512,0.39931564467756164
108,4,AdaBoost (Discrete),1,0.15,0.7417910447761195,0.7339485040106306,12.119219541549683,0.7339485040106306
109,4,AdaBoost (Real),1,0.15,0.6522388059701493,0.632064863640647,18.78524398803711,0.632064863640647
110,4,Logistic Regression (Penalty = L2),1,0.15,0.8134328358208955,0.8119900137992736,0.30682802200317383,0.8119900137992736
111,4,Naive Bayes,1,0.15,0.6119402985074627,0.521149907341612,0.048314571380615234,0.521149907341612
112,4,KNeighbors Classifier,2,0.15,0.8363636363636363,0.8349083283868062,0.31593966484069824,0.8349083283868062
113,4,SVC Classifier,2,0.15,0.8151515151515152,0.8083008165662648,0.48633527755737305,0.8083008165662648
114,4,Decision Tree,2,0.15,0.7636363636363637,0.7581439389614607,0.01598072052001953,0.7581439389614607
115,4,RandomForest,2,0.15,0.5136363636363637,0.36497017665656395,0.14760136604309082,0.0
116,4,AdaBoost (Discrete),2,0.15,0.759090909090909,0.7441143540125524,12.602649450302124,0.7441143540125524
117,4,AdaBoost (Real),2,0.15,0.5833333333333334,0.47566370989020346,15.971593141555786,0.47566370989020346
118,4,Logistic Regression (Penalty = L2),2,0.15,0.8363636363636363,0.8312969032359814,0.2397611141204834,0.8312969032359814
119,4,Naive Bayes,2,0.15,0.7166666666666667,0.7012069538046787,0.06079363822937012,0.7012069538046787
120,5,KNeighbors Classifier,0,0.15,0.22835820895522388,0.08557799469062081,0.08786153793334961,0.0
121,5,SVC Classifier,0,0.15,0.22686567164179106,0.236101392558311,0.33636927604675293,0.0
122,5,Decision Tree,0,0.15,0.2701492537313433,0.1845497513051103,0.0015473365783691406,0.0
123,5,RandomForest,0,0.15,0.2537313432835821,0.3762331025141137,0.1418590545654297,0.0
124,5,AdaBoost (Discrete),0,0.15,0.24477611940298508,0.24291516499528976,8.681479692459106,0.0
125,5,AdaBoost (Real),0,0.15,0.22388059701492538,0.05704379981170017,16.334834098815918,0.0
126,5,Logistic Regression (Penalty = L2),0,0.15,0.26417910447761195,0.3573944989829081,0.10109877586364746,0.0
127,5,Naive Bayes,0,0.15,0.23283582089552238,0.27463153040896726,0.0489351749420166,0.0
128,5,KNeighbors Classifier,1,0.15,0.19402985074626866,0.1747406470364333,0.07313942909240723,0.0
129,5,SVC Classifier,1,0.15,0.23432835820895523,0.1362668993780643,0.42589282989501953,0.0
130,5,Decision Tree,1,0.15,0.2656716417910448,0.09368413265474596,0.022697925567626953,0.0
131,5,RandomForest,1,0.15,0.25522388059701495,0.36442594329616484,0.14586448669433594,0.0
132,5,AdaBoost (Discrete),1,0.15,0.24776119402985075,0.16965130784265775,10.824318885803223,0.0
133,5,AdaBoost (Real),1,0.15,0.20298507462686566,0.059348087046497966,16.425679445266724,0.0
134,5,Logistic Regression (Penalty = L2),1,0.15,0.2671641791044776,0.3508873782123478,0.09385538101196289,0.0
135,5,Naive Bayes,1,0.15,0.24477611940298508,0.09874052608004617,0.047376155853271484,0.0
136,5,KNeighbors Classifier,2,0.15,0.19545454545454546,0.1383494575253023,0.09703612327575684,0.0
137,5,SVC Classifier,2,0.15,0.20757575757575758,0.11101837015595752,0.393261194229126,0.0
138,5,Decision Tree,2,0.15,0.24848484848484848,0.1750204096315055,0.0014841556549072266,0.0
139,5,RandomForest,2,0.15,0.25,0.3249792275397014,0.17051196098327637,0.0
140,5,AdaBoost (Discrete),2,0.15,0.22727272727272727,0.08905550116960165,10.185943841934204,0.0
141,5,AdaBoost (Real),2,0.15,0.2318181818181818,0.09917526238472309,15.907616138458252,0.0
142,5,Logistic Regression (Penalty = L2),2,0.15,0.2606060606060606,0.17932774725284364,0.096099853515625,0.0
143,5,Naive Bayes,2,0.15,0.23636363636363636,0.18842883037117011,0.047448158264160156,0.0
144,6,KNeighbors Classifier,0,0.15,0.5865671641791045,0.5590322681070322,0.09634256362915039,0.5590322681070322
145,6,SVC Classifier,0,0.15,0.5164179104477612,0.44197939206892406,0.4852409362792969,0.44197939206892406
146,6,Decision Tree,0,0.15,0.5656716417910448,0.5353406694413904,0.02402353286743164,0.5353406694413904
147,6,RandomForest,0,0.15,0.5223880597014925,0.43301219130839813,0.17746257781982422,0.43301219130839813
148,6,AdaBoost (Discrete),0,0.15,0.4417910447761194,0.36936728517520034,12.931917905807495,0.36936728517520034
149,6,AdaBoost (Real),0,0.15,0.4626865671641791,0.3192656876585393,18.71180772781372,0.3192656876585393
150,6,Logistic Regression (Penalty = L2),0,0.15,0.6044776119402985,0.5830227247052078,0.16608309745788574,0.5830227247052078
151,6,Naive Bayes,0,0.15,0.45223880597014926,0.3821541718628637,0.05150747299194336,0.3821541718628637
152,6,KNeighbors Classifier,1,0.15,0.5895522388059702,0.5660097099875581,0.15985560417175293,0.5660097099875581
153,6,SVC Classifier,1,0.15,0.5298507462686567,0.449784593650585,0.5833098888397217,0.449784593650585
154,6,Decision Tree,1,0.15,0.5507462686567164,0.5326826269811795,0.024331092834472656,0.5326826269811795
155,6,RandomForest,1,0.15,0.49701492537313435,0.3748788498226792,0.21885395050048828,0.3748788498226792
156,6,AdaBoost (Discrete),1,0.15,0.4582089552238806,0.33155481077611787,13.847748041152954,0.33155481077611787
157,6,AdaBoost (Real),1,0.15,0.3194029850746269,0.2106531332385079,19.668057441711426,0.2106531332385079
158,6,Logistic Regression (Penalty = L2),1,0.15,0.6149253731343284,0.605424830836811,0.22357845306396484,0.605424830836811
159,6,Naive Bayes,1,0.15,0.43283582089552236,0.3650355382402482,0.07817268371582031,0.3650355382402482
160,6,KNeighbors Classifier,2,0.15,0.5666666666666667,0.530405891837892,0.12194347381591797,0.530405891837892
161,6,SVC Classifier,2,0.15,0.5803030303030303,0.5197526305729895,0.5780620574951172,0.5197526305729895
162,6,Decision Tree,2,0.15,0.5954545454545455,0.5800455770163832,0.024346113204956055,0.5800455770163832
163,6,RandomForest,2,0.15,0.5303030303030303,0.4672196622374059,0.2230534553527832,0.4672196622374059
164,6,AdaBoost (Discrete),2,0.15,0.4984848484848485,0.40379676317324426,13.591142654418945,0.40379676317324426
165,6,AdaBoost (Real),2,0.15,0.43636363636363634,0.3219423233674511,19.797163724899292,0.3219423233674511
166,6,Logistic Regression (Penalty = L2),2,0.15,0.6348484848484849,0.6224451790636333,0.19309544563293457,0.6224451790636333
167,6,Naive Bayes,2,0.15,0.42272727272727273,0.28785158220827395,0.10300850868225098,0.28785158220827395
168,7,KNeighbors Classifier,0,0.15,0.3701492537313433,0.204144897560305,0.07254981994628906,0.204144897560305
169,7,SVC Classifier,0,0.15,0.4925373134328358,0.41260039446653163,0.4502549171447754,0.0
170,7,Decision Tree,0,0.15,0.5238805970149254,0.4361759458082905,0.014923334121704102,0.4361759458082905
171,7,RandomForest,0,0.15,0.4761194029850746,0.6479490577643418,0.20188236236572266,0.0
172,7,AdaBoost (Discrete),0,0.15,0.3,0.1161448879378674,10.897454023361206,0.1161448879378674
173,7,AdaBoost (Real),0,0.15,0.3567164179104478,0.384823448792492,17.944087028503418,0.0
174,7,Logistic Regression (Penalty = L2),0,0.15,0.5238805970149254,0.410233503555055,0.2268073558807373,0.410233503555055
175,7,Naive Bayes,0,0.15,0.508955223880597,0.40230311984174316,0.048345088958740234,0.40230311984174316
176,7,KNeighbors Classifier,1,0.15,0.31791044776119404,0.18275860138369548,0.10173368453979492,0.18275860138369548
177,7,SVC Classifier,1,0.15,0.5059701492537313,0.4259354319045389,0.4405629634857178,0.0
178,7,Decision Tree,1,0.15,0.5402985074626866,0.4391346914595228,0.01566600799560547,0.4391346914595228
179,7,RandomForest,1,0.15,0.49850746268656715,0.6820262372195565,0.15611743927001953,0.0
180,7,AdaBoost (Discrete),1,0.15,0.3880597014925373,0.2924767854416356,11.57728886604309,0.2924767854416356
181,7,AdaBoost (Real),1,0.15,0.3776119402985075,0.2806622921240283,17.414493322372437,0.2806622921240283
182,7,Logistic Regression (Penalty = L2),1,0.15,0.5656716417910448,0.4651323374631728,0.16713476181030273,0.4651323374631728
183,7,Naive Bayes,1,0.15,0.5253731343283582,0.4020985875106386,0.07587933540344238,0.4020985875106386
184,7,KNeighbors Classifier,2,0.15,0.28939393939393937,0.20571774533596107,0.08312153816223145,0.20571774533596107
185,7,SVC Classifier,2,0.15,0.4818181818181818,0.4074013837563941,0.4509396553039551,0.0
186,7,Decision Tree,2,0.15,0.5333333333333333,0.43345328514315373,0.019623756408691406,0.43345328514315373
187,7,RandomForest,2,0.15,0.49242424242424243,0.4574650592979316,0.17906761169433594,0.0
188,7,AdaBoost (Discrete),2,0.15,0.4,0.27840576233893277,11.846669435501099,0.27840576233893277
189,7,AdaBoost (Real),2,0.15,0.4681818181818182,0.3059269183309067,16.1111319065094,0.3059269183309067
190,7,Logistic Regression (Penalty = L2),2,0.15,0.5227272727272727,0.34527257669628353,0.16438937187194824,0.34527257669628353
191,7,Naive Bayes,2,0.15,0.49242424242424243,0.35562599838248954,0.059883832931518555,0.35562599838248954
192,8,KNeighbors Classifier,0,0.15,0.7865671641791044,0.7754239359241588,0.2556016445159912,0.7754239359241588
193,8,SVC Classifier,0,0.15,0.7865671641791044,0.7727231816957733,0.5074594020843506,0.7727231816957733
194,8,Decision Tree,0,0.15,0.753731343283582,0.7403438689074409,0.03366684913635254,0.7403438689074409
195,8,RandomForest,0,0.15,0.5835820895522388,0.49520161611894375,0.1772747039794922,0.0
196,8,AdaBoost (Discrete),0,0.15,0.746268656716418,0.7305230361586995,12.91048264503479,0.7305230361586995
197,8,AdaBoost (Real),0,0.15,0.5582089552238806,0.521722558006361,19.483818769454956,0.521722558006361
198,8,Logistic Regression (Penalty = L2),0,0.15,0.7835820895522388,0.7719530060375532,0.2698938846588135,0.7719530060375532
199,8,Naive Bayes,0,0.15,0.6895522388059702,0.653005483511358,0.08777928352355957,0.653005483511358
200,8,KNeighbors Classifier,1,0.15,0.8134328358208955,0.7988557586205166,0.19087457656860352,0.7988557586205166
201,8,SVC Classifier,1,0.15,0.7701492537313432,0.7528035785792533,0.4907500743865967,0.7528035785792533
202,8,Decision Tree,1,0.15,0.7208955223880597,0.712255039451888,0.0163877010345459,0.712255039451888
203,8,RandomForest,1,0.15,0.5895522388059702,0.5155331263794342,0.16297173500061035,0.5155331263794342
204,8,AdaBoost (Discrete),1,0.15,0.7298507462686568,0.7226250345225629,11.080485582351685,0.7226250345225629
205,8,AdaBoost (Real),1,0.15,0.5776119402985075,0.5447703846382219,15.552913665771484,0.5447703846382219
206,8,Logistic Regression (Penalty = L2),1,0.15,0.7805970149253731,0.7682673584942427,0.213425874710083,0.7682673584942427
207,8,Naive Bayes,1,0.15,0.7343283582089553,0.7186728425782387,0.07450008392333984,0.7186728425782387
208,8,KNeighbors Classifier,2,0.15,0.8272727272727273,0.8189003979340623,0.19486427307128906,0.8189003979340623
209,8,SVC Classifier,2,0.15,0.7848484848484848,0.7685708947964308,0.4616434574127197,0.7685708947964308
210,8,Decision Tree,2,0.15,0.7606060606060606,0.7484553262110906,0.020354032516479492,0.7484553262110906
211,8,RandomForest,2,0.15,0.6333333333333333,0.4841360636690178,0.1832261085510254,0.4841360636690178
212,8,AdaBoost (Discrete),2,0.15,0.740909090909091,0.7240244659183761,10.56073808670044,0.7240244659183761
213,8,AdaBoost (Real),2,0.15,0.4803030303030303,0.37286697972015564,14.826716184616089,0.37286697972015564
214,8,Logistic Regression (Penalty = L2),2,0.15,0.8287878787878787,0.8195542348069991,0.22109079360961914,0.8195542348069991
215,8,Naive Bayes,2,0.15,0.7212121212121212,0.6999767277193317,0.054982662200927734,0.6999767277193317
216,9,KNeighbors Classifier,0,0.15,0.573134328358209,0.5259257872703155,0.15916752815246582,0.5259257872703155
217,9,SVC Classifier,0,0.15,0.5567164179104478,0.37563192107967447,0.4178123474121094,0.37563192107967447
218,9,Decision Tree,0,0.15,0.5626865671641791,0.5133389840251565,0.018929481506347656,0.5133389840251565
219,9,RandomForest,0,0.15,0.4761194029850746,0.6668555164574255,0.14304113388061523,0.0
220,9,AdaBoost (Discrete),0,0.15,0.5671641791044776,0.501894152453416,9.066094875335693,0.501894152453416
221,9,AdaBoost (Real),0,0.15,0.5507462686567164,0.47935835827827267,14.595727920532227,0.47935835827827267
222,9,Logistic Regression (Penalty = L2),0,0.15,0.6223880597014926,0.5456573409805874,0.20907092094421387,0.5456573409805874
223,9,Naive Bayes,0,0.15,0.5611940298507463,0.47126792522351957,0.0565948486328125,0.47126792522351957
224,9,KNeighbors Classifier,1,0.15,0.564179104477612,0.5340525693222603,0.17203259468078613,0.5340525693222603
225,9,SVC Classifier,1,0.15,0.5597014925373134,0.3778769006861324,0.4884474277496338,0.3778769006861324
226,9,Decision Tree,1,0.15,0.564179104477612,0.5414815645098509,0.002780914306640625,0.5414815645098509
227,9,RandomForest,1,0.15,0.5268656716417911,0.45194504039476197,0.15641355514526367,0.0
228,9,AdaBoost (Discrete),1,0.15,0.4955223880597015,0.4654656990128937,9.358159065246582,0.4654656990128937
229,9,AdaBoost (Real),1,0.15,0.44328358208955226,0.3818897936637051,15.431321859359741,0.3818897936637051
230,9,Logistic Regression (Penalty = L2),1,0.15,0.5955223880597015,0.5157806475074742,0.16379070281982422,0.5157806475074742
231,9,Naive Bayes,1,0.15,0.5343283582089552,0.45121898010403527,0.06284713745117188,0.45121898010403527
232,9,KNeighbors Classifier,2,0.15,0.5818181818181818,0.5415826854587372,0.14420270919799805,0.5415826854587372
233,9,SVC Classifier,2,0.15,0.5742424242424242,0.43700913714330003,0.44306015968322754,0.43700913714330003
234,9,Decision Tree,2,0.15,0.5909090909090909,0.5714329322990483,0.02014780044555664,0.5714329322990483
235,9,RandomForest,2,0.15,0.5,0.6957513358685208,0.13599634170532227,0.0
236,9,AdaBoost (Discrete),2,0.15,0.5257575757575758,0.4872455177650504,9.267931699752808,0.4872455177650504
237,9,AdaBoost (Real),2,0.15,0.503030303030303,0.4559973185196741,13.708719968795776,0.4559973185196741
238,9,Logistic Regression (Penalty = L2),2,0.15,0.6363636363636364,0.5703733096880488,0.15771985054016113,0.5703733096880488
239,9,Naive Bayes,2,0.15,0.5787878787878787,0.5131677085468499,0.06746435165405273,0.5131677085468499
240,10,KNeighbors Classifier,0,0.15,0.9522388059701492,0.9516797377720689,0.6958973407745361,0.9516797377720689
241,10,SVC Classifier,0,0.15,0.9298507462686567,0.9289517480264572,0.5998897552490234,0.9289517480264572
242,10,Decision Tree,0,0.15,0.8402985074626865,0.8381063299808674,0.020128726959228516,0.8381063299808674
243,10,RandomForest,0,0.15,0.6537313432835821,0.6853423333431579,0.20437264442443848,0.0
244,10,AdaBoost (Discrete),0,0.15,0.9104477611940298,0.9095273221688267,16.4354088306427,0.9095273221688267
245,10,AdaBoost (Real),0,0.15,0.7835820895522388,0.7451938520689462,18.3835186958313,0.7451938520689462
246,10,Logistic Regression (Penalty = L2),0,0.15,0.9238805970149254,0.9228144771917942,0.5048375129699707,0.9228144771917942
247,10,Naive Bayes,0,0.15,0.8716417910447761,0.8706684764975697,0.14947056770324707,0.8706684764975697
248,10,KNeighbors Classifier,1,0.15,0.935820895522388,0.9351017936513297,0.8718147277832031,0.9351017936513297
249,10,SVC Classifier,1,0.15,0.9328358208955224,0.9319878900558224,0.6281886100769043,0.9319878900558224
250,10,Decision Tree,1,0.15,0.8208955223880597,0.8185571485638242,0.005417823791503906,0.8185571485638242
251,10,RandomForest,1,0.15,0.6656716417910448,0.6769395184818001,0.17843270301818848,0.0
252,10,AdaBoost (Discrete),1,0.15,0.8955223880597015,0.8948077306012513,15.143923997879028,0.8948077306012513
253,10,AdaBoost (Real),1,0.15,0.826865671641791,0.8159345935016027,18.89399290084839,0.8159345935016027
254,10,Logistic Regression (Penalty = L2),1,0.15,0.9328358208955224,0.9321175367668367,0.5148200988769531,0.9321175367668367
255,10,Naive Bayes,1,0.15,0.844776119402985,0.8394924557975594,0.10390162467956543,0.8394924557975594
256,10,KNeighbors Classifier,2,0.15,0.943939393939394,0.9436912225354196,0.7599883079528809,0.9436912225354196
257,10,SVC Classifier,2,0.15,0.9454545454545454,0.9450340012697246,0.6374008655548096,0.9450340012697246
258,10,Decision Tree,2,0.15,0.8318181818181818,0.8304521965333245,0.032843589782714844,0.8304521965333245
259,10,RandomForest,2,0.15,0.7272727272727273,0.8012486450162558,0.18114686012268066,0.0
260,10,AdaBoost (Discrete),2,0.15,0.906060606060606,0.9051591847829047,14.785512924194336,0.9051591847829047
261,10,AdaBoost (Real),2,0.15,0.7924242424242425,0.7650417507221031,17.74936318397522,0.7650417507221031
262,10,Logistic Regression (Penalty = L2),2,0.15,0.9333333333333333,0.9328743288964337,0.4633352756500244,0.9328743288964337
263,10,Naive Bayes,2,0.15,0.8848484848484849,0.8831918543644686,0.0761258602142334,0.8831918543644686
264,11,KNeighbors Classifier,0,0.15,0.9746268656716418,0.9744645190000923,2.251803159713745,0.9744645190000923
265,11,SVC Classifier,0,0.15,0.9671641791044776,0.9670762381927479,0.9198882579803467,0.9670762381927479
266,11,Decision Tree,0,0.15,0.8343283582089552,0.8319285950141475,0.03899645805358887,0.8319285950141475
267,11,RandomForest,0,0.15,0.6686567164179105,0.6984949020749505,0.15526461601257324,0.0
268,11,AdaBoost (Discrete),0,0.15,0.9208955223880597,0.9201497149413692,22.11943507194519,0.9201497149413692
269,11,AdaBoost (Real),0,0.15,0.8805970149253731,0.8712596942743875,25.385103464126587,0.8712596942743875
270,11,Logistic Regression (Penalty = L2),0,0.15,0.9417910447761194,0.9413064296762705,1.069889783859253,0.9413064296762705
271,11,Naive Bayes,0,0.15,0.9149253731343283,0.9142927183694782,0.11272549629211426,0.9142927183694782
272,11,KNeighbors Classifier,1,0.15,0.9611940298507463,0.9607949779795709,2.0387370586395264,0.9607949779795709
273,11,SVC Classifier,1,0.15,0.9611940298507463,0.9610040906683783,0.9270632266998291,0.9610040906683783
274,11,Decision Tree,1,0.15,0.835820895522388,0.8322006603303496,0.018018484115600586,0.8322006603303496
275,11,RandomForest,1,0.15,0.6597014925373135,0.656305389580037,0.16230249404907227,0.0
276,11,AdaBoost (Discrete),1,0.15,0.9119402985074627,0.9108831597957073,22.839123010635376,0.9108831597957073
277,11,AdaBoost (Real),1,0.15,0.6,0.5521443226912248,25.12653684616089,0.5521443226912248
278,11,Logistic Regression (Penalty = L2),1,0.15,0.9313432835820895,0.9305112424888945,1.004483938217163,0.9305112424888945
279,11,Naive Bayes,1,0.15,0.891044776119403,0.8895264434851252,0.17015361785888672,0.8895264434851252
280,11,KNeighbors Classifier,2,0.15,0.9696969696969697,0.969382899431213,2.2327187061309814,0.969382899431213
281,11,SVC Classifier,2,0.15,0.9575757575757575,0.957364398358882,1.0140290260314941,0.957364398358882
282,11,Decision Tree,2,0.15,0.843939393939394,0.8418910562188507,0.03984951972961426,0.8418910562188507
283,11,RandomForest,2,0.15,0.6803030303030303,0.6349826948557435,0.18941664695739746,0.0
284,11,AdaBoost (Discrete),2,0.15,0.9303030303030303,0.9294434702300916,22.992959022521973,0.9294434702300916
285,11,AdaBoost (Real),2,0.15,0.8863636363636364,0.8843285514347187,26.449793577194214,0.8843285514347187
286,11,Logistic Regression (Penalty = L2),2,0.15,0.9454545454545454,0.9451777774144082,1.0642225742340088,0.9451777774144082
287,11,Naive Bayes,2,0.15,0.8984848484848484,0.8979224699240913,0.11441206932067871,0.8979224699240913
