,feat_set_id,classifier,fold_id,feat_th,score,geo_score,exec_t,geo_score_woz
0,0,KNeighbors Classifier,0,0.25,0.17341040462427745,0.26699612962303954,0.03577876091003418,0.0
1,0,SVC Classifier,0,0.25,0.49710982658959535,1.0,0.020969152450561523,0.0
2,0,Decision Tree,0,0.25,0.5317919075144508,0.35228379023218037,0.003164052963256836,0.0
3,0,RandomForest,0,0.25,0.49710982658959535,1.0,0.049669742584228516,0.0
4,0,AdaBoost (Discrete),0,0.25,0.5375722543352601,0.37398062955763645,6.3779075145721436,0.0
5,0,AdaBoost (Real),0,0.25,0.5317919075144508,0.3582615194519448,8.847273111343384,0.0
6,0,Logistic Regression (Penalty = L2),0,0.25,0.49710982658959535,1.0,0.07474875450134277,0.0
7,0,Naive Bayes,0,0.25,0.14450867052023122,0.306902234725089,0.0584566593170166,0.0
8,0,KNeighbors Classifier,1,0.25,0.5476190476190477,0.3792258758532711,0.10001635551452637,0.0
9,0,SVC Classifier,1,0.25,0.5119047619047619,1.0,0.09691166877746582,0.0
10,0,Decision Tree,1,0.25,0.5416666666666666,0.40247378391177857,0.018853187561035156,0.0
11,0,RandomForest,1,0.25,0.5119047619047619,1.0,0.13225913047790527,0.0
12,0,AdaBoost (Discrete),1,0.25,0.5178571428571429,0.3880217564206154,6.790273666381836,0.0
13,0,AdaBoost (Real),1,0.25,0.5297619047619048,0.4665063810296269,8.291888952255249,0.0
14,0,Logistic Regression (Penalty = L2),1,0.25,0.5119047619047619,1.0,0.04540085792541504,0.0
15,0,Naive Bayes,1,0.25,0.125,0.2824663681580665,0.007596492767333984,0.0
16,0,KNeighbors Classifier,2,0.25,0.5153374233128835,0.4286267330629201,0.06714892387390137,0.0
17,0,SVC Classifier,2,0.25,0.5153374233128835,1.0,0.09339427947998047,0.0
18,0,Decision Tree,2,0.25,0.5521472392638037,0.4167079262924475,0.0021796226501464844,0.0
19,0,RandomForest,2,0.25,0.5153374233128835,1.0,0.09495782852172852,0.0
20,0,AdaBoost (Discrete),2,0.25,0.5521472392638037,0.3655754686274652,6.744462966918945,0.0
21,0,AdaBoost (Real),2,0.25,0.5521472392638037,0.33846566809655465,7.822418928146362,0.0
22,0,Logistic Regression (Penalty = L2),2,0.25,0.5153374233128835,1.0,0.054962158203125,0.0
23,0,Naive Bayes,2,0.25,0.15337423312883436,0.2883446419505567,0.06862092018127441,0.0
24,1,KNeighbors Classifier,0,0.25,0.6011560693641619,0.5120685418540368,0.0989065170288086,0.0
25,1,SVC Classifier,0,0.25,0.49710982658959535,1.0,0.08649420738220215,0.0
26,1,Decision Tree,0,0.25,0.5606936416184971,0.5683062145815727,0.027307748794555664,0.0
27,1,RandomForest,0,0.25,0.5375722543352601,0.4909706842597744,0.09655141830444336,0.0
28,1,AdaBoost (Discrete),0,0.25,0.6763005780346821,0.7320349120665983,9.108551740646362,0.0
29,1,AdaBoost (Real),0,0.25,0.5664739884393064,0.5153840438669505,10.186496257781982,0.0
30,1,Logistic Regression (Penalty = L2),0,0.25,0.5144508670520231,0.7539474411291538,0.09436273574829102,0.0
31,1,Naive Bayes,0,0.25,0.2254335260115607,0.362173177978653,0.031006813049316406,0.0
32,1,KNeighbors Classifier,1,0.25,0.6071428571428571,0.516798079550196,0.09479141235351562,0.0
33,1,SVC Classifier,1,0.25,0.5119047619047619,1.0,0.08572006225585938,0.0
34,1,Decision Tree,1,0.25,0.5833333333333334,0.5705032173389071,0.0036754608154296875,0.0
35,1,RandomForest,1,0.25,0.5476190476190477,0.575581947444966,0.0932610034942627,0.0
36,1,AdaBoost (Discrete),1,0.25,0.7261904761904762,0.5571805969410931,9.05735468864441,0.0
37,1,AdaBoost (Real),1,0.25,0.6428571428571429,0.7007650646753204,10.313367366790771,0.0
38,1,Logistic Regression (Penalty = L2),1,0.25,0.5357142857142857,0.26501332618617,0.1100773811340332,0.0
39,1,Naive Bayes,1,0.25,0.22023809523809523,0.5594627618341078,0.04611659049987793,0.0
40,1,KNeighbors Classifier,2,0.25,0.6319018404907976,0.7057780953208812,0.11197090148925781,0.0
41,1,SVC Classifier,2,0.25,0.5153374233128835,1.0,0.06550145149230957,0.0
42,1,Decision Tree,2,0.25,0.5398773006134969,0.592989163392534,0.02782440185546875,0.0
43,1,RandomForest,2,0.25,0.5521472392638037,0.6109575107015982,0.17751479148864746,0.0
44,1,AdaBoost (Discrete),2,0.25,0.6871165644171779,0.5551196753604066,9.046036720275879,0.0
45,1,AdaBoost (Real),2,0.25,0.5460122699386503,0.6807129670270932,10.588983297348022,0.0
46,1,Logistic Regression (Penalty = L2),2,0.25,0.5705521472392638,0.35069006023948646,0.12008857727050781,0.0
47,1,Naive Bayes,2,0.25,0.26993865030674846,0.4647885256034024,0.056716203689575195,0.0
48,2,KNeighbors Classifier,0,0.25,0.6069364161849711,0.5270137789071607,0.08092784881591797,0.0
49,2,SVC Classifier,0,0.25,0.49710982658959535,1.0,0.09665584564208984,0.0
50,2,Decision Tree,0,0.25,0.5895953757225434,0.5127386960029386,0.024488210678100586,0.0
51,2,RandomForest,0,0.25,0.5491329479768786,0.6666920717185073,0.09298849105834961,0.0
52,2,AdaBoost (Discrete),0,0.25,0.6763005780346821,0.5999849962030518,11.386300802230835,0.0
53,2,AdaBoost (Real),0,0.25,0.5838150289017341,0.6319630678090885,12.579530954360962,0.0
54,2,Logistic Regression (Penalty = L2),0,0.25,0.6473988439306358,0.5403200344995297,0.22088384628295898,0.0
55,2,Naive Bayes,0,0.25,0.24855491329479767,0.43929454483276636,0.053290605545043945,0.0
56,2,KNeighbors Classifier,1,0.25,0.6071428571428571,0.5332646726087971,0.09203505516052246,0.0
57,2,SVC Classifier,1,0.25,0.5119047619047619,1.0,0.11478257179260254,0.0
58,2,Decision Tree,1,0.25,0.5773809523809523,0.6381648237943002,0.003623485565185547,0.0
59,2,RandomForest,1,0.25,0.5892857142857143,0.7560007651179461,0.12780499458312988,0.0
60,2,AdaBoost (Discrete),1,0.25,0.6904761904761905,0.5490564758937877,11.600960969924927,0.5490564758937877
61,2,AdaBoost (Real),1,0.25,0.5714285714285714,0.53121910574097,12.789546489715576,0.0
62,2,Logistic Regression (Penalty = L2),1,0.25,0.6904761904761905,0.6900567468512163,0.21008849143981934,0.0
63,2,Naive Bayes,1,0.25,0.2916666666666667,0.48674491251435925,0.04535174369812012,0.0
64,2,KNeighbors Classifier,2,0.25,0.6441717791411042,0.68627982307689,0.11823153495788574,0.0
65,2,SVC Classifier,2,0.25,0.5153374233128835,1.0,0.0901792049407959,0.0
66,2,Decision Tree,2,0.25,0.5705521472392638,0.5296177406779738,0.0029783248901367188,0.0
67,2,RandomForest,2,0.25,0.558282208588957,0.6128818101499457,0.09955620765686035,0.0
68,2,AdaBoost (Discrete),2,0.25,0.7361963190184049,0.572432069460628,11.246198892593384,0.0
69,2,AdaBoost (Real),2,0.25,0.558282208588957,0.830783684049387,12.038731575012207,0.0
70,2,Logistic Regression (Penalty = L2),2,0.25,0.656441717791411,0.6780987157939656,0.20909619331359863,0.0
71,2,Naive Bayes,2,0.25,0.25153374233128833,0.4198548231432729,0.08627915382385254,0.0
72,3,KNeighbors Classifier,0,0.25,0.6242774566473989,0.5576648055798173,0.11040592193603516,0.0
73,3,SVC Classifier,0,0.25,0.49710982658959535,1.0,0.1176598072052002,0.0
74,3,Decision Tree,0,0.25,0.6127167630057804,0.5499739161291354,0.024245262145996094,0.0
75,3,RandomForest,0,0.25,0.5144508670520231,0.48892302243490104,0.12050700187683105,0.0
76,3,AdaBoost (Discrete),0,0.25,0.7167630057803468,0.5992071658930147,11.071593523025513,0.0
77,3,AdaBoost (Real),0,0.25,0.6473988439306358,0.7357897351951632,12.644708395004272,0.0
78,3,Logistic Regression (Penalty = L2),0,0.25,0.7167630057803468,0.6080319667895049,0.15158796310424805,0.0
79,3,Naive Bayes,0,0.25,0.24277456647398843,0.37351922320706504,0.06348609924316406,0.0
80,3,KNeighbors Classifier,1,0.25,0.6428571428571429,0.5618685100498971,0.08750414848327637,0.0
81,3,SVC Classifier,1,0.25,0.5119047619047619,1.0,0.09521651268005371,0.0
82,3,Decision Tree,1,0.25,0.6011904761904762,0.5579467773223107,0.0042302608489990234,0.0
83,3,RandomForest,1,0.25,0.5416666666666666,0.5081327481546147,0.1227419376373291,0.0
84,3,AdaBoost (Discrete),1,0.25,0.6666666666666666,0.5896060241534039,11.394757747650146,0.0
85,3,AdaBoost (Real),1,0.25,0.6071428571428571,0.5103879315632266,12.738033533096313,0.0
86,3,Logistic Regression (Penalty = L2),1,0.25,0.7857142857142857,0.6675002476984438,0.1771702766418457,0.0
87,3,Naive Bayes,1,0.25,0.27976190476190477,0.4732816765743484,0.053411245346069336,0.0
88,3,KNeighbors Classifier,2,0.25,0.6503067484662577,0.5610227361808513,0.10044670104980469,0.0
89,3,SVC Classifier,2,0.25,0.5153374233128835,1.0,0.08644652366638184,0.0
90,3,Decision Tree,2,0.25,0.5521472392638037,0.6569568341388567,0.0029816627502441406,0.0
91,3,RandomForest,2,0.25,0.5460122699386503,0.6042750794713536,0.10042977333068848,0.0
92,3,AdaBoost (Discrete),2,0.25,0.7607361963190185,0.6608867057188048,11.441956758499146,0.0
93,3,AdaBoost (Real),2,0.25,0.5644171779141104,0.647991645295736,12.593137264251709,0.0
94,3,Logistic Regression (Penalty = L2),2,0.25,0.7177914110429447,0.5982236439408122,0.19051909446716309,0.0
95,3,Naive Bayes,2,0.25,0.3006134969325153,0.5649985708594787,0.05670523643493652,0.0
96,4,KNeighbors Classifier,0,0.25,0.13872832369942195,0.25228042482661817,0.05056643486022949,0.0
97,4,SVC Classifier,0,0.25,0.49710982658959535,1.0,0.033896684646606445,0.0
98,4,Decision Tree,0,0.25,0.5086705202312138,0.3364097484985315,0.001996278762817383,0.0
99,4,RandomForest,0,0.25,0.49710982658959535,1.0,0.10508608818054199,0.0
100,4,AdaBoost (Discrete),0,0.25,0.48554913294797686,0.2705467285284472,6.361222505569458,0.0
101,4,AdaBoost (Real),0,0.25,0.5086705202312138,0.3364097484985315,7.554168224334717,0.0
102,4,Logistic Regression (Penalty = L2),0,0.25,0.49710982658959535,1.0,0.04278397560119629,0.0
103,4,Naive Bayes,0,0.25,0.10982658959537572,0.2941363310879346,0.033974647521972656,0.0
104,4,KNeighbors Classifier,1,0.25,0.5238095238095238,0.329340597116918,0.049533843994140625,0.0
105,4,SVC Classifier,1,0.25,0.5119047619047619,1.0,0.0423886775970459,0.0
106,4,Decision Tree,1,0.25,0.5119047619047619,0.37448406087883596,0.0013613700866699219,0.0
107,4,RandomForest,1,0.25,0.5119047619047619,1.0,0.09364581108093262,0.0
108,4,AdaBoost (Discrete),1,0.25,0.5119047619047619,0.37448406087883596,6.015611886978149,0.0
109,4,AdaBoost (Real),1,0.25,0.5119047619047619,0.37448406087883596,7.549858808517456,0.0
110,4,Logistic Regression (Penalty = L2),1,0.25,0.5119047619047619,1.0,0.03942680358886719,0.0
111,4,Naive Bayes,1,0.25,0.10714285714285714,0.19806055721940083,0.01901984214782715,0.0
112,4,KNeighbors Classifier,2,0.25,0.5153374233128835,0.6273573525873524,0.07570672035217285,0.0
113,4,SVC Classifier,2,0.25,0.5153374233128835,1.0,0.04385948181152344,0.0
114,4,Decision Tree,2,0.25,0.5276073619631901,0.34767076144023246,0.0021326541900634766,0.0
115,4,RandomForest,2,0.25,0.5153374233128835,1.0,0.0979924201965332,0.0
116,4,AdaBoost (Discrete),2,0.25,0.5398773006134969,0.2824174146135648,6.035689115524292,0.0
117,4,AdaBoost (Real),2,0.25,0.5460122699386503,0.28293184295483104,6.96570348739624,0.0
118,4,Logistic Regression (Penalty = L2),2,0.25,0.5153374233128835,1.0,0.03175854682922363,0.0
119,4,Naive Bayes,2,0.25,0.12883435582822086,0.21341998210577443,0.030263423919677734,0.0
120,6,KNeighbors Classifier,0,0.25,0.1329479768786127,0.23144580013592386,0.028468847274780273,0.0
121,6,SVC Classifier,0,0.25,0.47398843930635837,1.0,0.005708217620849609,0.0
122,6,Decision Tree,0,0.25,0.5028901734104047,0.48799729377078904,0.0012161731719970703,0.0
123,6,RandomForest,0,0.25,0.5086705202312138,0.4899973050296446,0.13566994667053223,0.0
124,6,AdaBoost (Discrete),0,0.25,0.5028901734104047,0.38924388731965215,5.003833532333374,0.0
125,6,AdaBoost (Real),0,0.25,0.49710982658959535,0.48598075302477,6.785842418670654,0.0
126,6,Logistic Regression (Penalty = L2),0,0.25,0.49710982658959535,1.0,0.007193326950073242,0.0
127,6,Naive Bayes,0,0.25,0.08670520231213873,0.39165418135068353,0.0310366153717041,0.0
128,6,KNeighbors Classifier,1,0.25,0.5357142857142857,0.6173579189986083,0.0035657882690429688,0.0
129,6,SVC Classifier,1,0.25,0.4880952380952381,1.0,0.030679702758789062,0.0
130,6,Decision Tree,1,0.25,0.5357142857142857,0.6173579189986083,0.0011932849884033203,0.0
131,6,RandomForest,1,0.25,0.5357142857142857,0.6173579189986083,0.0796504020690918,0.0
132,6,AdaBoost (Discrete),1,0.25,0.5357142857142857,0.6173579189986083,5.592880725860596,0.0
133,6,AdaBoost (Real),1,0.25,0.5357142857142857,0.6173579189986083,7.043384313583374,0.0
134,6,Logistic Regression (Penalty = L2),1,0.25,0.5119047619047619,1.0,0.029423236846923828,0.0
135,6,Naive Bayes,1,0.25,0.09523809523809523,0.6173579189986083,0.03132748603820801,0.0
136,6,KNeighbors Classifier,2,0.25,0.5214723926380368,0.3968502629920499,0.02914905548095703,0.0
137,6,SVC Classifier,2,0.25,0.49693251533742333,1.0,0.031107187271118164,0.0
138,6,Decision Tree,2,0.25,0.5214723926380368,0.3968502629920499,0.0017616748809814453,0.0
139,6,RandomForest,2,0.25,0.5214723926380368,0.3968502629920499,0.0971531867980957,0.0
140,6,AdaBoost (Discrete),2,0.25,0.5214723926380368,0.35245708781352136,5.542533874511719,0.0
141,6,AdaBoost (Real),2,0.25,0.5214723926380368,0.3968502629920499,7.388484001159668,0.0
142,6,Logistic Regression (Penalty = L2),2,0.25,0.5153374233128835,1.0,0.004410743713378906,0.0
143,6,Naive Bayes,2,0.25,0.07975460122699386,0.3535533905932738,0.029184579849243164,0.0
144,7,KNeighbors Classifier,0,0.25,0.6127167630057804,0.46530285960583834,0.05817413330078125,0.0
145,7,SVC Classifier,0,0.25,0.49710982658959535,1.0,0.025744915008544922,0.0
146,7,Decision Tree,0,0.25,0.5375722543352601,0.5334683785052738,0.003021717071533203,0.0
147,7,RandomForest,0,0.25,0.5606936416184971,0.7903765226488096,0.0988621711730957,0.0
148,7,AdaBoost (Discrete),0,0.25,0.5491329479768786,0.4786633194429704,6.586661338806152,0.0
149,7,AdaBoost (Real),0,0.25,0.5317919075144508,0.506848151874472,8.304802179336548,0.0
150,7,Logistic Regression (Penalty = L2),0,0.25,0.5028901734104047,0.5227579585747102,0.09424614906311035,0.0
151,7,Naive Bayes,0,0.25,0.2658959537572254,0.49438853531703153,0.03173947334289551,0.0
152,7,KNeighbors Classifier,1,0.25,0.6190476190476191,0.6108291803048828,0.05504965782165527,0.0
153,7,SVC Classifier,1,0.25,0.5119047619047619,1.0,0.04390859603881836,0.0
154,7,Decision Tree,1,0.25,0.49404761904761907,0.5560527314929109,0.0032989978790283203,0.0
155,7,RandomForest,1,0.25,0.5654761904761905,0.7551595516923566,0.11925244331359863,0.0
156,7,AdaBoost (Discrete),1,0.25,0.6130952380952381,0.6060237114870761,6.280077934265137,0.0
157,7,AdaBoost (Real),1,0.25,0.5892857142857143,0.6830451166761059,8.373931169509888,0.0
158,7,Logistic Regression (Penalty = L2),1,0.25,0.5238095238095238,0.6933612743506347,0.09069013595581055,0.0
159,7,Naive Bayes,1,0.25,0.27976190476190477,0.5361531817903877,0.042470693588256836,0.0
160,7,KNeighbors Classifier,2,0.25,0.6441717791411042,0.5863661505598036,0.07059788703918457,0.0
161,7,SVC Classifier,2,0.25,0.5153374233128835,1.0,0.04010295867919922,0.0
162,7,Decision Tree,2,0.25,0.5153374233128835,0.5525632848718708,0.01929163932800293,0.0
163,7,RandomForest,2,0.25,0.588957055214724,0.9077566051105,0.07407641410827637,0.0
164,7,AdaBoost (Discrete),2,0.25,0.588957055214724,0.640898916903857,6.340368986129761,0.0
165,7,AdaBoost (Real),2,0.25,0.49079754601226994,0.483569786146853,7.114707946777344,0.0
166,7,Logistic Regression (Penalty = L2),2,0.25,0.5398773006134969,0.9371474058908325,0.06409811973571777,0.0
167,7,Naive Bayes,2,0.25,0.44785276073619634,0.5211686195760588,0.0055294036865234375,0.0
168,8,KNeighbors Classifier,0,0.25,0.5838150289017341,0.6008055477125355,0.027489900588989258,0.0
169,8,SVC Classifier,0,0.25,0.47398843930635837,1.0,0.03351950645446777,0.0
170,8,Decision Tree,0,0.25,0.5260115606936416,0.5027638233323652,0.01878666877746582,0.0
171,8,RandomForest,0,0.25,0.5144508670520231,0.2975928234249098,0.10020041465759277,0.0
172,8,AdaBoost (Discrete),0,0.25,0.5375722543352601,0.559826742329925,5.4568259716033936,0.0
173,8,AdaBoost (Real),0,0.25,0.5895953757225434,0.6734776309964862,6.7376484870910645,0.0
174,8,Logistic Regression (Penalty = L2),0,0.25,0.49710982658959535,1.0,0.024675607681274414,0.0
175,8,Naive Bayes,0,0.25,0.19653179190751446,0.5460643110494057,0.004566192626953125,0.0
176,8,KNeighbors Classifier,1,0.25,0.6011904761904762,0.6078282091308815,0.02900385856628418,0.0
177,8,SVC Classifier,1,0.25,0.4880952380952381,1.0,0.031584978103637695,0.0
178,8,Decision Tree,1,0.25,0.5238095238095238,0.6536018815162206,0.0020656585693359375,0.0
179,8,RandomForest,1,0.25,0.5476190476190477,0.5382459516254351,0.09966182708740234,0.0
180,8,AdaBoost (Discrete),1,0.25,0.5,0.4865261190588881,5.576577425003052,0.0
181,8,AdaBoost (Real),1,0.25,0.5476190476190477,0.6155298855475788,6.918294668197632,0.0
182,8,Logistic Regression (Penalty = L2),1,0.25,0.5119047619047619,1.0,0.03374600410461426,0.0
183,8,Naive Bayes,1,0.25,0.16666666666666666,0.8819423096017339,0.029809951782226562,0.0
184,8,KNeighbors Classifier,2,0.25,0.6319018404907976,0.756365286493104,0.028731584548950195,0.0
185,8,SVC Classifier,2,0.25,0.5153374233128835,1.0,0.03132367134094238,0.0
186,8,Decision Tree,2,0.25,0.5460122699386503,0.6751395002165647,0.001556396484375,0.0
187,8,RandomForest,2,0.25,0.5950920245398773,0.5135330435446758,0.09383273124694824,0.0
188,8,AdaBoost (Discrete),2,0.25,0.5460122699386503,0.5497627343375057,5.211828231811523,0.0
189,8,AdaBoost (Real),2,0.25,0.5828220858895705,0.6569374001890843,6.380396127700806,0.0
190,8,Logistic Regression (Penalty = L2),2,0.25,0.5214723926380368,0.3968502629920499,0.03211212158203125,0.0
191,8,Naive Bayes,2,0.25,0.15337423312883436,0.5868239318562383,0.006643533706665039,0.0
192,9,KNeighbors Classifier,0,0.25,0.6011560693641619,0.5465856420988362,0.03487372398376465,0.0
193,9,SVC Classifier,0,0.25,0.49710982658959535,1.0,0.06825828552246094,0.0
194,9,Decision Tree,0,0.25,0.5549132947976878,0.5241923835179018,0.002275705337524414,0.0
195,9,RandomForest,0,0.25,0.5317919075144508,0.32011247998491643,0.09540700912475586,0.0
196,9,AdaBoost (Discrete),0,0.25,0.6473988439306358,0.5736471133181272,7.100534200668335,0.0
197,9,AdaBoost (Real),0,0.25,0.5606936416184971,0.47935164303131983,8.409616470336914,0.0
198,9,Logistic Regression (Penalty = L2),0,0.25,0.6069364161849711,0.39627625816529866,0.10038328170776367,0.0
199,9,Naive Bayes,0,0.25,0.18497109826589594,0.42293372613577745,0.024951457977294922,0.0
200,9,KNeighbors Classifier,1,0.25,0.6071428571428571,0.5692812478853123,0.036295413970947266,0.0
201,9,SVC Classifier,1,0.25,0.5119047619047619,1.0,0.04738569259643555,0.0
202,9,Decision Tree,1,0.25,0.5654761904761905,0.7751682683061601,0.002302408218383789,0.0
203,9,RandomForest,1,0.25,0.5773809523809523,0.44574002785457,0.10020923614501953,0.0
204,9,AdaBoost (Discrete),1,0.25,0.6071428571428571,0.6080507730224691,7.341715574264526,0.0
205,9,AdaBoost (Real),1,0.25,0.5595238095238095,0.8508446614373998,8.710151195526123,0.0
206,9,Logistic Regression (Penalty = L2),1,0.25,0.6785714285714286,0.6131163270689182,0.0924673080444336,0.0
207,9,Naive Bayes,1,0.25,0.23809523809523808,0.40439784245535804,0.033118486404418945,0.0
208,9,KNeighbors Classifier,2,0.25,0.6134969325153374,0.7302149409994442,0.056546688079833984,0.0
209,9,SVC Classifier,2,0.25,0.5153374233128835,1.0,0.053003787994384766,0.0
210,9,Decision Tree,2,0.25,0.5276073619631901,0.6796534611302069,0.003749847412109375,0.0
211,9,RandomForest,2,0.25,0.6012269938650306,0.5295266543086656,0.0708775520324707,0.0
212,9,AdaBoost (Discrete),2,0.25,0.6380368098159509,0.6057633382753246,7.579231262207031,0.0
213,9,AdaBoost (Real),2,0.25,0.6196319018404908,0.5408927569466259,8.90414834022522,0.0
214,9,Logistic Regression (Penalty = L2),2,0.25,0.6257668711656442,0.5021077132742979,0.13302397727966309,0.0
215,9,Naive Bayes,2,0.25,0.1901840490797546,0.4003656589614592,0.05684924125671387,0.0
216,10,KNeighbors Classifier,0,0.25,0.5895953757225434,0.5450480292233325,0.06907868385314941,0.0
217,10,SVC Classifier,0,0.25,0.49710982658959535,1.0,0.0825655460357666,0.0
218,10,Decision Tree,0,0.25,0.5895953757225434,0.6009147726058565,0.0038919448852539062,0.0
219,10,RandomForest,0,0.25,0.5491329479768786,0.6666920717185073,0.09367585182189941,0.0
220,10,AdaBoost (Discrete),0,0.25,0.6936416184971098,0.5890358572885688,8.709031820297241,0.0
221,10,AdaBoost (Real),0,0.25,0.630057803468208,0.6943377365756876,9.592782974243164,0.0
222,10,Logistic Regression (Penalty = L2),0,0.25,0.6184971098265896,0.3728240422402359,0.11392092704772949,0.0
223,10,Naive Bayes,0,0.25,0.20809248554913296,0.4833129782494662,0.05230379104614258,0.0
224,10,KNeighbors Classifier,1,0.25,0.6130952380952381,0.5700563192914028,0.10273623466491699,0.0
225,10,SVC Classifier,1,0.25,0.5119047619047619,1.0,0.052773237228393555,0.0
226,10,Decision Tree,1,0.25,0.5595238095238095,0.5809538042743205,0.0025954246520996094,0.0
227,10,RandomForest,1,0.25,0.5714285714285714,0.757508443356907,0.12013840675354004,0.0
228,10,AdaBoost (Discrete),1,0.25,0.6666666666666666,0.6137195489579013,8.450330972671509,0.0
229,10,AdaBoost (Real),1,0.25,0.5892857142857143,0.6696701072320818,9.763107776641846,0.0
230,10,Logistic Regression (Penalty = L2),1,0.25,0.6726190476190477,0.6515385554297655,0.17115497589111328,0.0
231,10,Naive Bayes,1,0.25,0.25,0.4496811151747973,0.06935572624206543,0.0
232,10,KNeighbors Classifier,2,0.25,0.6196319018404908,0.7314003756750214,0.08255696296691895,0.0
233,10,SVC Classifier,2,0.25,0.5153374233128835,1.0,0.017325639724731445,0.0
234,10,Decision Tree,2,0.25,0.558282208588957,0.5632888573467761,0.00395512580871582,0.0
235,10,RandomForest,2,0.25,0.5950920245398773,0.5569120893014394,0.0280609130859375,0.0
236,10,AdaBoost (Discrete),2,0.25,0.6993865030674846,0.6536616456959202,7.910304069519043,0.0
237,10,AdaBoost (Real),2,0.25,0.5766871165644172,0.7607643939942106,9.483764171600342,0.0
238,10,Logistic Regression (Penalty = L2),2,0.25,0.6380368098159509,0.5388405618271863,0.11001110076904297,0.0
239,10,Naive Bayes,2,0.25,0.2392638036809816,0.42571124270701227,0.02680492401123047,0.0
240,11,KNeighbors Classifier,0,0.25,0.630057803468208,0.5445266976642471,0.1881425380706787,0.0
241,11,SVC Classifier,0,0.25,0.49710982658959535,1.0,0.17213106155395508,0.0
242,11,Decision Tree,0,0.25,0.630057803468208,0.6259130121466817,0.0049893856048583984,0.0
243,11,RandomForest,0,0.25,0.5491329479768786,0.5856596027429395,0.0823218822479248,0.0
244,11,AdaBoost (Discrete),0,0.25,0.7341040462427746,0.6103749157264865,13.49302053451538,0.0
245,11,AdaBoost (Real),0,0.25,0.5433526011560693,0.4765643368669437,14.825469017028809,0.0
246,11,Logistic Regression (Penalty = L2),0,0.25,0.7052023121387283,0.5851519990642929,0.2582428455352783,0.0
247,11,Naive Bayes,0,0.25,0.2543352601156069,0.4594759073496625,0.10070466995239258,0.0
248,11,KNeighbors Classifier,1,0.25,0.6369047619047619,0.5409354453156615,0.1543886661529541,0.0
249,11,SVC Classifier,1,0.25,0.5119047619047619,1.0,0.17003297805786133,0.0
250,11,Decision Tree,1,0.25,0.6190476190476191,0.5800321163276735,0.00435638427734375,0.0
251,11,RandomForest,1,0.25,0.5595238095238095,0.6992846463522321,0.16750431060791016,0.0
252,11,AdaBoost (Discrete),1,0.25,0.7440476190476191,0.6985209405617033,12.742499589920044,0.0
253,11,AdaBoost (Real),1,0.25,0.6369047619047619,0.590234492468298,14.277203559875488,0.0
254,11,Logistic Regression (Penalty = L2),1,0.25,0.7738095238095238,0.6909299298737666,0.2723076343536377,0.0
255,11,Naive Bayes,1,0.25,0.25595238095238093,0.4240759390680204,0.10779523849487305,0.0
256,11,KNeighbors Classifier,2,0.25,0.6380368098159509,0.5767274153295001,0.14613652229309082,0.0
257,11,SVC Classifier,2,0.25,0.5153374233128835,1.0,0.1704719066619873,0.0
258,11,Decision Tree,2,0.25,0.5950920245398773,0.6027940465658435,0.029645681381225586,0.0
259,11,RandomForest,2,0.25,0.5766871165644172,0.4291871094662785,0.09737586975097656,0.0
260,11,AdaBoost (Discrete),2,0.25,0.7852760736196319,0.7453320880890213,13.925967693328857,0.0
261,11,AdaBoost (Real),2,0.25,0.6257668711656442,0.8337639034473011,14.766456604003906,0.0
262,11,Logistic Regression (Penalty = L2),2,0.25,0.754601226993865,0.7231767448195898,0.3283557891845703,0.0
263,11,Naive Bayes,2,0.25,0.294478527607362,0.48094861014454465,0.08967328071594238,0.48094861014454465
