,feat_set_id,classifier,fold_id,feat_th,score,geo_score,exec_t,geo_score_woz
0,0,KNeighbors Classifier,0,0.9,0.9047619047619048,0.8819171036881969,0.046816110610961914,0.8819171036881969
1,0,SVC Classifier,0,0.9,0.7142857142857143,1.0,0.03085637092590332,0.0
2,0,Decision Tree,0,0.9,0.5714285714285714,0.4714045207910317,0.022083044052124023,0.4714045207910317
3,0,RandomForest,0,0.9,0.9523809523809523,0.9128709291752769,0.13499736785888672,0.9128709291752769
4,0,AdaBoost (Discrete),0,0.9,0.9523809523809523,0.9128709291752769,0.04537844657897949,0.9128709291752769
5,0,AdaBoost (Real),0,0.9,0.9523809523809523,0.9128709291752769,0.023079395294189453,0.9128709291752769
6,0,Logistic Regression (Penalty = L2),0,0.9,1.0,1.0,0.023982763290405273,1.0
7,0,Naive Bayes,0,0.9,0.9523809523809523,0.9128709291752769,0.02224874496459961,0.9128709291752769
8,0,KNeighbors Classifier,1,0.9,0.8095238095238095,0.6831300510639732,0.02355504035949707,0.6831300510639732
9,0,SVC Classifier,1,0.9,0.7142857142857143,1.0,0.0013227462768554688,0.0
10,0,Decision Tree,1,0.9,0.8095238095238095,0.7601169500660919,0.0018253326416015625,0.7601169500660919
11,0,RandomForest,1,0.9,1.0,1.0,0.14505577087402344,1.0
12,0,AdaBoost (Discrete),1,0.9,0.9523809523809523,0.9660917830792959,0.002595663070678711,0.9660917830792959
13,0,AdaBoost (Real),1,0.9,0.9523809523809523,0.9660917830792959,0.024552345275878906,0.9660917830792959
14,0,Logistic Regression (Penalty = L2),1,0.9,0.9523809523809523,0.9660917830792959,0.022232770919799805,0.9660917830792959
15,0,Naive Bayes,1,0.9,0.9523809523809523,0.9128709291752769,0.001642465591430664,0.9128709291752769
16,0,KNeighbors Classifier,2,0.9,0.7894736842105263,0.4472135954999579,0.0022470951080322266,0.4472135954999579
17,0,SVC Classifier,2,0.9,0.7368421052631579,1.0,0.0014033317565917969,0.0
18,0,Decision Tree,2,0.9,1.0,1.0,0.0010726451873779297,1.0
19,0,RandomForest,2,0.9,1.0,1.0,0.11760997772216797,1.0
20,0,AdaBoost (Discrete),2,0.9,0.8947368421052632,0.7745966692414834,0.024144411087036133,0.7745966692414834
21,0,AdaBoost (Real),2,0.9,0.8947368421052632,0.7745966692414834,0.02779102325439453,0.7745966692414834
22,0,Logistic Regression (Penalty = L2),2,0.9,0.8947368421052632,0.7745966692414834,0.0013058185577392578,0.7745966692414834
23,0,Naive Bayes,2,0.9,0.8947368421052632,0.7745966692414834,0.022291183471679688,0.7745966692414834
24,1,KNeighbors Classifier,0,0.9,0.9047619047619048,0.8819171036881969,0.024204015731811523,0.8819171036881969
25,1,SVC Classifier,0,0.9,0.7142857142857143,1.0,0.0019598007202148438,0.0
26,1,Decision Tree,0,0.9,0.7619047619047619,0.7302967433402214,0.030050277709960938,0.7302967433402214
27,1,RandomForest,0,0.9,0.9523809523809523,0.9128709291752769,0.12351036071777344,0.9128709291752769
28,1,AdaBoost (Discrete),0,0.9,0.9523809523809523,0.9128709291752769,0.027767419815063477,0.9128709291752769
29,1,AdaBoost (Real),0,0.9,0.9523809523809523,0.9128709291752769,0.023349285125732422,0.9128709291752769
30,1,Logistic Regression (Penalty = L2),0,0.9,1.0,1.0,0.022174596786499023,1.0
31,1,Naive Bayes,0,0.9,0.9523809523809523,0.9128709291752769,0.022312164306640625,0.9128709291752769
32,1,KNeighbors Classifier,1,0.9,0.9047619047619048,0.8819171036881969,0.023298025131225586,0.8819171036881969
33,1,SVC Classifier,1,0.9,0.7142857142857143,1.0,0.002213716506958008,0.0
34,1,Decision Tree,1,0.9,0.7619047619047619,0.6582805886043833,0.018417835235595703,0.6582805886043833
35,1,RandomForest,1,0.9,0.9523809523809523,0.9660917830792959,0.14471149444580078,0.9660917830792959
36,1,AdaBoost (Discrete),1,0.9,0.9523809523809523,0.9660917830792959,0.024354219436645508,0.9660917830792959
37,1,AdaBoost (Real),1,0.9,0.9523809523809523,0.9660917830792959,0.023951292037963867,0.9660917830792959
38,1,Logistic Regression (Penalty = L2),1,0.9,0.9523809523809523,0.9660917830792959,0.02182626724243164,0.9660917830792959
39,1,Naive Bayes,1,0.9,0.9523809523809523,0.9128709291752769,0.019215106964111328,0.9128709291752769
40,1,KNeighbors Classifier,2,0.9,0.8421052631578947,0.6324555320336759,0.0020112991333007812,0.6324555320336759
41,1,SVC Classifier,2,0.9,0.7368421052631579,1.0,0.001771688461303711,0.0
42,1,Decision Tree,2,0.9,0.8421052631578947,0.7464200272921789,0.0010700225830078125,0.7464200272921789
43,1,RandomForest,2,0.9,0.9473684210526315,0.8944271909999159,0.13856935501098633,0.8944271909999159
44,1,AdaBoost (Discrete),2,0.9,0.9473684210526315,0.8944271909999159,0.023488998413085938,0.8944271909999159
45,1,AdaBoost (Real),2,0.9,0.8947368421052632,0.7745966692414834,0.041083335876464844,0.7745966692414834
46,1,Logistic Regression (Penalty = L2),2,0.9,0.8947368421052632,0.7745966692414834,0.02639031410217285,0.7745966692414834
47,1,Naive Bayes,2,0.9,0.8947368421052632,0.7745966692414834,0.002840280532836914,0.7745966692414834
48,2,KNeighbors Classifier,0,0.9,0.9523809523809523,0.9128709291752769,0.022942304611206055,0.9128709291752769
49,2,SVC Classifier,0,0.9,0.7142857142857143,1.0,0.0020606517791748047,0.0
50,2,Decision Tree,0,0.9,0.8095238095238095,0.816496580927726,0.0015952587127685547,0.816496580927726
51,2,RandomForest,0,0.9,0.9523809523809523,0.9128709291752769,0.16341948509216309,0.9128709291752769
52,2,AdaBoost (Discrete),0,0.9,0.9523809523809523,0.9128709291752769,0.0027425289154052734,0.9128709291752769
53,2,AdaBoost (Real),0,0.9,0.9523809523809523,0.9128709291752769,0.027779579162597656,0.9128709291752769
54,2,Logistic Regression (Penalty = L2),0,0.9,1.0,1.0,0.0012645721435546875,1.0
55,2,Naive Bayes,0,0.9,0.9523809523809523,0.9128709291752769,0.0016696453094482422,0.9128709291752769
56,2,KNeighbors Classifier,1,0.9,0.8571428571428571,0.7888106377466155,0.022916555404663086,0.7888106377466155
57,2,SVC Classifier,1,0.9,0.7142857142857143,1.0,0.001753091812133789,0.0
58,2,Decision Tree,1,0.9,0.9523809523809523,0.9660917830792959,0.0011186599731445312,0.9660917830792959
59,2,RandomForest,1,0.9,1.0,1.0,0.11940670013427734,1.0
60,2,AdaBoost (Discrete),1,0.9,0.9523809523809523,0.9660917830792959,0.023020505905151367,0.9660917830792959
61,2,AdaBoost (Real),1,0.9,0.9523809523809523,0.9660917830792959,0.02441859245300293,0.9660917830792959
62,2,Logistic Regression (Penalty = L2),1,0.9,1.0,1.0,0.021984338760375977,1.0
63,2,Naive Bayes,1,0.9,0.9523809523809523,0.9128709291752769,0.022701740264892578,0.9128709291752769
64,2,KNeighbors Classifier,2,0.9,0.7894736842105263,0.4472135954999579,0.022638797760009766,0.4472135954999579
65,2,SVC Classifier,2,0.9,0.7368421052631579,1.0,0.0011246204376220703,0.0
66,2,Decision Tree,2,0.9,0.9473684210526315,0.8944271909999159,0.021892309188842773,0.8944271909999159
67,2,RandomForest,2,0.9,0.9473684210526315,0.8944271909999159,0.14679384231567383,0.8944271909999159
68,2,AdaBoost (Discrete),2,0.9,0.9473684210526315,0.8944271909999159,0.023736953735351562,0.8944271909999159
69,2,AdaBoost (Real),2,0.9,0.9473684210526315,0.8944271909999159,0.023647308349609375,0.8944271909999159
70,2,Logistic Regression (Penalty = L2),2,0.9,0.8947368421052632,0.7745966692414834,0.0012857913970947266,0.7745966692414834
71,2,Naive Bayes,2,0.9,0.8947368421052632,0.7745966692414834,0.0015552043914794922,0.7745966692414834
72,3,KNeighbors Classifier,0,0.9,0.8571428571428571,0.7071067811865476,0.02226424217224121,0.7071067811865476
73,3,SVC Classifier,0,0.9,0.7142857142857143,1.0,0.0012011528015136719,0.0
74,3,Decision Tree,0,0.9,0.9047619047619048,0.9309493362512627,0.001775979995727539,0.9309493362512627
75,3,RandomForest,0,0.9,0.9523809523809523,0.9128709291752769,0.1157677173614502,0.9128709291752769
76,3,AdaBoost (Discrete),0,0.9,0.9523809523809523,0.9128709291752769,0.024515390396118164,0.9128709291752769
77,3,AdaBoost (Real),0,0.9,0.9523809523809523,0.9128709291752769,0.015238761901855469,0.9128709291752769
78,3,Logistic Regression (Penalty = L2),0,0.9,1.0,1.0,0.0013451576232910156,1.0
79,3,Naive Bayes,0,0.9,0.9523809523809523,0.9128709291752769,0.022200584411621094,0.9128709291752769
80,3,KNeighbors Classifier,1,0.9,0.8571428571428571,0.7888106377466155,0.0033216476440429688,0.7888106377466155
81,3,SVC Classifier,1,0.9,0.7142857142857143,1.0,0.0011899471282958984,0.0
82,3,Decision Tree,1,0.9,0.9523809523809523,0.9660917830792959,0.0009930133819580078,0.9660917830792959
83,3,RandomForest,1,0.9,1.0,1.0,0.14891839027404785,1.0
84,3,AdaBoost (Discrete),1,0.9,0.9523809523809523,0.9660917830792959,0.030803680419921875,0.9660917830792959
85,3,AdaBoost (Real),1,0.9,0.9523809523809523,0.9660917830792959,0.0045545101165771484,0.9660917830792959
86,3,Logistic Regression (Penalty = L2),1,0.9,0.9523809523809523,0.9660917830792959,0.001748800277709961,0.9660917830792959
87,3,Naive Bayes,1,0.9,0.9523809523809523,0.9128709291752769,0.16632652282714844,0.9128709291752769
88,3,KNeighbors Classifier,2,0.9,0.7894736842105263,0.4472135954999579,0.03125166893005371,0.4472135954999579
89,3,SVC Classifier,2,0.9,0.7368421052631579,1.0,0.03789472579956055,0.0
90,3,Decision Tree,2,0.9,1.0,1.0,0.001413583755493164,1.0
91,3,RandomForest,2,0.9,0.9473684210526315,0.8944271909999159,0.2295072078704834,0.8944271909999159
92,3,AdaBoost (Discrete),2,0.9,0.9473684210526315,0.8944271909999159,0.027789831161499023,0.8944271909999159
93,3,AdaBoost (Real),2,0.9,0.9473684210526315,0.8944271909999159,0.03263115882873535,0.8944271909999159
94,3,Logistic Regression (Penalty = L2),2,0.9,0.9473684210526315,0.8944271909999159,0.03365969657897949,0.8944271909999159
95,3,Naive Bayes,2,0.9,0.8947368421052632,0.7745966692414834,0.030292034149169922,0.7745966692414834
96,4,KNeighbors Classifier,0,0.9,0.9047619047619048,0.8819171036881969,0.031182050704956055,0.8819171036881969
97,4,SVC Classifier,0,0.9,0.7142857142857143,1.0,0.037107229232788086,0.0
98,4,Decision Tree,0,0.9,0.9523809523809523,0.9660917830792959,0.0010704994201660156,0.9660917830792959
99,4,RandomForest,0,0.9,0.9047619047619048,0.816496580927726,0.212785005569458,0.816496580927726
100,4,AdaBoost (Discrete),0,0.9,0.9523809523809523,0.9128709291752769,0.0027189254760742188,0.9128709291752769
101,4,AdaBoost (Real),0,0.9,0.9523809523809523,0.9128709291752769,0.002532482147216797,0.9128709291752769
102,4,Logistic Regression (Penalty = L2),0,0.9,1.0,1.0,0.033327341079711914,1.0
103,4,Naive Bayes,0,0.9,0.9523809523809523,0.9128709291752769,0.0015223026275634766,0.9128709291752769
104,4,KNeighbors Classifier,1,0.9,0.8095238095238095,0.6831300510639732,0.034435272216796875,0.6831300510639732
105,4,SVC Classifier,1,0.9,0.7142857142857143,1.0,0.0011622905731201172,0.0
106,4,Decision Tree,1,0.9,0.9047619047619048,0.816496580927726,0.0010223388671875,0.816496580927726
107,4,RandomForest,1,0.9,0.8095238095238095,0.7601169500660919,0.18256759643554688,0.7601169500660919
108,4,AdaBoost (Discrete),1,0.9,0.9523809523809523,0.9660917830792959,0.03592801094055176,0.9660917830792959
109,4,AdaBoost (Real),1,0.9,0.9523809523809523,0.9660917830792959,0.03602457046508789,0.9660917830792959
110,4,Logistic Regression (Penalty = L2),1,0.9,0.9523809523809523,0.9660917830792959,0.002048969268798828,0.9660917830792959
111,4,Naive Bayes,1,0.9,0.9523809523809523,0.9128709291752769,0.002257823944091797,0.9128709291752769
112,4,KNeighbors Classifier,2,0.9,0.8421052631578947,0.6324555320336759,0.0018854141235351562,0.6324555320336759
113,4,SVC Classifier,2,0.9,0.7368421052631579,1.0,0.001252889633178711,0.0
114,4,Decision Tree,2,0.9,0.7894736842105263,0.7171371656006361,0.03349590301513672,0.7171371656006361
115,4,RandomForest,2,0.9,0.9473684210526315,0.8944271909999159,0.14526963233947754,0.8944271909999159
116,4,AdaBoost (Discrete),2,0.9,0.8947368421052632,0.7745966692414834,0.03626513481140137,0.7745966692414834
117,4,AdaBoost (Real),2,0.9,0.8947368421052632,0.7745966692414834,0.02731609344482422,0.7745966692414834
118,4,Logistic Regression (Penalty = L2),2,0.9,0.8947368421052632,0.7745966692414834,0.0015375614166259766,0.7745966692414834
119,4,Naive Bayes,2,0.9,0.8947368421052632,0.7745966692414834,0.0027647018432617188,0.7745966692414834
120,5,KNeighbors Classifier,0,0.9,0.9523809523809523,0.9660917830792959,0.002735614776611328,0.9660917830792959
121,5,SVC Classifier,0,0.9,0.7142857142857143,1.0,0.001926422119140625,0.0
122,5,Decision Tree,0,0.9,1.0,1.0,0.0335698127746582,1.0
123,5,RandomForest,0,0.9,0.9523809523809523,0.9128709291752769,0.18367433547973633,0.9128709291752769
124,5,AdaBoost (Discrete),0,0.9,0.9523809523809523,0.9128709291752769,0.03651571273803711,0.9128709291752769
125,5,AdaBoost (Real),0,0.9,0.9523809523809523,0.9128709291752769,0.03253936767578125,0.9128709291752769
126,5,Logistic Regression (Penalty = L2),0,0.9,1.0,1.0,0.03416562080383301,1.0
127,5,Naive Bayes,0,0.9,0.9523809523809523,0.9128709291752769,0.002747058868408203,0.9128709291752769
128,5,KNeighbors Classifier,1,0.9,0.8571428571428571,0.7888106377466155,0.03192543983459473,0.7888106377466155
129,5,SVC Classifier,1,0.9,0.7142857142857143,1.0,0.002058744430541992,0.0
130,5,Decision Tree,1,0.9,0.8571428571428571,0.8498365855987975,0.029803037643432617,0.8498365855987975
131,5,RandomForest,1,0.9,0.9523809523809523,0.9128709291752769,0.2530543804168701,0.9128709291752769
132,5,AdaBoost (Discrete),1,0.9,0.9523809523809523,0.9660917830792959,0.036574363708496094,0.9660917830792959
133,5,AdaBoost (Real),1,0.9,0.9523809523809523,0.9660917830792959,0.0026760101318359375,0.9660917830792959
134,5,Logistic Regression (Penalty = L2),1,0.9,1.0,1.0,0.0018067359924316406,1.0
135,5,Naive Bayes,1,0.9,0.9523809523809523,0.9128709291752769,0.03533601760864258,0.9128709291752769
136,5,KNeighbors Classifier,2,0.9,0.8421052631578947,0.6324555320336759,0.0018572807312011719,0.6324555320336759
137,5,SVC Classifier,2,0.9,0.7368421052631579,1.0,0.030430316925048828,0.0
138,5,Decision Tree,2,0.9,0.9473684210526315,0.8944271909999159,0.00177001953125,0.8944271909999159
139,5,RandomForest,2,0.9,0.8947368421052632,0.7745966692414834,0.2912123203277588,0.7745966692414834
140,5,AdaBoost (Discrete),2,0.9,0.9473684210526315,0.8944271909999159,0.03672504425048828,0.8944271909999159
141,5,AdaBoost (Real),2,0.9,0.9473684210526315,0.8944271909999159,0.06926226615905762,0.8944271909999159
142,5,Logistic Regression (Penalty = L2),2,0.9,0.8947368421052632,0.7745966692414834,0.0018491744995117188,0.7745966692414834
143,5,Naive Bayes,2,0.9,0.8947368421052632,0.7745966692414834,0.03424525260925293,0.7745966692414834
144,6,KNeighbors Classifier,0,0.9,0.9047619047619048,0.8819171036881969,0.0351557731628418,0.8819171036881969
145,6,SVC Classifier,0,0.9,0.7142857142857143,1.0,0.0345156192779541,0.0
146,6,Decision Tree,0,0.9,0.9523809523809523,0.9128709291752769,0.0019290447235107422,0.9128709291752769
147,6,RandomForest,0,0.9,0.9523809523809523,0.9128709291752769,0.2580244541168213,0.9128709291752769
148,6,AdaBoost (Discrete),0,0.9,0.9523809523809523,0.9128709291752769,0.04101681709289551,0.9128709291752769
149,6,AdaBoost (Real),0,0.9,0.9523809523809523,0.9128709291752769,0.03690838813781738,0.9128709291752769
150,6,Logistic Regression (Penalty = L2),0,0.9,1.0,1.0,0.03408956527709961,1.0
151,6,Naive Bayes,0,0.9,0.9523809523809523,0.9128709291752769,0.03124213218688965,0.9128709291752769
152,6,KNeighbors Classifier,1,0.9,0.7619047619047619,0.5577733510227171,0.04855084419250488,0.5577733510227171
153,6,SVC Classifier,1,0.9,0.7142857142857143,1.0,0.03448343276977539,0.0
154,6,Decision Tree,1,0.9,0.8095238095238095,0.6831300510639732,0.0017232894897460938,0.6831300510639732
155,6,RandomForest,1,0.9,0.9047619047619048,0.816496580927726,0.24448204040527344,0.816496580927726
156,6,AdaBoost (Discrete),1,0.9,0.9523809523809523,0.9660917830792959,0.03647422790527344,0.9660917830792959
157,6,AdaBoost (Real),1,0.9,0.9523809523809523,0.9660917830792959,0.06942939758300781,0.9660917830792959
158,6,Logistic Regression (Penalty = L2),1,0.9,0.9523809523809523,0.9660917830792959,0.037809133529663086,0.9660917830792959
159,6,Naive Bayes,1,0.9,0.9523809523809523,0.9128709291752769,0.035017967224121094,0.9128709291752769
160,6,KNeighbors Classifier,2,0.9,0.7894736842105263,0.4472135954999579,0.035764217376708984,0.4472135954999579
161,6,SVC Classifier,2,0.9,0.7368421052631579,1.0,0.002028942108154297,0.0
162,6,Decision Tree,2,0.9,0.7894736842105263,0.609449400220044,0.041506290435791016,0.609449400220044
163,6,RandomForest,2,0.9,0.8947368421052632,0.7745966692414834,0.31178808212280273,0.7745966692414834
164,6,AdaBoost (Discrete),2,0.9,0.8947368421052632,0.7745966692414834,0.035262107849121094,0.7745966692414834
165,6,AdaBoost (Real),2,0.9,0.8947368421052632,0.7745966692414834,0.03687930107116699,0.7745966692414834
166,6,Logistic Regression (Penalty = L2),2,0.9,0.9473684210526315,0.8944271909999159,0.0017023086547851562,0.8944271909999159
167,6,Naive Bayes,2,0.9,0.8947368421052632,0.7745966692414834,0.03454136848449707,0.7745966692414834
168,7,KNeighbors Classifier,0,0.9,0.9047619047619048,0.9309493362512627,0.035709381103515625,0.9309493362512627
169,7,SVC Classifier,0,0.9,0.7142857142857143,1.0,0.03439021110534668,0.0
170,7,Decision Tree,0,0.9,0.9047619047619048,0.9309493362512627,0.0014834403991699219,0.9309493362512627
171,7,RandomForest,0,0.9,0.9523809523809523,0.9128709291752769,0.2628142833709717,0.9128709291752769
172,7,AdaBoost (Discrete),0,0.9,0.9523809523809523,0.9128709291752769,0.0024292469024658203,0.9128709291752769
173,7,AdaBoost (Real),0,0.9,0.9523809523809523,0.9128709291752769,0.0355224609375,0.9128709291752769
174,7,Logistic Regression (Penalty = L2),0,0.9,1.0,1.0,0.034230947494506836,1.0
175,7,Naive Bayes,0,0.9,0.9523809523809523,0.9128709291752769,0.03466010093688965,0.9128709291752769
176,7,KNeighbors Classifier,1,0.9,0.9047619047619048,0.8819171036881969,0.00249481201171875,0.8819171036881969
177,7,SVC Classifier,1,0.9,0.7142857142857143,1.0,0.002064943313598633,0.0
178,7,Decision Tree,1,0.9,0.9523809523809523,0.9660917830792959,0.0337367057800293,0.9660917830792959
179,7,RandomForest,1,0.9,0.9047619047619048,0.816496580927726,0.2187330722808838,0.816496580927726
180,7,AdaBoost (Discrete),1,0.9,0.9523809523809523,0.9660917830792959,0.036844491958618164,0.9660917830792959
181,7,AdaBoost (Real),1,0.9,0.9523809523809523,0.9660917830792959,0.0696568489074707,0.9660917830792959
182,7,Logistic Regression (Penalty = L2),1,0.9,1.0,1.0,0.0019392967224121094,1.0
183,7,Naive Bayes,1,0.9,1.0,1.0,0.0390927791595459,1.0
184,7,KNeighbors Classifier,2,0.9,0.8947368421052632,0.7745966692414834,0.030925989151000977,0.7745966692414834
185,7,SVC Classifier,2,0.9,0.7368421052631579,1.0,0.0417025089263916,0.0
186,7,Decision Tree,2,0.9,0.7894736842105263,0.609449400220044,0.03345131874084473,0.609449400220044
187,7,RandomForest,2,0.9,0.9473684210526315,0.8944271909999159,0.26039934158325195,0.8944271909999159
188,7,AdaBoost (Discrete),2,0.9,0.9473684210526315,0.8944271909999159,0.034775733947753906,0.8944271909999159
189,7,AdaBoost (Real),2,0.9,0.9473684210526315,0.8944271909999159,0.03599429130554199,0.8944271909999159
190,7,Logistic Regression (Penalty = L2),2,0.9,0.8947368421052632,0.7745966692414834,0.03410482406616211,0.7745966692414834
191,7,Naive Bayes,2,0.9,0.8947368421052632,0.7745966692414834,0.0389246940612793,0.7745966692414834
192,8,KNeighbors Classifier,0,0.9,0.8571428571428571,0.7888106377466155,0.038686275482177734,0.7888106377466155
193,8,SVC Classifier,0,0.9,0.7142857142857143,1.0,0.03804731369018555,0.0
194,8,Decision Tree,0,0.9,0.9523809523809523,0.9128709291752769,0.0019383430480957031,0.9128709291752769
195,8,RandomForest,0,0.9,0.9047619047619048,0.816496580927726,0.2473006248474121,0.816496580927726
196,8,AdaBoost (Discrete),0,0.9,0.9523809523809523,0.9128709291752769,0.03623652458190918,0.9128709291752769
197,8,AdaBoost (Real),0,0.9,0.9523809523809523,0.9128709291752769,0.04063725471496582,0.9128709291752769
198,8,Logistic Regression (Penalty = L2),0,0.9,1.0,1.0,0.0011692047119140625,1.0
199,8,Naive Bayes,0,0.9,0.9523809523809523,0.9128709291752769,0.030756711959838867,0.9128709291752769
200,8,KNeighbors Classifier,1,0.9,0.9047619047619048,0.8819171036881969,0.03878664970397949,0.8819171036881969
201,8,SVC Classifier,1,0.9,0.7142857142857143,1.0,0.03396129608154297,0.0
202,8,Decision Tree,1,0.9,0.9523809523809523,0.9660917830792959,0.03311800956726074,0.9660917830792959
203,8,RandomForest,1,0.9,0.9047619047619048,0.816496580927726,0.26380062103271484,0.816496580927726
204,8,AdaBoost (Discrete),1,0.9,0.9523809523809523,0.9660917830792959,0.0033185482025146484,0.9660917830792959
205,8,AdaBoost (Real),1,0.9,0.9523809523809523,0.9660917830792959,0.039768218994140625,0.9660917830792959
206,8,Logistic Regression (Penalty = L2),1,0.9,0.9523809523809523,0.9660917830792959,0.03921914100646973,0.9660917830792959
207,8,Naive Bayes,1,0.9,0.9523809523809523,0.9128709291752769,0.031102895736694336,0.9128709291752769
208,8,KNeighbors Classifier,2,0.9,0.8421052631578947,0.6324555320336759,0.03944253921508789,0.6324555320336759
209,8,SVC Classifier,2,0.9,0.7368421052631579,1.0,0.03424644470214844,0.0
210,8,Decision Tree,2,0.9,1.0,1.0,0.037857770919799805,1.0
211,8,RandomForest,2,0.9,0.9473684210526315,0.8944271909999159,0.31923508644104004,0.8944271909999159
212,8,AdaBoost (Discrete),2,0.9,0.9473684210526315,0.8944271909999159,0.040266990661621094,0.8944271909999159
213,8,AdaBoost (Real),2,0.9,0.8947368421052632,0.7745966692414834,0.040677785873413086,0.7745966692414834
214,8,Logistic Regression (Penalty = L2),2,0.9,0.9473684210526315,0.8944271909999159,0.0020248889923095703,0.8944271909999159
215,8,Naive Bayes,2,0.9,0.8947368421052632,0.7745966692414834,0.038598060607910156,0.7745966692414834
216,9,KNeighbors Classifier,0,0.9,0.9523809523809523,0.9128709291752769,0.038294315338134766,0.9128709291752769
217,9,SVC Classifier,0,0.9,0.7142857142857143,1.0,0.0012409687042236328,0.0
218,9,Decision Tree,0,0.9,0.7619047619047619,0.6582805886043833,0.0015587806701660156,0.6582805886043833
219,9,RandomForest,0,0.9,0.9047619047619048,0.816496580927726,0.24365901947021484,0.816496580927726
220,9,AdaBoost (Discrete),0,0.9,0.9523809523809523,0.9128709291752769,0.03696942329406738,0.9128709291752769
221,9,AdaBoost (Real),0,0.9,0.9523809523809523,0.9128709291752769,0.04071688652038574,0.9128709291752769
222,9,Logistic Regression (Penalty = L2),0,0.9,1.0,1.0,0.0012958049774169922,1.0
223,9,Naive Bayes,0,0.9,0.9523809523809523,0.9128709291752769,0.0028192996978759766,0.9128709291752769
224,9,KNeighbors Classifier,1,0.9,0.8571428571428571,0.7888106377466155,0.03548073768615723,0.7888106377466155
225,9,SVC Classifier,1,0.9,0.7142857142857143,1.0,0.0020177364349365234,0.0
226,9,Decision Tree,1,0.9,0.7142857142857143,0.5374838498865699,0.001771688461303711,0.5374838498865699
227,9,RandomForest,1,0.9,0.9047619047619048,0.816496580927726,0.29058241844177246,0.816496580927726
228,9,AdaBoost (Discrete),1,0.9,0.9523809523809523,0.9660917830792959,0.04091477394104004,0.9660917830792959
229,9,AdaBoost (Real),1,0.9,0.9523809523809523,0.9660917830792959,0.08082866668701172,0.9660917830792959
230,9,Logistic Regression (Penalty = L2),1,0.9,0.9523809523809523,0.9660917830792959,0.033429622650146484,0.9660917830792959
231,9,Naive Bayes,1,0.9,0.9523809523809523,0.9128709291752769,0.002063751220703125,0.9128709291752769
232,9,KNeighbors Classifier,2,0.9,0.7894736842105263,0.4472135954999579,0.0018830299377441406,0.4472135954999579
233,9,SVC Classifier,2,0.9,0.7368421052631579,1.0,0.0381779670715332,0.0
234,9,Decision Tree,2,0.9,0.9473684210526315,0.8944271909999159,0.001485586166381836,0.8944271909999159
235,9,RandomForest,2,0.9,0.8421052631578947,0.6324555320336759,0.28093838691711426,0.6324555320336759
236,9,AdaBoost (Discrete),2,0.9,0.8947368421052632,0.7745966692414834,0.04011964797973633,0.7745966692414834
237,9,AdaBoost (Real),2,0.9,0.9473684210526315,0.8944271909999159,0.04007768630981445,0.8944271909999159
238,9,Logistic Regression (Penalty = L2),2,0.9,0.9473684210526315,0.8944271909999159,0.0011754035949707031,0.8944271909999159
239,9,Naive Bayes,2,0.9,0.8947368421052632,0.7745966692414834,0.0347745418548584,0.7745966692414834
240,10,KNeighbors Classifier,0,0.9,0.8571428571428571,0.7071067811865476,0.03908658027648926,0.7071067811865476
241,10,SVC Classifier,0,0.9,0.7142857142857143,1.0,0.03814554214477539,0.0
242,10,Decision Tree,0,0.9,0.9523809523809523,0.9128709291752769,0.041919708251953125,0.9128709291752769
243,10,RandomForest,0,0.9,0.9523809523809523,0.9128709291752769,0.23920464515686035,0.9128709291752769
244,10,AdaBoost (Discrete),0,0.9,0.9523809523809523,0.9128709291752769,0.04350090026855469,0.9128709291752769
245,10,AdaBoost (Real),0,0.9,0.9523809523809523,0.9128709291752769,0.03148007392883301,0.9128709291752769
246,10,Logistic Regression (Penalty = L2),0,0.9,1.0,1.0,0.0020732879638671875,1.0
247,10,Naive Bayes,0,0.9,0.9523809523809523,0.9128709291752769,0.0016400814056396484,0.9128709291752769
248,10,KNeighbors Classifier,1,0.9,0.8095238095238095,0.6831300510639732,0.036956787109375,0.6831300510639732
249,10,SVC Classifier,1,0.9,0.7142857142857143,1.0,0.041970014572143555,0.0
250,10,Decision Tree,1,0.9,0.9523809523809523,0.9660917830792959,0.0014827251434326172,0.9660917830792959
251,10,RandomForest,1,0.9,0.9523809523809523,0.9128709291752769,0.2759113311767578,0.9128709291752769
252,10,AdaBoost (Discrete),1,0.9,0.9523809523809523,0.9660917830792959,0.04002714157104492,0.9660917830792959
253,10,AdaBoost (Real),1,0.9,0.9523809523809523,0.9660917830792959,0.04322528839111328,0.9660917830792959
254,10,Logistic Regression (Penalty = L2),1,0.9,0.9523809523809523,0.9660917830792959,0.0011754035949707031,0.9660917830792959
255,10,Naive Bayes,1,0.9,0.9523809523809523,0.9128709291752769,0.04137849807739258,0.9128709291752769
256,10,KNeighbors Classifier,2,0.9,0.7894736842105263,0.4472135954999579,0.03915882110595703,0.4472135954999579
257,10,SVC Classifier,2,0.9,0.7368421052631579,1.0,0.001840829849243164,0.0
258,10,Decision Tree,2,0.9,1.0,1.0,0.001043081283569336,1.0
259,10,RandomForest,2,0.9,0.8947368421052632,0.7745966692414834,0.2476949691772461,0.7745966692414834
260,10,AdaBoost (Discrete),2,0.9,0.9473684210526315,0.8944271909999159,0.04053902626037598,0.8944271909999159
261,10,AdaBoost (Real),2,0.9,0.8947368421052632,0.7745966692414834,0.040624380111694336,0.7745966692414834
262,10,Logistic Regression (Penalty = L2),2,0.9,0.8947368421052632,0.7745966692414834,0.0019702911376953125,0.7745966692414834
263,10,Naive Bayes,2,0.9,0.8947368421052632,0.7745966692414834,0.038085222244262695,0.7745966692414834
264,11,KNeighbors Classifier,0,0.9,0.8571428571428571,0.7071067811865476,0.039575815200805664,0.7071067811865476
265,11,SVC Classifier,0,0.9,0.7142857142857143,1.0,0.0017342567443847656,0.0
266,11,Decision Tree,0,0.9,0.9047619047619048,0.8819171036881969,0.0015411376953125,0.8819171036881969
267,11,RandomForest,0,0.9,0.9523809523809523,0.9128709291752769,0.2773473262786865,0.9128709291752769
268,11,AdaBoost (Discrete),0,0.9,0.9523809523809523,0.9128709291752769,0.04007267951965332,0.9128709291752769
269,11,AdaBoost (Real),0,0.9,0.9523809523809523,0.9128709291752769,0.03937268257141113,0.9128709291752769
270,11,Logistic Regression (Penalty = L2),0,0.9,1.0,1.0,0.0011622905731201172,1.0
271,11,Naive Bayes,0,0.9,0.9523809523809523,0.9128709291752769,0.03805661201477051,0.9128709291752769
272,11,KNeighbors Classifier,1,0.9,0.8095238095238095,0.6831300510639732,0.03136777877807617,0.6831300510639732
273,11,SVC Classifier,1,0.9,0.7142857142857143,1.0,0.0011372566223144531,0.0
274,11,Decision Tree,1,0.9,0.9523809523809523,0.9660917830792959,0.0017032623291015625,0.9660917830792959
275,11,RandomForest,1,0.9,0.9523809523809523,0.9128709291752769,0.23393011093139648,0.9128709291752769
276,11,AdaBoost (Discrete),1,0.9,0.9523809523809523,0.9660917830792959,0.07642221450805664,0.9660917830792959
277,11,AdaBoost (Real),1,0.9,0.9523809523809523,0.9660917830792959,0.04057049751281738,0.9660917830792959
278,11,Logistic Regression (Penalty = L2),1,0.9,0.9523809523809523,0.9660917830792959,0.03800773620605469,0.9660917830792959
279,11,Naive Bayes,1,0.9,0.9523809523809523,0.9128709291752769,0.033669233322143555,0.9128709291752769
280,11,KNeighbors Classifier,2,0.9,0.7894736842105263,0.4472135954999579,0.0018775463104248047,0.4472135954999579
281,11,SVC Classifier,2,0.9,0.7368421052631579,1.0,0.029364347457885742,0.0
282,11,Decision Tree,2,0.9,0.631578947368421,0.6210590034081188,0.0011017322540283203,0.6210590034081188
283,11,RandomForest,2,0.9,0.8947368421052632,0.7745966692414834,0.20220136642456055,0.7745966692414834
284,11,AdaBoost (Discrete),2,0.9,0.9473684210526315,0.8944271909999159,0.03918766975402832,0.8944271909999159
285,11,AdaBoost (Real),2,0.9,0.9473684210526315,0.8944271909999159,0.039519548416137695,0.8944271909999159
286,11,Logistic Regression (Penalty = L2),2,0.9,0.8947368421052632,0.7745966692414834,0.0015552043914794922,0.7745966692414834
287,11,Naive Bayes,2,0.9,0.8947368421052632,0.7745966692414834,0.03085613250732422,0.7745966692414834
288,12,KNeighbors Classifier,0,0.9,1.0,1.0,0.030755996704101562,1.0
289,12,SVC Classifier,0,0.9,0.7142857142857143,1.0,0.0011360645294189453,0.0
290,12,Decision Tree,0,0.9,0.9523809523809523,0.9128709291752769,0.03680109977722168,0.9128709291752769
291,12,RandomForest,0,0.9,0.9523809523809523,0.9128709291752769,0.20502424240112305,0.9128709291752769
292,12,AdaBoost (Discrete),0,0.9,0.9523809523809523,0.9128709291752769,0.04017829895019531,0.9128709291752769
293,12,AdaBoost (Real),0,0.9,0.9523809523809523,0.9128709291752769,0.04052448272705078,0.9128709291752769
294,12,Logistic Regression (Penalty = L2),0,0.9,1.0,1.0,0.0014495849609375,1.0
295,12,Naive Bayes,0,0.9,0.9523809523809523,0.9128709291752769,0.03768658638000488,0.9128709291752769
296,12,KNeighbors Classifier,1,0.9,0.9047619047619048,0.8819171036881969,0.03810882568359375,0.8819171036881969
297,12,SVC Classifier,1,0.9,0.7142857142857143,1.0,0.002083301544189453,0.0
298,12,Decision Tree,1,0.9,1.0,1.0,0.000997304916381836,1.0
299,12,RandomForest,1,0.9,1.0,1.0,0.2015986442565918,1.0
300,12,AdaBoost (Discrete),1,0.9,0.9523809523809523,0.9660917830792959,0.0023636817932128906,0.9660917830792959
301,12,AdaBoost (Real),1,0.9,0.9523809523809523,0.9660917830792959,0.03921818733215332,0.9660917830792959
302,12,Logistic Regression (Penalty = L2),1,0.9,1.0,1.0,0.0011670589447021484,1.0
303,12,Naive Bayes,1,0.9,0.9523809523809523,0.9128709291752769,0.03768110275268555,0.9128709291752769
304,12,KNeighbors Classifier,2,0.9,0.8421052631578947,0.6324555320336759,0.0019049644470214844,0.6324555320336759
305,12,SVC Classifier,2,0.9,0.7368421052631579,1.0,0.0018696784973144531,0.0
306,12,Decision Tree,2,0.9,1.0,1.0,0.03751206398010254,1.0
307,12,RandomForest,2,0.9,1.0,1.0,0.24117064476013184,1.0
308,12,AdaBoost (Discrete),2,0.9,0.8947368421052632,0.7745966692414834,0.038789987564086914,0.7745966692414834
309,12,AdaBoost (Real),2,0.9,0.8947368421052632,0.7745966692414834,0.002477407455444336,0.7745966692414834
310,12,Logistic Regression (Penalty = L2),2,0.9,0.9473684210526315,0.8944271909999159,0.03329658508300781,0.8944271909999159
311,12,Naive Bayes,2,0.9,0.8947368421052632,0.7745966692414834,0.03495430946350098,0.7745966692414834
