,feat_set_id,classifier,fold_id,feat_th,score,geo_score,exec_t,geo_score_woz
0,0,KNeighbors Classifier,0,1.0,0.8074626865671641,0.7500144509395629,1.898507833480835,0.7500144509395629
1,0,SVC Classifier,0,1.0,0.7597014925373134,0.7254318967282575,2.622793436050415,0.7254318967282575
2,0,Decision Tree,0,1.0,0.608955223880597,0.5416070385494066,0.12961268424987793,0.5416070385494066
3,0,RandomForest,0,1.0,0.4552238805970149,0.28147025604272446,0.44686079025268555,0.0
4,0,AdaBoost (Discrete),0,1.0,0.746268656716418,0.7170805766671005,115.07106900215149,0.7170805766671005
5,0,AdaBoost (Real),0,1.0,0.673134328358209,0.6170231342609389,105.98759031295776,0.6170231342609389
6,0,Logistic Regression (Penalty = L2),0,1.0,0.826865671641791,0.7818376212331395,1.3055915832519531,0.7818376212331395
7,0,Naive Bayes,0,1.0,0.7149253731343284,0.6783149276069205,0.12132930755615234,0.6783149276069205
8,0,KNeighbors Classifier,1,1.0,0.7970149253731343,0.7316275011690854,1.7046184539794922,0.7316275011690854
9,0,SVC Classifier,1,1.0,0.7567164179104477,0.7134614538724139,2.169682741165161,0.7134614538724139
10,0,Decision Tree,1,1.0,0.6253731343283582,0.5613934238752797,0.10896801948547363,0.5613934238752797
11,0,RandomForest,1,1.0,0.48656716417910445,0.33496400347164623,0.32636332511901855,0.33496400347164623
12,0,AdaBoost (Discrete),1,1.0,0.7283582089552239,0.6943090437224501,102.71138405799866,0.6943090437224501
13,0,AdaBoost (Real),1,1.0,0.7298507462686568,0.6995027525534621,96.48967504501343,0.6995027525534621
14,0,Logistic Regression (Penalty = L2),1,1.0,0.8208955223880597,0.7742219691760631,1.0659236907958984,0.7742219691760631
15,0,Naive Bayes,1,1.0,0.7402985074626866,0.6926500352030763,0.14474987983703613,0.6926500352030763
16,0,KNeighbors Classifier,2,1.0,0.8227272727272728,0.7689950572795311,1.559072732925415,0.7689950572795311
17,0,SVC Classifier,2,1.0,0.7651515151515151,0.7336416229890806,1.9261722564697266,0.7336416229890806
18,0,Decision Tree,2,1.0,0.6484848484848484,0.5960369025394806,0.10721135139465332,0.5960369025394806
19,0,RandomForest,2,1.0,0.5424242424242425,0.3561155710884892,0.3235499858856201,0.3561155710884892
20,0,AdaBoost (Discrete),2,1.0,0.7333333333333333,0.7012166824593254,103.26122307777405,0.7012166824593254
21,0,AdaBoost (Real),2,1.0,0.6636363636363637,0.6105003571700084,100.74574756622314,0.6105003571700084
22,0,Logistic Regression (Penalty = L2),2,1.0,0.8348484848484848,0.7886688169070574,1.3054659366607666,0.7886688169070574
23,0,Naive Bayes,2,1.0,0.7333333333333333,0.6920698419809663,0.16962790489196777,0.6920698419809663
24,1,KNeighbors Classifier,0,1.0,0.8074626865671641,0.7500144509395629,1.6398732662200928,0.7500144509395629
25,1,SVC Classifier,0,1.0,0.7597014925373134,0.7254318967282575,2.607093334197998,0.7254318967282575
26,1,Decision Tree,0,1.0,0.5970149253731343,0.5387808730115445,0.15745234489440918,0.5387808730115445
27,1,RandomForest,0,1.0,0.4552238805970149,0.28147025604272446,0.520989179611206,0.0
28,1,AdaBoost (Discrete),0,1.0,0.746268656716418,0.7170805766671005,146.64747262001038,0.7170805766671005
29,1,AdaBoost (Real),0,1.0,0.6492537313432836,0.5984324302608381,145.65082144737244,0.5984324302608381
30,1,Logistic Regression (Penalty = L2),0,1.0,0.826865671641791,0.7818376212331395,1.6824631690979004,0.7818376212331395
31,1,Naive Bayes,0,1.0,0.7149253731343284,0.6783149276069205,0.1541304588317871,0.6783149276069205
32,1,KNeighbors Classifier,1,1.0,0.7970149253731343,0.7316275011690854,2.156498908996582,0.7316275011690854
33,1,SVC Classifier,1,1.0,0.7567164179104477,0.7134614538724139,3.0167813301086426,0.7134614538724139
34,1,Decision Tree,1,1.0,0.6373134328358209,0.5844535030992325,0.1531684398651123,0.5844535030992325
35,1,RandomForest,1,1.0,0.48656716417910445,0.33496400347164623,0.5386765003204346,0.33496400347164623
36,1,AdaBoost (Discrete),1,1.0,0.7283582089552239,0.6943090437224501,138.66420531272888,0.6943090437224501
37,1,AdaBoost (Real),1,1.0,0.5626865671641791,0.5284689081240097,147.54886960983276,0.5284689081240097
38,1,Logistic Regression (Penalty = L2),1,1.0,0.8208955223880597,0.7742219691760631,1.4157910346984863,0.7742219691760631
39,1,Naive Bayes,1,1.0,0.7402985074626866,0.6926500352030763,0.1487717628479004,0.6926500352030763
40,1,KNeighbors Classifier,2,1.0,0.8227272727272728,0.7689950572795311,2.0161705017089844,0.7689950572795311
41,1,SVC Classifier,2,1.0,0.7651515151515151,0.7336416229890806,2.8695600032806396,0.7336416229890806
42,1,Decision Tree,2,1.0,0.6484848484848484,0.5851497695260419,0.14313030242919922,0.5851497695260419
43,1,RandomForest,2,1.0,0.5424242424242425,0.3561155710884892,0.5238029956817627,0.3561155710884892
44,1,AdaBoost (Discrete),2,1.0,0.7333333333333333,0.7012166824593254,151.2335560321808,0.7012166824593254
45,1,AdaBoost (Real),2,1.0,0.6893939393939394,0.6501855030084738,173.94517278671265,0.6501855030084738
46,1,Logistic Regression (Penalty = L2),2,1.0,0.8348484848484848,0.7886688169070574,2.1875393390655518,0.7886688169070574
47,1,Naive Bayes,2,1.0,0.7333333333333333,0.6920698419809663,0.20486140251159668,0.6920698419809663
48,2,KNeighbors Classifier,0,1.0,0.8074626865671641,0.7500144509395629,2.728853464126587,0.7500144509395629
49,2,SVC Classifier,0,1.0,0.7597014925373134,0.7254318967282575,3.8064680099487305,0.7254318967282575
50,2,Decision Tree,0,1.0,0.6074626865671642,0.5473736010564684,0.1961956024169922,0.5473736010564684
51,2,RandomForest,0,1.0,0.4552238805970149,0.28147025604272446,0.6350915431976318,0.0
52,2,AdaBoost (Discrete),0,1.0,0.746268656716418,0.7170805766671005,180.3368637561798,0.7170805766671005
53,2,AdaBoost (Real),0,1.0,0.7119402985074627,0.6724053679128581,178.50350403785706,0.6724053679128581
54,2,Logistic Regression (Penalty = L2),0,1.0,0.826865671641791,0.7818376212331395,2.1698455810546875,0.7818376212331395
55,2,Naive Bayes,0,1.0,0.7149253731343284,0.6783149276069205,0.18899846076965332,0.6783149276069205
56,2,KNeighbors Classifier,1,1.0,0.7970149253731343,0.7316275011690854,2.726034164428711,0.7316275011690854
57,2,SVC Classifier,1,1.0,0.7567164179104477,0.7134614538724139,3.633091449737549,0.7134614538724139
58,2,Decision Tree,1,1.0,0.6238805970149254,0.5616342458207461,0.1260995864868164,0.5616342458207461
59,2,RandomForest,1,1.0,0.48656716417910445,0.33496400347164623,0.6473548412322998,0.33496400347164623
60,2,AdaBoost (Discrete),1,1.0,0.7283582089552239,0.6943090437224501,179.38812136650085,0.6943090437224501
61,2,AdaBoost (Real),1,1.0,0.6865671641791045,0.6543355818475671,170.26156663894653,0.6543355818475671
62,2,Logistic Regression (Penalty = L2),1,1.0,0.8208955223880597,0.7742219691760631,2.111785888671875,0.7742219691760631
63,2,Naive Bayes,1,1.0,0.7402985074626866,0.6926500352030763,0.24605774879455566,0.6926500352030763
64,2,KNeighbors Classifier,2,1.0,0.8227272727272728,0.7689950572795311,2.620520830154419,0.7689950572795311
65,2,SVC Classifier,2,1.0,0.7651515151515151,0.7336416229890806,3.840303659439087,0.7336416229890806
66,2,Decision Tree,2,1.0,0.6530303030303031,0.6216861404443423,0.19181394577026367,0.6216861404443423
67,2,RandomForest,2,1.0,0.5424242424242425,0.3561155710884892,0.7063255310058594,0.3561155710884892
68,2,AdaBoost (Discrete),2,1.0,0.7333333333333333,0.7012166824593254,183.25938487052917,0.7012166824593254
69,2,AdaBoost (Real),2,1.0,0.7,0.6725855206652434,218.40217208862305,0.6725855206652434
70,2,Logistic Regression (Penalty = L2),2,1.0,0.8348484848484848,0.7886688169070574,2.7634687423706055,0.7886688169070574
71,2,Naive Bayes,2,1.0,0.7333333333333333,0.6920698419809663,0.2411339282989502,0.6920698419809663
72,3,KNeighbors Classifier,0,1.0,0.8074626865671641,0.7500144509395629,3.4158637523651123,0.7500144509395629
73,3,SVC Classifier,0,1.0,0.7597014925373134,0.7254318967282575,4.8067522048950195,0.7254318967282575
74,3,Decision Tree,0,1.0,0.5850746268656717,0.5071262055303445,0.2444167137145996,0.5071262055303445
75,3,RandomForest,0,1.0,0.4552238805970149,0.28147025604272446,0.9056375026702881,0.0
76,3,AdaBoost (Discrete),0,1.0,0.746268656716418,0.7170805766671005,222.08456540107727,0.7170805766671005
77,3,AdaBoost (Real),0,1.0,0.6925373134328359,0.6615023136993121,209.82415652275085,0.6615023136993121
78,3,Logistic Regression (Penalty = L2),0,1.0,0.826865671641791,0.7818376212331395,2.5498507022857666,0.7818376212331395
79,3,Naive Bayes,0,1.0,0.7149253731343284,0.6783149276069205,0.3174571990966797,0.6783149276069205
80,3,KNeighbors Classifier,1,1.0,0.7970149253731343,0.7316275011690854,3.2690012454986572,0.7316275011690854
81,3,SVC Classifier,1,1.0,0.7567164179104477,0.7134614538724139,4.294009447097778,0.7134614538724139
82,3,Decision Tree,1,1.0,0.6149253731343284,0.569417874748509,0.3029963970184326,0.569417874748509
83,3,RandomForest,1,1.0,0.48656716417910445,0.33496400347164623,0.755927324295044,0.33496400347164623
84,3,AdaBoost (Discrete),1,1.0,0.7283582089552239,0.6943090437224501,221.06962704658508,0.6943090437224501
85,3,AdaBoost (Real),1,1.0,0.6895522388059702,0.6497279239720888,209.70191025733948,0.6497279239720888
86,3,Logistic Regression (Penalty = L2),1,1.0,0.8208955223880597,0.7742219691760631,2.460899591445923,0.7742219691760631
87,3,Naive Bayes,1,1.0,0.7402985074626866,0.6926500352030763,0.22112083435058594,0.6926500352030763
88,3,KNeighbors Classifier,2,1.0,0.8227272727272728,0.7689950572795311,3.1094260215759277,0.7689950572795311
89,3,SVC Classifier,2,1.0,0.7651515151515151,0.7336416229890806,4.3484883308410645,0.7336416229890806
90,3,Decision Tree,2,1.0,0.6106060606060606,0.5545513039962502,0.22516655921936035,0.5545513039962502
91,3,RandomForest,2,1.0,0.5424242424242425,0.3561155710884892,0.902031421661377,0.3561155710884892
92,3,AdaBoost (Discrete),2,1.0,0.7333333333333333,0.7012166824593254,212.59062027931213,0.7012166824593254
93,3,AdaBoost (Real),2,1.0,0.7121212121212122,0.6656556898770642,209.33823657035828,0.6656556898770642
94,3,Logistic Regression (Penalty = L2),2,1.0,0.8348484848484848,0.7886688169070574,2.5425326824188232,0.7886688169070574
95,3,Naive Bayes,2,1.0,0.7333333333333333,0.6920698419809663,0.24933886528015137,0.6920698419809663
96,4,KNeighbors Classifier,0,1.0,0.8074626865671641,0.7500144509395629,3.3662259578704834,0.7500144509395629
97,4,SVC Classifier,0,1.0,0.7597014925373134,0.7254318967282575,4.5017006397247314,0.7254318967282575
98,4,Decision Tree,0,1.0,0.5940298507462687,0.502302237544804,0.1651310920715332,0.502302237544804
99,4,RandomForest,0,1.0,0.4552238805970149,0.28147025604272446,0.7631473541259766,0.0
100,4,AdaBoost (Discrete),0,1.0,0.746268656716418,0.7170805766671005,212.108491897583,0.7170805766671005
101,4,AdaBoost (Real),0,1.0,0.7223880597014926,0.6891486879920665,209.27925491333008,0.6891486879920665
102,4,Logistic Regression (Penalty = L2),0,1.0,0.826865671641791,0.7818376212331395,2.440967082977295,0.7818376212331395
103,4,Naive Bayes,0,1.0,0.7149253731343284,0.6783149276069205,0.2765085697174072,0.6783149276069205
104,4,KNeighbors Classifier,1,1.0,0.7970149253731343,0.7316275011690854,3.500805616378784,0.7316275011690854
105,4,SVC Classifier,1,1.0,0.7567164179104477,0.7134614538724139,4.598340272903442,0.7134614538724139
106,4,Decision Tree,1,1.0,0.5955223880597015,0.5535780465616836,0.2199716567993164,0.5535780465616836
107,4,RandomForest,1,1.0,0.48656716417910445,0.33496400347164623,0.7605197429656982,0.33496400347164623
108,4,AdaBoost (Discrete),1,1.0,0.7283582089552239,0.6943090437224501,215.51466870307922,0.6943090437224501
109,4,AdaBoost (Real),1,1.0,0.6835820895522388,0.6489579443806407,211.94999265670776,0.6489579443806407
110,4,Logistic Regression (Penalty = L2),1,1.0,0.8208955223880597,0.7742219691760631,2.348304033279419,0.7742219691760631
111,4,Naive Bayes,1,1.0,0.7402985074626866,0.6926500352030763,0.29729485511779785,0.6926500352030763
112,4,KNeighbors Classifier,2,1.0,0.8227272727272728,0.7689950572795311,3.195439338684082,0.7689950572795311
113,4,SVC Classifier,2,1.0,0.7651515151515151,0.7336416229890806,4.241417646408081,0.7336416229890806
114,4,Decision Tree,2,1.0,0.6318181818181818,0.5737060886518272,0.22346115112304688,0.5737060886518272
115,4,RandomForest,2,1.0,0.5424242424242425,0.3561155710884892,0.8565199375152588,0.3561155710884892
116,4,AdaBoost (Discrete),2,1.0,0.7333333333333333,0.7012166824593254,216.20122051239014,0.7012166824593254
117,4,AdaBoost (Real),2,1.0,0.7015151515151515,0.670350960690241,205.7850320339203,0.670350960690241
118,4,Logistic Regression (Penalty = L2),2,1.0,0.8348484848484848,0.7886688169070574,2.634244203567505,0.7886688169070574
119,4,Naive Bayes,2,1.0,0.7333333333333333,0.6920698419809663,0.19602465629577637,0.6920698419809663
120,5,KNeighbors Classifier,0,1.0,0.8074626865671641,0.7500144509395629,3.231435775756836,0.7500144509395629
121,5,SVC Classifier,0,1.0,0.7597014925373134,0.7254318967282575,4.22681188583374,0.7254318967282575
122,5,Decision Tree,0,1.0,0.6253731343283582,0.5651556628536568,0.2168269157409668,0.5651556628536568
123,5,RandomForest,0,1.0,0.4552238805970149,0.28147025604272446,0.8469192981719971,0.0
124,5,AdaBoost (Discrete),0,1.0,0.746268656716418,0.7170805766671005,207.71005249023438,0.7170805766671005
125,5,AdaBoost (Real),0,1.0,0.6955223880597015,0.668674591105629,203.40211963653564,0.668674591105629
126,5,Logistic Regression (Penalty = L2),0,1.0,0.826865671641791,0.7818376212331395,2.5171608924865723,0.7818376212331395
127,5,Naive Bayes,0,1.0,0.7149253731343284,0.6783149276069205,0.2152249813079834,0.6783149276069205
128,5,KNeighbors Classifier,1,1.0,0.7970149253731343,0.7316275011690854,3.1745474338531494,0.7316275011690854
129,5,SVC Classifier,1,1.0,0.7567164179104477,0.7134614538724139,4.040274620056152,0.7134614538724139
130,5,Decision Tree,1,1.0,0.5776119402985075,0.5148352839965177,0.20628046989440918,0.5148352839965177
131,5,RandomForest,1,1.0,0.48656716417910445,0.33496400347164623,0.7194051742553711,0.33496400347164623
132,5,AdaBoost (Discrete),1,1.0,0.7283582089552239,0.6943090437224501,197.50345826148987,0.6943090437224501
133,5,AdaBoost (Real),1,1.0,0.7,0.6486749916456068,174.5368959903717,0.6486749916456068
134,5,Logistic Regression (Penalty = L2),1,1.0,0.8208955223880597,0.7742219691760631,1.895751953125,0.7742219691760631
135,5,Naive Bayes,1,1.0,0.7402985074626866,0.6926500352030763,0.18855881690979004,0.6926500352030763
136,5,KNeighbors Classifier,2,1.0,0.8227272727272728,0.7689950572795311,2.621577501296997,0.7689950572795311
137,5,SVC Classifier,2,1.0,0.7651515151515151,0.7336416229890806,3.6256988048553467,0.7336416229890806
138,5,Decision Tree,2,1.0,0.6121212121212121,0.567795608383497,0.19113826751708984,0.567795608383497
139,5,RandomForest,2,1.0,0.5424242424242425,0.3561155710884892,0.666600227355957,0.3561155710884892
140,5,AdaBoost (Discrete),2,1.0,0.7333333333333333,0.7012166824593254,177.60182690620422,0.7012166824593254
141,5,AdaBoost (Real),2,1.0,0.693939393939394,0.6517365781376863,167.78961992263794,0.6517365781376863
142,5,Logistic Regression (Penalty = L2),2,1.0,0.8348484848484848,0.7886688169070574,2.081336736679077,0.7886688169070574
143,5,Naive Bayes,2,1.0,0.7333333333333333,0.6920698419809663,0.20485758781433105,0.6920698419809663
144,6,KNeighbors Classifier,0,1.0,0.8074626865671641,0.7500144509395629,2.5652592182159424,0.7500144509395629
145,6,SVC Classifier,0,1.0,0.7597014925373134,0.7254318967282575,3.6059999465942383,0.7254318967282575
146,6,Decision Tree,0,1.0,0.6059701492537314,0.5500472253997947,0.23656415939331055,0.5500472253997947
147,6,RandomForest,0,1.0,0.4552238805970149,0.28147025604272446,0.5321204662322998,0.0
148,6,AdaBoost (Discrete),0,1.0,0.746268656716418,0.7170805766671005,169.29986238479614,0.7170805766671005
149,6,AdaBoost (Real),0,1.0,0.755223880597015,0.729137373115064,164.9712164402008,0.729137373115064
150,6,Logistic Regression (Penalty = L2),0,1.0,0.826865671641791,0.7818376212331395,2.06343674659729,0.7818376212331395
151,6,Naive Bayes,0,1.0,0.7149253731343284,0.6783149276069205,0.12668895721435547,0.6783149276069205
152,6,KNeighbors Classifier,1,1.0,0.7970149253731343,0.7316275011690854,2.6793107986450195,0.7316275011690854
153,6,SVC Classifier,1,1.0,0.7567164179104477,0.7134614538724139,3.4813363552093506,0.7134614538724139
154,6,Decision Tree,1,1.0,0.6074626865671642,0.5592910661916509,0.1811206340789795,0.5592910661916509
155,6,RandomForest,1,1.0,0.48656716417910445,0.33496400347164623,0.6534554958343506,0.33496400347164623
156,6,AdaBoost (Discrete),1,1.0,0.7283582089552239,0.6943090437224501,166.4128258228302,0.6943090437224501
157,6,AdaBoost (Real),1,1.0,0.6746268656716418,0.6368993697617237,155.1816008090973,0.6368993697617237
158,6,Logistic Regression (Penalty = L2),1,1.0,0.8208955223880597,0.7742219691760631,1.7382168769836426,0.7742219691760631
159,6,Naive Bayes,1,1.0,0.7402985074626866,0.6926500352030763,0.20601630210876465,0.6926500352030763
160,6,KNeighbors Classifier,2,1.0,0.8227272727272728,0.7689950572795311,2.183384656906128,0.7689950572795311
161,6,SVC Classifier,2,1.0,0.7651515151515151,0.7336416229890806,3.163581371307373,0.7336416229890806
162,6,Decision Tree,2,1.0,0.6530303030303031,0.6007466131221357,0.1724853515625,0.6007466131221357
163,6,RandomForest,2,1.0,0.5424242424242425,0.3561155710884892,0.5722241401672363,0.3561155710884892
164,6,AdaBoost (Discrete),2,1.0,0.7333333333333333,0.7012166824593254,158.61908721923828,0.7012166824593254
165,6,AdaBoost (Real),2,1.0,0.6181818181818182,0.5289299451526082,154.22597312927246,0.5289299451526082
166,6,Logistic Regression (Penalty = L2),2,1.0,0.8348484848484848,0.7886688169070574,2.0618855953216553,0.7886688169070574
167,6,Naive Bayes,2,1.0,0.7333333333333333,0.6920698419809663,0.23720455169677734,0.6920698419809663
168,7,KNeighbors Classifier,0,1.0,0.8074626865671641,0.7500144509395629,2.7985613346099854,0.7500144509395629
169,7,SVC Classifier,0,1.0,0.7597014925373134,0.7254318967282575,3.5778703689575195,0.7254318967282575
170,7,Decision Tree,0,1.0,0.5895522388059702,0.5268606178318755,0.18141961097717285,0.5268606178318755
171,7,RandomForest,0,1.0,0.4552238805970149,0.28147025604272446,0.6711063385009766,0.0
172,7,AdaBoost (Discrete),0,1.0,0.746268656716418,0.7170805766671005,171.7446038722992,0.7170805766671005
173,7,AdaBoost (Real),0,1.0,0.7223880597014926,0.6476916688108204,156.7557852268219,0.6476916688108204
174,7,Logistic Regression (Penalty = L2),0,1.0,0.826865671641791,0.7818376212331395,1.963210105895996,0.7818376212331395
175,7,Naive Bayes,0,1.0,0.7149253731343284,0.6783149276069205,0.25111818313598633,0.6783149276069205
176,7,KNeighbors Classifier,1,1.0,0.7970149253731343,0.7316275011690854,2.678959846496582,0.7316275011690854
177,7,SVC Classifier,1,1.0,0.7567164179104477,0.7134614538724139,3.2050089836120605,0.7134614538724139
178,7,Decision Tree,1,1.0,0.6134328358208955,0.5678303644014076,0.20945239067077637,0.5678303644014076
179,7,RandomForest,1,1.0,0.48656716417910445,0.33496400347164623,0.6395108699798584,0.33496400347164623
180,7,AdaBoost (Discrete),1,1.0,0.7283582089552239,0.6943090437224501,154.02414345741272,0.6943090437224501
181,7,AdaBoost (Real),1,1.0,0.6955223880597015,0.6487967478671374,142.24656534194946,0.6487967478671374
182,7,Logistic Regression (Penalty = L2),1,1.0,0.8208955223880597,0.7742219691760631,1.794670820236206,0.7742219691760631
183,7,Naive Bayes,1,1.0,0.7402985074626866,0.6926500352030763,0.16334962844848633,0.6926500352030763
184,7,KNeighbors Classifier,2,1.0,0.8227272727272728,0.7689950572795311,2.2238194942474365,0.7689950572795311
185,7,SVC Classifier,2,1.0,0.7651515151515151,0.7336416229890806,2.96547269821167,0.7336416229890806
186,7,Decision Tree,2,1.0,0.6287878787878788,0.5714077539433967,0.15557169914245605,0.5714077539433967
187,7,RandomForest,2,1.0,0.5424242424242425,0.3561155710884892,0.5480663776397705,0.3561155710884892
188,7,AdaBoost (Discrete),2,1.0,0.7333333333333333,0.7012166824593254,148.46716475486755,0.7012166824593254
189,7,AdaBoost (Real),2,1.0,0.6984848484848485,0.6720145738650692,138.82168531417847,0.6720145738650692
190,7,Logistic Regression (Penalty = L2),2,1.0,0.8348484848484848,0.7886688169070574,1.8194499015808105,0.7886688169070574
191,7,Naive Bayes,2,1.0,0.7333333333333333,0.6920698419809663,0.16358280181884766,0.6920698419809663
192,8,KNeighbors Classifier,0,1.0,0.8074626865671641,0.7500144509395629,2.278829336166382,0.7500144509395629
193,8,SVC Classifier,0,1.0,0.7597014925373134,0.7254318967282575,2.9944517612457275,0.7254318967282575
194,8,Decision Tree,0,1.0,0.6194029850746269,0.5543234877388908,0.1554248332977295,0.5543234877388908
195,8,RandomForest,0,1.0,0.4552238805970149,0.28147025604272446,0.5772643089294434,0.0
196,8,AdaBoost (Discrete),0,1.0,0.746268656716418,0.7170805766671005,140.4031822681427,0.7170805766671005
197,8,AdaBoost (Real),0,1.0,0.7119402985074627,0.6791026549063337,128.99531054496765,0.6791026549063337
198,8,Logistic Regression (Penalty = L2),0,1.0,0.826865671641791,0.7818376212331395,1.4835641384124756,0.7818376212331395
199,8,Naive Bayes,0,1.0,0.7149253731343284,0.6783149276069205,0.1389141082763672,0.6783149276069205
200,8,KNeighbors Classifier,1,1.0,0.7970149253731343,0.7316275011690854,1.894136905670166,0.7316275011690854
201,8,SVC Classifier,1,1.0,0.7567164179104477,0.7134614538724139,2.572681188583374,0.7134614538724139
202,8,Decision Tree,1,1.0,0.608955223880597,0.5512643391215838,0.17229866981506348,0.5512643391215838
203,8,RandomForest,1,1.0,0.48656716417910445,0.33496400347164623,0.398817777633667,0.33496400347164623
204,8,AdaBoost (Discrete),1,1.0,0.7283582089552239,0.6943090437224501,125.28148198127747,0.6943090437224501
205,8,AdaBoost (Real),1,1.0,0.6761194029850747,0.6399027844605106,129.53260564804077,0.6399027844605106
206,8,Logistic Regression (Penalty = L2),1,1.0,0.8208955223880597,0.7742219691760631,1.3714792728424072,0.7742219691760631
207,8,Naive Bayes,1,1.0,0.7402985074626866,0.6926500352030763,0.13981413841247559,0.6926500352030763
208,8,KNeighbors Classifier,2,1.0,0.8227272727272728,0.7689950572795311,1.8459913730621338,0.7689950572795311
209,8,SVC Classifier,2,1.0,0.7651515151515151,0.7336416229890806,2.530998706817627,0.7336416229890806
210,8,Decision Tree,2,1.0,0.6348484848484849,0.5840229992472271,0.1743624210357666,0.5840229992472271
211,8,RandomForest,2,1.0,0.5424242424242425,0.3561155710884892,0.4835164546966553,0.3561155710884892
212,8,AdaBoost (Discrete),2,1.0,0.7333333333333333,0.7012166824593254,126.8451714515686,0.7012166824593254
213,8,AdaBoost (Real),2,1.0,0.7045454545454546,0.6658959280039222,126.83651375770569,0.6658959280039222
214,8,Logistic Regression (Penalty = L2),2,1.0,0.8348484848484848,0.7886688169070574,1.6093976497650146,0.7886688169070574
215,8,Naive Bayes,2,1.0,0.7333333333333333,0.6920698419809663,0.15918231010437012,0.6920698419809663
216,9,KNeighbors Classifier,0,1.0,0.8074626865671641,0.7500144509395629,2.0161924362182617,0.7500144509395629
217,9,SVC Classifier,0,1.0,0.7597014925373134,0.7254318967282575,2.7764620780944824,0.7254318967282575
218,9,Decision Tree,0,1.0,0.591044776119403,0.5293232881403637,0.14086270332336426,0.5293232881403637
219,9,RandomForest,0,1.0,0.4552238805970149,0.28147025604272446,0.5460619926452637,0.0
220,9,AdaBoost (Discrete),0,1.0,0.746268656716418,0.7170805766671005,136.47856092453003,0.7170805766671005
221,9,AdaBoost (Real),0,1.0,0.46567164179104475,0.3512878656101901,128.6435661315918,0.3512878656101901
222,9,Logistic Regression (Penalty = L2),0,1.0,0.826865671641791,0.7818376212331395,1.5159814357757568,0.7818376212331395
223,9,Naive Bayes,0,1.0,0.7149253731343284,0.6783149276069205,0.14375662803649902,0.6783149276069205
224,9,KNeighbors Classifier,1,1.0,0.7970149253731343,0.7316275011690854,1.902115821838379,0.7316275011690854
225,9,SVC Classifier,1,1.0,0.7567164179104477,0.7134614538724139,2.529282569885254,0.7134614538724139
226,9,Decision Tree,1,1.0,0.5970149253731343,0.5400656132723047,0.17588138580322266,0.5400656132723047
227,9,RandomForest,1,1.0,0.48656716417910445,0.33496400347164623,0.5343756675720215,0.33496400347164623
228,9,AdaBoost (Discrete),1,1.0,0.7283582089552239,0.6943090437224501,112.35566091537476,0.6943090437224501
229,9,AdaBoost (Real),1,1.0,0.6970149253731344,0.6614430385498268,110.87928366661072,0.6614430385498268
230,9,Logistic Regression (Penalty = L2),1,1.0,0.8208955223880597,0.7742219691760631,1.2190067768096924,0.7742219691760631
231,9,Naive Bayes,1,1.0,0.7402985074626866,0.6926500352030763,0.13690567016601562,0.6926500352030763
232,9,KNeighbors Classifier,2,1.0,0.8227272727272728,0.7689950572795311,1.6140189170837402,0.7689950572795311
233,9,SVC Classifier,2,1.0,0.7651515151515151,0.7336416229890806,2.423729181289673,0.7336416229890806
234,9,Decision Tree,2,1.0,0.6272727272727273,0.5875314489215954,0.1545562744140625,0.5875314489215954
235,9,RandomForest,2,1.0,0.5424242424242425,0.3561155710884892,0.4412040710449219,0.3561155710884892
236,9,AdaBoost (Discrete),2,1.0,0.7333333333333333,0.7012166824593254,110.4326331615448,0.7012166824593254
237,9,AdaBoost (Real),2,1.0,0.7090909090909091,0.674174565772013,100.41354012489319,0.674174565772013
238,9,Logistic Regression (Penalty = L2),2,1.0,0.8348484848484848,0.7886688169070574,1.2566447257995605,0.7886688169070574
239,9,Naive Bayes,2,1.0,0.7333333333333333,0.6920698419809663,0.1284773349761963,0.6920698419809663
240,10,KNeighbors Classifier,0,1.0,0.8074626865671641,0.7500144509395629,1.5430800914764404,0.7500144509395629
241,10,SVC Classifier,0,1.0,0.7597014925373134,0.7254318967282575,2.089726209640503,0.7254318967282575
242,10,Decision Tree,0,1.0,0.6313432835820896,0.5720273594352092,0.14262604713439941,0.5720273594352092
243,10,RandomForest,0,1.0,0.4552238805970149,0.28147025604272446,0.4665226936340332,0.0
244,10,AdaBoost (Discrete),0,1.0,0.746268656716418,0.7170805766671005,102.33686304092407,0.7170805766671005
245,10,AdaBoost (Real),0,1.0,0.682089552238806,0.645655946046639,100.2646369934082,0.645655946046639
246,10,Logistic Regression (Penalty = L2),0,1.0,0.826865671641791,0.7818376212331395,1.2954554557800293,0.7818376212331395
247,10,Naive Bayes,0,1.0,0.7149253731343284,0.6783149276069205,0.10960268974304199,0.6783149276069205
248,10,KNeighbors Classifier,1,1.0,0.7970149253731343,0.7316275011690854,1.5377192497253418,0.7316275011690854
249,10,SVC Classifier,1,1.0,0.7567164179104477,0.7134614538724139,2.098191976547241,0.7134614538724139
250,10,Decision Tree,1,1.0,0.6119402985074627,0.5564309327333827,0.11114931106567383,0.5564309327333827
251,10,RandomForest,1,1.0,0.48656716417910445,0.33496400347164623,0.39633679389953613,0.33496400347164623
252,10,AdaBoost (Discrete),1,1.0,0.7283582089552239,0.6943090437224501,96.01178312301636,0.6943090437224501
253,10,AdaBoost (Real),1,1.0,0.6597014925373135,0.612936507809643,98.14689373970032,0.612936507809643
254,10,Logistic Regression (Penalty = L2),1,1.0,0.8208955223880597,0.7742219691760631,1.1896328926086426,0.7742219691760631
255,10,Naive Bayes,1,1.0,0.7402985074626866,0.6926500352030763,0.12428593635559082,0.6926500352030763
256,10,KNeighbors Classifier,2,1.0,0.8227272727272728,0.7689950572795311,1.5447189807891846,0.7689950572795311
257,10,SVC Classifier,2,1.0,0.7651515151515151,0.7336416229890806,2.048142910003662,0.7336416229890806
258,10,Decision Tree,2,1.0,0.6075757575757575,0.5548833811144235,0.14197850227355957,0.5548833811144235
259,10,RandomForest,2,1.0,0.5424242424242425,0.3561155710884892,0.36299800872802734,0.3561155710884892
260,10,AdaBoost (Discrete),2,1.0,0.7333333333333333,0.7012166824593254,100.1306836605072,0.7012166824593254
261,10,AdaBoost (Real),2,1.0,0.703030303030303,0.6280633053975264,92.18209171295166,0.6280633053975264
262,10,Logistic Regression (Penalty = L2),2,1.0,0.8348484848484848,0.7886688169070574,1.0707719326019287,0.7886688169070574
263,10,Naive Bayes,2,1.0,0.7333333333333333,0.6920698419809663,0.1572895050048828,0.6920698419809663
264,11,KNeighbors Classifier,0,1.0,0.8074626865671641,0.7500144509395629,1.4030649662017822,0.7500144509395629
265,11,SVC Classifier,0,1.0,0.7597014925373134,0.7254318967282575,1.930891752243042,0.7254318967282575
266,11,Decision Tree,0,1.0,0.5970149253731343,0.512021760216062,0.12775111198425293,0.512021760216062
267,11,RandomForest,0,1.0,0.4552238805970149,0.28147025604272446,0.351229190826416,0.0
268,11,AdaBoost (Discrete),0,1.0,0.746268656716418,0.7170805766671005,91.4351327419281,0.7170805766671005
269,11,AdaBoost (Real),0,1.0,0.664179104477612,0.6260230488019228,91.51822781562805,0.6260230488019228
270,11,Logistic Regression (Penalty = L2),0,1.0,0.826865671641791,0.7818376212331395,1.137251615524292,0.7818376212331395
271,11,Naive Bayes,0,1.0,0.7149253731343284,0.6783149276069205,0.1278212070465088,0.6783149276069205
272,11,KNeighbors Classifier,1,1.0,0.7970149253731343,0.7316275011690854,1.4206030368804932,0.7316275011690854
273,11,SVC Classifier,1,1.0,0.7567164179104477,0.7134614538724139,1.8745288848876953,0.7134614538724139
274,11,Decision Tree,1,1.0,0.6208955223880597,0.558156161312594,0.09723424911499023,0.558156161312594
275,11,RandomForest,1,1.0,0.48656716417910445,0.33496400347164623,0.3510019779205322,0.33496400347164623
276,11,AdaBoost (Discrete),1,1.0,0.7283582089552239,0.6943090437224501,89.71107888221741,0.6943090437224501
277,11,AdaBoost (Real),1,1.0,0.7044776119402985,0.6448372746322172,79.7376434803009,0.6448372746322172
278,11,Logistic Regression (Penalty = L2),1,1.0,0.8208955223880597,0.7742219691760631,0.8720552921295166,0.7742219691760631
279,11,Naive Bayes,1,1.0,0.7402985074626866,0.6926500352030763,0.0848548412322998,0.6926500352030763
280,11,KNeighbors Classifier,2,1.0,0.8227272727272728,0.7689950572795311,1.2247157096862793,0.7689950572795311
281,11,SVC Classifier,2,1.0,0.7651515151515151,0.7336416229890806,1.6362807750701904,0.7336416229890806
282,11,Decision Tree,2,1.0,0.6439393939393939,0.5998042487361822,0.08510160446166992,0.5998042487361822
283,11,RandomForest,2,1.0,0.5424242424242425,0.3561155710884892,0.40252089500427246,0.3561155710884892
284,11,AdaBoost (Discrete),2,1.0,0.7333333333333333,0.7012166824593254,70.04883289337158,0.7012166824593254
285,11,AdaBoost (Real),2,1.0,0.703030303030303,0.6741278771012187,70.6347587108612,0.6741278771012187
286,11,Logistic Regression (Penalty = L2),2,1.0,0.8348484848484848,0.7886688169070574,1.0065839290618896,0.7886688169070574
287,11,Naive Bayes,2,1.0,0.7333333333333333,0.6920698419809663,0.12668824195861816,0.6920698419809663
288,12,KNeighbors Classifier,0,1.0,0.8074626865671641,0.7500144509395629,1.065227746963501,0.7500144509395629
289,12,SVC Classifier,0,1.0,0.7597014925373134,0.7254318967282575,1.4457499980926514,0.7254318967282575
290,12,Decision Tree,0,1.0,0.6104477611940299,0.5467439655959192,0.09408450126647949,0.5467439655959192
291,12,RandomForest,0,1.0,0.4552238805970149,0.28147025604272446,0.26282358169555664,0.0
292,12,AdaBoost (Discrete),0,1.0,0.746268656716418,0.7170805766671005,73.10386204719543,0.7170805766671005
293,12,AdaBoost (Real),0,1.0,0.7343283582089553,0.6847055564082312,72.22249507904053,0.6847055564082312
294,12,Logistic Regression (Penalty = L2),0,1.0,0.826865671641791,0.7818376212331395,0.9069499969482422,0.7818376212331395
295,12,Naive Bayes,0,1.0,0.7149253731343284,0.6783149276069205,0.09600973129272461,0.6783149276069205
296,12,KNeighbors Classifier,1,1.0,0.7970149253731343,0.7316275011690854,1.0940654277801514,0.7316275011690854
297,12,SVC Classifier,1,1.0,0.7567164179104477,0.7134614538724139,1.4325532913208008,0.7134614538724139
298,12,Decision Tree,1,1.0,0.5985074626865672,0.5668131557063437,0.07278132438659668,0.5668131557063437
299,12,RandomForest,1,1.0,0.48656716417910445,0.33496400347164623,0.24028301239013672,0.33496400347164623
300,12,AdaBoost (Discrete),1,1.0,0.7283582089552239,0.6943090437224501,74.69071531295776,0.6943090437224501
301,12,AdaBoost (Real),1,1.0,0.6925373134328359,0.6583933550434183,76.66735243797302,0.6583933550434183
302,12,Logistic Regression (Penalty = L2),1,1.0,0.8208955223880597,0.7742219691760631,0.889493465423584,0.7742219691760631
303,12,Naive Bayes,1,1.0,0.7402985074626866,0.6926500352030763,0.08492493629455566,0.6926500352030763
304,12,KNeighbors Classifier,2,1.0,0.8227272727272728,0.7689950572795311,1.1860158443450928,0.7689950572795311
305,12,SVC Classifier,2,1.0,0.7651515151515151,0.7336416229890806,1.4106500148773193,0.7336416229890806
306,12,Decision Tree,2,1.0,0.6545454545454545,0.6175592579245252,0.06861186027526855,0.6175592579245252
307,12,RandomForest,2,1.0,0.5424242424242425,0.3561155710884892,0.2447032928466797,0.3561155710884892
308,12,AdaBoost (Discrete),2,1.0,0.7333333333333333,0.7012166824593254,69.86248850822449,0.7012166824593254
309,12,AdaBoost (Real),2,1.0,0.6878787878787879,0.6559615205726531,66.10682535171509,0.6559615205726531
310,12,Logistic Regression (Penalty = L2),2,1.0,0.8348484848484848,0.7886688169070574,0.8610622882843018,0.7886688169070574
311,12,Naive Bayes,2,1.0,0.7333333333333333,0.6920698419809663,0.09183287620544434,0.6920698419809663
