,feat_set_id,classifier,fold_id,feat_th,score,geo_score,exec_t,geo_score_woz
0,0,KNeighbors Classifier,0,0.8,1.0,1.0,0.717937707901001,1.0
1,0,SVC Classifier,0,0.8,0.01904761904761905,1.0,4.809003114700317,0.0
2,0,Decision Tree,0,0.8,1.0,1.0,0.1192939281463623,1.0
3,0,RandomForest,0,0.8,0.23809523809523808,1.0,0.9708647727966309,0.0
4,0,AdaBoost (Discrete),0,0.8,0.8476190476190476,1.0,71.1680212020874,0.0
5,0,AdaBoost (Real),0,0.8,0.9333333333333333,1.0,356.7638809680939,0.0
6,0,Logistic Regression (Penalty = L2),0,0.8,0.6952380952380952,1.0,6.946511268615723,0.0
7,0,Naive Bayes,0,0.8,1.0,1.0,1.4446978569030762,1.0
8,0,KNeighbors Classifier,1,0.8,1.0,1.0,0.7697288990020752,1.0
9,0,SVC Classifier,1,0.8,0.01904761904761905,1.0,5.458555459976196,0.0
10,0,Decision Tree,1,0.8,1.0,1.0,0.12427949905395508,1.0
11,0,RandomForest,1,0.8,0.22857142857142856,1.0,1.0899226665496826,0.0
12,0,AdaBoost (Discrete),1,0.8,0.780952380952381,1.0,80.94487762451172,0.0
13,0,AdaBoost (Real),1,0.8,0.8666666666666667,1.0,218.8315989971161,0.0
14,0,Logistic Regression (Penalty = L2),1,0.8,0.6952380952380952,1.0,6.599506378173828,0.0
15,0,Naive Bayes,1,0.8,1.0,1.0,1.3102986812591553,1.0
16,0,KNeighbors Classifier,2,0.8,1.0,1.0,0.4804413318634033,1.0
17,0,SVC Classifier,2,0.8,1.0,1.0,5.167656183242798,1.0
18,0,Decision Tree,2,0.8,1.0,1.0,0.0027604103088378906,1.0
19,0,RandomForest,2,0.8,0.18037974683544303,1.0,0.9162495136260986,0.0
20,0,AdaBoost (Discrete),2,0.8,0.7056962025316456,1.0,75.37927889823914,0.0
21,0,AdaBoost (Real),2,0.8,0.9715189873417721,1.0,216.49251651763916,0.0
22,0,Logistic Regression (Penalty = L2),2,0.8,0.7215189873417721,1.0,8.22359299659729,0.0
23,0,Naive Bayes,2,0.8,1.0,1.0,1.5166206359863281,1.0
24,1,KNeighbors Classifier,0,0.8,1.0,1.0,0.6851980686187744,1.0
25,1,SVC Classifier,0,0.8,0.01904761904761905,1.0,5.719480752944946,0.0
26,1,Decision Tree,0,0.8,1.0,1.0,0.13190102577209473,1.0
27,1,RandomForest,0,0.8,0.24761904761904763,1.0,1.3618886470794678,0.0
28,1,AdaBoost (Discrete),0,0.8,0.7523809523809524,1.0,100.72476530075073,0.0
29,1,AdaBoost (Real),0,0.8,0.9428571428571428,1.0,298.0624279975891,0.0
30,1,Logistic Regression (Penalty = L2),0,0.8,0.9904761904761905,1.0,9.1988844871521,0.0
31,1,Naive Bayes,0,0.8,1.0,1.0,1.522789716720581,1.0
32,1,KNeighbors Classifier,1,0.8,1.0,1.0,0.7241265773773193,1.0
33,1,SVC Classifier,1,0.8,0.01904761904761905,1.0,6.639122009277344,0.0
34,1,Decision Tree,1,0.8,1.0,1.0,0.2867465019226074,1.0
35,1,RandomForest,1,0.8,0.18095238095238095,1.0,1.157268762588501,0.0
36,1,AdaBoost (Discrete),1,0.8,0.9238095238095239,1.0,100.92580890655518,0.0
37,1,AdaBoost (Real),1,0.8,0.9238095238095239,1.0,269.7768087387085,0.0
38,1,Logistic Regression (Penalty = L2),1,0.8,0.9904761904761905,1.0,9.740696668624878,0.0
39,1,Naive Bayes,1,0.8,1.0,1.0,1.7883918285369873,1.0
40,1,KNeighbors Classifier,2,0.8,1.0,1.0,0.5944151878356934,1.0
41,1,SVC Classifier,2,0.8,1.0,1.0,6.941258430480957,1.0
42,1,Decision Tree,2,0.8,1.0,1.0,0.2948019504547119,1.0
43,1,RandomForest,2,0.8,0.1518987341772152,1.0,1.3376047611236572,0.0
44,1,AdaBoost (Discrete),2,0.8,0.8449367088607594,1.0,95.28645253181458,0.0
45,1,AdaBoost (Real),2,0.8,0.8481012658227848,1.0,257.8669843673706,0.0
46,1,Logistic Regression (Penalty = L2),2,0.8,0.990506329113924,1.0,10.402055025100708,0.0
47,1,Naive Bayes,2,0.8,1.0,1.0,1.7658061981201172,1.0
48,2,KNeighbors Classifier,0,0.8,1.0,1.0,0.6656391620635986,1.0
49,2,SVC Classifier,0,0.8,0.01904761904761905,1.0,6.123274803161621,0.0
50,2,Decision Tree,0,0.8,1.0,1.0,0.003154754638671875,1.0
51,2,RandomForest,0,0.8,0.24761904761904763,1.0,1.2030620574951172,0.0
52,2,AdaBoost (Discrete),0,0.8,0.7238095238095238,1.0,90.72221112251282,0.0
53,2,AdaBoost (Real),0,0.8,0.819047619047619,1.0,302.55322003364563,0.0
54,2,Logistic Regression (Penalty = L2),0,0.8,0.9809523809523809,1.0,11.634836196899414,0.0
55,2,Naive Bayes,0,0.8,1.0,1.0,2.5887789726257324,1.0
56,2,KNeighbors Classifier,1,0.8,1.0,1.0,0.39276671409606934,1.0
57,2,SVC Classifier,1,0.8,0.01904761904761905,1.0,4.1728515625,0.0
58,2,Decision Tree,1,0.8,1.0,1.0,0.44101953506469727,1.0
59,2,RandomForest,1,0.8,0.1619047619047619,1.0,0.5974857807159424,0.0
60,2,AdaBoost (Discrete),1,0.8,0.9619047619047619,1.0,112.88636946678162,0.0
61,2,AdaBoost (Real),1,0.8,0.9047619047619048,1.0,301.15908765792847,0.0
62,2,Logistic Regression (Penalty = L2),1,0.8,0.9809523809523809,1.0,9.753678321838379,0.0
63,2,Naive Bayes,1,0.8,1.0,1.0,1.7188026905059814,1.0
64,2,KNeighbors Classifier,2,0.8,1.0,1.0,0.6457159519195557,1.0
65,2,SVC Classifier,2,0.8,1.0,1.0,6.871840000152588,1.0
66,2,Decision Tree,2,0.8,1.0,1.0,0.15591764450073242,1.0
67,2,RandomForest,2,0.8,0.1518987341772152,1.0,1.364441156387329,0.0
68,2,AdaBoost (Discrete),2,0.8,0.7246835443037974,1.0,101.16787385940552,0.0
69,2,AdaBoost (Real),2,0.8,0.8955696202531646,1.0,277.4733564853668,0.0
70,2,Logistic Regression (Penalty = L2),2,0.8,0.990506329113924,1.0,10.535240888595581,0.0
71,2,Naive Bayes,2,0.8,1.0,1.0,1.795849323272705,1.0
72,3,KNeighbors Classifier,0,0.8,1.0,1.0,0.8598527908325195,1.0
73,3,SVC Classifier,0,0.8,0.009523809523809525,1.0,7.283447027206421,0.0
74,3,Decision Tree,0,0.8,1.0,1.0,0.12900114059448242,1.0
75,3,RandomForest,0,0.8,0.2,1.0,1.598909854888916,0.0
76,3,AdaBoost (Discrete),0,0.8,0.8952380952380953,1.0,97.66788482666016,0.0
77,3,AdaBoost (Real),0,0.8,0.8761904761904762,1.0,275.25137186050415,0.0
78,3,Logistic Regression (Penalty = L2),0,0.8,0.6476190476190476,1.0,7.424207448959351,0.0
79,3,Naive Bayes,0,0.8,1.0,1.0,1.925812005996704,1.0
80,3,KNeighbors Classifier,1,0.8,1.0,1.0,0.920461893081665,1.0
81,3,SVC Classifier,1,0.8,0.009523809523809525,1.0,7.05741024017334,0.0
82,3,Decision Tree,1,0.8,1.0,1.0,0.17176246643066406,1.0
83,3,RandomForest,1,0.8,0.2,1.0,1.4448637962341309,0.0
84,3,AdaBoost (Discrete),1,0.8,0.9809523809523809,1.0,98.75165247917175,0.0
85,3,AdaBoost (Real),1,0.8,0.9333333333333333,1.0,268.159451007843,0.0
86,3,Logistic Regression (Penalty = L2),1,0.8,0.6476190476190476,1.0,6.948997974395752,0.0
87,3,Naive Bayes,1,0.8,1.0,1.0,1.6728169918060303,1.0
88,3,KNeighbors Classifier,2,0.8,1.0,1.0,0.7577383518218994,1.0
89,3,SVC Classifier,2,0.8,1.0,1.0,6.680316925048828,1.0
90,3,Decision Tree,2,0.8,1.0,1.0,0.15668249130249023,1.0
91,3,RandomForest,2,0.8,0.17088607594936708,1.0,1.2097201347351074,0.0
92,3,AdaBoost (Discrete),2,0.8,0.9430379746835443,1.0,96.93789601325989,0.0
93,3,AdaBoost (Real),2,0.8,0.9620253164556962,1.0,257.52335476875305,0.0
94,3,Logistic Regression (Penalty = L2),2,0.8,0.6740506329113924,1.0,7.306396007537842,0.0
95,3,Naive Bayes,2,0.8,1.0,1.0,1.532639741897583,1.0
96,4,KNeighbors Classifier,0,0.8,1.0,1.0,0.747406005859375,1.0
97,4,SVC Classifier,0,0.8,0.009523809523809525,1.0,6.99455189704895,0.0
98,4,Decision Tree,0,0.8,1.0,1.0,0.15261220932006836,1.0
99,4,RandomForest,0,0.8,0.19047619047619047,1.0,1.3648109436035156,0.0
100,4,AdaBoost (Discrete),0,0.8,0.8666666666666667,1.0,94.30313372612,0.0
101,4,AdaBoost (Real),0,0.8,0.9333333333333333,1.0,246.53593635559082,0.0
102,4,Logistic Regression (Penalty = L2),0,0.8,0.6666666666666666,1.0,7.14030385017395,0.0
103,4,Naive Bayes,0,0.8,1.0,1.0,1.5339760780334473,1.0
104,4,KNeighbors Classifier,1,0.8,1.0,1.0,0.658719539642334,1.0
105,4,SVC Classifier,1,0.8,0.009523809523809525,1.0,5.798205137252808,0.0
106,4,Decision Tree,1,0.8,1.0,1.0,0.156951904296875,1.0
107,4,RandomForest,1,0.8,0.18095238095238095,1.0,1.2958459854125977,0.0
108,4,AdaBoost (Discrete),1,0.8,0.6285714285714286,1.0,83.08379220962524,0.0
109,4,AdaBoost (Real),1,0.8,0.9619047619047619,1.0,261.3671028614044,0.0
110,4,Logistic Regression (Penalty = L2),1,0.8,0.6666666666666666,1.0,6.884254455566406,0.0
111,4,Naive Bayes,1,0.8,1.0,1.0,1.7251965999603271,1.0
112,4,KNeighbors Classifier,2,0.8,1.0,1.0,0.780282735824585,1.0
113,4,SVC Classifier,2,0.8,1.0,1.0,6.742292404174805,1.0
114,4,Decision Tree,2,0.8,1.0,1.0,0.29672837257385254,1.0
115,4,RandomForest,2,0.8,0.189873417721519,1.0,1.3244445323944092,0.0
116,4,AdaBoost (Discrete),2,0.8,0.819620253164557,1.0,88.29551219940186,0.0
117,4,AdaBoost (Real),2,0.8,0.9620253164556962,1.0,219.7365746498108,0.0
118,4,Logistic Regression (Penalty = L2),2,0.8,0.7025316455696202,1.0,7.674798488616943,0.0
119,4,Naive Bayes,2,0.8,1.0,1.0,1.4920334815979004,1.0
120,5,KNeighbors Classifier,0,0.8,1.0,1.0,0.7699158191680908,1.0
121,5,SVC Classifier,0,0.8,0.009523809523809525,1.0,6.9681236743927,0.0
122,5,Decision Tree,0,0.8,1.0,1.0,0.29125523567199707,1.0
123,5,RandomForest,0,0.8,0.23809523809523808,1.0,1.423947811126709,0.0
124,5,AdaBoost (Discrete),0,0.8,0.7047619047619048,1.0,96.77838397026062,0.0
125,5,AdaBoost (Real),0,0.8,0.9333333333333333,1.0,240.76802802085876,0.0
126,5,Logistic Regression (Penalty = L2),0,0.8,0.9619047619047619,1.0,6.890017509460449,0.0
127,5,Naive Bayes,0,0.8,1.0,1.0,1.4756736755371094,1.0
128,5,KNeighbors Classifier,1,0.8,1.0,1.0,0.48183417320251465,1.0
129,5,SVC Classifier,1,0.8,0.009523809523809525,1.0,5.718483209609985,0.0
130,5,Decision Tree,1,0.8,1.0,1.0,0.10161733627319336,1.0
131,5,RandomForest,1,0.8,0.18095238095238095,1.0,1.3036141395568848,0.0
132,5,AdaBoost (Discrete),1,0.8,0.7047619047619048,1.0,87.8339536190033,0.0
133,5,AdaBoost (Real),1,0.8,0.9523809523809523,1.0,231.62922167778015,0.0
134,5,Logistic Regression (Penalty = L2),1,0.8,0.9619047619047619,1.0,5.934671878814697,0.0
135,5,Naive Bayes,1,0.8,1.0,1.0,1.4479155540466309,1.0
136,5,KNeighbors Classifier,2,0.8,1.0,1.0,0.48719096183776855,1.0
137,5,SVC Classifier,2,0.8,1.0,1.0,5.014734268188477,1.0
138,5,Decision Tree,2,0.8,1.0,1.0,0.2841203212738037,1.0
139,5,RandomForest,2,0.8,0.1518987341772152,1.0,0.9103152751922607,0.0
140,5,AdaBoost (Discrete),2,0.8,0.5981012658227848,1.0,82.88114976882935,0.0
141,5,AdaBoost (Real),2,0.8,0.810126582278481,1.0,216.93869304656982,0.0
142,5,Logistic Regression (Penalty = L2),2,0.8,0.9715189873417721,1.0,9.810287237167358,0.0
143,5,Naive Bayes,2,0.8,1.0,1.0,1.583643913269043,1.0
144,6,KNeighbors Classifier,0,0.8,1.0,1.0,0.6051685810089111,1.0
145,6,SVC Classifier,0,0.8,0.01904761904761905,1.0,7.378875255584717,0.0
146,6,Decision Tree,0,0.8,1.0,1.0,0.17906999588012695,1.0
147,6,RandomForest,0,0.8,0.20952380952380953,1.0,1.3567848205566406,0.0
148,6,AdaBoost (Discrete),0,0.8,0.9333333333333333,1.0,1133.075367450714,0.0
149,6,AdaBoost (Real),0,0.8,0.8857142857142857,1.0,196.5049343109131,0.0
150,6,Logistic Regression (Penalty = L2),0,0.8,0.9904761904761905,1.0,6.722839832305908,0.0
151,6,Naive Bayes,0,0.8,1.0,1.0,1.5581011772155762,1.0
152,6,KNeighbors Classifier,1,0.8,1.0,1.0,0.608755350112915,1.0
153,6,SVC Classifier,1,0.8,0.01904761904761905,1.0,5.378476858139038,0.0
154,6,Decision Tree,1,0.8,1.0,1.0,0.1157381534576416,1.0
155,6,RandomForest,1,0.8,0.17142857142857143,1.0,0.9619805812835693,0.0
156,6,AdaBoost (Discrete),1,0.8,0.8666666666666667,1.0,72.19985365867615,0.0
157,6,AdaBoost (Real),1,0.8,0.9238095238095239,1.0,189.90295362472534,0.0
158,6,Logistic Regression (Penalty = L2),1,0.8,0.9904761904761905,1.0,6.688681364059448,0.0
159,6,Naive Bayes,1,0.8,1.0,1.0,1.2520060539245605,1.0
160,6,KNeighbors Classifier,2,0.8,1.0,1.0,0.5473649501800537,1.0
161,6,SVC Classifier,2,0.8,1.0,1.0,4.901662111282349,1.0
162,6,Decision Tree,2,0.8,1.0,1.0,0.11312341690063477,1.0
163,6,RandomForest,2,0.8,0.189873417721519,1.0,0.8989598751068115,0.0
164,6,AdaBoost (Discrete),2,0.8,0.8860759493670886,1.0,63.47459149360657,0.0
165,6,AdaBoost (Real),2,0.8,0.8955696202531646,1.0,171.416410446167,0.0
166,6,Logistic Regression (Penalty = L2),2,0.8,0.990506329113924,1.0,7.161696910858154,0.0
167,6,Naive Bayes,2,0.8,1.0,1.0,1.3270883560180664,1.0
168,7,KNeighbors Classifier,0,0.8,1.0,1.0,0.5252194404602051,1.0
169,7,SVC Classifier,0,0.8,0.01904761904761905,1.0,4.997264385223389,0.0
170,7,Decision Tree,0,0.8,1.0,1.0,0.08319377899169922,1.0
171,7,RandomForest,0,0.8,0.23809523809523808,1.0,0.9344198703765869,0.0
172,7,AdaBoost (Discrete),0,0.8,0.9619047619047619,1.0,66.34225010871887,0.0
173,7,AdaBoost (Real),0,0.8,0.9428571428571428,1.0,169.19999861717224,0.0
174,7,Logistic Regression (Penalty = L2),0,0.8,0.9809523809523809,1.0,5.855255842208862,0.0
175,7,Naive Bayes,0,0.8,1.0,1.0,1.11419677734375,1.0
176,7,KNeighbors Classifier,1,0.8,1.0,1.0,0.5374972820281982,1.0
177,7,SVC Classifier,1,0.8,0.01904761904761905,1.0,4.170580625534058,0.0
178,7,Decision Tree,1,0.8,1.0,1.0,0.09173893928527832,1.0
179,7,RandomForest,1,0.8,0.19047619047619047,1.0,0.7477507591247559,0.0
180,7,AdaBoost (Discrete),1,0.8,0.8285714285714286,1.0,59.27967596054077,0.0
181,7,AdaBoost (Real),1,0.8,0.8666666666666667,1.0,153.89259600639343,0.0
182,7,Logistic Regression (Penalty = L2),1,0.8,0.9809523809523809,1.0,5.597130298614502,0.0
183,7,Naive Bayes,1,0.8,1.0,1.0,1.2486412525177002,1.0
184,7,KNeighbors Classifier,2,0.8,1.0,1.0,0.4646298885345459,1.0
185,7,SVC Classifier,2,0.8,1.0,1.0,4.441037178039551,1.0
186,7,Decision Tree,2,0.8,1.0,1.0,0.07300472259521484,1.0
187,7,RandomForest,2,0.8,0.2468354430379747,1.0,0.7629048824310303,0.0
188,7,AdaBoost (Discrete),2,0.8,0.7816455696202531,1.0,60.00776934623718,0.0
189,7,AdaBoost (Real),2,0.8,0.8860759493670886,1.0,150.39969873428345,0.0
190,7,Logistic Regression (Penalty = L2),2,0.8,0.990506329113924,1.0,5.907740831375122,0.0
191,7,Naive Bayes,2,0.8,1.0,1.0,1.0294568538665771,1.0
192,8,KNeighbors Classifier,0,0.8,1.0,1.0,0.41399526596069336,1.0
193,8,SVC Classifier,0,0.8,0.009523809523809525,1.0,3.9201369285583496,0.0
194,8,Decision Tree,0,0.8,1.0,1.0,0.1859583854675293,1.0
195,8,RandomForest,0,0.8,0.1523809523809524,1.0,0.753504753112793,0.0
196,8,AdaBoost (Discrete),0,0.8,0.9714285714285714,1.0,53.59347605705261,0.0
197,8,AdaBoost (Real),0,0.8,0.9047619047619048,1.0,162.87538862228394,0.0
198,8,Logistic Regression (Penalty = L2),0,0.8,0.580952380952381,1.0,4.1170759201049805,0.0
199,8,Naive Bayes,0,0.8,1.0,1.0,1.0645034313201904,1.0
200,8,KNeighbors Classifier,1,0.8,1.0,1.0,0.3932163715362549,1.0
201,8,SVC Classifier,1,0.8,0.009523809523809525,1.0,4.705122709274292,0.0
202,8,Decision Tree,1,0.8,1.0,1.0,0.1900627613067627,1.0
203,8,RandomForest,1,0.8,0.13333333333333333,1.0,0.7653207778930664,0.0
204,8,AdaBoost (Discrete),1,0.8,0.9047619047619048,1.0,50.50610876083374,0.0
205,8,AdaBoost (Real),1,0.8,0.9238095238095239,1.0,153.16369247436523,0.0
206,8,Logistic Regression (Penalty = L2),1,0.8,0.580952380952381,1.0,3.9598493576049805,0.0
207,8,Naive Bayes,1,0.8,1.0,1.0,0.8916761875152588,1.0
208,8,KNeighbors Classifier,2,0.8,1.0,1.0,0.3509688377380371,1.0
209,8,SVC Classifier,2,0.8,1.0,1.0,4.153329372406006,1.0
210,8,Decision Tree,2,0.8,1.0,1.0,0.1708357334136963,1.0
211,8,RandomForest,2,0.8,0.1518987341772152,1.0,0.723585844039917,0.0
212,8,AdaBoost (Discrete),2,0.8,0.8765822784810127,1.0,54.77810573577881,0.0
213,8,AdaBoost (Real),2,0.8,0.8860759493670886,1.0,133.47553086280823,0.0
214,8,Logistic Regression (Penalty = L2),2,0.8,0.6170886075949367,1.0,3.92673397064209,0.0
215,8,Naive Bayes,2,0.8,1.0,1.0,0.9227159023284912,1.0
