,feat_set_id,classifier,fold_id,feat_th,score,geo_score,exec_t,geo_score_woz
0,0,KNeighbors Classifier,0,0.8,0.7744451109778044,0.7741496956781941,20.990992069244385,0.7741496956781941
1,0,SVC Classifier,0,0.8,0.847630473905219,0.8416922605667667,15.132465124130249,0.8416922605667667
2,0,Decision Tree,0,0.8,0.7180563887222555,0.7174948409571174,0.4869835376739502,0.7174948409571174
3,0,RandomForest,0,0.8,0.7558488302339532,0.7297590821989084,1.1221394538879395,0.7297590821989084
4,0,AdaBoost (Discrete),0,0.8,0.8446310737852429,0.8446755840736535,239.32420372962952,0.8446755840736535
5,0,AdaBoost (Real),0,0.8,0.8326334733053389,0.832159401635541,244.90158414840698,0.832159401635541
6,0,Logistic Regression (Penalty = L2),0,0.8,0.8686262747450509,0.8685188836931741,1.0706367492675781,0.8685188836931741
7,0,Naive Bayes,0,0.8,0.8008398320335933,0.7757503066734448,0.1829090118408203,0.7757503066734448
8,0,KNeighbors Classifier,1,0.8,0.7876424715056989,0.7870023478012561,21.948841333389282,0.7870023478012561
9,0,SVC Classifier,1,0.8,0.8488302339532093,0.8441309775319281,16.522846460342407,0.8441309775319281
10,0,Decision Tree,1,0.8,0.6928614277144571,0.6927581937851379,0.44857072830200195,0.6927581937851379
11,0,RandomForest,1,0.8,0.7486502699460108,0.7313145532302011,1.2755753993988037,0.7313145532302011
12,0,AdaBoost (Discrete),1,0.8,0.8146370725854829,0.8144331437322904,258.50623297691345,0.8144331437322904
13,0,AdaBoost (Real),1,0.8,0.826634673065387,0.826440353789828,274.00867986679077,0.826440353789828
14,0,Logistic Regression (Penalty = L2),1,0.8,0.8590281943611278,0.8590483393424547,1.0189063549041748,0.8590483393424547
15,0,Naive Bayes,1,0.8,0.7954409118176364,0.7706282349680887,0.23583507537841797,0.7706282349680887
16,0,KNeighbors Classifier,2,0.8,0.8097238895558223,0.8088138764677696,19.267650604248047,0.8088138764677696
17,0,SVC Classifier,2,0.8,0.8607442977190877,0.8547105218421726,15.494170427322388,0.8547105218421726
18,0,Decision Tree,2,0.8,0.7274909963985594,0.7272407018150178,0.48263001441955566,0.7272407018150178
19,0,RandomForest,2,0.8,0.776110444177671,0.7489705876481509,1.2049717903137207,0.7489705876481509
20,0,AdaBoost (Discrete),2,0.8,0.8541416566626651,0.8532627040982458,240.78182673454285,0.8532627040982458
21,0,AdaBoost (Real),2,0.8,0.8433373349339736,0.8410702489172248,257.64618253707886,0.8410702489172248
22,0,Logistic Regression (Penalty = L2),2,0.8,0.8763505402160864,0.8763228216289907,0.866999626159668,0.8763228216289907
23,0,Naive Bayes,2,0.8,0.8043217286914766,0.7772976448150574,0.2187356948852539,0.7772976448150574
24,1,KNeighbors Classifier,0,0.8,0.79124175164967,0.7911035845014668,19.27575945854187,0.7911035845014668
25,1,SVC Classifier,0,0.8,0.8470305938812237,0.8412455421490027,14.45107626914978,0.8412455421490027
26,1,Decision Tree,0,0.8,0.7270545890821836,0.7270110236817968,0.45269775390625,0.7270110236817968
27,1,RandomForest,0,0.8,0.7588482303539292,0.7334168680324709,1.0561888217926025,0.7334168680324709
28,1,AdaBoost (Discrete),0,0.8,0.8332333533293341,0.8332324943520327,226.89864015579224,0.8332324943520327
29,1,AdaBoost (Real),0,0.8,0.8242351529694061,0.8235870892024943,236.56313061714172,0.8235870892024943
30,1,Logistic Regression (Penalty = L2),0,0.8,0.865626874625075,0.8653821471196436,0.9798569679260254,0.8653821471196436
31,1,Naive Bayes,0,0.8,0.7984403119376124,0.7730150287805508,0.22232651710510254,0.7730150287805508
32,1,KNeighbors Classifier,1,0.8,0.7936412717456509,0.7936034609805657,19.87881565093994,0.7936034609805657
33,1,SVC Classifier,1,0.8,0.8458308338332333,0.8404715458532445,14.971129894256592,0.8404715458532445
34,1,Decision Tree,1,0.8,0.6964607078584283,0.6964243819552839,0.482590913772583,0.6964243819552839
35,1,RandomForest,1,0.8,0.7420515896820636,0.7251880287181258,1.1275372505187988,0.7251880287181258
36,1,AdaBoost (Discrete),1,0.8,0.8260347930413917,0.8256969348362838,232.2406723499298,0.8256969348362838
37,1,AdaBoost (Real),1,0.8,0.8206358728254349,0.8192029178439877,234.6583912372589,0.8192029178439877
38,1,Logistic Regression (Penalty = L2),1,0.8,0.8608278344331134,0.8607937556495274,0.8657355308532715,0.8607937556495274
39,1,Naive Bayes,1,0.8,0.7960407918416317,0.7718607264120017,0.18364548683166504,0.7718607264120017
40,1,KNeighbors Classifier,2,0.8,0.7923169267707083,0.7917719872284459,17.614575624465942,0.7917719872284459
41,1,SVC Classifier,2,0.8,0.8601440576230492,0.8541601607615702,12.998081922531128,0.8541601607615702
42,1,Decision Tree,2,0.8,0.741296518607443,0.7411316700118737,0.40239453315734863,0.7411316700118737
43,1,RandomForest,2,0.8,0.7791116446578632,0.7513800303345411,0.8968226909637451,0.7513800303345411
44,1,AdaBoost (Discrete),2,0.8,0.8457382953181273,0.8450932018467618,211.39308738708496,0.8450932018467618
45,1,AdaBoost (Real),2,0.8,0.851140456182473,0.8492316887295914,215.19410181045532,0.8492316887295914
46,1,Logistic Regression (Penalty = L2),2,0.8,0.8739495798319328,0.873887926731693,0.7960052490234375,0.873887926731693
47,1,Naive Bayes,2,0.8,0.8067226890756303,0.7796668139032917,0.19428157806396484,0.7796668139032917
48,2,KNeighbors Classifier,0,0.8,0.79124175164967,0.791245041543988,16.650914907455444,0.791245041543988
49,2,SVC Classifier,0,0.8,0.8458308338332333,0.8400704988215489,12.92878770828247,0.8400704988215489
50,2,Decision Tree,0,0.8,0.7174565086982604,0.7174349896177221,0.3855762481689453,0.7174349896177221
51,2,RandomForest,0,0.8,0.7546490701859628,0.7292263043533066,0.8444759845733643,0.7292263043533066
52,2,AdaBoost (Discrete),0,0.8,0.8326334733053389,0.832481400718761,195.47722625732422,0.832481400718761
53,2,AdaBoost (Real),0,0.8,0.8314337132573485,0.831163503645689,202.55142426490784,0.831163503645689
54,2,Logistic Regression (Penalty = L2),0,0.8,0.8704259148170366,0.8703683015487863,0.7672364711761475,0.8703683015487863
55,2,Naive Bayes,0,0.8,0.7960407918416317,0.7696034035085103,0.15386605262756348,0.7696034035085103
56,2,KNeighbors Classifier,1,0.8,0.7750449910017997,0.774271206137141,15.575665712356567,0.774271206137141
57,2,SVC Classifier,1,0.8,0.8518296340731853,0.8469110519736821,12.4758141040802,0.8469110519736821
58,2,Decision Tree,1,0.8,0.707258548290342,0.7071287982239842,0.3234226703643799,0.7071287982239842
59,2,RandomForest,1,0.8,0.7426514697060588,0.7281502927898575,0.9109086990356445,0.7281502927898575
60,2,AdaBoost (Discrete),1,0.8,0.8278344331133773,0.8277859690230109,194.9381387233734,0.8277859690230109
61,2,AdaBoost (Real),1,0.8,0.8200359928014397,0.8192841058598959,204.84806060791016,0.8192841058598959
62,2,Logistic Regression (Penalty = L2),1,0.8,0.865626874625075,0.8656291784513322,0.68145751953125,0.8656291784513322
63,2,Naive Bayes,1,0.8,0.7936412717456509,0.7702181998730272,0.12183356285095215,0.7702181998730272
64,2,KNeighbors Classifier,2,0.8,0.787515006002401,0.7867873053848634,16.443825244903564,0.7867873053848634
65,2,SVC Classifier,2,0.8,0.8619447779111644,0.8565970032902354,12.141690015792847,0.8565970032902354
66,2,Decision Tree,2,0.8,0.7166866746698679,0.7165093512461865,0.3249995708465576,0.7165093512461865
67,2,RandomForest,2,0.8,0.7797118847539015,0.7523489042608306,0.8822052478790283,0.7523489042608306
68,2,AdaBoost (Discrete),2,0.8,0.8613445378151261,0.86082691560774,196.26457285881042,0.86082691560774
69,2,AdaBoost (Real),2,0.8,0.8421368547418968,0.8396203751693939,207.43385696411133,0.8396203751693939
70,2,Logistic Regression (Penalty = L2),2,0.8,0.8727490996398559,0.8727409481421252,0.8084051609039307,0.8727409481421252
71,2,Naive Bayes,2,0.8,0.8013205282112845,0.7732610136314434,0.18279337882995605,0.7732610136314434
72,3,KNeighbors Classifier,0,0.8,0.7780443911217756,0.7769306997648957,16.207064867019653,0.7769306997648957
73,3,SVC Classifier,0,0.8,0.8482303539292142,0.8423498993065399,12.155758142471313,0.8423498993065399
74,3,Decision Tree,0,0.8,0.728254349130174,0.7281091258527254,0.394986629486084,0.7281091258527254
75,3,RandomForest,0,0.8,0.7588482303539292,0.7334168680324709,0.8352997303009033,0.7334168680324709
76,3,AdaBoost (Discrete),0,0.8,0.8272345530893821,0.8272727941047057,179.881178855896,0.8272727941047057
77,3,AdaBoost (Real),0,0.8,0.8284343131373725,0.8276639642072579,194.25085163116455,0.8276639642072579
78,3,Logistic Regression (Penalty = L2),0,0.8,0.8692261547690462,0.8691110073715647,0.6866726875305176,0.8691110073715647
79,3,Naive Bayes,0,0.8,0.7996400719856028,0.774393028422764,0.1489570140838623,0.774393028422764
80,3,KNeighbors Classifier,1,0.8,0.7690461907618477,0.7689297258457577,14.888548612594604,0.7689297258457577
81,3,SVC Classifier,1,0.8,0.8464307138572286,0.8408746014459464,11.00286602973938,0.8408746014459464
82,3,Decision Tree,1,0.8,0.7096580683863227,0.7094926986169742,0.35747766494750977,0.7094926986169742
83,3,RandomForest,1,0.8,0.7486502699460108,0.7313145532302011,0.8636839389801025,0.7313145532302011
84,3,AdaBoost (Discrete),1,0.8,0.8320335932813437,0.8313077321285285,178.4221270084381,0.8313077321285285
85,3,AdaBoost (Real),1,0.8,0.826634673065387,0.8260747088766001,197.32826209068298,0.8260747088766001
86,3,Logistic Regression (Penalty = L2),1,0.8,0.8590281943611278,0.8589532198356143,0.7579281330108643,0.8589532198356143
87,3,Naive Bayes,1,0.8,0.794241151769646,0.7696303310781517,0.16797423362731934,0.7696303310781517
88,3,KNeighbors Classifier,2,0.8,0.7953181272509003,0.7947134837843819,15.695091485977173,0.7947134837843819
89,3,SVC Classifier,2,0.8,0.8589435774309724,0.8528971550204222,11.366942882537842,0.8528971550204222
90,3,Decision Tree,2,0.8,0.7280912364945978,0.7280903448488152,0.3214123249053955,0.7280903448488152
91,3,RandomForest,2,0.8,0.78031212484994,0.7532340214350222,0.8280289173126221,0.7532340214350222
92,3,AdaBoost (Discrete),2,0.8,0.8493397358943577,0.8481751709576151,166.0981321334839,0.8481751709576151
93,3,AdaBoost (Real),2,0.8,0.8499399759903962,0.8485793822922391,179.83948493003845,0.8485793822922391
94,3,Logistic Regression (Penalty = L2),2,0.8,0.8781512605042017,0.8780157200726443,0.6767206192016602,0.8780157200726443
95,3,Naive Bayes,2,0.8,0.8031212484993998,0.775141914107031,0.11475300788879395,0.775141914107031
96,4,KNeighbors Classifier,0,0.8,0.7840431913617276,0.7839875836229782,10.466439485549927,0.7839875836229782
97,4,SVC Classifier,0,0.8,0.8488302339532093,0.8431104473439348,8.56196117401123,0.8431104473439348
98,4,Decision Tree,0,0.8,0.7294541091781643,0.729295448603843,0.3104262351989746,0.729295448603843
99,4,RandomForest,0,0.8,0.7756448710257948,0.7663594298888519,0.6272199153900146,0.7663594298888519
100,4,AdaBoost (Discrete),0,0.8,0.8326334733053389,0.8325864209264175,137.5880994796753,0.8325864209264175
101,4,AdaBoost (Real),0,0.8,0.8242351529694061,0.8232464760550527,150.3599808216095,0.8232464760550527
102,4,Logistic Regression (Penalty = L2),0,0.8,0.8698260347930414,0.8697234884043396,0.5862874984741211,0.8697234884043396
103,4,Naive Bayes,0,0.8,0.7984403119376124,0.773753343214915,0.16288161277770996,0.773753343214915
104,4,KNeighbors Classifier,1,0.8,0.7846430713857229,0.7843343521913503,10.211665391921997,0.7843343521913503
105,4,SVC Classifier,1,0.8,0.8482303539292142,0.8429817720580088,8.114595890045166,0.8429817720580088
106,4,Decision Tree,1,0.8,0.7498500299940012,0.7496851049580308,0.21882414817810059,0.7496851049580308
107,4,RandomForest,1,0.8,0.743251349730054,0.736202088032769,0.6834702491760254,0.736202088032769
108,4,AdaBoost (Discrete),1,0.8,0.823635272945411,0.8233595864685721,134.5580472946167,0.8233595864685721
109,4,AdaBoost (Real),1,0.8,0.8170365926814637,0.8155991786738153,148.95235061645508,0.8155991786738153
110,4,Logistic Regression (Penalty = L2),1,0.8,0.8650269946010798,0.8650677221954689,0.5018043518066406,0.8650677221954689
111,4,Naive Bayes,1,0.8,0.7960407918416317,0.7718607264120017,0.18318724632263184,0.7718607264120017
112,4,KNeighbors Classifier,2,0.8,0.8073229291716687,0.806988589558491,9.546669483184814,0.806988589558491
113,4,SVC Classifier,2,0.8,0.8625450180072028,0.856524895628028,7.688149452209473,0.856524895628028
114,4,Decision Tree,2,0.8,0.7202881152460985,0.7202910262338537,0.2869429588317871,0.7202910262338537
115,4,RandomForest,2,0.8,0.7791116446578632,0.768529854466384,0.6219608783721924,0.768529854466384
116,4,AdaBoost (Discrete),2,0.8,0.8523409363745498,0.8516676669266686,128.1402313709259,0.8516676669266686
117,4,AdaBoost (Real),2,0.8,0.8433373349339736,0.8415806908314813,136.29151558876038,0.8415806908314813
118,4,Logistic Regression (Penalty = L2),2,0.8,0.8733493397358943,0.8732784607357358,0.5309360027313232,0.8732784607357358
119,4,Naive Bayes,2,0.8,0.8055222088835534,0.779059090964122,0.0931999683380127,0.779059090964122
120,5,KNeighbors Classifier,0,0.8,0.7846430713857229,0.784558232819297,8.56388545036316,0.784558232819297
121,5,SVC Classifier,0,0.8,0.8482303539292142,0.8427345475463255,7.854999542236328,0.8427345475463255
122,5,Decision Tree,0,0.8,0.710257948410318,0.710211617010632,0.24157094955444336,0.710211617010632
123,5,RandomForest,0,0.8,0.770245950809838,0.7600268400156305,0.702547550201416,0.7600268400156305
124,5,AdaBoost (Discrete),0,0.8,0.8278344331133773,0.8276670362532674,124.82973146438599,0.8276670362532674
125,5,AdaBoost (Real),0,0.8,0.823635272945411,0.8230316251774124,127.16102862358093,0.8230316251774124
126,5,Logistic Regression (Penalty = L2),0,0.8,0.8710257948410318,0.8709773768361196,0.4644293785095215,0.8709773768361196
127,5,Naive Bayes,0,0.8,0.7972405518896221,0.7713564924896807,0.09793400764465332,0.7713564924896807
128,5,KNeighbors Classifier,1,0.8,0.8050389922015597,0.8045153721042098,8.24500322341919,0.8045153721042098
129,5,SVC Classifier,1,0.8,0.8518296340731853,0.8469066847982213,7.040473222732544,0.8469066847982213
130,5,Decision Tree,1,0.8,0.7264547090581883,0.7262673585293735,0.2707951068878174,0.7262673585293735
131,5,RandomForest,1,0.8,0.7696460707858428,0.754021834474636,0.6204602718353271,0.754021834474636
132,5,AdaBoost (Discrete),1,0.8,0.8194361127774445,0.8191234861358132,120.73207998275757,0.8191234861358132
133,5,AdaBoost (Real),1,0.8,0.8170365926814637,0.815169962902827,120.97309041023254,0.815169962902827
134,5,Logistic Regression (Penalty = L2),1,0.8,0.8632273545290942,0.8632201513921446,0.4785912036895752,0.8632201513921446
135,5,Naive Bayes,1,0.8,0.7948410317936413,0.7719317054089717,0.1426713466644287,0.7719317054089717
136,5,KNeighbors Classifier,2,0.8,0.8145258103241296,0.814457350370143,8.603529214859009,0.814457350370143
137,5,SVC Classifier,2,0.8,0.8607442977190877,0.8550283363447273,7.518833637237549,0.8550283363447273
138,5,Decision Tree,2,0.8,0.7490996398559424,0.7490930691782399,0.24212408065795898,0.7490930691782399
139,5,RandomForest,2,0.8,0.7947178871548619,0.7811604226124557,0.6792352199554443,0.7811604226124557
140,5,AdaBoost (Discrete),2,0.8,0.8529411764705882,0.8526950585506388,104.91447162628174,0.8526950585506388
141,5,AdaBoost (Real),2,0.8,0.8481392557022809,0.8462532611641632,120.90051221847534,0.8462532611641632
142,5,Logistic Regression (Penalty = L2),2,0.8,0.8733493397358943,0.8733318358975471,0.4396364688873291,0.8733318358975471
143,5,Naive Bayes,2,0.8,0.8007202881152461,0.772765015410917,0.09329056739807129,0.772765015410917
144,6,KNeighbors Classifier,0,0.8,0.7888422315536893,0.7886287022274315,7.544559955596924,0.7886287022274315
145,6,SVC Classifier,0,0.8,0.8458308338332333,0.8402156742654179,6.280145883560181,0.8402156742654179
146,6,Decision Tree,0,0.8,0.743251349730054,0.74285164329665,0.18934369087219238,0.74285164329665
147,6,RandomForest,0,0.8,0.7624475104979004,0.7491076527085647,0.5172538757324219,0.7491076527085647
148,6,AdaBoost (Discrete),0,0.8,0.826634673065387,0.826615592868143,99.71748208999634,0.826615592868143
149,6,AdaBoost (Real),0,0.8,0.8314337132573485,0.8306206648529533,104.84106945991516,0.8306206648529533
150,6,Logistic Regression (Penalty = L2),0,0.8,0.871625674865027,0.8714653313989544,0.4448966979980469,0.8714653313989544
151,6,Naive Bayes,0,0.8,0.8002399520095981,0.7752611827690696,0.1210944652557373,0.7752611827690696
152,6,KNeighbors Classifier,1,0.8,0.7876424715056989,0.7875206626922525,7.030988454818726,0.7875206626922525
153,6,SVC Classifier,1,0.8,0.8470305938812237,0.8415622073682988,5.877639293670654,0.8415622073682988
154,6,Decision Tree,1,0.8,0.737252549490102,0.7370705488316617,0.20319676399230957,0.7370705488316617
155,6,RandomForest,1,0.8,0.7540491901619676,0.7364249347293367,0.5575542449951172,0.7364249347293367
156,6,AdaBoost (Discrete),1,0.8,0.8308338332333534,0.830516270929748,86.19794034957886,0.830516270929748
157,6,AdaBoost (Real),1,0.8,0.8194361127774445,0.8186186783641702,93.51175928115845,0.8186186783641702
158,6,Logistic Regression (Penalty = L2),1,0.8,0.8608278344331134,0.8607954314054448,0.34207892417907715,0.8607954314054448
159,6,Naive Bayes,1,0.8,0.7936412717456509,0.7683916426178248,0.15071582794189453,0.7683916426178248
160,6,KNeighbors Classifier,2,0.8,0.8145258103241296,0.8143295693247393,6.451946258544922,0.8143295693247393
161,6,SVC Classifier,2,0.8,0.8613445378151261,0.8552623041270302,5.310351133346558,0.8552623041270302
162,6,Decision Tree,2,0.8,0.7466986794717887,0.7465469391777492,0.21399998664855957,0.7465469391777492
163,6,RandomForest,2,0.8,0.7713085234093637,0.748748353159918,0.4570176601409912,0.748748353159918
164,6,AdaBoost (Discrete),2,0.8,0.8577430972388955,0.8568702638393126,80.07400465011597,0.8568702638393126
165,6,AdaBoost (Real),2,0.8,0.8403361344537815,0.8378950061066897,93.6719343662262,0.8378950061066897
166,6,Logistic Regression (Penalty = L2),2,0.8,0.8751500600240096,0.8750391075599676,0.38632965087890625,0.8750391075599676
167,6,Naive Bayes,2,0.8,0.8037214885954381,0.7771885174187552,0.1090536117553711,0.7771885174187552
168,7,KNeighbors Classifier,0,0.8,0.7894421115776845,0.7894153671717002,7.131877183914185,0.7894153671717002
169,7,SVC Classifier,0,0.8,0.8494301139772046,0.8438611993525055,5.884883165359497,0.8438611993525055
170,7,Decision Tree,0,0.8,0.7306538692261547,0.730153843815574,0.18004107475280762,0.730153843815574
171,7,RandomForest,0,0.8,0.7654469106178764,0.7618378498274366,0.4631326198577881,0.7618378498274366
172,7,AdaBoost (Discrete),0,0.8,0.8332333533293341,0.8331188323432993,92.58918762207031,0.8331188323432993
173,7,AdaBoost (Real),0,0.8,0.8218356328734253,0.820604836858414,100.96625351905823,0.820604836858414
174,7,Logistic Regression (Penalty = L2),0,0.8,0.8698260347930414,0.8697412904910347,0.4621119499206543,0.8697412904910347
175,7,Naive Bayes,0,0.8,0.7978404319136173,0.7722300566478455,0.11480069160461426,0.7722300566478455
176,7,KNeighbors Classifier,1,0.8,0.7810437912417516,0.7802534800915029,7.541220664978027,0.7802534800915029
177,7,SVC Classifier,1,0.8,0.8512297540491902,0.8457602422862157,6.115877866744995,0.8457602422862157
178,7,Decision Tree,1,0.8,0.7186562687462508,0.7184788549631939,0.2132887840270996,0.7184788549631939
179,7,RandomForest,1,0.8,0.7558488302339532,0.7539602483076133,0.5300858020782471,0.7539602483076133
180,7,AdaBoost (Discrete),1,0.8,0.8212357528494301,0.8207456516936421,95.89983201026917,0.8207456516936421
181,7,AdaBoost (Real),1,0.8,0.8242351529694061,0.8236183140220652,94.14263391494751,0.8236183140220652
182,7,Logistic Regression (Penalty = L2),1,0.8,0.8638272345530894,0.8638142466597852,0.3544888496398926,0.8638142466597852
183,7,Naive Bayes,1,0.8,0.794241151769646,0.7710759045904783,0.0921316146850586,0.7710759045904783
184,7,KNeighbors Classifier,2,0.8,0.8073229291716687,0.806934492536684,6.566285610198975,0.806934492536684
185,7,SVC Classifier,2,0.8,0.8619447779111644,0.8568947562675656,5.486247301101685,0.8568947562675656
186,7,Decision Tree,2,0.8,0.7274909963985594,0.7273705071851511,0.1887805461883545,0.7273705071851511
187,7,RandomForest,2,0.8,0.7947178871548619,0.7869252085596598,0.44628357887268066,0.7869252085596598
188,7,AdaBoost (Discrete),2,0.8,0.8529411764705882,0.8523848442827844,87.3621597290039,0.8523848442827844
189,7,AdaBoost (Real),2,0.8,0.8469387755102041,0.8447589353828198,82.2027759552002,0.8447589353828198
190,7,Logistic Regression (Penalty = L2),2,0.8,0.8703481392557023,0.8703385146702257,0.3049302101135254,0.8703385146702257
191,7,Naive Bayes,2,0.8,0.8013205282112845,0.7732610136314434,0.07522296905517578,0.7732610136314434
192,8,KNeighbors Classifier,0,0.8,0.7972405518896221,0.7970198650780621,5.792378664016724,0.7970198650780621
193,8,SVC Classifier,0,0.8,0.8464307138572286,0.8403920725111442,4.69392204284668,0.8403920725111442
194,8,Decision Tree,0,0.8,0.7366526694661067,0.7366556104213442,0.1897423267364502,0.7366556104213442
195,8,RandomForest,0,0.8,0.7876424715056989,0.7827608821244267,0.3752906322479248,0.7827608821244267
196,8,AdaBoost (Discrete),0,0.8,0.8272345530893821,0.8269417837014972,76.65279483795166,0.8269417837014972
197,8,AdaBoost (Real),0,0.8,0.8230353929214157,0.8224751920616633,76.9213445186615,0.8224751920616633
198,8,Logistic Regression (Penalty = L2),0,0.8,0.8722255548890222,0.8720534721443496,0.3275027275085449,0.8720534721443496
199,8,Naive Bayes,0,0.8,0.7972405518896221,0.7720184644270789,0.05832815170288086,0.7720184644270789
200,8,KNeighbors Classifier,1,0.8,0.7906418716256749,0.7905750821157528,5.673870086669922,0.7905750821157528
201,8,SVC Classifier,1,0.8,0.8446310737852429,0.8388901765561256,4.821913480758667,0.8388901765561256
202,8,Decision Tree,1,0.8,0.7150569886022795,0.7147287335135819,0.16712617874145508,0.7147287335135819
203,8,RandomForest,1,0.8,0.7648470305938813,0.7574892424265629,0.37997007369995117,0.7574892424265629
204,8,AdaBoost (Discrete),1,0.8,0.8302339532093581,0.8298955485292732,76.46897053718567,0.8298955485292732
205,8,AdaBoost (Real),1,0.8,0.8260347930413917,0.8252922433232694,81.63064575195312,0.8252922433232694
206,8,Logistic Regression (Penalty = L2),1,0.8,0.865626874625075,0.8655587399193422,0.254014253616333,0.8655587399193422
207,8,Naive Bayes,1,0.8,0.7960407918416317,0.7714950841071875,0.09072089195251465,0.7714950841071875
208,8,KNeighbors Classifier,2,0.8,0.8073229291716687,0.8060633858942263,4.894743919372559,0.8060633858942263
209,8,SVC Classifier,2,0.8,0.8607442977190877,0.8550294067812961,4.11412787437439,0.8550294067812961
210,8,Decision Tree,2,0.8,0.734093637454982,0.7334650054840006,0.11826014518737793,0.7334650054840006
211,8,RandomForest,2,0.8,0.7923169267707083,0.7837178941626575,0.3339264392852783,0.7837178941626575
212,8,AdaBoost (Discrete),2,0.8,0.8493397358943577,0.8485314670980498,68.13197183609009,0.8485314670980498
213,8,AdaBoost (Real),2,0.8,0.8529411764705882,0.8516506752160871,74.66096925735474,0.8516506752160871
214,8,Logistic Regression (Penalty = L2),2,0.8,0.8775510204081632,0.8774276316716002,0.3231964111328125,0.8774276316716002
215,8,Naive Bayes,2,0.8,0.804921968787515,0.7777965304240031,0.07812356948852539,0.7777965304240031
216,9,KNeighbors Classifier,0,0.8,0.7972405518896221,0.7969951511517439,5.125519752502441,0.7969951511517439
217,9,SVC Classifier,0,0.8,0.8500299940011997,0.844546706950165,4.1946399211883545,0.844546706950165
218,9,Decision Tree,0,0.8,0.7414517096580684,0.7414220431991749,0.14193177223205566,0.7414220431991749
219,9,RandomForest,0,0.8,0.7420515896820636,0.7180356397379355,0.3655974864959717,0.7180356397379355
220,9,AdaBoost (Discrete),0,0.8,0.8308338332333534,0.8300854857225303,60.018166065216064,0.8300854857225303
221,9,AdaBoost (Real),0,0.8,0.8290341931613677,0.8287043895969011,63.941591024398804,0.8287043895969011
222,9,Logistic Regression (Penalty = L2),0,0.8,0.8698260347930414,0.8697856769359753,0.2483837604522705,0.8697856769359753
223,9,Naive Bayes,0,0.8,0.7966406718656269,0.7708549601685127,0.0720529556274414,0.7708549601685127
224,9,KNeighbors Classifier,1,0.8,0.7828434313137372,0.7827346855009136,4.247776508331299,0.7827346855009136
225,9,SVC Classifier,1,0.8,0.8500299940011997,0.8441873250370796,3.72176456451416,0.8441873250370796
226,9,Decision Tree,1,0.8,0.7066586682663467,0.7065315900479965,0.11994743347167969,0.7065315900479965
227,9,RandomForest,1,0.8,0.7504499100179964,0.7301316824267311,0.3078277111053467,0.7301316824267311
228,9,AdaBoost (Discrete),1,0.8,0.8206358728254349,0.8204814922147485,59.70811462402344,0.8204814922147485
229,9,AdaBoost (Real),1,0.8,0.829634073185363,0.8293420981047599,64.77637934684753,0.8293420981047599
230,9,Logistic Regression (Penalty = L2),1,0.8,0.8668266346730654,0.866768293386482,0.25838422775268555,0.866768293386482
231,9,Naive Bayes,1,0.8,0.7954409118176364,0.772785612858957,0.07353830337524414,0.772785612858957
232,9,KNeighbors Classifier,2,0.8,0.8097238895558223,0.8091842347658013,4.3299338817596436,0.8091842347658013
233,9,SVC Classifier,2,0.8,0.8637454981992797,0.8588512306965593,3.6915385723114014,0.8588512306965593
234,9,Decision Tree,2,0.8,0.7460984393757503,0.7459469411825855,0.1206672191619873,0.7459469411825855
235,9,RandomForest,2,0.8,0.7701080432172869,0.7504716915128528,0.3372623920440674,0.7504716915128528
236,9,AdaBoost (Discrete),2,0.8,0.8523409363745498,0.8518646847568122,54.96706771850586,0.8518646847568122
237,9,AdaBoost (Real),2,0.8,0.84093637454982,0.8393707691423975,57.703723669052124,0.8393707691423975
238,9,Logistic Regression (Penalty = L2),2,0.8,0.8733493397358943,0.8733376373189183,0.23176360130310059,0.8733376373189183
239,9,Naive Bayes,2,0.8,0.8013205282112845,0.7740453360888677,0.07164907455444336,0.7740453360888677
240,10,KNeighbors Classifier,0,0.8,0.7744451109778044,0.7742301752551053,6.032085657119751,0.7742301752551053
241,10,SVC Classifier,0,0.8,0.8482303539292142,0.8420311789253286,4.392091751098633,0.8420311789253286
242,10,Decision Tree,0,0.8,0.710257948410318,0.7100581266159365,0.12110328674316406,0.7100581266159365
243,10,RandomForest,0,0.8,0.764247150569886,0.7471940203129498,0.3207435607910156,0.7471940203129498
244,10,AdaBoost (Discrete),0,0.8,0.8338332333533294,0.8337156225418964,70.0900628566742,0.8337156225418964
245,10,AdaBoost (Real),0,0.8,0.8332333533293341,0.832841302932181,73.61205530166626,0.832841302932181
246,10,Logistic Regression (Penalty = L2),0,0.8,0.8674265146970606,0.8672183103068305,0.2611265182495117,0.8672183103068305
247,10,Naive Bayes,0,0.8,0.7990401919616077,0.7731383330047056,0.06203317642211914,0.7731383330047056
248,10,KNeighbors Classifier,1,0.8,0.7822435512897421,0.7820033712860495,6.9726855754852295,0.7820033712860495
249,10,SVC Classifier,1,0.8,0.8464307138572286,0.8413157180560171,5.346868991851807,0.8413157180560171
250,10,Decision Tree,1,0.8,0.7198560287942412,0.7197587598590198,0.17826056480407715,0.7197587598590198
251,10,RandomForest,1,0.8,0.7540491901619676,0.7448570920371569,0.37162137031555176,0.7448570920371569
252,10,AdaBoost (Discrete),1,0.8,0.8272345530893821,0.8272702160110973,69.26618313789368,0.8272702160110973
253,10,AdaBoost (Real),1,0.8,0.8194361127774445,0.8185501944872421,66.67723822593689,0.8185501944872421
254,10,Logistic Regression (Penalty = L2),1,0.8,0.8620275944811038,0.8620143762142157,0.33184123039245605,0.8620143762142157
255,10,Naive Bayes,1,0.8,0.7960407918416317,0.7718607264120017,0.043013572692871094,0.7718607264120017
256,10,KNeighbors Classifier,2,0.8,0.7827130852340937,0.7818919233283866,5.2936999797821045,0.7818919233283866
257,10,SVC Classifier,2,0.8,0.8601440576230492,0.8541601607615702,4.008145093917847,0.8541601607615702
258,10,Decision Tree,2,0.8,0.7274909963985594,0.7269964735394204,0.1220550537109375,0.7269964735394204
259,10,RandomForest,2,0.8,0.7779111644657863,0.7590254617853458,0.22603344917297363,0.7590254617853458
260,10,AdaBoost (Discrete),2,0.8,0.8559423769507803,0.8552177778552189,63.37740397453308,0.8552177778552189
261,10,AdaBoost (Real),2,0.8,0.8475390156062425,0.8451336937610954,63.1728515625,0.8451336937610954
262,10,Logistic Regression (Penalty = L2),2,0.8,0.8745498199279712,0.8744771972586942,0.22898054122924805,0.8744771972586942
263,10,Naive Bayes,2,0.8,0.8037214885954381,0.776418192424226,0.08404707908630371,0.776418192424226
264,11,KNeighbors Classifier,0,0.8,0.7840431913617276,0.7837489203171676,5.620697259902954,0.7837489203171676
265,11,SVC Classifier,0,0.8,0.8458308338332333,0.8395894872696271,4.0130627155303955,0.8395894872696271
266,11,Decision Tree,0,0.8,0.7024595080983803,0.7024089748890145,0.09471869468688965,0.7024089748890145
267,11,RandomForest,0,0.8,0.7828434313137372,0.7794595578970417,0.27188992500305176,0.7794595578970417
268,11,AdaBoost (Discrete),0,0.8,0.8392321535692862,0.8392505192319132,58.95030355453491,0.8392505192319132
269,11,AdaBoost (Real),0,0.8,0.8302339532093581,0.8299452470415793,59.97713255882263,0.8299452470415793
270,11,Logistic Regression (Penalty = L2),0,0.8,0.8674265146970606,0.8672644951320224,0.16225409507751465,0.8672644951320224
271,11,Naive Bayes,0,0.8,0.8002399520095981,0.7748816045955451,0.05196714401245117,0.7748816045955451
272,11,KNeighbors Classifier,1,0.8,0.7756448710257948,0.7753556022946306,4.563083171844482,0.7753556022946306
273,11,SVC Classifier,1,0.8,0.847630473905219,0.8428739984266588,3.674452781677246,0.8428739984266588
274,11,Decision Tree,1,0.8,0.6970605878824235,0.697085301540276,0.08919501304626465,0.697085301540276
275,11,RandomForest,1,0.8,0.7558488302339532,0.7508261666234098,0.22928810119628906,0.7508261666234098
276,11,AdaBoost (Discrete),1,0.8,0.829634073185363,0.8293449797479536,55.009342193603516,0.8293449797479536
277,11,AdaBoost (Real),1,0.8,0.8272345530893821,0.8269239581185698,55.23780608177185,0.8269239581185698
278,11,Logistic Regression (Penalty = L2),1,0.8,0.8554289142171566,0.8553940078212201,0.18407773971557617,0.8553940078212201
279,11,Naive Bayes,1,0.8,0.7960407918416317,0.7722216985465098,0.03615117073059082,0.7722216985465098
280,11,KNeighbors Classifier,2,0.8,0.7881152460984394,0.7878673849869081,4.034205675125122,0.7878673849869081
281,11,SVC Classifier,2,0.8,0.8601440576230492,0.8543187689347056,2.896711587905884,0.8543187689347056
282,11,Decision Tree,2,0.8,0.751500600240096,0.7514500335985913,0.07211685180664062,0.7514500335985913
283,11,RandomForest,2,0.8,0.7971188475390156,0.7907648114446229,0.17140865325927734,0.7907648114446229
284,11,AdaBoost (Discrete),2,0.8,0.858343337334934,0.8579666129066809,48.019675493240356,0.8579666129066809
285,11,AdaBoost (Real),2,0.8,0.84093637454982,0.8393598273213165,77.14550518989563,0.8393598273213165
286,11,Logistic Regression (Penalty = L2),2,0.8,0.8739495798319328,0.873930132505624,0.41310763359069824,0.873930132505624
287,11,Naive Bayes,2,0.8,0.8055222088835534,0.7779008581081963,0.0746762752532959,0.7779008581081963
288,12,KNeighbors Classifier,0,0.8,0.794241151769646,0.7942363438754094,3.535841941833496,0.7942363438754094
289,12,SVC Classifier,0,0.8,0.8512297540491902,0.8458354807447388,3.4916436672210693,0.8458354807447388
290,12,Decision Tree,0,0.8,0.7192561487702459,0.7192900953531645,0.1121358871459961,0.7192900953531645
291,12,RandomForest,0,0.8,0.7576484703059388,0.755944215764832,0.3703775405883789,0.755944215764832
292,12,AdaBoost (Discrete),0,0.8,0.8218356328734253,0.8212551927172709,56.584468364715576,0.8212551927172709
293,12,AdaBoost (Real),0,0.8,0.8182363527294542,0.8149364307405674,62.158323526382446,0.8149364307405674
294,12,Logistic Regression (Penalty = L2),0,0.8,0.8710257948410318,0.8709773768361196,0.29889678955078125,0.8709773768361196
295,12,Naive Bayes,0,0.8,0.7972405518896221,0.7717279563394185,0.07545685768127441,0.7717279563394185
296,12,KNeighbors Classifier,1,0.8,0.7924415116976604,0.7922378153061929,3.4313368797302246,0.7922378153061929
297,12,SVC Classifier,1,0.8,0.8524295140971806,0.8473190324940801,3.586925506591797,0.8473190324940801
298,12,Decision Tree,1,0.8,0.7348530293941212,0.7347057036986735,0.14657068252563477,0.7347057036986735
299,12,RandomForest,1,0.8,0.7708458308338332,0.7666403724009929,0.301738977432251,0.7666403724009929
300,12,AdaBoost (Discrete),1,0.8,0.8206358728254349,0.8204037225649191,56.64320230484009,0.8204037225649191
301,12,AdaBoost (Real),1,0.8,0.8290341931613677,0.8283975865297967,62.36879754066467,0.8283975865297967
302,12,Logistic Regression (Penalty = L2),1,0.8,0.8650269946010798,0.8650048949575135,0.26137328147888184,0.8650048949575135
303,12,Naive Bayes,1,0.8,0.7960407918416317,0.7732884012980397,0.04917407035827637,0.7732884012980397
304,12,KNeighbors Classifier,2,0.8,0.8169267707082833,0.8168138911215407,3.723010778427124,0.8168138911215407
305,12,SVC Classifier,2,0.8,0.8625450180072028,0.8566853721492818,3.514848232269287,0.8566853721492818
306,12,Decision Tree,2,0.8,0.7346938775510204,0.7347280641440966,0.11352872848510742,0.7347280641440966
307,12,RandomForest,2,0.8,0.7917166866746699,0.7765718496710591,0.3334016799926758,0.7765718496710591
308,12,AdaBoost (Discrete),2,0.8,0.851140456182473,0.8503647222249205,56.64141249656677,0.8503647222249205
309,12,AdaBoost (Real),2,0.8,0.8445378151260504,0.8420841370816149,58.46571469306946,0.8420841370816149
310,12,Logistic Regression (Penalty = L2),2,0.8,0.8733493397358943,0.8733576877444407,0.27884697914123535,0.8733576877444407
311,12,Naive Bayes,2,0.8,0.8013205282112845,0.7740453360888677,0.02635645866394043,0.7740453360888677
