,feat_set_id,classifier,fold_id,feat_th,score,geo_score,exec_t,geo_score_woz
0,0,KNeighbors Classifier,0,1.0,0.6794258373205742,0.3834327676123552,0.01923203468322754,0.3834327676123552
1,0,SVC Classifier,0,1.0,0.7942583732057417,0.8569568250501305,0.00841379165649414,0.0
2,0,Decision Tree,0,1.0,0.6411483253588517,0.45885264962949823,0.0018908977508544922,0.45885264962949823
3,0,RandomForest,0,1.0,0.5023923444976076,0.30618621784789724,0.028273582458496094,0.0
4,0,AdaBoost (Discrete),0,1.0,0.6842105263157895,0.7138007815729402,1.269972801208496,0.7138007815729402
5,0,AdaBoost (Real),0,1.0,0.6698564593301436,0.6942099426082057,1.4052815437316895,0.6942099426082057
6,0,Logistic Regression (Penalty = L2),0,1.0,0.8229665071770335,0.8936504412303007,0.014909029006958008,0.0
7,0,Naive Bayes,0,1.0,0.5741626794258373,0.5,0.002095937728881836,0.0
8,0,KNeighbors Classifier,1,1.0,0.75,0.8092214837250814,0.005396604537963867,0.0
9,0,SVC Classifier,1,1.0,0.8798076923076923,0.9527691731065936,0.006041049957275391,0.0
10,0,Decision Tree,1,1.0,0.6394230769230769,0.6840189649742502,0.0012021064758300781,0.0
11,0,RandomForest,1,1.0,0.7259615384615384,0.7802076379614168,0.02822089195251465,0.0
12,0,AdaBoost (Discrete),1,1.0,0.6923076923076923,0.3248739375210822,1.2265655994415283,0.3248739375210822
13,0,AdaBoost (Real),1,1.0,0.5769230769230769,0.449810948823153,1.4771466255187988,0.449810948823153
14,0,Logistic Regression (Penalty = L2),1,1.0,0.8798076923076923,0.9524274542218717,0.0021741390228271484,0.0
15,0,Naive Bayes,1,1.0,0.8942307692307693,0.9686939947968892,0.0019271373748779297,0.0
16,0,KNeighbors Classifier,2,1.0,0.6153846153846154,0.5773502691896257,0.002882719039916992,0.0
17,0,SVC Classifier,2,1.0,0.6057692307692307,0.5590169943749475,0.006798505783081055,0.0
18,0,Decision Tree,2,1.0,0.49038461538461536,0.27904656847403364,0.002099752426147461,0.27904656847403364
19,0,RandomForest,2,1.0,0.46153846153846156,1.0,0.0310213565826416,0.0
20,0,AdaBoost (Discrete),2,1.0,0.7980769230769231,0.7201845953194296,1.3607003688812256,0.7201845953194296
21,0,AdaBoost (Real),2,1.0,0.7644230769230769,0.346228641047154,1.6301100254058838,0.346228641047154
22,0,Logistic Regression (Penalty = L2),2,1.0,0.8173076923076923,0.8779711460710616,0.0024042129516601562,0.0
23,0,Naive Bayes,2,1.0,0.5240384615384616,0.3679900360969936,0.0030770301818847656,0.0
24,1,KNeighbors Classifier,0,1.0,0.6794258373205742,0.3834327676123552,0.004814863204956055,0.3834327676123552
25,1,SVC Classifier,0,1.0,0.7942583732057417,0.8569568250501305,0.006451845169067383,0.0
26,1,Decision Tree,0,1.0,0.48325358851674644,0.2724360627046374,0.0011632442474365234,0.2724360627046374
27,1,RandomForest,0,1.0,0.5023923444976076,0.30618621784789724,0.029288053512573242,0.0
28,1,AdaBoost (Discrete),0,1.0,0.6842105263157895,0.7138007815729402,1.2632300853729248,0.7138007815729402
29,1,AdaBoost (Real),0,1.0,0.6698564593301436,0.6942099426082057,1.5147747993469238,0.6942099426082057
30,1,Logistic Regression (Penalty = L2),0,1.0,0.8229665071770335,0.8936504412303007,0.004233360290527344,0.0
31,1,Naive Bayes,0,1.0,0.5741626794258373,0.5,0.0034852027893066406,0.0
32,1,KNeighbors Classifier,1,1.0,0.75,0.8092214837250814,0.005932807922363281,0.0
33,1,SVC Classifier,1,1.0,0.8798076923076923,0.9527691731065936,0.007932901382446289,0.0
34,1,Decision Tree,1,1.0,0.7596153846153846,0.34701886240170965,0.0017404556274414062,0.34701886240170965
35,1,RandomForest,1,1.0,0.7259615384615384,0.7802076379614168,0.028287410736083984,0.0
36,1,AdaBoost (Discrete),1,1.0,0.7211538461538461,0.5242991087967237,1.5386295318603516,0.5242991087967237
37,1,AdaBoost (Real),1,1.0,0.5817307692307693,0.45225562155402443,1.9941980838775635,0.45225562155402443
38,1,Logistic Regression (Penalty = L2),1,1.0,0.8798076923076923,0.9524274542218717,0.003980398178100586,0.0
39,1,Naive Bayes,1,1.0,0.8942307692307693,0.9686939947968892,0.0035614967346191406,0.0
40,1,KNeighbors Classifier,2,1.0,0.6153846153846154,0.5773502691896257,0.019744157791137695,0.0
41,1,SVC Classifier,2,1.0,0.6057692307692307,0.5590169943749475,0.023493051528930664,0.0
42,1,Decision Tree,2,1.0,0.49038461538461536,0.2693043362539855,0.018254995346069336,0.2693043362539855
43,1,RandomForest,2,1.0,0.46153846153846156,1.0,0.034674644470214844,0.0
44,1,AdaBoost (Discrete),2,1.0,0.7692307692307693,0.5455020359417712,3.4326796531677246,0.5455020359417712
45,1,AdaBoost (Real),2,1.0,0.7740384615384616,0.652981989220792,4.521604537963867,0.652981989220792
46,1,Logistic Regression (Penalty = L2),2,1.0,0.8173076923076923,0.8779711460710616,0.0037877559661865234,0.0
47,1,Naive Bayes,2,1.0,0.5240384615384616,0.3679900360969936,0.003459453582763672,0.0
48,2,KNeighbors Classifier,0,1.0,0.6794258373205742,0.3834327676123552,0.021204471588134766,0.3834327676123552
49,2,SVC Classifier,0,1.0,0.7942583732057417,0.8569568250501305,0.023532629013061523,0.0
50,2,Decision Tree,0,1.0,0.45933014354066987,0.18889661561595683,0.017353296279907227,0.18889661561595683
51,2,RandomForest,0,1.0,0.5023923444976076,0.30618621784789724,0.09144997596740723,0.0
52,2,AdaBoost (Discrete),0,1.0,0.6842105263157895,0.7138007815729402,3.914180040359497,0.7138007815729402
53,2,AdaBoost (Real),0,1.0,0.6698564593301436,0.6942099426082057,4.304315090179443,0.6942099426082057
54,2,Logistic Regression (Penalty = L2),0,1.0,0.8229665071770335,0.8936504412303007,0.0032339096069335938,0.0
55,2,Naive Bayes,0,1.0,0.5741626794258373,0.5,0.019233226776123047,0.0
56,2,KNeighbors Classifier,1,1.0,0.75,0.8092214837250814,0.02156209945678711,0.0
57,2,SVC Classifier,1,1.0,0.8798076923076923,0.9527691731065936,0.023046016693115234,0.0
58,2,Decision Tree,1,1.0,0.6682692307692307,0.7032600179007604,0.0012669563293457031,0.0
59,2,RandomForest,1,1.0,0.7259615384615384,0.7802076379614168,0.07333803176879883,0.0
60,2,AdaBoost (Discrete),1,1.0,0.6923076923076923,0.3248739375210822,3.6114377975463867,0.3248739375210822
61,2,AdaBoost (Real),1,1.0,0.5769230769230769,0.449810948823153,3.475198268890381,0.449810948823153
62,2,Logistic Regression (Penalty = L2),1,1.0,0.8798076923076923,0.9524274542218717,0.0022041797637939453,0.0
63,2,Naive Bayes,1,1.0,0.8942307692307693,0.9686939947968892,0.0034105777740478516,0.0
64,2,KNeighbors Classifier,2,1.0,0.6153846153846154,0.5773502691896257,0.0029230117797851562,0.0
65,2,SVC Classifier,2,1.0,0.6057692307692307,0.5590169943749475,0.004456758499145508,0.0
66,2,Decision Tree,2,1.0,0.5384615384615384,0.30660236025434046,0.018012285232543945,0.30660236025434046
67,2,RandomForest,2,1.0,0.46153846153846156,1.0,0.04693341255187988,0.0
68,2,AdaBoost (Discrete),2,1.0,0.7692307692307693,0.5455020359417712,3.2414159774780273,0.5455020359417712
69,2,AdaBoost (Real),2,1.0,0.7740384615384616,0.652981989220792,3.9422659873962402,0.652981989220792
70,2,Logistic Regression (Penalty = L2),2,1.0,0.8173076923076923,0.8779711460710616,0.003878355026245117,0.0
71,2,Naive Bayes,2,1.0,0.5240384615384616,0.3679900360969936,0.0027055740356445312,0.0
72,3,KNeighbors Classifier,0,1.0,0.6794258373205742,0.3834327676123552,0.024888038635253906,0.3834327676123552
73,3,SVC Classifier,0,1.0,0.7942583732057417,0.8569568250501305,0.01959705352783203,0.0
74,3,Decision Tree,0,1.0,0.5502392344497608,0.3432479301520523,0.013984918594360352,0.3432479301520523
75,3,RandomForest,0,1.0,0.5023923444976076,0.30618621784789724,0.06381440162658691,0.0
76,3,AdaBoost (Discrete),0,1.0,0.6842105263157895,0.7138007815729402,3.2820847034454346,0.7138007815729402
77,3,AdaBoost (Real),0,1.0,0.6698564593301436,0.6942099426082057,3.965043067932129,0.6942099426082057
78,3,Logistic Regression (Penalty = L2),0,1.0,0.8229665071770335,0.8936504412303007,0.00409388542175293,0.0
79,3,Naive Bayes,0,1.0,0.5741626794258373,0.5,0.0027582645416259766,0.0
80,3,KNeighbors Classifier,1,1.0,0.75,0.8092214837250814,0.003231048583984375,0.0
81,3,SVC Classifier,1,1.0,0.8798076923076923,0.9527691731065936,0.004736423492431641,0.0
82,3,Decision Tree,1,1.0,0.7644230769230769,0.3480296026604276,0.0014760494232177734,0.3480296026604276
83,3,RandomForest,1,1.0,0.7259615384615384,0.7802076379614168,0.08830571174621582,0.0
84,3,AdaBoost (Discrete),1,1.0,0.7211538461538461,0.5242991087967237,2.9833617210388184,0.5242991087967237
85,3,AdaBoost (Real),1,1.0,0.5817307692307693,0.45225562155402443,3.8926665782928467,0.45225562155402443
86,3,Logistic Regression (Penalty = L2),1,1.0,0.8798076923076923,0.9524274542218717,0.0026693344116210938,0.0
87,3,Naive Bayes,1,1.0,0.8942307692307693,0.9686939947968892,0.0026369094848632812,0.0
88,3,KNeighbors Classifier,2,1.0,0.6153846153846154,0.5773502691896257,0.002935171127319336,0.0
89,3,SVC Classifier,2,1.0,0.6057692307692307,0.5590169943749475,0.017064809799194336,0.0
90,3,Decision Tree,2,1.0,0.6586538461538461,0.3771735909893672,0.0013375282287597656,0.3771735909893672
91,3,RandomForest,2,1.0,0.46153846153846156,1.0,0.033426523208618164,0.0
92,3,AdaBoost (Discrete),2,1.0,0.7692307692307693,0.5455020359417712,3.5594468116760254,0.5455020359417712
93,3,AdaBoost (Real),2,1.0,0.7740384615384616,0.652981989220792,4.126691579818726,0.652981989220792
94,3,Logistic Regression (Penalty = L2),2,1.0,0.8173076923076923,0.8779711460710616,0.0036957263946533203,0.0
95,3,Naive Bayes,2,1.0,0.5240384615384616,0.3679900360969936,0.0032808780670166016,0.0
96,4,KNeighbors Classifier,0,1.0,0.6794258373205742,0.3834327676123552,0.0169219970703125,0.3834327676123552
97,4,SVC Classifier,0,1.0,0.7942583732057417,0.8569568250501305,0.023694753646850586,0.0
98,4,Decision Tree,0,1.0,0.4784688995215311,0.29123251400488853,0.0012123584747314453,0.29123251400488853
99,4,RandomForest,0,1.0,0.5023923444976076,0.30618621784789724,0.06923294067382812,0.0
100,4,AdaBoost (Discrete),0,1.0,0.6842105263157895,0.7138007815729402,3.5072927474975586,0.7138007815729402
101,4,AdaBoost (Real),0,1.0,0.6698564593301436,0.6942099426082057,3.637158155441284,0.6942099426082057
102,4,Logistic Regression (Penalty = L2),0,1.0,0.8229665071770335,0.8936504412303007,0.0034117698669433594,0.0
103,4,Naive Bayes,0,1.0,0.5741626794258373,0.5,0.010975122451782227,0.0
104,4,KNeighbors Classifier,1,1.0,0.75,0.8092214837250814,0.018250703811645508,0.0
105,4,SVC Classifier,1,1.0,0.8798076923076923,0.9527691731065936,0.01983046531677246,0.0
106,4,Decision Tree,1,1.0,0.5480769230769231,0.5477423677139545,0.0012967586517333984,0.0
107,4,RandomForest,1,1.0,0.7259615384615384,0.7802076379614168,0.04649686813354492,0.0
108,4,AdaBoost (Discrete),1,1.0,0.6923076923076923,0.3248739375210822,4.057102680206299,0.3248739375210822
109,4,AdaBoost (Real),1,1.0,0.5769230769230769,0.449810948823153,4.864426136016846,0.449810948823153
110,4,Logistic Regression (Penalty = L2),1,1.0,0.8798076923076923,0.9524274542218717,0.01920318603515625,0.0
111,4,Naive Bayes,1,1.0,0.8942307692307693,0.9686939947968892,0.0034575462341308594,0.0
112,4,KNeighbors Classifier,2,1.0,0.6153846153846154,0.5773502691896257,0.021132946014404297,0.0
113,4,SVC Classifier,2,1.0,0.6057692307692307,0.5590169943749475,0.016036033630371094,0.0
114,4,Decision Tree,2,1.0,0.5240384615384616,0.211496857878344,0.010830163955688477,0.211496857878344
115,4,RandomForest,2,1.0,0.46153846153846156,1.0,0.0783989429473877,0.0
116,4,AdaBoost (Discrete),2,1.0,0.7980769230769231,0.7201845953194296,4.205157518386841,0.7201845953194296
117,4,AdaBoost (Real),2,1.0,0.7644230769230769,0.346228641047154,4.411473751068115,0.346228641047154
118,4,Logistic Regression (Penalty = L2),2,1.0,0.8173076923076923,0.8779711460710616,0.01592111587524414,0.0
119,4,Naive Bayes,2,1.0,0.5240384615384616,0.3679900360969936,0.002075672149658203,0.0
120,5,KNeighbors Classifier,0,1.0,0.6794258373205742,0.3834327676123552,0.014859914779663086,0.3834327676123552
121,5,SVC Classifier,0,1.0,0.7942583732057417,0.8569568250501305,0.02566695213317871,0.0
122,5,Decision Tree,0,1.0,0.583732057416268,0.4069654215126358,0.020058631896972656,0.4069654215126358
123,5,RandomForest,0,1.0,0.5023923444976076,0.30618621784789724,0.11662173271179199,0.0
124,5,AdaBoost (Discrete),0,1.0,0.6842105263157895,0.7138007815729402,3.433746576309204,0.7138007815729402
125,5,AdaBoost (Real),0,1.0,0.6698564593301436,0.6942099426082057,4.009679317474365,0.6942099426082057
126,5,Logistic Regression (Penalty = L2),0,1.0,0.8229665071770335,0.8936504412303007,0.016286134719848633,0.0
127,5,Naive Bayes,0,1.0,0.5741626794258373,0.5,0.01550602912902832,0.0
128,5,KNeighbors Classifier,1,1.0,0.75,0.8092214837250814,0.016522645950317383,0.0
129,5,SVC Classifier,1,1.0,0.8798076923076923,0.9527691731065936,0.005681037902832031,0.0
130,5,Decision Tree,1,1.0,0.7163461538461539,0.33312296839618,0.002054452896118164,0.33312296839618
131,5,RandomForest,1,1.0,0.7259615384615384,0.7802076379614168,0.05080270767211914,0.0
132,5,AdaBoost (Discrete),1,1.0,0.7211538461538461,0.5242991087967237,3.515730619430542,0.5242991087967237
133,5,AdaBoost (Real),1,1.0,0.5769230769230769,0.449810948823153,4.302872657775879,0.449810948823153
134,5,Logistic Regression (Penalty = L2),1,1.0,0.8798076923076923,0.9524274542218717,0.003941535949707031,0.0
135,5,Naive Bayes,1,1.0,0.8942307692307693,0.9686939947968892,0.0019788742065429688,0.0
136,5,KNeighbors Classifier,2,1.0,0.6153846153846154,0.5773502691896257,0.0048580169677734375,0.0
137,5,SVC Classifier,2,1.0,0.6057692307692307,0.5590169943749475,0.02375936508178711,0.0
138,5,Decision Tree,2,1.0,0.7307692307692307,0.47876594306401976,0.0012998580932617188,0.47876594306401976
139,5,RandomForest,2,1.0,0.46153846153846156,1.0,0.06177663803100586,0.0
140,5,AdaBoost (Discrete),2,1.0,0.7692307692307693,0.5455020359417712,3.6099143028259277,0.5455020359417712
141,5,AdaBoost (Real),2,1.0,0.7740384615384616,0.652981989220792,4.106825113296509,0.652981989220792
142,5,Logistic Regression (Penalty = L2),2,1.0,0.8173076923076923,0.8779711460710616,0.0037186145782470703,0.0
143,5,Naive Bayes,2,1.0,0.5240384615384616,0.3679900360969936,0.0032804012298583984,0.0
144,6,KNeighbors Classifier,0,1.0,0.6794258373205742,0.3834327676123552,0.0046956539154052734,0.3834327676123552
145,6,SVC Classifier,0,1.0,0.7942583732057417,0.8569568250501305,0.007254123687744141,0.0
146,6,Decision Tree,0,1.0,0.507177033492823,0.27420184855172475,0.0012383460998535156,0.27420184855172475
147,6,RandomForest,0,1.0,0.5023923444976076,0.30618621784789724,0.0583949089050293,0.0
148,6,AdaBoost (Discrete),0,1.0,0.6842105263157895,0.7138007815729402,3.650888442993164,0.7138007815729402
149,6,AdaBoost (Real),0,1.0,0.6698564593301436,0.6942099426082057,4.3542799949646,0.6942099426082057
150,6,Logistic Regression (Penalty = L2),0,1.0,0.8229665071770335,0.8936504412303007,0.014840364456176758,0.0
151,6,Naive Bayes,0,1.0,0.5741626794258373,0.5,0.001962900161743164,0.0
152,6,KNeighbors Classifier,1,1.0,0.75,0.8092214837250814,0.005548000335693359,0.0
153,6,SVC Classifier,1,1.0,0.8798076923076923,0.9527691731065936,0.007721662521362305,0.0
154,6,Decision Tree,1,1.0,0.6490384615384616,0.6843361544023684,0.0015108585357666016,0.0
155,6,RandomForest,1,1.0,0.7259615384615384,0.7802076379614168,0.05069923400878906,0.0
156,6,AdaBoost (Discrete),1,1.0,0.6923076923076923,0.3248739375210822,3.6688523292541504,0.3248739375210822
157,6,AdaBoost (Real),1,1.0,0.5769230769230769,0.449810948823153,3.775536298751831,0.449810948823153
158,6,Logistic Regression (Penalty = L2),1,1.0,0.8798076923076923,0.9524274542218717,0.024356603622436523,0.0
159,6,Naive Bayes,1,1.0,0.8942307692307693,0.9686939947968892,0.0033059120178222656,0.0
160,6,KNeighbors Classifier,2,1.0,0.6153846153846154,0.5773502691896257,0.004563570022583008,0.0
161,6,SVC Classifier,2,1.0,0.6057692307692307,0.5590169943749475,0.0072231292724609375,0.0
162,6,Decision Tree,2,1.0,0.6442307692307693,0.2971776691580672,0.0020177364349365234,0.2971776691580672
163,6,RandomForest,2,1.0,0.46153846153846156,1.0,0.05740046501159668,0.0
164,6,AdaBoost (Discrete),2,1.0,0.7980769230769231,0.7201845953194296,3.6071908473968506,0.7201845953194296
165,6,AdaBoost (Real),2,1.0,0.7740384615384616,0.652981989220792,4.112675428390503,0.652981989220792
166,6,Logistic Regression (Penalty = L2),2,1.0,0.8173076923076923,0.8779711460710616,0.015004396438598633,0.0
167,6,Naive Bayes,2,1.0,0.5240384615384616,0.3679900360969936,0.0019183158874511719,0.0
168,7,KNeighbors Classifier,0,1.0,0.6794258373205742,0.3834327676123552,0.004798412322998047,0.3834327676123552
169,7,SVC Classifier,0,1.0,0.7942583732057417,0.8569568250501305,0.007596731185913086,0.0
170,7,Decision Tree,0,1.0,0.48325358851674644,0.2301917563273768,0.002095460891723633,0.2301917563273768
171,7,RandomForest,0,1.0,0.5023923444976076,0.30618621784789724,0.0774381160736084,0.0
172,7,AdaBoost (Discrete),0,1.0,0.6842105263157895,0.7138007815729402,4.075731039047241,0.7138007815729402
173,7,AdaBoost (Real),0,1.0,0.6698564593301436,0.6942099426082057,4.099755764007568,0.6942099426082057
174,7,Logistic Regression (Penalty = L2),0,1.0,0.8229665071770335,0.8936504412303007,0.0040302276611328125,0.0
175,7,Naive Bayes,0,1.0,0.5741626794258373,0.5,0.019095659255981445,0.0
176,7,KNeighbors Classifier,1,1.0,0.75,0.8092214837250814,0.004694938659667969,0.0
177,7,SVC Classifier,1,1.0,0.8798076923076923,0.9527691731065936,0.02370738983154297,0.0
178,7,Decision Tree,1,1.0,0.75,0.8114309205896019,0.0021240711212158203,0.0
179,7,RandomForest,1,1.0,0.7259615384615384,0.7802076379614168,0.09175896644592285,0.0
180,7,AdaBoost (Discrete),1,1.0,0.7211538461538461,0.5242991087967237,3.6394834518432617,0.5242991087967237
181,7,AdaBoost (Real),1,1.0,0.5817307692307693,0.45225562155402443,3.7755115032196045,0.45225562155402443
182,7,Logistic Regression (Penalty = L2),1,1.0,0.8798076923076923,0.9524274542218717,0.0031728744506835938,0.0
183,7,Naive Bayes,1,1.0,0.8942307692307693,0.9686939947968892,0.012022972106933594,0.0
184,7,KNeighbors Classifier,2,1.0,0.6153846153846154,0.5773502691896257,0.00842738151550293,0.0
185,7,SVC Classifier,2,1.0,0.6057692307692307,0.5590169943749475,0.03220033645629883,0.0
186,7,Decision Tree,2,1.0,0.4855769230769231,0.21453573477407023,0.0012402534484863281,0.21453573477407023
187,7,RandomForest,2,1.0,0.46153846153846156,1.0,0.04810595512390137,0.0
188,7,AdaBoost (Discrete),2,1.0,0.7692307692307693,0.5455020359417712,3.568976879119873,0.5455020359417712
189,7,AdaBoost (Real),2,1.0,0.7644230769230769,0.346228641047154,4.085988283157349,0.346228641047154
190,7,Logistic Regression (Penalty = L2),2,1.0,0.8173076923076923,0.8779711460710616,0.002939462661743164,0.0
191,7,Naive Bayes,2,1.0,0.5240384615384616,0.3679900360969936,0.0033347606658935547,0.0
192,8,KNeighbors Classifier,0,1.0,0.6794258373205742,0.3834327676123552,0.003985404968261719,0.3834327676123552
193,8,SVC Classifier,0,1.0,0.7942583732057417,0.8569568250501305,0.007411003112792969,0.0
194,8,Decision Tree,0,1.0,0.5263157894736842,0.3627744871322338,0.0012524127960205078,0.3627744871322338
195,8,RandomForest,0,1.0,0.5023923444976076,0.30618621784789724,0.07843923568725586,0.0
196,8,AdaBoost (Discrete),0,1.0,0.6842105263157895,0.7138007815729402,3.260554313659668,0.7138007815729402
197,8,AdaBoost (Real),0,1.0,0.6698564593301436,0.6942099426082057,4.038220643997192,0.6942099426082057
198,8,Logistic Regression (Penalty = L2),0,1.0,0.8229665071770335,0.8936504412303007,0.0044019222259521484,0.0
199,8,Naive Bayes,0,1.0,0.5741626794258373,0.5,0.019620656967163086,0.0
200,8,KNeighbors Classifier,1,1.0,0.75,0.8092214837250814,0.02157306671142578,0.0
201,8,SVC Classifier,1,1.0,0.8798076923076923,0.9527691731065936,0.021681547164916992,0.0
202,8,Decision Tree,1,1.0,0.6153846153846154,0.6637305134197496,0.002070188522338867,0.0
203,8,RandomForest,1,1.0,0.7259615384615384,0.7802076379614168,0.09347677230834961,0.0
204,8,AdaBoost (Discrete),1,1.0,0.7211538461538461,0.5242991087967237,3.6294102668762207,0.5242991087967237
205,8,AdaBoost (Real),1,1.0,0.5817307692307693,0.45225562155402443,3.971282720565796,0.45225562155402443
206,8,Logistic Regression (Penalty = L2),1,1.0,0.8798076923076923,0.9524274542218717,0.0027997493743896484,0.0
207,8,Naive Bayes,1,1.0,0.8942307692307693,0.9686939947968892,0.0019214153289794922,0.0
208,8,KNeighbors Classifier,2,1.0,0.6153846153846154,0.5773502691896257,0.004784584045410156,0.0
209,8,SVC Classifier,2,1.0,0.6057692307692307,0.5590169943749475,0.004475831985473633,0.0
210,8,Decision Tree,2,1.0,0.4951923076923077,0.21609604948503167,0.0016472339630126953,0.21609604948503167
211,8,RandomForest,2,1.0,0.46153846153846156,1.0,0.04486870765686035,0.0
212,8,AdaBoost (Discrete),2,1.0,0.7692307692307693,0.5455020359417712,3.7711758613586426,0.5455020359417712
213,8,AdaBoost (Real),2,1.0,0.7740384615384616,0.652981989220792,4.244233846664429,0.652981989220792
214,8,Logistic Regression (Penalty = L2),2,1.0,0.8173076923076923,0.8779711460710616,0.0024657249450683594,0.0
215,8,Naive Bayes,2,1.0,0.5240384615384616,0.3679900360969936,0.0023767948150634766,0.0
216,9,KNeighbors Classifier,0,1.0,0.6794258373205742,0.3834327676123552,0.016431331634521484,0.3834327676123552
217,9,SVC Classifier,0,1.0,0.7942583732057417,0.8569568250501305,0.016654253005981445,0.0
218,9,Decision Tree,0,1.0,0.4784688995215311,0.29123251400488853,0.0012116432189941406,0.29123251400488853
219,9,RandomForest,0,1.0,0.5023923444976076,0.30618621784789724,0.030486106872558594,0.0
220,9,AdaBoost (Discrete),0,1.0,0.6842105263157895,0.7138007815729402,3.428070545196533,0.7138007815729402
221,9,AdaBoost (Real),0,1.0,0.6698564593301436,0.6942099426082057,3.2593350410461426,0.6942099426082057
222,9,Logistic Regression (Penalty = L2),0,1.0,0.8229665071770335,0.8936504412303007,0.0028290748596191406,0.0
223,9,Naive Bayes,0,1.0,0.5741626794258373,0.5,0.014014482498168945,0.0
224,9,KNeighbors Classifier,1,1.0,0.75,0.8092214837250814,0.0034215450286865234,0.0
225,9,SVC Classifier,1,1.0,0.8798076923076923,0.9527691731065936,0.008014202117919922,0.0
226,9,Decision Tree,1,1.0,0.7307692307692307,0.7915981329984721,0.0013289451599121094,0.0
227,9,RandomForest,1,1.0,0.7259615384615384,0.7802076379614168,0.042244672775268555,0.0
228,9,AdaBoost (Discrete),1,1.0,0.7211538461538461,0.5242991087967237,3.3129031658172607,0.5242991087967237
229,9,AdaBoost (Real),1,1.0,0.5817307692307693,0.45225562155402443,4.011972188949585,0.45225562155402443
230,9,Logistic Regression (Penalty = L2),1,1.0,0.8798076923076923,0.9524274542218717,0.0030896663665771484,0.0
231,9,Naive Bayes,1,1.0,0.8942307692307693,0.9686939947968892,0.0028200149536132812,0.0
232,9,KNeighbors Classifier,2,1.0,0.6153846153846154,0.5773502691896257,0.0047185420989990234,0.0
233,9,SVC Classifier,2,1.0,0.6057692307692307,0.5590169943749475,0.023372650146484375,0.0
234,9,Decision Tree,2,1.0,0.46634615384615385,0.13613198077265778,0.0020987987518310547,0.13613198077265778
235,9,RandomForest,2,1.0,0.46153846153846156,1.0,0.053574323654174805,0.0
236,9,AdaBoost (Discrete),2,1.0,0.7692307692307693,0.5455020359417712,3.7900757789611816,0.5455020359417712
237,9,AdaBoost (Real),2,1.0,0.7644230769230769,0.346228641047154,3.5381221771240234,0.346228641047154
238,9,Logistic Regression (Penalty = L2),2,1.0,0.8173076923076923,0.8779711460710616,0.015508890151977539,0.0
239,9,Naive Bayes,2,1.0,0.5240384615384616,0.3679900360969936,0.001985311508178711,0.0
240,10,KNeighbors Classifier,0,1.0,0.6794258373205742,0.3834327676123552,0.016492605209350586,0.3834327676123552
241,10,SVC Classifier,0,1.0,0.7942583732057417,0.8569568250501305,0.0194091796875,0.0
242,10,Decision Tree,0,1.0,0.6889952153110048,0.39382823591912675,0.0021142959594726562,0.39382823591912675
243,10,RandomForest,0,1.0,0.5023923444976076,0.30618621784789724,0.0623471736907959,0.0
244,10,AdaBoost (Discrete),0,1.0,0.6842105263157895,0.7138007815729402,3.494070529937744,0.7138007815729402
245,10,AdaBoost (Real),0,1.0,0.6698564593301436,0.6942099426082057,4.225153923034668,0.6942099426082057
246,10,Logistic Regression (Penalty = L2),0,1.0,0.8229665071770335,0.8936504412303007,0.01604628562927246,0.0
247,10,Naive Bayes,0,1.0,0.5741626794258373,0.5,0.001893758773803711,0.0
248,10,KNeighbors Classifier,1,1.0,0.75,0.8092214837250814,0.013404369354248047,0.0
249,10,SVC Classifier,1,1.0,0.8798076923076923,0.9527691731065936,0.023792743682861328,0.0
250,10,Decision Tree,1,1.0,0.7692307692307693,0.8309862781324638,0.002100229263305664,0.0
251,10,RandomForest,1,1.0,0.7259615384615384,0.7802076379614168,0.06978702545166016,0.0
252,10,AdaBoost (Discrete),1,1.0,0.7211538461538461,0.5242991087967237,2.9711358547210693,0.5242991087967237
253,10,AdaBoost (Real),1,1.0,0.5769230769230769,0.449810948823153,3.4643807411193848,0.449810948823153
254,10,Logistic Regression (Penalty = L2),1,1.0,0.8798076923076923,0.9524274542218717,0.014407157897949219,0.0
255,10,Naive Bayes,1,1.0,0.8942307692307693,0.9686939947968892,0.0019321441650390625,0.0
256,10,KNeighbors Classifier,2,1.0,0.6153846153846154,0.5773502691896257,0.015548944473266602,0.0
257,10,SVC Classifier,2,1.0,0.6057692307692307,0.5590169943749475,0.0180666446685791,0.0
258,10,Decision Tree,2,1.0,0.5,0.1900375201628218,0.0012323856353759766,0.1900375201628218
259,10,RandomForest,2,1.0,0.46153846153846156,1.0,0.048331260681152344,0.0
260,10,AdaBoost (Discrete),2,1.0,0.7692307692307693,0.5455020359417712,3.100955009460449,0.5455020359417712
261,10,AdaBoost (Real),2,1.0,0.7740384615384616,0.652981989220792,3.580796003341675,0.652981989220792
262,10,Logistic Regression (Penalty = L2),2,1.0,0.8173076923076923,0.8779711460710616,0.004198789596557617,0.0
263,10,Naive Bayes,2,1.0,0.5240384615384616,0.3679900360969936,0.0031664371490478516,0.0
264,11,KNeighbors Classifier,0,1.0,0.6794258373205742,0.3834327676123552,0.004793405532836914,0.3834327676123552
265,11,SVC Classifier,0,1.0,0.7942583732057417,0.8569568250501305,0.019631624221801758,0.0
266,11,Decision Tree,0,1.0,0.5358851674641149,0.37647686783698414,0.0020575523376464844,0.37647686783698414
267,11,RandomForest,0,1.0,0.5023923444976076,0.30618621784789724,0.051267147064208984,0.0
268,11,AdaBoost (Discrete),0,1.0,0.6842105263157895,0.7138007815729402,3.5006520748138428,0.7138007815729402
269,11,AdaBoost (Real),0,1.0,0.6698564593301436,0.6942099426082057,3.6040613651275635,0.6942099426082057
270,11,Logistic Regression (Penalty = L2),0,1.0,0.8229665071770335,0.8936504412303007,0.02070903778076172,0.0
271,11,Naive Bayes,0,1.0,0.5741626794258373,0.5,0.0031054019927978516,0.0
272,11,KNeighbors Classifier,1,1.0,0.75,0.8092214837250814,0.003254413604736328,0.0
273,11,SVC Classifier,1,1.0,0.8798076923076923,0.9527691731065936,0.021240234375,0.0
274,11,Decision Tree,1,1.0,0.8028846153846154,0.8696513110309083,0.0013272762298583984,0.0
275,11,RandomForest,1,1.0,0.7259615384615384,0.7802076379614168,0.062342166900634766,0.0
276,11,AdaBoost (Discrete),1,1.0,0.6923076923076923,0.3248739375210822,3.574392557144165,0.3248739375210822
277,11,AdaBoost (Real),1,1.0,0.5817307692307693,0.45225562155402443,3.370941162109375,0.45225562155402443
278,11,Logistic Regression (Penalty = L2),1,1.0,0.8798076923076923,0.9524274542218717,0.00246429443359375,0.0
279,11,Naive Bayes,1,1.0,0.8942307692307693,0.9686939947968892,0.0019283294677734375,0.0
280,11,KNeighbors Classifier,2,1.0,0.6153846153846154,0.5773502691896257,0.002990245819091797,0.0
281,11,SVC Classifier,2,1.0,0.6057692307692307,0.5590169943749475,0.019336938858032227,0.0
282,11,Decision Tree,2,1.0,0.6105769230769231,0.34303109627871137,0.001965761184692383,0.34303109627871137
283,11,RandomForest,2,1.0,0.46153846153846156,1.0,0.0351102352142334,0.0
284,11,AdaBoost (Discrete),2,1.0,0.7692307692307693,0.5455020359417712,3.4060909748077393,0.5455020359417712
285,11,AdaBoost (Real),2,1.0,0.7740384615384616,0.652981989220792,4.004408597946167,0.652981989220792
286,11,Logistic Regression (Penalty = L2),2,1.0,0.8173076923076923,0.8779711460710616,0.003915071487426758,0.0
287,11,Naive Bayes,2,1.0,0.5240384615384616,0.3679900360969936,0.0022783279418945312,0.0
288,12,KNeighbors Classifier,0,1.0,0.6794258373205742,0.3834327676123552,0.004837989807128906,0.3834327676123552
289,12,SVC Classifier,0,1.0,0.7942583732057417,0.8569568250501305,0.015425682067871094,0.0
290,12,Decision Tree,0,1.0,0.5645933014354066,0.3680642323315448,0.002053976058959961,0.3680642323315448
291,12,RandomForest,0,1.0,0.5023923444976076,0.30618621784789724,0.09319853782653809,0.0
292,12,AdaBoost (Discrete),0,1.0,0.6842105263157895,0.7138007815729402,3.791574239730835,0.7138007815729402
293,12,AdaBoost (Real),0,1.0,0.6698564593301436,0.6942099426082057,4.237895250320435,0.6942099426082057
294,12,Logistic Regression (Penalty = L2),0,1.0,0.8229665071770335,0.8936504412303007,0.0025339126586914062,0.0
295,12,Naive Bayes,0,1.0,0.5741626794258373,0.5,0.0019152164459228516,0.0
296,12,KNeighbors Classifier,1,1.0,0.75,0.8092214837250814,0.003328084945678711,0.0
297,12,SVC Classifier,1,1.0,0.8798076923076923,0.9527691731065936,0.004709482192993164,0.0
298,12,Decision Tree,1,1.0,0.6538461538461539,0.30889372865371506,0.001245260238647461,0.30889372865371506
299,12,RandomForest,1,1.0,0.7259615384615384,0.7802076379614168,0.03085017204284668,0.0
300,12,AdaBoost (Discrete),1,1.0,0.7211538461538461,0.5242991087967237,3.0123627185821533,0.5242991087967237
301,12,AdaBoost (Real),1,1.0,0.5769230769230769,0.449810948823153,3.827519655227661,0.449810948823153
302,12,Logistic Regression (Penalty = L2),1,1.0,0.8798076923076923,0.9524274542218717,0.020028352737426758,0.0
303,12,Naive Bayes,1,1.0,0.8942307692307693,0.9686939947968892,0.0034308433532714844,0.0
304,12,KNeighbors Classifier,2,1.0,0.6153846153846154,0.5773502691896257,0.021390199661254883,0.0
305,12,SVC Classifier,2,1.0,0.6057692307692307,0.5590169943749475,0.023239850997924805,0.0
306,12,Decision Tree,2,1.0,0.5288461538461539,0.26646934322754995,0.018507719039916992,0.26646934322754995
307,12,RandomForest,2,1.0,0.46153846153846156,1.0,0.07062077522277832,0.0
308,12,AdaBoost (Discrete),2,1.0,0.7980769230769231,0.7201845953194296,3.563326835632324,0.7201845953194296
309,12,AdaBoost (Real),2,1.0,0.7644230769230769,0.346228641047154,3.4033689498901367,0.346228641047154
310,12,Logistic Regression (Penalty = L2),2,1.0,0.8173076923076923,0.8779711460710616,0.002299785614013672,0.0
311,12,Naive Bayes,2,1.0,0.5240384615384616,0.3679900360969936,0.013571500778198242,0.0
