,feat_set_id,classifier,fold_id,feat_th,score,geo_score,exec_t,geo_score_woz
0,0,KNeighbors Classifier,0,0.85,0.8833333333333333,0.8391566243088356,0.30637025833129883,0.8391566243088356
1,0,SVC Classifier,0,0.85,0.8083333333333333,1.0,0.3997964859008789,0.0
2,0,Decision Tree,0,0.85,0.7916666666666666,0.8015269527222779,0.1025850772857666,0.8015269527222779
3,0,RandomForest,0,0.85,0.775,0.9373175393324713,0.6014413833618164,0.0
4,0,AdaBoost (Discrete),0,0.85,0.825,0.7481595356833938,42.65739154815674,0.7481595356833938
5,0,AdaBoost (Real),0,0.85,0.8,0.8532982640620798,46.507428884506226,0.0
6,0,Logistic Regression (Penalty = L2),0,0.85,0.975,0.9696654978825953,0.42258191108703613,0.9696654978825953
7,0,Naive Bayes,0,0.85,0.825,0.8048120598644068,0.1280665397644043,0.8048120598644068
8,0,KNeighbors Classifier,1,0.85,0.85,0.7880133228902736,0.3048069477081299,0.7880133228902736
9,0,SVC Classifier,1,0.85,0.8083333333333333,1.0,0.29675793647766113,0.0
10,0,Decision Tree,1,0.85,0.8166666666666667,0.8208732724133081,0.10252690315246582,0.8208732724133081
11,0,RandomForest,1,0.85,0.7083333333333334,0.8217893606856457,0.724576473236084,0.0
12,0,AdaBoost (Discrete),1,0.85,0.325,1.0,43.06811165809631,0.0
13,0,AdaBoost (Real),1,0.85,0.8333333333333334,0.9748970527428702,48.83698797225952,0.0
14,0,Logistic Regression (Penalty = L2),1,0.85,0.9583333333333334,0.9533988533647133,0.2588639259338379,0.9533988533647133
15,0,Naive Bayes,1,0.85,0.8,0.7429158520787884,0.20610809326171875,0.7429158520787884
16,0,KNeighbors Classifier,2,0.85,0.8983050847457628,0.861968818516883,0.29996490478515625,0.861968818516883
17,0,SVC Classifier,2,0.85,0.8135593220338984,1.0,0.3175535202026367,0.0
18,0,Decision Tree,2,0.85,0.8559322033898306,0.8339877880126201,0.00243377685546875,0.8339877880126201
19,0,RandomForest,2,0.85,0.652542372881356,0.9472682371859096,0.7098829746246338,0.0
20,0,AdaBoost (Discrete),2,0.85,0.923728813559322,0.7922561070581773,44.44337558746338,0.7922561070581773
21,0,AdaBoost (Real),2,0.85,0.9661016949152542,0.9370735665844807,48.79841327667236,0.9370735665844807
22,0,Logistic Regression (Penalty = L2),2,0.85,0.9661016949152542,0.9609668960083467,0.20054340362548828,0.9609668960083467
23,0,Naive Bayes,2,0.85,0.788135593220339,0.7107425712434663,0.17436695098876953,0.7107425712434663
24,1,KNeighbors Classifier,0,0.85,0.8583333333333333,0.8548338520126384,0.3219442367553711,0.8548338520126384
25,1,SVC Classifier,0,0.85,0.8083333333333333,1.0,0.2774970531463623,0.0
26,1,Decision Tree,0,0.85,0.9,0.8238804720075867,0.0014772415161132812,0.8238804720075867
27,1,RandomForest,0,0.85,0.7333333333333333,0.8132882808488928,0.5550146102905273,0.0
28,1,AdaBoost (Discrete),0,0.85,0.8333333333333334,0.7550752681421514,41.82197022438049,0.7550752681421514
29,1,AdaBoost (Real),0,0.85,0.8,0.8532982640620798,46.53124213218689,0.0
30,1,Logistic Regression (Penalty = L2),0,0.85,0.975,0.9696654978825953,0.571857213973999,0.9696654978825953
31,1,Naive Bayes,0,0.85,0.8,0.7703780795498101,0.21156692504882812,0.7703780795498101
32,1,KNeighbors Classifier,1,0.85,0.8916666666666667,0.8777319901322499,0.2879366874694824,0.8777319901322499
33,1,SVC Classifier,1,0.85,0.8083333333333333,1.0,0.3031189441680908,0.0
34,1,Decision Tree,1,0.85,0.9,0.9105846360404465,0.0020406246185302734,0.9105846360404465
35,1,RandomForest,1,0.85,0.775,0.7228278049954272,0.78550124168396,0.0
36,1,AdaBoost (Discrete),1,0.85,0.325,1.0,42.877044916152954,0.0
37,1,AdaBoost (Real),1,0.85,0.8333333333333334,0.9748970527428702,48.7292366027832,0.0
38,1,Logistic Regression (Penalty = L2),1,0.85,0.95,0.944846175074216,0.16802048683166504,0.944846175074216
39,1,Naive Bayes,1,0.85,0.7666666666666667,0.683113982346698,0.17398524284362793,0.683113982346698
40,1,KNeighbors Classifier,2,0.85,0.864406779661017,0.8119143988882697,0.4599616527557373,0.8119143988882697
41,1,SVC Classifier,2,0.85,0.8135593220338984,1.0,0.7497010231018066,0.0
42,1,Decision Tree,2,0.85,0.9152542372881356,0.8613291374752328,0.001550912857055664,0.8613291374752328
43,1,RandomForest,2,0.85,0.8559322033898306,0.9641925040026272,0.6703658103942871,0.0
44,1,AdaBoost (Discrete),2,0.85,0.923728813559322,0.7922561070581773,17.494686603546143,0.7922561070581773
45,1,AdaBoost (Real),2,0.85,0.8559322033898306,0.9641925040026272,39.154866218566895,0.0
46,1,Logistic Regression (Penalty = L2),2,0.85,0.9491525423728814,0.9422865815358938,0.23759126663208008,0.9422865815358938
47,1,Naive Bayes,2,0.85,0.7711864406779662,0.6859431568581424,0.1856846809387207,0.6859431568581424
48,2,KNeighbors Classifier,0,0.85,0.9083333333333333,0.9078769103339341,0.2725708484649658,0.9078769103339341
49,2,SVC Classifier,0,0.85,0.8083333333333333,1.0,0.28474903106689453,0.0
50,2,Decision Tree,0,0.85,0.8916666666666667,0.7511955001424397,0.08590269088745117,0.7511955001424397
51,2,RandomForest,0,0.85,0.7833333333333333,0.9584146563694087,0.645655632019043,0.0
52,2,AdaBoost (Discrete),0,0.85,0.825,0.7481595356833938,38.013994455337524,0.7481595356833938
53,2,AdaBoost (Real),0,0.85,0.7666666666666667,0.8339947279394198,44.63248157501221,0.0
54,2,Logistic Regression (Penalty = L2),0,0.85,0.975,0.9696654978825953,0.23554491996765137,0.9696654978825953
55,2,Naive Bayes,0,0.85,0.7916666666666666,0.7569682576589495,0.10460114479064941,0.7569682576589495
56,2,KNeighbors Classifier,1,0.85,0.875,0.8496681409970417,0.2743196487426758,0.8496681409970417
57,2,SVC Classifier,1,0.85,0.8083333333333333,1.0,0.2891685962677002,0.0
58,2,Decision Tree,1,0.85,0.7666666666666667,0.7797749150638809,0.002345561981201172,0.7797749150638809
59,2,RandomForest,1,0.85,0.7416666666666667,0.8840955321927456,0.6862895488739014,0.0
60,2,AdaBoost (Discrete),1,0.85,0.325,1.0,40.36705279350281,0.0
61,2,AdaBoost (Real),1,0.85,0.8333333333333334,0.9748970527428702,46.37296223640442,0.0
62,2,Logistic Regression (Penalty = L2),1,0.85,0.9416666666666667,0.9381678405381247,0.3190879821777344,0.9381678405381247
63,2,Naive Bayes,1,0.85,0.7666666666666667,0.683113982346698,0.21378159523010254,0.683113982346698
64,2,KNeighbors Classifier,2,0.85,0.864406779661017,0.8119143988882697,0.32463884353637695,0.8119143988882697
65,2,SVC Classifier,2,0.85,0.8135593220338984,1.0,0.32787132263183594,0.0
66,2,Decision Tree,2,0.85,0.9152542372881356,0.919159933187494,0.12579011917114258,0.919159933187494
67,2,RandomForest,2,0.85,0.8135593220338984,1.0,0.6604995727539062,0.0
68,2,AdaBoost (Discrete),2,0.85,0.923728813559322,0.7922561070581773,28.59761929512024,0.7922561070581773
69,2,AdaBoost (Real),2,0.85,0.864406779661017,1.0,54.679296255111694,0.0
70,2,Logistic Regression (Penalty = L2),2,0.85,0.9576271186440678,0.9518558056141587,0.34549999237060547,0.9518558056141587
71,2,Naive Bayes,2,0.85,0.7711864406779662,0.6873648184993013,0.1563267707824707,0.6873648184993013
72,3,KNeighbors Classifier,0,0.85,0.8416666666666667,0.8148142008605146,0.41954660415649414,0.8148142008605146
73,3,SVC Classifier,0,0.85,0.8083333333333333,1.0,0.4857652187347412,0.0
74,3,Decision Tree,0,0.85,0.8083333333333333,0.7731051810951428,0.002125978469848633,0.7731051810951428
75,3,RandomForest,0,0.85,0.6833333333333333,0.39779566221371765,0.7544515132904053,0.0
76,3,AdaBoost (Discrete),0,0.85,0.8166666666666667,0.7406381167867305,50.396326541900635,0.7406381167867305
77,3,AdaBoost (Real),0,0.85,0.7666666666666667,0.8374247492892184,60.28714847564697,0.0
78,3,Logistic Regression (Penalty = L2),0,0.85,0.975,0.9696654978825953,0.7312328815460205,0.9696654978825953
79,3,Naive Bayes,0,0.85,0.8166666666666667,0.793224979327062,0.2383575439453125,0.793224979327062
80,3,KNeighbors Classifier,1,0.85,0.8416666666666667,0.8200118082891207,0.708214521408081,0.8200118082891207
81,3,SVC Classifier,1,0.85,0.8,0.9931736624740629,0.9248764514923096,0.0
82,3,Decision Tree,1,0.85,0.85,0.8064010454538565,0.20579171180725098,0.8064010454538565
83,3,RandomForest,1,0.85,0.6916666666666667,0.7311104457090247,1.6201965808868408,0.0
84,3,AdaBoost (Discrete),1,0.85,0.325,1.0,91.67053866386414,0.0
85,3,AdaBoost (Real),1,0.85,0.8333333333333334,0.9748970527428702,101.52276372909546,0.0
86,3,Logistic Regression (Penalty = L2),1,0.85,0.9583333333333334,0.9491706774639023,0.9360089302062988,0.9491706774639023
87,3,Naive Bayes,1,0.85,0.7666666666666667,0.6897521778273282,0.23822903633117676,0.6897521778273282
88,3,KNeighbors Classifier,2,0.85,0.8813559322033898,0.8348376392733098,0.9214978218078613,0.8348376392733098
89,3,SVC Classifier,2,0.85,0.8135593220338984,1.0,0.6967923641204834,0.0
90,3,Decision Tree,2,0.85,0.8728813559322034,0.8331513721707914,0.001489877700805664,0.8331513721707914
91,3,RandomForest,2,0.85,0.6864406779661016,0.5,1.362663745880127,0.0
92,3,AdaBoost (Discrete),2,0.85,0.923728813559322,0.7922561070581773,87.27997946739197,0.7922561070581773
93,3,AdaBoost (Real),2,0.85,0.864406779661017,1.0,94.0924425125122,0.0
94,3,Logistic Regression (Penalty = L2),2,0.85,0.9661016949152542,0.9609668960083467,0.514531135559082,0.9609668960083467
95,3,Naive Bayes,2,0.85,0.7627118644067796,0.6667920688349989,0.27291393280029297,0.6667920688349989
96,4,KNeighbors Classifier,0,0.85,0.9,0.8840594648170274,0.43025779724121094,0.8840594648170274
97,4,SVC Classifier,0,0.85,0.8083333333333333,1.0,0.6225569248199463,0.0
98,4,Decision Tree,0,0.85,0.875,0.728923373607477,0.20985984802246094,0.728923373607477
99,4,RandomForest,0,0.85,0.7,0.7282376575609851,1.472534418106079,0.0
100,4,AdaBoost (Discrete),0,0.85,0.8333333333333334,0.7550752681421514,87.61395645141602,0.7550752681421514
101,4,AdaBoost (Real),0,0.85,0.7666666666666667,0.8339947279394198,93.15924072265625,0.0
102,4,Logistic Regression (Penalty = L2),0,0.85,0.975,0.9696654978825953,0.47936487197875977,0.9696654978825953
103,4,Naive Bayes,0,0.85,0.8333333333333334,0.8156205507141818,0.21719670295715332,0.8156205507141818
104,4,KNeighbors Classifier,1,0.85,0.8333333333333334,0.7651544745739504,0.6487782001495361,0.7651544745739504
105,4,SVC Classifier,1,0.85,0.8083333333333333,1.0,0.6569368839263916,0.0
106,4,Decision Tree,1,0.85,0.8333333333333334,0.8367771148469371,0.2146320343017578,0.8367771148469371
107,4,RandomForest,1,0.85,0.7833333333333333,0.9790825228441276,1.3211309909820557,0.0
108,4,AdaBoost (Discrete),1,0.85,0.325,1.0,88.1417784690857,0.0
109,4,AdaBoost (Real),1,0.85,0.8333333333333334,0.9748970527428702,93.17187261581421,0.0
110,4,Logistic Regression (Penalty = L2),1,0.85,0.9666666666666667,0.9577625008329119,0.2271430492401123,0.9577625008329119
111,4,Naive Bayes,1,0.85,0.775,0.6930926100197101,0.12726140022277832,0.6930926100197101
112,4,KNeighbors Classifier,2,0.85,0.8728813559322034,0.8237744862210329,0.24136066436767578,0.8237744862210329
113,4,SVC Classifier,2,0.85,0.8135593220338984,1.0,0.4276435375213623,0.0
114,4,Decision Tree,2,0.85,0.8728813559322034,0.7783401724296704,0.12967610359191895,0.7783401724296704
115,4,RandomForest,2,0.85,0.788135593220339,0.9494144610579709,0.7880346775054932,0.0
116,4,AdaBoost (Discrete),2,0.85,0.923728813559322,0.7922561070581773,40.24869418144226,0.7922561070581773
117,4,AdaBoost (Real),2,0.85,0.8559322033898306,0.9641925040026272,43.198570251464844,0.0
118,4,Logistic Regression (Penalty = L2),2,0.85,0.9661016949152542,0.9609668960083467,0.22150325775146484,0.9609668960083467
119,4,Naive Bayes,2,0.85,0.788135593220339,0.7107425712434663,0.003438234329223633,0.7107425712434663
120,5,KNeighbors Classifier,0,0.85,0.9166666666666666,0.8947446219403641,0.2173306941986084,0.8947446219403641
121,5,SVC Classifier,0,0.85,0.8083333333333333,1.0,0.22297215461730957,0.0
122,5,Decision Tree,0,0.85,0.85,0.7230200263994838,0.10567474365234375,0.7230200263994838
123,5,RandomForest,0,0.85,0.6666666666666666,0.9830475724915585,0.750896692276001,0.0
124,5,AdaBoost (Discrete),0,0.85,0.8166666666666667,0.7406381167867305,39.699782371520996,0.7406381167867305
125,5,AdaBoost (Real),0,0.85,0.7666666666666667,0.8339947279394198,48.93772006034851,0.0
126,5,Logistic Regression (Penalty = L2),0,0.85,0.975,0.9696654978825953,0.28008556365966797,0.9696654978825953
127,5,Naive Bayes,0,0.85,0.825,0.8048120598644068,0.12020134925842285,0.8048120598644068
128,5,KNeighbors Classifier,1,0.85,0.8583333333333333,0.8144610850870395,0.3551750183105469,0.8144610850870395
129,5,SVC Classifier,1,0.85,0.8083333333333333,1.0,0.3578774929046631,0.0
130,5,Decision Tree,1,0.85,0.8416666666666667,0.8169169879783069,0.002165079116821289,0.8169169879783069
131,5,RandomForest,1,0.85,0.75,0.8869084711105276,0.6010732650756836,0.0
132,5,AdaBoost (Discrete),1,0.85,0.325,1.0,42.18589997291565,0.0
133,5,AdaBoost (Real),1,0.85,0.8333333333333334,0.9748970527428702,48.034401416778564,0.0
134,5,Logistic Regression (Penalty = L2),1,0.85,0.95,0.944846175074216,0.1959228515625,0.944846175074216
135,5,Naive Bayes,1,0.85,0.7833333333333333,0.7024007274138591,0.10901737213134766,0.7024007274138591
136,5,KNeighbors Classifier,2,0.85,0.9067796610169492,0.8712905617352432,0.4242422580718994,0.8712905617352432
137,5,SVC Classifier,2,0.85,0.8135593220338984,1.0,0.2273728847503662,0.0
138,5,Decision Tree,2,0.85,0.9152542372881356,0.8958458509528604,0.0015060901641845703,0.8958458509528604
139,5,RandomForest,2,0.85,0.7627118644067796,0.8891397050194614,0.7000839710235596,0.0
140,5,AdaBoost (Discrete),2,0.85,0.923728813559322,0.7922561070581773,41.80951476097107,0.7922561070581773
141,5,AdaBoost (Real),2,0.85,0.864406779661017,1.0,44.94763135910034,0.0
142,5,Logistic Regression (Penalty = L2),2,0.85,0.9661016949152542,0.9609668960083467,0.17585372924804688,0.9609668960083467
143,5,Naive Bayes,2,0.85,0.7966101694915254,0.7248326527536443,0.003507375717163086,0.7248326527536443
144,6,KNeighbors Classifier,0,0.85,0.8916666666666667,0.8778586013177381,0.31134867668151855,0.8778586013177381
145,6,SVC Classifier,0,0.85,0.8083333333333333,1.0,0.34198927879333496,0.0
146,6,Decision Tree,0,0.85,0.9333333333333333,0.8660254037844387,0.0015668869018554688,0.8660254037844387
147,6,RandomForest,0,0.85,0.7166666666666667,0.3987179139971629,0.6220107078552246,0.3987179139971629
148,6,AdaBoost (Discrete),0,0.85,0.825,0.7481595356833938,37.8898069858551,0.7481595356833938
149,6,AdaBoost (Real),0,0.85,0.7666666666666667,0.8374247492892184,43.925440311431885,0.0
150,6,Logistic Regression (Penalty = L2),0,0.85,0.975,0.9696654978825953,0.2969357967376709,0.9696654978825953
151,6,Naive Bayes,0,0.85,0.8333333333333334,0.8176986041493832,0.11549639701843262,0.8176986041493832
152,6,KNeighbors Classifier,1,0.85,0.8916666666666667,0.8608782066921262,0.31267738342285156,0.8608782066921262
153,6,SVC Classifier,1,0.85,0.8,0.9931736624740629,0.3170328140258789,0.0
154,6,Decision Tree,1,0.85,0.8583333333333333,0.8487917399872947,0.10206937789916992,0.8487917399872947
155,6,RandomForest,1,0.85,0.65,0.9472682371859096,0.5124590396881104,0.0
156,6,AdaBoost (Discrete),1,0.85,0.325,1.0,39.27677845954895,0.0
157,6,AdaBoost (Real),1,0.85,0.8333333333333334,0.9748970527428702,45.448275566101074,0.0
158,6,Logistic Regression (Penalty = L2),1,0.85,0.975,0.9696654978825953,0.2666041851043701,0.9696654978825953
159,6,Naive Bayes,1,0.85,0.7833333333333333,0.707702742624028,0.19420790672302246,0.707702742624028
160,6,KNeighbors Classifier,2,0.85,0.8983050847457628,0.8491906647824764,0.3441643714904785,0.8491906647824764
161,6,SVC Classifier,2,0.85,0.8135593220338984,1.0,0.3244917392730713,0.0
162,6,Decision Tree,2,0.85,0.9152542372881356,0.911942874966337,0.00138092041015625,0.911942874966337
163,6,RandomForest,2,0.85,0.7288135593220338,1.0,0.7728838920593262,0.0
164,6,AdaBoost (Discrete),2,0.85,0.923728813559322,0.7922561070581773,40.21445608139038,0.7922561070581773
165,6,AdaBoost (Real),2,0.85,0.9661016949152542,0.9370735665844807,45.392271280288696,0.9370735665844807
166,6,Logistic Regression (Penalty = L2),2,0.85,0.9661016949152542,0.9609668960083467,0.24309849739074707,0.9609668960083467
167,6,Naive Bayes,2,0.85,0.7796610169491526,0.6950995455920289,0.20972347259521484,0.6950995455920289
168,7,KNeighbors Classifier,0,0.85,0.9,0.8989297640737037,0.12788605690002441,0.8989297640737037
169,7,SVC Classifier,0,0.85,0.8083333333333333,1.0,0.32380247116088867,0.0
170,7,Decision Tree,0,0.85,0.8,0.7106281844043351,0.0020589828491210938,0.7106281844043351
171,7,RandomForest,0,0.85,0.7416666666666667,0.5623730565710474,0.657090425491333,0.0
172,7,AdaBoost (Discrete),0,0.85,0.8416666666666667,0.7627433009661261,39.637524366378784,0.7627433009661261
173,7,AdaBoost (Real),0,0.85,0.8,0.8532982640620798,45.74061298370361,0.0
174,7,Logistic Regression (Penalty = L2),0,0.85,0.975,0.9696654978825953,0.3008556365966797,0.9696654978825953
175,7,Naive Bayes,0,0.85,0.7916666666666666,0.7569682576589495,0.1816883087158203,0.7569682576589495
176,7,KNeighbors Classifier,1,0.85,0.8666666666666667,0.8374352562395649,0.335695743560791,0.8374352562395649
177,7,SVC Classifier,1,0.85,0.8083333333333333,1.0,0.347564697265625,0.0
178,7,Decision Tree,1,0.85,0.7916666666666666,0.7460944620326377,0.10613560676574707,0.7460944620326377
179,7,RandomForest,1,0.85,0.7083333333333334,0.7071067811865476,0.5292928218841553,0.0
180,7,AdaBoost (Discrete),1,0.85,0.325,1.0,41.27765107154846,0.0
181,7,AdaBoost (Real),1,0.85,0.8333333333333334,0.9748970527428702,46.43540334701538,0.0
182,7,Logistic Regression (Penalty = L2),1,0.85,0.95,0.944846175074216,0.23575186729431152,0.944846175074216
183,7,Naive Bayes,1,0.85,0.7666666666666667,0.683113982346698,0.11208105087280273,0.683113982346698
184,7,KNeighbors Classifier,2,0.85,0.8728813559322034,0.8237744862210329,0.21704554557800293,0.8237744862210329
185,7,SVC Classifier,2,0.85,0.8135593220338984,1.0,0.32308197021484375,0.0
186,7,Decision Tree,2,0.85,0.847457627118644,0.7317367521005407,0.002494335174560547,0.7317367521005407
187,7,RandomForest,2,0.85,0.9152542372881356,0.944087511294902,0.5332410335540771,0.0
188,7,AdaBoost (Discrete),2,0.85,0.923728813559322,0.7922561070581773,40.87692427635193,0.7922561070581773
189,7,AdaBoost (Real),2,0.85,0.8559322033898306,0.9641925040026272,45.6753933429718,0.0
190,7,Logistic Regression (Penalty = L2),2,0.85,0.9491525423728814,0.9422865815358938,0.2676370143890381,0.9422865815358938
191,7,Naive Bayes,2,0.85,0.7711864406779662,0.6873648184993013,0.2140350341796875,0.6873648184993013
192,8,KNeighbors Classifier,0,0.85,0.85,0.836277771891689,0.21750497817993164,0.836277771891689
193,8,SVC Classifier,0,0.85,0.8083333333333333,1.0,0.3225390911102295,0.0
194,8,Decision Tree,0,0.85,0.8416666666666667,0.7310768208798096,0.10624217987060547,0.7310768208798096
195,8,RandomForest,0,0.85,0.8,0.5374742020163636,0.5409221649169922,0.5374742020163636
196,8,AdaBoost (Discrete),0,0.85,0.8416666666666667,0.7627433009661261,38.66231870651245,0.7627433009661261
197,8,AdaBoost (Real),0,0.85,0.7666666666666667,0.8374247492892184,40.62428641319275,0.0
198,8,Logistic Regression (Penalty = L2),0,0.85,0.975,0.9696654978825953,0.2915370464324951,0.9696654978825953
199,8,Naive Bayes,0,0.85,0.8166666666666667,0.793224979327062,0.16966629028320312,0.793224979327062
200,8,KNeighbors Classifier,1,0.85,0.8666666666666667,0.8472470631056911,0.2711327075958252,0.8472470631056911
201,8,SVC Classifier,1,0.85,0.8083333333333333,1.0,0.18715548515319824,0.0
202,8,Decision Tree,1,0.85,0.85,0.8601566184273729,0.0902700424194336,0.8601566184273729
203,8,RandomForest,1,0.85,0.7583333333333333,0.7154845405526278,0.6428852081298828,0.0
204,8,AdaBoost (Discrete),1,0.85,0.325,1.0,34.992111921310425,0.0
205,8,AdaBoost (Real),1,0.85,0.8333333333333334,0.9748970527428702,40.94401836395264,0.0
206,8,Logistic Regression (Penalty = L2),1,0.85,0.9583333333333334,0.9491706774639023,0.21132349967956543,0.9491706774639023
207,8,Naive Bayes,1,0.85,0.7583333333333333,0.679821643192148,0.18079733848571777,0.679821643192148
208,8,KNeighbors Classifier,2,0.85,0.8389830508474576,0.7387126921412362,0.21471357345581055,0.7387126921412362
209,8,SVC Classifier,2,0.85,0.8135593220338984,1.0,0.4487121105194092,0.0
210,8,Decision Tree,2,0.85,0.9067796610169492,0.8719376408016086,0.0015609264373779297,0.8719376408016086
211,8,RandomForest,2,0.85,0.7288135593220338,0.7073519215859911,0.5261831283569336,0.0
212,8,AdaBoost (Discrete),2,0.85,0.923728813559322,0.7922561070581773,39.34887766838074,0.7922561070581773
213,8,AdaBoost (Real),2,0.85,0.8559322033898306,0.9641925040026272,40.927077770233154,0.0
214,8,Logistic Regression (Penalty = L2),2,0.85,0.9661016949152542,0.9609668960083467,0.21541905403137207,0.9609668960083467
215,8,Naive Bayes,2,0.85,0.7627118644067796,0.6667920688349989,0.09710335731506348,0.6667920688349989
216,9,KNeighbors Classifier,0,0.85,0.8666666666666667,0.8499063768966064,0.2865316867828369,0.8499063768966064
217,9,SVC Classifier,0,0.85,0.8083333333333333,1.0,0.2860844135284424,0.0
218,9,Decision Tree,0,0.85,0.85,0.7852089012375099,0.09456825256347656,0.7852089012375099
219,9,RandomForest,0,0.85,0.75,0.5213876611991533,0.487382173538208,0.5213876611991533
220,9,AdaBoost (Discrete),0,0.85,0.8166666666666667,0.7406381167867305,34.92653155326843,0.7406381167867305
221,9,AdaBoost (Real),0,0.85,0.7666666666666667,0.8374247492892184,39.28906202316284,0.0
222,9,Logistic Regression (Penalty = L2),0,0.85,0.975,0.9696654978825953,0.2750391960144043,0.9696654978825953
223,9,Naive Bayes,0,0.85,0.8083333333333333,0.7794174658807117,0.09961152076721191,0.7794174658807117
224,9,KNeighbors Classifier,1,0.85,0.8666666666666667,0.855480230293932,0.18717384338378906,0.855480230293932
225,9,SVC Classifier,1,0.85,0.8,0.9931736624740629,0.18905305862426758,0.0
226,9,Decision Tree,1,0.85,0.8916666666666667,0.919109863192062,0.0943751335144043,0.919109863192062
227,9,RandomForest,1,0.85,0.6666666666666666,0.9830475724915585,0.4542372226715088,0.0
228,9,AdaBoost (Discrete),1,0.85,0.325,1.0,32.95712614059448,0.0
229,9,AdaBoost (Real),1,0.85,0.8333333333333334,0.9748970527428702,40.758405685424805,0.0
230,9,Logistic Regression (Penalty = L2),1,0.85,0.9583333333333334,0.9491706774639023,0.28943371772766113,0.9491706774639023
231,9,Naive Bayes,1,0.85,0.7666666666666667,0.6897521778273282,0.09619522094726562,0.6897521778273282
232,9,KNeighbors Classifier,2,0.85,0.8898305084745762,0.8482049491656009,0.3081846237182617,0.8482049491656009
233,9,SVC Classifier,2,0.85,0.8135593220338984,1.0,0.2864243984222412,0.0
234,9,Decision Tree,2,0.85,0.9152542372881356,0.8613291374752328,0.0014195442199707031,0.8613291374752328
235,9,RandomForest,2,0.85,0.7457627118644068,0.8408964152537145,0.6608479022979736,0.0
236,9,AdaBoost (Discrete),2,0.85,0.923728813559322,0.7922561070581773,37.01769208908081,0.7922561070581773
237,9,AdaBoost (Real),2,0.85,0.864406779661017,1.0,41.96662878990173,0.0
238,9,Logistic Regression (Penalty = L2),2,0.85,0.9661016949152542,0.9609668960083467,0.17592144012451172,0.9609668960083467
239,9,Naive Bayes,2,0.85,0.7711864406779662,0.6786044041487267,0.2089381217956543,0.6786044041487267
240,10,KNeighbors Classifier,0,0.85,0.8666666666666667,0.8496681409970417,0.28408241271972656,0.8496681409970417
241,10,SVC Classifier,0,0.85,0.8083333333333333,1.0,0.2713959217071533,0.0
242,10,Decision Tree,0,0.85,0.8583333333333333,0.8033312502711415,0.0981597900390625,0.8033312502711415
243,10,RandomForest,0,0.85,0.75,0.8935524445344916,0.6699867248535156,0.0
244,10,AdaBoost (Discrete),0,0.85,0.8166666666666667,0.7406381167867305,36.408082723617554,0.7406381167867305
245,10,AdaBoost (Real),0,0.85,0.8,0.8532982640620798,41.807459354400635,0.0
246,10,Logistic Regression (Penalty = L2),0,0.85,0.975,0.9696654978825953,0.2205524444580078,0.9696654978825953
247,10,Naive Bayes,0,0.85,0.8,0.7703780795498101,0.2729356288909912,0.7703780795498101
248,10,KNeighbors Classifier,1,0.85,0.8833333333333333,0.8663141271331594,0.3809199333190918,0.8663141271331594
249,10,SVC Classifier,1,0.85,0.8083333333333333,1.0,0.28881192207336426,0.0
250,10,Decision Tree,1,0.85,0.9166666666666666,0.9436459837442929,0.0944061279296875,0.9436459837442929
251,10,RandomForest,1,0.85,0.6666666666666666,0.9830475724915585,0.4811863899230957,0.0
252,10,AdaBoost (Discrete),1,0.85,0.325,1.0,37.13800120353699,0.0
253,10,AdaBoost (Real),1,0.85,0.8333333333333334,0.9748970527428702,45.22139239311218,0.0
254,10,Logistic Regression (Penalty = L2),1,0.85,0.9416666666666667,0.9381678405381247,0.18767380714416504,0.9381678405381247
255,10,Naive Bayes,1,0.85,0.7666666666666667,0.683113982346698,0.17779970169067383,0.683113982346698
256,10,KNeighbors Classifier,2,0.85,0.8559322033898306,0.8032279079814331,0.30795907974243164,0.8032279079814331
257,10,SVC Classifier,2,0.85,0.8135593220338984,1.0,0.29756665229797363,0.0
258,10,Decision Tree,2,0.85,0.9576271186440678,0.93429310401246,0.11226081848144531,0.93429310401246
259,10,RandomForest,2,0.85,0.652542372881356,0.9472682371859096,0.6960277557373047,0.0
260,10,AdaBoost (Discrete),2,0.85,0.923728813559322,0.7922561070581773,39.49086570739746,0.7922561070581773
261,10,AdaBoost (Real),2,0.85,0.864406779661017,1.0,41.826087474823,0.0
262,10,Logistic Regression (Penalty = L2),2,0.85,0.9576271186440678,0.9518558056141587,0.2501344680786133,0.9518558056141587
263,10,Naive Bayes,2,0.85,0.7627118644067796,0.6740030772986388,0.10402417182922363,0.6740030772986388
264,11,KNeighbors Classifier,0,0.85,0.875,0.8539061940747412,0.41736698150634766,0.8539061940747412
265,11,SVC Classifier,0,0.85,0.8083333333333333,1.0,0.4152102470397949,0.0
266,11,Decision Tree,0,0.85,0.7833333333333333,0.615623768987206,0.002460956573486328,0.615623768987206
267,11,RandomForest,0,0.85,0.8,0.6358114348177182,0.6152441501617432,0.0
268,11,AdaBoost (Discrete),0,0.85,0.8166666666666667,0.7406381167867305,32.07502031326294,0.7406381167867305
269,11,AdaBoost (Real),0,0.85,0.8,0.8532982640620798,42.235711097717285,0.0
270,11,Logistic Regression (Penalty = L2),0,0.85,0.975,0.9696654978825953,0.23048996925354004,0.9696654978825953
271,11,Naive Bayes,0,0.85,0.7833333333333333,0.743791857938213,0.12851262092590332,0.743791857938213
272,11,KNeighbors Classifier,1,0.85,0.875,0.8526614251383757,0.2731313705444336,0.8526614251383757
273,11,SVC Classifier,1,0.85,0.8083333333333333,1.0,0.2765085697174072,0.0
274,11,Decision Tree,1,0.85,0.875,0.8539061940747412,0.0023889541625976562,0.8539061940747412
275,11,RandomForest,1,0.85,0.8416666666666667,0.9665910224658814,0.6656756401062012,0.0
276,11,AdaBoost (Discrete),1,0.85,0.325,1.0,37.02801728248596,0.0
277,11,AdaBoost (Real),1,0.85,0.8333333333333334,0.9748970527428702,43.29875349998474,0.0
278,11,Logistic Regression (Penalty = L2),1,0.85,0.9416666666666667,0.9381678405381247,0.1832141876220703,0.9381678405381247
279,11,Naive Bayes,1,0.85,0.7666666666666667,0.683113982346698,0.10925698280334473,0.683113982346698
280,11,KNeighbors Classifier,2,0.85,0.8559322033898306,0.8032279079814331,0.3014645576477051,0.8032279079814331
281,11,SVC Classifier,2,0.85,0.8135593220338984,1.0,0.3549931049346924,0.0
282,11,Decision Tree,2,0.85,0.9152542372881356,0.9075342504782565,0.15856385231018066,0.9075342504782565
283,11,RandomForest,2,0.85,0.8135593220338984,0.5099122256638764,0.4965481758117676,0.5099122256638764
284,11,AdaBoost (Discrete),2,0.85,0.923728813559322,0.7922561070581773,38.34028601646423,0.7922561070581773
285,11,AdaBoost (Real),2,0.85,0.864406779661017,1.0,46.018014669418335,0.0
286,11,Logistic Regression (Penalty = L2),2,0.85,0.9576271186440678,0.9518558056141587,0.22417807579040527,0.9518558056141587
287,11,Naive Bayes,2,0.85,0.7627118644067796,0.6740030772986388,0.08210897445678711,0.6740030772986388
288,12,KNeighbors Classifier,0,0.85,0.9166666666666666,0.9170966931056548,0.2791423797607422,0.9170966931056548
289,12,SVC Classifier,0,0.85,0.8083333333333333,1.0,0.27557945251464844,0.0
290,12,Decision Tree,0,0.85,0.8166666666666667,0.6932496848557066,0.0023200511932373047,0.6932496848557066
291,12,RandomForest,0,0.85,0.6916666666666667,0.6496526575050342,0.7055609226226807,0.0
292,12,AdaBoost (Discrete),0,0.85,0.8416666666666667,0.7627433009661261,41.69168448448181,0.7627433009661261
293,12,AdaBoost (Real),0,0.85,0.7666666666666667,0.8374247492892184,45.40074944496155,0.0
294,12,Logistic Regression (Penalty = L2),0,0.85,0.975,0.9696654978825953,0.23816204071044922,0.9696654978825953
295,12,Naive Bayes,0,0.85,0.8166666666666667,0.793224979327062,0.1974329948425293,0.793224979327062
296,12,KNeighbors Classifier,1,0.85,0.9,0.8989297640737037,0.25992751121520996,0.8989297640737037
297,12,SVC Classifier,1,0.85,0.8083333333333333,1.0,0.2867698669433594,0.0
298,12,Decision Tree,1,0.85,0.8416666666666667,0.8272625156253087,0.0014429092407226562,0.8272625156253087
299,12,RandomForest,1,0.85,0.75,0.9000514359196271,0.7269454002380371,0.0
300,12,AdaBoost (Discrete),1,0.85,0.325,1.0,39.228888511657715,0.0
301,12,AdaBoost (Real),1,0.85,0.8333333333333334,0.9748970527428702,46.29512619972229,0.0
302,12,Logistic Regression (Penalty = L2),1,0.85,0.9583333333333334,0.9491706774639023,0.26213765144348145,0.9491706774639023
303,12,Naive Bayes,1,0.85,0.775,0.6990154337779351,0.18184709548950195,0.6990154337779351
304,12,KNeighbors Classifier,2,0.85,0.8983050847457628,0.8549879733383485,0.2798905372619629,0.8549879733383485
305,12,SVC Classifier,2,0.85,0.8135593220338984,1.0,0.2874562740325928,0.0
306,12,Decision Tree,2,0.85,0.8728813559322034,0.8295364574861732,0.09448838233947754,0.8295364574861732
307,12,RandomForest,2,0.85,0.9067796610169492,0.6922281371060118,0.5970070362091064,0.6922281371060118
308,12,AdaBoost (Discrete),2,0.85,0.923728813559322,0.7922561070581773,38.80382490158081,0.7922561070581773
309,12,AdaBoost (Real),2,0.85,0.8559322033898306,0.9641925040026272,39.518455266952515,0.0
310,12,Logistic Regression (Penalty = L2),2,0.85,0.9661016949152542,0.9609668960083467,0.21766090393066406,0.9609668960083467
311,12,Naive Bayes,2,0.85,0.788135593220339,0.7074133526882928,0.16889595985412598,0.7074133526882928
