,feat_set_id,classifier,fold_id,feat_th,score,geo_score,exec_t,geo_score_woz
0,0,KNeighbors Classifier,0,0.4,0.8571428571428571,0.7888106377466155,0.05056595802307129,0.7888106377466155
1,0,SVC Classifier,0,0.4,0.7142857142857143,1.0,0.023592710494995117,0.0
2,0,Decision Tree,0,0.4,0.9523809523809523,0.9128709291752769,0.030282258987426758,0.9128709291752769
3,0,RandomForest,0,0.4,0.9523809523809523,0.9128709291752769,0.16690397262573242,0.9128709291752769
4,0,AdaBoost (Discrete),0,0.4,0.9523809523809523,0.9128709291752769,0.0245511531829834,0.9128709291752769
5,0,AdaBoost (Real),0,0.4,0.9523809523809523,0.9128709291752769,0.022859811782836914,0.9128709291752769
6,0,Logistic Regression (Penalty = L2),0,0.4,1.0,1.0,0.0031914710998535156,1.0
7,0,Naive Bayes,0,0.4,0.9523809523809523,0.9128709291752769,0.022422075271606445,0.9128709291752769
8,0,KNeighbors Classifier,1,0.4,0.9047619047619048,0.8819171036881969,0.023207664489746094,0.8819171036881969
9,0,SVC Classifier,1,0.4,0.7142857142857143,1.0,0.022304296493530273,0.0
10,0,Decision Tree,1,0.4,1.0,1.0,0.021780967712402344,1.0
11,0,RandomForest,1,0.4,0.9523809523809523,0.9660917830792959,0.16753268241882324,0.9660917830792959
12,0,AdaBoost (Discrete),1,0.4,0.9523809523809523,0.9660917830792959,0.0235595703125,0.9660917830792959
13,0,AdaBoost (Real),1,0.4,0.9523809523809523,0.9660917830792959,0.023951292037963867,0.9660917830792959
14,0,Logistic Regression (Penalty = L2),1,0.4,0.9523809523809523,0.9660917830792959,0.022159337997436523,0.9660917830792959
15,0,Naive Bayes,1,0.4,1.0,1.0,0.023051977157592773,1.0
16,0,KNeighbors Classifier,2,0.4,0.8947368421052632,0.7745966692414834,0.024100303649902344,0.7745966692414834
17,0,SVC Classifier,2,0.4,0.7368421052631579,1.0,0.022537946701049805,0.0
18,0,Decision Tree,2,0.4,0.8947368421052632,0.7745966692414834,0.0010695457458496094,0.7745966692414834
19,0,RandomForest,2,0.4,1.0,1.0,0.14073705673217773,1.0
20,0,AdaBoost (Discrete),2,0.4,1.0,1.0,0.05027365684509277,1.0
21,0,AdaBoost (Real),2,0.4,1.0,1.0,0.16613292694091797,1.0
22,0,Logistic Regression (Penalty = L2),2,0.4,0.9473684210526315,0.8944271909999159,0.02631545066833496,0.8944271909999159
23,0,Naive Bayes,2,0.4,1.0,1.0,0.002360820770263672,1.0
24,1,KNeighbors Classifier,0,0.4,0.9523809523809523,0.9660917830792959,0.04687786102294922,0.9660917830792959
25,1,SVC Classifier,0,0.4,0.7142857142857143,1.0,0.022602558135986328,0.0
26,1,Decision Tree,0,0.4,0.9523809523809523,0.9128709291752769,0.001611948013305664,0.9128709291752769
27,1,RandomForest,0,0.4,0.9523809523809523,0.9128709291752769,0.14488959312438965,0.9128709291752769
28,1,AdaBoost (Discrete),0,0.4,0.9523809523809523,0.9128709291752769,0.025015830993652344,0.9128709291752769
29,1,AdaBoost (Real),0,0.4,0.9523809523809523,0.9128709291752769,0.02841782569885254,0.9128709291752769
30,1,Logistic Regression (Penalty = L2),0,0.4,1.0,1.0,0.026234149932861328,1.0
31,1,Naive Bayes,0,0.4,0.9523809523809523,0.9128709291752769,0.0032219886779785156,0.9128709291752769
32,1,KNeighbors Classifier,1,0.4,0.8571428571428571,0.7888106377466155,0.0033388137817382812,0.7888106377466155
33,1,SVC Classifier,1,0.4,0.7142857142857143,1.0,0.022490739822387695,0.0
34,1,Decision Tree,1,0.4,1.0,1.0,0.0013065338134765625,1.0
35,1,RandomForest,1,0.4,0.9523809523809523,0.9660917830792959,0.1865534782409668,0.9660917830792959
36,1,AdaBoost (Discrete),1,0.4,0.9523809523809523,0.9660917830792959,0.028679609298706055,0.9660917830792959
37,1,AdaBoost (Real),1,0.4,0.9523809523809523,0.9660917830792959,0.0027446746826171875,0.9660917830792959
38,1,Logistic Regression (Penalty = L2),1,0.4,1.0,1.0,0.002044677734375,1.0
39,1,Naive Bayes,1,0.4,0.9523809523809523,0.9128709291752769,0.022235870361328125,0.9128709291752769
40,1,KNeighbors Classifier,2,0.4,0.9473684210526315,0.8944271909999159,0.023589134216308594,0.8944271909999159
41,1,SVC Classifier,2,0.4,0.7368421052631579,1.0,0.022393226623535156,0.0
42,1,Decision Tree,2,0.4,1.0,1.0,0.0017905235290527344,1.0
43,1,RandomForest,2,0.4,1.0,1.0,0.19704508781433105,1.0
44,1,AdaBoost (Discrete),2,0.4,0.9473684210526315,0.8944271909999159,0.05266237258911133,0.8944271909999159
45,1,AdaBoost (Real),2,0.4,0.9473684210526315,0.8944271909999159,0.027761220932006836,0.8944271909999159
46,1,Logistic Regression (Penalty = L2),2,0.4,1.0,1.0,0.0019164085388183594,1.0
47,1,Naive Bayes,2,0.4,0.9473684210526315,0.8944271909999159,0.02767491340637207,0.8944271909999159
48,2,KNeighbors Classifier,0,0.4,1.0,1.0,0.027485132217407227,1.0
49,2,SVC Classifier,0,0.4,0.7142857142857143,1.0,0.026131153106689453,0.0
50,2,Decision Tree,0,0.4,0.7142857142857143,0.6324555320336759,0.0020666122436523438,0.6324555320336759
51,2,RandomForest,0,0.4,0.9523809523809523,0.9128709291752769,0.1681971549987793,0.9128709291752769
52,2,AdaBoost (Discrete),0,0.4,0.9523809523809523,0.9128709291752769,0.027764081954956055,0.9128709291752769
53,2,AdaBoost (Real),0,0.4,0.9523809523809523,0.9128709291752769,0.029231548309326172,0.9128709291752769
54,2,Logistic Regression (Penalty = L2),0,0.4,1.0,1.0,0.0021698474884033203,1.0
55,2,Naive Bayes,0,0.4,0.9523809523809523,0.9128709291752769,0.02315998077392578,0.9128709291752769
56,2,KNeighbors Classifier,1,0.4,0.9047619047619048,0.8819171036881969,0.02393031120300293,0.8819171036881969
57,2,SVC Classifier,1,0.4,0.7142857142857143,1.0,0.0021944046020507812,0.0
58,2,Decision Tree,1,0.4,0.9523809523809523,0.9660917830792959,0.0017561912536621094,0.9660917830792959
59,2,RandomForest,1,0.4,0.9523809523809523,0.9660917830792959,0.12457942962646484,0.9660917830792959
60,2,AdaBoost (Discrete),1,0.4,0.9523809523809523,0.9660917830792959,0.019791126251220703,0.9660917830792959
61,2,AdaBoost (Real),1,0.4,0.9523809523809523,0.9660917830792959,0.023909807205200195,0.9660917830792959
62,2,Logistic Regression (Penalty = L2),1,0.4,1.0,1.0,0.02220320701599121,1.0
63,2,Naive Bayes,1,0.4,1.0,1.0,0.002457857131958008,1.0
64,2,KNeighbors Classifier,2,0.4,0.8947368421052632,0.7745966692414834,0.0018405914306640625,0.7745966692414834
65,2,SVC Classifier,2,0.4,0.7368421052631579,1.0,0.021861791610717773,0.0
66,2,Decision Tree,2,0.4,1.0,1.0,0.0010914802551269531,1.0
67,2,RandomForest,2,0.4,1.0,1.0,0.16550493240356445,1.0
68,2,AdaBoost (Discrete),2,0.4,0.9473684210526315,0.8944271909999159,0.022913694381713867,0.8944271909999159
69,2,AdaBoost (Real),2,0.4,0.9473684210526315,0.8944271909999159,0.023005247116088867,0.8944271909999159
70,2,Logistic Regression (Penalty = L2),2,0.4,0.9473684210526315,0.8944271909999159,0.02189326286315918,0.8944271909999159
71,2,Naive Bayes,2,0.4,1.0,1.0,0.02284550666809082,1.0
72,3,KNeighbors Classifier,0,0.4,0.9523809523809523,0.9660917830792959,0.0018551349639892578,0.9660917830792959
73,3,SVC Classifier,0,0.4,0.7142857142857143,1.0,0.002187013626098633,0.0
74,3,Decision Tree,0,0.4,0.9523809523809523,0.9128709291752769,0.0015256404876708984,0.9128709291752769
75,3,RandomForest,0,0.4,0.9523809523809523,0.9128709291752769,0.3684854507446289,0.9128709291752769
76,3,AdaBoost (Discrete),0,0.4,0.9523809523809523,0.9128709291752769,0.06847691535949707,0.9128709291752769
77,3,AdaBoost (Real),0,0.4,0.9523809523809523,0.9128709291752769,0.06078314781188965,0.9128709291752769
78,3,Logistic Regression (Penalty = L2),0,0.4,1.0,1.0,0.03446078300476074,1.0
79,3,Naive Bayes,0,0.4,0.9523809523809523,0.9128709291752769,0.047025442123413086,0.9128709291752769
80,3,KNeighbors Classifier,1,0.4,0.8571428571428571,0.7888106377466155,0.003456592559814453,0.7888106377466155
81,3,SVC Classifier,1,0.4,0.7142857142857143,1.0,0.030072450637817383,0.0
82,3,Decision Tree,1,0.4,0.9523809523809523,0.9660917830792959,0.0018546581268310547,0.9660917830792959
83,3,RandomForest,1,0.4,0.9523809523809523,0.9660917830792959,0.1678018569946289,0.9660917830792959
84,3,AdaBoost (Discrete),1,0.4,0.9523809523809523,0.9660917830792959,0.03290438652038574,0.9660917830792959
85,3,AdaBoost (Real),1,0.4,0.9523809523809523,0.9660917830792959,0.03264474868774414,0.9660917830792959
86,3,Logistic Regression (Penalty = L2),1,0.4,1.0,1.0,0.029939889907836914,1.0
87,3,Naive Bayes,1,0.4,0.9523809523809523,0.9128709291752769,0.03442859649658203,0.9128709291752769
88,3,KNeighbors Classifier,2,0.4,0.9473684210526315,0.8944271909999159,0.03065943717956543,0.8944271909999159
89,3,SVC Classifier,2,0.4,0.7368421052631579,1.0,0.0011591911315917969,0.0
90,3,Decision Tree,2,0.4,0.8947368421052632,0.7745966692414834,0.0010018348693847656,0.7745966692414834
91,3,RandomForest,2,0.4,1.0,1.0,0.22997117042541504,1.0
92,3,AdaBoost (Discrete),2,0.4,1.0,1.0,0.09499406814575195,1.0
93,3,AdaBoost (Real),2,0.4,1.0,1.0,0.03368568420410156,1.0
94,3,Logistic Regression (Penalty = L2),2,0.4,0.9473684210526315,0.8944271909999159,0.0011615753173828125,0.8944271909999159
95,3,Naive Bayes,2,0.4,0.8947368421052632,0.7745966692414834,0.030805110931396484,0.7745966692414834
96,4,KNeighbors Classifier,0,0.4,0.9523809523809523,0.9660917830792959,0.029946088790893555,0.9660917830792959
97,4,SVC Classifier,0,0.4,0.7142857142857143,1.0,0.033860206604003906,0.0
98,4,Decision Tree,0,0.4,0.9523809523809523,0.9128709291752769,0.02922964096069336,0.9128709291752769
99,4,RandomForest,0,0.4,0.9523809523809523,0.9128709291752769,0.24262237548828125,0.9128709291752769
100,4,AdaBoost (Discrete),0,0.4,0.9523809523809523,0.9128709291752769,0.04485344886779785,0.9128709291752769
101,4,AdaBoost (Real),0,0.4,0.9523809523809523,0.9128709291752769,0.03611350059509277,0.9128709291752769
102,4,Logistic Regression (Penalty = L2),0,0.4,1.0,1.0,0.0018165111541748047,1.0
103,4,Naive Bayes,0,0.4,0.9523809523809523,0.9128709291752769,0.01856398582458496,0.9128709291752769
104,4,KNeighbors Classifier,1,0.4,0.9523809523809523,0.9128709291752769,0.03170204162597656,0.9128709291752769
105,4,SVC Classifier,1,0.4,0.7142857142857143,1.0,0.0016415119171142578,0.0
106,4,Decision Tree,1,0.4,0.9047619047619048,0.9309493362512627,0.034223079681396484,0.9309493362512627
107,4,RandomForest,1,0.4,1.0,1.0,0.25135064125061035,1.0
108,4,AdaBoost (Discrete),1,0.4,0.9523809523809523,0.9660917830792959,0.0368351936340332,0.9660917830792959
109,4,AdaBoost (Real),1,0.4,0.9523809523809523,0.9660917830792959,0.040296077728271484,0.9660917830792959
110,4,Logistic Regression (Penalty = L2),1,0.4,1.0,1.0,0.030088424682617188,1.0
111,4,Naive Bayes,1,0.4,1.0,1.0,0.03520512580871582,1.0
112,4,KNeighbors Classifier,2,0.4,0.9473684210526315,0.8944271909999159,0.03490281105041504,0.8944271909999159
113,4,SVC Classifier,2,0.4,0.7368421052631579,1.0,0.03415417671203613,0.0
114,4,Decision Tree,2,0.4,1.0,1.0,0.022237539291381836,1.0
115,4,RandomForest,2,0.4,0.9473684210526315,0.8944271909999159,0.22230815887451172,0.8944271909999159
116,4,AdaBoost (Discrete),2,0.4,1.0,1.0,13.669702529907227,1.0
117,4,AdaBoost (Real),2,0.4,1.0,1.0,14.882836818695068,1.0
118,4,Logistic Regression (Penalty = L2),2,0.4,1.0,1.0,0.03410744667053223,1.0
119,4,Naive Bayes,2,0.4,1.0,1.0,0.0015532970428466797,1.0
120,5,KNeighbors Classifier,0,0.4,1.0,1.0,0.035027265548706055,1.0
121,5,SVC Classifier,0,0.4,0.7142857142857143,1.0,0.002050638198852539,0.0
122,5,Decision Tree,0,0.4,0.9523809523809523,0.9128709291752769,0.000997304916381836,0.9128709291752769
123,5,RandomForest,0,0.4,0.9523809523809523,0.9128709291752769,0.1821446418762207,0.9128709291752769
124,5,AdaBoost (Discrete),0,0.4,0.9523809523809523,0.9128709291752769,0.036425113677978516,0.9128709291752769
125,5,AdaBoost (Real),0,0.4,0.9523809523809523,0.9128709291752769,0.03615689277648926,0.9128709291752769
126,5,Logistic Regression (Penalty = L2),0,0.4,1.0,1.0,0.0011258125305175781,1.0
127,5,Naive Bayes,0,0.4,0.9523809523809523,0.9128709291752769,0.03440570831298828,0.9128709291752769
128,5,KNeighbors Classifier,1,0.4,1.0,1.0,0.03528642654418945,1.0
129,5,SVC Classifier,1,0.4,0.7142857142857143,1.0,0.0020432472229003906,0.0
130,5,Decision Tree,1,0.4,0.8571428571428571,0.8498365855987975,0.03842973709106445,0.8498365855987975
131,5,RandomForest,1,0.4,1.0,1.0,0.20047640800476074,1.0
132,5,AdaBoost (Discrete),1,0.4,0.9523809523809523,0.9660917830792959,0.043619632720947266,0.9660917830792959
133,5,AdaBoost (Real),1,0.4,0.9523809523809523,0.9660917830792959,0.0389096736907959,0.9660917830792959
134,5,Logistic Regression (Penalty = L2),1,0.4,1.0,1.0,0.0012187957763671875,1.0
135,5,Naive Bayes,1,0.4,1.0,1.0,0.03502082824707031,1.0
136,5,KNeighbors Classifier,2,0.4,1.0,1.0,0.003383159637451172,1.0
137,5,SVC Classifier,2,0.4,0.7368421052631579,1.0,0.033591270446777344,0.0
138,5,Decision Tree,2,0.4,1.0,1.0,0.0010492801666259766,1.0
139,5,RandomForest,2,0.4,1.0,1.0,0.25113892555236816,1.0
140,5,AdaBoost (Discrete),2,0.4,1.0,1.0,0.07613015174865723,1.0
141,5,AdaBoost (Real),2,0.4,0.8947368421052632,0.7745966692414834,14.430090427398682,0.7745966692414834
142,5,Logistic Regression (Penalty = L2),2,0.4,1.0,1.0,0.0341494083404541,1.0
143,5,Naive Bayes,2,0.4,1.0,1.0,0.03498196601867676,1.0
144,6,KNeighbors Classifier,0,0.4,1.0,1.0,0.035546064376831055,1.0
145,6,SVC Classifier,0,0.4,0.7142857142857143,1.0,0.033768415451049805,0.0
146,6,Decision Tree,0,0.4,0.9523809523809523,0.9128709291752769,0.0010445117950439453,0.9128709291752769
147,6,RandomForest,0,0.4,1.0,1.0,0.17947125434875488,1.0
148,6,AdaBoost (Discrete),0,0.4,0.9523809523809523,0.9128709291752769,0.03637838363647461,0.9128709291752769
149,6,AdaBoost (Real),0,0.4,0.9523809523809523,0.9128709291752769,0.031067609786987305,0.9128709291752769
150,6,Logistic Regression (Penalty = L2),0,0.4,1.0,1.0,0.0011456012725830078,1.0
151,6,Naive Bayes,0,0.4,0.9523809523809523,0.9128709291752769,0.03902029991149902,0.9128709291752769
152,6,KNeighbors Classifier,1,0.4,0.9523809523809523,0.9128709291752769,0.034117698669433594,0.9128709291752769
153,6,SVC Classifier,1,0.4,0.7142857142857143,1.0,0.001956462860107422,0.0
154,6,Decision Tree,1,0.4,0.9523809523809523,0.9660917830792959,0.0010097026824951172,0.9660917830792959
155,6,RandomForest,1,0.4,1.0,1.0,0.26142430305480957,1.0
156,6,AdaBoost (Discrete),1,0.4,0.9523809523809523,0.9660917830792959,0.04067039489746094,0.9660917830792959
157,6,AdaBoost (Real),1,0.4,0.9523809523809523,0.9660917830792959,0.027576684951782227,0.9660917830792959
158,6,Logistic Regression (Penalty = L2),1,0.4,1.0,1.0,0.0021140575408935547,1.0
159,6,Naive Bayes,1,0.4,1.0,1.0,0.0027437210083007812,1.0
160,6,KNeighbors Classifier,2,0.4,0.9473684210526315,0.8944271909999159,0.03466534614562988,0.8944271909999159
161,6,SVC Classifier,2,0.4,0.7368421052631579,1.0,0.0011284351348876953,0.0
162,6,Decision Tree,2,0.4,0.9473684210526315,0.8944271909999159,0.037017822265625,0.8944271909999159
163,6,RandomForest,2,0.4,1.0,1.0,0.21521782875061035,1.0
164,6,AdaBoost (Discrete),2,0.4,1.0,1.0,0.10869193077087402,1.0
165,6,AdaBoost (Real),2,0.4,1.0,1.0,0.14525985717773438,1.0
166,6,Logistic Regression (Penalty = L2),2,0.4,0.9473684210526315,0.8944271909999159,0.001135110855102539,0.8944271909999159
167,6,Naive Bayes,2,0.4,1.0,1.0,0.0015141963958740234,1.0
168,7,KNeighbors Classifier,0,0.4,0.9523809523809523,0.9128709291752769,0.0033621788024902344,0.9128709291752769
169,7,SVC Classifier,0,0.4,0.7142857142857143,1.0,0.0011432170867919922,0.0
170,7,Decision Tree,0,0.4,0.9523809523809523,0.9128709291752769,0.03400063514709473,0.9128709291752769
171,7,RandomForest,0,0.4,0.9523809523809523,0.9128709291752769,0.2152266502380371,0.9128709291752769
172,7,AdaBoost (Discrete),0,0.4,0.9523809523809523,0.9128709291752769,0.03516674041748047,0.9128709291752769
173,7,AdaBoost (Real),0,0.4,0.9523809523809523,0.9128709291752769,0.06904268264770508,0.9128709291752769
174,7,Logistic Regression (Penalty = L2),0,0.4,0.9523809523809523,0.9128709291752769,0.0012171268463134766,0.9128709291752769
175,7,Naive Bayes,0,0.4,0.9523809523809523,0.9128709291752769,0.0015413761138916016,0.9128709291752769
176,7,KNeighbors Classifier,1,0.4,1.0,1.0,0.03526568412780762,1.0
177,7,SVC Classifier,1,0.4,0.7142857142857143,1.0,0.03374457359313965,0.0
178,7,Decision Tree,1,0.4,1.0,1.0,0.03381538391113281,1.0
179,7,RandomForest,1,0.4,1.0,1.0,0.28445935249328613,1.0
180,7,AdaBoost (Discrete),1,0.4,0.9523809523809523,0.9660917830792959,0.03647470474243164,0.9660917830792959
181,7,AdaBoost (Real),1,0.4,0.9523809523809523,0.9660917830792959,0.036255598068237305,0.9660917830792959
182,7,Logistic Regression (Penalty = L2),1,0.4,1.0,1.0,0.0016298294067382812,1.0
183,7,Naive Bayes,1,0.4,1.0,1.0,0.034891605377197266,1.0
184,7,KNeighbors Classifier,2,0.4,1.0,1.0,0.03462696075439453,1.0
185,7,SVC Classifier,2,0.4,0.7368421052631579,1.0,0.0019178390502929688,0.0
186,7,Decision Tree,2,0.4,1.0,1.0,0.0336911678314209,1.0
187,7,RandomForest,2,0.4,1.0,1.0,0.25071048736572266,1.0
188,7,AdaBoost (Discrete),2,0.4,1.0,1.0,0.0759117603302002,1.0
189,7,AdaBoost (Real),2,0.4,1.0,1.0,0.06144523620605469,1.0
190,7,Logistic Regression (Penalty = L2),2,0.4,1.0,1.0,0.0011892318725585938,1.0
191,7,Naive Bayes,2,0.4,1.0,1.0,0.0015110969543457031,1.0
192,8,KNeighbors Classifier,0,0.4,0.9523809523809523,0.9660917830792959,0.03370809555053711,0.9660917830792959
193,8,SVC Classifier,0,0.4,0.7142857142857143,1.0,0.0011568069458007812,0.0
194,8,Decision Tree,0,0.4,0.8571428571428571,0.7888106377466155,0.03319144248962402,0.7888106377466155
195,8,RandomForest,0,0.4,0.9523809523809523,0.9128709291752769,0.1806480884552002,0.9128709291752769
196,8,AdaBoost (Discrete),0,0.4,0.9523809523809523,0.9128709291752769,0.03522062301635742,0.9128709291752769
197,8,AdaBoost (Real),0,0.4,0.9523809523809523,0.9128709291752769,0.034718990325927734,0.9128709291752769
198,8,Logistic Regression (Penalty = L2),0,0.4,1.0,1.0,0.0016884803771972656,1.0
199,8,Naive Bayes,0,0.4,0.9523809523809523,0.9128709291752769,0.034796953201293945,0.9128709291752769
200,8,KNeighbors Classifier,1,0.4,0.9523809523809523,0.9128709291752769,0.034288644790649414,0.9128709291752769
201,8,SVC Classifier,1,0.4,0.7142857142857143,1.0,0.0011677742004394531,0.0
202,8,Decision Tree,1,0.4,0.9523809523809523,0.9660917830792959,0.033409833908081055,0.9660917830792959
203,8,RandomForest,1,0.4,1.0,1.0,0.24988508224487305,1.0
204,8,AdaBoost (Discrete),1,0.4,0.9523809523809523,0.9660917830792959,0.06859302520751953,0.9660917830792959
205,8,AdaBoost (Real),1,0.4,0.9523809523809523,0.9660917830792959,0.03524303436279297,0.9660917830792959
206,8,Logistic Regression (Penalty = L2),1,0.4,1.0,1.0,0.002008199691772461,1.0
207,8,Naive Bayes,1,0.4,0.9523809523809523,0.9128709291752769,0.0015723705291748047,0.9128709291752769
208,8,KNeighbors Classifier,2,0.4,0.9473684210526315,0.8944271909999159,0.03457355499267578,0.8944271909999159
209,8,SVC Classifier,2,0.4,0.7368421052631579,1.0,0.0011115074157714844,0.0
210,8,Decision Tree,2,0.4,0.8947368421052632,0.7745966692414834,0.0010688304901123047,0.7745966692414834
211,8,RandomForest,2,0.4,0.9473684210526315,0.8944271909999159,0.25020694732666016,0.8944271909999159
212,8,AdaBoost (Discrete),2,0.4,1.0,1.0,12.394996404647827,1.0
213,8,AdaBoost (Real),2,0.4,1.0,1.0,0.07228589057922363,1.0
214,8,Logistic Regression (Penalty = L2),2,0.4,1.0,1.0,0.0019316673278808594,1.0
215,8,Naive Bayes,2,0.4,1.0,1.0,0.0026993751525878906,1.0
216,9,KNeighbors Classifier,0,0.4,1.0,1.0,0.03462982177734375,1.0
217,9,SVC Classifier,0,0.4,0.7142857142857143,1.0,0.03368020057678223,0.0
218,9,Decision Tree,0,0.4,0.9523809523809523,0.9128709291752769,0.03348875045776367,0.9128709291752769
219,9,RandomForest,0,0.4,0.9523809523809523,0.9128709291752769,0.17757081985473633,0.9128709291752769
220,9,AdaBoost (Discrete),0,0.4,0.9523809523809523,0.9128709291752769,0.039832115173339844,0.9128709291752769
221,9,AdaBoost (Real),0,0.4,0.9523809523809523,0.9128709291752769,0.06841921806335449,0.9128709291752769
222,9,Logistic Regression (Penalty = L2),0,0.4,1.0,1.0,0.002100229263305664,1.0
223,9,Naive Bayes,0,0.4,0.9523809523809523,0.9128709291752769,0.03126859664916992,0.9128709291752769
224,9,KNeighbors Classifier,1,0.4,0.9047619047619048,0.8819171036881969,0.03572726249694824,0.8819171036881969
225,9,SVC Classifier,1,0.4,0.7142857142857143,1.0,0.0011289119720458984,0.0
226,9,Decision Tree,1,0.4,0.9523809523809523,0.9660917830792959,0.001798868179321289,0.9660917830792959
227,9,RandomForest,1,0.4,0.9523809523809523,0.9660917830792959,0.2110581398010254,0.9660917830792959
228,9,AdaBoost (Discrete),1,0.4,0.9523809523809523,0.9660917830792959,0.036304473876953125,0.9660917830792959
229,9,AdaBoost (Real),1,0.4,0.9523809523809523,0.9660917830792959,0.03228354454040527,0.9660917830792959
230,9,Logistic Regression (Penalty = L2),1,0.4,1.0,1.0,0.0012202262878417969,1.0
231,9,Naive Bayes,1,0.4,1.0,1.0,0.03506636619567871,1.0
232,9,KNeighbors Classifier,2,0.4,0.9473684210526315,0.8944271909999159,0.034485816955566406,0.8944271909999159
233,9,SVC Classifier,2,0.4,0.7368421052631579,1.0,0.0011556148529052734,0.0
234,9,Decision Tree,2,0.4,1.0,1.0,0.0010211467742919922,1.0
235,9,RandomForest,2,0.4,1.0,1.0,0.17956304550170898,1.0
236,9,AdaBoost (Discrete),2,0.4,1.0,1.0,0.07288384437561035,1.0
237,9,AdaBoost (Real),2,0.4,1.0,1.0,0.03665637969970703,1.0
238,9,Logistic Regression (Penalty = L2),2,0.4,1.0,1.0,0.0017282962799072266,1.0
239,9,Naive Bayes,2,0.4,1.0,1.0,0.001522064208984375,1.0
240,10,KNeighbors Classifier,0,0.4,0.9523809523809523,0.9660917830792959,0.03533196449279785,0.9660917830792959
241,10,SVC Classifier,0,0.4,0.7142857142857143,1.0,0.0012197494506835938,0.0
242,10,Decision Tree,0,0.4,0.9523809523809523,0.9128709291752769,0.033798933029174805,0.9128709291752769
243,10,RandomForest,0,0.4,0.9523809523809523,0.9128709291752769,0.22026705741882324,0.9128709291752769
244,10,AdaBoost (Discrete),0,0.4,0.9523809523809523,0.9128709291752769,0.03540182113647461,0.9128709291752769
245,10,AdaBoost (Real),0,0.4,0.9523809523809523,0.9128709291752769,0.002592802047729492,0.9128709291752769
246,10,Logistic Regression (Penalty = L2),0,0.4,1.0,1.0,0.03405261039733887,1.0
247,10,Naive Bayes,0,0.4,0.9523809523809523,0.9128709291752769,0.0015420913696289062,0.9128709291752769
248,10,KNeighbors Classifier,1,0.4,0.8571428571428571,0.7888106377466155,0.035726070404052734,0.7888106377466155
249,10,SVC Classifier,1,0.4,0.7142857142857143,1.0,0.001722574234008789,0.0
250,10,Decision Tree,1,0.4,0.9523809523809523,0.9660917830792959,0.0338282585144043,0.9660917830792959
251,10,RandomForest,1,0.4,0.9523809523809523,0.9660917830792959,0.2523515224456787,0.9660917830792959
252,10,AdaBoost (Discrete),1,0.4,0.9523809523809523,0.9660917830792959,0.036643266677856445,0.9660917830792959
253,10,AdaBoost (Real),1,0.4,0.9523809523809523,0.9660917830792959,0.036951541900634766,0.9660917830792959
254,10,Logistic Regression (Penalty = L2),1,0.4,1.0,1.0,0.029970884323120117,1.0
255,10,Naive Bayes,1,0.4,0.9523809523809523,0.9128709291752769,0.0346376895904541,0.9128709291752769
256,10,KNeighbors Classifier,2,0.4,0.9473684210526315,0.8944271909999159,0.002920389175415039,0.8944271909999159
257,10,SVC Classifier,2,0.4,0.7368421052631579,1.0,0.038668155670166016,0.0
258,10,Decision Tree,2,0.4,0.8947368421052632,0.8618916073713346,0.03258490562438965,0.8618916073713346
259,10,RandomForest,2,0.4,1.0,1.0,0.20781588554382324,1.0
260,10,AdaBoost (Discrete),2,0.4,1.0,1.0,0.0805060863494873,1.0
261,10,AdaBoost (Real),2,0.4,1.0,1.0,0.06229567527770996,1.0
262,10,Logistic Regression (Penalty = L2),2,0.4,0.9473684210526315,0.8944271909999159,0.001157522201538086,0.8944271909999159
263,10,Naive Bayes,2,0.4,0.8947368421052632,0.7745966692414834,0.03411984443664551,0.7745966692414834
264,11,KNeighbors Classifier,0,0.4,0.8095238095238095,0.6831300510639732,0.035326480865478516,0.6831300510639732
265,11,SVC Classifier,0,0.4,0.7142857142857143,1.0,0.0011377334594726562,0.0
266,11,Decision Tree,0,0.4,0.9523809523809523,0.9128709291752769,0.0018343925476074219,0.9128709291752769
267,11,RandomForest,0,0.4,0.9047619047619048,0.816496580927726,0.21545147895812988,0.816496580927726
268,11,AdaBoost (Discrete),0,0.4,0.9523809523809523,0.9128709291752769,0.03930830955505371,0.9128709291752769
269,11,AdaBoost (Real),0,0.4,0.9523809523809523,0.9128709291752769,0.03567624092102051,0.9128709291752769
270,11,Logistic Regression (Penalty = L2),0,0.4,1.0,1.0,0.03399324417114258,1.0
271,11,Naive Bayes,0,0.4,0.9523809523809523,0.9128709291752769,0.03566312789916992,0.9128709291752769
272,11,KNeighbors Classifier,1,0.4,0.8571428571428571,0.7888106377466155,0.03150534629821777,0.7888106377466155
273,11,SVC Classifier,1,0.4,0.7142857142857143,1.0,0.0011446475982666016,0.0
274,11,Decision Tree,1,0.4,0.7142857142857143,0.6324555320336759,0.0017383098602294922,0.6324555320336759
275,11,RandomForest,1,0.4,0.9523809523809523,0.9128709291752769,0.2420673370361328,0.9128709291752769
276,11,AdaBoost (Discrete),1,0.4,0.9523809523809523,0.9660917830792959,0.002393484115600586,0.9660917830792959
277,11,AdaBoost (Real),1,0.4,0.9523809523809523,0.9660917830792959,0.0027685165405273438,0.9660917830792959
278,11,Logistic Regression (Penalty = L2),1,0.4,0.9523809523809523,0.9660917830792959,0.03740286827087402,0.9660917830792959
279,11,Naive Bayes,1,0.4,1.0,1.0,0.03503680229187012,1.0
280,11,KNeighbors Classifier,2,0.4,0.8421052631578947,0.6324555320336759,0.0020411014556884766,0.6324555320336759
281,11,SVC Classifier,2,0.4,0.7368421052631579,1.0,0.03347420692443848,0.0
282,11,Decision Tree,2,0.4,1.0,1.0,0.03386569023132324,1.0
283,11,RandomForest,2,0.4,0.9473684210526315,0.8944271909999159,0.25330495834350586,0.8944271909999159
284,11,AdaBoost (Discrete),2,0.4,0.9473684210526315,0.8944271909999159,0.03515744209289551,0.8944271909999159
285,11,AdaBoost (Real),2,0.4,0.9473684210526315,0.8944271909999159,0.036379098892211914,0.8944271909999159
286,11,Logistic Regression (Penalty = L2),2,0.4,0.8421052631578947,0.6324555320336759,0.0011839866638183594,0.6324555320336759
287,11,Naive Bayes,2,0.4,0.8947368421052632,0.7745966692414834,0.0015430450439453125,0.7745966692414834
288,12,KNeighbors Classifier,0,0.4,0.9523809523809523,0.9128709291752769,0.0030710697174072266,0.9128709291752769
289,12,SVC Classifier,0,0.4,0.7142857142857143,1.0,0.033518075942993164,0.0
290,12,Decision Tree,0,0.4,0.9523809523809523,0.9128709291752769,0.03498339653015137,0.9128709291752769
291,12,RandomForest,0,0.4,0.9523809523809523,0.9128709291752769,0.25484490394592285,0.9128709291752769
292,12,AdaBoost (Discrete),0,0.4,0.9523809523809523,0.9128709291752769,0.036202192306518555,0.9128709291752769
293,12,AdaBoost (Real),0,0.4,0.9523809523809523,0.9128709291752769,0.0030868053436279297,0.9128709291752769
294,12,Logistic Regression (Penalty = L2),0,0.4,0.9523809523809523,0.9128709291752769,0.001983165740966797,0.9128709291752769
295,12,Naive Bayes,0,0.4,0.9523809523809523,0.9128709291752769,0.03913116455078125,0.9128709291752769
296,12,KNeighbors Classifier,1,0.4,1.0,1.0,0.002706289291381836,1.0
297,12,SVC Classifier,1,0.4,0.7142857142857143,1.0,0.03014349937438965,0.0
298,12,Decision Tree,1,0.4,0.9523809523809523,0.9660917830792959,0.0015833377838134766,0.9660917830792959
299,12,RandomForest,1,0.4,0.9523809523809523,0.9660917830792959,0.25069260597229004,0.9660917830792959
300,12,AdaBoost (Discrete),1,0.4,0.9523809523809523,0.9660917830792959,0.03612875938415527,0.9660917830792959
301,12,AdaBoost (Real),1,0.4,0.9523809523809523,0.9660917830792959,0.040024518966674805,0.9660917830792959
302,12,Logistic Regression (Penalty = L2),1,0.4,1.0,1.0,0.0011799335479736328,1.0
303,12,Naive Bayes,1,0.4,1.0,1.0,0.002588033676147461,1.0
304,12,KNeighbors Classifier,2,0.4,1.0,1.0,0.03530716896057129,1.0
305,12,SVC Classifier,2,0.4,0.7368421052631579,1.0,0.03376173973083496,0.0
306,12,Decision Tree,2,0.4,1.0,1.0,0.02637934684753418,1.0
307,12,RandomForest,2,0.4,1.0,1.0,0.21663117408752441,1.0
308,12,AdaBoost (Discrete),2,0.4,1.0,1.0,12.349730491638184,1.0
309,12,AdaBoost (Real),2,0.4,1.0,1.0,13.672885656356812,1.0
310,12,Logistic Regression (Penalty = L2),2,0.4,1.0,1.0,0.001989603042602539,1.0
311,12,Naive Bayes,2,0.4,1.0,1.0,0.002288341522216797,1.0
