,feat_set_id,classifier,fold_id,feat_th,score,geo_score,exec_t,geo_score_woz
0,0,KNeighbors Classifier,0,0.55,0.6227544910179641,0.7040808008860376,1.8301727771759033,0.7040808008860376
1,0,SVC Classifier,0,0.55,0.592814371257485,0.2902397809308411,1.8040316104888916,0.0
2,0,Decision Tree,0,0.55,0.5149700598802395,0.5639388819380087,0.05407905578613281,0.5639388819380087
3,0,RandomForest,0,0.55,0.592814371257485,0.2438093199376099,0.2615985870361328,0.2438093199376099
4,0,AdaBoost (Discrete),0,0.55,0.437125748502994,0.34329817136034474,32.335886001586914,0.34329817136034474
5,0,AdaBoost (Real),0,0.55,0.6107784431137725,0.6860621925574227,36.12164878845215,0.6860621925574227
6,0,Logistic Regression (Penalty = L2),0,0.55,0.5808383233532934,0.681866975476474,0.2667405605316162,0.681866975476474
7,0,Naive Bayes,0,0.55,0.46706586826347307,0.525271256626669,0.1882033348083496,0.525271256626669
8,0,KNeighbors Classifier,1,0.55,0.5515151515151515,0.654351626975434,1.5502471923828125,0.654351626975434
9,0,SVC Classifier,1,0.55,0.5818181818181818,0.9947780321927768,1.741917371749878,0.0
10,0,Decision Tree,1,0.55,0.5393939393939394,0.6435609748144865,0.05054283142089844,0.6435609748144865
11,0,RandomForest,1,0.55,0.5818181818181818,0.9947780321927768,0.29254794120788574,0.0
12,0,AdaBoost (Discrete),1,0.55,0.5757575757575758,0.623722882326302,33.526010513305664,0.623722882326302
13,0,AdaBoost (Real),1,0.55,0.5454545454545454,0.6435609748144865,40.61648774147034,0.6435609748144865
14,0,Logistic Regression (Penalty = L2),1,0.55,0.5818181818181818,0.6599092704944058,0.18172669410705566,0.6599092704944058
15,0,Naive Bayes,1,0.55,0.49696969696969695,0.5717329581629295,0.14851760864257812,0.5717329581629295
16,0,KNeighbors Classifier,2,0.55,0.5393939393939394,0.6435609748144865,1.8276665210723877,0.6435609748144865
17,0,SVC Classifier,2,0.55,0.6060606060606061,0.46206375934610827,1.7561028003692627,0.46206375934610827
18,0,Decision Tree,2,0.55,0.6060606060606061,0.667788145051214,0.05006003379821777,0.667788145051214
19,0,RandomForest,2,0.55,0.5818181818181818,0.9947780321927768,0.38350391387939453,0.0
20,0,AdaBoost (Discrete),2,0.55,0.43636363636363634,0.5692225725524779,34.80708169937134,0.5692225725524779
21,0,AdaBoost (Real),2,0.55,0.5151515151515151,0.6090747909993272,30.672228574752808,0.6090747909993272
22,0,Logistic Regression (Penalty = L2),2,0.55,0.5393939393939394,0.6399655870870427,0.2509608268737793,0.6399655870870427
23,0,Naive Bayes,2,0.55,0.49696969696969695,0.5836666096061082,0.14105844497680664,0.5836666096061082
24,1,KNeighbors Classifier,0,0.55,0.5748502994011976,0.6438538727521261,0.9764516353607178,0.6438538727521261
25,1,SVC Classifier,0,0.55,0.5988023952095808,0.33333333333333337,0.9115822315216064,0.0
26,1,Decision Tree,0,0.55,0.47904191616766467,0.592385662598489,0.0517125129699707,0.592385662598489
27,1,RandomForest,0,0.55,0.5808383233532934,0.20633095688266445,0.24232101440429688,0.0
28,1,AdaBoost (Discrete),0,0.55,0.6227544910179641,0.7227661245082092,23.24790859222412,0.7227661245082092
29,1,AdaBoost (Real),0,0.55,0.5748502994011976,0.6933612743506347,24.457101106643677,0.6933612743506347
30,1,Logistic Regression (Penalty = L2),0,0.55,0.6586826347305389,0.691156112287384,0.14608430862426758,0.691156112287384
31,1,Naive Bayes,0,0.55,0.47904191616766467,0.4926459905662744,0.12093997001647949,0.4926459905662744
32,1,KNeighbors Classifier,1,0.55,0.5393939393939394,0.5995673624081098,0.8534798622131348,0.5995673624081098
33,1,SVC Classifier,1,0.55,0.5818181818181818,1.0,0.9479622840881348,0.0
34,1,Decision Tree,1,0.55,0.5575757575757576,0.6465063750027435,0.09742879867553711,0.6465063750027435
35,1,RandomForest,1,0.55,0.5818181818181818,1.0,0.24312758445739746,0.0
36,1,AdaBoost (Discrete),1,0.55,0.49696969696969695,0.623722882326302,23.683447122573853,0.623722882326302
37,1,AdaBoost (Real),1,0.55,0.5393939393939394,0.5995673624081098,25.00445866584778,0.5995673624081098
38,1,Logistic Regression (Penalty = L2),1,0.55,0.6363636363636364,0.7241559893721562,0.14701390266418457,0.7241559893721562
39,1,Naive Bayes,1,0.55,0.46060606060606063,0.49794911558783184,0.06090497970581055,0.49794911558783184
40,1,KNeighbors Classifier,2,0.55,0.5333333333333333,0.5582979868919323,0.8914527893066406,0.5582979868919323
41,1,SVC Classifier,2,0.55,0.6,0.3339455162794333,0.8711597919464111,0.0
42,1,Decision Tree,2,0.55,0.6121212121212121,0.6851932084829357,0.04869675636291504,0.6851932084829357
43,1,RandomForest,2,0.55,0.5818181818181818,1.0,0.26381993293762207,0.0
44,1,AdaBoost (Discrete),2,0.55,0.4909090909090909,0.6252939793472078,23.22568130493164,0.6252939793472078
45,1,AdaBoost (Real),2,0.55,0.5454545454545454,0.6566096690099397,24.60084819793701,0.6566096690099397
46,1,Logistic Regression (Penalty = L2),2,0.55,0.5878787878787879,0.6478474254465216,0.244415283203125,0.6478474254465216
47,1,Naive Bayes,2,0.55,0.45454545454545453,0.5137135743406683,0.11456179618835449,0.5137135743406683
48,2,KNeighbors Classifier,0,0.55,0.5149700598802395,0.6422719158302672,1.1027026176452637,0.6422719158302672
49,2,SVC Classifier,0,0.55,0.5748502994011976,0.2052305172662957,1.2260208129882812,0.0
50,2,Decision Tree,0,0.55,0.5808383233532934,0.6790412271880225,0.04400277137756348,0.6790412271880225
51,2,RandomForest,0,0.55,0.592814371257485,0.2438093199376099,0.2436389923095703,0.2438093199376099
52,2,AdaBoost (Discrete),0,0.55,0.437125748502994,0.34329817136034474,25.599074602127075,0.34329817136034474
53,2,AdaBoost (Real),0,0.55,0.6107784431137725,0.6899953899145445,28.283331871032715,0.6899953899145445
54,2,Logistic Regression (Penalty = L2),0,0.55,0.49101796407185627,0.6195172613552342,0.13252758979797363,0.6195172613552342
55,2,Naive Bayes,0,0.55,0.4491017964071856,0.5163666337264373,0.06376504898071289,0.5163666337264373
56,2,KNeighbors Classifier,1,0.55,0.47878787878787876,0.5876858636081601,1.1089904308319092,0.5876858636081601
57,2,SVC Classifier,1,0.55,0.5818181818181818,0.9947780321927768,1.214951992034912,0.0
58,2,Decision Tree,1,0.55,0.5212121212121212,0.6447914959270326,0.04770016670227051,0.6447914959270326
59,2,RandomForest,1,0.55,0.593939393939394,0.24499865251482233,0.291517972946167,0.24499865251482233
60,2,AdaBoost (Discrete),1,0.55,0.41818181818181815,0.3640632172700595,26.348799467086792,0.3640632172700595
61,2,AdaBoost (Real),1,0.55,0.5575757575757576,0.6580278368475444,27.65037178993225,0.6580278368475444
62,2,Logistic Regression (Penalty = L2),1,0.55,0.4666666666666667,0.5904816070919543,0.20110392570495605,0.5904816070919543
63,2,Naive Bayes,1,0.55,0.4303030303030303,0.5233978098358734,0.1528627872467041,0.5233978098358734
64,2,KNeighbors Classifier,2,0.55,0.5272727272727272,0.649061762731388,1.059204339981079,0.649061762731388
65,2,SVC Classifier,2,0.55,0.593939393939394,0.4777858488946908,1.0672707557678223,0.4777858488946908
66,2,Decision Tree,2,0.55,0.5212121212121212,0.6447914959270326,0.04421424865722656,0.6447914959270326
67,2,RandomForest,2,0.55,0.593939393939394,0.24499865251482233,0.30466270446777344,0.24499865251482233
68,2,AdaBoost (Discrete),2,0.55,0.43636363636363634,0.5692225725524779,26.3109393119812,0.5692225725524779
69,2,AdaBoost (Real),2,0.55,0.5575757575757576,0.6544708601462536,32.1423864364624,0.6544708601462536
70,2,Logistic Regression (Penalty = L2),2,0.55,0.503030303030303,0.6141256193608323,0.20952391624450684,0.6141256193608323
71,2,Naive Bayes,2,0.55,0.45454545454545453,0.5489690621400171,0.20166468620300293,0.5489690621400171
72,3,KNeighbors Classifier,0,0.55,0.5449101796407185,0.6638620096654761,1.017934799194336,0.6638620096654761
73,3,SVC Classifier,0,0.55,0.5748502994011976,1.0,1.044217586517334,0.0
74,3,Decision Tree,0,0.55,0.5089820359281437,0.6183349736319939,0.04983687400817871,0.6183349736319939
75,3,RandomForest,0,0.55,0.5868263473053892,1.0,0.4001145362854004,0.0
76,3,AdaBoost (Discrete),0,0.55,0.4431137724550898,0.42597411803627644,26.37958526611328,0.42597411803627644
77,3,AdaBoost (Real),0,0.55,0.5389221556886228,0.6520047870628164,25.6130211353302,0.6520047870628164
78,3,Logistic Regression (Penalty = L2),0,0.55,0.6706586826347305,0.7646089217096638,0.1268782615661621,0.7646089217096638
79,3,Naive Bayes,0,0.55,0.46706586826347307,0.5079252470024034,0.10119795799255371,0.5079252470024034
80,3,KNeighbors Classifier,1,0.55,0.5333333333333333,0.6532765676017525,0.958789587020874,0.6532765676017525
81,3,SVC Classifier,1,0.55,0.5818181818181818,1.0,1.1211822032928467,0.0
82,3,Decision Tree,1,0.55,0.5454545454545454,0.6718851073252299,0.049567222595214844,0.6718851073252299
83,3,RandomForest,1,0.55,0.5878787878787879,1.0,0.38999176025390625,0.0
84,3,AdaBoost (Discrete),1,0.55,0.4909090909090909,0.5620406966354856,23.355796098709106,0.5620406966354856
85,3,AdaBoost (Real),1,0.55,0.5151515151515151,0.6460173382238398,24.79075026512146,0.6460173382238398
86,3,Logistic Regression (Penalty = L2),1,0.55,0.5757575757575758,0.6916576771312541,0.05951714515686035,0.6916576771312541
87,3,Naive Bayes,1,0.55,0.46060606060606063,0.49794911558783184,0.029743432998657227,0.49794911558783184
88,3,KNeighbors Classifier,2,0.55,0.4727272727272727,0.6022541388351689,1.1386027336120605,0.6022541388351689
89,3,SVC Classifier,2,0.55,0.5818181818181818,1.0,0.8352954387664795,0.0
90,3,Decision Tree,2,0.55,0.48484848484848486,0.6165530185826176,0.03958845138549805,0.6165530185826176
91,3,RandomForest,2,0.55,0.5878787878787879,1.0,0.183135986328125,0.0
92,3,AdaBoost (Discrete),2,0.55,0.49696969696969695,0.6192279024801866,23.869547367095947,0.6192279024801866
93,3,AdaBoost (Real),2,0.55,0.5696969696969697,0.6748132389880844,26.91045117378235,0.6748132389880844
94,3,Logistic Regression (Penalty = L2),2,0.55,0.5151515151515151,0.6420781101709965,0.19101524353027344,0.6420781101709965
95,3,Naive Bayes,2,0.55,0.4666666666666667,0.5494768968996689,0.13308072090148926,0.5494768968996689
96,4,KNeighbors Classifier,0,0.55,0.5868263473053892,0.6725401899878516,1.0592517852783203,0.6725401899878516
97,4,SVC Classifier,0,0.55,0.5988023952095808,0.33333333333333337,0.9199607372283936,0.0
98,4,Decision Tree,0,0.55,0.5209580838323353,0.6322347703937959,0.0848991870880127,0.6322347703937959
99,4,RandomForest,0,0.55,0.6167664670658682,0.3387245186237752,0.32177305221557617,0.0
100,4,AdaBoost (Discrete),0,0.55,0.5868263473053892,0.6907344827105579,25.271401405334473,0.6907344827105579
101,4,AdaBoost (Real),0,0.55,0.5748502994011976,0.6883000627148177,25.92168951034546,0.6883000627148177
102,4,Logistic Regression (Penalty = L2),0,0.55,0.6706586826347305,0.696798452656831,0.16223478317260742,0.696798452656831
103,4,Naive Bayes,0,0.55,0.49101796407185627,0.4975727773091722,0.1399085521697998,0.4975727773091722
104,4,KNeighbors Classifier,1,0.55,0.5636363636363636,0.6354453732158798,1.020247220993042,0.6354453732158798
105,4,SVC Classifier,1,0.55,0.5818181818181818,1.0,1.010868787765503,0.0
106,4,Decision Tree,1,0.55,0.5515151515151515,0.6119517051708303,0.04349970817565918,0.6119517051708303
107,4,RandomForest,1,0.55,0.5818181818181818,1.0,0.30693531036376953,0.0
108,4,AdaBoost (Discrete),1,0.55,0.4727272727272727,0.599993191643877,25.221885919570923,0.599993191643877
109,4,AdaBoost (Real),1,0.55,0.5272727272727272,0.6249019454015914,25.294621229171753,0.6249019454015914
110,4,Logistic Regression (Penalty = L2),1,0.55,0.6606060606060606,0.7469007910928608,0.1115105152130127,0.7469007910928608
111,4,Naive Bayes,1,0.55,0.503030303030303,0.5263632998046983,0.13518548011779785,0.5263632998046983
112,4,KNeighbors Classifier,2,0.55,0.5272727272727272,0.5723571212766659,1.0801494121551514,0.5723571212766659
113,4,SVC Classifier,2,0.55,0.6,0.3339455162794333,0.929743766784668,0.0
114,4,Decision Tree,2,0.55,0.5636363636363636,0.6405883644234812,0.04963827133178711,0.6405883644234812
115,4,RandomForest,2,0.55,0.5878787878787879,0.17060302505191033,0.31708812713623047,0.0
116,4,AdaBoost (Discrete),2,0.55,0.509090909090909,0.6398408860731518,26.52222967147827,0.6398408860731518
117,4,AdaBoost (Real),2,0.55,0.5575757575757576,0.6696152079049733,27.176900148391724,0.6696152079049733
118,4,Logistic Regression (Penalty = L2),2,0.55,0.5818181818181818,0.6330335517491583,0.14569711685180664,0.6330335517491583
119,4,Naive Bayes,2,0.55,0.47878787878787876,0.525070018672476,0.12220215797424316,0.525070018672476
120,5,KNeighbors Classifier,0,0.55,0.49700598802395207,0.627158399034931,1.1319808959960938,0.627158399034931
121,5,SVC Classifier,0,0.55,0.5748502994011976,0.2052305172662957,1.1790504455566406,0.0
122,5,Decision Tree,0,0.55,0.6167664670658682,0.6933612743506347,0.044027090072631836,0.6933612743506347
123,5,RandomForest,0,0.55,0.5988023952095808,0.3843166266583483,0.3243753910064697,0.3843166266583483
124,5,AdaBoost (Discrete),0,0.55,0.437125748502994,0.34329817136034474,27.972753763198853,0.34329817136034474
125,5,AdaBoost (Real),0,0.55,0.5988023952095808,0.6663645974514727,31.39717960357666,0.6663645974514727
126,5,Logistic Regression (Penalty = L2),0,0.55,0.49101796407185627,0.606665479498799,0.15352535247802734,0.606665479498799
127,5,Naive Bayes,0,0.55,0.46706586826347307,0.525271256626669,0.12650203704833984,0.525271256626669
128,5,KNeighbors Classifier,1,0.55,0.4909090909090909,0.5949870556711115,1.1006109714508057,0.5949870556711115
129,5,SVC Classifier,1,0.55,0.5818181818181818,0.9947780321927768,1.0497865676879883,0.0
130,5,Decision Tree,1,0.55,0.5212121212121212,0.6501507945768054,0.04528045654296875,0.6501507945768054
131,5,RandomForest,1,0.55,0.5878787878787879,1.0,0.41013455390930176,0.0
132,5,AdaBoost (Discrete),1,0.55,0.4121212121212121,0.3379663528019703,27.256788730621338,0.3379663528019703
133,5,AdaBoost (Real),1,0.55,0.5454545454545454,0.6435609748144865,31.160398721694946,0.6435609748144865
134,5,Logistic Regression (Penalty = L2),1,0.55,0.48484848484848486,0.6025355660438075,0.16954946517944336,0.6025355660438075
135,5,Naive Bayes,1,0.55,0.4909090909090909,0.5685915048814884,0.15407443046569824,0.5685915048814884
136,5,KNeighbors Classifier,2,0.55,0.5212121212121212,0.6428203976645589,1.1128716468811035,0.6428203976645589
137,5,SVC Classifier,2,0.55,0.593939393939394,0.4777858488946908,1.0695757865905762,0.4777858488946908
138,5,Decision Tree,2,0.55,0.4727272727272727,0.5974290868895751,0.04049801826477051,0.5974290868895751
139,5,RandomForest,2,0.55,0.593939393939394,0.24499865251482233,0.3002791404724121,0.24499865251482233
140,5,AdaBoost (Discrete),2,0.55,0.43636363636363634,0.5692225725524779,26.207592010498047,0.5692225725524779
141,5,AdaBoost (Real),2,0.55,0.5454545454545454,0.6537548083052067,29.191574573516846,0.6537548083052067
142,5,Logistic Regression (Penalty = L2),2,0.55,0.4666666666666667,0.5801986042015974,0.12080264091491699,0.5801986042015974
143,5,Naive Bayes,2,0.55,0.49696969696969695,0.5836666096061082,0.08435893058776855,0.5836666096061082
144,6,KNeighbors Classifier,0,0.55,0.5329341317365269,0.6501052721852144,0.9048714637756348,0.6501052721852144
145,6,SVC Classifier,0,0.55,0.5748502994011976,1.0,0.9025421142578125,0.0
146,6,Decision Tree,0,0.55,0.5988023952095808,0.7121097802829861,0.04425454139709473,0.7121097802829861
147,6,RandomForest,0,0.55,0.5868263473053892,1.0,0.3155810832977295,0.0
148,6,AdaBoost (Discrete),0,0.55,0.4491017964071856,0.4281812772201781,24.432096242904663,0.4281812772201781
149,6,AdaBoost (Real),0,0.55,0.5329341317365269,0.6562387030162826,25.466658115386963,0.6562387030162826
150,6,Logistic Regression (Penalty = L2),0,0.55,0.6586826347305389,0.7603677390301081,0.1161348819732666,0.7603677390301081
151,6,Naive Bayes,0,0.55,0.47904191616766467,0.513329112661999,0.08585619926452637,0.513329112661999
152,6,KNeighbors Classifier,1,0.55,0.5333333333333333,0.6511157693429644,0.9282865524291992,0.6511157693429644
153,6,SVC Classifier,1,0.55,0.5818181818181818,1.0,0.8420522212982178,0.0
154,6,Decision Tree,1,0.55,0.5878787878787879,0.705058725271578,0.04111194610595703,0.705058725271578
155,6,RandomForest,1,0.55,0.5878787878787879,1.0,0.24195241928100586,0.0
156,6,AdaBoost (Discrete),1,0.55,0.503030303030303,0.5811072957477805,25.551937103271484,0.5811072957477805
157,6,AdaBoost (Real),1,0.55,0.5818181818181818,0.6986317812058203,26.51911997795105,0.6986317812058203
158,6,Logistic Regression (Penalty = L2),1,0.55,0.5696969696969697,0.6799324004990296,0.13327503204345703,0.6799324004990296
159,6,Naive Bayes,1,0.55,0.48484848484848486,0.5084353217822112,0.0834202766418457,0.5084353217822112
160,6,KNeighbors Classifier,2,0.55,0.48484848484848486,0.6165530185826176,0.8673272132873535,0.6165530185826176
161,6,SVC Classifier,2,0.55,0.5818181818181818,1.0,0.9441366195678711,0.0
162,6,Decision Tree,2,0.55,0.5151515151515151,0.6364554212074361,0.08524394035339355,0.6364554212074361
163,6,RandomForest,2,0.55,0.5878787878787879,1.0,0.3623034954071045,0.0
164,6,AdaBoost (Discrete),2,0.55,0.49696969696969695,0.6216156943658047,24.281955003738403,0.6216156943658047
165,6,AdaBoost (Real),2,0.55,0.6303030303030303,0.7258075448402647,26.884764194488525,0.7258075448402647
166,6,Logistic Regression (Penalty = L2),2,0.55,0.509090909090909,0.6375879065515905,0.09155607223510742,0.6375879065515905
167,6,Naive Bayes,2,0.55,0.48484848484848486,0.5654149497475027,0.12097358703613281,0.5654149497475027
168,7,KNeighbors Classifier,0,0.55,0.5389221556886228,0.6636335643584966,0.6644642353057861,0.6636335643584966
169,7,SVC Classifier,0,0.55,0.592814371257485,0.23951440407302044,0.6276395320892334,0.0
170,7,Decision Tree,0,0.55,0.46107784431137727,0.596232430532171,0.03897857666015625,0.596232430532171
171,7,RandomForest,0,0.55,0.5868263473053892,0.23825046699671878,0.26456117630004883,0.0
172,7,AdaBoost (Discrete),0,0.55,0.5209580838323353,0.6484340430334705,21.333499670028687,0.6484340430334705
173,7,AdaBoost (Real),0,0.55,0.5089820359281437,0.6379736002453904,21.83324909210205,0.6379736002453904
174,7,Logistic Regression (Penalty = L2),0,0.55,0.5688622754491018,0.6788228859423634,0.09178304672241211,0.6788228859423634
175,7,Naive Bayes,0,0.55,0.47904191616766467,0.4926459905662744,0.04566168785095215,0.4926459905662744
176,7,KNeighbors Classifier,1,0.55,0.5393939393939394,0.6667560133520172,0.6955547332763672,0.6667560133520172
177,7,SVC Classifier,1,0.55,0.5818181818181818,1.0,0.6937382221221924,0.0
178,7,Decision Tree,1,0.55,0.6121212121212121,0.7258075448402647,0.04310917854309082,0.7258075448402647
179,7,RandomForest,1,0.55,0.6121212121212121,0.2711630722733202,0.2697756290435791,0.0
180,7,AdaBoost (Discrete),1,0.55,0.5515151515151515,0.6751494688588596,23.2327663898468,0.6751494688588596
181,7,AdaBoost (Real),1,0.55,0.5212121212121212,0.6428203976645589,28.14708375930786,0.6428203976645589
182,7,Logistic Regression (Penalty = L2),1,0.55,0.5575757575757576,0.6797114279776181,0.10742735862731934,0.6797114279776181
183,7,Naive Bayes,1,0.55,0.46060606060606063,0.49794911558783184,0.10645508766174316,0.49794911558783184
184,7,KNeighbors Classifier,2,0.55,0.49696969696969695,0.6294454302574575,0.7876307964324951,0.6294454302574575
185,7,SVC Classifier,2,0.55,0.5878787878787879,0.31065632609231775,0.7526500225067139,0.0
186,7,Decision Tree,2,0.55,0.6424242424242425,0.7357513496049479,0.0028111934661865234,0.7357513496049479
187,7,RandomForest,2,0.55,0.5575757575757576,0.11806756955401494,0.36853599548339844,0.0
188,7,AdaBoost (Discrete),2,0.55,0.5393939393939394,0.6594399180810907,26.701536655426025,0.6594399180810907
189,7,AdaBoost (Real),2,0.55,0.5515151515151515,0.654351626975434,27.866924285888672,0.654351626975434
190,7,Logistic Regression (Penalty = L2),2,0.55,0.503030303030303,0.6299605249474366,0.11194658279418945,0.6299605249474366
191,7,Naive Bayes,2,0.55,0.45454545454545453,0.5137135743406683,0.11151695251464844,0.5137135743406683
192,8,KNeighbors Classifier,0,0.55,0.5688622754491018,0.5835920751217647,0.6648597717285156,0.0
193,8,SVC Classifier,0,0.55,0.5748502994011976,1.0,0.7774884700775146,0.0
194,8,Decision Tree,0,0.55,0.6107784431137725,0.6222766754985801,0.05251884460449219,0.0
195,8,RandomForest,0,0.55,0.5748502994011976,1.0,0.36249566078186035,0.0
196,8,AdaBoost (Discrete),0,0.55,0.5568862275449101,0.5386622363141098,25.24483609199524,0.0
197,8,AdaBoost (Real),0,0.55,0.5868263473053892,0.531609533071195,27.44734501838684,0.0
198,8,Logistic Regression (Penalty = L2),0,0.55,0.6526946107784432,0.657086969148038,0.1343848705291748,0.0
199,8,Naive Bayes,0,0.55,0.437125748502994,0.45158187633432156,0.11921048164367676,0.45158187633432156
200,8,KNeighbors Classifier,1,0.55,0.5636363636363636,0.6681314809189274,0.8861353397369385,0.6681314809189274
201,8,SVC Classifier,1,0.55,0.5818181818181818,1.0,0.8212835788726807,0.0
202,8,Decision Tree,1,0.55,0.6060606060606061,0.6063390625908325,0.06028628349304199,0.0
203,8,RandomForest,1,0.55,0.5878787878787879,0.12126781251816648,0.45552635192871094,0.0
204,8,AdaBoost (Discrete),1,0.55,0.5636363636363636,0.4966184671966844,26.869669198989868,0.0
205,8,AdaBoost (Real),1,0.55,0.5575757575757576,0.35441888366456886,26.61851930618286,0.0
206,8,Logistic Regression (Penalty = L2),1,0.55,0.6181818181818182,0.6069703371632574,0.08775138854980469,0.0
207,8,Naive Bayes,1,0.55,0.45454545454545453,0.4848390555857102,0.09573650360107422,0.4848390555857102
208,8,KNeighbors Classifier,2,0.55,0.5393939393939394,0.6273765725056447,0.7296552658081055,0.6273765725056447
209,8,SVC Classifier,2,0.55,0.5818181818181818,1.0,0.7488315105438232,0.0
210,8,Decision Tree,2,0.55,0.6121212121212121,0.60860858666692,0.05224609375,0.0
211,8,RandomForest,2,0.55,0.5818181818181818,1.0,0.41906166076660156,0.0
212,8,AdaBoost (Discrete),2,0.55,0.5878787878787879,0.5496210815947049,27.44891667366028,0.0
213,8,AdaBoost (Real),2,0.55,0.5636363636363636,0.5036630526336385,26.509505033493042,0.0
214,8,Logistic Regression (Penalty = L2),2,0.55,0.6121212121212121,0.6055806644671464,0.1116182804107666,0.0
215,8,Naive Bayes,2,0.55,0.4121212121212121,0.47553846924800286,0.10608458518981934,0.47553846924800286
216,9,KNeighbors Classifier,0,0.55,0.5089820359281437,0.5873235259135193,0.9111623764038086,0.5873235259135193
217,9,SVC Classifier,0,0.55,0.5748502994011976,1.0,0.910076379776001,0.0
218,9,Decision Tree,0,0.55,0.5568862275449101,0.6779481132130456,0.10097694396972656,0.6779481132130456
219,9,RandomForest,0,0.55,0.5868263473053892,1.0,0.3150937557220459,0.0
220,9,AdaBoost (Discrete),0,0.55,0.4431137724550898,0.42597411803627644,28.361517190933228,0.42597411803627644
221,9,AdaBoost (Real),0,0.55,0.6766467065868264,0.7730371538664003,28.960769653320312,0.7730371538664003
222,9,Logistic Regression (Penalty = L2),0,0.55,0.5808383233532934,0.6908399383584118,0.13312172889709473,0.6908399383584118
223,9,Naive Bayes,0,0.55,0.46706586826347307,0.5079252470024034,0.09545063972473145,0.5079252470024034
224,9,KNeighbors Classifier,1,0.55,0.4666666666666667,0.5428003482719742,0.8979010581970215,0.5428003482719742
225,9,SVC Classifier,1,0.55,0.5818181818181818,1.0,0.9140994548797607,0.0
226,9,Decision Tree,1,0.55,0.5878787878787879,0.705058725271578,0.04781937599182129,0.705058725271578
227,9,RandomForest,1,0.55,0.5878787878787879,1.0,0.3178431987762451,0.0
228,9,AdaBoost (Discrete),1,0.55,0.49696969696969695,0.5579701547631802,27.648422956466675,0.5579701547631802
229,9,AdaBoost (Real),1,0.55,0.5636363636363636,0.6780495352143556,28.578229188919067,0.6780495352143556
230,9,Logistic Regression (Penalty = L2),1,0.55,0.503030303030303,0.6021133265459974,0.21676301956176758,0.6021133265459974
231,9,Naive Bayes,1,0.55,0.46060606060606063,0.49794911558783184,0.10376262664794922,0.49794911558783184
232,9,KNeighbors Classifier,2,0.55,0.4666666666666667,0.5613933701811722,0.7397842407226562,0.5613933701811722
233,9,SVC Classifier,2,0.55,0.5818181818181818,1.0,0.811298131942749,0.0
234,9,Decision Tree,2,0.55,0.49696969696969695,0.6103110761053288,0.08457183837890625,0.6103110761053288
235,9,RandomForest,2,0.55,0.5878787878787879,1.0,0.2821691036224365,0.0
236,9,AdaBoost (Discrete),2,0.55,0.4727272727272727,0.5131324498917512,25.339609622955322,0.5131324498917512
237,9,AdaBoost (Real),2,0.55,0.5696969696969697,0.690588652742531,29.33256196975708,0.690588652742531
238,9,Logistic Regression (Penalty = L2),2,0.55,0.4727272727272727,0.5913589956143608,0.1347513198852539,0.5913589956143608
239,9,Naive Bayes,2,0.55,0.4666666666666667,0.5494768968996689,0.10808134078979492,0.5494768968996689
240,10,KNeighbors Classifier,0,0.55,0.6287425149700598,0.7285951353033073,1.8011860847473145,0.7285951353033073
241,10,SVC Classifier,0,0.55,0.592814371257485,0.2902397809308411,1.8278133869171143,0.0
242,10,Decision Tree,0,0.55,0.5808383233532934,0.6567057769839425,0.060341596603393555,0.6567057769839425
243,10,RandomForest,0,0.55,0.5748502994011976,1.0,0.36034059524536133,0.0
244,10,AdaBoost (Discrete),0,0.55,0.437125748502994,0.34329817136034474,36.053006172180176,0.34329817136034474
245,10,AdaBoost (Real),0,0.55,0.5688622754491018,0.6742049002196551,36.55432105064392,0.6742049002196551
246,10,Logistic Regression (Penalty = L2),0,0.55,0.6167664670658682,0.6971092459418674,0.18680667877197266,0.6971092459418674
247,10,Naive Bayes,0,0.55,0.4550898203592814,0.5193688327767603,0.1934363842010498,0.5193688327767603
248,10,KNeighbors Classifier,1,0.55,0.5878787878787879,0.7016525913497478,1.7376594543457031,0.7016525913497478
249,10,SVC Classifier,1,0.55,0.5818181818181818,0.9947780321927768,1.7096226215362549,0.0
250,10,Decision Tree,1,0.55,0.5878787878787879,0.6916576771312541,0.05733966827392578,0.6916576771312541
251,10,RandomForest,1,0.55,0.5818181818181818,1.0,0.3278796672821045,0.0
252,10,AdaBoost (Discrete),1,0.55,0.5818181818181818,0.5068501662977833,35.54145908355713,0.5068501662977833
253,10,AdaBoost (Real),1,0.55,0.593939393939394,0.6615467691941467,36.02656126022339,0.6615467691941467
254,10,Logistic Regression (Penalty = L2),1,0.55,0.593939393939394,0.6897310440952802,0.16699457168579102,0.6897310440952802
255,10,Naive Bayes,1,0.55,0.4484848484848485,0.5396627039097113,0.14728379249572754,0.5396627039097113
256,10,KNeighbors Classifier,2,0.55,0.5212121212121212,0.6380899444807125,1.6698582172393799,0.6380899444807125
257,10,SVC Classifier,2,0.55,0.6060606060606061,0.46206375934610827,1.6072731018066406,0.46206375934610827
258,10,Decision Tree,2,0.55,0.4727272727272727,0.5701665586475767,0.09564781188964844,0.5701665586475767
259,10,RandomForest,2,0.55,0.5878787878787879,1.0,0.3911771774291992,0.0
260,10,AdaBoost (Discrete),2,0.55,0.43636363636363634,0.5692225725524779,34.08829045295715,0.5692225725524779
261,10,AdaBoost (Real),2,0.55,0.5636363636363636,0.6815851352474145,35.20520281791687,0.6815851352474145
262,10,Logistic Regression (Penalty = L2),2,0.55,0.5454545454545454,0.6636402855832089,0.22242474555969238,0.6636402855832089
263,10,Naive Bayes,2,0.55,0.4666666666666667,0.5613933701811722,0.1488509178161621,0.5613933701811722
264,11,KNeighbors Classifier,0,0.55,0.6287425149700598,0.6999967136458812,1.9449398517608643,0.6999967136458812
265,11,SVC Classifier,0,0.55,0.5868263473053892,0.26495145850196566,1.9267513751983643,0.0
266,11,Decision Tree,0,0.55,0.5868263473053892,0.6761917630820112,0.04182791709899902,0.6761917630820112
267,11,RandomForest,0,0.55,0.5748502994011976,0.24124271543573797,0.3966860771179199,0.24124271543573797
268,11,AdaBoost (Discrete),0,0.55,0.437125748502994,0.34329817136034474,38.50296759605408,0.34329817136034474
269,11,AdaBoost (Real),0,0.55,0.5868263473053892,0.68563427278786,39.453725814819336,0.68563427278786
270,11,Logistic Regression (Penalty = L2),0,0.55,0.6047904191616766,0.6742049002196551,0.11211156845092773,0.6742049002196551
271,11,Naive Bayes,0,0.55,0.4491017964071856,0.5163666337264373,0.16752409934997559,0.5163666337264373
272,11,KNeighbors Classifier,1,0.55,0.5454545454545454,0.6566096690099397,1.7789137363433838,0.6566096690099397
273,11,SVC Classifier,1,0.55,0.5818181818181818,0.9947780321927768,1.757359266281128,0.0
274,11,Decision Tree,1,0.55,0.5212121212121212,0.6075569272759603,0.050302743911743164,0.6075569272759603
275,11,RandomForest,1,0.55,0.5878787878787879,1.0,0.314023494720459,0.0
276,11,AdaBoost (Discrete),1,0.55,0.5757575757575758,0.6169557313153966,34.54086637496948,0.6169557313153966
277,11,AdaBoost (Real),1,0.55,0.48484848484848486,0.5714203649031516,39.05271315574646,0.5714203649031516
278,11,Logistic Regression (Penalty = L2),1,0.55,0.5696969696969697,0.6615467691941467,0.13812494277954102,0.6615467691941467
279,11,Naive Bayes,1,0.55,0.43636363636363634,0.5267316437316311,0.08478569984436035,0.5267316437316311
280,11,KNeighbors Classifier,2,0.55,0.5272727272727272,0.6158806592503815,1.5802302360534668,0.6158806592503815
281,11,SVC Classifier,2,0.55,0.6060606060606061,0.46206375934610827,1.7498741149902344,0.46206375934610827
282,11,Decision Tree,2,0.55,0.5272727272727272,0.6249019454015914,0.08714008331298828,0.6249019454015914
283,11,RandomForest,2,0.55,0.593939393939394,0.24499865251482233,0.2713441848754883,0.24499865251482233
284,11,AdaBoost (Discrete),2,0.55,0.43636363636363634,0.5692225725524779,34.37012434005737,0.5692225725524779
285,11,AdaBoost (Real),2,0.55,0.5333333333333333,0.6398408860731518,35.170204877853394,0.6398408860731518
286,11,Logistic Regression (Penalty = L2),2,0.55,0.5393939393939394,0.6435609748144865,0.15779805183410645,0.6435609748144865
287,11,Naive Bayes,2,0.55,0.45454545454545453,0.5489690621400171,0.16732478141784668,0.5489690621400171
288,12,KNeighbors Classifier,0,0.55,0.49101796407185627,0.5031603023441659,0.42917346954345703,0.0
289,12,SVC Classifier,0,0.55,0.5748502994011976,1.0,0.38768577575683594,0.0
290,12,Decision Tree,0,0.55,0.6047904191616766,0.6180165405913052,0.04668545722961426,0.0
291,12,RandomForest,0,0.55,0.5808383233532934,0.1203858530857692,0.19800662994384766,0.0
292,12,AdaBoost (Discrete),0,0.55,0.5568862275449101,0.5065989657286074,17.037352800369263,0.0
293,12,AdaBoost (Real),0,0.55,0.562874251497006,0.5472813793767886,16.935267686843872,0.0
294,12,Logistic Regression (Penalty = L2),0,0.55,0.6227544910179641,0.6384423980690614,0.09415864944458008,0.0
295,12,Naive Bayes,0,0.55,0.4431137724550898,0.4540361738602457,0.04159688949584961,0.4540361738602457
296,12,KNeighbors Classifier,1,0.55,0.5696969696969697,0.6897310440952802,0.31360578536987305,0.6897310440952802
297,12,SVC Classifier,1,0.55,0.5818181818181818,1.0,0.37212371826171875,0.0
298,12,Decision Tree,1,0.55,0.6242424242424243,0.6264688621903867,0.042708635330200195,0.0
299,12,RandomForest,1,0.55,0.5878787878787879,0.12126781251816648,0.20952272415161133,0.0
300,12,AdaBoost (Discrete),1,0.55,0.6181818181818182,0.6069703371632574,18.219884634017944,0.0
301,12,AdaBoost (Real),1,0.55,0.6242424242424243,0.60380736442456,19.336090564727783,0.0
302,12,Logistic Regression (Penalty = L2),1,0.55,0.6121212121212121,0.6180991576013115,0.10462832450866699,0.0
303,12,Naive Bayes,1,0.55,0.47878787878787876,0.4950491797707047,0.06577754020690918,0.4950491797707047
304,12,KNeighbors Classifier,2,0.55,0.4727272727272727,0.599993191643877,0.3622567653656006,0.599993191643877
305,12,SVC Classifier,2,0.55,0.5818181818181818,1.0,0.33727073669433594,0.0
306,12,Decision Tree,2,0.55,0.5454545454545454,0.5535093034625596,0.0034444332122802734,0.0
307,12,RandomForest,2,0.55,0.5818181818181818,1.0,0.25728893280029297,0.0
308,12,AdaBoost (Discrete),2,0.55,0.6060606060606061,0.6108696789871653,19.06034779548645,0.0
309,12,AdaBoost (Real),2,0.55,0.6,0.509409019374027,20.27712655067444,0.0
310,12,Logistic Regression (Penalty = L2),2,0.55,0.5515151515151515,0.560385459077141,0.07905220985412598,0.0
311,12,Naive Bayes,2,0.55,0.42424242424242425,0.48133829047370646,0.040174007415771484,0.48133829047370646
