,feat_set_id,classifier,fold_id,feat_th,score,geo_score,exec_t,geo_score_woz
0,0,KNeighbors Classifier,0,0.85,0.9656716417910448,0.9653656536675848,10.83690595626831,0.9653656536675848
1,0,SVC Classifier,0,0.85,0.9507462686567164,0.9499874635748394,7.809660196304321,0.9499874635748394
2,0,Decision Tree,0,0.85,0.826865671641791,0.8207252650652087,0.41276001930236816,0.8207252650652087
3,0,RandomForest,0,0.85,0.6925373134328359,0.5721521492825574,0.9172546863555908,0.5721521492825574
4,0,AdaBoost (Discrete),0,0.85,0.9537313432835821,0.9530172947222582,395.2650725841522,0.9530172947222582
5,0,AdaBoost (Real),0,0.85,0.9164179104477612,0.9152620412831807,347.119845867157,0.9152620412831807
6,0,Logistic Regression (Penalty = L2),0,0.85,0.9746268656716418,0.9744421460615832,9.742942571640015,0.9744421460615832
7,0,Naive Bayes,0,0.85,0.9134328358208955,0.912038509416419,0.723677396774292,0.912038509416419
8,0,KNeighbors Classifier,1,0.85,0.9462686567164179,0.9457861801906092,13.9239342212677,0.9457861801906092
9,0,SVC Classifier,1,0.85,0.9477611940298507,0.947322365671173,8.671366453170776,0.947322365671173
10,0,Decision Tree,1,0.85,0.8417910447761194,0.839792443265633,0.35164356231689453,0.839792443265633
11,0,RandomForest,1,0.85,0.7865671641791044,0.7503256048226209,1.1466410160064697,0.7503256048226209
12,0,AdaBoost (Discrete),1,0.85,0.9462686567164179,0.9460742770915458,459.1947720050812,0.9460742770915458
13,0,AdaBoost (Real),1,0.85,0.34626865671641793,0.21609026680821003,404.3767008781433,0.0
14,0,Logistic Regression (Penalty = L2),1,0.85,0.9686567164179104,0.9685316095905262,9.125900983810425,0.9685316095905262
15,0,Naive Bayes,1,0.85,0.9253731343283582,0.924564669937308,0.5841193199157715,0.924564669937308
16,0,KNeighbors Classifier,2,0.85,0.9681818181818181,0.967885046115846,12.387506008148193,0.967885046115846
17,0,SVC Classifier,2,0.85,0.9545454545454546,0.9543048815485738,8.278544425964355,0.9543048815485738
18,0,Decision Tree,2,0.85,0.8303030303030303,0.8278511158615459,0.39832353591918945,0.8278511158615459
19,0,RandomForest,2,0.85,0.7712121212121212,0.7361912044078137,0.965092658996582,0.7361912044078137
20,0,AdaBoost (Discrete),2,0.85,0.9454545454545454,0.9449856012788551,430.5766432285309,0.9449856012788551
21,0,AdaBoost (Real),2,0.85,0.44696969696969696,0.3060189175111857,388.28096771240234,0.0
22,0,Logistic Regression (Penalty = L2),2,0.85,0.9787878787878788,0.9786423791651166,10.23799729347229,0.9786423791651166
23,0,Naive Bayes,2,0.85,0.9212121212121213,0.9207386588919105,0.5636487007141113,0.9207386588919105
24,1,KNeighbors Classifier,0,0.85,0.9671641791044776,0.9667955650596445,13.68247127532959,0.9667955650596445
25,1,SVC Classifier,0,0.85,0.9552238805970149,0.9545892791370986,8.273429870605469,0.9545892791370986
26,1,Decision Tree,0,0.85,0.8552238805970149,0.8483595115981294,0.3173394203186035,0.8483595115981294
27,1,RandomForest,0,0.85,0.6776119402985075,0.5687564116955133,1.0517816543579102,0.5687564116955133
28,1,AdaBoost (Discrete),0,0.85,0.9477611940298507,0.947073030428174,404.8759214878082,0.947073030428174
29,1,AdaBoost (Real),0,0.85,0.764179104477612,0.7402720983162111,352.62586212158203,0.7402720983162111
30,1,Logistic Regression (Penalty = L2),0,0.85,0.9805970149253731,0.9804365966001716,8.280004501342773,0.9804365966001716
31,1,Naive Bayes,0,0.85,0.908955223880597,0.9070721432090902,0.5953004360198975,0.9070721432090902
32,1,KNeighbors Classifier,1,0.85,0.9537313432835821,0.9531360488551255,11.675601720809937,0.9531360488551255
33,1,SVC Classifier,1,0.85,0.9447761194029851,0.9441007613173178,7.403984785079956,0.9441007613173178
34,1,Decision Tree,1,0.85,0.8402985074626865,0.8380025534449046,0.27311110496520996,0.8380025534449046
35,1,RandomForest,1,0.85,0.6686567164179105,0.6139347971310519,0.8732163906097412,0.6139347971310519
36,1,AdaBoost (Discrete),1,0.85,0.9492537313432836,0.9490625080048408,373.70650720596313,0.9490625080048408
37,1,AdaBoost (Real),1,0.85,0.28059701492537314,0.23019371313340084,341.9218668937683,0.0
38,1,Logistic Regression (Penalty = L2),1,0.85,0.9716417910447761,0.9715179482470662,7.981942653656006,0.9715179482470662
39,1,Naive Bayes,1,0.85,0.926865671641791,0.9263574614399159,0.5443367958068848,0.9263574614399159
40,1,KNeighbors Classifier,2,0.85,0.9727272727272728,0.9724694048578066,12.061107873916626,0.9724694048578066
41,1,SVC Classifier,2,0.85,0.953030303030303,0.9525535271458807,7.636912107467651,0.9525535271458807
42,1,Decision Tree,2,0.85,0.8348484848484848,0.8329380939980767,0.2810404300689697,0.8329380939980767
43,1,RandomForest,2,0.85,0.7,0.7236199323579751,0.8960690498352051,0.0
44,1,AdaBoost (Discrete),2,0.85,0.9303030303030303,0.9295757438281415,329.7045648097992,0.9295757438281415
45,1,AdaBoost (Real),2,0.85,0.7727272727272727,0.745059420452549,280.8014633655548,0.745059420452549
46,1,Logistic Regression (Penalty = L2),2,0.85,0.9742424242424242,0.9740757608466152,7.163252592086792,0.9740757608466152
47,1,Naive Bayes,2,0.85,0.9227272727272727,0.9220590066159744,0.43289756774902344,0.9220590066159744
48,2,KNeighbors Classifier,0,0.85,0.9641791044776119,0.9638502244078758,10.16227412223816,0.9638502244078758
49,2,SVC Classifier,0,0.85,0.9537313432835821,0.9531548582883362,6.182779312133789,0.9531548582883362
50,2,Decision Tree,0,0.85,0.8194029850746268,0.8155745019131512,0.23981404304504395,0.8155745019131512
51,2,RandomForest,0,0.85,0.7432835820895523,0.5854030484266988,0.8380353450775146,0.5854030484266988
52,2,AdaBoost (Discrete),0,0.85,0.9507462686567164,0.9500848532458568,304.9298849105835,0.9500848532458568
53,2,AdaBoost (Real),0,0.85,0.8970149253731343,0.8949827311372045,244.00163793563843,0.8949827311372045
54,2,Logistic Regression (Penalty = L2),0,0.85,0.9791044776119403,0.9789176871891386,6.973953723907471,0.9789176871891386
55,2,Naive Bayes,0,0.85,0.9194029850746268,0.9182720632174557,0.41312694549560547,0.9182720632174557
56,2,KNeighbors Classifier,1,0.85,0.9507462686567164,0.950344664448112,9.147578716278076,0.950344664448112
57,2,SVC Classifier,1,0.85,0.9462686567164179,0.9457160282825289,5.636732339859009,0.9457160282825289
58,2,Decision Tree,1,0.85,0.8537313432835821,0.8510029161505143,0.17519402503967285,0.8510029161505143
59,2,RandomForest,1,0.85,0.6761194029850747,0.711154396977715,0.717454195022583,0.0
60,2,AdaBoost (Discrete),1,0.85,0.9373134328358209,0.9371266057842467,250.19658613204956,0.9371266057842467
61,2,AdaBoost (Real),1,0.85,0.282089552238806,0.15572385107347458,227.07359790802002,0.0
62,2,Logistic Regression (Penalty = L2),1,0.85,0.9701492537313433,0.9700580894047669,5.713878631591797,0.9700580894047669
63,2,Naive Bayes,1,0.85,0.935820895522388,0.9352012476937966,0.3483424186706543,0.9352012476937966
64,2,KNeighbors Classifier,2,0.85,0.9621212121212122,0.9618526712168649,7.086554765701294,0.9618526712168649
65,2,SVC Classifier,2,0.85,0.9575757575757575,0.9573628657065242,4.521344184875488,0.9573628657065242
66,2,Decision Tree,2,0.85,0.8318181818181818,0.830191062575993,0.18000245094299316,0.830191062575993
67,2,RandomForest,2,0.85,0.7166666666666667,0.6240227936670055,0.5712051391601562,0.6240227936670055
68,2,AdaBoost (Discrete),2,0.85,0.9424242424242424,0.9418683508897041,221.21641373634338,0.9418683508897041
69,2,AdaBoost (Real),2,0.85,0.6818181818181818,0.6007834308261658,193.54360461235046,0.6007834308261658
70,2,Logistic Regression (Penalty = L2),2,0.85,0.9757575757575757,0.9755871574222122,5.351431131362915,0.9755871574222122
71,2,Naive Bayes,2,0.85,0.9166666666666666,0.9158511381050691,0.3128969669342041,0.9158511381050691
72,3,KNeighbors Classifier,0,0.85,0.9656716417910448,0.9653428023423991,5.435066223144531,0.9653428023423991
73,3,SVC Classifier,0,0.85,0.9462686567164179,0.9452874812152535,3.996412754058838,0.9452874812152535
74,3,Decision Tree,0,0.85,0.8,0.7960776189725955,0.22460603713989258,0.7960776189725955
75,3,RandomForest,0,0.85,0.7149253731343284,0.6589330625373228,0.5757772922515869,0.6589330625373228
76,3,AdaBoost (Discrete),0,0.85,0.9507462686567164,0.9501335144086936,178.9301836490631,0.9501335144086936
77,3,AdaBoost (Real),0,0.85,0.8701492537313433,0.8673876370729648,152.77576684951782,0.8673876370729648
78,3,Logistic Regression (Penalty = L2),0,0.85,0.9791044776119403,0.9789176871891385,4.123961687088013,0.9789176871891385
79,3,Naive Bayes,0,0.85,0.908955223880597,0.9075285280383673,0.2340223789215088,0.9075285280383673
80,3,KNeighbors Classifier,1,0.85,0.9492537313432836,0.948816159496119,4.819502592086792,0.948816159496119
81,3,SVC Classifier,1,0.85,0.9417910447761194,0.940997348321127,3.310622215270996,0.940997348321127
82,3,Decision Tree,1,0.85,0.8477611940298507,0.8455699163632935,0.15704011917114258,0.8455699163632935
83,3,RandomForest,1,0.85,0.7134328358208956,0.5785821457822699,0.49735403060913086,0.5785821457822699
84,3,AdaBoost (Discrete),1,0.85,0.9447761194029851,0.9446324053439966,163.3276777267456,0.9446324053439966
85,3,AdaBoost (Real),1,0.85,0.34776119402985073,0.23894016096523335,139.27046370506287,0.0
86,3,Logistic Regression (Penalty = L2),1,0.85,0.9686567164179104,0.9684162290517161,3.294112205505371,0.9684162290517161
87,3,Naive Bayes,1,0.85,0.926865671641791,0.9261658543250844,0.2760894298553467,0.9261658543250844
88,3,KNeighbors Classifier,2,0.85,0.9636363636363636,0.9631742205288397,4.404465913772583,0.9631742205288397
89,3,SVC Classifier,2,0.85,0.946969696969697,0.9465234470579927,2.972278594970703,0.9465234470579927
90,3,Decision Tree,2,0.85,0.8636363636363636,0.8613830159660992,0.12406229972839355,0.8613830159660992
91,3,RandomForest,2,0.85,0.6636363636363637,0.5095732556733445,0.3806900978088379,0.5095732556733445
92,3,AdaBoost (Discrete),2,0.85,0.9348484848484848,0.9341598364790189,135.12073183059692,0.9341598364790189
93,3,AdaBoost (Real),2,0.85,0.6666666666666666,0.6052225552503319,116.36484742164612,0.6052225552503319
94,3,Logistic Regression (Penalty = L2),2,0.85,0.9787878787878788,0.9786184839035772,3.159844160079956,0.9786184839035772
95,3,Naive Bayes,2,0.85,0.9212121212121213,0.9204585732425252,0.24740195274353027,0.9204585732425252
96,4,KNeighbors Classifier,0,0.85,0.9641791044776119,0.9638700924232081,4.31327748298645,0.9638700924232081
97,4,SVC Classifier,0,0.85,0.9507462686567164,0.9500848532458568,2.9410054683685303,0.9500848532458568
98,4,Decision Tree,0,0.85,0.835820895522388,0.834534706382176,0.1273961067199707,0.834534706382176
99,4,RandomForest,0,0.85,0.755223880597015,0.6849120736364394,0.37518310546875,0.6849120736364394
100,4,AdaBoost (Discrete),0,0.85,0.9537313432835821,0.9529608346776882,137.041424036026,0.9529608346776882
101,4,AdaBoost (Real),0,0.85,0.7611940298507462,0.7325509307862332,112.75005507469177,0.7325509307862332
102,4,Logistic Regression (Penalty = L2),0,0.85,0.9805970149253731,0.9804133885282791,2.8897151947021484,0.9804133885282791
103,4,Naive Bayes,0,0.85,0.9164179104477612,0.9153227797461266,0.21441102027893066,0.9153227797461266
104,4,KNeighbors Classifier,1,0.85,0.9492537313432836,0.9486792221104278,3.3725876808166504,0.9486792221104278
105,4,SVC Classifier,1,0.85,0.9462686567164179,0.9456675933615922,2.413461685180664,0.9456675933615922
106,4,Decision Tree,1,0.85,0.8164179104477612,0.8115144995245562,0.09473872184753418,0.8115144995245562
107,4,RandomForest,1,0.85,0.7313432835820896,0.6876780148765045,0.3057379722595215,0.6876780148765045
108,4,AdaBoost (Discrete),1,0.85,0.9537313432835821,0.9536283112525326,112.62657165527344,0.9536283112525326
109,4,AdaBoost (Real),1,0.85,0.34626865671641793,0.20468729395083415,105.76789569854736,0.0
110,4,Logistic Regression (Penalty = L2),1,0.85,0.9671641791044776,0.9670075318392639,2.4282827377319336,0.9670075318392639
111,4,Naive Bayes,1,0.85,0.9223880597014925,0.9213347513121488,0.17343401908874512,0.9213347513121488
112,4,KNeighbors Classifier,2,0.85,0.9636363636363636,0.9633929002041918,2.650559425354004,0.9633929002041918
113,4,SVC Classifier,2,0.85,0.9515151515151515,0.9512040826667486,1.994762659072876,0.9512040826667486
114,4,Decision Tree,2,0.85,0.8393939393939394,0.8359120895087914,0.08177661895751953,0.8359120895087914
115,4,RandomForest,2,0.85,0.7909090909090909,0.7692854962044489,0.20122218132019043,0.7692854962044489
116,4,AdaBoost (Discrete),2,0.85,0.9287878787878788,0.9277494772617458,98.81478595733643,0.9277494772617458
117,4,AdaBoost (Real),2,0.85,0.65,0.6209583130528475,85.24077081680298,0.6209583130528475
118,4,Logistic Regression (Penalty = L2),2,0.85,0.9757575757575757,0.975540244043066,2.521702527999878,0.975540244043066
119,4,Naive Bayes,2,0.85,0.9151515151515152,0.9142315540424846,0.1737358570098877,0.9142315540424846
120,5,KNeighbors Classifier,0,0.85,0.9656716417910448,0.9652498960456748,2.681096315383911,0.9652498960456748
121,5,SVC Classifier,0,0.85,0.9477611940298507,0.9470686876601109,1.861541748046875,0.9470686876601109
122,5,Decision Tree,0,0.85,0.8582089552238806,0.8538775146897182,0.08450818061828613,0.8538775146897182
123,5,RandomForest,0,0.85,0.6880597014925374,0.7306189254204469,0.212921142578125,0.0
124,5,AdaBoost (Discrete),0,0.85,0.9507462686567164,0.9499431658209695,94.02772188186646,0.9499431658209695
125,5,AdaBoost (Real),0,0.85,0.9014925373134328,0.9001512377676587,87.74404048919678,0.9001512377676587
126,5,Logistic Regression (Penalty = L2),0,0.85,0.9805970149253731,0.9804133885282791,2.438004970550537,0.9804133885282791
127,5,Naive Bayes,0,0.85,0.908955223880597,0.9073458236049766,0.17069697380065918,0.9073458236049766
128,5,KNeighbors Classifier,1,0.85,0.9537313432835821,0.9532199063289974,2.583923578262329,0.9532199063289974
129,5,SVC Classifier,1,0.85,0.9432835820895522,0.9425913757289144,1.7796330451965332,0.9425913757289144
130,5,Decision Tree,1,0.85,0.8328358208955224,0.830624985147346,0.06241631507873535,0.830624985147346
131,5,RandomForest,1,0.85,0.7059701492537314,0.6154341446935433,0.2219407558441162,0.6154341446935433
132,5,AdaBoost (Discrete),1,0.85,0.9343283582089552,0.9336027499087538,82.72566223144531,0.9336027499087538
133,5,AdaBoost (Real),1,0.85,0.282089552238806,0.15572385107347458,80.12059783935547,0.0
134,5,Logistic Regression (Penalty = L2),1,0.85,0.9716417910447761,0.971493535272375,1.8265256881713867,0.971493535272375
135,5,Naive Bayes,1,0.85,0.9223880597014925,0.9216983972896357,0.17725706100463867,0.9216983972896357
136,5,KNeighbors Classifier,2,0.85,0.9621212121212122,0.9618034098564884,2.275834798812866,0.9618034098564884
137,5,SVC Classifier,2,0.85,0.95,0.9495812021462648,1.8033397197723389,0.9495812021462648
138,5,Decision Tree,2,0.85,0.853030303030303,0.8509330823565764,0.07995367050170898,0.8509330823565764
139,5,RandomForest,2,0.85,0.656060606060606,0.5050434176155704,0.18787789344787598,0.5050434176155704
140,5,AdaBoost (Discrete),2,0.85,0.9348484848484848,0.9344088984594731,86.8650267124176,0.9344088984594731
141,5,AdaBoost (Real),2,0.85,0.8621212121212121,0.86045077374314,68.41937446594238,0.86045077374314
142,5,Logistic Regression (Penalty = L2),2,0.85,0.9727272727272728,0.9725667057528543,1.811779260635376,0.9725667057528543
143,5,Naive Bayes,2,0.85,0.9181818181818182,0.9174692191039877,0.14664173126220703,0.9174692191039877
144,6,KNeighbors Classifier,0,0.85,0.9641791044776119,0.9638951706757626,3.2475414276123047,0.9638951706757626
145,6,SVC Classifier,0,0.85,0.9567164179104478,0.9560401328664246,1.8311898708343506,0.9560401328664246
146,6,Decision Tree,0,0.85,0.8432835820895522,0.8395484305766313,0.0673527717590332,0.8395484305766313
147,6,RandomForest,0,0.85,0.7044776119402985,0.7554955103611909,0.2733640670776367,0.0
148,6,AdaBoost (Discrete),0,0.85,0.9567164179104478,0.9562853658154465,97.88882064819336,0.9562853658154465
149,6,AdaBoost (Real),0,0.85,0.7970149253731343,0.7843726398969333,82.8789975643158,0.7843726398969333
150,6,Logistic Regression (Penalty = L2),0,0.85,0.9791044776119403,0.9789176871891385,2.255753755569458,0.9789176871891385
151,6,Naive Bayes,0,0.85,0.9104477611940298,0.9090436636212389,0.18723845481872559,0.9090436636212389
152,6,KNeighbors Classifier,1,0.85,0.9462686567164179,0.9458085685768977,2.8002266883850098,0.9458085685768977
153,6,SVC Classifier,1,0.85,0.9507462686567164,0.9502440509546674,1.6911523342132568,0.9502440509546674
154,6,Decision Tree,1,0.85,0.8552238805970149,0.8502392014998553,0.06607437133789062,0.8502392014998553
155,6,RandomForest,1,0.85,0.7164179104477612,0.7775042687151793,0.1947023868560791,0.0
156,6,AdaBoost (Discrete),1,0.85,0.9402985074626866,0.9399429128245923,93.406001329422,0.9399429128245923
157,6,AdaBoost (Real),1,0.85,0.282089552238806,0.15572385107347458,83.8132381439209,0.0
158,6,Logistic Regression (Penalty = L2),1,0.85,0.9716417910447761,0.9715179482470662,1.7937726974487305,0.9715179482470662
159,6,Naive Bayes,1,0.85,0.9298507462686567,0.9291865926360673,0.16305947303771973,0.9291865926360673
160,6,KNeighbors Classifier,2,0.85,0.9651515151515152,0.9648648810150517,2.7860374450683594,0.9648648810150517
161,6,SVC Classifier,2,0.85,0.9636363636363636,0.9634149525642907,1.7081575393676758,0.9634149525642907
162,6,Decision Tree,2,0.85,0.8515151515151516,0.8497821696605555,0.09164214134216309,0.8497821696605555
163,6,RandomForest,2,0.85,0.6696969696969697,0.6583401028990483,0.17804193496704102,0.0
164,6,AdaBoost (Discrete),2,0.85,0.9303030303030303,0.9294945094464138,87.09986615180969,0.9294945094464138
165,6,AdaBoost (Real),2,0.85,0.6757575757575758,0.529589272305801,78.3283941745758,0.529589272305801
166,6,Logistic Regression (Penalty = L2),2,0.85,0.9787878787878788,0.9786177192166646,2.115342855453491,0.9786177192166646
167,6,Naive Bayes,2,0.85,0.9227272727272727,0.9221633178444335,0.15749669075012207,0.9221633178444335
168,7,KNeighbors Classifier,0,0.85,0.9686567164179104,0.9683933055158714,3.093881368637085,0.9683933055158714
169,7,SVC Classifier,0,0.85,0.9626865671641791,0.9621855870966883,1.9291009902954102,0.9621855870966883
170,7,Decision Tree,0,0.85,0.8432835820895522,0.8391278981442659,0.09319710731506348,0.8391278981442659
171,7,RandomForest,0,0.85,0.7,0.4874340540712875,0.20047497749328613,0.4874340540712875
172,7,AdaBoost (Discrete),0,0.85,0.9537313432835821,0.95316082995885,91.9255895614624,0.95316082995885
173,7,AdaBoost (Real),0,0.85,0.7955223880597015,0.7834285284059003,78.95934319496155,0.7834285284059003
174,7,Logistic Regression (Penalty = L2),0,0.85,0.982089552238806,0.9819346187011799,2.571124315261841,0.9819346187011799
175,7,Naive Bayes,0,0.85,0.9164179104477612,0.9151896745128952,0.16864323616027832,0.9151896745128952
176,7,KNeighbors Classifier,1,0.85,0.9507462686567164,0.9502208490878697,2.9400341510772705,0.9502208490878697
177,7,SVC Classifier,1,0.85,0.9507462686567164,0.9503678693381515,1.648629903793335,0.9503678693381515
178,7,Decision Tree,1,0.85,0.8388059701492537,0.8367649453863335,0.0672147274017334,0.8367649453863335
179,7,RandomForest,1,0.85,0.6895522388059702,0.5179758816386004,0.19324922561645508,0.5179758816386004
180,7,AdaBoost (Discrete),1,0.85,0.9343283582089552,0.9338836150851446,85.46354460716248,0.9338836150851446
181,7,AdaBoost (Real),1,0.85,0.2865671641791045,0.2742092605526665,88.41723895072937,0.0
182,7,Logistic Regression (Penalty = L2),1,0.85,0.9716417910447761,0.9715179482470662,4.437647342681885,0.9715179482470662
183,7,Naive Bayes,1,0.85,0.9298507462686567,0.9292373831258615,0.25267696380615234,0.9292373831258615
184,7,KNeighbors Classifier,2,0.85,0.9666666666666667,0.9663871288818325,4.843982219696045,0.9663871288818325
185,7,SVC Classifier,2,0.85,0.9636363636363636,0.9634149525642907,2.66920804977417,0.9634149525642907
186,7,Decision Tree,2,0.85,0.8424242424242424,0.8388957784035432,0.12274575233459473,0.8388957784035432
187,7,RandomForest,2,0.85,0.7818181818181819,0.7535455700250447,0.3609352111816406,0.7535455700250447
188,7,AdaBoost (Discrete),2,0.85,0.9424242424242424,0.9419664162169071,151.7759189605713,0.9419664162169071
189,7,AdaBoost (Real),2,0.85,0.41515151515151516,0.2769512258216392,149.43079614639282,0.0
190,7,Logistic Regression (Penalty = L2),2,0.85,0.9757575757575757,0.975540244043066,4.866024971008301,0.975540244043066
191,7,Naive Bayes,2,0.85,0.9242424242424242,0.9237410519220602,0.2506277561187744,0.9237410519220602
192,8,KNeighbors Classifier,0,0.85,0.9671641791044776,0.9668915773386771,3.454124689102173,0.9668915773386771
193,8,SVC Classifier,0,0.85,0.9402985074626866,0.9393599106684011,2.4201650619506836,0.9393599106684011
194,8,Decision Tree,0,0.85,0.8134328358208955,0.8070068047305273,0.09013485908508301,0.8070068047305273
195,8,RandomForest,0,0.85,0.7149253731343284,0.7615587175136671,0.32922911643981934,0.0
196,8,AdaBoost (Discrete),0,0.85,0.9447761194029851,0.9439638000085395,113.84180402755737,0.9439638000085395
197,8,AdaBoost (Real),0,0.85,0.8985074626865671,0.8978092773045027,107.49224328994751,0.8978092773045027
198,8,Logistic Regression (Penalty = L2),0,0.85,0.9805970149253731,0.9804133885282791,3.005199670791626,0.9804133885282791
199,8,Naive Bayes,0,0.85,0.9074626865671642,0.9060158584780937,0.2259371280670166,0.9060158584780937
200,8,KNeighbors Classifier,1,0.85,0.9477611940298507,0.9473792319302625,3.094587564468384,0.9473792319302625
201,8,SVC Classifier,1,0.85,0.9432835820895522,0.9426108055318348,2.0301713943481445,0.9426108055318348
202,8,Decision Tree,1,0.85,0.8253731343283582,0.8223962495854434,0.09302806854248047,0.8223962495854434
203,8,RandomForest,1,0.85,0.6716417910447762,0.47368041200601263,0.291475772857666,0.47368041200601263
204,8,AdaBoost (Discrete),1,0.85,0.9507462686567164,0.9504195926710839,109.43656373023987,0.9504195926710839
205,8,AdaBoost (Real),1,0.85,0.3522388059701492,0.27850805366256237,112.11573362350464,0.0
206,8,Logistic Regression (Penalty = L2),1,0.85,0.9686567164179104,0.9684850354938194,3.3211405277252197,0.9684850354938194
207,8,Naive Bayes,1,0.85,0.9194029850746268,0.9186811140877953,0.22186970710754395,0.9186811140877953
208,8,KNeighbors Classifier,2,0.85,0.9651515151515152,0.9648383042263254,3.717758893966675,0.9648383042263254
209,8,SVC Classifier,2,0.85,0.9424242424242424,0.9417898105865959,2.448443651199341,0.9417898105865959
210,8,Decision Tree,2,0.85,0.843939393939394,0.8420558048506348,0.13433361053466797,0.8420558048506348
211,8,RandomForest,2,0.85,0.7454545454545455,0.6575650836861661,0.394350528717041,0.6575650836861661
212,8,AdaBoost (Discrete),2,0.85,0.9378787878787879,0.9364880755000006,115.59581112861633,0.9364880755000006
213,8,AdaBoost (Real),2,0.85,0.7136363636363636,0.6805494954173288,104.56123542785645,0.6805494954173288
214,8,Logistic Regression (Penalty = L2),2,0.85,0.9727272727272728,0.9725912132232986,3.1425588130950928,0.9725912132232986
215,8,Naive Bayes,2,0.85,0.9166666666666666,0.9158995843035534,0.16887855529785156,0.9158995843035534
