,feat_set_id,classifier,fold_id,feat_th,score,geo_score,exec_t,geo_score_woz
0,0,KNeighbors Classifier,0,0.7,0.6069364161849711,0.5610960118255495,1.9998888969421387,0.0
1,0,SVC Classifier,0,0.7,0.49710982658959535,1.0,2.202623128890991,0.0
2,0,Decision Tree,0,0.7,0.630057803468208,0.7079297532579055,0.32037997245788574,0.0
3,0,RandomForest,0,0.7,0.5491329479768786,0.422390949677227,1.3867592811584473,0.0
4,0,AdaBoost (Discrete),0,0.7,0.6936416184971098,0.5288050054837478,129.78343772888184,0.0
5,0,AdaBoost (Real),0,0.7,0.6416184971098265,0.7129305177661308,155.86099410057068,0.0
6,0,Logistic Regression (Penalty = L2),0,0.7,0.6358381502890174,0.45469917304765256,2.7985963821411133,0.0
7,0,Naive Bayes,0,0.7,0.21965317919075145,0.3991668535408312,0.7214961051940918,0.0
8,0,KNeighbors Classifier,1,0.7,0.6428571428571429,0.5409869360113657,2.1358509063720703,0.0
9,0,SVC Classifier,1,0.7,0.5119047619047619,1.0,2.353383779525757,0.0
10,0,Decision Tree,1,0.7,0.6130952380952381,0.5459256940929856,0.17659282684326172,0.0
11,0,RandomForest,1,0.7,0.5535714285714286,0.5595642461260143,1.2614400386810303,0.0
12,0,AdaBoost (Discrete),1,0.7,0.7202380952380952,0.7795003950179016,150.5981273651123,0.0
13,0,AdaBoost (Real),1,0.7,0.6666666666666666,0.798079928364319,181.84899044036865,0.0
14,0,Logistic Regression (Penalty = L2),1,0.7,0.625,0.4470046280749025,3.06921648979187,0.0
15,0,Naive Bayes,1,0.7,0.25,0.4181698984778722,0.6827929019927979,0.0
16,0,KNeighbors Classifier,2,0.7,0.6748466257668712,0.5747747285269627,2.105638265609741,0.0
17,0,SVC Classifier,2,0.7,0.5153374233128835,1.0,2.5855700969696045,0.0
18,0,Decision Tree,2,0.7,0.558282208588957,0.5606002804043368,0.15694785118103027,0.0
19,0,RandomForest,2,0.7,0.5521472392638037,0.5395313323208076,1.158515453338623,0.0
20,0,AdaBoost (Discrete),2,0.7,0.7177914110429447,0.674637725508176,92.93627285957336,0.0
21,0,AdaBoost (Real),2,0.7,0.5644171779141104,0.5356036410340865,149.27581524848938,0.0
22,0,Logistic Regression (Penalty = L2),2,0.7,0.6932515337423313,0.6149834196279631,3.0128371715545654,0.0
23,0,Naive Bayes,2,0.7,0.25766871165644173,0.4715705532707429,0.47296714782714844,0.0
24,1,KNeighbors Classifier,0,0.7,0.5549132947976878,0.5643208209417312,2.142303228378296,0.0
25,1,SVC Classifier,0,0.7,0.49710982658959535,1.0,2.121631145477295,0.0
26,1,Decision Tree,0,0.7,0.6127167630057804,0.5192970808979485,0.3216731548309326,0.0
27,1,RandomForest,0,0.7,0.5549132947976878,0.48438841363348917,1.2827551364898682,0.0
28,1,AdaBoost (Discrete),0,0.7,0.6936416184971098,0.5369109580622465,158.91964292526245,0.0
29,1,AdaBoost (Real),0,0.7,0.5953757225433526,0.6329691034842289,171.7125701904297,0.0
30,1,Logistic Regression (Penalty = L2),0,0.7,0.6184971098265896,0.4725653855550048,2.78281307220459,0.0
31,1,Naive Bayes,0,0.7,0.24277456647398843,0.40534831115499803,0.5944929122924805,0.0
32,1,KNeighbors Classifier,1,0.7,0.6369047619047619,0.4886551474651264,1.965221881866455,0.0
33,1,SVC Classifier,1,0.7,0.5119047619047619,1.0,1.8588550090789795,0.0
34,1,Decision Tree,1,0.7,0.6488095238095238,0.5986989540686087,0.1535177230834961,0.0
35,1,RandomForest,1,0.7,0.5476190476190477,0.575581947444966,1.2390847206115723,0.0
36,1,AdaBoost (Discrete),1,0.7,0.7083333333333334,0.5828922071764386,145.13238072395325,0.0
37,1,AdaBoost (Real),1,0.7,0.6130952380952381,0.52871435884137,150.50909662246704,0.0
38,1,Logistic Regression (Penalty = L2),1,0.7,0.7023809523809523,0.6292237188431867,2.562166690826416,0.0
39,1,Naive Bayes,1,0.7,0.2619047619047619,0.4410714231202338,0.6885831356048584,0.0
40,1,KNeighbors Classifier,2,0.7,0.5644171779141104,0.5568356481270701,1.7296838760375977,0.0
41,1,SVC Classifier,2,0.7,0.5153374233128835,1.0,1.8762145042419434,0.0
42,1,Decision Tree,2,0.7,0.5766871165644172,0.5495203128738918,0.14425945281982422,0.0
43,1,RandomForest,2,0.7,0.5705521472392638,0.4069475124088966,1.090576171875,0.0
44,1,AdaBoost (Discrete),2,0.7,0.7239263803680982,0.7503272149014625,160.45301628112793,0.0
45,1,AdaBoost (Real),2,0.7,0.558282208588957,0.7278093672809528,172.9075527191162,0.0
46,1,Logistic Regression (Penalty = L2),2,0.7,0.6932515337423313,0.5280720125556105,2.5679469108581543,0.0
47,1,Naive Bayes,2,0.7,0.27607361963190186,0.47369883722309636,0.5240349769592285,0.0
48,2,KNeighbors Classifier,0,0.7,0.6242774566473989,0.4643480292495597,1.5025105476379395,0.0
49,2,SVC Classifier,0,0.7,0.5028901734104047,0.5227579585747102,1.9682223796844482,0.0
50,2,Decision Tree,0,0.7,0.6647398843930635,0.626913710631917,0.15205621719360352,0.0
51,2,RandomForest,0,0.7,0.5549132947976878,0.3792258758532711,1.0459799766540527,0.0
52,2,AdaBoost (Discrete),0,0.7,0.7398843930635838,0.593330032251681,175.8302845954895,0.0
53,2,AdaBoost (Real),0,0.7,0.6242774566473989,0.7244007043050418,194.83564567565918,0.0
54,2,Logistic Regression (Penalty = L2),0,0.7,0.6820809248554913,0.5967260731744631,4.825406074523926,0.0
55,2,Naive Bayes,0,0.7,0.2832369942196532,0.46376858100982044,0.6689114570617676,0.0
56,2,KNeighbors Classifier,1,0.7,0.6488095238095238,0.5241923835179018,2.2007617950439453,0.0
57,2,SVC Classifier,1,0.7,0.5238095238095238,0.6933612743506347,2.7787702083587646,0.0
58,2,Decision Tree,1,0.7,0.5892857142857143,0.6484132710521986,0.17340731620788574,0.0
59,2,RandomForest,1,0.7,0.5535714285714286,0.6613425865923768,1.3006198406219482,0.0
60,2,AdaBoost (Discrete),1,0.7,0.7619047619047619,0.7205875489128999,213.2012333869934,0.0
61,2,AdaBoost (Real),1,0.7,0.6547619047619048,0.7541912785069493,214.4825837612152,0.0
62,2,Logistic Regression (Penalty = L2),1,0.7,0.7380952380952381,0.7320013364107395,4.3457159996032715,0.0
63,2,Naive Bayes,1,0.7,0.25,0.4181698984778722,0.6480989456176758,0.0
64,2,KNeighbors Classifier,2,0.7,0.7055214723926381,0.6542728385368908,1.6149804592132568,0.0
65,2,SVC Classifier,2,0.7,0.5337423312883436,0.7937005259840998,2.115624189376831,0.0
66,2,Decision Tree,2,0.7,0.5828220858895705,0.5879409628627946,0.2874159812927246,0.0
67,2,RandomForest,2,0.7,0.5705521472392638,0.6803749333171202,1.1736633777618408,0.0
68,2,AdaBoost (Discrete),2,0.7,0.7484662576687117,0.7821516358838347,208.35784554481506,0.0
69,2,AdaBoost (Real),2,0.7,0.6319018404907976,0.8243501461227469,203.55716347694397,0.0
70,2,Logistic Regression (Penalty = L2),2,0.7,0.7177914110429447,0.7172960229068771,3.965043306350708,0.0
71,2,Naive Bayes,2,0.7,0.294478527607362,0.5243950337039179,0.481259822845459,0.0
72,3,KNeighbors Classifier,0,0.7,0.5895953757225434,0.4043347424665647,1.4991121292114258,0.0
73,3,SVC Classifier,0,0.7,0.49710982658959535,1.0,1.3425872325897217,0.0
74,3,Decision Tree,0,0.7,0.6358381502890174,0.5801624021601052,0.14856386184692383,0.0
75,3,RandomForest,0,0.7,0.5375722543352601,0.5796499174725646,0.987372875213623,0.0
76,3,AdaBoost (Discrete),0,0.7,0.7052023121387283,0.6528499594054373,123.28831553459167,0.0
77,3,AdaBoost (Real),0,0.7,0.6647398843930635,0.7482392084546236,138.40577125549316,0.0
78,3,Logistic Regression (Penalty = L2),0,0.7,0.5491329479768786,0.2593717585434615,1.903365135192871,0.0
79,3,Naive Bayes,0,0.7,0.23121387283236994,0.38977893923086965,0.5117628574371338,0.0
80,3,KNeighbors Classifier,1,0.7,0.6130952380952381,0.5049896121217647,1.2388226985931396,0.0
81,3,SVC Classifier,1,0.7,0.5119047619047619,1.0,1.3136651515960693,0.0
82,3,Decision Tree,1,0.7,0.6011904761904762,0.48681767304251106,0.1315159797668457,0.48681767304251106
83,3,RandomForest,1,0.7,0.5595238095238095,0.5942189340961133,0.9574434757232666,0.0
84,3,AdaBoost (Discrete),1,0.7,0.6964285714285714,0.7432215829237611,105.25398325920105,0.0
85,3,AdaBoost (Real),1,0.7,0.6666666666666666,0.798079928364319,127.67870998382568,0.0
86,3,Logistic Regression (Penalty = L2),1,0.7,0.6011904761904762,0.37341848563228647,1.6429388523101807,0.0
87,3,Naive Bayes,1,0.7,0.2619047619047619,0.4410714231202338,0.5063779354095459,0.0
88,3,KNeighbors Classifier,2,0.7,0.6380368098159509,0.5146035479682434,1.1089940071105957,0.0
89,3,SVC Classifier,2,0.7,0.5153374233128835,1.0,1.4671225547790527,0.0
90,3,Decision Tree,2,0.7,0.5276073619631901,0.55375722220055,0.13170242309570312,0.0
91,3,RandomForest,2,0.7,0.6012269938650306,0.9135945690055858,0.9575843811035156,0.0
92,3,AdaBoost (Discrete),2,0.7,0.7361963190184049,0.7010056025596615,112.71272373199463,0.0
93,3,AdaBoost (Real),2,0.7,0.588957055214724,0.8231583071399764,123.86902976036072,0.0
94,3,Logistic Regression (Penalty = L2),2,0.7,0.6134969325153374,0.5068293502853337,1.7843024730682373,0.0
95,3,Naive Bayes,2,0.7,0.2822085889570552,0.48870614528562994,0.4006025791168213,0.0
96,4,KNeighbors Classifier,0,0.7,0.6184971098265896,0.5625348140278511,0.9509851932525635,0.0
97,4,SVC Classifier,0,0.7,0.49710982658959535,1.0,1.2106854915618896,0.0
98,4,Decision Tree,0,0.7,0.5953757225433526,0.5143513047695032,0.11698341369628906,0.0
99,4,RandomForest,0,0.7,0.5780346820809249,0.6914459382987216,0.9121222496032715,0.0
100,4,AdaBoost (Discrete),0,0.7,0.6936416184971098,0.6292237188431867,104.57106447219849,0.0
101,4,AdaBoost (Real),0,0.7,0.6358381502890174,0.6915925896742248,117.11866068840027,0.0
102,4,Logistic Regression (Penalty = L2),0,0.7,0.6358381502890174,0.45469917304765256,1.8016026020050049,0.0
103,4,Naive Bayes,0,0.7,0.24277456647398843,0.4168748588544191,0.39203643798828125,0.0
104,4,KNeighbors Classifier,1,0.7,0.6428571428571429,0.5409869360113657,0.8792080879211426,0.0
105,4,SVC Classifier,1,0.7,0.5119047619047619,1.0,1.1582307815551758,0.0
106,4,Decision Tree,1,0.7,0.5654761904761905,0.5390983997661893,0.16864514350891113,0.0
107,4,RandomForest,1,0.7,0.5654761904761905,0.4966753529735609,0.7416439056396484,0.0
108,4,AdaBoost (Discrete),1,0.7,0.7023809523809523,0.7584523724087568,109.39795303344727,0.0
109,4,AdaBoost (Real),1,0.7,0.6309523809523809,0.7135385621411178,120.76541876792908,0.0
110,4,Logistic Regression (Penalty = L2),1,0.7,0.625,0.4470046280749025,2.149240016937256,0.0
111,4,Naive Bayes,1,0.7,0.25595238095238093,0.42752689377842096,0.26698851585388184,0.0
112,4,KNeighbors Classifier,2,0.7,0.6748466257668712,0.5836775926580572,1.048358678817749,0.0
113,4,SVC Classifier,2,0.7,0.5153374233128835,1.0,1.142590045928955,0.0
114,4,Decision Tree,2,0.7,0.6073619631901841,0.5088121073651338,0.15257859230041504,0.5088121073651338
115,4,RandomForest,2,0.7,0.588957055214724,0.7521594538461184,1.0606284141540527,0.0
116,4,AdaBoost (Discrete),2,0.7,0.7239263803680982,0.5976118367256645,104.80314469337463,0.0
117,4,AdaBoost (Real),2,0.7,0.6196319018404908,0.6661413349965102,128.6753249168396,0.0
118,4,Logistic Regression (Penalty = L2),2,0.7,0.6932515337423313,0.6149834196279631,2.543980598449707,0.0
119,4,Naive Bayes,2,0.7,0.25153374233128833,0.4804215860085767,0.6136798858642578,0.0
120,5,KNeighbors Classifier,0,0.7,0.5491329479768786,0.5634853938035123,1.2548854351043701,0.0
121,5,SVC Classifier,0,0.7,0.49710982658959535,1.0,1.2551791667938232,0.0
122,5,Decision Tree,0,0.7,0.5895953757225434,0.520099367832348,0.3214385509490967,0.0
123,5,RandomForest,0,0.7,0.5780346820809249,0.8746954073710493,1.2567896842956543,0.0
124,5,AdaBoost (Discrete),0,0.7,0.6994219653179191,0.6484664342099989,1197.3817262649536,0.0
125,5,AdaBoost (Real),0,0.7,0.5953757225433526,0.6329691034842289,108.35554027557373,0.0
126,5,Logistic Regression (Penalty = L2),0,0.7,0.6242774566473989,0.5103988469320805,1.722369909286499,0.0
127,5,Naive Bayes,0,0.7,0.24855491329479767,0.35097626525886044,0.4524834156036377,0.35097626525886044
128,5,KNeighbors Classifier,1,0.7,0.6309523809523809,0.5299961363543438,0.8185596466064453,0.0
129,5,SVC Classifier,1,0.7,0.5119047619047619,1.0,0.9018251895904541,0.0
130,5,Decision Tree,1,0.7,0.5714285714285714,0.5959931544261334,0.11617922782897949,0.0
131,5,RandomForest,1,0.7,0.5535714285714286,0.6646247845960803,0.7006967067718506,0.0
132,5,AdaBoost (Discrete),1,0.7,0.6845238095238095,0.648273402820021,98.45941662788391,0.0
133,5,AdaBoost (Real),1,0.7,0.6130952380952381,0.52871435884137,105.07149457931519,0.0
134,5,Logistic Regression (Penalty = L2),1,0.7,0.7083333333333334,0.5826391483385842,1.6257236003875732,0.0
135,5,Naive Bayes,1,0.7,0.2619047619047619,0.4711206761990738,0.3341710567474365,0.0
136,5,KNeighbors Classifier,2,0.7,0.5705521472392638,0.5576864447113838,0.7721669673919678,0.0
137,5,SVC Classifier,2,0.7,0.5153374233128835,1.0,0.8823378086090088,0.0
138,5,Decision Tree,2,0.7,0.5766871165644172,0.5529142192667282,0.1076819896697998,0.0
139,5,RandomForest,2,0.7,0.6012269938650306,0.7909313908842954,0.6639776229858398,0.0
140,5,AdaBoost (Discrete),2,0.7,0.6993865030674846,0.6312044247764963,96.69776487350464,0.0
141,5,AdaBoost (Real),2,0.7,0.6196319018404908,0.6814971419300424,99.19470071792603,0.0
142,5,Logistic Regression (Penalty = L2),2,0.7,0.6871165644171779,0.5768012128355466,1.4311320781707764,0.0
143,5,Naive Bayes,2,0.7,0.3128834355828221,0.5226137301342834,0.35749101638793945,0.5226137301342834
144,6,KNeighbors Classifier,0,0.7,0.6358381502890174,0.6022117713171975,1.1609163284301758,0.0
145,6,SVC Classifier,0,0.7,0.49710982658959535,1.0,1.3494384288787842,0.0
146,6,Decision Tree,0,0.7,0.6184971098265896,0.6816058512971069,0.17383217811584473,0.0
147,6,RandomForest,0,0.7,0.5606936416184971,0.41799054169593336,0.7003355026245117,0.0
148,6,AdaBoost (Discrete),0,0.7,0.6936416184971098,0.779181210194917,98.80221772193909,0.0
149,6,AdaBoost (Real),0,0.7,0.5953757225433526,0.6329691034842289,106.08150291442871,0.0
150,6,Logistic Regression (Penalty = L2),0,0.7,0.6820809248554913,0.5246791361039986,2.2663333415985107,0.0
151,6,Naive Bayes,0,0.7,0.23121387283236994,0.38259785858810896,0.30696797370910645,0.0
152,6,KNeighbors Classifier,1,0.7,0.6428571428571429,0.5632079773129263,1.1875865459442139,0.0
153,6,SVC Classifier,1,0.7,0.5119047619047619,1.0,1.437525987625122,0.0
154,6,Decision Tree,1,0.7,0.5952380952380952,0.5452203472444174,0.19732332229614258,0.0
155,6,RandomForest,1,0.7,0.5476190476190477,0.6350109599627048,0.7074141502380371,0.0
156,6,AdaBoost (Discrete),1,0.7,0.7380952380952381,0.7236474897803616,99.62040996551514,0.0
157,6,AdaBoost (Real),1,0.7,0.6130952380952381,0.52871435884137,103.7078697681427,0.0
158,6,Logistic Regression (Penalty = L2),1,0.7,0.7023809523809523,0.6554206359345038,2.246525287628174,0.0
159,6,Naive Bayes,1,0.7,0.25,0.4181698984778722,0.384418249130249,0.0
160,6,KNeighbors Classifier,2,0.7,0.656441717791411,0.5498478108749074,1.3514626026153564,0.0
161,6,SVC Classifier,2,0.7,0.5153374233128835,1.0,1.4599206447601318,0.0
162,6,Decision Tree,2,0.7,0.5705521472392638,0.657933224657568,0.0035696029663085938,0.0
163,6,RandomForest,2,0.7,0.5766871165644172,0.4388458482832188,0.8016054630279541,0.0
164,6,AdaBoost (Discrete),2,0.7,0.754601226993865,0.8987197188785216,100.42797231674194,0.0
165,6,AdaBoost (Real),2,0.7,0.6196319018404908,0.7047409450965496,103.38895225524902,0.0
166,6,Logistic Regression (Penalty = L2),2,0.7,0.6993865030674846,0.6813112530238538,1.956895112991333,0.0
167,6,Naive Bayes,2,0.7,0.25766871165644173,0.4715705532707429,0.4348602294921875,0.0
168,7,KNeighbors Classifier,0,0.7,0.6242774566473989,0.4643480292495597,1.6215336322784424,0.0
169,7,SVC Classifier,0,0.7,0.5028901734104047,0.5227579585747102,1.8232498168945312,0.0
170,7,Decision Tree,0,0.7,0.5895953757225434,0.6309491290779625,0.1940450668334961,0.0
171,7,RandomForest,0,0.7,0.5375722543352601,0.5384101761911863,0.6755595207214355,0.0
172,7,AdaBoost (Discrete),0,0.7,0.7341040462427746,0.5909222007407172,125.78384780883789,0.0
173,7,AdaBoost (Real),0,0.7,0.6127167630057804,0.6399232827187109,125.47385668754578,0.0
174,7,Logistic Regression (Penalty = L2),0,0.7,0.6820809248554913,0.5967260731744631,2.5673296451568604,0.0
175,7,Naive Bayes,0,0.7,0.2543352601156069,0.4375120665169366,0.38123083114624023,0.0
176,7,KNeighbors Classifier,1,0.7,0.6488095238095238,0.5241923835179018,1.3467795848846436,0.0
177,7,SVC Classifier,1,0.7,0.5238095238095238,0.6933612743506347,1.6538727283477783,0.0
178,7,Decision Tree,1,0.7,0.6190476190476191,0.6233733121097239,0.09254765510559082,0.0
179,7,RandomForest,1,0.7,0.5535714285714286,0.5595642461260143,0.7342946529388428,0.0
180,7,AdaBoost (Discrete),1,0.7,0.7559523809523809,0.7272759833414827,113.33747148513794,0.0
181,7,AdaBoost (Real),1,0.7,0.6607142857142857,0.6671125599275987,121.30868768692017,0.0
182,7,Logistic Regression (Penalty = L2),1,0.7,0.7380952380952381,0.7320013364107395,2.5255484580993652,0.0
183,7,Naive Bayes,1,0.7,0.25595238095238093,0.4410714231202338,0.450333833694458,0.0
184,7,KNeighbors Classifier,2,0.7,0.7055214723926381,0.6542728385368908,1.2449641227722168,0.0
185,7,SVC Classifier,2,0.7,0.5337423312883436,0.7937005259840998,1.73569917678833,0.0
186,7,Decision Tree,2,0.7,0.5828220858895705,0.6339826407282461,0.17474579811096191,0.0
187,7,RandomForest,2,0.7,0.5705521472392638,0.4332527900359493,0.7009634971618652,0.0
188,7,AdaBoost (Discrete),2,0.7,0.7668711656441718,0.71658897082964,117.98025679588318,0.0
189,7,AdaBoost (Real),2,0.7,0.6319018404907976,0.7002359497302189,133.00954341888428,0.0
190,7,Logistic Regression (Penalty = L2),2,0.7,0.7177914110429447,0.7172960229068771,2.511310577392578,0.0
191,7,Naive Bayes,2,0.7,0.2822085889570552,0.48870614528562994,0.42281413078308105,0.0
192,8,KNeighbors Classifier,0,0.7,0.5838150289017341,0.40384164397924294,0.5021166801452637,0.0
193,8,SVC Classifier,0,0.7,0.49710982658959535,1.0,0.6889379024505615,0.0
194,8,Decision Tree,0,0.7,0.6416184971098265,0.7001938113019133,0.0839693546295166,0.0
195,8,RandomForest,0,0.7,0.5491329479768786,0.6042750794713536,0.5022587776184082,0.0
196,8,AdaBoost (Discrete),0,0.7,0.7167630057803468,0.5577724058456444,59.62406015396118,0.0
197,8,AdaBoost (Real),0,0.7,0.6589595375722543,0.7290022275036606,64.96132612228394,0.0
198,8,Logistic Regression (Penalty = L2),0,0.7,0.5433526011560693,0.29108922648939284,1.1498255729675293,0.0
199,8,Naive Bayes,0,0.7,0.24277456647398843,0.34095714926164705,0.27516770362854004,0.34095714926164705
200,8,KNeighbors Classifier,1,0.7,0.6190476190476191,0.44703944919706534,0.4280991554260254,0.0
201,8,SVC Classifier,1,0.7,0.5119047619047619,1.0,0.46683835983276367,0.0
202,8,Decision Tree,1,0.7,0.5892857142857143,0.6225300937369656,0.0832667350769043,0.0
203,8,RandomForest,1,0.7,0.5416666666666666,0.9410360288810286,0.5029056072235107,0.0
204,8,AdaBoost (Discrete),1,0.7,0.7202380952380952,0.6874888939234333,53.400280475616455,0.0
205,8,AdaBoost (Real),1,0.7,0.6309523809523809,0.5562019569128526,60.069462299346924,0.0
206,8,Logistic Regression (Penalty = L2),1,0.7,0.5833333333333334,0.3519260246410887,0.7439613342285156,0.0
207,8,Naive Bayes,1,0.7,0.25595238095238093,0.4624409984952622,0.2221236228942871,0.0
208,8,KNeighbors Classifier,2,0.7,0.6380368098159509,0.49125242588914225,0.4830596446990967,0.0
209,8,SVC Classifier,2,0.7,0.5153374233128835,1.0,0.5545740127563477,0.0
210,8,Decision Tree,2,0.7,0.5644171779141104,0.5387870400477288,0.0718536376953125,0.0
211,8,RandomForest,2,0.7,0.588957055214724,0.7067785948781162,0.49891066551208496,0.0
212,8,AdaBoost (Discrete),2,0.7,0.7239263803680982,0.6546500599412268,53.07525634765625,0.0
213,8,AdaBoost (Real),2,0.7,0.6257668711656442,0.6905318665801873,58.984928369522095,0.0
214,8,Logistic Regression (Penalty = L2),2,0.7,0.6073619631901841,0.48178175507585336,0.8987081050872803,0.0
215,8,Naive Bayes,2,0.7,0.3128834355828221,0.5226137301342834,0.24616742134094238,0.5226137301342834
