,feat_set_id,classifier,fold_id,feat_th,score,geo_score,exec_t,geo_score_woz
0,0,KNeighbors Classifier,0,0.7,1.0,1.0,0.526691198348999,1.0
1,0,SVC Classifier,0,0.7,0.009523809523809525,1.0,1.404205083847046,0.0
2,0,Decision Tree,0,0.7,1.0,1.0,0.10755300521850586,1.0
3,0,RandomForest,0,0.7,0.17142857142857143,1.0,0.8629143238067627,0.0
4,0,AdaBoost (Discrete),0,0.7,0.8952380952380953,1.0,36.47076058387756,0.0
5,0,AdaBoost (Real),0,0.7,0.9619047619047619,1.0,122.79329109191895,0.0
6,0,Logistic Regression (Penalty = L2),0,0.7,0.5333333333333333,1.0,1.226015567779541,0.0
7,0,Naive Bayes,0,0.7,1.0,1.0,0.8969535827636719,1.0
8,0,KNeighbors Classifier,1,0.7,1.0,1.0,0.2892286777496338,1.0
9,0,SVC Classifier,1,0.7,1.0,1.0,1.160060167312622,1.0
10,0,Decision Tree,1,0.7,1.0,1.0,0.09407687187194824,1.0
11,0,RandomForest,1,0.7,0.20754716981132076,1.0,0.7104806900024414,0.0
12,0,AdaBoost (Discrete),1,0.7,0.9056603773584906,1.0,43.779664278030396,0.0
13,0,AdaBoost (Real),1,0.7,0.9622641509433962,1.0,77.63792967796326,0.0
14,0,Logistic Regression (Penalty = L2),1,0.7,0.5660377358490566,1.0,2.004525661468506,0.0
15,0,Naive Bayes,1,0.7,1.0,1.0,0.8481545448303223,1.0
16,0,KNeighbors Classifier,2,0.7,1.0,1.0,0.3099031448364258,1.0
17,0,SVC Classifier,2,0.7,0.009523809523809525,1.0,0.9647543430328369,0.0
18,0,Decision Tree,2,0.7,1.0,1.0,0.09541797637939453,1.0
19,0,RandomForest,2,0.7,0.21904761904761905,1.0,0.8646125793457031,0.0
20,0,AdaBoost (Discrete),2,0.7,0.8476190476190476,1.0,41.12007689476013,0.0
21,0,AdaBoost (Real),2,0.7,0.9714285714285714,1.0,80.30156826972961,0.0
22,0,Logistic Regression (Penalty = L2),2,0.7,0.5523809523809524,1.0,1.8583893775939941,0.0
23,0,Naive Bayes,2,0.7,1.0,1.0,0.7921128273010254,1.0
24,1,KNeighbors Classifier,0,0.7,1.0,1.0,0.3916611671447754,1.0
25,1,SVC Classifier,0,0.7,0.009523809523809525,1.0,1.3052864074707031,0.0
26,1,Decision Tree,0,0.7,1.0,1.0,0.10095572471618652,1.0
27,1,RandomForest,0,0.7,0.2,1.0,0.7188518047332764,0.0
28,1,AdaBoost (Discrete),0,0.7,0.5619047619047619,1.0,46.477612257003784,0.0
29,1,AdaBoost (Real),0,0.7,0.8857142857142857,1.0,86.65734767913818,0.0
30,1,Logistic Regression (Penalty = L2),0,0.7,0.8857142857142857,1.0,1.5548970699310303,0.0
31,1,Naive Bayes,0,0.7,1.0,1.0,0.953502893447876,1.0
32,1,KNeighbors Classifier,1,0.7,1.0,1.0,0.3251016139984131,1.0
33,1,SVC Classifier,1,0.7,1.0,1.0,1.0281078815460205,1.0
34,1,Decision Tree,1,0.7,1.0,1.0,0.09581732749938965,1.0
35,1,RandomForest,1,0.7,0.19811320754716982,1.0,0.6656975746154785,0.0
36,1,AdaBoost (Discrete),1,0.7,0.9150943396226415,1.0,45.0580940246582,0.0
37,1,AdaBoost (Real),1,0.7,0.839622641509434,1.0,80.88698863983154,0.0
38,1,Logistic Regression (Penalty = L2),1,0.7,0.9528301886792453,1.0,2.2935893535614014,0.0
39,1,Naive Bayes,1,0.7,1.0,1.0,0.853395938873291,1.0
40,1,KNeighbors Classifier,2,0.7,1.0,1.0,0.2857930660247803,1.0
41,1,SVC Classifier,2,0.7,0.009523809523809525,1.0,1.0756001472473145,0.0
42,1,Decision Tree,2,0.7,1.0,1.0,0.09770607948303223,1.0
43,1,RandomForest,2,0.7,0.18095238095238095,1.0,0.6824908256530762,0.0
44,1,AdaBoost (Discrete),2,0.7,0.8380952380952381,1.0,44.322283029556274,0.0
45,1,AdaBoost (Real),2,0.7,0.819047619047619,1.0,84.56312775611877,0.0
46,1,Logistic Regression (Penalty = L2),2,0.7,0.9238095238095239,1.0,1.7983193397521973,0.0
47,1,Naive Bayes,2,0.7,1.0,1.0,1.041989803314209,1.0
48,2,KNeighbors Classifier,0,0.7,1.0,1.0,0.25565242767333984,1.0
49,2,SVC Classifier,0,0.7,0.009523809523809525,1.0,1.2357127666473389,0.0
50,2,Decision Tree,0,0.7,1.0,1.0,0.13038229942321777,1.0
51,2,RandomForest,0,0.7,0.2,1.0,0.7672567367553711,0.0
52,2,AdaBoost (Discrete),0,0.7,0.6952380952380952,1.0,44.6016526222229,0.0
53,2,AdaBoost (Real),0,0.7,0.9047619047619048,1.0,81.45116448402405,0.0
54,2,Logistic Regression (Penalty = L2),0,0.7,0.8380952380952381,1.0,1.3048431873321533,0.0
55,2,Naive Bayes,0,0.7,1.0,1.0,0.8588900566101074,1.0
56,2,KNeighbors Classifier,1,0.7,1.0,1.0,0.2714962959289551,1.0
57,2,SVC Classifier,1,0.7,1.0,1.0,1.1176068782806396,1.0
58,2,Decision Tree,1,0.7,1.0,1.0,0.0872945785522461,1.0
59,2,RandomForest,1,0.7,0.2169811320754717,1.0,0.6523222923278809,0.0
60,2,AdaBoost (Discrete),1,0.7,0.6509433962264151,1.0,44.146790981292725,0.0
61,2,AdaBoost (Real),1,0.7,0.8962264150943396,1.0,81.08915495872498,0.0
62,2,Logistic Regression (Penalty = L2),1,0.7,0.9150943396226415,1.0,2.002960205078125,0.0
63,2,Naive Bayes,1,0.7,1.0,1.0,1.0337889194488525,1.0
64,2,KNeighbors Classifier,2,0.7,1.0,1.0,0.2959730625152588,1.0
65,2,SVC Classifier,2,0.7,0.009523809523809525,1.0,0.9374070167541504,0.0
66,2,Decision Tree,2,0.7,1.0,1.0,0.09620523452758789,1.0
67,2,RandomForest,2,0.7,0.2,1.0,0.6820309162139893,0.0
68,2,AdaBoost (Discrete),2,0.7,0.6857142857142857,1.0,45.073328733444214,0.0
69,2,AdaBoost (Real),2,0.7,0.9142857142857143,1.0,81.89010214805603,0.0
70,2,Logistic Regression (Penalty = L2),2,0.7,0.9047619047619048,1.0,2.1742053031921387,0.0
71,2,Naive Bayes,2,0.7,1.0,1.0,0.8430812358856201,1.0
72,3,KNeighbors Classifier,0,0.7,1.0,1.0,0.2861051559448242,1.0
73,3,SVC Classifier,0,0.7,0.009523809523809525,1.0,1.227440357208252,0.0
74,3,Decision Tree,0,0.7,1.0,1.0,0.08645296096801758,1.0
75,3,RandomForest,0,0.7,0.2,1.0,0.5816240310668945,0.0
76,3,AdaBoost (Discrete),0,0.7,0.8666666666666667,1.0,42.26805329322815,0.0
77,3,AdaBoost (Real),0,0.7,0.9714285714285714,1.0,83.104483127594,0.0
78,3,Logistic Regression (Penalty = L2),0,0.7,0.6571428571428571,1.0,1.1274518966674805,0.0
79,3,Naive Bayes,0,0.7,1.0,1.0,0.8226385116577148,1.0
80,3,KNeighbors Classifier,1,0.7,1.0,1.0,0.3831920623779297,1.0
81,3,SVC Classifier,1,0.7,1.0,1.0,1.19783616065979,1.0
82,3,Decision Tree,1,0.7,1.0,1.0,0.0019414424896240234,1.0
83,3,RandomForest,1,0.7,0.24528301886792453,1.0,0.7334928512573242,0.0
84,3,AdaBoost (Discrete),1,0.7,0.8490566037735849,1.0,41.048537492752075,0.0
85,3,AdaBoost (Real),1,0.7,0.9622641509433962,1.0,78.87461447715759,0.0
86,3,Logistic Regression (Penalty = L2),1,0.7,0.6981132075471698,1.0,1.4947113990783691,0.0
87,3,Naive Bayes,1,0.7,1.0,1.0,0.9821155071258545,1.0
88,3,KNeighbors Classifier,2,0.7,1.0,1.0,0.29624462127685547,1.0
89,3,SVC Classifier,2,0.7,0.009523809523809525,1.0,1.0560474395751953,0.0
90,3,Decision Tree,2,0.7,1.0,1.0,0.09469985961914062,1.0
91,3,RandomForest,2,0.7,0.2,1.0,0.590524435043335,0.0
92,3,AdaBoost (Discrete),2,0.7,0.8095238095238095,1.0,39.22201180458069,0.0
93,3,AdaBoost (Real),2,0.7,0.9619047619047619,1.0,76.57522463798523,0.0
94,3,Logistic Regression (Penalty = L2),2,0.7,0.6952380952380952,1.0,1.5725204944610596,0.0
95,3,Naive Bayes,2,0.7,1.0,1.0,0.9064319133758545,1.0
96,4,KNeighbors Classifier,0,0.7,1.0,1.0,0.3835184574127197,1.0
97,4,SVC Classifier,0,0.7,0.009523809523809525,1.0,1.1948986053466797,0.0
98,4,Decision Tree,0,0.7,1.0,1.0,0.09215164184570312,1.0
99,4,RandomForest,0,0.7,0.19047619047619047,1.0,0.7645609378814697,0.0
100,4,AdaBoost (Discrete),0,0.7,0.9619047619047619,1.0,37.96321749687195,0.0
101,4,AdaBoost (Real),0,0.7,1.0,1.0,76.82164573669434,1.0
102,4,Logistic Regression (Penalty = L2),0,0.7,0.41904761904761906,1.0,1.1261489391326904,0.0
103,4,Naive Bayes,0,0.7,1.0,1.0,0.8205962181091309,1.0
104,4,KNeighbors Classifier,1,0.7,1.0,1.0,0.3863861560821533,1.0
105,4,SVC Classifier,1,0.7,1.0,1.0,0.8341729640960693,1.0
106,4,Decision Tree,1,0.7,1.0,1.0,0.0926508903503418,1.0
107,4,RandomForest,1,0.7,0.19811320754716982,1.0,0.6319072246551514,0.0
108,4,AdaBoost (Discrete),1,0.7,0.8207547169811321,1.0,36.90315651893616,0.0
109,4,AdaBoost (Real),1,0.7,0.9622641509433962,1.0,69.71854281425476,0.0
110,4,Logistic Regression (Penalty = L2),1,0.7,0.4811320754716981,1.0,1.4329092502593994,0.0
111,4,Naive Bayes,1,0.7,1.0,1.0,0.6976156234741211,1.0
112,4,KNeighbors Classifier,2,0.7,1.0,1.0,0.3334372043609619,1.0
113,4,SVC Classifier,2,0.7,0.009523809523809525,1.0,0.8018684387207031,0.0
114,4,Decision Tree,2,0.7,1.0,1.0,0.08753824234008789,1.0
115,4,RandomForest,2,0.7,0.18095238095238095,1.0,0.7143347263336182,0.0
116,4,AdaBoost (Discrete),2,0.7,0.9904761904761905,1.0,34.6869170665741,0.0
117,4,AdaBoost (Real),2,0.7,0.9714285714285714,1.0,72.39066815376282,0.0
118,4,Logistic Regression (Penalty = L2),2,0.7,0.4666666666666667,1.0,1.5804862976074219,0.0
119,4,Naive Bayes,2,0.7,1.0,1.0,0.7758002281188965,1.0
120,5,KNeighbors Classifier,0,0.7,1.0,1.0,0.26068925857543945,1.0
121,5,SVC Classifier,0,0.7,0.009523809523809525,1.0,1.0669264793395996,0.0
122,5,Decision Tree,0,0.7,1.0,1.0,0.08989834785461426,1.0
123,5,RandomForest,0,0.7,0.1619047619047619,1.0,0.6171748638153076,0.0
124,5,AdaBoost (Discrete),0,0.7,0.9428571428571428,1.0,38.85676884651184,0.0
125,5,AdaBoost (Real),0,0.7,0.9714285714285714,1.0,77.85193252563477,0.0
126,5,Logistic Regression (Penalty = L2),0,0.7,0.41904761904761906,1.0,1.060058832168579,0.0
127,5,Naive Bayes,0,0.7,1.0,1.0,0.7216410636901855,1.0
128,5,KNeighbors Classifier,1,0.7,1.0,1.0,0.2686271667480469,1.0
129,5,SVC Classifier,1,0.7,1.0,1.0,0.9663980007171631,1.0
130,5,Decision Tree,1,0.7,1.0,1.0,0.08383703231811523,1.0
131,5,RandomForest,1,0.7,0.19811320754716982,1.0,0.5893566608428955,0.0
132,5,AdaBoost (Discrete),1,0.7,0.8490566037735849,1.0,35.960678577423096,0.0
133,5,AdaBoost (Real),1,0.7,0.9339622641509434,1.0,70.7292833328247,0.0
134,5,Logistic Regression (Penalty = L2),1,0.7,0.5,1.0,1.4692907333374023,0.0
135,5,Naive Bayes,1,0.7,1.0,1.0,0.6890332698822021,1.0
136,5,KNeighbors Classifier,2,0.7,1.0,1.0,0.2594645023345947,1.0
137,5,SVC Classifier,2,0.7,0.009523809523809525,1.0,1.0235750675201416,0.0
138,5,Decision Tree,2,0.7,1.0,1.0,0.08643865585327148,1.0
139,5,RandomForest,2,0.7,0.2,1.0,0.7490582466125488,0.0
140,5,AdaBoost (Discrete),2,0.7,0.8666666666666667,1.0,34.85300612449646,0.0
141,5,AdaBoost (Real),2,0.7,0.9333333333333333,1.0,66.77372479438782,0.0
142,5,Logistic Regression (Penalty = L2),2,0.7,0.4857142857142857,1.0,1.493690013885498,0.0
143,5,Naive Bayes,2,0.7,1.0,1.0,0.7568910121917725,1.0
144,6,KNeighbors Classifier,0,0.7,1.0,1.0,0.3409254550933838,1.0
145,6,SVC Classifier,0,0.7,0.009523809523809525,1.0,1.0876245498657227,0.0
146,6,Decision Tree,0,0.7,1.0,1.0,0.07559466361999512,1.0
147,6,RandomForest,0,0.7,0.1523809523809524,1.0,0.5066425800323486,0.0
148,6,AdaBoost (Discrete),0,0.7,0.7523809523809524,1.0,34.75782299041748,0.0
149,6,AdaBoost (Real),0,0.7,0.9714285714285714,1.0,70.03143262863159,0.0
150,6,Logistic Regression (Penalty = L2),0,0.7,0.2761904761904762,1.0,0.857820987701416,0.0
151,6,Naive Bayes,0,0.7,1.0,1.0,0.5797977447509766,1.0
152,6,KNeighbors Classifier,1,0.7,1.0,1.0,0.2357630729675293,1.0
153,6,SVC Classifier,1,0.7,1.0,1.0,0.9054172039031982,1.0
154,6,Decision Tree,1,0.7,1.0,1.0,0.07053661346435547,1.0
155,6,RandomForest,1,0.7,0.16981132075471697,1.0,0.6082344055175781,0.0
156,6,AdaBoost (Discrete),1,0.7,0.8301886792452831,1.0,30.129080057144165,0.0
157,6,AdaBoost (Real),1,0.7,0.9905660377358491,1.0,59.116408824920654,0.0
158,6,Logistic Regression (Penalty = L2),1,0.7,0.3018867924528302,1.0,1.1411314010620117,0.0
159,6,Naive Bayes,1,0.7,1.0,1.0,0.6176395416259766,1.0
160,6,KNeighbors Classifier,2,0.7,1.0,1.0,0.22942304611206055,1.0
161,6,SVC Classifier,2,0.7,0.009523809523809525,1.0,0.844512939453125,0.0
162,6,Decision Tree,2,0.7,1.0,1.0,0.07386565208435059,1.0
163,6,RandomForest,2,0.7,0.18095238095238095,1.0,0.4589550495147705,0.0
164,6,AdaBoost (Discrete),2,0.7,0.7333333333333333,1.0,28.233563661575317,0.0
165,6,AdaBoost (Real),2,0.7,1.0,1.0,52.20229983329773,1.0
166,6,Logistic Regression (Penalty = L2),2,0.7,0.3047619047619048,1.0,1.0028698444366455,0.0
167,6,Naive Bayes,2,0.7,1.0,1.0,0.4886128902435303,1.0
168,7,KNeighbors Classifier,0,0.7,1.0,1.0,0.25840330123901367,1.0
169,7,SVC Classifier,0,0.7,0.009523809523809525,1.0,0.8314414024353027,0.0
170,7,Decision Tree,0,0.7,1.0,1.0,0.04846930503845215,1.0
171,7,RandomForest,0,0.7,0.20952380952380953,1.0,0.506563663482666,0.0
172,7,AdaBoost (Discrete),0,0.7,0.819047619047619,1.0,28.388076543807983,0.0
173,7,AdaBoost (Real),0,0.7,0.8095238095238095,1.0,54.47057390213013,0.0
174,7,Logistic Regression (Penalty = L2),0,0.7,0.7619047619047619,1.0,0.791008710861206,0.0
175,7,Naive Bayes,0,0.7,1.0,1.0,0.5721242427825928,1.0
176,7,KNeighbors Classifier,1,0.7,1.0,1.0,0.17064642906188965,1.0
177,7,SVC Classifier,1,0.7,1.0,1.0,0.7198162078857422,1.0
178,7,Decision Tree,1,0.7,1.0,1.0,0.06077980995178223,1.0
179,7,RandomForest,1,0.7,0.19811320754716982,1.0,0.5453126430511475,0.0
180,7,AdaBoost (Discrete),1,0.7,0.7358490566037735,1.0,26.39568281173706,0.0
181,7,AdaBoost (Real),1,0.7,0.8679245283018868,1.0,47.36092519760132,0.0
182,7,Logistic Regression (Penalty = L2),1,0.7,0.8679245283018868,1.0,1.157364845275879,0.0
183,7,Naive Bayes,1,0.7,1.0,1.0,0.4510648250579834,1.0
184,7,KNeighbors Classifier,2,0.7,1.0,1.0,0.11284804344177246,1.0
185,7,SVC Classifier,2,0.7,0.009523809523809525,1.0,0.6172432899475098,0.0
186,7,Decision Tree,2,0.7,1.0,1.0,0.1091618537902832,1.0
187,7,RandomForest,2,0.7,0.19047619047619047,1.0,0.39822864532470703,0.0
188,7,AdaBoost (Discrete),2,0.7,0.819047619047619,1.0,26.13285803794861,0.0
189,7,AdaBoost (Real),2,0.7,0.8952380952380953,1.0,42.093701124191284,0.0
190,7,Logistic Regression (Penalty = L2),2,0.7,0.8380952380952381,1.0,1.0624167919158936,0.0
191,7,Naive Bayes,2,0.7,1.0,1.0,0.43871092796325684,1.0
192,8,KNeighbors Classifier,0,0.7,1.0,1.0,0.14694976806640625,1.0
193,8,SVC Classifier,0,0.7,0.009523809523809525,1.0,0.7296712398529053,0.0
194,8,Decision Tree,0,0.7,1.0,1.0,0.04786229133605957,1.0
195,8,RandomForest,0,0.7,0.17142857142857143,1.0,0.3150198459625244,0.0
196,8,AdaBoost (Discrete),0,0.7,0.7714285714285715,1.0,20.657302856445312,0.0
197,8,AdaBoost (Real),0,0.7,0.9619047619047619,1.0,38.59632754325867,0.0
198,8,Logistic Regression (Penalty = L2),0,0.7,0.5428571428571428,1.0,0.5215978622436523,0.0
199,8,Naive Bayes,0,0.7,1.0,1.0,0.4079461097717285,1.0
200,8,KNeighbors Classifier,1,0.7,1.0,1.0,0.14405012130737305,1.0
201,8,SVC Classifier,1,0.7,1.0,1.0,0.44155144691467285,1.0
202,8,Decision Tree,1,0.7,1.0,1.0,0.043120622634887695,1.0
203,8,RandomForest,1,0.7,0.2169811320754717,1.0,0.30048036575317383,0.0
204,8,AdaBoost (Discrete),1,0.7,0.7735849056603774,1.0,18.70869255065918,0.0
205,8,AdaBoost (Real),1,0.7,0.8584905660377359,1.0,32.29074835777283,0.0
206,8,Logistic Regression (Penalty = L2),1,0.7,0.6792452830188679,1.0,0.6979079246520996,0.0
207,8,Naive Bayes,1,0.7,1.0,1.0,0.4039907455444336,1.0
208,8,KNeighbors Classifier,2,0.7,1.0,1.0,0.22750139236450195,1.0
209,8,SVC Classifier,2,0.7,0.009523809523809525,1.0,0.5572614669799805,0.0
210,8,Decision Tree,2,0.7,1.0,1.0,0.039927005767822266,1.0
211,8,RandomForest,2,0.7,0.17142857142857143,1.0,0.2513601779937744,0.0
212,8,AdaBoost (Discrete),2,0.7,0.8666666666666667,1.0,16.629398107528687,0.0
213,8,AdaBoost (Real),2,0.7,0.8380952380952381,1.0,32.43677377700806,0.0
214,8,Logistic Regression (Penalty = L2),2,0.7,0.6761904761904762,1.0,0.6192045211791992,0.0
215,8,Naive Bayes,2,0.7,1.0,1.0,0.3254413604736328,1.0
216,9,KNeighbors Classifier,0,0.7,1.0,1.0,0.10531091690063477,1.0
217,9,SVC Classifier,0,0.7,0.009523809523809525,1.0,0.4374411106109619,0.0
218,9,Decision Tree,0,0.7,1.0,1.0,0.03945469856262207,1.0
219,9,RandomForest,0,0.7,0.17142857142857143,1.0,0.2532501220703125,0.0
220,9,AdaBoost (Discrete),0,0.7,0.8952380952380953,1.0,17.26412606239319,0.0
221,9,AdaBoost (Real),0,0.7,0.9142857142857143,1.0,33.459670305252075,0.0
222,9,Logistic Regression (Penalty = L2),0,0.7,0.5428571428571428,1.0,0.542809009552002,0.0
223,9,Naive Bayes,0,0.7,1.0,1.0,0.32036423683166504,1.0
224,9,KNeighbors Classifier,1,0.7,1.0,1.0,0.10624504089355469,1.0
225,9,SVC Classifier,1,0.7,1.0,1.0,0.40523648262023926,1.0
226,9,Decision Tree,1,0.7,1.0,1.0,0.03566455841064453,1.0
227,9,RandomForest,1,0.7,0.20754716981132076,1.0,0.21642637252807617,0.0
228,9,AdaBoost (Discrete),1,0.7,0.8867924528301887,1.0,15.502017498016357,0.0
229,9,AdaBoost (Real),1,0.7,0.9528301886792453,1.0,31.650397777557373,0.0
230,9,Logistic Regression (Penalty = L2),1,0.7,0.5566037735849056,1.0,0.6416134834289551,0.0
231,9,Naive Bayes,1,0.7,1.0,1.0,0.3659934997558594,1.0
232,9,KNeighbors Classifier,2,0.7,1.0,1.0,0.10418224334716797,1.0
233,9,SVC Classifier,2,0.7,0.009523809523809525,1.0,0.4617598056793213,0.0
234,9,Decision Tree,2,0.7,1.0,1.0,0.002022981643676758,1.0
235,9,RandomForest,2,0.7,0.20952380952380953,1.0,0.262204647064209,0.0
236,9,AdaBoost (Discrete),2,0.7,0.8857142857142857,1.0,16.045164585113525,0.0
237,9,AdaBoost (Real),2,0.7,0.9142857142857143,1.0,32.245678663253784,0.0
238,9,Logistic Regression (Penalty = L2),2,0.7,0.5428571428571428,1.0,0.6806087493896484,0.0
239,9,Naive Bayes,2,0.7,1.0,1.0,0.3115825653076172,1.0
240,10,KNeighbors Classifier,0,0.7,1.0,1.0,0.14191961288452148,1.0
241,10,SVC Classifier,0,0.7,0.009523809523809525,1.0,0.48328518867492676,0.0
242,10,Decision Tree,0,0.7,1.0,1.0,0.038636207580566406,1.0
243,10,RandomForest,0,0.7,0.19047619047619047,1.0,0.38667964935302734,0.0
244,10,AdaBoost (Discrete),0,0.7,0.9619047619047619,1.0,17.772260189056396,0.0
245,10,AdaBoost (Real),0,0.7,0.8761904761904762,1.0,32.403499364852905,0.0
246,10,Logistic Regression (Penalty = L2),0,0.7,0.9047619047619048,1.0,0.6081352233886719,0.0
247,10,Naive Bayes,0,0.7,1.0,1.0,0.31689000129699707,1.0
248,10,KNeighbors Classifier,1,0.7,1.0,1.0,0.09817290306091309,1.0
249,10,SVC Classifier,1,0.7,1.0,1.0,0.3494834899902344,1.0
250,10,Decision Tree,1,0.7,1.0,1.0,0.027179718017578125,1.0
251,10,RandomForest,1,0.7,0.3018867924528302,1.0,0.22064900398254395,0.0
252,10,AdaBoost (Discrete),1,0.7,0.9056603773584906,1.0,16.1227285861969,0.0
253,10,AdaBoost (Real),1,0.7,0.9339622641509434,1.0,29.412130117416382,0.0
254,10,Logistic Regression (Penalty = L2),1,0.7,0.9716981132075472,1.0,0.7754940986633301,0.0
255,10,Naive Bayes,1,0.7,1.0,1.0,0.32289791107177734,1.0
256,10,KNeighbors Classifier,2,0.7,1.0,1.0,0.11202549934387207,1.0
257,10,SVC Classifier,2,0.7,0.009523809523809525,1.0,0.4037628173828125,0.0
258,10,Decision Tree,2,0.7,1.0,1.0,0.035271406173706055,1.0
259,10,RandomForest,2,0.7,0.24761904761904763,1.0,0.28592514991760254,0.0
260,10,AdaBoost (Discrete),2,0.7,0.9714285714285714,1.0,17.006404399871826,0.0
261,10,AdaBoost (Real),2,0.7,0.9809523809523809,1.0,33.5235013961792,0.0
262,10,Logistic Regression (Penalty = L2),2,0.7,0.9428571428571428,1.0,1.0082321166992188,0.0
263,10,Naive Bayes,2,0.7,1.0,1.0,0.3720695972442627,1.0
264,11,KNeighbors Classifier,0,0.7,1.0,1.0,0.13435149192810059,1.0
265,11,SVC Classifier,0,0.7,0.009523809523809525,1.0,0.6175215244293213,0.0
266,11,Decision Tree,0,0.7,1.0,1.0,0.04337000846862793,1.0
267,11,RandomForest,0,0.7,0.19047619047619047,1.0,0.26162004470825195,0.0
268,11,AdaBoost (Discrete),0,0.7,0.9619047619047619,1.0,25.139771461486816,0.0
269,11,AdaBoost (Real),0,0.7,0.9333333333333333,1.0,46.61368131637573,0.0
270,11,Logistic Regression (Penalty = L2),0,0.7,0.9047619047619048,1.0,0.8369522094726562,0.0
271,11,Naive Bayes,0,0.7,1.0,1.0,0.5288345813751221,1.0
272,11,KNeighbors Classifier,1,0.7,1.0,1.0,0.14228081703186035,1.0
273,11,SVC Classifier,1,0.7,1.0,1.0,0.6186158657073975,1.0
274,11,Decision Tree,1,0.7,1.0,1.0,0.047539710998535156,1.0
275,11,RandomForest,1,0.7,0.3018867924528302,1.0,0.3271358013153076,0.0
276,11,AdaBoost (Discrete),1,0.7,0.9245283018867925,1.0,23.79246187210083,0.0
277,11,AdaBoost (Real),1,0.7,0.8301886792452831,1.0,44.1910560131073,0.0
278,11,Logistic Regression (Penalty = L2),1,0.7,0.9716981132075472,1.0,1.0722360610961914,0.0
279,11,Naive Bayes,1,0.7,1.0,1.0,0.47089719772338867,1.0
280,11,KNeighbors Classifier,2,0.7,1.0,1.0,0.1786332130432129,1.0
281,11,SVC Classifier,2,0.7,0.009523809523809525,1.0,0.6136224269866943,0.0
282,11,Decision Tree,2,0.7,1.0,1.0,0.04710054397583008,1.0
283,11,RandomForest,2,0.7,0.24761904761904763,1.0,0.3771934509277344,0.0
284,11,AdaBoost (Discrete),2,0.7,0.8952380952380953,1.0,23.45786213874817,0.0
285,11,AdaBoost (Real),2,0.7,0.8571428571428571,1.0,42.25474786758423,0.0
286,11,Logistic Regression (Penalty = L2),2,0.7,0.9428571428571428,1.0,1.047788143157959,0.0
287,11,Naive Bayes,2,0.7,1.0,1.0,0.4247167110443115,1.0
288,12,KNeighbors Classifier,0,0.7,1.0,1.0,0.14254546165466309,1.0
289,12,SVC Classifier,0,0.7,0.009523809523809525,1.0,0.6226871013641357,0.0
290,12,Decision Tree,0,0.7,1.0,1.0,0.04755425453186035,1.0
291,12,RandomForest,0,0.7,0.14285714285714285,1.0,0.33692336082458496,0.0
292,12,AdaBoost (Discrete),0,0.7,0.8857142857142857,1.0,20.653472423553467,0.0
293,12,AdaBoost (Real),0,0.7,1.0,1.0,41.78306865692139,1.0
294,12,Logistic Regression (Penalty = L2),0,0.7,0.0761904761904762,1.0,0.4801771640777588,0.0
295,12,Naive Bayes,0,0.7,1.0,1.0,0.3782539367675781,1.0
296,12,KNeighbors Classifier,1,0.7,1.0,1.0,0.09661102294921875,1.0
297,12,SVC Classifier,1,0.7,1.0,1.0,0.5265758037567139,1.0
298,12,Decision Tree,1,0.7,1.0,1.0,0.047438621520996094,1.0
299,12,RandomForest,1,0.7,0.16981132075471697,1.0,0.29065585136413574,0.0
300,12,AdaBoost (Discrete),1,0.7,0.9245283018867925,1.0,20.108888387680054,0.0
301,12,AdaBoost (Real),1,0.7,1.0,1.0,36.61314415931702,1.0
302,12,Logistic Regression (Penalty = L2),1,0.7,0.10377358490566038,1.0,0.5721111297607422,0.0
303,12,Naive Bayes,1,0.7,1.0,1.0,0.3542163372039795,1.0
304,12,KNeighbors Classifier,2,0.7,1.0,1.0,0.1768784523010254,1.0
305,12,SVC Classifier,2,0.7,0.009523809523809525,1.0,0.46761631965637207,0.0
306,12,Decision Tree,2,0.7,1.0,1.0,0.04404902458190918,1.0
307,12,RandomForest,2,0.7,0.2,1.0,0.3458583354949951,0.0
308,12,AdaBoost (Discrete),2,0.7,0.9238095238095239,1.0,18.680094003677368,0.0
309,12,AdaBoost (Real),2,0.7,1.0,1.0,36.054927825927734,1.0
310,12,Logistic Regression (Penalty = L2),2,0.7,0.08571428571428572,1.0,0.5844652652740479,0.0
311,12,Naive Bayes,2,0.7,1.0,1.0,0.36420583724975586,1.0
