,feat_set_id,classifier,fold_id,feat_th,score,geo_score,exec_t,geo_score_woz
0,0,KNeighbors Classifier,0,0.2,0.13872832369942195,0.3761095585875525,0.749136209487915,0.0
1,0,SVC Classifier,0,0.2,0.49710982658959535,1.0,0.8029868602752686,0.0
2,0,Decision Tree,0,0.2,0.5317919075144508,0.4685313138176493,0.003016233444213867,0.0
3,0,RandomForest,0,0.2,0.49710982658959535,1.0,1.217756748199463,0.0
4,0,AdaBoost (Discrete),0,0.2,0.4913294797687861,0.4235917749235957,66.88420176506042,0.0
5,0,AdaBoost (Real),0,0.2,0.5144508670520231,0.4298815285989873,98.76887917518616,0.0
6,0,Logistic Regression (Penalty = L2),0,0.2,0.49710982658959535,1.0,0.5898785591125488,0.0
7,0,Naive Bayes,0,0.2,0.12138728323699421,0.2565612464507602,0.2896761894226074,0.0
8,0,KNeighbors Classifier,1,0.2,0.5119047619047619,0.5480749741372283,0.5903077125549316,0.0
9,0,SVC Classifier,1,0.2,0.5119047619047619,1.0,0.7226192951202393,0.0
10,0,Decision Tree,1,0.2,0.5178571428571429,0.31370233309485673,0.1424083709716797,0.0
11,0,RandomForest,1,0.2,0.5119047619047619,1.0,0.8864741325378418,0.0
12,0,AdaBoost (Discrete),1,0.2,0.5,0.26855526028143406,63.95291447639465,0.0
13,0,AdaBoost (Real),1,0.2,0.5178571428571429,0.23236834748323262,80.19512724876404,0.0
14,0,Logistic Regression (Penalty = L2),1,0.2,0.5119047619047619,1.0,0.6126370429992676,0.0
15,0,Naive Bayes,1,0.2,0.08928571428571429,0.21385167708929512,0.4723026752471924,0.0
16,0,KNeighbors Classifier,2,0.2,0.5030674846625767,0.41243600031998046,0.7942922115325928,0.0
17,0,SVC Classifier,2,0.2,0.5153374233128835,1.0,0.8688831329345703,0.0
18,0,Decision Tree,2,0.2,0.5398773006134969,0.2857375683405856,0.0024383068084716797,0.0
19,0,RandomForest,2,0.2,0.5153374233128835,1.0,1.2907028198242188,0.0
20,0,AdaBoost (Discrete),2,0.2,0.5460122699386503,0.3090205361019905,80.96273684501648,0.0
21,0,AdaBoost (Real),2,0.2,0.5337423312883436,0.2747220978690993,80.82417559623718,0.0
22,0,Logistic Regression (Penalty = L2),2,0.2,0.5153374233128835,1.0,0.5391614437103271,0.0
23,0,Naive Bayes,2,0.2,0.10429447852760736,0.3188194067282532,0.6986813545227051,0.0
24,1,KNeighbors Classifier,0,0.2,0.6127167630057804,0.4673817479527429,0.7551724910736084,0.0
25,1,SVC Classifier,0,0.2,0.49710982658959535,1.0,1.1487925052642822,0.0
26,1,Decision Tree,0,0.2,0.5953757225433526,0.5808970483286656,0.19941186904907227,0.0
27,1,RandomForest,0,0.2,0.5491329479768786,0.6042750794713536,2.041259288787842,0.0
28,1,AdaBoost (Discrete),0,0.2,0.6416184971098265,0.6137437613588531,64.66002702713013,0.0
29,1,AdaBoost (Real),0,0.2,0.6416184971098265,0.49858919320379413,100.3440535068512,0.0
30,1,Logistic Regression (Penalty = L2),0,0.2,0.5028901734104047,0.5227579585747102,1.1344985961914062,0.0
31,1,Naive Bayes,0,0.2,0.19653179190751446,0.3577832784583438,0.5421757698059082,0.0
32,1,KNeighbors Classifier,1,0.2,0.6011904761904762,0.4656980682818927,0.7080521583557129,0.0
33,1,SVC Classifier,1,0.2,0.5119047619047619,1.0,0.9574289321899414,0.0
34,1,Decision Tree,1,0.2,0.5773809523809523,0.47816811111805513,0.267941951751709,0.0
35,1,RandomForest,1,0.2,0.5654761904761905,0.48009694123150753,1.5512259006500244,0.0
36,1,AdaBoost (Discrete),1,0.2,0.6488095238095238,0.5397396625642314,90.64002633094788,0.0
37,1,AdaBoost (Real),1,0.2,0.6071428571428571,0.7052452331286333,109.0098226070404,0.0
38,1,Logistic Regression (Penalty = L2),1,0.2,0.5178571428571429,0.5503212081491045,1.1670646667480469,0.0
39,1,Naive Bayes,1,0.2,0.22023809523809523,0.5594627618341078,0.31636810302734375,0.0
40,1,KNeighbors Classifier,2,0.2,0.6319018404907976,0.6278863909463879,0.6365561485290527,0.0
41,1,SVC Classifier,2,0.2,0.5153374233128835,1.0,0.8151888847351074,0.0
42,1,Decision Tree,2,0.2,0.6196319018404908,0.5010365581028202,0.1437852382659912,0.5010365581028202
43,1,RandomForest,2,0.2,0.5766871165644172,0.5109716537267232,1.1484508514404297,0.0
44,1,AdaBoost (Discrete),2,0.2,0.656441717791411,0.6519705613846017,98.34241700172424,0.0
45,1,AdaBoost (Real),2,0.2,0.5705521472392638,0.8231583071399764,107.59834814071655,0.0
46,1,Logistic Regression (Penalty = L2),2,0.2,0.5460122699386503,0.268181277931735,1.133697748184204,0.0
47,1,Naive Bayes,2,0.2,0.2822085889570552,0.4179341115308785,0.3056142330169678,0.4179341115308785
48,2,KNeighbors Classifier,0,0.2,0.6069364161849711,0.615656797729914,0.7918910980224609,0.0
49,2,SVC Classifier,0,0.2,0.49710982658959535,1.0,0.642946720123291,0.0
50,2,Decision Tree,0,0.2,0.5838150289017341,0.5195260484878822,0.1641538143157959,0.0
51,2,RandomForest,0,0.2,0.5491329479768786,0.6042750794713536,1.295424461364746,0.0
52,2,AdaBoost (Discrete),0,0.2,0.6358381502890174,0.5949455837817144,103.89818143844604,0.0
53,2,AdaBoost (Real),0,0.2,0.5838150289017341,0.6319630678090885,124.60712337493896,0.0
54,2,Logistic Regression (Penalty = L2),0,0.2,0.6184971098265896,0.4302982245918818,1.5894665718078613,0.0
55,2,Naive Bayes,0,0.2,0.26011560693641617,0.44995322777257435,0.3187680244445801,0.0
56,2,KNeighbors Classifier,1,0.2,0.6726190476190477,0.7009873471274195,0.614933967590332,0.0
57,2,SVC Classifier,1,0.2,0.5119047619047619,1.0,0.7943863868713379,0.0
58,2,Decision Tree,1,0.2,0.5595238095238095,0.5406427594590348,0.1599564552307129,0.0
59,2,RandomForest,1,0.2,0.5595238095238095,0.6389431042462725,1.1266744136810303,0.0
60,2,AdaBoost (Discrete),1,0.2,0.6904761904761905,0.7264338758117634,107.80439043045044,0.0
61,2,AdaBoost (Real),1,0.2,0.5773809523809523,0.4238942726241891,119.22380638122559,0.0
62,2,Logistic Regression (Penalty = L2),1,0.2,0.6845238095238095,0.6775895223561039,1.491400957107544,0.0
63,2,Naive Bayes,1,0.2,0.30357142857142855,0.5134020216201731,0.49755859375,0.0
64,2,KNeighbors Classifier,2,0.2,0.6196319018404908,0.5498478108749074,0.6899316310882568,0.0
65,2,SVC Classifier,2,0.2,0.5153374233128835,1.0,1.0031955242156982,0.0
66,2,Decision Tree,2,0.2,0.6012269938650306,0.6411748314406666,0.18824291229248047,0.0
67,2,RandomForest,2,0.2,0.588957055214724,0.7311846378041618,1.4266996383666992,0.0
68,2,AdaBoost (Discrete),2,0.2,0.7055214723926381,0.7002002991326697,104.50882863998413,0.0
69,2,AdaBoost (Real),2,0.2,0.588957055214724,0.8038679774895205,118.37930536270142,0.0
70,2,Logistic Regression (Penalty = L2),2,0.2,0.6687116564417178,0.5828861508526172,1.4598071575164795,0.0
71,2,Naive Bayes,2,0.2,0.25153374233128833,0.46794133873819044,0.15896821022033691,0.0
72,3,KNeighbors Classifier,0,0.2,0.10404624277456648,0.24456082527864936,0.3445613384246826,0.0
73,3,SVC Classifier,0,0.2,0.49710982658959535,1.0,0.3176381587982178,0.0
74,3,Decision Tree,0,0.2,0.5144508670520231,0.4790904055632943,0.001348257064819336,0.0
75,3,RandomForest,0,0.2,0.49710982658959535,1.0,1.095191478729248,0.0
76,3,AdaBoost (Discrete),0,0.2,0.5144508670520231,0.4790904055632943,56.03534197807312,0.0
77,3,AdaBoost (Real),0,0.2,0.5028901734104047,0.40161619453042774,67.12882208824158,0.0
78,3,Logistic Regression (Penalty = L2),0,0.2,0.49710982658959535,1.0,0.259765625,0.0
79,3,Naive Bayes,0,0.2,0.09248554913294797,0.3510748715226527,0.12559819221496582,0.0
80,3,KNeighbors Classifier,1,0.2,0.5059523809523809,0.9938837346736189,0.26086902618408203,0.0
81,3,SVC Classifier,1,0.2,0.5119047619047619,1.0,0.3891310691833496,0.0
82,3,Decision Tree,1,0.2,0.5178571428571429,0.48799729377078904,0.002035379409790039,0.0
83,3,RandomForest,1,0.2,0.5119047619047619,1.0,1.0541725158691406,0.0
84,3,AdaBoost (Discrete),1,0.2,0.5178571428571429,0.48799729377078904,53.36843490600586,0.0
85,3,AdaBoost (Real),1,0.2,0.5178571428571429,0.48799729377078904,64.40791511535645,0.0
86,3,Logistic Regression (Penalty = L2),1,0.2,0.5119047619047619,1.0,0.13116049766540527,0.0
87,3,Naive Bayes,1,0.2,0.07738095238095238,0.6299605249474366,0.12976861000061035,0.0
88,3,KNeighbors Classifier,2,0.2,0.5337423312883436,0.3976353643835253,0.3005397319793701,0.0
89,3,SVC Classifier,2,0.2,0.5153374233128835,1.0,0.2558770179748535,0.0
90,3,Decision Tree,2,0.2,0.5398773006134969,0.28207356966104163,0.13421177864074707,0.0
91,3,RandomForest,2,0.2,0.5153374233128835,1.0,0.926626443862915,0.0
92,3,AdaBoost (Discrete),2,0.2,0.5398773006134969,0.28207356966104163,52.618412733078,0.0
93,3,AdaBoost (Real),2,0.2,0.5398773006134969,0.28207356966104163,80.67420768737793,0.0
94,3,Logistic Regression (Penalty = L2),2,0.2,0.5153374233128835,1.0,0.31439661979675293,0.0
95,3,Naive Bayes,2,0.2,0.09815950920245399,0.2764555609554996,0.30771541595458984,0.0
96,5,KNeighbors Classifier,0,0.2,0.6127167630057804,0.5133393530874706,0.2566187381744385,0.0
97,5,SVC Classifier,0,0.2,0.49710982658959535,1.0,0.32135844230651855,0.0
98,5,Decision Tree,0,0.2,0.5028901734104047,0.5601576975052109,0.16195201873779297,0.0
99,5,RandomForest,0,0.2,0.5491329479768786,0.6666920717185073,1.0969758033752441,0.0
100,5,AdaBoost (Discrete),0,0.2,0.5028901734104047,0.3984235792972511,71.29127645492554,0.0
101,5,AdaBoost (Real),0,0.2,0.5838150289017341,0.5185327250485745,85.74187231063843,0.0
102,5,Logistic Regression (Penalty = L2),0,0.2,0.5028901734104047,0.5227579585747102,0.40807104110717773,0.0
103,5,Naive Bayes,0,0.2,0.19653179190751446,0.42890231504232523,0.29138827323913574,0.0
104,5,KNeighbors Classifier,1,0.2,0.5833333333333334,0.45999710955652495,0.27251195907592773,0.0
105,5,SVC Classifier,1,0.2,0.5119047619047619,1.0,0.29705023765563965,0.0
106,5,Decision Tree,1,0.2,0.4642857142857143,0.5930343492784039,0.1389164924621582,0.0
107,5,RandomForest,1,0.2,0.5535714285714286,0.6823636839543257,0.8506655693054199,0.0
108,5,AdaBoost (Discrete),1,0.2,0.5773809523809523,0.6284319642804744,64.58365607261658,0.0
109,5,AdaBoost (Real),1,0.2,0.5416666666666666,0.6071266080810012,79.50039219856262,0.0
110,5,Logistic Regression (Penalty = L2),1,0.2,0.5178571428571429,0.5503212081491045,0.5176346302032471,0.0
111,5,Naive Bayes,1,0.2,0.23214285714285715,0.5315026102994314,0.24883532524108887,0.0
112,5,KNeighbors Classifier,2,0.2,0.5705521472392638,0.6840743722643103,0.24255156517028809,0.0
113,5,SVC Classifier,2,0.2,0.5153374233128835,1.0,0.3370821475982666,0.0
114,5,Decision Tree,2,0.2,0.44785276073619634,0.6012408755226418,0.001748800277709961,0.0
115,5,RandomForest,2,0.2,0.5950920245398773,0.8667457680458256,1.1906628608703613,0.0
116,5,AdaBoost (Discrete),2,0.2,0.44785276073619634,0.5619713585230235,66.35106611251831,0.0
117,5,AdaBoost (Real),2,0.2,0.5521472392638037,0.7660722077918758,77.98636722564697,0.0
118,5,Logistic Regression (Penalty = L2),2,0.2,0.5153374233128835,0.5480471276289933,0.4784677028656006,0.0
119,5,Naive Bayes,2,0.2,0.3006134969325153,0.4445195778019555,0.3443734645843506,0.0
120,6,KNeighbors Classifier,0,0.2,0.5953757225433526,0.4807911314168294,0.30568647384643555,0.0
121,6,SVC Classifier,0,0.2,0.49710982658959535,1.0,0.4834153652191162,0.0
122,6,Decision Tree,0,0.2,0.49710982658959535,0.6130546664643055,0.1589052677154541,0.0
123,6,RandomForest,0,0.2,0.5549132947976878,0.5240180317628493,1.0962774753570557,0.0
124,6,AdaBoost (Discrete),0,0.2,0.4393063583815029,0.46007856477029857,71.91126227378845,0.0
125,6,AdaBoost (Real),0,0.2,0.5549132947976878,0.5491075399303699,75.98762512207031,0.0
126,6,Logistic Regression (Penalty = L2),0,0.2,0.5028901734104047,0.5227579585747102,0.4378623962402344,0.0
127,6,Naive Bayes,0,0.2,0.18497109826589594,0.4991454576805277,0.2505526542663574,0.0
128,6,KNeighbors Classifier,1,0.2,0.5892857142857143,0.4606080062592156,0.1407322883605957,0.0
129,6,SVC Classifier,1,0.2,0.5119047619047619,1.0,0.1519615650177002,0.0
130,6,Decision Tree,1,0.2,0.5,0.5788646895586103,0.07434439659118652,0.0
131,6,RandomForest,1,0.2,0.5476190476190477,1.0,0.4769771099090576,0.0
132,6,AdaBoost (Discrete),1,0.2,0.5297619047619048,0.4620538533613929,63.32494497299194,0.0
133,6,AdaBoost (Real),1,0.2,0.5416666666666666,0.6071266080810012,81.92707967758179,0.0
134,6,Logistic Regression (Penalty = L2),1,0.2,0.5178571428571429,0.5503212081491045,0.5073227882385254,0.0
135,6,Naive Bayes,1,0.2,0.16666666666666666,0.6399431422640735,0.29849767684936523,0.0
136,6,KNeighbors Classifier,2,0.2,0.5705521472392638,0.6751991182656606,0.2752957344055176,0.0
137,6,SVC Classifier,2,0.2,0.5153374233128835,1.0,0.4376516342163086,0.0
138,6,Decision Tree,2,0.2,0.4785276073619632,0.5935987591684015,0.14258718490600586,0.0
139,6,RandomForest,2,0.2,0.558282208588957,0.5169731539571706,1.1342308521270752,0.0
140,6,AdaBoost (Discrete),2,0.2,0.49079754601226994,0.5533073377792391,60.19162940979004,0.0
141,6,AdaBoost (Real),2,0.2,0.5521472392638037,0.7660722077918758,78.97907876968384,0.0
142,6,Logistic Regression (Penalty = L2),2,0.2,0.5214723926380368,0.5503212081491045,0.6637916564941406,0.0
143,6,Naive Bayes,2,0.2,0.15950920245398773,0.4099088771177487,0.28862762451171875,0.0
144,7,KNeighbors Classifier,0,0.2,0.6069364161849711,0.615656797729914,1.5734002590179443,0.0
145,7,SVC Classifier,0,0.2,0.49710982658959535,1.0,1.6198837757110596,0.0
146,7,Decision Tree,0,0.2,0.6242774566473989,0.49725177118097275,0.3340420722961426,0.0
147,7,RandomForest,0,0.2,0.5260115606936416,0.8939035350965676,1.2302348613739014,0.0
148,7,AdaBoost (Discrete),0,0.2,0.6936416184971098,0.6513490754889744,123.65524792671204,0.0
149,7,AdaBoost (Real),0,0.2,0.5549132947976878,0.7955938126154367,131.44376468658447,0.0
150,7,Logistic Regression (Penalty = L2),0,0.2,0.6184971098265896,0.45100520334349337,2.335711717605591,0.0
151,7,Naive Bayes,0,0.2,0.2254335260115607,0.37353471820721296,0.6350235939025879,0.0
152,7,KNeighbors Classifier,1,0.2,0.6785714285714286,0.7168052545901045,1.4498300552368164,0.0
153,7,SVC Classifier,1,0.2,0.5119047619047619,1.0,1.5785765647888184,0.0
154,7,Decision Tree,1,0.2,0.5595238095238095,0.6071377632740809,0.16894769668579102,0.0
155,7,RandomForest,1,0.2,0.5595238095238095,0.6192596340984008,1.3020877838134766,0.0
156,7,AdaBoost (Discrete),1,0.2,0.6904761904761905,0.720539978831679,122.8327374458313,0.0
157,7,AdaBoost (Real),1,0.2,0.6011904761904762,0.5386476946054063,133.41209483146667,0.0
158,7,Logistic Regression (Penalty = L2),1,0.2,0.6964285714285714,0.6071377632740809,1.8780384063720703,0.0
159,7,Naive Bayes,1,0.2,0.27380952380952384,0.4243954757460054,0.48840832710266113,0.4243954757460054
160,7,KNeighbors Classifier,2,0.2,0.6257668711656442,0.5505573037263156,1.2663476467132568,0.0
161,7,SVC Classifier,2,0.2,0.5153374233128835,1.0,1.5317559242248535,0.0
162,7,Decision Tree,2,0.2,0.5828220858895705,0.6892073278257476,0.29328179359436035,0.0
163,7,RandomForest,2,0.2,0.5705521472392638,0.6580370064762462,0.9715356826782227,0.0
164,7,AdaBoost (Discrete),2,0.2,0.7423312883435583,0.8105434773606861,116.1636872291565,0.0
165,7,AdaBoost (Real),2,0.2,0.5398773006134969,0.6389431042462724,131.12673234939575,0.0
166,7,Logistic Regression (Penalty = L2),2,0.2,0.6748466257668712,0.598331412176236,1.7775540351867676,0.0
167,7,Naive Bayes,2,0.2,0.26993865030674846,0.41648014127460825,0.5764176845550537,0.41648014127460825
