,feat_set_id,classifier,fold_id,feat_th,score,geo_score,exec_t,geo_score_woz
0,0,KNeighbors Classifier,0,0.75,0.5129740518962076,0.511577567665962,0.21201205253601074,0.0
1,0,SVC Classifier,0,0.75,0.3093812375249501,1.0,0.5590417385101318,0.0
2,0,Decision Tree,0,0.75,0.46506986027944114,0.46555339178105487,0.0438387393951416,0.0
3,0,RandomForest,0,0.75,0.48303393213572854,0.35853698032136244,0.3839848041534424,0.0
4,0,AdaBoost (Discrete),0,0.75,0.4471057884231537,0.49012994719145875,24.17213487625122,0.0
5,0,AdaBoost (Real),0,0.75,0.3013972055888224,0.3149799352610324,41.759748697280884,0.3149799352610324
6,0,Logistic Regression (Penalty = L2),0,0.75,0.5189620758483033,0.5027319272911231,0.36612772941589355,0.0
7,0,Naive Bayes,0,0.75,0.08582834331337326,0.5266685267202618,0.11349964141845703,0.0
8,0,KNeighbors Classifier,1,0.75,0.5160642570281124,0.5490805464493445,0.21194887161254883,0.0
9,0,SVC Classifier,1,0.75,0.3092369477911647,1.0,0.5853366851806641,0.0
10,0,Decision Tree,1,0.75,0.4497991967871486,0.467606286643316,0.05229783058166504,0.0
11,0,RandomForest,1,0.75,0.4799196787148594,0.569759094683252,0.3316793441772461,0.0
12,0,AdaBoost (Discrete),1,0.75,0.4457831325301205,0.4235645898771214,23.97271728515625,0.4235645898771214
13,0,AdaBoost (Real),1,0.75,0.3152610441767068,0.35580219389462875,45.135273694992065,0.35580219389462875
14,0,Logistic Regression (Penalty = L2),1,0.75,0.5421686746987951,0.5783175950722215,0.3980984687805176,0.0
15,0,Naive Bayes,1,0.75,0.21285140562248997,0.3364011694112307,0.17901945114135742,0.0
16,0,KNeighbors Classifier,2,0.75,0.494949494949495,0.4914156703295414,0.37491846084594727,0.0
17,0,SVC Classifier,2,0.75,0.3111111111111111,1.0,0.9052965641021729,0.0
18,0,Decision Tree,2,0.75,0.46464646464646464,0.42065350142915525,0.07606053352355957,0.42065350142915525
19,0,RandomForest,2,0.75,0.4666666666666667,0.2829518694196607,0.611311674118042,0.0
20,0,AdaBoost (Discrete),2,0.75,0.42828282828282827,0.4964597927583036,36.501023054122925,0.0
21,0,AdaBoost (Real),2,0.75,0.36767676767676766,0.38435349201514407,52.00050640106201,0.0
22,0,Logistic Regression (Penalty = L2),2,0.75,0.5272727272727272,0.4732637977015223,0.4018862247467041,0.0
23,0,Naive Bayes,2,0.75,0.08080808080808081,0.6428683636420658,0.1581707000732422,0.0
24,1,KNeighbors Classifier,0,0.75,0.5129740518962076,0.511577567665962,0.32827186584472656,0.0
25,1,SVC Classifier,0,0.75,0.3093812375249501,1.0,0.944453239440918,0.0
26,1,Decision Tree,0,0.75,0.4311377245508982,0.46707032104379714,0.07589578628540039,0.0
27,1,RandomForest,0,0.75,0.48303393213572854,0.35853698032136244,0.6167738437652588,0.0
28,1,AdaBoost (Discrete),0,0.75,0.4471057884231537,0.49012994719145875,40.673216819763184,0.0
29,1,AdaBoost (Real),0,0.75,0.3013972055888224,0.3149799352610324,56.815457344055176,0.3149799352610324
30,1,Logistic Regression (Penalty = L2),0,0.75,0.5189620758483033,0.5027319272911231,0.5055592060089111,0.0
31,1,Naive Bayes,0,0.75,0.08582834331337326,0.5266685267202618,0.19610214233398438,0.0
32,1,KNeighbors Classifier,1,0.75,0.5160642570281124,0.5490805464493445,0.2940025329589844,0.0
33,1,SVC Classifier,1,0.75,0.3092369477911647,1.0,1.3347666263580322,0.0
34,1,Decision Tree,1,0.75,0.42971887550200805,0.36419508277281976,0.09959840774536133,0.36419508277281976
35,1,RandomForest,1,0.75,0.4799196787148594,0.569759094683252,0.7619798183441162,0.0
36,1,AdaBoost (Discrete),1,0.75,0.4457831325301205,0.4235645898771214,47.80213451385498,0.4235645898771214
37,1,AdaBoost (Real),1,0.75,0.3253012048192771,0.3850916235999976,63.2907772064209,0.0
38,1,Logistic Regression (Penalty = L2),1,0.75,0.5421686746987951,0.5783175950722215,0.39579343795776367,0.0
39,1,Naive Bayes,1,0.75,0.21285140562248997,0.3364011694112307,0.09756660461425781,0.0
40,1,KNeighbors Classifier,2,0.75,0.494949494949495,0.4914156703295414,0.37845635414123535,0.0
41,1,SVC Classifier,2,0.75,0.3111111111111111,1.0,1.1554007530212402,0.0
42,1,Decision Tree,2,0.75,0.43434343434343436,0.39071181418768325,0.0029315948486328125,0.39071181418768325
43,1,RandomForest,2,0.75,0.4666666666666667,0.2829518694196607,0.8192651271820068,0.0
44,1,AdaBoost (Discrete),2,0.75,0.42828282828282827,0.4964597927583036,46.51739263534546,0.0
45,1,AdaBoost (Real),2,0.75,0.2787878787878788,0.29009841379825646,75.62972259521484,0.29009841379825646
46,1,Logistic Regression (Penalty = L2),2,0.75,0.5272727272727272,0.4732637977015223,0.7319431304931641,0.0
47,1,Naive Bayes,2,0.75,0.08080808080808081,0.6428683636420658,0.23927974700927734,0.0
48,2,KNeighbors Classifier,0,0.75,0.47704590818363274,0.515710872807321,0.359713077545166,0.0
49,2,SVC Classifier,0,0.75,0.3093812375249501,1.0,1.4393730163574219,0.0
50,2,Decision Tree,0,0.75,0.4151696606786427,0.4614695347487812,0.11965513229370117,0.0
51,2,RandomForest,0,0.75,0.469061876247505,0.6504389684116559,0.847261905670166,0.0
52,2,AdaBoost (Discrete),0,0.75,0.3712574850299401,0.3885554611739381,58.148885011672974,0.3885554611739381
53,2,AdaBoost (Real),0,0.75,0.2834331337325349,0.26871604389171483,75.49052262306213,0.0
54,2,Logistic Regression (Penalty = L2),0,0.75,0.5249500998003992,0.4926054353123857,0.653888463973999,0.0
55,2,Naive Bayes,0,0.75,0.11377245508982035,0.38773446816747786,0.12656521797180176,0.0
56,2,KNeighbors Classifier,1,0.75,0.5080321285140562,0.5019518223482113,0.44793176651000977,0.0
57,2,SVC Classifier,1,0.75,0.3092369477911647,1.0,1.4837512969970703,0.0
58,2,Decision Tree,1,0.75,0.4457831325301205,0.4370303594226836,0.11069393157958984,0.0
59,2,RandomForest,1,0.75,0.5080321285140562,0.6581299772735808,0.9118380546569824,0.0
60,2,AdaBoost (Discrete),1,0.75,0.43172690763052207,0.4438690151029002,57.41337776184082,0.0
61,2,AdaBoost (Real),1,0.75,0.38353413654618473,0.3345926986877851,81.24106764793396,0.3345926986877851
62,2,Logistic Regression (Penalty = L2),1,0.75,0.5481927710843374,0.44479389149837506,0.7029690742492676,0.0
63,2,Naive Bayes,1,0.75,0.17269076305220885,0.4287649107884109,0.24001240730285645,0.0
64,2,KNeighbors Classifier,2,0.75,0.4909090909090909,0.48410997774419334,0.48307132720947266,0.0
65,2,SVC Classifier,2,0.75,0.3111111111111111,1.0,1.3816313743591309,0.0
66,2,Decision Tree,2,0.75,0.40606060606060607,0.3621401548775306,0.1197202205657959,0.0
67,2,RandomForest,2,0.75,0.4868686868686869,0.6903558268254193,0.9216668605804443,0.0
68,2,AdaBoost (Discrete),2,0.75,0.3797979797979798,0.3600501568788881,56.93892502784729,0.0
69,2,AdaBoost (Real),2,0.75,0.25656565656565655,0.31279197871944575,78.2128472328186,0.0
70,2,Logistic Regression (Penalty = L2),2,0.75,0.5050505050505051,0.443433367052614,0.7623803615570068,0.0
71,2,Naive Bayes,2,0.75,0.12525252525252525,0.506636366942522,0.12166571617126465,0.0
72,3,KNeighbors Classifier,0,0.75,0.5129740518962076,0.511577567665962,0.47980666160583496,0.0
73,3,SVC Classifier,0,0.75,0.3093812375249501,1.0,1.3351120948791504,0.0
74,3,Decision Tree,0,0.75,0.42714570858283435,0.4716035704146648,0.1349799633026123,0.0
75,3,RandomForest,0,0.75,0.48303393213572854,0.35853698032136244,0.7675940990447998,0.0
76,3,AdaBoost (Discrete),0,0.75,0.4471057884231537,0.49012994719145875,59.064146995544434,0.0
77,3,AdaBoost (Real),0,0.75,0.3532934131736527,0.290969103484263,88.58457732200623,0.290969103484263
78,3,Logistic Regression (Penalty = L2),0,0.75,0.5189620758483033,0.5027319272911231,0.7079157829284668,0.0
79,3,Naive Bayes,0,0.75,0.08582834331337326,0.5266685267202618,0.29874324798583984,0.0
80,3,KNeighbors Classifier,1,0.75,0.5160642570281124,0.5490805464493445,0.5732734203338623,0.0
81,3,SVC Classifier,1,0.75,0.3092369477911647,1.0,1.7971563339233398,0.0
82,3,Decision Tree,1,0.75,0.43373493975903615,0.4414295613413872,0.1474606990814209,0.0
83,3,RandomForest,1,0.75,0.4799196787148594,0.569759094683252,1.356217861175537,0.0
84,3,AdaBoost (Discrete),1,0.75,0.4457831325301205,0.4235645898771214,74.59905695915222,0.4235645898771214
85,3,AdaBoost (Real),1,0.75,0.35943775100401604,0.36122600509144015,88.0873429775238,0.36122600509144015
86,3,Logistic Regression (Penalty = L2),1,0.75,0.5421686746987951,0.5783175950722215,0.7517614364624023,0.0
87,3,Naive Bayes,1,0.75,0.21285140562248997,0.3364011694112307,0.28952908515930176,0.0
88,3,KNeighbors Classifier,2,0.75,0.494949494949495,0.4914156703295414,0.4021754264831543,0.0
89,3,SVC Classifier,2,0.75,0.3111111111111111,1.0,1.6409196853637695,0.0
90,3,Decision Tree,2,0.75,0.4404040404040404,0.3929175224790819,0.14730191230773926,0.3929175224790819
91,3,RandomForest,2,0.75,0.4666666666666667,0.2829518694196607,0.9642198085784912,0.0
92,3,AdaBoost (Discrete),2,0.75,0.42828282828282827,0.4964597927583036,63.80515909194946,0.0
93,3,AdaBoost (Real),2,0.75,0.2606060606060606,0.30416706602983545,85.48497343063354,0.0
94,3,Logistic Regression (Penalty = L2),2,0.75,0.5272727272727272,0.4732637977015223,0.9230499267578125,0.0
95,3,Naive Bayes,2,0.75,0.08080808080808081,0.6428683636420658,0.3110501766204834,0.0
96,4,KNeighbors Classifier,0,0.75,0.4291417165668663,0.4811959720538876,0.4688286781311035,0.0
97,4,SVC Classifier,0,0.75,0.3093812375249501,1.0,1.9198689460754395,0.0
98,4,Decision Tree,0,0.75,0.4231536926147705,0.41866799195684906,0.16016697883605957,0.0
99,4,RandomForest,0,0.75,0.43912175648702595,0.28472952937787704,1.238415241241455,0.0
100,4,AdaBoost (Discrete),0,0.75,0.4111776447105788,0.4494489620462363,67.79737448692322,0.0
101,4,AdaBoost (Real),0,0.75,0.34530938123752497,0.32990007021902973,91.28676891326904,0.32990007021902973
102,4,Logistic Regression (Penalty = L2),0,0.75,0.4750499001996008,0.43875102831750623,0.7184371948242188,0.0
103,4,Naive Bayes,0,0.75,0.0718562874251497,0.7364756974677535,0.2850227355957031,0.0
104,4,KNeighbors Classifier,1,0.75,0.4678714859437751,0.4887906585569954,0.5693786144256592,0.0
105,4,SVC Classifier,1,0.75,0.3092369477911647,1.0,1.5628983974456787,0.0
106,4,Decision Tree,1,0.75,0.42971887550200805,0.4375310255623765,0.14008331298828125,0.0
107,4,RandomForest,1,0.75,0.4598393574297189,0.5180330603061801,1.2454864978790283,0.0
108,4,AdaBoost (Discrete),1,0.75,0.3855421686746988,0.43882928174294455,61.91740417480469,0.0
109,4,AdaBoost (Real),1,0.75,0.37349397590361444,0.4481618150188564,87.29796743392944,0.0
110,4,Logistic Regression (Penalty = L2),1,0.75,0.46586345381526106,0.3883645817730628,0.9677934646606445,0.0
111,4,Naive Bayes,1,0.75,0.1706827309236948,0.663085942556331,0.3638646602630615,0.0
112,4,KNeighbors Classifier,2,0.75,0.4121212121212121,0.45137820231072395,0.7356793880462646,0.0
113,4,SVC Classifier,2,0.75,0.3111111111111111,1.0,2.2314305305480957,0.0
114,4,Decision Tree,2,0.75,0.40404040404040403,0.3765374068320973,0.17545509338378906,0.0
115,4,RandomForest,2,0.75,0.45252525252525255,0.4071757002002686,0.6467170715332031,0.0
116,4,AdaBoost (Discrete),2,0.75,0.36363636363636365,0.4016428837084956,68.79371905326843,0.0
117,4,AdaBoost (Real),2,0.75,0.23434343434343435,0.28507058015119174,90.94578742980957,0.0
118,4,Logistic Regression (Penalty = L2),2,0.75,0.4585858585858586,0.43289753508924705,0.8674182891845703,0.0
119,4,Naive Bayes,2,0.75,0.08080808080808081,0.6357148395449027,0.16968464851379395,0.0
120,5,KNeighbors Classifier,0,0.75,0.4291417165668663,0.4811959720538876,0.5035147666931152,0.0
121,5,SVC Classifier,0,0.75,0.3093812375249501,1.0,1.8437862396240234,0.0
122,5,Decision Tree,0,0.75,0.39520958083832336,0.4644504714265495,0.16368365287780762,0.0
123,5,RandomForest,0,0.75,0.43912175648702595,0.28472952937787704,0.9548866748809814,0.0
124,5,AdaBoost (Discrete),0,0.75,0.4111776447105788,0.4494489620462363,65.62419867515564,0.0
125,5,AdaBoost (Real),0,0.75,0.21956087824351297,0.30228747759803315,94.76418924331665,0.30228747759803315
126,5,Logistic Regression (Penalty = L2),0,0.75,0.4750499001996008,0.43875102831750623,0.7145445346832275,0.0
127,5,Naive Bayes,0,0.75,0.0718562874251497,0.7364756974677535,0.2544717788696289,0.0
128,5,KNeighbors Classifier,1,0.75,0.4678714859437751,0.4887906585569954,0.554511308670044,0.0
129,5,SVC Classifier,1,0.75,0.3092369477911647,1.0,1.7149131298065186,0.0
130,5,Decision Tree,1,0.75,0.44176706827309237,0.4282525827952044,0.1360933780670166,0.0
131,5,RandomForest,1,0.75,0.4598393574297189,0.5180330603061801,1.0536444187164307,0.0
132,5,AdaBoost (Discrete),1,0.75,0.3855421686746988,0.43882928174294455,70.38017153739929,0.0
133,5,AdaBoost (Real),1,0.75,0.37349397590361444,0.4481618150188564,86.04742407798767,0.0
134,5,Logistic Regression (Penalty = L2),1,0.75,0.46586345381526106,0.3883645817730628,0.386807918548584,0.0
135,5,Naive Bayes,1,0.75,0.1706827309236948,0.663085942556331,0.12987303733825684,0.0
136,5,KNeighbors Classifier,2,0.75,0.4121212121212121,0.45137820231072395,0.5081510543823242,0.0
137,5,SVC Classifier,2,0.75,0.3111111111111111,1.0,1.6525676250457764,0.0
138,5,Decision Tree,2,0.75,0.4,0.42028449804063805,0.13982343673706055,0.0
139,5,RandomForest,2,0.75,0.45252525252525255,0.4071757002002686,1.142829179763794,0.0
140,5,AdaBoost (Discrete),2,0.75,0.36363636363636365,0.4016428837084956,62.619378089904785,0.0
141,5,AdaBoost (Real),2,0.75,0.38585858585858585,0.29679811594368977,78.23430299758911,0.0
142,5,Logistic Regression (Penalty = L2),2,0.75,0.4585858585858586,0.43289753508924705,0.5888402462005615,0.0
143,5,Naive Bayes,2,0.75,0.08080808080808081,0.6357148395449027,0.11752676963806152,0.0
144,6,KNeighbors Classifier,0,0.75,0.5129740518962076,0.511577567665962,0.4624171257019043,0.0
145,6,SVC Classifier,0,0.75,0.3093812375249501,1.0,1.3891942501068115,0.0
146,6,Decision Tree,0,0.75,0.46107784431137727,0.3302558423368529,0.11609387397766113,0.3302558423368529
147,6,RandomForest,0,0.75,0.48303393213572854,0.35853698032136244,0.9281876087188721,0.0
148,6,AdaBoost (Discrete),0,0.75,0.44510978043912175,0.4893580762350527,57.268033027648926,0.0
149,6,AdaBoost (Real),0,0.75,0.3013972055888224,0.3149799352610324,81.28717923164368,0.3149799352610324
150,6,Logistic Regression (Penalty = L2),0,0.75,0.5189620758483033,0.5027319272911231,0.6994326114654541,0.0
151,6,Naive Bayes,0,0.75,0.08582834331337326,0.5266685267202618,0.11835169792175293,0.0
152,6,KNeighbors Classifier,1,0.75,0.5160642570281124,0.5490805464493445,0.6457719802856445,0.0
153,6,SVC Classifier,1,0.75,0.3092369477911647,1.0,1.6723859310150146,0.0
154,6,Decision Tree,1,0.75,0.41566265060240964,0.39909566255587603,0.12396574020385742,0.0
155,6,RandomForest,1,0.75,0.4799196787148594,0.569759094683252,0.8108782768249512,0.0
156,6,AdaBoost (Discrete),1,0.75,0.4457831325301205,0.4235645898771214,59.68000078201294,0.4235645898771214
157,6,AdaBoost (Real),1,0.75,0.37349397590361444,0.38757490926523747,83.04453301429749,0.0
158,6,Logistic Regression (Penalty = L2),1,0.75,0.5421686746987951,0.5783175950722215,0.6194462776184082,0.0
159,6,Naive Bayes,1,0.75,0.21285140562248997,0.3364011694112307,0.23992633819580078,0.0
160,6,KNeighbors Classifier,2,0.75,0.494949494949495,0.4914156703295414,0.48983001708984375,0.0
161,6,SVC Classifier,2,0.75,0.3111111111111111,1.0,1.5747363567352295,0.0
162,6,Decision Tree,2,0.75,0.4868686868686869,0.4828245772623343,0.12027740478515625,0.0
163,6,RandomForest,2,0.75,0.4666666666666667,0.2829518694196607,0.8421039581298828,0.0
164,6,AdaBoost (Discrete),2,0.75,0.42828282828282827,0.4964597927583036,59.958160638809204,0.0
165,6,AdaBoost (Real),2,0.75,0.2808080808080808,0.32352111246794246,86.63687872886658,0.0
166,6,Logistic Regression (Penalty = L2),2,0.75,0.5272727272727272,0.4732637977015223,0.7984812259674072,0.0
167,6,Naive Bayes,2,0.75,0.08080808080808081,0.6428683636420658,0.2632613182067871,0.0
168,7,KNeighbors Classifier,0,0.75,0.5209580838323353,0.5414107704758029,0.6577315330505371,0.0
169,7,SVC Classifier,0,0.75,0.3093812375249501,1.0,1.6865062713623047,0.0
170,7,Decision Tree,0,0.75,0.4550898203592814,0.3632437187313518,0.13202428817749023,0.3632437187313518
171,7,RandomForest,0,0.75,0.45109780439121755,0.2768168689779958,1.0006985664367676,0.0
172,7,AdaBoost (Discrete),0,0.75,0.49500998003992014,0.5007797604527435,83.86294078826904,0.0
173,7,AdaBoost (Real),0,0.75,0.32934131736526945,0.3563769214547409,110.89918041229248,0.3563769214547409
174,7,Logistic Regression (Penalty = L2),0,0.75,0.5768463073852296,0.5246904905780504,0.7528059482574463,0.0
175,7,Naive Bayes,0,0.75,0.12375249500998003,0.2945802783794665,0.29536008834838867,0.0
176,7,KNeighbors Classifier,1,0.75,0.5461847389558233,0.5351543757773826,0.7395062446594238,0.0
177,7,SVC Classifier,1,0.75,0.3092369477911647,1.0,1.7795677185058594,0.0
178,7,Decision Tree,1,0.75,0.4779116465863454,0.4049130898743675,0.1480541229248047,0.4049130898743675
179,7,RandomForest,1,0.75,0.5622489959839357,0.5895941436874921,1.0495243072509766,0.0
180,7,AdaBoost (Discrete),1,0.75,0.4919678714859438,0.5165424862211577,71.21295213699341,0.0
181,7,AdaBoost (Real),1,0.75,0.41164658634538154,0.36321487439083255,101.10776996612549,0.0
182,7,Logistic Regression (Penalty = L2),1,0.75,0.5903614457831325,0.5848712434206008,0.7970364093780518,0.0
183,7,Naive Bayes,1,0.75,0.21285140562248997,0.3860491600499613,0.14960050582885742,0.0
184,7,KNeighbors Classifier,2,0.75,0.5494949494949495,0.5135003813236351,0.8772563934326172,0.0
185,7,SVC Classifier,2,0.75,0.3111111111111111,1.0,1.6785624027252197,0.0
186,7,Decision Tree,2,0.75,0.5151515151515151,0.3990042788679632,0.16058039665222168,0.3990042788679632
187,7,RandomForest,2,0.75,0.4686868686868687,0.3817159181209077,1.0865249633789062,0.0
188,7,AdaBoost (Discrete),2,0.75,0.46464646464646464,0.42751461723393436,69.46920990943909,0.0
189,7,AdaBoost (Real),2,0.75,0.35353535353535354,0.37408421538606884,88.46070456504822,0.0
190,7,Logistic Regression (Penalty = L2),2,0.75,0.5757575757575758,0.5091462651866212,0.6725673675537109,0.0
191,7,Naive Bayes,2,0.75,0.12525252525252525,0.5057380642056387,0.274000883102417,0.0
192,8,KNeighbors Classifier,0,0.75,0.4291417165668663,0.4811959720538876,0.5859782695770264,0.0
193,8,SVC Classifier,0,0.75,0.3093812375249501,1.0,1.6003072261810303,0.0
194,8,Decision Tree,0,0.75,0.4171656686626746,0.4510548406358221,0.13593459129333496,0.0
195,8,RandomForest,0,0.75,0.43912175648702595,0.28472952937787704,0.9554769992828369,0.0
196,8,AdaBoost (Discrete),0,0.75,0.4111776447105788,0.4494489620462363,63.08670902252197,0.0
197,8,AdaBoost (Real),0,0.75,0.281437125748503,0.31691664715959333,96.13884973526001,0.0
198,8,Logistic Regression (Penalty = L2),0,0.75,0.4750499001996008,0.43875102831750623,0.7840743064880371,0.0
199,8,Naive Bayes,0,0.75,0.0718562874251497,0.7364756974677535,0.3188154697418213,0.0
200,8,KNeighbors Classifier,1,0.75,0.4678714859437751,0.4887906585569954,0.5448698997497559,0.0
201,8,SVC Classifier,1,0.75,0.3092369477911647,1.0,1.887207269668579,0.0
202,8,Decision Tree,1,0.75,0.40160642570281124,0.38704750244210134,0.16003155708312988,0.0
203,8,RandomForest,1,0.75,0.4598393574297189,0.5180330603061801,0.924572229385376,0.0
204,8,AdaBoost (Discrete),1,0.75,0.3855421686746988,0.43882928174294455,67.84119391441345,0.0
205,8,AdaBoost (Real),1,0.75,0.37349397590361444,0.4481618150188564,94.43108201026917,0.0
206,8,Logistic Regression (Penalty = L2),1,0.75,0.46586345381526106,0.3883645817730628,0.5071125030517578,0.0
207,8,Naive Bayes,1,0.75,0.1706827309236948,0.663085942556331,0.2712271213531494,0.0
208,8,KNeighbors Classifier,2,0.75,0.4121212121212121,0.45137820231072395,0.4317660331726074,0.0
209,8,SVC Classifier,2,0.75,0.3111111111111111,1.0,1.6676251888275146,0.0
210,8,Decision Tree,2,0.75,0.397979797979798,0.38523774893265794,0.15480923652648926,0.0
211,8,RandomForest,2,0.75,0.45252525252525255,0.4071757002002686,1.0658447742462158,0.0
212,8,AdaBoost (Discrete),2,0.75,0.36363636363636365,0.4016428837084956,73.78256034851074,0.0
213,8,AdaBoost (Real),2,0.75,0.38585858585858585,0.29679811594368977,92.77239298820496,0.0
214,8,Logistic Regression (Penalty = L2),2,0.75,0.4585858585858586,0.43289753508924705,0.3861865997314453,0.0
215,8,Naive Bayes,2,0.75,0.08080808080808081,0.6357148395449027,0.10328221321105957,0.0
