,feat_set_id,classifier,fold_id,feat_th,score,geo_score,exec_t,geo_score_woz
0,0,KNeighbors Classifier,0,0.15,0.6789,0.5413281263334431,7.516393661499023,0.5413281263334431
1,0,SVC Classifier,0,0.15,0.7795,0.09014398837291854,32.87832570075989,0.09014398837291854
2,0,Decision Tree,0,0.15,0.8075,0.5653897158412291,0.07924461364746094,0.5653897158412291
3,0,RandomForest,0,0.15,0.8098,0.5374868162767433,0.3634943962097168,0.5374868162767433
4,0,AdaBoost (Discrete),0,0.15,0.8072,0.5518850551035501,21.63932991027832,0.5518850551035501
5,0,AdaBoost (Real),0,0.15,0.8072,0.5639225144311613,80.7214047908783,0.5639225144311613
6,0,Logistic Regression (Penalty = L2),0,0.15,0.8052,0.472954528025573,0.16849541664123535,0.472954528025573
7,0,Naive Bayes,0,0.15,0.7896,0.5787894000140409,0.12277030944824219,0.5787894000140409
8,0,KNeighbors Classifier,1,0.15,0.7739,0.6140787853036744,7.048802137374878,0.6140787853036744
9,0,SVC Classifier,1,0.15,0.7788,1.0,27.62221932411194,0.0
10,0,Decision Tree,1,0.15,0.8232,0.6180032341725532,0.06546521186828613,0.6180032341725532
11,0,RandomForest,1,0.15,0.8261,0.5843302640681952,0.2919936180114746,0.5843302640681952
12,0,AdaBoost (Discrete),1,0.15,0.8242,0.6190291170161404,21.006638050079346,0.6190291170161404
13,0,AdaBoost (Real),1,0.15,0.8235,0.6199398738054017,87.25827097892761,0.6199398738054017
14,0,Logistic Regression (Penalty = L2),1,0.15,0.8118,0.4869616983197019,0.20861148834228516,0.4869616983197019
15,0,Naive Bayes,1,0.15,0.7989,0.627264017623129,0.10198760032653809,0.627264017623129
16,0,KNeighbors Classifier,2,0.15,0.8037,0.5920813328202712,8.050058603286743,0.5920813328202712
17,0,SVC Classifier,2,0.15,0.7788,1.0,28.414914846420288,0.0
18,0,Decision Tree,2,0.15,0.823,0.557069408795849,0.07210612297058105,0.557069408795849
19,0,RandomForest,2,0.15,0.8242,0.5528699919506312,0.3517270088195801,0.5528699919506312
20,0,AdaBoost (Discrete),2,0.15,0.8221,0.5426550094175557,20.419432163238525,0.5426550094175557
21,0,AdaBoost (Real),2,0.15,0.8229,0.5552548346756216,67.0068769454956,0.5552548346756216
22,0,Logistic Regression (Penalty = L2),2,0.15,0.8062,0.42724253100183507,0.15410685539245605,0.42724253100183507
23,0,Naive Bayes,2,0.15,0.8142,0.587148836808227,0.06597304344177246,0.587148836808227
24,1,KNeighbors Classifier,0,0.15,0.7614,0.5410933960830032,1.714130163192749,0.5410933960830032
25,1,SVC Classifier,0,0.15,0.7788,1.0,30.06452989578247,0.0
26,1,Decision Tree,0,0.15,0.7236,0.5366742089311398,0.3511693477630615,0.5366742089311398
27,1,RandomForest,0,0.15,0.8098,0.5374868162767433,0.5062606334686279,0.5374868162767433
28,1,AdaBoost (Discrete),0,0.15,0.8109,0.5501021321716741,49.38282084465027,0.5501021321716741
29,1,AdaBoost (Real),0,0.15,0.7837,0.5243700858001248,61.03543305397034,0.5243700858001248
30,1,Logistic Regression (Penalty = L2),0,0.15,0.8065,0.5098999841668851,0.18758177757263184,0.5098999841668851
31,1,Naive Bayes,0,0.15,0.7738,0.6510426404248907,0.0753026008605957,0.6510426404248907
32,1,KNeighbors Classifier,1,0.15,0.783,0.5754604464691535,1.750013828277588,0.5754604464691535
33,1,SVC Classifier,1,0.15,0.7788,1.0,29.315623998641968,0.0
34,1,Decision Tree,1,0.15,0.7267,0.5563125381950549,0.27480244636535645,0.5563125381950549
35,1,RandomForest,1,0.15,0.8249,0.5865063598458912,0.48977041244506836,0.5865063598458912
36,1,AdaBoost (Discrete),1,0.15,0.8246,0.5896686782184047,47.68400979042053,0.5896686782184047
37,1,AdaBoost (Real),1,0.15,0.7964,0.5716296151091504,62.59990215301514,0.5716296151091504
38,1,Logistic Regression (Penalty = L2),1,0.15,0.8168,0.5292177963171487,0.19820284843444824,0.5292177963171487
39,1,Naive Bayes,1,0.15,0.7878,0.6804017076089984,0.09876441955566406,0.6804017076089984
40,1,KNeighbors Classifier,2,0.15,0.7822,0.5565260385036248,1.6255993843078613,0.5565260385036248
41,1,SVC Classifier,2,0.15,0.7788,1.0,28.31727123260498,0.0
42,1,Decision Tree,2,0.15,0.736,0.5476720657952893,0.25695085525512695,0.5476720657952893
43,1,RandomForest,2,0.15,0.8239,0.5570475778696428,0.33912086486816406,0.5570475778696428
44,1,AdaBoost (Discrete),2,0.15,0.8234,0.5621529871024181,46.49091291427612,0.5621529871024181
45,1,AdaBoost (Real),2,0.15,0.7959,0.5288081219616205,58.85160207748413,0.5288081219616205
46,1,Logistic Regression (Penalty = L2),2,0.15,0.8104,0.4702251194441065,0.17715096473693848,0.4702251194441065
47,1,Naive Bayes,2,0.15,0.793,0.6514626805578182,0.12243199348449707,0.6514626805578182
48,2,KNeighbors Classifier,0,0.15,0.6789,0.5413281263334431,7.116125106811523,0.5413281263334431
49,2,SVC Classifier,0,0.15,0.7795,0.09014398837291854,27.28789734840393,0.09014398837291854
50,2,Decision Tree,0,0.15,0.8079,0.5682338966613941,0.06379890441894531,0.5682338966613941
51,2,RandomForest,0,0.15,0.8098,0.5374868162767433,0.25795507431030273,0.5374868162767433
52,2,AdaBoost (Discrete),0,0.15,0.8072,0.5518850551035501,21.188318967819214,0.5518850551035501
53,2,AdaBoost (Real),0,0.15,0.8072,0.5639225144311613,71.00493168830872,0.5639225144311613
54,2,Logistic Regression (Penalty = L2),0,0.15,0.8052,0.472954528025573,0.13267970085144043,0.472954528025573
55,2,Naive Bayes,0,0.15,0.7896,0.5787894000140409,0.06706809997558594,0.5787894000140409
56,2,KNeighbors Classifier,1,0.15,0.7739,0.6140787853036744,7.196043968200684,0.6140787853036744
57,2,SVC Classifier,1,0.15,0.7788,1.0,29.387312173843384,0.0
58,2,Decision Tree,1,0.15,0.8235,0.6187339898875585,0.08630681037902832,0.6187339898875585
59,2,RandomForest,1,0.15,0.8261,0.5843302640681952,0.24040508270263672,0.5843302640681952
60,2,AdaBoost (Discrete),1,0.15,0.8242,0.6190291170161404,21.01193141937256,0.6190291170161404
61,2,AdaBoost (Real),1,0.15,0.8235,0.6199398738054017,66.40148425102234,0.6199398738054017
62,2,Logistic Regression (Penalty = L2),1,0.15,0.8118,0.4869616983197019,0.200286865234375,0.4869616983197019
63,2,Naive Bayes,1,0.15,0.7989,0.627264017623129,0.12071871757507324,0.627264017623129
64,2,KNeighbors Classifier,2,0.15,0.8037,0.5920813328202712,8.161640405654907,0.5920813328202712
65,2,SVC Classifier,2,0.15,0.7788,1.0,28.31148934364319,0.0
66,2,Decision Tree,2,0.15,0.8234,0.5575722211658029,0.055211782455444336,0.5575722211658029
67,2,RandomForest,2,0.15,0.8242,0.5528699919506312,0.357318639755249,0.5528699919506312
68,2,AdaBoost (Discrete),2,0.15,0.8221,0.5426550094175557,20.932194471359253,0.5426550094175557
69,2,AdaBoost (Real),2,0.15,0.8228,0.5548614553597347,57.299843311309814,0.5548614553597347
70,2,Logistic Regression (Penalty = L2),2,0.15,0.8062,0.42724253100183507,0.23960280418395996,0.42724253100183507
71,2,Naive Bayes,2,0.15,0.8142,0.587148836808227,0.08758997917175293,0.587148836808227
72,3,KNeighbors Classifier,0,0.15,0.6789,0.5413281263334431,7.572424650192261,0.5413281263334431
73,3,SVC Classifier,0,0.15,0.7795,0.09014398837291854,27.12933874130249,0.09014398837291854
74,3,Decision Tree,0,0.15,0.8077,0.5671500145226306,0.05970120429992676,0.5671500145226306
75,3,RandomForest,0,0.15,0.8098,0.5374868162767433,0.3433952331542969,0.5374868162767433
76,3,AdaBoost (Discrete),0,0.15,0.8072,0.5518850551035501,21.960235834121704,0.5518850551035501
77,3,AdaBoost (Real),0,0.15,0.8072,0.5639225144311613,65.35121011734009,0.5639225144311613
78,3,Logistic Regression (Penalty = L2),0,0.15,0.8052,0.472954528025573,0.20305871963500977,0.472954528025573
79,3,Naive Bayes,0,0.15,0.7896,0.5787894000140409,0.06906962394714355,0.5787894000140409
80,3,KNeighbors Classifier,1,0.15,0.7739,0.6140787853036744,6.861847639083862,0.6140787853036744
81,3,SVC Classifier,1,0.15,0.7788,1.0,31.066608667373657,0.0
82,3,Decision Tree,1,0.15,0.8233,0.6186496419913329,0.06308627128601074,0.6186496419913329
83,3,RandomForest,1,0.15,0.8261,0.5843302640681952,0.31904149055480957,0.5843302640681952
84,3,AdaBoost (Discrete),1,0.15,0.8242,0.6190291170161404,22.602688550949097,0.6190291170161404
85,3,AdaBoost (Real),1,0.15,0.8235,0.6199398738054017,62.8543484210968,0.6199398738054017
86,3,Logistic Regression (Penalty = L2),1,0.15,0.8118,0.4869616983197019,0.19443464279174805,0.4869616983197019
87,3,Naive Bayes,1,0.15,0.7989,0.627264017623129,0.10112500190734863,0.627264017623129
88,3,KNeighbors Classifier,2,0.15,0.8037,0.5920813328202712,7.668251037597656,0.5920813328202712
89,3,SVC Classifier,2,0.15,0.7788,1.0,28.467548847198486,0.0
90,3,Decision Tree,2,0.15,0.8233,0.5575351571699387,0.06677103042602539,0.5575351571699387
91,3,RandomForest,2,0.15,0.8242,0.5528699919506312,0.2493748664855957,0.5528699919506312
92,3,AdaBoost (Discrete),2,0.15,0.8221,0.5426550094175557,21.71026372909546,0.5426550094175557
93,3,AdaBoost (Real),2,0.15,0.8228,0.5548614553597347,55.61210584640503,0.5548614553597347
94,3,Logistic Regression (Penalty = L2),2,0.15,0.8062,0.42724253100183507,0.25241565704345703,0.42724253100183507
95,3,Naive Bayes,2,0.15,0.8142,0.587148836808227,0.09456324577331543,0.587148836808227
96,4,KNeighbors Classifier,0,0.15,0.3898,0.4465368785977873,4.76392126083374,0.4465368785977873
97,4,SVC Classifier,0,0.15,0.7788,1.0,19.402447938919067,0.0
98,4,Decision Tree,0,0.15,0.8091,0.5331998579600798,0.03393435478210449,0.5331998579600798
99,4,RandomForest,0,0.15,0.8098,0.5374868162767433,0.3087289333343506,0.5374868162767433
100,4,AdaBoost (Discrete),0,0.15,0.8091,0.5331998579600798,16.99581789970398,0.5331998579600798
101,4,AdaBoost (Real),0,0.15,0.8097,0.5359881800938336,328.4085054397583,0.5359881800938336
102,4,Logistic Regression (Penalty = L2),0,0.15,0.8098,0.5374868162767433,0.1147005558013916,0.5374868162767433
103,4,Naive Bayes,0,0.15,0.8098,0.5374868162767433,0.064208984375,0.5374868162767433
104,4,KNeighbors Classifier,1,0.15,0.7373,0.4167498066475552,5.928463935852051,0.4167498066475552
105,4,SVC Classifier,1,0.15,0.7788,1.0,18.61535930633545,0.0
106,4,Decision Tree,1,0.15,0.8245,0.584698307625315,0.03774905204772949,0.584698307625315
107,4,RandomForest,1,0.15,0.8249,0.5865063598458912,0.24070000648498535,0.5865063598458912
108,4,AdaBoost (Discrete),1,0.15,0.8245,0.584698307625315,17.400317430496216,0.584698307625315
109,4,AdaBoost (Real),1,0.15,0.8245,0.584698307625315,315.7476291656494,0.584698307625315
110,4,Logistic Regression (Penalty = L2),1,0.15,0.8249,0.5865063598458912,0.11321234703063965,0.5865063598458912
111,4,Naive Bayes,1,0.15,0.8249,0.5865063598458912,0.0641477108001709,0.5865063598458912
112,4,KNeighbors Classifier,2,0.15,0.7875,0.23526314858897693,6.168121099472046,0.23526314858897693
113,4,SVC Classifier,2,0.15,0.7788,1.0,18.657313108444214,0.0
114,4,Decision Tree,2,0.15,0.824,0.5545891737925498,0.06087064743041992,0.5545891737925498
115,4,RandomForest,2,0.15,0.8241,0.5578316001828668,0.30202555656433105,0.5578316001828668
116,4,AdaBoost (Discrete),2,0.15,0.8241,0.5578316001828668,17.887582540512085,0.5578316001828668
117,4,AdaBoost (Real),2,0.15,0.8241,0.5553406581675171,355.386346578598,0.5553406581675171
118,4,Logistic Regression (Penalty = L2),2,0.15,0.8241,0.5578316001828668,0.10005569458007812,0.5578316001828668
119,4,Naive Bayes,2,0.15,0.8241,0.5578316001828668,0.0487062931060791,0.5578316001828668
120,5,KNeighbors Classifier,0,0.15,0.6789,0.5413281263334431,7.189502477645874,0.5413281263334431
121,5,SVC Classifier,0,0.15,0.7795,0.09014398837291854,27.5120906829834,0.09014398837291854
122,5,Decision Tree,0,0.15,0.8078,0.5668527100490027,0.06673860549926758,0.5668527100490027
123,5,RandomForest,0,0.15,0.8098,0.5374868162767433,0.290682315826416,0.5374868162767433
124,5,AdaBoost (Discrete),0,0.15,0.8072,0.5518850551035501,19.882891416549683,0.5518850551035501
125,5,AdaBoost (Real),0,0.15,0.8072,0.5639225144311613,58.98597598075867,0.5639225144311613
126,5,Logistic Regression (Penalty = L2),0,0.15,0.8052,0.472954528025573,0.19066405296325684,0.472954528025573
127,5,Naive Bayes,0,0.15,0.7896,0.5787894000140409,0.058328866958618164,0.5787894000140409
128,5,KNeighbors Classifier,1,0.15,0.7739,0.6140787853036744,6.955611228942871,0.6140787853036744
129,5,SVC Classifier,1,0.15,0.7788,1.0,28.078492879867554,0.0
130,5,Decision Tree,1,0.15,0.8231,0.617961105726806,0.06763982772827148,0.617961105726806
131,5,RandomForest,1,0.15,0.8261,0.5843302640681952,0.32518720626831055,0.5843302640681952
132,5,AdaBoost (Discrete),1,0.15,0.8242,0.6190291170161404,20.640004634857178,0.6190291170161404
133,5,AdaBoost (Real),1,0.15,0.8235,0.6199398738054017,74.67234635353088,0.6199398738054017
134,5,Logistic Regression (Penalty = L2),1,0.15,0.8118,0.4869616983197019,0.2317960262298584,0.4869616983197019
135,5,Naive Bayes,1,0.15,0.7989,0.627264017623129,0.08056521415710449,0.627264017623129
136,5,KNeighbors Classifier,2,0.15,0.8037,0.5920813328202712,7.645762205123901,0.5920813328202712
137,5,SVC Classifier,2,0.15,0.7788,1.0,29.66708207130432,0.0
138,5,Decision Tree,2,0.15,0.823,0.5567145371383199,0.06577110290527344,0.5567145371383199
139,5,RandomForest,2,0.15,0.8242,0.5528699919506312,0.31723546981811523,0.5528699919506312
140,5,AdaBoost (Discrete),2,0.15,0.8221,0.5426550094175557,21.23257327079773,0.5426550094175557
141,5,AdaBoost (Real),2,0.15,0.8228,0.5548614553597347,60.46350073814392,0.5548614553597347
142,5,Logistic Regression (Penalty = L2),2,0.15,0.8062,0.42724253100183507,0.20053482055664062,0.42724253100183507
143,5,Naive Bayes,2,0.15,0.8142,0.587148836808227,0.0756983757019043,0.587148836808227
144,6,KNeighbors Classifier,0,0.15,0.6789,0.5413281263334431,6.367511034011841,0.5413281263334431
145,6,SVC Classifier,0,0.15,0.7795,0.09014398837291854,26.63767123222351,0.09014398837291854
146,6,Decision Tree,0,0.15,0.8073,0.5656496150301269,0.09219717979431152,0.5656496150301269
147,6,RandomForest,0,0.15,0.8098,0.5374868162767433,0.32322216033935547,0.5374868162767433
148,6,AdaBoost (Discrete),0,0.15,0.8072,0.5518850551035501,20.774733066558838,0.5518850551035501
149,6,AdaBoost (Real),0,0.15,0.8073,0.5642993420805843,71.2461245059967,0.5642993420805843
150,6,Logistic Regression (Penalty = L2),0,0.15,0.8052,0.472954528025573,0.18267822265625,0.472954528025573
151,6,Naive Bayes,0,0.15,0.7896,0.5787894000140409,0.09368705749511719,0.5787894000140409
152,6,KNeighbors Classifier,1,0.15,0.7739,0.6140787853036744,8.229816675186157,0.6140787853036744
153,6,SVC Classifier,1,0.15,0.7788,1.0,31.329338788986206,0.0
154,6,Decision Tree,1,0.15,0.8236,0.6187761595239943,0.09463143348693848,0.6187761595239943
155,6,RandomForest,1,0.15,0.8261,0.5843302640681952,0.38341474533081055,0.5843302640681952
156,6,AdaBoost (Discrete),1,0.15,0.8242,0.6190291170161404,21.13505792617798,0.6190291170161404
157,6,AdaBoost (Real),1,0.15,0.8235,0.6199398738054017,74.50083947181702,0.6199398738054017
158,6,Logistic Regression (Penalty = L2),1,0.15,0.8118,0.4869616983197019,0.17722463607788086,0.4869616983197019
159,6,Naive Bayes,1,0.15,0.7989,0.627264017623129,0.08253097534179688,0.627264017623129
160,6,KNeighbors Classifier,2,0.15,0.8037,0.5920813328202712,6.925531625747681,0.5920813328202712
161,6,SVC Classifier,2,0.15,0.7788,1.0,28.75187921524048,0.0
162,6,Decision Tree,2,0.15,0.8231,0.5567515515020547,0.0927281379699707,0.5567515515020547
163,6,RandomForest,2,0.15,0.8242,0.5528699919506312,0.36534690856933594,0.5528699919506312
164,6,AdaBoost (Discrete),2,0.15,0.8221,0.5426550094175557,21.06164240837097,0.5426550094175557
165,6,AdaBoost (Real),2,0.15,0.8228,0.5548614553597347,60.07749843597412,0.5548614553597347
166,6,Logistic Regression (Penalty = L2),2,0.15,0.8062,0.42724253100183507,0.19147324562072754,0.42724253100183507
167,6,Naive Bayes,2,0.15,0.8142,0.587148836808227,0.06760835647583008,0.587148836808227
168,7,KNeighbors Classifier,0,0.15,0.3898,0.4465368785977873,6.457338809967041,0.4465368785977873
169,7,SVC Classifier,0,0.15,0.7788,1.0,20.647578954696655,0.0
170,7,Decision Tree,0,0.15,0.8091,0.5331998579600798,0.061394453048706055,0.5331998579600798
171,7,RandomForest,0,0.15,0.8098,0.5374868162767433,0.28110241889953613,0.5374868162767433
172,7,AdaBoost (Discrete),0,0.15,0.8091,0.5331998579600798,16.632730722427368,0.5331998579600798
173,7,AdaBoost (Real),0,0.15,0.8097,0.5359881800938336,342.01617765426636,0.5359881800938336
174,7,Logistic Regression (Penalty = L2),0,0.15,0.8098,0.5374868162767433,0.1324443817138672,0.5374868162767433
175,7,Naive Bayes,0,0.15,0.8098,0.5374868162767433,0.04961705207824707,0.5374868162767433
176,7,KNeighbors Classifier,1,0.15,0.7373,0.4167498066475552,5.406895637512207,0.4167498066475552
177,7,SVC Classifier,1,0.15,0.7788,1.0,18.078672170639038,0.0
178,7,Decision Tree,1,0.15,0.8245,0.584698307625315,0.03728771209716797,0.584698307625315
179,7,RandomForest,1,0.15,0.8249,0.5865063598458912,0.3365626335144043,0.5865063598458912
180,7,AdaBoost (Discrete),1,0.15,0.8245,0.584698307625315,17.859113454818726,0.584698307625315
181,7,AdaBoost (Real),1,0.15,0.8245,0.584698307625315,323.10474848747253,0.584698307625315
182,7,Logistic Regression (Penalty = L2),1,0.15,0.8249,0.5865063598458912,0.11874222755432129,0.5865063598458912
183,7,Naive Bayes,1,0.15,0.8249,0.5865063598458912,0.06207680702209473,0.5865063598458912
184,7,KNeighbors Classifier,2,0.15,0.7875,0.23526314858897693,4.912430286407471,0.23526314858897693
185,7,SVC Classifier,2,0.15,0.7788,1.0,15.791958570480347,0.0
186,7,Decision Tree,2,0.15,0.824,0.5545891737925498,0.03430509567260742,0.5545891737925498
187,7,RandomForest,2,0.15,0.8241,0.5578316001828668,0.32184648513793945,0.5578316001828668
188,7,AdaBoost (Discrete),2,0.15,0.8241,0.5578316001828668,18.52102279663086,0.5578316001828668
189,7,AdaBoost (Real),2,0.15,0.8241,0.5553406581675171,353.4406621456146,0.5553406581675171
190,7,Logistic Regression (Penalty = L2),2,0.15,0.8241,0.5578316001828668,0.13571381568908691,0.5578316001828668
191,7,Naive Bayes,2,0.15,0.8241,0.5578316001828668,0.040708065032958984,0.5578316001828668
192,8,KNeighbors Classifier,0,0.15,0.3898,0.4465368785977873,5.042988538742065,0.4465368785977873
193,8,SVC Classifier,0,0.15,0.7788,1.0,18.54263472557068,0.0
194,8,Decision Tree,0,0.15,0.8091,0.5331998579600798,0.0340571403503418,0.5331998579600798
195,8,RandomForest,0,0.15,0.8098,0.5374868162767433,0.2880256175994873,0.5374868162767433
196,8,AdaBoost (Discrete),0,0.15,0.8091,0.5331998579600798,16.965996503829956,0.5331998579600798
197,8,AdaBoost (Real),0,0.15,0.8097,0.5359881800938336,333.42402935028076,0.5359881800938336
198,8,Logistic Regression (Penalty = L2),0,0.15,0.8098,0.5374868162767433,0.13748717308044434,0.5374868162767433
199,8,Naive Bayes,0,0.15,0.8098,0.5374868162767433,0.05968070030212402,0.5374868162767433
200,8,KNeighbors Classifier,1,0.15,0.7373,0.4167498066475552,5.463253974914551,0.4167498066475552
201,8,SVC Classifier,1,0.15,0.7788,1.0,17.20890998840332,0.0
202,8,Decision Tree,1,0.15,0.8245,0.584698307625315,0.03762316703796387,0.584698307625315
203,8,RandomForest,1,0.15,0.8249,0.5865063598458912,0.3160529136657715,0.5865063598458912
204,8,AdaBoost (Discrete),1,0.15,0.8245,0.584698307625315,16.55051350593567,0.584698307625315
205,8,AdaBoost (Real),1,0.15,0.8245,0.584698307625315,325.9309275150299,0.584698307625315
206,8,Logistic Regression (Penalty = L2),1,0.15,0.8249,0.5865063598458912,0.14201140403747559,0.5865063598458912
207,8,Naive Bayes,1,0.15,0.8249,0.5865063598458912,0.061571598052978516,0.5865063598458912
208,8,KNeighbors Classifier,2,0.15,0.7875,0.23526314858897693,5.466466903686523,0.23526314858897693
209,8,SVC Classifier,2,0.15,0.7788,1.0,15.683132410049438,0.0
210,8,Decision Tree,2,0.15,0.824,0.5545891737925498,0.034850358963012695,0.5545891737925498
211,8,RandomForest,2,0.15,0.8241,0.5578316001828668,0.2880978584289551,0.5578316001828668
212,8,AdaBoost (Discrete),2,0.15,0.8241,0.5578316001828668,16.304389715194702,0.5578316001828668
213,8,AdaBoost (Real),2,0.15,0.8241,0.5553406581675171,353.60723185539246,0.5553406581675171
214,8,Logistic Regression (Penalty = L2),2,0.15,0.8241,0.5578316001828668,0.10375761985778809,0.5578316001828668
215,8,Naive Bayes,2,0.15,0.8241,0.5578316001828668,0.024793624877929688,0.5578316001828668
216,9,KNeighbors Classifier,0,0.15,0.6789,0.5413281263334431,7.2850329875946045,0.5413281263334431
217,9,SVC Classifier,0,0.15,0.7795,0.09014398837291854,25.07106637954712,0.09014398837291854
218,9,Decision Tree,0,0.15,0.8077,0.5671500145226306,0.06309914588928223,0.5671500145226306
219,9,RandomForest,0,0.15,0.8098,0.5374868162767433,0.2421731948852539,0.5374868162767433
220,9,AdaBoost (Discrete),0,0.15,0.8072,0.5518850551035501,19.333516597747803,0.5518850551035501
221,9,AdaBoost (Real),0,0.15,0.8073,0.5642993420805843,71.70963215827942,0.5642993420805843
222,9,Logistic Regression (Penalty = L2),0,0.15,0.8052,0.472954528025573,0.1282041072845459,0.472954528025573
223,9,Naive Bayes,0,0.15,0.7896,0.5787894000140409,0.06245136260986328,0.5787894000140409
224,9,KNeighbors Classifier,1,0.15,0.7739,0.6140787853036744,7.23056173324585,0.6140787853036744
225,9,SVC Classifier,1,0.15,0.7788,1.0,29.93860650062561,0.0
226,9,Decision Tree,1,0.15,0.8236,0.6181717192449782,0.06637334823608398,0.6181717192449782
227,9,RandomForest,1,0.15,0.8261,0.5843302640681952,0.3199007511138916,0.5843302640681952
228,9,AdaBoost (Discrete),1,0.15,0.8242,0.6190291170161404,20.853253602981567,0.6190291170161404
229,9,AdaBoost (Real),1,0.15,0.8235,0.6199398738054017,74.33522891998291,0.6199398738054017
230,9,Logistic Regression (Penalty = L2),1,0.15,0.8118,0.4869616983197019,0.16353392601013184,0.4869616983197019
231,9,Naive Bayes,1,0.15,0.7989,0.627264017623129,0.09287357330322266,0.627264017623129
232,9,KNeighbors Classifier,2,0.15,0.8037,0.5920813328202712,6.902076482772827,0.5920813328202712
233,9,SVC Classifier,2,0.15,0.7788,1.0,27.463141918182373,0.0
234,9,Decision Tree,2,0.15,0.8234,0.5575722211658029,0.0941622257232666,0.5575722211658029
235,9,RandomForest,2,0.15,0.8242,0.5528699919506312,0.34595346450805664,0.5528699919506312
236,9,AdaBoost (Discrete),2,0.15,0.8221,0.5426550094175557,18.947350025177002,0.5426550094175557
237,9,AdaBoost (Real),2,0.15,0.8228,0.5548614553597347,60.98110914230347,0.5548614553597347
238,9,Logistic Regression (Penalty = L2),2,0.15,0.8062,0.42724253100183507,0.2093796730041504,0.42724253100183507
239,9,Naive Bayes,2,0.15,0.8142,0.587148836808227,0.09150075912475586,0.587148836808227
240,10,KNeighbors Classifier,0,0.15,0.7669,0.5033085988926131,7.114556312561035,0.5033085988926131
241,10,SVC Classifier,0,0.15,0.7795,0.09014398837291854,26.810728073120117,0.09014398837291854
242,10,Decision Tree,0,0.15,0.8081,0.5686464551567252,0.05223965644836426,0.5686464551567252
243,10,RandomForest,0,0.15,0.8098,0.5374868162767433,0.2913820743560791,0.5374868162767433
244,10,AdaBoost (Discrete),0,0.15,0.8072,0.5518850551035501,21.532649517059326,0.5518850551035501
245,10,AdaBoost (Real),0,0.15,0.8073,0.5642993420805843,68.26904726028442,0.5642993420805843
246,10,Logistic Regression (Penalty = L2),0,0.15,0.8052,0.472954528025573,0.23612332344055176,0.472954528025573
247,10,Naive Bayes,0,0.15,0.7896,0.5787894000140409,0.10921287536621094,0.5787894000140409
248,10,KNeighbors Classifier,1,0.15,0.7985,0.5737640419704381,6.8829896450042725,0.5737640419704381
249,10,SVC Classifier,1,0.15,0.7788,1.0,28.360936403274536,0.0
250,10,Decision Tree,1,0.15,0.8231,0.6176586547010073,0.06751608848571777,0.6176586547010073
251,10,RandomForest,1,0.15,0.8259,0.5842520771053688,0.31697940826416016,0.5842520771053688
252,10,AdaBoost (Discrete),1,0.15,0.8242,0.6190291170161404,19.904102325439453,0.6190291170161404
253,10,AdaBoost (Real),1,0.15,0.8235,0.6199398738054017,77.01398539543152,0.6199398738054017
254,10,Logistic Regression (Penalty = L2),1,0.15,0.8118,0.4869616983197019,0.19670939445495605,0.4869616983197019
255,10,Naive Bayes,1,0.15,0.7989,0.627264017623129,0.1233522891998291,0.627264017623129
256,10,KNeighbors Classifier,2,0.15,0.4896,0.48248037112625564,8.03226613998413,0.48248037112625564
257,10,SVC Classifier,2,0.15,0.7788,1.0,29.674527168273926,0.0
258,10,Decision Tree,2,0.15,0.8231,0.5567515515020547,0.09211421012878418,0.5567515515020547
259,10,RandomForest,2,0.15,0.8235,0.5504521449064839,0.3229377269744873,0.5504521449064839
260,10,AdaBoost (Discrete),2,0.15,0.8221,0.5426550094175557,20.2411687374115,0.5426550094175557
261,10,AdaBoost (Real),2,0.15,0.8228,0.5548614553597347,58.77777671813965,0.5548614553597347
262,10,Logistic Regression (Penalty = L2),2,0.15,0.8062,0.42724253100183507,0.23034119606018066,0.42724253100183507
263,10,Naive Bayes,2,0.15,0.8142,0.587148836808227,0.07369613647460938,0.587148836808227
264,11,KNeighbors Classifier,0,0.15,0.7676,0.5779469820301273,5.825435161590576,0.5779469820301273
265,11,SVC Classifier,0,0.15,0.7795,0.09014398837291854,35.24037432670593,0.09014398837291854
266,11,Decision Tree,0,0.15,0.7307,0.5405415371648675,0.25814366340637207,0.5405415371648675
267,11,RandomForest,0,0.15,0.8031,0.46839793785590067,0.37268638610839844,0.46839793785590067
268,11,AdaBoost (Discrete),0,0.15,0.8074,0.5619629039330025,54.551756858825684,0.5619629039330025
269,11,AdaBoost (Real),0,0.15,0.7869,0.5431875694916508,70.25052523612976,0.5431875694916508
270,11,Logistic Regression (Penalty = L2),0,0.15,0.8038,0.45665511050040875,0.2775273323059082,0.45665511050040875
271,11,Naive Bayes,0,0.15,0.7792,0.651942865677103,0.13240933418273926,0.651942865677103
272,11,KNeighbors Classifier,1,0.15,0.7838,0.5829196013115008,5.267049551010132,0.5829196013115008
273,11,SVC Classifier,1,0.15,0.7788,1.0,35.31379175186157,0.0
274,11,Decision Tree,1,0.15,0.7361,0.5711175805166236,0.25260138511657715,0.5711175805166236
275,11,RandomForest,1,0.15,0.806,0.47492792246791476,0.42754244804382324,0.47492792246791476
276,11,AdaBoost (Discrete),1,0.15,0.8226,0.6116576159294534,53.34932565689087,0.6116576159294534
277,11,AdaBoost (Real),1,0.15,0.7962,0.5966495755460636,70.47728610038757,0.5966495755460636
278,11,Logistic Regression (Penalty = L2),1,0.15,0.8082,0.4691064015369891,0.264725923538208,0.4691064015369891
279,11,Naive Bayes,1,0.15,0.7841,0.6999588077684782,0.09782934188842773,0.6999588077684782
280,11,KNeighbors Classifier,2,0.15,0.782,0.5781630354356965,5.578457593917847,0.5781630354356965
281,11,SVC Classifier,2,0.15,0.7788,1.0,36.21943163871765,0.0
282,11,Decision Tree,2,0.15,0.7442,0.5562929732336597,0.20777392387390137,0.5562929732336597
283,11,RandomForest,2,0.15,0.804,0.4037810261423712,0.44291019439697266,0.4037810261423712
284,11,AdaBoost (Discrete),2,0.15,0.8223,0.5638350115965758,51.539135217666626,0.5638350115965758
285,11,AdaBoost (Real),2,0.15,0.7915,0.5397037906050124,64.09666967391968,0.5397037906050124
286,11,Logistic Regression (Penalty = L2),2,0.15,0.8068,0.4283927285576745,0.17737460136413574,0.4283927285576745
287,11,Naive Bayes,2,0.15,0.7968,0.6731734647656218,0.11871337890625,0.6731734647656218
288,12,KNeighbors Classifier,0,0.15,0.3898,0.4465368785977873,5.26097846031189,0.4465368785977873
289,12,SVC Classifier,0,0.15,0.7788,1.0,18.098049640655518,0.0
290,12,Decision Tree,0,0.15,0.8091,0.5331998579600798,0.061331987380981445,0.5331998579600798
291,12,RandomForest,0,0.15,0.8098,0.5374868162767433,0.3153095245361328,0.5374868162767433
292,12,AdaBoost (Discrete),0,0.15,0.8091,0.5331998579600798,16.18061351776123,0.5331998579600798
293,12,AdaBoost (Real),0,0.15,0.8097,0.5359881800938336,323.6348626613617,0.5359881800938336
294,12,Logistic Regression (Penalty = L2),0,0.15,0.8098,0.5374868162767433,0.10956835746765137,0.5374868162767433
295,12,Naive Bayes,0,0.15,0.8098,0.5374868162767433,0.043565988540649414,0.5374868162767433
296,12,KNeighbors Classifier,1,0.15,0.7373,0.4167498066475552,4.648991584777832,0.4167498066475552
297,12,SVC Classifier,1,0.15,0.7788,1.0,15.609539270401001,0.0
298,12,Decision Tree,1,0.15,0.8245,0.584698307625315,0.045461416244506836,0.584698307625315
299,12,RandomForest,1,0.15,0.8249,0.5865063598458912,0.25551271438598633,0.5865063598458912
300,12,AdaBoost (Discrete),1,0.15,0.8245,0.584698307625315,15.276020765304565,0.584698307625315
301,12,AdaBoost (Real),1,0.15,0.8245,0.584698307625315,304.1259865760803,0.584698307625315
302,12,Logistic Regression (Penalty = L2),1,0.15,0.8249,0.5865063598458912,0.17801570892333984,0.5865063598458912
303,12,Naive Bayes,1,0.15,0.8249,0.5865063598458912,0.05559659004211426,0.5865063598458912
304,12,KNeighbors Classifier,2,0.15,0.7875,0.23526314858897693,4.992952823638916,0.23526314858897693
305,12,SVC Classifier,2,0.15,0.7788,1.0,16.12831997871399,0.0
306,12,Decision Tree,2,0.15,0.824,0.5545891737925498,0.05181169509887695,0.5545891737925498
307,12,RandomForest,2,0.15,0.8241,0.5578316001828668,0.26122021675109863,0.5578316001828668
308,12,AdaBoost (Discrete),2,0.15,0.8241,0.5578316001828668,15.696370363235474,0.5578316001828668
309,12,AdaBoost (Real),2,0.15,0.8241,0.5553406581675171,300.4385437965393,0.5553406581675171
310,12,Logistic Regression (Penalty = L2),2,0.15,0.8241,0.5578316001828668,0.1298384666442871,0.5578316001828668
311,12,Naive Bayes,2,0.15,0.8241,0.5578316001828668,0.04730796813964844,0.5578316001828668
