,feat_set_id,classifier,fold_id,feat_th,score,geo_score,exec_t,geo_score_woz
0,0,KNeighbors Classifier,0,0.7,0.5372446936323588,0.5397519587687444,6.1723058223724365,0.5397519587687444
1,0,SVC Classifier,0,0.7,0.55126151381658,1.0,66.71625089645386,0.0
2,0,Decision Tree,0,0.7,0.5478574289146977,0.5503767143581149,0.4797210693359375,0.5503767143581149
3,0,RandomForest,0,0.7,0.5352422907488987,0.5377376807838424,0.9389667510986328,0.5377376807838424
4,0,AdaBoost (Discrete),0,0.7,0.5024028834601522,0.47555873208370336,120.26355385780334,0.47555873208370336
5,0,AdaBoost (Real),0,0.7,0.5434521425710853,0.5400608807527384,146.13073635101318,0.5400608807527384
6,0,Logistic Regression (Penalty = L2),0,0.7,0.5438526231477774,0.5239428919004026,0.5073142051696777,0.5239428919004026
7,0,Naive Bayes,0,0.7,0.46235482579094916,0.17305238624530997,0.15649127960205078,0.17305238624530997
8,0,KNeighbors Classifier,1,0.7,0.4810735029040657,0.4822831687776503,9.057792663574219,0.4822831687776503
9,0,SVC Classifier,1,0.7,0.5509713599038654,0.9996366279069767,63.52142643928528,0.0
10,0,Decision Tree,1,0.7,0.43100340476667337,0.4331100513663283,0.40593910217285156,0.4331100513663283
11,0,RandomForest,1,0.7,0.4582415381534148,0.3961144992974336,0.8733315467834473,0.3961144992974336
12,0,AdaBoost (Discrete),1,0.7,0.4816743440817144,0.4834759035210692,109.44296097755432,0.4834759035210692
13,0,AdaBoost (Real),1,0.7,0.49649509313038254,0.49900179771442243,145.2919216156006,0.49900179771442243
14,0,Logistic Regression (Penalty = L2),1,0.7,0.5285399559383136,0.5072786731079436,0.31428956985473633,0.5072786731079436
15,0,Naive Bayes,1,0.7,0.49769677548568,0.31291670016703055,0.12804841995239258,0.31291670016703055
16,0,KNeighbors Classifier,2,0.7,0.4271980773082315,0.40751642950730155,4.8338587284088135,0.40751642950730155
17,0,SVC Classifier,2,0.7,0.5513719206889646,0.021124141684149264,64.27900862693787,0.021124141684149264
18,0,Decision Tree,2,0.7,0.5109152813939515,0.4932598325357967,0.349170446395874,0.4932598325357967
19,0,RandomForest,2,0.7,0.5585820148207491,0.47455231027568195,0.8245794773101807,0.47455231027568195
20,0,AdaBoost (Discrete),2,0.7,0.5371520128179451,0.4939163543963159,100.01616907119751,0.4939163543963159
21,0,AdaBoost (Real),2,0.7,0.5577808932505508,0.5179401524253062,112.30425810813904,0.5179401524253062
22,0,Logistic Regression (Penalty = L2),2,0.7,0.5491688363709193,0.29554190838751965,0.38663721084594727,0.29554190838751965
23,0,Naive Bayes,2,0.7,0.409773683156419,0.1181760743994489,0.09011054039001465,0.1181760743994489
24,1,KNeighbors Classifier,0,0.7,0.5698838606327593,0.5559106101975837,3.826399564743042,0.5559106101975837
25,1,SVC Classifier,0,0.7,0.55126151381658,1.0,53.40592169761658,0.0
26,1,Decision Tree,0,0.7,0.5536643972767321,0.5515642005706439,0.35933899879455566,0.5515642005706439
27,1,RandomForest,0,0.7,0.5742891469763717,0.5762921529935858,0.7303595542907715,0.5762921529935858
28,1,AdaBoost (Discrete),0,0.7,0.5190228273928714,0.5122083725534873,89.73619246482849,0.5122083725534873
29,1,AdaBoost (Real),0,0.7,0.538846615939127,0.5383016554868533,94.54029631614685,0.5383016554868533
30,1,Logistic Regression (Penalty = L2),0,0.7,0.55126151381658,1.0,0.2543821334838867,0.0
31,1,Naive Bayes,0,0.7,0.46495794953944736,0.19773334896510292,0.12034225463867188,0.19773334896510292
32,1,KNeighbors Classifier,1,0.7,0.438614059683557,0.4408761758762875,4.389642000198364,0.4408761758762875
33,1,SVC Classifier,1,0.7,0.551171640296415,1.0,46.066784381866455,0.0
34,1,Decision Tree,1,0.7,0.4582415381534148,0.46065177729999157,0.2748403549194336,0.46065177729999157
35,1,RandomForest,1,0.7,0.5053074304025635,0.43103664456806123,0.5221927165985107,0.43103664456806123
36,1,AdaBoost (Discrete),1,0.7,0.47406368916483077,0.47611465471074416,79.44694423675537,0.47611465471074416
37,1,AdaBoost (Real),1,0.7,0.4592429401161626,0.46049916202200564,95.30851745605469,0.46049916202200564
38,1,Logistic Regression (Penalty = L2),1,0.7,0.5037051872621671,0.26698730664752474,0.22506141662597656,0.26698730664752474
39,1,Naive Bayes,1,0.7,0.5535750050070098,0.08701790983413867,0.12312483787536621,0.08701790983413867
40,1,KNeighbors Classifier,2,0.7,0.509313038253555,0.42861590095123564,3.971634864807129,0.42861590095123564
41,1,SVC Classifier,2,0.7,0.5513719206889646,0.021124141684149264,53.88082718849182,0.021124141684149264
42,1,Decision Tree,2,0.7,0.5147206088523933,0.4756323427101656,0.38189697265625,0.4756323427101656
43,1,RandomForest,2,0.7,0.5533747246144602,0.4806568799984687,0.7788939476013184,0.4806568799984687
44,1,AdaBoost (Discrete),2,0.7,0.5229321049469257,0.45485543344474305,100.18083024024963,0.45485543344474305
45,1,AdaBoost (Real),2,0.7,0.5095133186461045,0.45461082173926287,113.44075083732605,0.45461082173926287
46,1,Logistic Regression (Penalty = L2),2,0.7,0.5159222912076907,0.17212609330641385,0.3618752956390381,0.17212609330641385
47,1,Naive Bayes,2,0.7,0.3963548968555978,0.11879258931112031,0.14268088340759277,0.11879258931112031
48,2,KNeighbors Classifier,0,0.7,0.5150180216259511,0.5157789339481421,7.560759782791138,0.5157789339481421
49,2,SVC Classifier,0,0.7,0.55126151381658,1.0,69.87174081802368,0.0
50,2,Decision Tree,0,0.7,0.5110132158590308,0.5132073806896175,0.33529067039489746,0.5132073806896175
51,2,RandomForest,0,0.7,0.49439327192631155,0.49310450089759394,0.6805880069732666,0.49310450089759394
52,2,AdaBoost (Discrete),0,0.7,0.5030036043251902,0.4754032846345883,106.08538508415222,0.4754032846345883
53,2,AdaBoost (Real),0,0.7,0.5292350820985182,0.5071446656075136,130.2418556213379,0.5071446656075136
54,2,Logistic Regression (Penalty = L2),0,0.7,0.5416499799759712,0.5177959923464327,0.4988062381744385,0.5177959923464327
55,2,Naive Bayes,0,0.7,0.4655586704044854,0.18152575284329,0.18392324447631836,0.18152575284329
56,2,KNeighbors Classifier,1,0.7,0.42319246945724015,0.4254251321578344,10.535378456115723,0.4254251321578344
57,2,SVC Classifier,1,0.7,0.5509713599038654,0.9996366279069767,66.55127763748169,0.0
58,2,Decision Tree,1,0.7,0.4404165832165031,0.4423947161729335,0.3496384620666504,0.4423947161729335
59,2,RandomForest,1,0.7,0.5185259363108352,0.4105952221264524,0.7073214054107666,0.4105952221264524
60,2,AdaBoost (Discrete),1,0.7,0.4888844382134989,0.4903135383585684,110.25681805610657,0.4903135383585684
61,2,AdaBoost (Real),1,0.7,0.4786701381934709,0.48011733084811326,131.66447854042053,0.48011733084811326
62,2,Logistic Regression (Penalty = L2),1,0.7,0.47146004406168635,0.45786717338505706,0.4342987537384033,0.45786717338505706
63,2,Naive Bayes,1,0.7,0.4770678950530743,0.22635252398919495,0.1594083309173584,0.22635252398919495
64,2,KNeighbors Classifier,2,0.7,0.4580412577608652,0.384671782794091,6.661000490188599,0.384671782794091
65,2,SVC Classifier,2,0.7,0.5513719206889646,0.021124141684149264,75.15764689445496,0.021124141684149264
66,2,Decision Tree,2,0.7,0.4642499499299019,0.44702240647403035,0.3924589157104492,0.44702240647403035
67,2,RandomForest,2,0.7,0.5089124774684558,0.417725375798804,0.8372371196746826,0.417725375798804
68,2,AdaBoost (Discrete),2,0.7,0.47166032445423595,0.4594938411336386,112.12352275848389,0.4594938411336386
69,2,AdaBoost (Real),2,0.7,0.49569397156018424,0.47325041389976796,127.9313530921936,0.47325041389976796
70,2,Logistic Regression (Penalty = L2),2,0.7,0.4984978970558782,0.2269995365125495,0.5672650337219238,0.2269995365125495
71,2,Naive Bayes,2,0.7,0.3915481674344082,0.14218140571468774,0.16121959686279297,0.14218140571468774
72,3,KNeighbors Classifier,0,0.7,0.5482579094913896,0.5507795962589257,4.382674932479858,0.5507795962589257
73,3,SVC Classifier,0,0.7,0.55126151381658,1.0,57.35520696640015,0.0
74,3,Decision Tree,0,0.7,0.4629555466559872,0.46527141024568563,0.3376023769378662,0.46527141024568563
75,3,RandomForest,0,0.7,0.4937925510612735,0.49634300071755916,0.7658936977386475,0.49634300071755916
76,3,AdaBoost (Discrete),0,0.7,0.4921906287545054,0.46922416573768444,120.65515160560608,0.46922416573768444
77,3,AdaBoost (Real),0,0.7,0.5324389267120545,0.5238955572658777,152.58048510551453,0.5238955572658777
78,3,Logistic Regression (Penalty = L2),0,0.7,0.540048057669203,0.5204914100959595,0.47521233558654785,0.5204914100959595
79,3,Naive Bayes,0,0.7,0.4685622747296756,0.2321781887231847,0.15649056434631348,0.2321781887231847
80,3,KNeighbors Classifier,1,0.7,0.4582415381534148,0.46064614533949017,8.529193639755249,0.46064614533949017
81,3,SVC Classifier,1,0.7,0.5509713599038654,0.9996366279069767,79.4199161529541,0.0
82,3,Decision Tree,1,0.7,0.4816743440817144,0.4842148478373648,0.47190308570861816,0.4842148478373648
83,3,RandomForest,1,0.7,0.4594432205087122,0.39011993164406417,0.9320189952850342,0.39011993164406417
84,3,AdaBoost (Discrete),1,0.7,0.49569397156018424,0.49738225161388655,119.71456027030945,0.49738225161388655
85,3,AdaBoost (Real),1,0.7,0.46945724013619067,0.4718856561785732,135.5988574028015,0.4718856561785732
86,3,Logistic Regression (Penalty = L2),1,0.7,0.5411576206689365,0.5082132429607304,0.37095165252685547,0.5082132429607304
87,3,Naive Bayes,1,0.7,0.5509713599038654,0.9996366279069767,0.09318351745605469,0.0
88,3,KNeighbors Classifier,2,0.7,0.44802723813338674,0.43003107142792574,6.179715871810913,0.43003107142792574
89,3,SVC Classifier,2,0.7,0.5513719206889646,0.021124141684149264,64.99156975746155,0.021124141684149264
90,3,Decision Tree,2,0.7,0.5193270578810334,0.49425913329345383,0.3490138053894043,0.49425913329345383
91,3,RandomForest,2,0.7,0.5493691167634689,0.47551590807035404,0.780792236328125,0.47551590807035404
92,3,AdaBoost (Discrete),2,0.7,0.5285399559383136,0.487897767148323,108.15300989151001,0.487897767148323
93,3,AdaBoost (Real),2,0.7,0.5193270578810334,0.48210259145644474,119.55917835235596,0.48210259145644474
94,3,Logistic Regression (Penalty = L2),2,0.7,0.543761265772081,0.32878273986716033,0.3402996063232422,0.32878273986716033
95,3,Naive Bayes,2,0.7,0.4123773282595634,0.1251069714445916,0.09007501602172852,0.1251069714445916
96,4,KNeighbors Classifier,0,0.7,0.5903083700440529,0.5838395849075947,2.0747954845428467,0.5838395849075947
97,4,SVC Classifier,0,0.7,0.55126151381658,1.0,44.46478080749512,0.0
98,4,Decision Tree,0,0.7,0.5230276331597917,0.5236840460447187,0.26387858390808105,0.5236840460447187
99,4,RandomForest,0,0.7,0.6031237484981978,0.5972849167502443,0.682403564453125,0.5972849167502443
100,4,AdaBoost (Discrete),0,0.7,0.5036043251902282,0.4960432865683356,76.58178615570068,0.4960432865683356
101,4,AdaBoost (Real),0,0.7,0.5592711253504205,0.5598855520430677,95.89522814750671,0.5598855520430677
102,4,Logistic Regression (Penalty = L2),0,0.7,0.55126151381658,1.0,0.19800710678100586,0.0
103,4,Naive Bayes,0,0.7,0.4571485782939527,0.13840963786522828,0.1407785415649414,0.13840963786522828
104,4,KNeighbors Classifier,1,0.7,0.4446224714600441,0.44696491047577896,3.4515163898468018,0.44696491047577896
105,4,SVC Classifier,1,0.7,0.5509713599038654,0.9996366279069767,67.65943503379822,0.0
106,4,Decision Tree,1,0.7,0.4580412577608652,0.4593449006148969,0.30264735221862793,0.4593449006148969
107,4,RandomForest,1,0.7,0.4574404165832165,0.4406000673651825,0.6762924194335938,0.4406000673651825
108,4,AdaBoost (Discrete),1,0.7,0.48467854996995796,0.4869966294874065,75.98129487037659,0.4869966294874065
109,4,AdaBoost (Real),1,0.7,0.4782695774083717,0.4802459865747785,81.53449058532715,0.4802459865747785
110,4,Logistic Regression (Penalty = L2),1,0.7,0.5165231323853394,0.9371366279069767,0.21430325508117676,0.0
111,4,Naive Bayes,1,0.7,0.506509112757861,0.3408021551923323,0.11509346961975098,0.3408021551923323
112,4,KNeighbors Classifier,2,0.7,0.5057079911876627,0.4594320825603343,2.053887128829956,0.4594320825603343
113,4,SVC Classifier,2,0.7,0.5513719206889646,0.021124141684149264,36.353851556777954,0.021124141684149264
114,4,Decision Tree,2,0.7,0.5111155617865011,0.47237968868392777,0.21804332733154297,0.47237968868392777
115,4,RandomForest,2,0.7,0.5768075305427599,0.3352074332060207,0.5375471115112305,0.3352074332060207
116,4,AdaBoost (Discrete),2,0.7,0.5443621069497296,0.46003502050914524,60.85605502128601,0.46003502050914524
117,4,AdaBoost (Real),2,0.7,0.5545764069697576,0.48275430180119355,69.68642830848694,0.48275430180119355
118,4,Logistic Regression (Penalty = L2),2,0.7,0.540957340276387,0.17160199984190175,0.1766800880432129,0.17160199984190175
119,4,Naive Bayes,2,0.7,0.4057680753054276,0.06993692315230797,0.08184623718261719,0.06993692315230797
120,5,KNeighbors Classifier,0,0.7,0.5376451742090509,0.5401548132314209,1.780174970626831,0.5401548132314209
121,5,SVC Classifier,0,0.7,0.55126151381658,1.0,35.80423426628113,0.0
122,5,Decision Tree,0,0.7,0.500800961153384,0.5025108877539267,0.14066195487976074,0.5025108877539267
123,5,RandomForest,0,0.7,0.6131357629154986,0.6072911075331117,0.39147472381591797,0.6072911075331117
124,5,AdaBoost (Discrete),0,0.7,0.5120144173007609,0.4695986450674871,50.797048568725586,0.4695986450674871
125,5,AdaBoost (Real),0,0.7,0.5410492591109332,0.5260934988621473,63.09656763076782,0.5260934988621473
126,5,Logistic Regression (Penalty = L2),0,0.7,0.540048057669203,0.5255259841916863,0.2569408416748047,0.5255259841916863
127,5,Naive Bayes,0,0.7,0.460152182619143,0.15338292161643904,0.09565615653991699,0.15338292161643904
128,5,KNeighbors Classifier,1,0.7,0.46825555778089323,0.46875126474721196,2.491260290145874,0.46875126474721196
129,5,SVC Classifier,1,0.7,0.5509713599038654,0.9996366279069767,34.28915190696716,0.0
130,5,Decision Tree,1,0.7,0.47306228720208293,0.47546918982047703,0.1664130687713623,0.47546918982047703
131,5,RandomForest,1,0.7,0.41918686160624874,0.41908640183353446,0.36441802978515625,0.41908640183353446
132,5,AdaBoost (Discrete),1,0.7,0.4856799519327058,0.48767504940285017,48.28967833518982,0.48767504940285017
133,5,AdaBoost (Real),1,0.7,0.48608051271780495,0.48856962569605866,56.81873607635498,0.48856962569605866
134,5,Logistic Regression (Penalty = L2),1,0.7,0.5491688363709193,0.4725149123057572,0.16481733322143555,0.4725149123057572
135,5,Naive Bayes,1,0.7,0.46685359503304624,0.18084105831390454,0.0874333381652832,0.18084105831390454
136,5,KNeighbors Classifier,2,0.7,0.46324854796715403,0.4439193851056608,1.3002090454101562,0.4439193851056608
137,5,SVC Classifier,2,0.7,0.551171640296415,1.0,33.86512064933777,0.0
138,5,Decision Tree,2,0.7,0.509313038253555,0.4927372101665789,0.164259672164917,0.4927372101665789
139,5,RandomForest,2,0.7,0.5535750050070098,0.46505810103467976,0.3943662643432617,0.46505810103467976
140,5,AdaBoost (Discrete),2,0.7,0.513518926497096,0.5010099683619444,46.398765325546265,0.5010099683619444
141,5,AdaBoost (Real),2,0.7,0.5193270578810334,0.5112557246317978,54.60949945449829,0.5112557246317978
142,5,Logistic Regression (Penalty = L2),2,0.7,0.5307430402563589,0.2980405692868297,0.20435547828674316,0.2980405692868297
143,5,Naive Bayes,2,0.7,0.4045663929501302,0.08053503515840356,0.0794670581817627,0.08053503515840356
144,6,KNeighbors Classifier,0,0.7,0.5482579094913896,0.550700868313995,2.081200361251831,0.550700868313995
145,6,SVC Classifier,0,0.7,0.55126151381658,1.0,32.174110889434814,0.0
146,6,Decision Tree,0,0.7,0.5776932318782539,0.5791082870409141,0.2368335723876953,0.5791082870409141
147,6,RandomForest,0,0.7,0.5478574289146977,0.544168891089894,0.48877763748168945,0.544168891089894
148,6,AdaBoost (Discrete),0,0.7,0.5406487785342411,0.5324492207844252,53.636868715286255,0.5324492207844252
149,6,AdaBoost (Real),0,0.7,0.5418502202643172,0.5358631576954181,63.24420356750488,0.5358631576954181
150,6,Logistic Regression (Penalty = L2),0,0.7,0.5372446936323588,0.5169463436517803,0.21897053718566895,0.5169463436517803
151,6,Naive Bayes,0,0.7,0.460752903484181,0.1676459239625314,0.09210371971130371,0.1676459239625314
152,6,KNeighbors Classifier,1,0.7,0.45844181854596433,0.46085184322790385,3.136132001876831,0.46085184322790385
153,6,SVC Classifier,1,0.7,0.5509713599038654,0.9996366279069767,36.27895212173462,0.0
154,6,Decision Tree,1,0.7,0.44342078910474664,0.44566519640326563,0.19150686264038086,0.44566519640326563
155,6,RandomForest,1,0.7,0.422791908672141,0.42427787300394265,0.4548819065093994,0.42427787300394265
156,6,AdaBoost (Discrete),1,0.7,0.4706589224914881,0.47271475960938053,52.9699227809906,0.47271475960938053
157,6,AdaBoost (Real),1,0.7,0.4824754656519127,0.4850222074528601,63.22238802909851,0.4850222074528601
158,6,Logistic Regression (Penalty = L2),1,0.7,0.5439615461646304,0.5113820952718744,0.17325043678283691,0.5113820952718744
159,6,Naive Bayes,1,0.7,0.4954936911676347,0.3146251407190849,0.0886530876159668,0.3146251407190849
160,6,KNeighbors Classifier,2,0.7,0.4221910674944923,0.4178307499079395,2.4591777324676514,0.4178307499079395
161,6,SVC Classifier,2,0.7,0.5513719206889646,0.021124141684149264,35.02657341957092,0.021124141684149264
162,6,Decision Tree,2,0.7,0.5361506108551973,0.509654120579662,0.23112130165100098,0.509654120579662
163,6,RandomForest,2,0.7,0.5567794912878029,0.4434907247207757,0.42676210403442383,0.4434907247207757
164,6,AdaBoost (Discrete),2,0.7,0.5359503304626477,0.508953864965627,53.66034412384033,0.508953864965627
165,6,AdaBoost (Real),2,0.7,0.5403564990987383,0.5118090192477139,62.16533637046814,0.5118090192477139
166,6,Logistic Regression (Penalty = L2),2,0.7,0.5746044462247146,0.35814103084734894,0.21558308601379395,0.35814103084734894
167,6,Naive Bayes,2,0.7,0.41177648708191467,0.11847070481034416,0.09839415550231934,0.11847070481034416
168,7,KNeighbors Classifier,0,0.7,0.5708850620744894,0.5569978423901478,1.4509634971618652,0.5569978423901478
169,7,SVC Classifier,0,0.7,0.55126151381658,1.0,36.22581958770752,0.0
170,7,Decision Tree,0,0.7,0.5684821786143373,0.5694648887121764,0.14469051361083984,0.5694648887121764
171,7,RandomForest,0,0.7,0.5899078894673608,0.5769229570192105,0.3861706256866455,0.5769229570192105
172,7,AdaBoost (Discrete),0,0.7,0.5142170604725671,0.5036767078725635,40.78641748428345,0.5036767078725635
173,7,AdaBoost (Real),0,0.7,0.5434521425710853,0.5438567889017495,52.140172719955444,0.5438567889017495
174,7,Logistic Regression (Penalty = L2),0,0.7,0.55126151381658,1.0,0.12056994438171387,0.0
175,7,Naive Bayes,0,0.7,0.4593512214657589,0.14976795711806531,0.09932374954223633,0.14976795711806531
176,7,KNeighbors Classifier,1,0.7,0.4468255557780893,0.4490667790580695,1.7569019794464111,0.4490667790580695
177,7,SVC Classifier,1,0.7,0.5509713599038654,0.9996366279069767,31.3363676071167,0.0
178,7,Decision Tree,1,0.7,0.4696575205287402,0.47213316634435515,0.17782974243164062,0.47213316634435515
179,7,RandomForest,1,0.7,0.4592429401161626,0.45005720193082865,0.31854796409606934,0.45005720193082865
180,7,AdaBoost (Discrete),1,0.7,0.49068696174644505,0.4927975916548451,42.19107985496521,0.4927975916548451
181,7,AdaBoost (Real),1,0.7,0.5017023833366714,0.5032553734041842,49.42585587501526,0.5032553734041842
182,7,Logistic Regression (Penalty = L2),1,0.7,0.5083116362908071,0.9222383720930233,0.11764645576477051,0.0
183,7,Naive Bayes,1,0.7,0.4750650911275786,0.2181782394879162,0.13948583602905273,0.2181782394879162
184,7,KNeighbors Classifier,2,0.7,0.5193270578810334,0.44462196028402007,1.150876760482788,0.44462196028402007
185,7,SVC Classifier,2,0.7,0.5513719206889646,0.021124141684149264,28.311232328414917,0.021124141684149264
186,7,Decision Tree,2,0.7,0.5197276186661326,0.4923049456183621,0.14023971557617188,0.4923049456183621
187,7,RandomForest,2,0.7,0.6068495894251953,0.462477479383298,0.36426830291748047,0.462477479383298
188,7,AdaBoost (Discrete),2,0.7,0.5405567794912878,0.5115195295111654,38.34380340576172,0.5115195295111654
189,7,AdaBoost (Real),2,0.7,0.5085119166833567,0.4857554614794871,43.26688265800476,0.4857554614794871
190,7,Logistic Regression (Penalty = L2),2,0.7,0.5113158421790507,0.17582294078307587,0.17803955078125,0.17582294078307587
191,7,Naive Bayes,2,0.7,0.3895453635089125,0.11384105092600762,0.06777095794677734,0.11384105092600762
192,8,KNeighbors Classifier,0,0.7,0.5602723267921506,0.5529655047751709,1.0821306705474854,0.5529655047751709
193,8,SVC Classifier,0,0.7,0.55126151381658,1.0,30.81141972541809,0.0
194,8,Decision Tree,0,0.7,0.5386463756507809,0.5312859774900093,0.12178802490234375,0.5312859774900093
195,8,RandomForest,0,0.7,0.6013215859030837,0.5963051265753263,0.2267460823059082,0.5963051265753263
196,8,AdaBoost (Discrete),0,0.7,0.5010012014417301,0.489353623731125,33.885175466537476,0.489353623731125
197,8,AdaBoost (Real),0,0.7,0.5460552663195835,0.547142238988684,42.11070442199707,0.547142238988684
198,8,Logistic Regression (Penalty = L2),0,0.7,0.55126151381658,1.0,0.1034085750579834,0.0
199,8,Naive Bayes,0,0.7,0.46395674809771725,0.20753187941884332,0.05417513847351074,0.20753187941884332
200,8,KNeighbors Classifier,1,0.7,0.4456238734227919,0.447829109881173,1.0966954231262207,0.447829109881173
201,8,SVC Classifier,1,0.7,0.551171640296415,1.0,28.305079460144043,0.0
202,8,Decision Tree,1,0.7,0.49949929901862605,0.5020505258936668,0.1156013011932373,0.5020505258936668
203,8,RandomForest,1,0.7,0.4614460244342079,0.45309367932838746,0.3014681339263916,0.45309367932838746
204,8,AdaBoost (Discrete),1,0.7,0.4696575205287402,0.4714437313253657,32.4763720035553,0.4714437313253657
205,8,AdaBoost (Real),1,0.7,0.46825555778089323,0.4707162576125058,41.536431550979614,0.4707162576125058
206,8,Logistic Regression (Penalty = L2),1,0.7,0.551171640296415,1.0,0.10007452964782715,0.0
207,8,Naive Bayes,1,0.7,0.5509713599038654,0.9996366279069767,0.06097912788391113,0.0
208,8,KNeighbors Classifier,2,0.7,0.549769677548568,0.5076662501419226,1.1312201023101807,0.5076662501419226
209,8,SVC Classifier,2,0.7,0.551171640296415,1.0,20.11944341659546,0.0
210,8,Decision Tree,2,0.7,0.5071099539355097,0.4671217752063726,0.1393110752105713,0.4671217752063726
211,8,RandomForest,2,0.7,0.5934308031243741,0.4454308269152112,0.31435561180114746,0.4454308269152112
212,8,AdaBoost (Discrete),2,0.7,0.5067093931504105,0.4369953381831988,27.030357360839844,0.4369953381831988
213,8,AdaBoost (Real),2,0.7,0.5235329461245743,0.4650340428516701,33.6728515625,0.4650340428516701
214,8,Logistic Regression (Penalty = L2),2,0.7,0.5738033246545163,0.3409391526752615,0.219329833984375,0.3409391526752615
215,8,Naive Bayes,2,0.7,0.409773683156419,0.0887056031966386,0.08300375938415527,0.0887056031966386
216,9,KNeighbors Classifier,0,0.7,0.5484581497797357,0.550988501859557,0.7538776397705078,0.550988501859557
217,9,SVC Classifier,0,0.7,0.55126151381658,1.0,19.82966661453247,0.0
218,9,Decision Tree,0,0.7,0.4959951942330797,0.4888905112437159,0.09649038314819336,0.4888905112437159
219,9,RandomForest,0,0.7,0.5702843412094514,0.5653771214882691,0.2581651210784912,0.5653771214882691
220,9,AdaBoost (Discrete),0,0.7,0.5356427713255907,0.5059988485579415,30.63792085647583,0.5059988485579415
221,9,AdaBoost (Real),0,0.7,0.5674809771726071,0.5585796745541304,36.7684428691864,0.5585796745541304
222,9,Logistic Regression (Penalty = L2),0,0.7,0.5372446936323588,0.5267336453153719,0.16213250160217285,0.5267336453153719
223,9,Naive Bayes,0,0.7,0.46515818982779333,0.18239782901715273,0.048331260681152344,0.18239782901715273
224,9,KNeighbors Classifier,1,0.7,0.44201882635689965,0.4441592980239271,1.062833309173584,0.4441592980239271
225,9,SVC Classifier,1,0.7,0.5509713599038654,0.9996366279069767,19.164875984191895,0.0
226,9,Decision Tree,1,0.7,0.4930903264570399,0.4950841750026924,0.09386539459228516,0.4950841750026924
227,9,RandomForest,1,0.7,0.4542359303024234,0.45229224301591714,0.226454496383667,0.45229224301591714
228,9,AdaBoost (Discrete),1,0.7,0.49369116763468857,0.4960912407003921,28.507357835769653,0.4960912407003921
229,9,AdaBoost (Real),1,0.7,0.46164630482675745,0.4637674874005176,35.202561140060425,0.4637674874005176
230,9,Logistic Regression (Penalty = L2),1,0.7,0.5501702383336672,0.5082775282081963,0.14129996299743652,0.5082775282081963
231,9,Naive Bayes,1,0.7,0.464650510715001,0.16942961768485817,0.07064270973205566,0.16942961768485817
232,9,KNeighbors Classifier,2,0.7,0.43741237732825955,0.420169887360424,1.0204317569732666,0.420169887360424
233,9,SVC Classifier,2,0.7,0.5513719206889646,0.021124141684149264,21.935410022735596,0.021124141684149264
234,9,Decision Tree,2,0.7,0.48728219507310233,0.4755830788233217,0.07235336303710938,0.4755830788233217
235,9,RandomForest,2,0.7,0.5555778089325055,0.4410291475702812,0.22728729248046875,0.4410291475702812
236,9,AdaBoost (Discrete),2,0.7,0.4862807931103545,0.473480259281359,27.33961272239685,0.473480259281359
237,9,AdaBoost (Real),2,0.7,0.4842779891848588,0.47656602801973125,33.40082931518555,0.47656602801973125
238,9,Logistic Regression (Penalty = L2),2,0.7,0.5391548167434408,0.28687660237114854,0.13436532020568848,0.28687660237114854
239,9,Naive Bayes,2,0.7,0.41177648708191467,0.1008900222107,0.05049896240234375,0.1008900222107
240,10,KNeighbors Classifier,0,0.7,0.5376451742090509,0.5386592562422295,2.876955032348633,0.5386592562422295
241,10,SVC Classifier,0,0.7,0.55126151381658,1.0,23.09128713607788,0.0
242,10,Decision Tree,0,0.7,0.552062474969964,0.5522191427411535,0.12869954109191895,0.5522191427411535
243,10,RandomForest,0,0.7,0.5176211453744494,0.519114071345302,0.2332758903503418,0.519114071345302
244,10,AdaBoost (Discrete),0,0.7,0.47857428914697636,0.4578588880302922,40.580713987350464,0.4578588880302922
245,10,AdaBoost (Real),0,0.7,0.5004004805766921,0.48480172930060333,43.25412201881409,0.48480172930060333
246,10,Logistic Regression (Penalty = L2),0,0.7,0.5536643972767321,0.5271802707019019,0.17806434631347656,0.5271802707019019
247,10,Naive Bayes,0,0.7,0.4683620344413296,0.22412967759492378,0.05472993850708008,0.22412967759492378
248,10,KNeighbors Classifier,1,0.7,0.48988584017624676,0.49234265629879875,3.6793127059936523,0.49234265629879875
249,10,SVC Classifier,1,0.7,0.5509713599038654,0.9996366279069767,24.245534658432007,0.0
250,10,Decision Tree,1,0.7,0.46184658521930705,0.4642837792051459,0.09360241889953613,0.4642837792051459
251,10,RandomForest,1,0.7,0.48287602643701183,0.2835267910406695,0.21663236618041992,0.2835267910406695
252,10,AdaBoost (Discrete),1,0.7,0.4808732225115161,0.4816116307521991,36.39929437637329,0.4816116307521991
253,10,AdaBoost (Real),1,0.7,0.48207490486681354,0.48260951600374835,38.25164985656738,0.48260951600374835
254,10,Logistic Regression (Penalty = L2),1,0.7,0.5309433206489085,0.4898337868459278,0.09345316886901855,0.4898337868459278
255,10,Naive Bayes,1,0.7,0.5555778089325055,0.33542817973287753,0.0558314323425293,0.33542817973287753
256,10,KNeighbors Classifier,2,0.7,0.4207891047466453,0.38308781728083025,2.127403736114502,0.38308781728083025
257,10,SVC Classifier,2,0.7,0.5513719206889646,0.021124141684149264,17.154741287231445,0.021124141684149264
258,10,Decision Tree,2,0.7,0.49909873823352696,0.47972304467166665,0.09507918357849121,0.47972304467166665
259,10,RandomForest,2,0.7,0.5593831363909473,0.4716376723261451,0.23848676681518555,0.4716376723261451
260,10,AdaBoost (Discrete),2,0.7,0.5233326657320249,0.49514639886707473,30.66105842590332,0.49514639886707473
261,10,AdaBoost (Real),2,0.7,0.5157220108151412,0.4875945800747051,30.532591104507446,0.4875945800747051
262,10,Logistic Regression (Penalty = L2),2,0.7,0.5371520128179451,0.2377710818790534,0.14577960968017578,0.2377710818790534
263,10,Naive Bayes,2,0.7,0.3999599439214901,0.1478920177669876,0.04043149948120117,0.1478920177669876
264,11,KNeighbors Classifier,0,0.7,0.5146175410492592,0.5154098613184495,1.952765941619873,0.5154098613184495
265,11,SVC Classifier,0,0.7,0.55126151381658,1.0,14.56832218170166,0.0
266,11,Decision Tree,0,0.7,0.5024028834601522,0.5031716950965277,0.07866358757019043,0.5031716950965277
267,11,RandomForest,0,0.7,0.5298358029635563,0.5149664046790728,0.143812894821167,0.5149664046790728
268,11,AdaBoost (Discrete),0,0.7,0.46936323588305967,0.4459433215597815,26.861843824386597,0.4459433215597815
269,11,AdaBoost (Real),0,0.7,0.4945935122146576,0.47868501610238884,31.90721583366394,0.47868501610238884
270,11,Logistic Regression (Penalty = L2),0,0.7,0.5406487785342411,0.5197271056887202,0.11832356452941895,0.5197271056887202
271,11,Naive Bayes,0,0.7,0.46876251501802163,0.22644995595286435,0.043973445892333984,0.22644995595286435
272,11,KNeighbors Classifier,1,0.7,0.44081714400160227,0.4426585331897457,2.365966320037842,0.4426585331897457
273,11,SVC Classifier,1,0.7,0.5509713599038654,0.9996366279069767,15.272772550582886,0.0
274,11,Decision Tree,1,0.7,0.464650510715001,0.4662999399623635,0.06856274604797363,0.4662999399623635
275,11,RandomForest,1,0.7,0.5095133186461045,0.4200193559261955,0.14020800590515137,0.4200193559261955
276,11,AdaBoost (Discrete),1,0.7,0.47846985780092127,0.4781604520332152,26.155961275100708,0.4781604520332152
277,11,AdaBoost (Real),1,0.7,0.47386340877228117,0.47564512662199154,26.19699192047119,0.47564512662199154
278,11,Logistic Regression (Penalty = L2),1,0.7,0.4690566793510915,0.45022920349376694,0.10410714149475098,0.45022920349376694
279,11,Naive Bayes,1,0.7,0.5017023833366714,0.5042290769166725,0.07818245887756348,0.5042290769166725
280,11,KNeighbors Classifier,2,0.7,0.4233927498497897,0.37101333436249095,1.302703619003296,0.37101333436249095
281,11,SVC Classifier,2,0.7,0.5513719206889646,0.021124141684149264,12.648130893707275,0.021124141684149264
282,11,Decision Tree,2,0.7,0.5513719206889646,0.5293118852665571,0.07034921646118164,0.5293118852665571
283,11,RandomForest,2,0.7,0.5701982775886241,0.38726006697576243,0.14589405059814453,0.38726006697576243
284,11,AdaBoost (Discrete),2,0.7,0.4634488283597036,0.42678876830410734,22.765873670578003,0.42678876830410734
285,11,AdaBoost (Real),2,0.7,0.4902864009613459,0.4491516239348051,22.02691411972046,0.4491516239348051
286,11,Logistic Regression (Penalty = L2),2,0.7,0.5319447226116564,0.2559532148514081,0.039603471755981445,0.2559532148514081
287,11,Naive Bayes,2,0.7,0.4007610654916884,0.15006769743483475,0.010198116302490234,0.15006769743483475
288,12,KNeighbors Classifier,0,0.7,0.6007208650380457,0.6018693063373418,0.10433173179626465,0.6018693063373418
289,12,SVC Classifier,0,0.7,0.55126151381658,1.0,8.73918890953064,0.0
290,12,Decision Tree,0,0.7,0.5616740088105727,0.5595806226261781,0.029332399368286133,0.5595806226261781
291,12,RandomForest,0,0.7,0.6091309571485783,0.6116325296554818,0.10560488700866699,0.6116325296554818
292,12,AdaBoost (Discrete),0,0.7,0.5610732879455347,0.5453195152443306,6.913357496261597,0.5453195152443306
293,12,AdaBoost (Real),0,0.7,0.5404485382458951,0.5411049237704787,9.210196495056152,0.5411049237704787
294,12,Logistic Regression (Penalty = L2),0,0.7,0.55126151381658,1.0,0.019869565963745117,0.0
295,12,Naive Bayes,0,0.7,0.45554665598718463,0.12472608453357237,0.01051640510559082,0.12472608453357237
296,12,KNeighbors Classifier,1,0.7,0.4554376126577208,0.4573250241722976,0.07270550727844238,0.4573250241722976
297,12,SVC Classifier,1,0.7,0.5509713599038654,0.9996366279069767,7.421977758407593,0.0
298,12,Decision Tree,1,0.7,0.4704586420989385,0.47237488307148906,0.03097677230834961,0.47237488307148906
299,12,RandomForest,1,0.7,0.4778690166232726,0.40592473951490615,0.09483766555786133,0.40592473951490615
300,12,AdaBoost (Discrete),1,0.7,0.47666733426797514,0.47889896424726136,6.397546768188477,0.47889896424726136
301,12,AdaBoost (Real),1,0.7,0.46304826757460443,0.4654421660969376,9.593384504318237,0.4654421660969376
302,12,Logistic Regression (Penalty = L2),1,0.7,0.551171640296415,1.0,0.008087158203125,0.0
303,12,Naive Bayes,1,0.7,0.4652513518926497,0.17261666092213399,0.02245473861694336,0.17261666092213399
304,12,KNeighbors Classifier,2,0.7,0.5465651912677749,0.5027492698622045,0.06347346305847168,0.5027492698622045
305,12,SVC Classifier,2,0.7,0.551171640296415,1.0,5.686833381652832,0.0
306,12,Decision Tree,2,0.7,0.5405567794912878,0.5103529388005089,0.01430511474609375,0.5103529388005089
307,12,RandomForest,2,0.7,0.5549769677548568,0.45014474182894265,0.05750894546508789,0.45014474182894265
308,12,AdaBoost (Discrete),2,0.7,0.5828159423192469,0.5175435077271707,6.964418649673462,0.5175435077271707
309,12,AdaBoost (Real),2,0.7,0.5762066893651111,0.513321621195155,9.20478081703186,0.513321621195155
310,12,Logistic Regression (Penalty = L2),2,0.7,0.551171640296415,1.0,0.011164665222167969,0.0
311,12,Naive Bayes,2,0.7,0.41017424394151814,0.01821854871735463,0.007992744445800781,0.01821854871735463
