,feat_set_id,classifier,fold_id,feat_th,score,geo_score,exec_t,geo_score_woz
0,0,KNeighbors Classifier,0,0.2,0.7208067940552016,0.8625835842948135,7.862539768218994,0.0
1,0,SVC Classifier,0,0.2,0.648619957537155,0.6326362342191056,13.14212417602539,0.0
2,0,Decision Tree,0,0.2,0.6618895966029724,0.6936033393595968,0.15111470222473145,0.0
3,0,RandomForest,0,0.2,0.6199575371549894,0.7062907304547639,0.6769988536834717,0.0
4,0,AdaBoost (Discrete),0,0.2,0.7160297239915074,0.664980052713168,57.582350730895996,0.0
5,0,AdaBoost (Real),0,0.2,0.7192144373673036,0.7112353472351717,111.84639120101929,0.0
6,0,Logistic Regression (Penalty = L2),0,0.2,0.6443736730360934,0.6806822164462879,1.0103404521942139,0.0
7,0,Naive Bayes,0,0.2,0.27016985138004246,0.2653580882124131,0.29311084747314453,0.2653580882124131
8,0,KNeighbors Classifier,1,0.2,0.7682083997873471,0.4386599957814607,8.699910402297974,0.0
9,0,SVC Classifier,1,0.2,0.7421584263689527,0.9424793379355197,16.309468507766724,0.0
10,0,Decision Tree,1,0.2,0.7543859649122807,0.6122847368404143,0.08626294136047363,0.0
11,0,RandomForest,1,0.2,0.7421584263689527,0.9424793379355197,0.801020622253418,0.0
12,0,AdaBoost (Discrete),1,0.2,0.8176501860712387,0.8342261588687843,54.85167670249939,0.0
13,0,AdaBoost (Real),1,0.2,0.7628920786815524,0.8585953957726291,115.49774479866028,0.0
14,0,Logistic Regression (Penalty = L2),1,0.2,0.7554492291334397,0.6056064840274504,0.9165794849395752,0.0
15,0,Naive Bayes,1,0.2,0.43965975544922914,0.7692308621843881,0.2393507957458496,0.0
16,0,KNeighbors Classifier,2,0.2,0.42948376796168175,0.1390483647498075,10.48729658126831,0.0
17,0,SVC Classifier,2,0.2,0.3746673762639702,0.2548050529500685,8.66865348815918,0.0
18,0,Decision Tree,2,0.2,0.3746673762639702,0.24680667682928525,0.08165836334228516,0.0
19,0,RandomForest,2,0.2,0.456093666844066,0.23821397047906698,0.7290079593658447,0.0
20,0,AdaBoost (Discrete),2,0.2,0.4523682810005322,0.2509515210593065,47.84321570396423,0.0
21,0,AdaBoost (Real),2,0.2,0.39648749334752525,0.2507957808506034,73.84452414512634,0.0
22,0,Logistic Regression (Penalty = L2),2,0.2,0.3704097924427887,0.2460053458737386,0.9936950206756592,0.0
23,0,Naive Bayes,2,0.2,0.17562533262373603,0.27275714841705134,0.2844982147216797,0.27275714841705134
24,1,KNeighbors Classifier,0,0.2,0.6985138004246284,0.8506712983128302,4.1727399826049805,0.0
25,1,SVC Classifier,0,0.2,0.5981953290870489,0.65699031791148,10.166856050491333,0.0
26,1,Decision Tree,0,0.2,0.685244161358811,0.8526120246919198,0.0765223503112793,0.0
27,1,RandomForest,0,0.2,0.6502123142250531,0.7815678276732434,0.5976660251617432,0.0
28,1,AdaBoost (Discrete),0,0.2,0.7616772823779193,0.9432936311829813,49.98843431472778,0.0
29,1,AdaBoost (Real),0,0.2,0.5912951167728238,0.6460940290790284,75.60933566093445,0.0
30,1,Logistic Regression (Penalty = L2),0,0.2,0.7107218683651805,0.8635406788959284,1.4370286464691162,0.0
31,1,Naive Bayes,0,0.2,0.5106157112526539,0.8205983686259642,0.3175792694091797,0.0
32,1,KNeighbors Classifier,1,0.2,0.797979797979798,0.7212879099144217,4.010016918182373,0.0
33,1,SVC Classifier,1,0.2,0.7814992025518341,0.9154061101596771,11.671638250350952,0.0
34,1,Decision Tree,1,0.2,0.7666135034556087,0.6169761377004175,0.08044147491455078,0.0
35,1,RandomForest,1,0.2,0.4279638490164806,0.2691720165371975,0.7233095169067383,0.0
36,1,AdaBoost (Discrete),1,0.2,0.8729399255715046,0.6976069150191379,54.277499198913574,0.6976069150191379
37,1,AdaBoost (Real),1,0.2,0.4768740031897927,0.5072252894433719,80.67106008529663,0.0
38,1,Logistic Regression (Penalty = L2),1,0.2,0.7666135034556087,0.6169761377004175,1.3944203853607178,0.0
39,1,Naive Bayes,1,0.2,0.5757575757575758,0.9529331419734943,0.21495532989501953,0.0
40,1,KNeighbors Classifier,2,0.2,0.5380521554018095,0.6782015127499402,7.328888654708862,0.0
41,1,SVC Classifier,2,0.2,0.31293241085683876,0.29012383650659385,4.7149927616119385,0.0
42,1,Decision Tree,2,0.2,0.3991484832357637,0.49458264456659495,0.07253646850585938,0.0
43,1,RandomForest,2,0.2,0.2756785524215008,0.28514743589038166,0.6536633968353271,0.0
44,1,AdaBoost (Discrete),2,0.2,0.41564662054284196,0.471037903117894,52.56156778335571,0.471037903117894
45,1,AdaBoost (Real),2,0.2,0.38690792974986693,0.466128884684949,84.00355935096741,0.0
46,1,Logistic Regression (Penalty = L2),2,0.2,0.37360298030867484,0.3677257586636381,1.4369804859161377,0.0
47,1,Naive Bayes,2,0.2,0.3571048430015966,0.6549817904152957,0.18229031562805176,0.0
48,2,KNeighbors Classifier,0,0.2,0.25743099787685775,0.18735160820860364,7.8690526485443115,0.0
49,2,SVC Classifier,0,0.2,0.5727176220806794,0.4418829993464387,14.679983139038086,0.0
50,2,Decision Tree,0,0.2,0.631104033970276,0.6681880926716245,0.18814897537231445,0.0
51,2,RandomForest,0,0.2,0.5217622080679406,0.23761735989441957,0.776170015335083,0.0
52,2,AdaBoost (Discrete),0,0.2,0.6576433121019108,0.5838157034319833,56.237908601760864,0.0
53,2,AdaBoost (Real),0,0.2,0.638004246284501,0.45703265897374656,81.2284095287323,0.45703265897374656
54,2,Logistic Regression (Penalty = L2),0,0.2,0.6337579617834395,0.669107199438383,1.0171546936035156,0.0
55,2,Naive Bayes,0,0.2,0.32908704883227174,0.7013834106057978,0.25073719024658203,0.0
56,2,KNeighbors Classifier,1,0.2,0.1318447634237108,0.22811301223349106,8.348551750183105,0.0
57,2,SVC Classifier,1,0.2,0.7384370015948963,0.44419497344083403,17.177404165267944,0.0
58,2,Decision Tree,1,0.2,0.7288676236044657,0.9564001701466731,0.07753896713256836,0.0
59,2,RandomForest,1,0.2,0.48484848484848486,0.3614486980061245,0.7239727973937988,0.0
60,2,AdaBoost (Discrete),1,0.2,0.7703349282296651,0.4763849482979318,51.97645664215088,0.0
61,2,AdaBoost (Real),1,0.2,0.7496012759170654,0.47164665475468937,81.78784680366516,0.0
62,2,Logistic Regression (Penalty = L2),1,0.2,0.7421584263689527,0.9669806764936351,1.0403730869293213,0.0
63,2,Naive Bayes,1,0.2,0.22115895800106328,0.5198076849268124,0.2457277774810791,0.0
64,2,KNeighbors Classifier,2,0.2,0.30548163916977117,0.37836308676436486,9.61300539970398,0.37836308676436486
65,2,SVC Classifier,2,0.2,0.34486428951569986,0.3518087809620415,10.361488580703735,0.0
66,2,Decision Tree,2,0.2,0.35071846726982436,0.3473582453995959,0.06872010231018066,0.0
67,2,RandomForest,2,0.2,0.4332091538052155,0.1321293235904336,0.7813572883605957,0.0
68,2,AdaBoost (Discrete),2,0.2,0.349654071314529,0.2499730377187324,50.00658416748047,0.2499730377187324
69,2,AdaBoost (Real),2,0.2,0.36668440659925494,0.336766071776479,78.30981183052063,0.0
70,2,Logistic Regression (Penalty = L2),2,0.2,0.3453964874933475,0.32940006329671706,0.732640266418457,0.0
71,2,Naive Bayes,2,0.2,0.18999467802022352,0.44063396312608516,0.25681495666503906,0.0
72,3,KNeighbors Classifier,0,0.2,0.3232484076433121,0.4946922752738886,3.1267354488372803,0.0
73,3,SVC Classifier,0,0.2,0.517515923566879,0.7204727732383817,9.255463123321533,0.0
74,3,Decision Tree,0,0.2,0.524416135881104,0.5411695095986477,0.0027039051055908203,0.0
75,3,RandomForest,0,0.2,0.522823779193206,0.6007762253647153,0.672426700592041,0.0
76,3,AdaBoost (Discrete),0,0.2,0.3481953290870488,0.43800493067944946,41.2351655960083,0.0
77,3,AdaBoost (Real),0,0.2,0.6130573248407644,0.5759893268253297,78.54381561279297,0.0
78,3,Logistic Regression (Penalty = L2),0,0.2,0.524416135881104,0.5411695095986477,0.7049531936645508,0.0
79,3,Naive Bayes,0,0.2,0.17887473460721867,0.8386747408491846,0.11492681503295898,0.0
80,3,KNeighbors Classifier,1,0.2,0.3763955342902711,0.7514157277035132,3.686110496520996,0.0
81,3,SVC Classifier,1,0.2,0.45188729399255717,0.17505759420922756,10.032148122787476,0.0
82,3,Decision Tree,1,0.2,0.4965443912812334,0.5094959321993501,0.0955345630645752,0.0
83,3,RandomForest,1,0.2,0.4853801169590643,0.3636730186804199,0.7553932666778564,0.0
84,3,AdaBoost (Discrete),1,0.2,0.5066454013822435,0.3780660354187712,45.18373966217041,0.0
85,3,AdaBoost (Real),1,0.2,0.5066454013822435,0.3780660354187712,79.05301284790039,0.0
86,3,Logistic Regression (Penalty = L2),1,0.2,0.4965443912812334,0.5094959321993501,0.7016353607177734,0.0
87,3,Naive Bayes,1,0.2,0.12812333864965444,1.0,0.1918802261352539,0.0
88,3,KNeighbors Classifier,2,0.2,0.34113890367216604,1.0,4.161988258361816,0.0
89,3,SVC Classifier,2,0.2,0.42948376796168175,0.9731330596620531,9.240119934082031,0.0
90,3,Decision Tree,2,0.2,0.42948376796168175,0.76954360556895,0.09167027473449707,0.0
91,3,RandomForest,2,0.2,0.42256519425226186,0.9566265060240964,0.7944626808166504,0.0
92,3,AdaBoost (Discrete),2,0.2,0.44332091538052154,0.5414470939438473,44.96886444091797,0.0
93,3,AdaBoost (Real),2,0.2,0.4252261841405003,0.765656996855019,75.71328139305115,0.0
94,3,Logistic Regression (Penalty = L2),2,0.2,0.42948376796168175,0.9731330596620531,0.7516007423400879,0.0
95,3,Naive Bayes,2,0.2,0.12293773283661522,0.7914573592283368,0.17634344100952148,0.0
96,4,KNeighbors Classifier,0,0.2,0.5875796178343949,0.6276718833353278,4.533352613449097,0.0
97,4,SVC Classifier,0,0.2,0.5721868365180467,0.373459296989841,9.140376806259155,0.0
98,4,Decision Tree,0,0.2,0.5875796178343949,0.6276718833353278,0.08749580383300781,0.0
99,4,RandomForest,0,0.2,0.5212314225053079,0.41239347194394127,0.7004954814910889,0.0
100,4,AdaBoost (Discrete),0,0.2,0.5286624203821656,0.5374617334849231,46.53882956504822,0.0
101,4,AdaBoost (Real),0,0.2,0.5875796178343949,0.6276718833353278,83.20548224449158,0.0
102,4,Logistic Regression (Penalty = L2),0,0.2,0.5875796178343949,0.6276718833353278,0.6850507259368896,0.0
103,4,Naive Bayes,0,0.2,0.24097664543524416,0.737941958218765,0.17301130294799805,0.0
104,4,KNeighbors Classifier,1,0.2,0.12280701754385964,0.2585413008162108,4.885034799575806,0.0
105,4,SVC Classifier,1,0.2,0.732589048378522,0.9522100253099443,11.699620723724365,0.0
106,4,Decision Tree,1,0.2,0.7437533227006912,0.9678807070669865,0.17293858528137207,0.0
107,4,RandomForest,1,0.2,0.48219032429558745,0.3501151884184551,0.6983950138092041,0.0
108,4,AdaBoost (Discrete),1,0.2,0.5268474215842637,0.3104157389038603,44.92019534111023,0.0
109,4,AdaBoost (Real),1,0.2,0.7437533227006912,0.9678807070669865,78.17161798477173,0.0
110,4,Logistic Regression (Penalty = L2),1,0.2,0.7437533227006912,0.9678807070669865,0.6251955032348633,0.0
111,4,Naive Bayes,1,0.2,0.3950026581605529,0.8938945617293776,0.22019529342651367,0.0
112,4,KNeighbors Classifier,2,0.2,0.0707823310271421,0.09616028097679181,5.371482849121094,0.0
113,4,SVC Classifier,2,0.2,0.4278871740287387,0.34895266595579877,7.984009265899658,0.0
114,4,Decision Tree,2,0.2,0.4257583821181479,0.3483345022770617,0.08537507057189941,0.0
115,4,RandomForest,2,0.2,0.4481106971793507,0.3547190117885279,0.6752691268920898,0.0
116,4,AdaBoost (Discrete),2,0.2,0.456093666844066,0.30860352207222586,45.32918691635132,0.0
117,4,AdaBoost (Real),2,0.2,0.4257583821181479,0.3483345022770617,77.42284893989563,0.0
118,4,Logistic Regression (Penalty = L2),2,0.2,0.4257583821181479,0.3483345022770617,0.6424741744995117,0.0
119,4,Naive Bayes,2,0.2,0.15593400745077168,0.3964642543817903,0.24930238723754883,0.0
120,5,KNeighbors Classifier,0,0.2,0.34076433121019106,1.0,4.721299648284912,0.0
121,5,SVC Classifier,0,0.2,0.47558386411889597,0.32378806290136664,9.21731162071228,0.0
122,5,Decision Tree,0,0.2,0.47717622080679406,0.7204727732383817,0.08779668807983398,0.0
123,5,RandomForest,0,0.2,0.47558386411889597,0.32378806290136664,0.7141170501708984,0.0
124,5,AdaBoost (Discrete),0,0.2,0.34076433121019106,1.0,43.464017152786255,0.0
125,5,AdaBoost (Real),0,0.2,0.47717622080679406,0.7204727732383817,76.15587496757507,0.0
126,5,Logistic Regression (Penalty = L2),0,0.2,0.47717622080679406,0.7204727732383817,0.6979334354400635,0.0
127,5,Naive Bayes,0,0.2,0.07696390658174097,1.0,0.20666146278381348,0.0
128,5,KNeighbors Classifier,1,0.2,0.34077618288144607,1.0,4.637807130813599,0.0
129,5,SVC Classifier,1,0.2,0.47527910685805425,0.318767788877431,10.368523120880127,0.0
130,5,Decision Tree,1,0.2,0.4864433811802233,0.46664106362351077,0.08759164810180664,0.0
131,5,RandomForest,1,0.2,0.47527910685805425,0.318767788877431,0.7338800430297852,0.0
132,5,AdaBoost (Discrete),1,0.2,0.4965443912812334,0.8735804647362989,46.8718626499176,0.0
133,5,AdaBoost (Real),1,0.2,0.4864433811802233,0.46664106362351077,79.95205116271973,0.0
134,5,Logistic Regression (Penalty = L2),1,0.2,0.4864433811802233,0.46664106362351077,0.8221619129180908,0.0
135,5,Naive Bayes,1,0.2,0.07655502392344497,1.0,0.18764925003051758,0.0
136,5,KNeighbors Classifier,2,0.2,0.34113890367216604,1.0,4.642189264297485,0.0
137,5,SVC Classifier,2,0.2,0.42948376796168175,0.9731330596620531,9.183370351791382,0.0
138,5,Decision Tree,2,0.2,0.42948376796168175,0.9731330596620531,0.09483075141906738,0.0
139,5,RandomForest,2,0.2,0.42948376796168175,0.9731330596620531,0.7366602420806885,0.0
140,5,AdaBoost (Discrete),2,0.2,0.42948376796168175,0.9731330596620531,41.35300278663635,0.0
141,5,AdaBoost (Real),2,0.2,0.42948376796168175,0.9731330596620531,71.66027212142944,0.0
142,5,Logistic Regression (Penalty = L2),2,0.2,0.42948376796168175,0.9731330596620531,0.551354169845581,0.0
143,5,Naive Bayes,2,0.2,0.42948376796168175,0.9731330596620531,0.16368651390075684,0.0
144,6,KNeighbors Classifier,0,0.2,0.7372611464968153,0.8743653700510113,5.857724905014038,0.0
145,6,SVC Classifier,0,0.2,0.5886411889596603,0.46718235493566007,12.07131052017212,0.0
146,6,Decision Tree,0,0.2,0.6725053078556263,0.7102476047899328,0.08525681495666504,0.0
147,6,RandomForest,0,0.2,0.5923566878980892,0.7275777853156212,0.7558140754699707,0.0
148,6,AdaBoost (Discrete),0,0.2,0.755307855626327,0.6155277404407679,49.87491202354431,0.0
149,6,AdaBoost (Real),0,0.2,0.7123142250530785,0.7502153282912487,80.77304553985596,0.0
150,6,Logistic Regression (Penalty = L2),0,0.2,0.6470276008492569,0.7013178507543133,0.8838891983032227,0.0
151,6,Naive Bayes,0,0.2,0.25424628450106157,0.29520102029210077,0.24301576614379883,0.0
152,6,KNeighbors Classifier,1,0.2,0.4008506113769272,0.436025809429132,7.314103126525879,0.0
153,6,SVC Classifier,1,0.2,0.732589048378522,0.43746015708722735,14.618407726287842,0.0
154,6,Decision Tree,1,0.2,0.7628920786815524,0.6154368859751542,0.08171749114990234,0.0
155,6,RandomForest,1,0.2,0.7044125465178097,0.9093282347938078,0.7727775573730469,0.0
156,6,AdaBoost (Discrete),1,0.2,0.48431685273790537,0.5442977614271457,50.5667142868042,0.0
157,6,AdaBoost (Real),1,0.2,0.7862838915470495,0.8749402349504761,80.46188116073608,0.0
158,6,Logistic Regression (Penalty = L2),1,0.2,0.7761828814460393,0.9935063103670373,0.9317538738250732,0.0
159,6,Naive Bayes,1,0.2,0.4077618288144604,0.9597287693899687,0.17374467849731445,0.0
160,6,KNeighbors Classifier,2,0.2,0.41830761043108033,0.19605931809348795,8.474390745162964,0.0
161,6,SVC Classifier,2,0.2,0.41351782863225117,0.25158981668063035,8.822449684143066,0.0
162,6,Decision Tree,2,0.2,0.41883980840872803,0.34631016129144576,0.09891366958618164,0.0
163,6,RandomForest,2,0.2,0.447578499201703,0.13319885691653277,0.6642770767211914,0.0
164,6,AdaBoost (Discrete),2,0.2,0.41351782863225117,0.25158981668063035,44.53403854370117,0.0
165,6,AdaBoost (Real),2,0.2,0.4310803618946248,0.21828463603472137,79.52836608886719,0.0
166,6,Logistic Regression (Penalty = L2),2,0.2,0.4353379457158063,0.2561229427838334,0.833615779876709,0.0
167,6,Naive Bayes,2,0.2,0.17189994678020223,0.23922613591818137,0.17894268035888672,0.0
168,7,KNeighbors Classifier,0,0.2,0.7377919320594479,0.8745764674609507,11.27632474899292,0.0
169,7,SVC Classifier,0,0.2,0.6698513800424628,0.7093381938614752,21.820549488067627,0.0
170,7,Decision Tree,0,0.2,0.7319532908704883,0.8695004389314634,0.08242130279541016,0.0
171,7,RandomForest,0,0.2,0.5981953290870489,0.6909553927994988,0.827233076095581,0.0
172,7,AdaBoost (Discrete),0,0.2,0.7075371549893843,0.8441049636517284,76.43422627449036,0.0
173,7,AdaBoost (Real),0,0.2,0.5392781316348195,0.5690237806114667,107.3189787864685,0.0
174,7,Logistic Regression (Penalty = L2),0,0.2,0.7107218683651805,0.8635406788959284,1.7493634223937988,0.0
175,7,Naive Bayes,0,0.2,0.6815286624203821,0.759585298965345,0.4416806697845459,0.759585298965345
176,7,KNeighbors Classifier,1,0.2,0.8665603402445508,0.753253517664333,12.797934770584106,0.753253517664333
177,7,SVC Classifier,1,0.2,0.7814992025518341,0.9154061101596771,23.891895055770874,0.0
178,7,Decision Tree,1,0.2,0.7666135034556087,0.6169761377004175,0.17600750923156738,0.0
179,7,RandomForest,1,0.2,0.7161084529505582,0.9351077256659843,0.8989527225494385,0.0
180,7,AdaBoost (Discrete),1,0.2,0.7910685805422647,0.626160245392542,75.35263848304749,0.0
181,7,AdaBoost (Real),1,0.2,0.3902179691653376,0.47006764384170935,106.33161783218384,0.0
182,7,Logistic Regression (Penalty = L2),1,0.2,0.7671451355661882,0.6172284281386226,1.7670924663543701,0.0
183,7,Naive Bayes,1,0.2,0.8787878787878788,0.9448676241490953,0.4118380546569824,0.9448676241490953
184,7,KNeighbors Classifier,2,0.2,0.44385311335816924,0.474370520633326,19.506523370742798,0.474370520633326
185,7,SVC Classifier,2,0.2,0.31293241085683876,0.29012383650659385,9.742718696594238,0.0
186,7,Decision Tree,2,0.2,0.3927621075039915,0.49166023817072274,0.1603238582611084,0.0
187,7,RandomForest,2,0.2,0.359765832889835,0.14962213017185422,0.8382484912872314,0.0
188,7,AdaBoost (Discrete),2,0.2,0.4523682810005322,0.4920933740886436,72.72804164886475,0.0
189,7,AdaBoost (Real),2,0.2,0.3225119744544971,0.7389992625040792,103.73870968818665,0.0
190,7,Logistic Regression (Penalty = L2),2,0.2,0.37360298030867484,0.3677257586636381,1.4832017421722412,0.0
191,7,Naive Bayes,2,0.2,0.37573177221926557,0.4192875743195168,0.3167407512664795,0.4192875743195168
192,8,KNeighbors Classifier,0,0.2,0.32908704883227174,1.0,2.939934253692627,0.0
193,8,SVC Classifier,0,0.2,0.47558386411889597,0.32378806290136664,6.964852809906006,0.0
194,8,Decision Tree,0,0.2,0.46549893842887474,0.6115420998078532,0.06667852401733398,0.0
195,8,RandomForest,0,0.2,0.46549893842887474,0.6115420998078532,0.6166894435882568,0.0
196,8,AdaBoost (Discrete),0,0.2,0.47558386411889597,0.32378806290136664,37.8884334564209,0.0
197,8,AdaBoost (Real),0,0.2,0.46549893842887474,0.6115420998078532,66.65049648284912,0.0
198,8,Logistic Regression (Penalty = L2),0,0.2,0.46549893842887474,0.6115420998078532,0.4394495487213135,0.0
199,8,Naive Bayes,0,0.2,0.0881104033970276,0.7204727732383817,0.1492023468017578,0.0
200,8,KNeighbors Classifier,1,0.2,0.32961190855927697,1.0,2.9494056701660156,0.0
201,8,SVC Classifier,1,0.2,0.47527910685805425,0.318767788877431,7.459991931915283,0.0
202,8,Decision Tree,1,0.2,0.47527910685805425,0.318767788877431,0.07994818687438965,0.0
203,8,RandomForest,1,0.2,0.47527910685805425,0.318767788877431,0.71036696434021,0.0
204,8,AdaBoost (Discrete),1,0.2,0.4864433811802233,0.46664106362351077,39.12811279296875,0.0
205,8,AdaBoost (Real),1,0.2,0.47527910685805425,0.318767788877431,65.82236766815186,0.0
206,8,Logistic Regression (Penalty = L2),1,0.2,0.47527910685805425,0.318767788877431,0.7252318859100342,0.0
207,8,Naive Bayes,1,0.2,0.1063264221158958,0.8735804647362989,0.15546584129333496,0.0
208,8,KNeighbors Classifier,2,0.2,0.34113890367216604,1.0,3.225713014602661,0.0
209,8,SVC Classifier,2,0.2,0.42948376796168175,0.9731330596620531,7.0591721534729,0.0
210,8,Decision Tree,2,0.2,0.42948376796168175,0.9731330596620531,0.07157754898071289,0.0
211,8,RandomForest,2,0.2,0.42948376796168175,0.9731330596620531,0.6762034893035889,0.0
212,8,AdaBoost (Discrete),2,0.2,0.42948376796168175,0.9731330596620531,37.51326775550842,0.0
213,8,AdaBoost (Real),2,0.2,0.42948376796168175,0.9731330596620531,63.82790565490723,0.0
214,8,Logistic Regression (Penalty = L2),2,0.2,0.42948376796168175,0.9731330596620531,0.47727489471435547,0.0
215,8,Naive Bayes,2,0.2,0.42948376796168175,0.9731330596620531,0.15448760986328125,0.0
