,feat_set_id,classifier,fold_id,feat_th,score,geo_score,exec_t,geo_score_woz
0,0,KNeighbors Classifier,0,0.6,0.9776119402985075,0.9773772659446601,6.3408753871917725,0.9773772659446601
1,0,SVC Classifier,0,0.6,0.9119402985074627,0.9109382829877746,8.591763019561768,0.9109382829877746
2,0,Decision Tree,0,0.6,0.7522388059701492,0.7439180888527089,0.40216684341430664,0.7439180888527089
3,0,RandomForest,0,0.6,0.7179104477611941,0.7043489832587723,1.69057297706604,0.7043489832587723
4,0,AdaBoost (Discrete),0,0.6,0.9313432835820895,0.9306448040827227,333.4547028541565,0.9306448040827227
5,0,AdaBoost (Real),0,0.6,0.9029850746268657,0.9003757075447257,352.41109466552734,0.9003757075447257
6,0,Logistic Regression (Penalty = L2),0,0.6,0.9417910447761194,0.9409452399146839,3.6601064205169678,0.9409452399146839
7,0,Naive Bayes,0,0.6,0.9417910447761194,0.9412825668153109,0.39159059524536133,0.9412825668153109
8,0,KNeighbors Classifier,1,0.6,0.9626865671641791,0.9624004847653697,5.602386236190796,0.9624004847653697
9,0,SVC Classifier,1,0.6,0.9238805970149254,0.9228235686572994,7.5748279094696045,0.9228235686572994
10,0,Decision Tree,1,0.6,0.755223880597015,0.7522459552450246,0.38788938522338867,0.7522459552450246
11,0,RandomForest,1,0.6,0.6925373134328359,0.6577490153686945,1.6646902561187744,0.6577490153686945
12,0,AdaBoost (Discrete),1,0.6,0.9223880597014925,0.9218500361363351,368.2668070793152,0.9218500361363351
13,0,AdaBoost (Real),1,0.6,0.8537313432835821,0.8521461559392559,386.29809522628784,0.8521461559392559
14,0,Logistic Regression (Penalty = L2),1,0.6,0.9537313432835821,0.9535584253301767,3.446695566177368,0.9535584253301767
15,0,Naive Bayes,1,0.6,0.9298507462686567,0.9292773822853729,0.4430727958679199,0.9292773822853729
16,0,KNeighbors Classifier,2,0.6,0.9666666666666667,0.9663619857944711,6.689591646194458,0.9663619857944711
17,0,SVC Classifier,2,0.6,0.9272727272727272,0.9265505499593193,9.431683540344238,0.9265505499593193
18,0,Decision Tree,2,0.6,0.7575757575757576,0.7489468765968134,0.46323490142822266,0.7489468765968134
19,0,RandomForest,2,0.6,0.7136363636363636,0.686063640906367,1.683983564376831,0.686063640906367
20,0,AdaBoost (Discrete),2,0.6,0.9393939393939394,0.9388494165927969,385.32234597206116,0.9388494165927969
21,0,AdaBoost (Real),2,0.6,0.9045454545454545,0.9031583440257877,447.7470064163208,0.9031583440257877
22,0,Logistic Regression (Penalty = L2),2,0.6,0.9515151515151515,0.9512056054594454,2.5452873706817627,0.9512056054594454
23,0,Naive Bayes,2,0.6,0.9409090909090909,0.9405569349341074,0.23931431770324707,0.9405569349341074
24,1,KNeighbors Classifier,0,0.6,0.9776119402985075,0.9774242676655281,5.0991129875183105,0.9774242676655281
25,1,SVC Classifier,0,0.6,0.9194029850746268,0.9178799177056846,13.576992750167847,0.9178799177056846
26,1,Decision Tree,0,0.6,0.7134328358208956,0.7074837818485679,0.8253664970397949,0.7074837818485679
27,1,RandomForest,0,0.6,0.6716417910447762,0.644038313045328,2.3205056190490723,0.644038313045328
28,1,AdaBoost (Discrete),0,0.6,0.926865671641791,0.9260743262499762,446.25308060646057,0.9260743262499762
29,1,AdaBoost (Real),0,0.6,0.8850746268656716,0.8832952931816137,407.90445709228516,0.8832952931816137
30,1,Logistic Regression (Penalty = L2),0,0.6,0.9447761194029851,0.944113477421039,4.2602972984313965,0.944113477421039
31,1,Naive Bayes,0,0.6,0.9417910447761194,0.9410849289719657,0.6737134456634521,0.9410849289719657
32,1,KNeighbors Classifier,1,0.6,0.9611940298507463,0.9606761139359424,6.9045569896698,0.9606761139359424
33,1,SVC Classifier,1,0.6,0.9253731343283582,0.9244981671350062,9.462321281433105,0.9244981671350062
34,1,Decision Tree,1,0.6,0.7014925373134329,0.6964088628909658,0.6055638790130615,0.6964088628909658
35,1,RandomForest,1,0.6,0.7044776119402985,0.6749598804353908,2.1273086071014404,0.6749598804353908
36,1,AdaBoost (Discrete),1,0.6,0.9253731343283582,0.9247938968488064,402.3498055934906,0.9247938968488064
37,1,AdaBoost (Real),1,0.6,0.8552238805970149,0.852960695977591,388.52151226997375,0.852960695977591
38,1,Logistic Regression (Penalty = L2),1,0.6,0.9462686567164179,0.9458094976350573,2.9207801818847656,0.9458094976350573
39,1,Naive Bayes,1,0.6,0.935820895522388,0.9353246770105325,0.45772385597229004,0.9353246770105325
40,1,KNeighbors Classifier,2,0.6,0.9621212121212122,0.9618017943454031,6.2395079135894775,0.9618017943454031
41,1,SVC Classifier,2,0.6,0.9212121212121213,0.9202261853740354,9.004966735839844,0.9202261853740354
42,1,Decision Tree,2,0.6,0.7909090909090909,0.7893331571823958,0.5226681232452393,0.7893331571823958
43,1,RandomForest,2,0.6,0.6757575757575758,0.6435195732735437,1.8111586570739746,0.6435195732735437
44,1,AdaBoost (Discrete),2,0.6,0.9409090909090909,0.9402810349699983,393.9613230228424,0.9402810349699983
45,1,AdaBoost (Real),2,0.6,0.8924242424242425,0.8908177962664637,387.8097689151764,0.8908177962664637
46,1,Logistic Regression (Penalty = L2),2,0.6,0.9590909090909091,0.9588498652305969,3.236733913421631,0.9588498652305969
47,1,Naive Bayes,2,0.6,0.9409090909090909,0.9406778320103413,0.2828798294067383,0.9406778320103413
48,2,KNeighbors Classifier,0,0.6,0.9671641791044776,0.9664670204701662,5.969095468521118,0.9664670204701662
49,2,SVC Classifier,0,0.6,0.9194029850746268,0.9186000910656497,8.716026544570923,0.9186000910656497
50,2,Decision Tree,0,0.6,0.7134328358208956,0.7057256316365782,0.27488136291503906,0.7057256316365782
51,2,RandomForest,0,0.6,0.7268656716417911,0.7147814675940948,1.8092188835144043,0.7147814675940948
52,2,AdaBoost (Discrete),0,0.6,0.9238805970149254,0.9227900163561488,400.4983375072479,0.9227900163561488
53,2,AdaBoost (Real),0,0.6,0.8582089552238806,0.8552061137058065,403.7239854335785,0.8552061137058065
54,2,Logistic Regression (Penalty = L2),0,0.6,0.9492537313432836,0.9484999576392971,2.483943223953247,0.9484999576392971
55,2,Naive Bayes,0,0.6,0.9208955223880597,0.9199928843360206,0.368802547454834,0.9199928843360206
56,2,KNeighbors Classifier,1,0.6,0.9432835820895522,0.9424451105658175,5.656646013259888,0.9424451105658175
57,2,SVC Classifier,1,0.6,0.9059701492537313,0.9047162572647287,7.629407644271851,0.9047162572647287
58,2,Decision Tree,1,0.6,0.7343283582089553,0.7307307473351868,0.32463955879211426,0.7307307473351868
59,2,RandomForest,1,0.6,0.7104477611940299,0.6957831617850987,1.234785556793213,0.6957831617850987
60,2,AdaBoost (Discrete),1,0.6,0.9104477611940298,0.9099153186307954,375.4041111469269,0.9099153186307954
61,2,AdaBoost (Real),1,0.6,0.8388059701492537,0.8376745922799325,366.40416836738586,0.8376745922799325
62,2,Logistic Regression (Penalty = L2),1,0.6,0.9462686567164179,0.9456701018705865,2.855705499649048,0.9456701018705865
63,2,Naive Bayes,1,0.6,0.9208955223880597,0.9199748231589477,0.37642812728881836,0.9199748231589477
64,2,KNeighbors Classifier,2,0.6,0.9636363636363636,0.9630754891153778,5.9838197231292725,0.9630754891153778
65,2,SVC Classifier,2,0.6,0.9196969696969697,0.9190593218218066,8.504931211471558,0.9190593218218066
66,2,Decision Tree,2,0.6,0.7545454545454545,0.7494683966032124,0.3911936283111572,0.7494683966032124
67,2,RandomForest,2,0.6,0.7696969696969697,0.7592117876105926,1.5450174808502197,0.7592117876105926
68,2,AdaBoost (Discrete),2,0.6,0.9257575757575758,0.925023989139804,1394.344821691513,0.925023989139804
69,2,AdaBoost (Real),2,0.6,0.8818181818181818,0.8791908656192065,289.2804653644562,0.8791908656192065
70,2,Logistic Regression (Penalty = L2),2,0.6,0.9575757575757575,0.9572927061001979,2.6216800212860107,0.9572927061001979
71,2,Naive Bayes,2,0.6,0.9348484848484848,0.9346004198828186,0.31622982025146484,0.9346004198828186
72,3,KNeighbors Classifier,0,0.6,0.9791044776119403,0.9789408598552067,4.048067808151245,0.9789408598552067
73,3,SVC Classifier,0,0.6,0.9194029850746268,0.918147774797071,6.028395652770996,0.918147774797071
74,3,Decision Tree,0,0.6,0.7716417910447761,0.7688923688597261,0.3194098472595215,0.7688923688597261
75,3,RandomForest,0,0.6,0.7014925373134329,0.6599340225481451,1.1946613788604736,0.6599340225481451
76,3,AdaBoost (Discrete),0,0.6,0.9208955223880597,0.9202960530928677,226.87726759910583,0.9202960530928677
77,3,AdaBoost (Real),0,0.6,0.8880597014925373,0.8857374146580428,228.63029861450195,0.8857374146580428
78,3,Logistic Regression (Penalty = L2),0,0.6,0.9432835820895522,0.9424765105114467,1.8030197620391846,0.9424765105114467
79,3,Naive Bayes,0,0.6,0.9388059701492537,0.9382011726354048,0.2635021209716797,0.9382011726354048
80,3,KNeighbors Classifier,1,0.6,0.9686567164179104,0.9682979376493879,0.8600225448608398,0.9682979376493879
81,3,SVC Classifier,1,0.6,0.9208955223880597,0.9197726269259212,4.547062635421753,0.9197726269259212
82,3,Decision Tree,1,0.6,0.6850746268656717,0.677499202045904,0.2653970718383789,0.677499202045904
83,3,RandomForest,1,0.6,0.7044776119402985,0.6674058634939641,0.9622931480407715,0.6674058634939641
84,3,AdaBoost (Discrete),1,0.6,0.9313432835820895,0.9307896649043479,216.35144925117493,0.9307896649043479
85,3,AdaBoost (Real),1,0.6,0.8626865671641791,0.8616004161891023,220.3380467891693,0.8616004161891023
86,3,Logistic Regression (Penalty = L2),1,0.6,0.9507462686567164,0.9502982223547909,1.766570806503296,0.9502982223547909
87,3,Naive Bayes,1,0.6,0.9417910447761194,0.9413821523620614,0.18817734718322754,0.9413821523620614
88,3,KNeighbors Classifier,2,0.6,0.9712121212121212,0.9709881011523371,3.6173715591430664,0.9709881011523371
89,3,SVC Classifier,2,0.6,0.9242424242424242,0.9235967850007751,5.22999382019043,0.9235967850007751
90,3,Decision Tree,2,0.6,0.7545454545454545,0.7491500750569163,0.27494311332702637,0.7491500750569163
91,3,RandomForest,2,0.6,0.696969696969697,0.674344956435099,0.9138424396514893,0.674344956435099
92,3,AdaBoost (Discrete),2,0.6,0.9378787878787879,0.93688308548115,200.40792107582092,0.93688308548115
93,3,AdaBoost (Real),2,0.6,0.8651515151515151,0.8638320257245445,210.19919514656067,0.8638320257245445
94,3,Logistic Regression (Penalty = L2),2,0.6,0.953030303030303,0.9527791820743541,1.843719482421875,0.9527791820743541
95,3,Naive Bayes,2,0.6,0.9424242424242424,0.9421841534127294,0.2751617431640625,0.9421841534127294
96,4,KNeighbors Classifier,0,0.6,0.9746268656716418,0.974419773636739,3.0460855960845947,0.974419773636739
97,4,SVC Classifier,0,0.6,0.9074626865671642,0.9065410748461414,4.599066495895386,0.9065410748461414
98,4,Decision Tree,0,0.6,0.7373134328358208,0.7332501354808295,0.17302203178405762,0.7332501354808295
99,4,RandomForest,0,0.6,0.682089552238806,0.678716145411565,0.9926691055297852,0.678716145411565
100,4,AdaBoost (Discrete),0,0.6,0.9313432835820895,0.9307605179588221,179.1804563999176,0.9307605179588221
101,4,AdaBoost (Real),0,0.6,0.8925373134328358,0.8915711939781287,179.43297386169434,0.8915711939781287
102,4,Logistic Regression (Penalty = L2),0,0.6,0.9462686567164179,0.9452698889266128,1.3861370086669922,0.9452698889266128
103,4,Naive Bayes,0,0.6,0.9194029850746268,0.9184232542659027,0.23563885688781738,0.9184232542659027
104,4,KNeighbors Classifier,1,0.6,0.9671641791044776,0.9668908889470307,2.375332832336426,0.9668908889470307
105,4,SVC Classifier,1,0.6,0.9014925373134328,0.9007266813927893,3.901416301727295,0.9007266813927893
106,4,Decision Tree,1,0.6,0.746268656716418,0.740971244215824,0.23769307136535645,0.740971244215824
107,4,RandomForest,1,0.6,0.6701492537313433,0.652965044120543,0.7208011150360107,0.652965044120543
108,4,AdaBoost (Discrete),1,0.6,0.9164179104477612,0.9159455475408727,160.73220443725586,0.9159455475408727
109,4,AdaBoost (Real),1,0.6,0.8716417910447761,0.8705260705857398,162.80585360527039,0.8705260705857398
110,4,Logistic Regression (Penalty = L2),1,0.6,0.9432835820895522,0.9427887953546125,1.2783982753753662,0.9427887953546125
111,4,Naive Bayes,1,0.6,0.9208955223880597,0.9200754823759745,0.15759015083312988,0.9200754823759745
112,4,KNeighbors Classifier,2,0.6,0.9606060606060606,0.9601453107785642,2.1376287937164307,0.9601453107785642
113,4,SVC Classifier,2,0.6,0.9212121212121213,0.9208196172430805,3.5224978923797607,0.9208196172430805
114,4,Decision Tree,2,0.6,0.703030303030303,0.6892790816943479,0.1457962989807129,0.6892790816943479
115,4,RandomForest,2,0.6,0.7318181818181818,0.7231877831873287,0.70697021484375,0.7231877831873287
116,4,AdaBoost (Discrete),2,0.6,0.9287878787878788,0.9281173348003485,142.62608075141907,0.9281173348003485
117,4,AdaBoost (Real),2,0.6,0.8772727272727273,0.8758270038512925,152.063090801239,0.8758270038512925
118,4,Logistic Regression (Penalty = L2),2,0.6,0.95,0.949587442112426,1.2823851108551025,0.949587442112426
119,4,Naive Bayes,2,0.6,0.9363636363636364,0.9361221702893834,0.1411888599395752,0.9361221702893834
120,5,KNeighbors Classifier,0,0.6,0.9731343283582089,0.9729101855923863,2.2657344341278076,0.9729101855923863
121,5,SVC Classifier,0,0.6,0.9059701492537313,0.9046343311935523,3.3714518547058105,0.9046343311935523
122,5,Decision Tree,0,0.6,0.7044776119402985,0.6992193064443744,0.22350263595581055,0.6992193064443744
123,5,RandomForest,0,0.6,0.6716417910447762,0.6651781973218142,0.7997074127197266,0.6651781973218142
124,5,AdaBoost (Discrete),0,0.6,0.9194029850746268,0.9188581765895077,148.5763087272644,0.9188581765895077
125,5,AdaBoost (Real),0,0.6,0.8940298507462686,0.8929783004811855,174.65016746520996,0.8929783004811855
126,5,Logistic Regression (Penalty = L2),0,0.6,0.9447761194029851,0.9440618738299542,1.4127388000488281,0.9440618738299542
127,5,Naive Bayes,0,0.6,0.9208955223880597,0.9200219421552379,0.20676541328430176,0.9200219421552379
128,5,KNeighbors Classifier,1,0.6,0.9597014925373134,0.9593965807056538,2.3870413303375244,0.9593965807056538
129,5,SVC Classifier,1,0.6,0.9014925373134328,0.900000739661393,3.652161121368408,0.900000739661393
130,5,Decision Tree,1,0.6,0.735820895522388,0.7301881750812387,0.23934698104858398,0.7301881750812387
131,5,RandomForest,1,0.6,0.6850746268656717,0.6631982487276508,0.8008909225463867,0.6631982487276508
132,5,AdaBoost (Discrete),1,0.6,0.9104477611940298,0.9100241544460739,154.53715014457703,0.9100241544460739
133,5,AdaBoost (Real),1,0.6,0.8611940298507462,0.8591719580307249,170.26600217819214,0.8591719580307249
134,5,Logistic Regression (Penalty = L2),1,0.6,0.9492537313432836,0.948848464180953,1.2989706993103027,0.948848464180953
135,5,Naive Bayes,1,0.6,0.917910447761194,0.9171088643623226,0.21485042572021484,0.9171088643623226
136,5,KNeighbors Classifier,2,0.6,0.9666666666666667,0.9664579550148314,2.2918026447296143,0.9664579550148314
137,5,SVC Classifier,2,0.6,0.9287878787878788,0.9283390726116199,3.611832618713379,0.9283390726116199
138,5,Decision Tree,2,0.6,0.7606060606060606,0.759222035924884,0.21120953559875488,0.759222035924884
139,5,RandomForest,2,0.6,0.7439393939393939,0.7361700162514765,0.8710587024688721,0.7361700162514765
140,5,AdaBoost (Discrete),2,0.6,0.9303030303030303,0.9298295995082181,154.32933115959167,0.9298295995082181
141,5,AdaBoost (Real),2,0.6,0.843939393939394,0.8419832520522297,164.23525667190552,0.8419832520522297
142,5,Logistic Regression (Penalty = L2),2,0.6,0.95,0.9496616025630403,1.3975839614868164,0.9496616025630403
143,5,Naive Bayes,2,0.6,0.9409090909090909,0.9406754020557394,0.15499377250671387,0.9406754020557394
144,6,KNeighbors Classifier,0,0.6,0.9716417910447761,0.9713339224824272,3.139387607574463,0.9713339224824272
145,6,SVC Classifier,0,0.6,0.9164179104477612,0.9151720705535419,4.639444589614868,0.9151720705535419
146,6,Decision Tree,0,0.6,0.7492537313432835,0.7437251262720563,0.2312946319580078,0.7437251262720563
147,6,RandomForest,0,0.6,0.6940298507462687,0.6700449204410202,0.8145034313201904,0.6700449204410202
148,6,AdaBoost (Discrete),0,0.6,0.9373134328358209,0.9367001646621418,200.04485607147217,0.9367001646621418
149,6,AdaBoost (Real),0,0.6,0.8925373134328358,0.8913502436954306,205.5300920009613,0.8913502436954306
150,6,Logistic Regression (Penalty = L2),0,0.6,0.9402985074626866,0.9394408992311511,1.8065335750579834,0.9394408992311511
151,6,Naive Bayes,0,0.6,0.9373134328358209,0.9367667176625093,0.15099549293518066,0.9367667176625093
152,6,KNeighbors Classifier,1,0.6,0.9656716417910448,0.9653214969490717,3.304839611053467,0.9653214969490717
153,6,SVC Classifier,1,0.6,0.9223880597014925,0.9215030909760953,4.687345743179321,0.9215030909760953
154,6,Decision Tree,1,0.6,0.7611940298507462,0.7560887801726682,0.23966693878173828,0.7560887801726682
155,6,RandomForest,1,0.6,0.6343283582089553,0.5256812178561909,0.9119212627410889,0.5256812178561909
156,6,AdaBoost (Discrete),1,0.6,0.9253731343283582,0.9247878198069602,171.59755492210388,0.9247878198069602
157,6,AdaBoost (Real),1,0.6,0.5567164179104478,0.5305951495548427,193.60858011245728,0.5305951495548427
158,6,Logistic Regression (Penalty = L2),1,0.6,0.9492537313432836,0.9489914374334387,1.9654827117919922,0.9489914374334387
159,6,Naive Bayes,1,0.6,0.9298507462686567,0.9291296159944104,0.2792825698852539,0.9291296159944104
160,6,KNeighbors Classifier,2,0.6,0.9681818181818181,0.9678606572319669,3.405423879623413,0.9678606572319669
161,6,SVC Classifier,2,0.6,0.9257575757575758,0.925329026363355,4.940252304077148,0.925329026363355
162,6,Decision Tree,2,0.6,0.7727272727272727,0.7692314450390634,0.2816627025604248,0.7692314450390634
163,6,RandomForest,2,0.6,0.6757575757575758,0.6520224986570786,0.9118692874908447,0.6520224986570786
164,6,AdaBoost (Discrete),2,0.6,0.9363636363636364,0.9357995679935046,191.4634130001068,0.9357995679935046
165,6,AdaBoost (Real),2,0.6,0.8681818181818182,0.8657622976629874,207.57813215255737,0.8657622976629874
166,6,Logistic Regression (Penalty = L2),2,0.6,0.9545454545454546,0.9541844721098134,1.8488130569458008,0.9541844721098134
167,6,Naive Bayes,2,0.6,0.9378787878787879,0.9375967638718722,0.24678730964660645,0.9375967638718722
168,7,KNeighbors Classifier,0,0.6,0.9716417910447761,0.97128573047815,4.711785793304443,0.97128573047815
169,7,SVC Classifier,0,0.6,0.917910447761194,0.9170584072594093,5.789938926696777,0.9170584072594093
170,7,Decision Tree,0,0.6,0.7014925373134329,0.6936560629726665,0.2685849666595459,0.6936560629726665
171,7,RandomForest,0,0.6,0.7074626865671642,0.6885919982055192,1.0746612548828125,0.6885919982055192
172,7,AdaBoost (Discrete),0,0.6,0.9298507462686567,0.9290932973437096,273.35358357429504,0.9290932973437096
173,7,AdaBoost (Real),0,0.6,0.8746268656716418,0.8721523072169302,272.2355487346649,0.8721523072169302
174,7,Logistic Regression (Penalty = L2),0,0.6,0.9447761194029851,0.9439585904245545,2.1307435035705566,0.9439585904245545
175,7,Naive Bayes,0,0.6,0.9417910447761194,0.9412825668153109,0.2725200653076172,0.9412825668153109
176,7,KNeighbors Classifier,1,0.6,0.9567164179104478,0.9560954570792235,4.545618534088135,0.9560954570792235
177,7,SVC Classifier,1,0.6,0.9313432835820895,0.9307847347568331,6.406614303588867,0.9307847347568331
178,7,Decision Tree,1,0.6,0.6447761194029851,0.6343364302747683,0.3382089138031006,0.6343364302747683
179,7,RandomForest,1,0.6,0.7223880597014926,0.7113151300662048,0.9697883129119873,0.7113151300662048
180,7,AdaBoost (Discrete),1,0.6,0.9223880597014925,0.921874492882725,254.99931979179382,0.921874492882725
181,7,AdaBoost (Real),1,0.6,0.8791044776119403,0.8781172819510182,279.95560002326965,0.8781172819510182
182,7,Logistic Regression (Penalty = L2),1,0.6,0.9477611940298507,0.9474966611987027,2.152553081512451,0.9474966611987027
183,7,Naive Bayes,1,0.6,0.926865671641791,0.9262871812540368,0.2451169490814209,0.9262871812540368
184,7,KNeighbors Classifier,2,0.6,0.9606060606060606,0.9600671013992134,4.425859212875366,0.9600671013992134
185,7,SVC Classifier,2,0.6,0.9272727272727272,0.9262160759646477,5.591258525848389,0.9262160759646477
186,7,Decision Tree,2,0.6,0.6712121212121213,0.6642087620637337,0.17741751670837402,0.6642087620637337
187,7,RandomForest,2,0.6,0.7227272727272728,0.6804744461656722,0.9141340255737305,0.6804744461656722
188,7,AdaBoost (Discrete),2,0.6,0.9303030303030303,0.9295993294756341,242.10560846328735,0.9295993294756341
189,7,AdaBoost (Real),2,0.6,0.8651515151515151,0.8627253577338868,246.06014800071716,0.8627253577338868
190,7,Logistic Regression (Penalty = L2),2,0.6,0.9515151515151515,0.9511041213735879,2.0047895908355713,0.9511041213735879
191,7,Naive Bayes,2,0.6,0.9393939393939394,0.9389024754213215,0.24376797676086426,0.9389024754213215
192,8,KNeighbors Classifier,0,0.6,0.9746268656716418,0.9744435663769369,2.1984200477600098,0.9744435663769369
193,8,SVC Classifier,0,0.6,0.9044776119402985,0.9030304630043516,3.1487910747528076,0.9030304630043516
194,8,Decision Tree,0,0.6,0.7343283582089553,0.7260147263500272,0.15129423141479492,0.7260147263500272
195,8,RandomForest,0,0.6,0.6701492537313433,0.6424430241308609,0.6806132793426514,0.6424430241308609
196,8,AdaBoost (Discrete),0,0.6,0.9313432835820895,0.9303351044927354,130.91457390785217,0.9303351044927354
197,8,AdaBoost (Real),0,0.6,0.8925373134328358,0.8909039064525162,145.16921854019165,0.8909039064525162
198,8,Logistic Regression (Penalty = L2),0,0.6,0.9522388059701492,0.9511038089749878,1.2905371189117432,0.9511038089749878
199,8,Naive Bayes,0,0.6,0.9223880597014925,0.921467790467522,0.15256810188293457,0.921467790467522
200,8,KNeighbors Classifier,1,0.6,0.9611940298507463,0.9608382435590658,1.8130784034729004,0.9608382435590658
201,8,SVC Classifier,1,0.6,0.9029850746268657,0.901756682985609,3.0630710124969482,0.901756682985609
202,8,Decision Tree,1,0.6,0.7283582089552239,0.7203573198227531,0.22521376609802246,0.7203573198227531
203,8,RandomForest,1,0.6,0.6865671641791045,0.6720150333053121,0.8222272396087646,0.6720150333053121
204,8,AdaBoost (Discrete),1,0.6,0.9104477611940298,0.9093938157856448,128.3283338546753,0.9093938157856448
205,8,AdaBoost (Real),1,0.6,0.8567164179104477,0.8549964429316023,132.10083627700806,0.8549964429316023
206,8,Logistic Regression (Penalty = L2),1,0.6,0.9402985074626866,0.9397546058095422,1.1888551712036133,0.9397546058095422
207,8,Naive Bayes,1,0.6,0.9253731343283582,0.9245578367127146,0.14957213401794434,0.9245578367127146
208,8,KNeighbors Classifier,2,0.6,0.9681818181818181,0.9679346189636558,1.9347915649414062,0.9679346189636558
209,8,SVC Classifier,2,0.6,0.9151515151515152,0.9143876490625535,2.9289700984954834,0.9143876490625535
210,8,Decision Tree,2,0.6,0.7575757575757576,0.755572680485368,0.14963030815124512,0.755572680485368
211,8,RandomForest,2,0.6,0.7106060606060606,0.6967963137891648,0.6171369552612305,0.6967963137891648
212,8,AdaBoost (Discrete),2,0.6,0.9227272727272727,0.9221849287680164,120.0258469581604,0.9221849287680164
213,8,AdaBoost (Real),2,0.6,0.9030303030303031,0.90142556935292,132.8227379322052,0.90142556935292
214,8,Logistic Regression (Penalty = L2),2,0.6,0.953030303030303,0.9525597866440285,1.0626764297485352,0.9525597866440285
215,8,Naive Bayes,2,0.6,0.9393939393939394,0.9391233930347339,0.13201379776000977,0.9391233930347339
