,feat_set_id,classifier,fold_id,feat_th,score,geo_score,exec_t,geo_score_woz
0,0,KNeighbors Classifier,0,0.5,0.7282377919320594,0.843799386698311,8.267622947692871,0.0
1,0,SVC Classifier,0,0.5,0.6682590233545648,0.6533411319504318,14.917963743209839,0.0
2,0,Decision Tree,0,0.5,0.6836518046709129,0.8183270384253245,0.10561394691467285,0.0
3,0,RandomForest,0,0.5,0.601380042462845,0.6152713389346126,0.508765697479248,0.0
4,0,AdaBoost (Discrete),0,0.5,0.8030785562632696,0.6348020114211247,51.45725154876709,0.0
5,0,AdaBoost (Real),0,0.5,0.31475583864118895,0.36003689309827996,72.30678606033325,0.0
6,0,Logistic Regression (Penalty = L2),0,0.5,0.7361995753715499,0.873942562614331,1.514796495437622,0.0
7,0,Naive Bayes,0,0.5,0.6926751592356688,0.7637543016892311,0.38126182556152344,0.7637543016892311
8,0,KNeighbors Classifier,1,0.5,0.8256246677299309,0.5050149287220538,8.753133773803711,0.5050149287220538
9,0,SVC Classifier,1,0.5,0.7713981924508241,0.6192357015520555,16.758669137954712,0.0
10,0,Decision Tree,1,0.5,0.7612971823498139,0.27649385307351215,0.17011809349060059,0.0
11,0,RandomForest,1,0.5,0.7570441254651781,0.9830667169752293,0.6127195358276367,0.0
12,0,AdaBoost (Discrete),1,0.5,0.79585326953748,0.8174144739057183,60.23607349395752,0.0
13,0,AdaBoost (Real),1,0.5,0.7804359383306751,0.9822786963053242,100.38001561164856,0.0
14,0,Logistic Regression (Penalty = L2),1,0.5,0.7676767676767676,0.6326081619903872,1.4267089366912842,0.0
15,0,Naive Bayes,1,0.5,0.8649654439128124,0.9388998258529409,0.299701452255249,0.9388998258529409
16,0,KNeighbors Classifier,2,0.5,0.40606705694518364,0.29982960965112276,8.037431716918945,0.29982960965112276
17,0,SVC Classifier,2,0.5,0.34379989356040447,0.3181720219996804,6.415089845657349,0.0
18,0,Decision Tree,2,0.5,0.37360298030867484,0.33760707631782105,0.1029965877532959,0.0
19,0,RandomForest,2,0.5,0.30175625332623734,0.18999722543518244,0.5179522037506104,0.0
20,0,AdaBoost (Discrete),2,0.5,0.5002660989888238,0.18576951525693242,50.00249934196472,0.0
21,0,AdaBoost (Real),2,0.5,0.35178286322511976,0.359837216656336,68.51397967338562,0.0
22,0,Logistic Regression (Penalty = L2),2,0.5,0.3773283661522086,0.36900706414193424,1.121622085571289,0.0
23,0,Naive Bayes,2,0.5,0.3688131985098457,0.42035955176643675,0.2590799331665039,0.42035955176643675
24,1,KNeighbors Classifier,0,0.5,0.7399150743099787,0.8645157204128503,5.509450435638428,0.0
25,1,SVC Classifier,0,0.5,0.7361995753715499,0.873942562614331,13.082694053649902,0.0
26,1,Decision Tree,0,0.5,0.7361995753715499,0.873942562614331,0.09638690948486328,0.0
27,1,RandomForest,0,0.5,0.5721868365180467,0.647101685076666,0.5034945011138916,0.0
28,1,AdaBoost (Discrete),0,0.5,0.7462845010615711,0.8259511160563157,53.66321015357971,0.0
29,1,AdaBoost (Real),0,0.5,0.3211252653927813,0.31169803187753203,88.27963161468506,0.0
30,1,Logistic Regression (Penalty = L2),0,0.5,0.7361995753715499,0.873942562614331,1.0927281379699707,0.0
31,1,Naive Bayes,0,0.5,0.6358811040339702,0.7411988693440721,0.28925585746765137,0.7411988693440721
32,1,KNeighbors Classifier,1,0.5,0.847953216374269,0.6826568301804696,5.370682716369629,0.6826568301804696
33,1,SVC Classifier,1,0.5,0.7682083997873471,0.6177320829257733,12.522678136825562,0.0
34,1,Decision Tree,1,0.5,0.7666135034556087,0.6169761377004175,0.09259319305419922,0.0
35,1,RandomForest,1,0.5,0.7097288676236044,0.9275824198461835,0.4854269027709961,0.0
36,1,AdaBoost (Discrete),1,0.5,0.7814992025518341,0.9154061101596771,51.50018119812012,0.0
37,1,AdaBoost (Real),1,0.5,0.7804359383306751,0.9822786963053242,68.41895699501038,0.0
38,1,Logistic Regression (Penalty = L2),1,0.5,0.7671451355661882,0.6171710441021402,1.091385841369629,0.0
39,1,Naive Bayes,1,0.5,0.8543328017012227,0.9341766402374898,0.22235631942749023,0.9341766402374898
40,1,KNeighbors Classifier,2,0.5,0.41564662054284196,0.373013514899917,6.267107963562012,0.373013514899917
41,1,SVC Classifier,2,0.5,0.34379989356040447,0.3202435283244426,5.9434473514556885,0.0
42,1,Decision Tree,2,0.5,0.37360298030867484,0.33760707631782105,0.08112883567810059,0.0
43,1,RandomForest,2,0.5,0.30175625332623734,0.18999722543518244,0.48095202445983887,0.0
44,1,AdaBoost (Discrete),2,0.5,0.46886641830761044,0.37844927255967054,48.668636083602905,0.0
45,1,AdaBoost (Real),2,0.5,0.3677488025545503,0.784611766697512,61.249507427215576,0.0
46,1,Logistic Regression (Penalty = L2),2,0.5,0.37360298030867484,0.3677257586636381,0.9899756908416748,0.0
47,1,Naive Bayes,2,0.5,0.39648749334752525,0.3716162081238925,0.2613987922668457,0.3716162081238925
48,2,KNeighbors Classifier,0,0.5,0.7404458598726115,0.41402742893651,7.556064605712891,0.41402742893651
49,2,SVC Classifier,0,0.5,0.7361995753715499,0.873942562614331,12.475691795349121,0.0
50,2,Decision Tree,0,0.5,0.7340764331210191,0.8338936207588911,0.08872842788696289,0.0
51,2,RandomForest,0,0.5,0.5636942675159236,0.6103938443016036,0.3930075168609619,0.0
52,2,AdaBoost (Discrete),0,0.5,0.7622080679405521,0.8159757678859961,45.388432025909424,0.0
53,2,AdaBoost (Real),0,0.5,0.8131634819532909,0.9524598994728345,57.93593668937683,0.0
54,2,Logistic Regression (Penalty = L2),0,0.5,0.725583864118896,0.8696687999546263,0.8849527835845947,0.0
55,2,Naive Bayes,0,0.5,0.6459660297239915,0.745459686755211,0.21111583709716797,0.745459686755211
56,2,KNeighbors Classifier,1,0.5,0.7894736842105263,0.4141890956436416,7.301928758621216,0.4141890956436416
57,2,SVC Classifier,1,0.5,0.7719298245614035,0.7264394546979129,13.031010866165161,0.0
58,2,Decision Tree,1,0.5,0.7602339181286549,0.6215877680766513,0.08278512954711914,0.0
59,2,RandomForest,1,0.5,0.6241360978203083,0.7688586275424006,0.5227432250976562,0.0
60,2,AdaBoost (Discrete),1,0.5,0.7804359383306751,0.8749542407672597,43.50882577896118,0.0
61,2,AdaBoost (Real),1,0.5,0.6379585326953748,0.7797542635274467,59.89807343482971,0.0
62,2,Logistic Regression (Penalty = L2),1,0.5,0.7676767676767676,0.617423414240383,1.0098011493682861,0.0
63,2,Naive Bayes,1,0.5,0.5433280170122275,0.6379052274285133,0.19310665130615234,0.6379052274285133
64,2,KNeighbors Classifier,2,0.5,0.407131452900479,0.307546112312805,13.515143871307373,0.307546112312805
65,2,SVC Classifier,2,0.5,0.33315593400745075,0.2923702024976963,5.499830722808838,0.0
66,2,Decision Tree,2,0.5,0.38690792974986693,0.4275082335476885,0.11062145233154297,0.0
67,2,RandomForest,2,0.5,0.30175625332623734,0.18999722543518244,0.5093045234680176,0.0
68,2,AdaBoost (Discrete),2,0.5,0.4800425758382118,0.2823780446025381,41.79413723945618,0.2823780446025381
69,2,AdaBoost (Real),2,0.5,0.3704097924427887,0.3140794461926423,55.63107371330261,0.0
70,2,Logistic Regression (Penalty = L2),2,0.5,0.37360298030867484,0.3677257586636381,0.8720951080322266,0.0
71,2,Naive Bayes,2,0.5,0.35178286322511976,0.38105628762870036,0.17318177223205566,0.38105628762870036
72,3,KNeighbors Classifier,0,0.5,0.7526539278131635,0.6499783553160058,4.9421751499176025,0.6499783553160058
73,3,SVC Classifier,0,0.5,0.6900212314225053,0.8198225555837182,10.95597505569458,0.0
74,3,Decision Tree,0,0.5,0.7361995753715499,0.873942562614331,0.08898544311523438,0.0
75,3,RandomForest,0,0.5,0.5636942675159236,0.6103938443016036,0.348583459854126,0.0
76,3,AdaBoost (Discrete),0,0.5,0.7462845010615711,0.8259511160563157,40.55481505393982,0.0
77,3,AdaBoost (Real),0,0.5,0.4867303609341826,0.522009535604561,47.985907554626465,0.0
78,3,Logistic Regression (Penalty = L2),0,0.5,0.7367303609341825,0.8741540685835897,0.8238117694854736,0.0
79,3,Naive Bayes,0,0.5,0.6942675159235668,0.7643406783604408,0.1720561981201172,0.7643406783604408
80,3,KNeighbors Classifier,1,0.5,0.8607123870281765,0.7506511267883297,3.5772924423217773,0.7506511267883297
81,3,SVC Classifier,1,0.5,0.7713981924508241,0.6192357015520555,9.13514494895935,0.0
82,3,Decision Tree,1,0.5,0.7660818713450293,0.6166653730147104,0.0629415512084961,0.0
83,3,RandomForest,1,0.5,0.7113237639553429,0.9295263599871446,0.29723596572875977,0.0
84,3,AdaBoost (Discrete),1,0.5,0.8830409356725146,0.9520825388326535,32.54902529716492,0.0
85,3,AdaBoost (Real),1,0.5,0.5013290802764487,0.5274928382467838,45.17873167991638,0.0
86,3,Logistic Regression (Penalty = L2),1,0.5,0.7666135034556087,0.6169761377004175,0.7758579254150391,0.0
87,3,Naive Bayes,1,0.5,0.5608718766613503,0.6825032193050203,0.21019816398620605,0.6825032193050203
88,3,KNeighbors Classifier,2,0.5,0.4332091538052155,0.41332950545252906,3.3270113468170166,0.41332950545252906
89,3,SVC Classifier,2,0.5,0.3602980308674827,0.3466206166444903,3.653428554534912,0.0
90,3,Decision Tree,2,0.5,0.36934539648749337,0.3340941445866145,0.06328511238098145,0.0
91,3,RandomForest,2,0.5,0.25651942522618415,0.17572534841377752,0.32398557662963867,0.0
92,3,AdaBoost (Discrete),2,0.5,0.4768493879723257,0.4176845657456852,29.470879554748535,0.4176845657456852
93,3,AdaBoost (Real),2,0.5,0.37945715806279934,0.778124303139243,42.242696046829224,0.0
94,3,Logistic Regression (Penalty = L2),2,0.5,0.3778605641298563,0.36918866219451113,0.6413042545318604,0.0
95,3,Naive Bayes,2,0.5,0.3853113358169239,0.36812126162206504,0.19454336166381836,0.36812126162206504
96,4,KNeighbors Classifier,0,0.5,0.7473460721868365,0.8263507055592668,1.7076177597045898,0.0
97,4,SVC Classifier,0,0.5,0.6682590233545648,0.6533411319504318,5.827617645263672,0.0
98,4,Decision Tree,0,0.5,0.7361995753715499,0.873942562614331,0.02884507179260254,0.0
99,4,RandomForest,0,0.5,0.5636942675159236,0.6103938443016036,0.22383403778076172,0.0
100,4,AdaBoost (Discrete),0,0.5,0.7860934182590233,0.794873681817948,21.13103151321411,0.794873681817948
101,4,AdaBoost (Real),0,0.5,0.31475583864118895,0.36003689309827996,34.51527786254883,0.0
102,4,Logistic Regression (Penalty = L2),0,0.5,0.7361995753715499,0.873942562614331,0.598949670791626,0.0
103,4,Naive Bayes,0,0.5,0.6926751592356688,0.7637543016892311,0.13660049438476562,0.7637543016892311
104,4,KNeighbors Classifier,1,0.5,0.8644338118022329,0.6405274641450024,1.5170884132385254,0.6405274641450024
105,4,SVC Classifier,1,0.5,0.7713981924508241,0.6192357015520555,4.9773948192596436,0.0
106,4,Decision Tree,1,0.5,0.7666135034556087,0.6169761377004175,0.05510377883911133,0.0
107,4,RandomForest,1,0.5,0.7501329080276449,0.9756358042955093,0.2846653461456299,0.0
108,4,AdaBoost (Discrete),1,0.5,0.8155236576289208,0.7540894433855833,22.467904806137085,0.0
109,4,AdaBoost (Real),1,0.5,0.7804359383306751,0.9822786963053242,33.56433653831482,0.0
110,4,Logistic Regression (Penalty = L2),1,0.5,0.7666135034556087,0.6169761377004175,0.6070377826690674,0.0
111,4,Naive Bayes,1,0.5,0.8649654439128124,0.9388998258529409,0.09787273406982422,0.9388998258529409
112,4,KNeighbors Classifier,2,0.5,0.4103246407663651,0.403459531221613,2.0055718421936035,0.403459531221613
113,4,SVC Classifier,2,0.5,0.34379989356040447,0.3181720219996804,2.411874294281006,0.0
114,4,Decision Tree,2,0.5,0.41192123469930814,0.500228416923857,0.028655529022216797,0.0
115,4,RandomForest,2,0.5,0.2825971261309207,0.18422154731498122,0.2935483455657959,0.0
116,4,AdaBoost (Discrete),2,0.5,0.5087812666311868,0.34082240969799854,22.366179943084717,0.34082240969799854
117,4,AdaBoost (Real),2,0.5,0.30282064928153274,0.7236686447641765,30.354203939437866,0.0
118,4,Logistic Regression (Penalty = L2),2,0.5,0.3778605641298563,0.36918866219451113,0.4542069435119629,0.0
119,4,Naive Bayes,2,0.5,0.35923363491218735,0.35764599670371544,0.10019087791442871,0.35764599670371544
120,5,KNeighbors Classifier,0,0.5,0.7340764331210191,0.8619145004896768,3.014784097671509,0.0
121,5,SVC Classifier,0,0.5,0.7123142250530785,0.8476762126256773,4.652804851531982,0.0
122,5,Decision Tree,0,0.5,0.7292993630573248,0.8604763952293212,0.029078006744384766,0.0
123,5,RandomForest,0,0.5,0.5711252653927813,0.6286185570937122,0.27788209915161133,0.0
124,5,AdaBoost (Discrete),0,0.5,0.7829087048832272,0.7714159604574,22.837215423583984,0.0
125,5,AdaBoost (Real),0,0.5,0.6990445859872612,0.6138689930331905,31.039817094802856,0.0
126,5,Logistic Regression (Penalty = L2),0,0.5,0.7367303609341825,0.8741540685835897,0.451277494430542,0.0
127,5,Naive Bayes,0,0.5,0.3237791932059448,0.7372742092824321,0.11952900886535645,0.0
128,5,KNeighbors Classifier,1,0.5,0.84688995215311,0.6537497609932867,2.7528488636016846,0.6537497609932867
129,5,SVC Classifier,1,0.5,0.7751196172248804,0.801363715484218,4.5477001667022705,0.0
130,5,Decision Tree,1,0.5,0.7650186071238703,0.29286888107891146,0.04589486122131348,0.0
131,5,RandomForest,1,0.5,0.7501329080276449,0.9756358042955093,0.24040484428405762,0.0
132,5,AdaBoost (Discrete),1,0.5,0.8724082934609251,0.6711077899374213,18.90817904472351,0.6711077899374213
133,5,AdaBoost (Real),1,0.5,0.6241360978203083,0.6525718998989275,29.946998119354248,0.0
134,5,Logistic Regression (Penalty = L2),1,0.5,0.7666135034556087,0.6169761377004175,0.5813174247741699,0.0
135,5,Naive Bayes,1,0.5,0.5135566188197768,0.4657635573911303,0.1286911964416504,0.4657635573911303
136,5,KNeighbors Classifier,2,0.5,0.49228312932410856,0.4572783038661777,4.447932720184326,0.4572783038661777
137,5,SVC Classifier,2,0.5,0.31293241085683876,0.2877798912828133,2.187826156616211,0.0
138,5,Decision Tree,2,0.5,0.37360298030867484,0.33542325328309514,0.05409955978393555,0.0
139,5,RandomForest,2,0.5,0.30175625332623734,0.18999722543518244,0.22615766525268555,0.0
140,5,AdaBoost (Discrete),2,0.5,0.41298563065460353,0.31319527342210374,20.408571004867554,0.31319527342210374
141,5,AdaBoost (Real),2,0.5,0.35178286322511976,0.359837216656336,30.53826904296875,0.0
142,5,Logistic Regression (Penalty = L2),2,0.5,0.37679616817456096,0.3688251079074025,0.4694695472717285,0.0
143,5,Naive Bayes,2,0.5,0.33102714209686,0.4030860359690139,0.08101725578308105,0.4030860359690139
144,6,KNeighbors Classifier,0,0.5,0.7478768577494692,0.8265502108228788,1.3315911293029785,0.0
145,6,SVC Classifier,0,0.5,0.6459660297239915,0.6318731002306498,3.5348634719848633,0.0
146,6,Decision Tree,0,0.5,0.7361995753715499,0.873942562614331,0.04760026931762695,0.0
147,6,RandomForest,0,0.5,0.5636942675159236,0.6103938443016036,0.214385986328125,0.0
148,6,AdaBoost (Discrete),0,0.5,0.7860934182590233,0.794873681817948,17.884525299072266,0.794873681817948
149,6,AdaBoost (Real),0,0.5,0.3529723991507431,0.5774222958992498,28.48755717277527,0.0
150,6,Logistic Regression (Penalty = L2),0,0.5,0.7361995753715499,0.873942562614331,0.48235249519348145,0.0
151,6,Naive Bayes,0,0.5,0.6926751592356688,0.7637543016892311,0.11255097389221191,0.7637543016892311
152,6,KNeighbors Classifier,1,0.5,0.8304093567251462,0.6824151329529381,1.2961583137512207,0.0
153,6,SVC Classifier,1,0.5,0.7713981924508241,0.6192357015520555,3.8267979621887207,0.0
154,6,Decision Tree,1,0.5,0.7666135034556087,0.6169761377004175,0.025244951248168945,0.0
155,6,RandomForest,1,0.5,0.7698032961190856,0.9975777114203086,0.19263434410095215,0.0
156,6,AdaBoost (Discrete),1,0.5,0.8128654970760234,0.9722535080042236,18.18852996826172,0.0
157,6,AdaBoost (Real),1,0.5,0.5013290802764487,0.5274928382467838,27.80182671546936,0.0
158,6,Logistic Regression (Penalty = L2),1,0.5,0.7666135034556087,0.6169761377004175,0.5504806041717529,0.0
159,6,Naive Bayes,1,0.5,0.8649654439128124,0.9388998258529409,0.1269056797027588,0.9388998258529409
160,6,KNeighbors Classifier,2,0.5,0.4103246407663651,0.403459531221613,1.349564552307129,0.403459531221613
161,6,SVC Classifier,2,0.5,0.3602980308674827,0.3466206166444903,1.5249547958374023,0.0
162,6,Decision Tree,2,0.5,0.37360298030867484,0.33542325328309514,0.026215553283691406,0.0
163,6,RandomForest,2,0.5,0.30175625332623734,0.18999722543518244,0.16907691955566406,0.0
164,6,AdaBoost (Discrete),2,0.5,0.3778605641298563,0.36918866219451113,17.139276027679443,0.0
165,6,AdaBoost (Real),2,0.5,0.3874401277275146,0.34884859604691365,26.02787184715271,0.34884859604691365
166,6,Logistic Regression (Penalty = L2),2,0.5,0.3778605641298563,0.36918866219451113,0.44092464447021484,0.0
167,6,Naive Bayes,2,0.5,0.3634912187333688,0.38740571686295766,0.12548303604125977,0.38740571686295766
168,7,KNeighbors Classifier,0,0.5,0.7420382165605095,0.5559156790267524,1.5574982166290283,0.5559156790267524
169,7,SVC Classifier,0,0.5,0.7361995753715499,0.873942562614331,4.050626993179321,0.0
170,7,Decision Tree,0,0.5,0.7107218683651805,0.8635406788959284,0.04553556442260742,0.0
171,7,RandomForest,0,0.5,0.5631634819532909,0.6100264690987172,0.19554591178894043,0.0
172,7,AdaBoost (Discrete),0,0.5,0.7425690021231423,0.8559941753812627,18.06793737411499,0.0
173,7,AdaBoost (Real),0,0.5,0.7361995753715499,0.873942562614331,26.24588966369629,0.0
174,7,Logistic Regression (Penalty = L2),0,0.5,0.7361995753715499,0.873942562614331,0.43086957931518555,0.0
175,7,Naive Bayes,0,0.5,0.6454352441613588,0.7452384492189924,0.12130260467529297,0.7452384492189924
176,7,KNeighbors Classifier,1,0.5,0.8474215842636895,0.723822511997546,1.5725288391113281,0.723822511997546
177,7,SVC Classifier,1,0.5,0.7713981924508241,0.6192357015520555,4.765852928161621,0.0
178,7,Decision Tree,1,0.5,0.7666135034556087,0.6169761377004175,0.02244091033935547,0.0
179,7,RandomForest,1,0.5,0.7113237639553429,0.916400987009446,0.2173469066619873,0.0
180,7,AdaBoost (Discrete),1,0.5,0.8330675172780436,0.5588786382127608,18.549850940704346,0.5588786382127608
181,7,AdaBoost (Real),1,0.5,0.7729930887825625,0.6423522612231066,26.574923992156982,0.0
182,7,Logistic Regression (Penalty = L2),1,0.5,0.7671451355661882,0.6171710441021402,0.4232668876647949,0.0
183,7,Naive Bayes,1,0.5,0.5374800637958532,0.6188127976150575,0.09630632400512695,0.6188127976150575
184,7,KNeighbors Classifier,2,0.5,0.408728046833422,0.32521705358149655,1.5900187492370605,0.32521705358149655
185,7,SVC Classifier,2,0.5,0.31293241085683876,0.2877798912828133,1.9695756435394287,0.0
186,7,Decision Tree,2,0.5,0.3927621075039915,0.3411575840699446,0.03061985969543457,0.0
187,7,RandomForest,2,0.5,0.30175625332623734,0.18999722543518244,0.19130873680114746,0.0
188,7,AdaBoost (Discrete),2,0.5,0.3938265034592869,0.331968898322019,17.87220788002014,0.0
189,7,AdaBoost (Real),2,0.5,0.41564662054284196,0.22898736229276112,25.90653133392334,0.0
190,7,Logistic Regression (Penalty = L2),2,0.5,0.37360298030867484,0.3677257586636381,0.3872339725494385,0.0
191,7,Naive Bayes,2,0.5,0.34167110164981374,0.35259916889140624,0.08059430122375488,0.35259916889140624
192,8,KNeighbors Classifier,0,0.5,0.7404458598726115,0.864724439828877,1.5985877513885498,0.0
193,8,SVC Classifier,0,0.5,0.6900212314225053,0.8198225555837182,5.206179141998291,0.0
194,8,Decision Tree,0,0.5,0.7107218683651805,0.8635406788959284,0.03891730308532715,0.0
195,8,RandomForest,0,0.5,0.5981953290870489,0.6909553927994988,0.21544504165649414,0.0
196,8,AdaBoost (Discrete),0,0.5,0.7388535031847133,0.8749980518783079,20.69983148574829,0.0
197,8,AdaBoost (Real),0,0.5,0.4867303609341826,0.522009535604561,28.845723390579224,0.0
198,8,Logistic Regression (Penalty = L2),0,0.5,0.7361995753715499,0.873942562614331,0.5277810096740723,0.0
199,8,Naive Bayes,0,0.5,0.6942675159235668,0.7643406783604408,0.15746665000915527,0.7643406783604408
200,8,KNeighbors Classifier,1,0.5,0.8851674641148325,0.8092042567214232,1.8230841159820557,0.8092042567214232
201,8,SVC Classifier,1,0.5,0.7713981924508241,0.6192357015520555,5.411026954650879,0.0
202,8,Decision Tree,1,0.5,0.7666135034556087,0.6169761377004175,0.05034184455871582,0.0
203,8,RandomForest,1,0.5,0.7698032961190856,0.9975777114203086,0.23919272422790527,0.0
204,8,AdaBoost (Discrete),1,0.5,0.8011695906432749,0.9255152611699503,20.796744108200073,0.0
205,8,AdaBoost (Real),1,0.5,0.5013290802764487,0.5274928382467838,29.007099390029907,0.0
206,8,Logistic Regression (Penalty = L2),1,0.5,0.7666135034556087,0.6169761377004175,0.50797438621521,0.0
207,8,Naive Bayes,1,0.5,0.5608718766613503,0.6825032193050203,0.09665131568908691,0.6825032193050203
208,8,KNeighbors Classifier,2,0.5,0.44385311335816924,0.3872239415710007,1.8883118629455566,0.3872239415710007
209,8,SVC Classifier,2,0.5,0.34379989356040447,0.3202435283244426,2.2365877628326416,0.0
210,8,Decision Tree,2,0.5,0.36934539648749337,0.3340941445866145,0.049790143966674805,0.0
211,8,RandomForest,2,0.5,0.30175625332623734,0.18999722543518244,0.21838974952697754,0.0
212,8,AdaBoost (Discrete),2,0.5,0.36934539648749337,0.3340941445866145,19.711450338363647,0.0
213,8,AdaBoost (Real),2,0.5,0.3677488025545503,0.784611766697512,27.65250277519226,0.0
214,8,Logistic Regression (Penalty = L2),2,0.5,0.37360298030867484,0.3677257586636381,0.3847777843475342,0.0
215,8,Naive Bayes,2,0.5,0.3853113358169239,0.36812126162206504,0.11011099815368652,0.36812126162206504
216,9,KNeighbors Classifier,0,0.5,0.7261146496815286,0.8617503709251471,1.526460886001587,0.0
217,9,SVC Classifier,0,0.5,0.6900212314225053,0.8198225555837182,3.615300416946411,0.0
218,9,Decision Tree,0,0.5,0.7107218683651805,0.8635406788959284,0.021971464157104492,0.0
219,9,RandomForest,0,0.5,0.5790870488322718,0.6475761258027333,0.18378758430480957,0.0
220,9,AdaBoost (Discrete),0,0.5,0.7977707006369427,0.7108011336975973,17.70220136642456,0.0
221,9,AdaBoost (Real),0,0.5,0.8099787685774947,0.9712255062516554,24.71383500099182,0.0
222,9,Logistic Regression (Penalty = L2),0,0.5,0.7361995753715499,0.873942562614331,0.3925604820251465,0.0
223,9,Naive Bayes,0,0.5,0.6454352441613588,0.7452384492189924,0.10749530792236328,0.7452384492189924
224,9,KNeighbors Classifier,1,0.5,0.8442317916002127,0.7154513384759041,1.5774812698364258,0.7154513384759041
225,9,SVC Classifier,1,0.5,0.7814992025518341,0.9154061101596771,3.5637900829315186,0.0
226,9,Decision Tree,1,0.5,0.7666135034556087,0.6169761377004175,0.04642176628112793,0.0
227,9,RandomForest,1,0.5,0.7698032961190856,0.9975777114203086,0.23796939849853516,0.0
228,9,AdaBoost (Discrete),1,0.5,0.8755980861244019,0.9276823780642302,16.221975564956665,0.0
229,9,AdaBoost (Real),1,0.5,0.7612971823498139,0.9836905212116516,23.505544424057007,0.0
230,9,Logistic Regression (Penalty = L2),1,0.5,0.7666135034556087,0.6169761377004175,0.47400331497192383,0.0
231,9,Naive Bayes,1,0.5,0.5374800637958532,0.6188127976150575,0.09886741638183594,0.6188127976150575
232,9,KNeighbors Classifier,2,0.5,0.45077168706758913,0.35153011731982897,2.234795331954956,0.35153011731982897
233,9,SVC Classifier,2,0.5,0.31293241085683876,0.2877798912828133,1.815685510635376,0.0
234,9,Decision Tree,2,0.5,0.37360298030867484,0.33542325328309514,0.04669785499572754,0.0
235,9,RandomForest,2,0.5,0.30175625332623734,0.18999722543518244,0.19295883178710938,0.0
236,9,AdaBoost (Discrete),2,0.5,0.3932943054816392,0.3689338363410661,15.368876695632935,0.0
237,9,AdaBoost (Real),2,0.5,0.36934539648749337,0.3340941445866145,25.927375316619873,0.0
238,9,Logistic Regression (Penalty = L2),2,0.5,0.37360298030867484,0.3677257586636381,0.4314544200897217,0.0
239,9,Naive Bayes,2,0.5,0.34167110164981374,0.35259916889140624,0.10579538345336914,0.35259916889140624
240,10,KNeighbors Classifier,0,0.5,0.7399150743099787,0.8587465086497241,3.6011462211608887,0.0
241,10,SVC Classifier,0,0.5,0.7361995753715499,0.873942562614331,6.276510953903198,0.0
242,10,Decision Tree,0,0.5,0.6751592356687898,0.8198287274658244,0.03833794593811035,0.0
243,10,RandomForest,0,0.5,0.5859872611464968,0.666801061722294,0.13264060020446777,0.0
244,10,AdaBoost (Discrete),0,0.5,0.7170912951167728,0.8397220682362341,22.506237745285034,0.0
245,10,AdaBoost (Real),0,0.5,0.3619957537154989,0.35011387244385067,31.007060527801514,0.35011387244385067
246,10,Logistic Regression (Penalty = L2),0,0.5,0.7367303609341825,0.8741540685835897,0.5719656944274902,0.0
247,10,Naive Bayes,0,0.5,0.6942675159235668,0.7643406783604408,0.1693732738494873,0.7643406783604408
248,10,KNeighbors Classifier,1,0.5,0.822434875066454,0.5555623973742193,3.1089327335357666,0.5555623973742193
249,10,SVC Classifier,1,0.5,0.7682083997873471,0.6177320829257733,6.132525682449341,0.0
250,10,Decision Tree,1,0.5,0.7639553429027113,0.6513245712168793,0.04121255874633789,0.0
251,10,RandomForest,1,0.5,0.7698032961190856,0.9975777114203086,0.20003032684326172,0.0
252,10,AdaBoost (Discrete),1,0.5,0.7894736842105263,0.8909509655268488,23.39820647239685,0.0
253,10,AdaBoost (Real),1,0.5,0.7804359383306751,0.9822786963053242,29.836792707443237,0.0
254,10,Logistic Regression (Penalty = L2),1,0.5,0.7682083997873471,0.6253918159827379,0.5696046352386475,0.0
255,10,Naive Bayes,1,0.5,0.5608718766613503,0.6825032193050203,0.1350705623626709,0.6825032193050203
256,10,KNeighbors Classifier,2,0.5,0.417243214475785,0.36844127223552886,3.010544776916504,0.36844127223552886
257,10,SVC Classifier,2,0.5,0.359765832889835,0.3473185520710378,2.644183397293091,0.0
258,10,Decision Tree,2,0.5,0.37360298030867484,0.33542325328309514,0.03995800018310547,0.0
259,10,RandomForest,2,0.5,0.2937732836615221,0.18763383057393795,0.1784818172454834,0.0
260,10,AdaBoost (Discrete),2,0.5,0.466205428419372,0.24961130415340152,20.133954286575317,0.0
261,10,AdaBoost (Real),2,0.5,0.3677488025545503,0.784611766697512,29.267319679260254,0.0
262,10,Logistic Regression (Penalty = L2),2,0.5,0.37360298030867484,0.3677257586636381,0.5001785755157471,0.0
263,10,Naive Bayes,2,0.5,0.3938265034592869,0.43093965918782556,0.12853550910949707,0.43093965918782556
264,11,KNeighbors Classifier,0,0.5,0.7367303609341825,0.41240965442646954,5.242428541183472,0.41240965442646954
265,11,SVC Classifier,0,0.5,0.7160297239915074,0.7937149983329698,7.810581922531128,0.0
266,11,Decision Tree,0,0.5,0.6963906581740976,0.7909188167921237,0.05963706970214844,0.0
267,11,RandomForest,0,0.5,0.6061571125265393,0.6725037864108112,0.1748824119567871,0.0
268,11,AdaBoost (Discrete),0,0.5,0.7563694267515924,0.8101143973426487,25.302018642425537,0.0
269,11,AdaBoost (Real),0,0.5,0.3211252653927813,0.31169803187753203,32.41360807418823,0.0
270,11,Logistic Regression (Penalty = L2),0,0.5,0.7367303609341825,0.8741540685835897,0.5393552780151367,0.0
271,11,Naive Bayes,0,0.5,0.6459660297239915,0.745459686755211,0.1654658317565918,0.745459686755211
272,11,KNeighbors Classifier,1,0.5,0.7783094098883573,0.3933240023708121,5.492232799530029,0.3933240023708121
273,11,SVC Classifier,1,0.5,0.7682083997873471,0.6177320829257733,9.156414985656738,0.0
274,11,Decision Tree,1,0.5,0.7549175970228602,0.6333586976408757,0.08844375610351562,0.0
275,11,RandomForest,1,0.5,0.7698032961190856,0.9975777114203086,0.259171724319458,0.0
276,11,AdaBoost (Discrete),1,0.5,0.7814992025518341,0.9154061101596771,27.26249623298645,0.0
277,11,AdaBoost (Real),1,0.5,0.7804359383306751,0.9822786963053242,34.21525812149048,0.0
278,11,Logistic Regression (Penalty = L2),1,0.5,0.7682083997873471,0.639948415612862,0.5725650787353516,0.0
279,11,Naive Bayes,1,0.5,0.8543328017012227,0.9341766402374898,0.16077280044555664,0.9341766402374898
280,11,KNeighbors Classifier,2,0.5,0.3863757317722193,0.2619627551093192,4.905407667160034,0.2619627551093192
281,11,SVC Classifier,2,0.5,0.35816923895689196,0.347081223977999,4.204437255859375,0.0
282,11,Decision Tree,2,0.5,0.41192123469930814,0.45405260024111926,0.056359052658081055,0.0
283,11,RandomForest,2,0.5,0.30175625332623734,0.18999722543518244,0.2370891571044922,0.0
284,11,AdaBoost (Discrete),2,0.5,0.4773815859499734,0.2896867485631999,25.215922832489014,0.2896867485631999
285,11,AdaBoost (Real),2,0.5,0.3677488025545503,0.784611766697512,31.579265832901,0.0
286,11,Logistic Regression (Penalty = L2),2,0.5,0.37360298030867484,0.3677257586636381,0.4629635810852051,0.0
287,11,Naive Bayes,2,0.5,0.39861628525811604,0.39795049660148546,0.1791832447052002,0.39795049660148546
288,12,KNeighbors Classifier,0,0.5,0.6900212314225053,0.8198225555837182,1.1477055549621582,0.0
289,12,SVC Classifier,0,0.5,0.6900212314225053,0.8198225555837182,2.472398519515991,0.0
290,12,Decision Tree,0,0.5,0.6900212314225053,0.8198225555837182,0.02876448631286621,0.0
291,12,RandomForest,0,0.5,0.5966029723991507,0.6897070532201875,0.1581273078918457,0.0
292,12,AdaBoost (Discrete),0,0.5,0.6900212314225053,0.8198225555837182,12.257911682128906,0.0
293,12,AdaBoost (Real),0,0.5,0.6900212314225053,0.8198225555837182,18.035865783691406,0.0
294,12,Logistic Regression (Penalty = L2),0,0.5,0.6900212314225053,0.8198225555837182,0.3210909366607666,0.0
295,12,Naive Bayes,0,0.5,0.304140127388535,0.3217317495280602,0.06280684471130371,0.3217317495280602
296,12,KNeighbors Classifier,1,0.5,0.8718766613503456,0.7708178196756085,1.0157623291015625,0.7708178196756085
297,12,SVC Classifier,1,0.5,0.7814992025518341,0.9154061101596771,2.3767216205596924,0.0
298,12,Decision Tree,1,0.5,0.7713981924508241,0.6192357015520555,0.005293846130371094,0.0
299,12,RandomForest,1,0.5,0.7586390217969166,0.9854537703890565,0.1958320140838623,0.0
300,12,AdaBoost (Discrete),1,0.5,0.7830940988835726,0.6223193757197221,12.015929937362671,0.0
301,12,AdaBoost (Real),1,0.5,0.7825624667729931,0.8384000527113549,19.158568859100342,0.0
302,12,Logistic Regression (Penalty = L2),1,0.5,0.7713981924508241,0.6192357015520555,0.34824323654174805,0.0
303,12,Naive Bayes,1,0.5,0.5374800637958532,0.6188127976150575,0.055551767349243164,0.6188127976150575
304,12,KNeighbors Classifier,2,0.5,0.5231506120276743,0.3609175022604071,1.2883834838867188,0.0
305,12,SVC Classifier,2,0.5,0.31293241085683876,0.2877798912828133,1.018965244293213,0.0
306,12,Decision Tree,2,0.5,0.37360298030867484,0.33542325328309514,0.02954721450805664,0.0
307,12,RandomForest,2,0.5,0.30175625332623734,0.18999722543518244,0.156646728515625,0.0
308,12,AdaBoost (Discrete),2,0.5,0.5002660989888238,0.320159848527593,11.493781328201294,0.0
309,12,AdaBoost (Real),2,0.5,0.37360298030867484,0.33542325328309514,17.327853202819824,0.0
310,12,Logistic Regression (Penalty = L2),2,0.5,0.37360298030867484,0.3677257586636381,0.2071397304534912,0.0
311,12,Naive Bayes,2,0.5,0.32570516232038316,0.3714863479747674,0.07562613487243652,0.3714863479747674
