,feat_set_id,classifier,fold_id,feat_th,score,geo_score,exec_t,geo_score_woz
0,0,KNeighbors Classifier,0,0.8,0.8666666666666667,0.8310340479364138,0.31544017791748047,0.8310340479364138
1,0,SVC Classifier,0,0.8,0.8083333333333333,1.0,0.2980611324310303,0.0
2,0,Decision Tree,0,0.8,0.8416666666666667,0.7373535017218309,0.07391738891601562,0.7373535017218309
3,0,RandomForest,0,0.8,0.8083333333333333,0.9004489606971755,0.5346286296844482,0.0
4,0,AdaBoost (Discrete),0,0.8,0.8166666666666667,0.7406381167867305,34.90206217765808,0.7406381167867305
5,0,AdaBoost (Real),0,0.8,0.8,0.8532982640620798,42.90250205993652,0.0
6,0,Logistic Regression (Penalty = L2),0,0.8,0.975,0.9696654978825953,0.2639460563659668,0.9696654978825953
7,0,Naive Bayes,0,0.8,0.8333333333333334,0.8176986041493832,0.1787574291229248,0.8176986041493832
8,0,KNeighbors Classifier,1,0.8,0.8666666666666667,0.8378193130017028,0.2973906993865967,0.8378193130017028
9,0,SVC Classifier,1,0.8,0.8083333333333333,1.0,0.2519114017486572,0.0
10,0,Decision Tree,1,0.8,0.775,0.7877851446607594,0.08195018768310547,0.7877851446607594
11,0,RandomForest,1,0.8,0.775,0.7759227869576798,0.42156291007995605,0.0
12,0,AdaBoost (Discrete),1,0.8,0.325,1.0,36.62929606437683,0.0
13,0,AdaBoost (Real),1,0.8,0.8333333333333334,0.9748970527428702,46.76031947135925,0.0
14,0,Logistic Regression (Penalty = L2),1,0.8,0.9583333333333334,0.9491706774639023,0.32637834548950195,0.9491706774639023
15,0,Naive Bayes,1,0.8,0.8083333333333333,0.7605089548266607,0.1866004467010498,0.7605089548266607
16,0,KNeighbors Classifier,2,0.8,0.9067796610169492,0.8686779277152785,0.2614777088165283,0.8686779277152785
17,0,SVC Classifier,2,0.8,0.8135593220338984,1.0,0.38073158264160156,0.0
18,0,Decision Tree,2,0.8,0.8898305084745762,0.8676217797818901,0.0944678783416748,0.8676217797818901
19,0,RandomForest,2,0.8,0.8559322033898306,0.9641925040026272,0.5775816440582275,0.0
20,0,AdaBoost (Discrete),2,0.8,0.923728813559322,0.7922561070581773,42.7899444103241,0.7922561070581773
21,0,AdaBoost (Real),2,0.8,0.9661016949152542,0.9370735665844807,44.60069918632507,0.9370735665844807
22,0,Logistic Regression (Penalty = L2),2,0.8,0.9661016949152542,0.9609668960083467,0.29485154151916504,0.9609668960083467
23,0,Naive Bayes,2,0.8,0.7966101694915254,0.7248326527536443,0.1009223461151123,0.7248326527536443
24,1,KNeighbors Classifier,0,0.8,0.85,0.828889402229203,0.39283227920532227,0.828889402229203
25,1,SVC Classifier,0,0.8,0.8083333333333333,1.0,0.2572448253631592,0.0
26,1,Decision Tree,0,0.8,0.8833333333333333,0.7545828806592996,0.0021288394927978516,0.7545828806592996
27,1,RandomForest,0,0.8,0.8,0.6754800192603067,0.7694575786590576,0.0
28,1,AdaBoost (Discrete),0,0.8,0.8416666666666667,0.7627433009661261,40.119080543518066,0.7627433009661261
29,1,AdaBoost (Real),0,0.8,0.7583333333333333,0.8250249569034103,52.14277720451355,0.0
30,1,Logistic Regression (Penalty = L2),0,0.8,0.975,0.9696654978825953,0.3113112449645996,0.9696654978825953
31,1,Naive Bayes,0,0.8,0.8083333333333333,0.7827132714950777,0.21802663803100586,0.7827132714950777
32,1,KNeighbors Classifier,1,0.8,0.9083333333333333,0.8858989910127633,0.4776573181152344,0.8858989910127633
33,1,SVC Classifier,1,0.8,0.8083333333333333,1.0,0.3600947856903076,0.0
34,1,Decision Tree,1,0.8,0.8333333333333334,0.8153522102607347,0.11845183372497559,0.8153522102607347
35,1,RandomForest,1,0.8,0.675,1.0,0.8435637950897217,0.0
36,1,AdaBoost (Discrete),1,0.8,0.325,1.0,50.16688084602356,0.0
37,1,AdaBoost (Real),1,0.8,0.8333333333333334,0.9748970527428702,59.12160778045654,0.0
38,1,Logistic Regression (Penalty = L2),1,0.8,0.9583333333333334,0.9533988533647133,0.34177660942077637,0.9533988533647133
39,1,Naive Bayes,1,0.8,0.775,0.6940519131061853,0.10485577583312988,0.6940519131061853
40,1,KNeighbors Classifier,2,0.8,0.8559322033898306,0.7866563052483427,0.33567047119140625,0.7866563052483427
41,1,SVC Classifier,2,0.8,0.8135593220338984,1.0,0.3310987949371338,0.0
42,1,Decision Tree,2,0.8,0.864406779661017,0.7353470542445917,0.002119779586791992,0.7353470542445917
43,1,RandomForest,2,0.8,0.6779661016949152,1.0,0.7554373741149902,0.0
44,1,AdaBoost (Discrete),2,0.8,0.923728813559322,0.7922561070581773,47.569974422454834,0.7922561070581773
45,1,AdaBoost (Real),2,0.8,0.8559322033898306,0.9641925040026272,56.5190532207489,0.0
46,1,Logistic Regression (Penalty = L2),2,0.8,0.9491525423728814,0.9422865815358938,0.27059054374694824,0.9422865815358938
47,1,Naive Bayes,2,0.8,0.7711864406779662,0.6859431568581424,0.10867834091186523,0.6859431568581424
48,2,KNeighbors Classifier,0,0.8,0.8916666666666667,0.8878950739119864,0.3876674175262451,0.8878950739119864
49,2,SVC Classifier,0,0.8,0.8083333333333333,1.0,0.35462331771850586,0.0
50,2,Decision Tree,0,0.8,0.875,0.6676127396202685,0.11844110488891602,0.6676127396202685
51,2,RandomForest,0,0.8,0.675,1.0,0.7197444438934326,0.0
52,2,AdaBoost (Discrete),0,0.8,0.8166666666666667,0.6848351801484946,50.9825873374939,0.6848351801484946
53,2,AdaBoost (Real),0,0.8,0.7666666666666667,0.8339947279394198,57.85078477859497,0.0
54,2,Logistic Regression (Penalty = L2),0,0.8,0.975,0.9696654978825953,0.4599449634552002,0.9696654978825953
55,2,Naive Bayes,0,0.8,0.7833333333333333,0.743791857938213,0.23439860343933105,0.743791857938213
56,2,KNeighbors Classifier,1,0.8,0.85,0.8112480747237274,0.24653029441833496,0.8112480747237274
57,2,SVC Classifier,1,0.8,0.8083333333333333,1.0,0.3555772304534912,0.0
58,2,Decision Tree,1,0.8,0.8416666666666667,0.8450769073230369,0.0947122573852539,0.8450769073230369
59,2,RandomForest,1,0.8,0.7833333333333333,0.887431337929649,0.7024974822998047,0.0
60,2,AdaBoost (Discrete),1,0.8,0.325,1.0,50.156023025512695,0.0
61,2,AdaBoost (Real),1,0.8,0.8333333333333334,0.9748970527428702,57.02153396606445,0.0
62,2,Logistic Regression (Penalty = L2),1,0.8,0.9333333333333333,0.923485670457099,0.2836625576019287,0.923485670457099
63,2,Naive Bayes,1,0.8,0.7666666666666667,0.683113982346698,0.2340250015258789,0.683113982346698
64,2,KNeighbors Classifier,2,0.8,0.8728813559322034,0.8237744862210329,0.35309362411499023,0.8237744862210329
65,2,SVC Classifier,2,0.8,0.8135593220338984,1.0,0.2387247085571289,0.0
66,2,Decision Tree,2,0.8,0.9067796610169492,0.8948886452304328,0.0024750232696533203,0.8948886452304328
67,2,RandomForest,2,0.8,0.8135593220338984,0.5349565969668315,0.9459214210510254,0.5349565969668315
68,2,AdaBoost (Discrete),2,0.8,0.9322033898305084,0.8476452619160645,51.89794135093689,0.8476452619160645
69,2,AdaBoost (Real),2,0.8,0.864406779661017,1.0,62.196654319763184,0.0
70,2,Logistic Regression (Penalty = L2),2,0.8,0.9491525423728814,0.9401714290217257,0.31438302993774414,0.9401714290217257
71,2,Naive Bayes,2,0.8,0.7711864406779662,0.6873648184993013,0.25760650634765625,0.6873648184993013
72,3,KNeighbors Classifier,0,0.8,0.9083333333333333,0.9031602944121249,0.35428810119628906,0.9031602944121249
73,3,SVC Classifier,0,0.8,0.8083333333333333,1.0,0.35115623474121094,0.0
74,3,Decision Tree,0,0.8,0.875,0.8965357603868384,0.0020165443420410156,0.8965357603868384
75,3,RandomForest,0,0.8,0.75,0.8869084711105276,0.9597554206848145,0.0
76,3,AdaBoost (Discrete),0,0.8,0.8416666666666667,0.7627433009661261,59.8324134349823,0.7627433009661261
77,3,AdaBoost (Real),0,0.8,0.7666666666666667,0.8339947279394198,70.88125896453857,0.0
78,3,Logistic Regression (Penalty = L2),0,0.8,0.975,0.9696654978825953,0.3677239418029785,0.9696654978825953
79,3,Naive Bayes,0,0.8,0.8333333333333334,0.8176986041493832,0.28545522689819336,0.8176986041493832
80,3,KNeighbors Classifier,1,0.8,0.8833333333333333,0.8676969213225094,0.4152255058288574,0.8676969213225094
81,3,SVC Classifier,1,0.8,0.8083333333333333,1.0,0.5560061931610107,0.0
82,3,Decision Tree,1,0.8,0.8916666666666667,0.8722225260819082,0.14235973358154297,0.8722225260819082
83,3,RandomForest,1,0.8,0.7833333333333333,0.852101981070865,0.9802699089050293,0.0
84,3,AdaBoost (Discrete),1,0.8,0.325,1.0,54.925666093826294,0.0
85,3,AdaBoost (Real),1,0.8,0.8333333333333334,0.9748970527428702,63.043736934661865,0.0
86,3,Logistic Regression (Penalty = L2),1,0.8,0.9666666666666667,0.9577625008329119,0.3972439765930176,0.9577625008329119
87,3,Naive Bayes,1,0.8,0.7833333333333333,0.7102079764751443,0.14580202102661133,0.7102079764751443
88,3,KNeighbors Classifier,2,0.8,0.8898305084745762,0.8491906647824764,0.3920764923095703,0.8491906647824764
89,3,SVC Classifier,2,0.8,0.8135593220338984,1.0,0.3798236846923828,0.0
90,3,Decision Tree,2,0.8,0.9067796610169492,0.910969521221864,0.002266407012939453,0.910969521221864
91,3,RandomForest,2,0.8,0.8898305084745762,0.9138944456197073,0.9515891075134277,0.0
92,3,AdaBoost (Discrete),2,0.8,0.923728813559322,0.7922561070581773,54.625800371170044,0.7922561070581773
93,3,AdaBoost (Real),2,0.8,0.8559322033898306,0.9641925040026272,63.2763774394989,0.0
94,3,Logistic Regression (Penalty = L2),2,0.8,0.9661016949152542,0.9609668960083467,0.37832069396972656,0.9609668960083467
95,3,Naive Bayes,2,0.8,0.7966101694915254,0.7248326527536443,0.1541893482208252,0.7248326527536443
96,4,KNeighbors Classifier,0,0.8,0.9166666666666666,0.8842808949050823,0.41898059844970703,0.8842808949050823
97,4,SVC Classifier,0,0.8,0.8083333333333333,1.0,0.3100733757019043,0.0
98,4,Decision Tree,0,0.8,0.7416666666666667,0.6617727003009441,0.14231538772583008,0.6617727003009441
99,4,RandomForest,0,0.8,0.9083333333333333,0.9513505792446537,1.0613036155700684,0.0
100,4,AdaBoost (Discrete),0,0.8,0.8166666666666667,0.6848351801484946,57.63584899902344,0.6848351801484946
101,4,AdaBoost (Real),0,0.8,0.7666666666666667,0.8339947279394198,63.94595789909363,0.0
102,4,Logistic Regression (Penalty = L2),0,0.8,0.9916666666666667,0.9893012232339632,0.351973295211792,0.9893012232339632
103,4,Naive Bayes,0,0.8,0.8166666666666667,0.793224979327062,0.2897617816925049,0.793224979327062
104,4,KNeighbors Classifier,1,0.8,0.8666666666666667,0.8378193130017028,0.2851850986480713,0.8378193130017028
105,4,SVC Classifier,1,0.8,0.8083333333333333,1.0,0.4311647415161133,0.0
106,4,Decision Tree,1,0.8,0.85,0.8334316586795033,0.13034987449645996,0.8334316586795033
107,4,RandomForest,1,0.8,0.8,0.9894164999496223,1.0137569904327393,0.0
108,4,AdaBoost (Discrete),1,0.8,0.325,1.0,57.78543281555176,0.0
109,4,AdaBoost (Real),1,0.8,0.8333333333333334,0.9748970527428702,62.94267559051514,0.0
110,4,Logistic Regression (Penalty = L2),1,0.8,0.95,0.944846175074216,0.34497523307800293,0.944846175074216
111,4,Naive Bayes,1,0.8,0.7916666666666666,0.7190343853617875,0.1378765106201172,0.7190343853617875
112,4,KNeighbors Classifier,2,0.8,0.8389830508474576,0.7437557826838987,0.27382326126098633,0.7437557826838987
113,4,SVC Classifier,2,0.8,0.8135593220338984,1.0,0.2698378562927246,0.0
114,4,Decision Tree,2,0.8,0.9745762711864406,0.9487194431861344,0.002304553985595703,0.9487194431861344
115,4,RandomForest,2,0.8,0.8728813559322034,0.8476091015362177,0.9538674354553223,0.0
116,4,AdaBoost (Discrete),2,0.8,0.9322033898305084,0.8476452619160645,57.60932111740112,0.8476452619160645
117,4,AdaBoost (Real),2,0.8,0.8559322033898306,0.9641925040026272,52.624550342559814,0.0
118,4,Logistic Regression (Penalty = L2),2,0.8,0.9576271186440678,0.9491706774639023,0.402146577835083,0.9491706774639023
119,4,Naive Bayes,2,0.8,0.8050847457627118,0.7376731869184014,0.30977964401245117,0.7376731869184014
120,5,KNeighbors Classifier,0,0.8,0.8916666666666667,0.882948134154499,0.4431166648864746,0.882948134154499
121,5,SVC Classifier,0,0.8,0.8083333333333333,1.0,0.428863525390625,0.0
122,5,Decision Tree,0,0.8,0.9083333333333333,0.8105821156114102,0.0024673938751220703,0.8105821156114102
123,5,RandomForest,0,0.8,0.7833333333333333,0.6165083688432642,1.1447460651397705,0.0
124,5,AdaBoost (Discrete),0,0.8,0.8333333333333334,0.698184572956167,58.62610101699829,0.698184572956167
125,5,AdaBoost (Real),0,0.8,0.8,0.8532982640620798,69.87988209724426,0.0
126,5,Logistic Regression (Penalty = L2),0,0.8,0.975,0.9696654978825953,0.2834169864654541,0.9696654978825953
127,5,Naive Bayes,0,0.8,0.7833333333333333,0.743791857938213,0.14574360847473145,0.743791857938213
128,5,KNeighbors Classifier,1,0.8,0.8833333333333333,0.8561241758291369,0.40363597869873047,0.8561241758291369
129,5,SVC Classifier,1,0.8,0.8083333333333333,1.0,0.4204270839691162,0.0
130,5,Decision Tree,1,0.8,0.8666666666666667,0.8499063768966064,0.1376180648803711,0.8499063768966064
131,5,RandomForest,1,0.8,0.7833333333333333,0.9584146563694087,1.1313271522521973,0.0
132,5,AdaBoost (Discrete),1,0.8,0.325,1.0,57.116955041885376,0.0
133,5,AdaBoost (Real),1,0.8,0.8333333333333334,0.9748970527428702,66.25832962989807,0.0
134,5,Logistic Regression (Penalty = L2),1,0.8,0.9416666666666667,0.9277124071408973,0.511467456817627,0.9277124071408973
135,5,Naive Bayes,1,0.8,0.775,0.6940519131061853,0.28947925567626953,0.6940519131061853
136,5,KNeighbors Classifier,2,0.8,0.8728813559322034,0.8056436946512944,0.4321143627166748,0.8056436946512944
137,5,SVC Classifier,2,0.8,0.8135593220338984,1.0,0.29002952575683594,0.0
138,5,Decision Tree,2,0.8,0.9661016949152542,0.9147629133293019,0.1380929946899414,0.9147629133293019
139,5,RandomForest,2,0.8,0.8983050847457628,0.9311499150948377,1.0274271965026855,0.0
140,5,AdaBoost (Discrete),2,0.8,0.9322033898305084,0.8476452619160645,52.409340620040894,0.8476452619160645
141,5,AdaBoost (Real),2,0.8,0.8559322033898306,0.9641925040026272,62.4498610496521,0.0
142,5,Logistic Regression (Penalty = L2),2,0.8,0.9491525423728814,0.9401714290217257,0.2960243225097656,0.9401714290217257
143,5,Naive Bayes,2,0.8,0.7796610169491526,0.6995416035848818,0.12833070755004883,0.6995416035848818
144,6,KNeighbors Classifier,0,0.8,0.8416666666666667,0.7981079202652448,0.43233394622802734,0.7981079202652448
145,6,SVC Classifier,0,0.8,0.8083333333333333,1.0,0.3790404796600342,0.0
146,6,Decision Tree,0,0.8,0.7916666666666666,0.7120256990405244,0.15336823463439941,0.7120256990405244
147,6,RandomForest,0,0.8,0.775,0.9448166772278399,0.8036377429962158,0.0
148,6,AdaBoost (Discrete),0,0.8,0.825,0.7481595356833938,54.83114743232727,0.7481595356833938
149,6,AdaBoost (Real),0,0.8,0.7666666666666667,0.8339947279394198,58.68518352508545,0.0
150,6,Logistic Regression (Penalty = L2),0,0.8,0.9833333333333333,0.9808798513677408,0.19649314880371094,0.9808798513677408
151,6,Naive Bayes,0,0.8,0.8083333333333333,0.7827132714950777,0.14145159721374512,0.7827132714950777
152,6,KNeighbors Classifier,1,0.8,0.8916666666666667,0.8650201468962934,0.3773524761199951,0.8650201468962934
153,6,SVC Classifier,1,0.8,0.8083333333333333,1.0,0.3759467601776123,0.0
154,6,Decision Tree,1,0.8,0.875,0.8722225260819082,0.1263570785522461,0.8722225260819082
155,6,RandomForest,1,0.8,0.675,1.0,0.9706709384918213,0.0
156,6,AdaBoost (Discrete),1,0.8,0.325,1.0,53.51128053665161,0.0
157,6,AdaBoost (Real),1,0.8,0.8333333333333334,0.9748970527428702,59.8554949760437,0.0
158,6,Logistic Regression (Penalty = L2),1,0.8,0.9583333333333334,0.9533988533647133,0.42066383361816406,0.9533988533647133
159,6,Naive Bayes,1,0.8,0.775,0.6940519131061853,0.12608003616333008,0.6940519131061853
160,6,KNeighbors Classifier,2,0.8,0.8728813559322034,0.8143563110310286,0.37186717987060547,0.8143563110310286
161,6,SVC Classifier,2,0.8,0.8135593220338984,1.0,0.3733069896697998,0.0
162,6,Decision Tree,2,0.8,0.8220338983050848,0.6795062086632898,0.0014731884002685547,0.6795062086632898
163,6,RandomForest,2,0.8,0.923728813559322,0.8712905617352432,0.8582351207733154,0.8712905617352432
164,6,AdaBoost (Discrete),2,0.8,0.923728813559322,0.7922561070581773,54.75321817398071,0.7922561070581773
165,6,AdaBoost (Real),2,0.8,0.8559322033898306,0.9641925040026272,69.55481052398682,0.0
166,6,Logistic Regression (Penalty = L2),2,0.8,0.9576271186440678,0.9518558056141587,0.3343160152435303,0.9518558056141587
167,6,Naive Bayes,2,0.8,0.7627118644067796,0.6740030772986388,0.14222431182861328,0.6740030772986388
168,7,KNeighbors Classifier,0,0.8,0.875,0.8539061940747412,0.37833738327026367,0.8539061940747412
169,7,SVC Classifier,0,0.8,0.8083333333333333,1.0,0.5029914379119873,0.0
170,7,Decision Tree,0,0.8,0.825,0.712880199197191,0.15419650077819824,0.712880199197191
171,7,RandomForest,0,0.8,0.8,0.6358114348177182,0.8175430297851562,0.0
172,7,AdaBoost (Discrete),0,0.8,0.825,0.7481595356833938,60.60557961463928,0.7481595356833938
173,7,AdaBoost (Real),0,0.8,0.7666666666666667,0.8339947279394198,61.17079758644104,0.0
174,7,Logistic Regression (Penalty = L2),0,0.8,0.975,0.9696654978825953,0.35071849822998047,0.9696654978825953
175,7,Naive Bayes,0,0.8,0.7833333333333333,0.743791857938213,0.25446367263793945,0.743791857938213
176,7,KNeighbors Classifier,1,0.8,0.875,0.8526614251383757,0.3700981140136719,0.8526614251383757
177,7,SVC Classifier,1,0.8,0.8083333333333333,1.0,0.3671145439147949,0.0
178,7,Decision Tree,1,0.8,0.825,0.7987571918421159,0.1066904067993164,0.7987571918421159
179,7,RandomForest,1,0.8,0.8416666666666667,0.9665910224658814,0.9615967273712158,0.0
180,7,AdaBoost (Discrete),1,0.8,0.325,1.0,53.66084861755371,0.0
181,7,AdaBoost (Real),1,0.8,0.8333333333333334,0.9748970527428702,61.07080936431885,0.0
182,7,Logistic Regression (Penalty = L2),1,0.8,0.9416666666666667,0.9381678405381247,0.37077784538269043,0.9381678405381247
183,7,Naive Bayes,1,0.8,0.7666666666666667,0.683113982346698,0.12889528274536133,0.683113982346698
184,7,KNeighbors Classifier,2,0.8,0.8559322033898306,0.8032279079814331,0.5099811553955078,0.8032279079814331
185,7,SVC Classifier,2,0.8,0.8135593220338984,1.0,0.5231235027313232,0.0
186,7,Decision Tree,2,0.8,0.9322033898305084,0.9043044717058228,0.0022814273834228516,0.9043044717058228
187,7,RandomForest,2,0.8,0.8135593220338984,0.5099122256638764,1.0292763710021973,0.5099122256638764
188,7,AdaBoost (Discrete),2,0.8,0.923728813559322,0.7922561070581773,57.2711296081543,0.7922561070581773
189,7,AdaBoost (Real),2,0.8,0.864406779661017,1.0,68.93133902549744,0.0
190,7,Logistic Regression (Penalty = L2),2,0.8,0.9576271186440678,0.9518558056141587,0.3199577331542969,0.9518558056141587
191,7,Naive Bayes,2,0.8,0.7627118644067796,0.6740030772986388,0.2910044193267822,0.6740030772986388
192,8,KNeighbors Classifier,0,0.8,0.925,0.9270146155361292,0.38788342475891113,0.9270146155361292
193,8,SVC Classifier,0,0.8,0.8083333333333333,1.0,0.38794803619384766,0.0
194,8,Decision Tree,0,0.8,0.8916666666666667,0.8322472438632326,0.13003158569335938,0.8322472438632326
195,8,RandomForest,0,0.8,0.8083333333333333,0.6706950684870365,1.1662023067474365,0.0
196,8,AdaBoost (Discrete),0,0.8,0.8333333333333334,0.698184572956167,71.95745706558228,0.698184572956167
197,8,AdaBoost (Real),0,0.8,0.7666666666666667,0.8339947279394198,68.59845113754272,0.0
198,8,Logistic Regression (Penalty = L2),0,0.8,0.9916666666666667,0.9893012232339632,0.3423037528991699,0.9893012232339632
199,8,Naive Bayes,0,0.8,0.8166666666666667,0.793224979327062,0.14818215370178223,0.793224979327062
200,8,KNeighbors Classifier,1,0.8,0.8666666666666667,0.8442584286590804,0.44696736335754395,0.8442584286590804
201,8,SVC Classifier,1,0.8,0.8083333333333333,1.0,0.4105823040008545,0.0
202,8,Decision Tree,1,0.8,0.8833333333333333,0.8917861186987197,0.0019936561584472656,0.8917861186987197
203,8,RandomForest,1,0.8,0.8083333333333333,1.0,0.8995461463928223,0.0
204,8,AdaBoost (Discrete),1,0.8,0.325,1.0,61.052533864974976,0.0
205,8,AdaBoost (Real),1,0.8,0.8333333333333334,0.9748970527428702,72.40474510192871,0.0
206,8,Logistic Regression (Penalty = L2),1,0.8,0.9583333333333334,0.9491706774639023,0.41374874114990234,0.9491706774639023
207,8,Naive Bayes,1,0.8,0.7833333333333333,0.7102079764751443,0.15639781951904297,0.7102079764751443
208,8,KNeighbors Classifier,2,0.8,0.8813559322033898,0.8094352034302833,0.4350459575653076,0.8094352034302833
209,8,SVC Classifier,2,0.8,0.8135593220338984,1.0,0.2859761714935303,0.0
210,8,Decision Tree,2,0.8,0.9152542372881356,0.8780722264505297,0.11448955535888672,0.8780722264505297
211,8,RandomForest,2,0.8,0.8135593220338984,1.0,0.8680901527404785,0.0
212,8,AdaBoost (Discrete),2,0.8,0.9322033898305084,0.8476452619160645,57.918556690216064,0.8476452619160645
213,8,AdaBoost (Real),2,0.8,0.8559322033898306,0.9641925040026272,63.71125102043152,0.0
214,8,Logistic Regression (Penalty = L2),2,0.8,0.9576271186440678,0.9491706774639023,0.2841825485229492,0.9491706774639023
215,8,Naive Bayes,2,0.8,0.8050847457627118,0.7376731869184014,0.24493908882141113,0.7376731869184014
