,feat_set_id,classifier,fold_id,feat_th,score,geo_score,exec_t,geo_score_woz
0,0,KNeighbors Classifier,0,0.3,0.9373134328358209,0.9368097346405272,4.50043797492981,0.9368097346405272
1,0,SVC Classifier,0,0.3,0.8895522388059701,0.8881015446926108,5.080333948135376,0.8881015446926108
2,0,Decision Tree,0,0.3,0.808955223880597,0.8056609637752309,0.2824277877807617,0.8056609637752309
3,0,RandomForest,0,0.3,0.6701492537313433,0.720522633997371,0.8374662399291992,0.0
4,0,AdaBoost (Discrete),0,0.3,0.8940298507462686,0.8901596807876125,158.06057143211365,0.8901596807876125
5,0,AdaBoost (Real),0,0.3,0.8597014925373134,0.8584621329366683,184.82862162590027,0.8584621329366683
6,0,Logistic Regression (Penalty = L2),0,0.3,0.9522388059701492,0.9518199490313143,4.063717842102051,0.9518199490313143
7,0,Naive Bayes,0,0.3,0.8626865671641791,0.8611700055575894,0.45015597343444824,0.8611700055575894
8,0,KNeighbors Classifier,1,0.3,0.926865671641791,0.9257551006354401,4.242394685745239,0.9257551006354401
9,0,SVC Classifier,1,0.3,0.9014925373134328,0.9003226305087372,4.675371885299683,0.9003226305087372
10,0,Decision Tree,1,0.3,0.817910447761194,0.8153285576346726,0.16515803337097168,0.8153285576346726
11,0,RandomForest,1,0.3,0.6985074626865672,0.5328854178710833,0.7696483135223389,0.5328854178710833
12,0,AdaBoost (Discrete),1,0.3,0.9194029850746268,0.9186827400780055,140.90936589241028,0.9186827400780055
13,0,AdaBoost (Real),1,0.3,0.7597014925373134,0.7523878483104639,139.57048296928406,0.7523878483104639
14,0,Logistic Regression (Penalty = L2),1,0.3,0.9507462686567164,0.9506040150341047,4.098767995834351,0.9506040150341047
15,0,Naive Bayes,1,0.3,0.8776119402985074,0.8768271508465637,0.2824974060058594,0.8768271508465637
16,0,KNeighbors Classifier,2,0.3,0.9393939393939394,0.9388526493893469,3.868518114089966,0.9388526493893469
17,0,SVC Classifier,2,0.3,0.8984848484848484,0.8977425274454134,4.58386492729187,0.8977425274454134
18,0,Decision Tree,2,0.3,0.8166666666666667,0.8153432046361815,0.1701979637145996,0.8153432046361815
19,0,RandomForest,2,0.3,0.7181818181818181,0.6108533331861343,0.8344736099243164,0.6108533331861343
20,0,AdaBoost (Discrete),2,0.3,0.9181818181818182,0.9172902718169917,161.7656397819519,0.9172902718169917
21,0,AdaBoost (Real),2,0.3,0.8075757575757576,0.7934456013148191,155.4920916557312,0.7934456013148191
22,0,Logistic Regression (Penalty = L2),2,0.3,0.9590909090909091,0.9588513293928821,4.394287586212158,0.9588513293928821
23,0,Naive Bayes,2,0.3,0.8757575757575757,0.8749544563295527,0.34302210807800293,0.8749544563295527
24,1,KNeighbors Classifier,0,0.3,0.9611940298507463,0.9606761139359424,4.218843698501587,0.9606761139359424
25,1,SVC Classifier,0,0.3,0.8462686567164179,0.8160783558880559,5.632500886917114,0.8160783558880559
26,1,Decision Tree,0,0.3,0.8582089552238806,0.8554775363865891,0.17904424667358398,0.8554775363865891
27,1,RandomForest,0,0.3,0.6,0.5247428420109377,0.9001717567443848,0.0
28,1,AdaBoost (Discrete),0,0.3,0.9223880597014925,0.921304726226705,201.00194668769836,0.921304726226705
29,1,AdaBoost (Real),0,0.3,0.8746268656716418,0.8731466179507071,191.57038831710815,0.8731466179507071
30,1,Logistic Regression (Penalty = L2),0,0.3,0.9746268656716418,0.9743505455585739,3.8560638427734375,0.9743505455585739
31,1,Naive Bayes,0,0.3,0.8388059701492537,0.826217387539762,0.2674567699432373,0.826217387539762
32,1,KNeighbors Classifier,1,0.3,0.935820895522388,0.9355325360528931,4.176904916763306,0.9355325360528931
33,1,SVC Classifier,1,0.3,0.8567164179104477,0.839979419668712,5.965393304824829,0.839979419668712
34,1,Decision Tree,1,0.3,0.8149253731343283,0.8091568860252043,0.26372575759887695,0.8091568860252043
35,1,RandomForest,1,0.3,0.5716417910447761,0.5010448115222017,0.9660482406616211,0.0
36,1,AdaBoost (Discrete),1,0.3,0.8985074626865671,0.897085127652486,200.9447865486145,0.897085127652486
37,1,AdaBoost (Real),1,0.3,0.7835820895522388,0.7792198414882138,194.549884557724,0.7792198414882138
38,1,Logistic Regression (Penalty = L2),1,0.3,0.9582089552238806,0.9580010038366048,3.7434394359588623,0.9580010038366048
39,1,Naive Bayes,1,0.3,0.8731343283582089,0.8697452495072845,0.3634476661682129,0.8697452495072845
40,1,KNeighbors Classifier,2,0.3,0.9378787878787879,0.9371609262591423,4.049372911453247,0.9371609262591423
41,1,SVC Classifier,2,0.3,0.8575757575757575,0.831383731227668,5.840139865875244,0.831383731227668
42,1,Decision Tree,2,0.3,0.8090909090909091,0.807394577836255,0.2751483917236328,0.807394577836255
43,1,RandomForest,2,0.3,0.6090909090909091,0.43902192848960125,1.036942958831787,0.43902192848960125
44,1,AdaBoost (Discrete),2,0.3,0.9121212121212121,0.9110160992047192,204.73387932777405,0.9110160992047192
45,1,AdaBoost (Real),2,0.3,0.6348484848484849,0.560867720858217,191.03171920776367,0.560867720858217
46,1,Logistic Regression (Penalty = L2),2,0.3,0.9727272727272728,0.9725414737701334,3.6333558559417725,0.9725414737701334
47,1,Naive Bayes,2,0.3,0.8545454545454545,0.8515202287098688,0.34003686904907227,0.8515202287098688
48,2,KNeighbors Classifier,0,0.3,0.9626865671641791,0.9619308038924308,4.331840991973877,0.9619308038924308
49,2,SVC Classifier,0,0.3,0.9074626865671642,0.9050634943684294,4.984787225723267,0.9050634943684294
50,2,Decision Tree,0,0.3,0.8552238805970149,0.8526778259802521,0.2462630271911621,0.8526778259802521
51,2,RandomForest,0,0.3,0.6343283582089553,0.4592375951877264,0.93076491355896,0.4592375951877264
52,2,AdaBoost (Discrete),0,0.3,0.9223880597014925,0.9206861239142424,170.49331164360046,0.9206861239142424
53,2,AdaBoost (Real),0,0.3,0.8029850746268656,0.7913427796435566,157.30497670173645,0.7913427796435566
54,2,Logistic Regression (Penalty = L2),0,0.3,0.9671641791044776,0.9668207194279973,3.597695827484131,0.9668207194279973
55,2,Naive Bayes,0,0.3,0.9059701492537313,0.9029905771629552,0.2583346366882324,0.9029905771629552
56,2,KNeighbors Classifier,1,0.3,0.9462686567164179,0.9456342749261047,3.950922966003418,0.9456342749261047
57,2,SVC Classifier,1,0.3,0.9238805970149254,0.9220099215950028,4.821171998977661,0.9220099215950028
58,2,Decision Tree,1,0.3,0.8432835820895522,0.8388995583867921,0.2474203109741211,0.8388995583867921
59,2,RandomForest,1,0.3,0.5701492537313433,0.3988300917993707,0.9151694774627686,0.0
60,2,AdaBoost (Discrete),1,0.3,0.926865671641791,0.9262972494593827,172.43508863449097,0.9262972494593827
61,2,AdaBoost (Real),1,0.3,0.3895522388059702,0.19063337021184587,167.17866373062134,0.19063337021184587
62,2,Logistic Regression (Penalty = L2),1,0.3,0.9686567164179104,0.9684377069044336,3.236583709716797,0.9684377069044336
63,2,Naive Bayes,1,0.3,0.9194029850746268,0.9177744961752359,0.2427051067352295,0.9177744961752359
64,2,KNeighbors Classifier,2,0.3,0.9575757575757575,0.9567672252679108,3.935026168823242,0.9567672252679108
65,2,SVC Classifier,2,0.3,0.9242424242424242,0.9220073894672893,4.829115629196167,0.9220073894672893
66,2,Decision Tree,2,0.3,0.8454545454545455,0.8412563820513095,0.16078710556030273,0.8412563820513095
67,2,RandomForest,2,0.3,0.6863636363636364,0.5866811673275103,0.8782143592834473,0.5866811673275103
68,2,AdaBoost (Discrete),2,0.3,0.9287878787878788,0.9282129574435333,166.71939420700073,0.9282129574435333
69,2,AdaBoost (Real),2,0.3,0.5636363636363636,0.47481538148754165,161.31007027626038,0.47481538148754165
70,2,Logistic Regression (Penalty = L2),2,0.3,0.9696969696969697,0.9691934928322575,3.246244430541992,0.9691934928322575
71,2,Naive Bayes,2,0.3,0.9257575757575758,0.9249120451396409,0.3151876926422119,0.9249120451396409
72,3,KNeighbors Classifier,0,0.3,0.8432835820895522,0.8399287654246186,0.5975747108459473,0.8399287654246186
73,3,SVC Classifier,0,0.3,0.6716417910447762,0.5228485345887096,2.6119327545166016,0.5228485345887096
74,3,Decision Tree,0,0.3,0.7089552238805971,0.7004063136613234,0.14976119995117188,0.7004063136613234
75,3,RandomForest,0,0.3,0.5298507462686567,0.3729604553368271,0.6138327121734619,0.3729604553368271
76,3,AdaBoost (Discrete),0,0.3,0.7611940298507462,0.7551372401358849,64.42242932319641,0.7551372401358849
77,3,AdaBoost (Real),0,0.3,0.6746268656716418,0.6317022777227262,76.72169208526611,0.6317022777227262
78,3,Logistic Regression (Penalty = L2),0,0.3,0.8164179104477612,0.8086831973840695,1.339019775390625,0.8086831973840695
79,3,Naive Bayes,0,0.3,0.7074626865671642,0.676880803347667,0.22533178329467773,0.676880803347667
80,3,KNeighbors Classifier,1,0.3,0.8552238805970149,0.8509103919085013,0.7025830745697021,0.8509103919085013
81,3,SVC Classifier,1,0.3,0.6880597014925374,0.5458696045236228,2.494323492050171,0.5458696045236228
82,3,Decision Tree,1,0.3,0.7597014925373134,0.7533853531909108,0.1516106128692627,0.7533853531909108
83,3,RandomForest,1,0.3,0.6343283582089553,0.5284167336338076,0.6120202541351318,0.5284167336338076
84,3,AdaBoost (Discrete),1,0.3,0.7835820895522388,0.7712362765903119,64.37404727935791,0.7712362765903119
85,3,AdaBoost (Real),1,0.3,0.3940298507462687,0.300538167031311,73.27832078933716,0.0
86,3,Logistic Regression (Penalty = L2),1,0.3,0.8343283582089552,0.8302273914009985,1.4336612224578857,0.8302273914009985
87,3,Naive Bayes,1,0.3,0.7507462686567165,0.7357010262859229,0.2132716178894043,0.7357010262859229
88,3,KNeighbors Classifier,2,0.3,0.8621212121212121,0.8588932923337128,0.6265943050384521,0.8588932923337128
89,3,SVC Classifier,2,0.3,0.6878787878787879,0.49986124400092347,2.361790418624878,0.49986124400092347
90,3,Decision Tree,2,0.3,0.7363636363636363,0.733216609480449,0.07437562942504883,0.733216609480449
91,3,RandomForest,2,0.3,0.6,0.724313863750914,0.6539802551269531,0.0
92,3,AdaBoost (Discrete),2,0.3,0.7803030303030303,0.7723314023827396,61.38103938102722,0.7723314023827396
93,3,AdaBoost (Real),2,0.3,0.7303030303030303,0.7160880076211266,77.12193942070007,0.7160880076211266
94,3,Logistic Regression (Penalty = L2),2,0.3,0.8469696969696969,0.8450896874509729,1.5701069831848145,0.8450896874509729
95,3,Naive Bayes,2,0.3,0.7287878787878788,0.698982882932893,0.09521913528442383,0.698982882932893
96,4,KNeighbors Classifier,0,0.3,0.9074626865671642,0.9053856167634109,1.302894115447998,0.9053856167634109
97,4,SVC Classifier,0,0.3,0.7746268656716417,0.715534890775047,2.487989902496338,0.715534890775047
98,4,Decision Tree,0,0.3,0.7895522388059701,0.7846250751465671,0.13165783882141113,0.7846250751465671
99,4,RandomForest,0,0.3,0.5835820895522388,0.5507648217244189,0.5425281524658203,0.0
100,4,AdaBoost (Discrete),0,0.3,0.8402985074626865,0.8304071826781584,73.55452990531921,0.8304071826781584
101,4,AdaBoost (Real),0,0.3,0.7388059701492538,0.7292496906091578,80.99427103996277,0.7292496906091578
102,4,Logistic Regression (Penalty = L2),0,0.3,0.9208955223880597,0.9198641665283984,1.6653294563293457,0.9198641665283984
103,4,Naive Bayes,0,0.3,0.8343283582089552,0.8265477553297147,0.1874387264251709,0.8265477553297147
104,4,KNeighbors Classifier,1,0.3,0.9238805970149254,0.9227655646852677,1.2149925231933594,0.9227655646852677
105,4,SVC Classifier,1,0.3,0.7970149253731343,0.7693543504963225,2.503192901611328,0.7693543504963225
106,4,Decision Tree,1,0.3,0.7626865671641792,0.7592139386655503,0.1345679759979248,0.7592139386655503
107,4,RandomForest,1,0.3,0.6164179104477612,0.6331569266835961,0.5458245277404785,0.0
108,4,AdaBoost (Discrete),1,0.3,0.8805970149253731,0.8787129335564836,70.03449845314026,0.8787129335564836
109,4,AdaBoost (Real),1,0.3,0.7253731343283583,0.6851145974759133,76.83146047592163,0.6851145974759133
110,4,Logistic Regression (Penalty = L2),1,0.3,0.926865671641791,0.9262827280680325,1.5806117057800293,0.9262827280680325
111,4,Naive Bayes,1,0.3,0.8552238805970149,0.8517320437008857,0.1803891658782959,0.8517320437008857
112,4,KNeighbors Classifier,2,0.3,0.9151515151515152,0.9139391696644226,1.2032792568206787,0.9139391696644226
113,4,SVC Classifier,2,0.3,0.7757575757575758,0.72600910289798,2.586665630340576,0.72600910289798
114,4,Decision Tree,2,0.3,0.8121212121212121,0.8100191742344156,0.12035703659057617,0.8100191742344156
115,4,RandomForest,2,0.3,0.5969696969696969,0.5729722355503459,0.6138091087341309,0.0
116,4,AdaBoost (Discrete),2,0.3,0.8787878787878788,0.8773961611403442,70.16193699836731,0.8773961611403442
117,4,AdaBoost (Real),2,0.3,0.5045454545454545,0.4720702911613584,77.06595087051392,0.4720702911613584
118,4,Logistic Regression (Penalty = L2),2,0.3,0.9393939393939394,0.9388827833791948,1.5084114074707031,0.9388827833791948
119,4,Naive Bayes,2,0.3,0.8575757575757575,0.853699550450001,0.20509099960327148,0.853699550450001
120,5,KNeighbors Classifier,0,0.3,0.908955223880597,0.9065373939229294,0.7804052829742432,0.9065373939229294
121,5,SVC Classifier,0,0.3,0.7223880597014926,0.6525174497522612,2.095409870147705,0.6525174497522612
122,5,Decision Tree,0,0.3,0.7970149253731343,0.7911461990810309,0.13922524452209473,0.7911461990810309
123,5,RandomForest,0,0.3,0.491044776119403,0.33791933491921955,0.5719387531280518,0.0
124,5,AdaBoost (Discrete),0,0.3,0.8477611940298507,0.8449931153033963,63.660825967788696,0.8449931153033963
125,5,AdaBoost (Real),0,0.3,0.7895522388059701,0.7758991120338019,70.91530108451843,0.7758991120338019
126,5,Logistic Regression (Penalty = L2),0,0.3,0.8880597014925373,0.8855287848570482,1.3017921447753906,0.8855287848570482
127,5,Naive Bayes,0,0.3,0.8253731343283582,0.8205066415935928,0.18901395797729492,0.8205066415935928
128,5,KNeighbors Classifier,1,0.3,0.9134328358208955,0.9126415172171635,0.7600648403167725,0.9126415172171635
129,5,SVC Classifier,1,0.3,0.7373134328358208,0.7010234185150975,2.0916824340820312,0.7010234185150975
130,5,Decision Tree,1,0.3,0.7955223880597015,0.7898131698921843,0.11603975296020508,0.7898131698921843
131,5,RandomForest,1,0.3,0.48059701492537316,0.3596436015490719,0.6344902515411377,0.0
132,5,AdaBoost (Discrete),1,0.3,0.8522388059701492,0.8515641352407203,62.4184455871582,0.8515641352407203
133,5,AdaBoost (Real),1,0.3,0.7955223880597015,0.7829152367388138,68.99780130386353,0.7829152367388138
134,5,Logistic Regression (Penalty = L2),1,0.3,0.891044776119403,0.8891187585171542,1.1282637119293213,0.8891187585171542
135,5,Naive Bayes,1,0.3,0.8373134328358209,0.8353277849504724,0.12547683715820312,0.8353277849504724
136,5,KNeighbors Classifier,2,0.3,0.9136363636363637,0.9126699077785458,0.619624137878418,0.9126699077785458
137,5,SVC Classifier,2,0.3,0.7378787878787879,0.6697093693147488,2.091993570327759,0.6697093693147488
138,5,Decision Tree,2,0.3,0.7878787878787878,0.7828555970512221,0.11934280395507812,0.7828555970512221
139,5,RandomForest,2,0.3,0.543939393939394,0.4902727266539784,0.5354485511779785,0.0
140,5,AdaBoost (Discrete),2,0.3,0.8469696969696969,0.8452901015851658,59.34108090400696,0.8452901015851658
141,5,AdaBoost (Real),2,0.3,0.7136363636363636,0.6928276266846172,67.12678456306458,0.6928276266846172
142,5,Logistic Regression (Penalty = L2),2,0.3,0.8954545454545455,0.8941740291858908,1.2524259090423584,0.8941740291858908
143,5,Naive Bayes,2,0.3,0.8378787878787879,0.8352643509888531,0.18562912940979004,0.8352643509888531
144,6,KNeighbors Classifier,0,0.3,0.9388059701492537,0.9377892333903939,2.3919999599456787,0.9377892333903939
145,6,SVC Classifier,0,0.3,0.8477611940298507,0.8330696299723541,3.1178905963897705,0.8330696299723541
146,6,Decision Tree,0,0.3,0.8567164179104477,0.8526961133148719,0.11317896842956543,0.8526961133148719
147,6,RandomForest,0,0.3,0.5223880597014925,0.29437168569278954,0.5915505886077881,0.29437168569278954
148,6,AdaBoost (Discrete),0,0.3,0.9104477611940298,0.9084984468052189,98.18611335754395,0.9084984468052189
149,6,AdaBoost (Real),0,0.3,0.7611940298507462,0.7428637674966182,102.8191134929657,0.7428637674966182
150,6,Logistic Regression (Penalty = L2),0,0.3,0.9671641791044776,0.9667490744446795,2.3949954509735107,0.9667490744446795
151,6,Naive Bayes,0,0.3,0.8641791044776119,0.859216202660583,0.21456694602966309,0.859216202660583
152,6,KNeighbors Classifier,1,0.3,0.9477611940298507,0.947155066285104,1.9745831489562988,0.947155066285104
153,6,SVC Classifier,1,0.3,0.8746268656716418,0.8684959981245386,3.118010997772217,0.8684959981245386
154,6,Decision Tree,1,0.3,0.8283582089552238,0.8260764544246242,0.14635705947875977,0.8260764544246242
155,6,RandomForest,1,0.3,0.5432835820895522,0.3895948342797185,0.5526487827301025,0.3895948342797185
156,6,AdaBoost (Discrete),1,0.3,0.9238805970149254,0.9235382041223685,94.01628756523132,0.9235382041223685
157,6,AdaBoost (Real),1,0.3,0.49701492537313435,0.2751947622340971,94.97387599945068,0.2751947622340971
158,6,Logistic Regression (Penalty = L2),1,0.3,0.9492537313432836,0.9487939244835121,2.2630765438079834,0.9487939244835121
159,6,Naive Bayes,1,0.3,0.8805970149253731,0.8791447042124292,0.18625378608703613,0.8791447042124292
160,6,KNeighbors Classifier,2,0.3,0.943939393939394,0.9431912107320585,2.03995943069458,0.9431912107320585
161,6,SVC Classifier,2,0.3,0.85,0.8297303414974113,3.0987372398376465,0.8297303414974113
162,6,Decision Tree,2,0.3,0.85,0.8482658255267186,0.16898441314697266,0.8482658255267186
163,6,RandomForest,2,0.3,0.646969696969697,0.5869095822025836,0.4941091537475586,0.5869095822025836
164,6,AdaBoost (Discrete),2,0.3,0.8909090909090909,0.885965963511049,94.85072064399719,0.885965963511049
165,6,AdaBoost (Real),2,0.3,0.5954545454545455,0.4093653921434776,91.5700957775116,0.4093653921434776
166,6,Logistic Regression (Penalty = L2),2,0.3,0.9651515151515152,0.964815465384113,1.9737727642059326,0.964815465384113
167,6,Naive Bayes,2,0.3,0.8909090909090909,0.8882372597315403,0.14874625205993652,0.8882372597315403
168,7,KNeighbors Classifier,0,0.3,0.9671641791044776,0.9667719590587456,5.80514121055603,0.9667719590587456
169,7,SVC Classifier,0,0.3,0.9462686567164179,0.9453748366342143,4.481868505477905,0.9453748366342143
170,7,Decision Tree,0,0.3,0.826865671641791,0.8220895767252332,0.23020243644714355,0.8220895767252332
171,7,RandomForest,0,0.3,0.6253731343283582,0.5195210417869374,0.660620927810669,0.5195210417869374
172,7,AdaBoost (Discrete),0,0.3,0.9522388059701492,0.951467008775763,210.0560896396637,0.951467008775763
173,7,AdaBoost (Real),0,0.3,0.8805970149253731,0.8789689781352797,182.15871286392212,0.8789689781352797
174,7,Logistic Regression (Penalty = L2),0,0.3,0.9761194029850746,0.9759779413328776,4.524371385574341,0.9759779413328776
175,7,Naive Bayes,0,0.3,0.908955223880597,0.9075594257327455,0.3698399066925049,0.9075594257327455
176,7,KNeighbors Classifier,1,0.3,0.9477611940298507,0.9472775516676111,5.95393180847168,0.9472775516676111
177,7,SVC Classifier,1,0.3,0.9477611940298507,0.9473083574284911,4.618977308273315,0.9473083574284911
178,7,Decision Tree,1,0.3,0.8119402985074626,0.8081675107400529,0.15676569938659668,0.8081675107400529
179,7,RandomForest,1,0.3,0.5283582089552239,0.46237073993936306,0.617089033126831,0.0
180,7,AdaBoost (Discrete),1,0.3,0.9328358208955224,0.9323955028611539,198.38953113555908,0.9323955028611539
181,7,AdaBoost (Real),1,0.3,0.34626865671641793,0.21609026680821003,167.41936874389648,0.0
182,7,Logistic Regression (Penalty = L2),1,0.3,0.9701492537313433,0.9700580894047669,3.7700910568237305,0.9700580894047669
183,7,Naive Bayes,1,0.3,0.9313432835820895,0.9308207997517192,0.27715468406677246,0.9308207997517192
184,7,KNeighbors Classifier,2,0.3,0.9636363636363636,0.9631742205288397,5.333953619003296,0.9631742205288397
185,7,SVC Classifier,2,0.3,0.9424242424242424,0.9419599188754696,4.481827020645142,0.9419599188754696
186,7,Decision Tree,2,0.3,0.8590909090909091,0.8581623541213581,0.19188261032104492,0.8581623541213581
187,7,RandomForest,2,0.3,0.6924242424242424,0.5009119310835743,0.5235037803649902,0.5009119310835743
188,7,AdaBoost (Discrete),2,0.3,0.9378787878787879,0.936965653818246,170.7636342048645,0.936965653818246
189,7,AdaBoost (Real),2,0.3,0.5121212121212121,0.3622094554430525,160.6586000919342,0.3622094554430525
190,7,Logistic Regression (Penalty = L2),2,0.3,0.9742424242424242,0.9740757608466152,3.4277892112731934,0.9740757608466152
191,7,Naive Bayes,2,0.3,0.9151515151515152,0.9146941321110269,0.24616169929504395,0.9146941321110269
192,8,KNeighbors Classifier,0,0.3,0.7611940298507462,0.7542599164481173,0.1232459545135498,0.7542599164481173
193,8,SVC Classifier,0,0.3,0.5402985074626866,0.44516537320371274,1.115077257156372,0.44516537320371274
194,8,Decision Tree,0,0.3,0.6283582089552239,0.6194548010297254,0.08449673652648926,0.6194548010297254
195,8,RandomForest,0,0.3,0.5014925373134328,0.34692084906613174,0.28127360343933105,0.0
196,8,AdaBoost (Discrete),0,0.3,0.6537313432835821,0.6434922477646934,25.615283489227295,0.6434922477646934
197,8,AdaBoost (Real),0,0.3,0.46567164179104475,0.32263818955177015,35.19330644607544,0.32263818955177015
198,8,Logistic Regression (Penalty = L2),0,0.3,0.7104477611940299,0.6950054455705028,0.442821741104126,0.6950054455705028
199,8,Naive Bayes,0,0.3,0.6567164179104478,0.6278633466962972,0.0849299430847168,0.6278633466962972
200,8,KNeighbors Classifier,1,0.3,0.8104477611940298,0.8059293850959943,0.1492462158203125,0.8059293850959943
201,8,SVC Classifier,1,0.3,0.5447761194029851,0.4305997024477318,0.9360072612762451,0.4305997024477318
202,8,Decision Tree,1,0.3,0.6686567164179105,0.6638385423064543,0.0408635139465332,0.6638385423064543
203,8,RandomForest,1,0.3,0.4537313432835821,0.29722709110379514,0.3143467903137207,0.0
204,8,AdaBoost (Discrete),1,0.3,0.7044776119402985,0.6854715880411523,25.663250207901,0.6854715880411523
205,8,AdaBoost (Real),1,0.3,0.40746268656716417,0.314065990102429,33.46078824996948,0.0
206,8,Logistic Regression (Penalty = L2),1,0.3,0.7716417910447761,0.7608449061363112,0.46120333671569824,0.7608449061363112
207,8,Naive Bayes,1,0.3,0.7,0.6811681330682919,0.07652854919433594,0.6811681330682919
208,8,KNeighbors Classifier,2,0.3,0.803030303030303,0.8013932013566865,0.16125273704528809,0.8013932013566865
209,8,SVC Classifier,2,0.3,0.543939393939394,0.4193459141947732,1.0209648609161377,0.4193459141947732
210,8,Decision Tree,2,0.3,0.703030303030303,0.696258788299676,0.040712594985961914,0.696258788299676
211,8,RandomForest,2,0.3,0.4318181818181818,0.30727665227588274,0.31592774391174316,0.0
212,8,AdaBoost (Discrete),2,0.3,0.65,0.6185354094317749,25.727724313735962,0.6185354094317749
213,8,AdaBoost (Real),2,0.3,0.5,0.3980823352156109,34.29321646690369,0.3980823352156109
214,8,Logistic Regression (Penalty = L2),2,0.3,0.7287878787878788,0.7217823850541244,0.4267868995666504,0.7217823850541244
215,8,Naive Bayes,2,0.3,0.65,0.6210572030824361,0.08780264854431152,0.6210572030824361
