,feat_set_id,classifier,fold_id,feat_th,score,geo_score,exec_t,geo_score_woz
0,0,KNeighbors Classifier,0,0.55,0.9611940298507463,0.9608101638368671,6.794144630432129,0.9608101638368671
1,0,SVC Classifier,0,0.55,0.9283582089552239,0.9272740850905915,5.569245100021362,0.9272740850905915
2,0,Decision Tree,0,0.55,0.8507462686567164,0.8482401129533674,0.22421693801879883,0.8482401129533674
3,0,RandomForest,0,0.55,0.6253731343283582,0.5707811432990278,0.9130187034606934,0.0
4,0,AdaBoost (Discrete),0,0.55,0.935820895522388,0.9349359218932077,255.29058980941772,0.9349359218932077
5,0,AdaBoost (Real),0,0.55,0.755223880597015,0.722190566980055,253.3399052619934,0.722190566980055
6,0,Logistic Regression (Penalty = L2),0,0.55,0.9761194029850746,0.9759086025540082,6.370836019515991,0.9759086025540082
7,0,Naive Bayes,0,0.55,0.8895522388059701,0.8880612398467028,0.44626379013061523,0.8880612398467028
8,0,KNeighbors Classifier,1,0.55,0.9492537313432836,0.9489225669192031,8.054746866226196,0.9489225669192031
9,0,SVC Classifier,1,0.55,0.935820895522388,0.9351910674085976,6.7236950397491455,0.9351910674085976
10,0,Decision Tree,1,0.55,0.8462686567164179,0.8447494752686212,0.26039719581604004,0.8447494752686212
11,0,RandomForest,1,0.55,0.6238805970149254,0.49240984322593023,0.8328120708465576,0.49240984322593023
12,0,AdaBoost (Discrete),1,0.55,0.9343283582089552,0.9339992804782028,280.90871477127075,0.9339992804782028
13,0,AdaBoost (Real),1,0.55,0.3417910447761194,0.2229293463295801,279.922176361084,0.0
14,0,Logistic Regression (Penalty = L2),1,0.55,0.9656716417910448,0.9655794342764028,6.692149639129639,0.9655794342764028
15,0,Naive Bayes,1,0.55,0.908955223880597,0.908050758697147,0.49379563331604004,0.908050758697147
16,0,KNeighbors Classifier,2,0.55,0.956060606060606,0.9557396400339963,7.911179065704346,0.9557396400339963
17,0,SVC Classifier,2,0.55,0.9257575757575758,0.9250316604899013,6.739021062850952,0.9250316604899013
18,0,Decision Tree,2,0.55,0.8318181818181818,0.829593615620374,0.33441758155822754,0.829593615620374
19,0,RandomForest,2,0.55,0.6424242424242425,0.4560033904635974,0.9228630065917969,0.0
20,0,AdaBoost (Discrete),2,0.55,0.9333333333333333,0.9326166281630018,280.99467515945435,0.9326166281630018
21,0,AdaBoost (Real),2,0.55,0.5969696969696969,0.45069668311117267,262.4509904384613,0.45069668311117267
22,0,Logistic Regression (Penalty = L2),2,0.55,0.9742424242424242,0.9740519770870313,7.191592216491699,0.9740519770870313
23,0,Naive Bayes,2,0.55,0.9,0.8991662966567734,0.6167471408843994,0.8991662966567734
24,1,KNeighbors Classifier,0,0.55,0.9656716417910448,0.9652529152619453,8.362891674041748,0.9652529152619453
25,1,SVC Classifier,0,0.55,0.9194029850746268,0.9173969597389893,8.030096530914307,0.9173969597389893
26,1,Decision Tree,0,0.55,0.8134328358208955,0.8090511944869794,0.27701687812805176,0.8090511944869794
27,1,RandomForest,0,0.55,0.6671641791044776,0.5748840676485749,1.0550994873046875,0.5748840676485749
28,1,AdaBoost (Discrete),0,0.55,0.9492537313432836,0.9487557624527615,324.83541655540466,0.9487557624527615
29,1,AdaBoost (Real),0,0.55,0.7626865671641792,0.7449695029697818,280.6276731491089,0.7449695029697818
30,1,Logistic Regression (Penalty = L2),0,0.55,0.9805970149253731,0.9803908790084069,6.487500905990601,0.9803908790084069
31,1,Naive Bayes,0,0.55,0.9014925373134328,0.899559461816514,0.43235325813293457,0.899559461816514
32,1,KNeighbors Classifier,1,0.55,0.9462686567164179,0.9455875967391479,7.779293060302734,0.9455875967391479
33,1,SVC Classifier,1,0.55,0.9298507462686567,0.9291696105150697,7.364163875579834,0.9291696105150697
34,1,Decision Tree,1,0.55,0.8611940298507462,0.8590007806863187,0.31697893142700195,0.8590007806863187
35,1,RandomForest,1,0.55,0.5970149253731343,0.5036229674599301,0.9515235424041748,0.5036229674599301
36,1,AdaBoost (Discrete),1,0.55,0.9417910447761194,0.9416395837145887,299.69383096694946,0.9416395837145887
37,1,AdaBoost (Real),1,0.55,0.2865671641791045,0.16386416404677148,278.09101724624634,0.0
38,1,Logistic Regression (Penalty = L2),1,0.55,0.9746268656716418,0.9744890066335927,5.451319456100464,0.9744890066335927
39,1,Naive Bayes,1,0.55,0.9208955223880597,0.9200080553470533,0.4784698486328125,0.9200080553470533
40,1,KNeighbors Classifier,2,0.55,0.9606060606060606,0.9600912938951861,7.0769970417022705,0.9600912938951861
41,1,SVC Classifier,2,0.55,0.9378787878787879,0.9371752298654732,6.707028865814209,0.9371752298654732
42,1,Decision Tree,2,0.55,0.8196969696969697,0.817049583602151,0.30662035942077637,0.817049583602151
43,1,RandomForest,2,0.55,0.6772727272727272,0.4829729381226567,0.9217233657836914,0.4829729381226567
44,1,AdaBoost (Discrete),2,0.55,0.9287878787878788,0.9266317557627516,294.1374866962433,0.9266317557627516
45,1,AdaBoost (Real),2,0.55,0.706060606060606,0.5776839278584915,249.82156586647034,0.5776839278584915
46,1,Logistic Regression (Penalty = L2),2,0.55,0.9712121212121212,0.970941408929516,5.01455283164978,0.970941408929516
47,1,Naive Bayes,2,0.55,0.9075757575757576,0.9065237816131186,0.36632680892944336,0.9065237816131186
48,2,KNeighbors Classifier,0,0.55,0.9641791044776119,0.9637263491871648,7.713805198669434,0.9637263491871648
49,2,SVC Classifier,0,0.55,0.9388059701492537,0.9374268172788484,5.882034778594971,0.9374268172788484
50,2,Decision Tree,0,0.55,0.8552238805970149,0.8523761350682828,0.2778463363647461,0.8523761350682828
51,2,RandomForest,0,0.55,0.6582089552238806,0.8124719581682752,0.8560199737548828,0.0
52,2,AdaBoost (Discrete),0,0.55,0.9388059701492537,0.9379089387194041,246.82575869560242,0.9379089387194041
53,2,AdaBoost (Real),0,0.55,0.8626865671641791,0.8595731889213293,224.4682812690735,0.8595731889213293
54,2,Logistic Regression (Penalty = L2),0,0.55,0.9776119402985075,0.977401130898957,5.591580629348755,0.977401130898957
55,2,Naive Bayes,0,0.55,0.908955223880597,0.9074380012293298,0.40088653564453125,0.9074380012293298
56,2,KNeighbors Classifier,1,0.55,0.9552238805970149,0.9547533678831767,7.459980726242065,0.9547533678831767
57,2,SVC Classifier,1,0.55,0.9432835820895522,0.9426916263362249,6.074038028717041,0.9426916263362249
58,2,Decision Tree,1,0.55,0.8582089552238806,0.8565665473688344,0.22810101509094238,0.8565665473688344
59,2,RandomForest,1,0.55,0.6955223880597015,0.531789775153063,0.8357527256011963,0.531789775153063
60,2,AdaBoost (Discrete),1,0.55,0.9477611940298507,0.9475914634338463,231.34981226921082,0.9475914634338463
61,2,AdaBoost (Real),1,0.55,0.2865671641791045,0.17750218685961625,217.00542163848877,0.0
62,2,Logistic Regression (Penalty = L2),1,0.55,0.9731343283582089,0.9728828339972694,4.23805832862854,0.9728828339972694
63,2,Naive Bayes,1,0.55,0.9238805970149254,0.923182777841525,0.41456174850463867,0.923182777841525
64,2,KNeighbors Classifier,2,0.55,0.9606060606060606,0.960170292118666,6.152930974960327,0.960170292118666
65,2,SVC Classifier,2,0.55,0.9424242424242424,0.9418610440774655,5.064801931381226,0.9418610440774655
66,2,Decision Tree,2,0.55,0.8348484848484848,0.8298448840011212,0.23865342140197754,0.8298448840011212
67,2,RandomForest,2,0.55,0.6893939393939394,0.7076625099076392,0.6637866497039795,0.0
68,2,AdaBoost (Discrete),2,0.55,0.9272727272727272,0.9257712262816998,208.54361486434937,0.9257712262816998
69,2,AdaBoost (Real),2,0.55,0.8227272727272728,0.817824153450396,183.43362855911255,0.817824153450396
70,2,Logistic Regression (Penalty = L2),2,0.55,0.9727272727272728,0.9725674657115357,4.494323015213013,0.9725674657115357
71,2,Naive Bayes,2,0.55,0.9136363636363637,0.9127839953867164,0.3511381149291992,0.9127839953867164
72,3,KNeighbors Classifier,0,0.55,0.9597014925373134,0.9588830393458235,2.747922420501709,0.9588830393458235
73,3,SVC Classifier,0,0.55,0.8805970149253731,0.8770025874350756,3.4829463958740234,0.8770025874350756
74,3,Decision Tree,0,0.55,0.8238805970149253,0.8184614032023709,0.19915032386779785,0.8184614032023709
75,3,RandomForest,0,0.55,0.5701492537313433,0.3569128069445043,0.5649433135986328,0.3569128069445043
76,3,AdaBoost (Discrete),0,0.55,0.9134328358208955,0.9080560960834447,128.97778820991516,0.9080560960834447
77,3,AdaBoost (Real),0,0.55,0.6567164179104478,0.7020673718041489,124.70329880714417,0.0
78,3,Logistic Regression (Penalty = L2),0,0.55,0.9656716417910448,0.9653199515581308,2.9831128120422363,0.9653199515581308
79,3,Naive Bayes,0,0.55,0.8656716417910447,0.8638660112201099,0.2609419822692871,0.8638660112201099
80,3,KNeighbors Classifier,1,0.55,0.9417910447761194,0.941117509485145,2.647127389907837,0.941117509485145
81,3,SVC Classifier,1,0.55,0.8940298507462686,0.8923748663495782,3.6832566261291504,0.8923748663495782
82,3,Decision Tree,1,0.55,0.8388059701492537,0.8376364440806721,0.20271992683410645,0.8376364440806721
83,3,RandomForest,1,0.55,0.5686567164179105,0.5367487287546758,0.6192653179168701,0.0
84,3,AdaBoost (Discrete),1,0.55,0.908955223880597,0.9058681975467745,129.25725078582764,0.9058681975467745
85,3,AdaBoost (Real),1,0.55,0.48059701492537316,0.336366943980484,115.93084168434143,0.0
86,3,Logistic Regression (Penalty = L2),1,0.55,0.9641791044776119,0.9640357764910104,2.7773568630218506,0.9640357764910104
87,3,Naive Bayes,1,0.55,0.8820895522388059,0.8811826453218037,0.25003910064697266,0.8811826453218037
88,3,KNeighbors Classifier,2,0.55,0.946969696969697,0.946330773333294,2.2700557708740234,0.946330773333294
89,3,SVC Classifier,2,0.55,0.8848484848484849,0.882173532399342,3.319626569747925,0.882173532399342
90,3,Decision Tree,2,0.55,0.8393939393939394,0.8361499308787343,0.11090850830078125,0.8361499308787343
91,3,RandomForest,2,0.55,0.5833333333333334,0.34579957173384446,0.5601153373718262,0.34579957173384446
92,3,AdaBoost (Discrete),2,0.55,0.896969696969697,0.8944675826667167,118.74811387062073,0.8944675826667167
93,3,AdaBoost (Real),2,0.55,0.5590909090909091,0.4624984465746393,110.9682867527008,0.0
94,3,Logistic Regression (Penalty = L2),2,0.55,0.9727272727272728,0.972542958839484,2.326474666595459,0.972542958839484
95,3,Naive Bayes,2,0.55,0.8848484848484849,0.8837468787942625,0.20444631576538086,0.8837468787942625
96,4,KNeighbors Classifier,0,0.55,0.9641791044776119,0.9639429959847632,3.264413356781006,0.9639429959847632
97,4,SVC Classifier,0,0.55,0.9194029850746268,0.9180864708271519,3.090604543685913,0.9180864708271519
98,4,Decision Tree,0,0.55,0.8313432835820895,0.8275904192687746,0.14785075187683105,0.8275904192687746
99,4,RandomForest,0,0.55,0.5940298507462687,0.477486332706081,0.43883371353149414,0.0
100,4,AdaBoost (Discrete),0,0.55,0.9388059701492537,0.937634281685593,118.52290320396423,0.937634281685593
101,4,AdaBoost (Real),0,0.55,0.826865671641791,0.8233753162421642,111.08560562133789,0.8233753162421642
102,4,Logistic Regression (Penalty = L2),0,0.55,0.9686567164179104,0.9682505140670942,2.9506375789642334,0.9682505140670942
103,4,Naive Bayes,0,0.55,0.9,0.8986726265045785,0.19785714149475098,0.8986726265045785
104,4,KNeighbors Classifier,1,0.55,0.9507462686567164,0.9503686119507749,3.3096673488616943,0.9503686119507749
105,4,SVC Classifier,1,0.55,0.9298507462686567,0.9292141520814053,3.0634963512420654,0.9292141520814053
106,4,Decision Tree,1,0.55,0.8477611940298507,0.8463448973510054,0.11919021606445312,0.8463448973510054
107,4,RandomForest,1,0.55,0.5686567164179105,0.4906996870666643,0.4434537887573242,0.0
108,4,AdaBoost (Discrete),1,0.55,0.9313432835820895,0.9308682675048638,107.51654553413391,0.9308682675048638
109,4,AdaBoost (Real),1,0.55,0.3417910447761194,0.2027042463201804,111.61858820915222,0.0
110,4,Logistic Regression (Penalty = L2),1,0.55,0.9641791044776119,0.9640364628499191,2.254539966583252,0.9640364628499191
111,4,Naive Bayes,1,0.55,0.9104477611940298,0.9096785177318285,0.19228816032409668,0.9096785177318285
112,4,KNeighbors Classifier,2,0.55,0.9545454545454546,0.9541300791754541,2.7396435737609863,0.9541300791754541
113,4,SVC Classifier,2,0.55,0.9318181818181818,0.9310983914929163,2.7584340572357178,0.9310983914929163
114,4,Decision Tree,2,0.55,0.8515151515151516,0.8508713774923855,0.12458586692810059,0.8508713774923855
115,4,RandomForest,2,0.55,0.6015151515151516,0.6825980151985721,0.5396502017974854,0.0
116,4,AdaBoost (Discrete),2,0.55,0.9257575757575758,0.9248174966549253,103.29576373100281,0.9248174966549253
117,4,AdaBoost (Real),2,0.55,0.6136363636363636,0.4207103812154953,106.13572454452515,0.4207103812154953
118,4,Logistic Regression (Penalty = L2),2,0.55,0.9696969696969697,0.9692874688016685,2.7637405395507812,0.9692874688016685
119,4,Naive Bayes,2,0.55,0.906060606060606,0.9050727949398083,0.20548224449157715,0.9050727949398083
120,5,KNeighbors Classifier,0,0.55,0.9537313432835821,0.9528158041852041,2.5245039463043213,0.9528158041852041
121,5,SVC Classifier,0,0.55,0.8925373134328358,0.8900916315474171,2.897805690765381,0.8900916315474171
122,5,Decision Tree,0,0.55,0.826865671641791,0.8195182995934258,0.09145450592041016,0.8195182995934258
123,5,RandomForest,0,0.55,0.6417910447761194,0.4688712845098387,0.4815385341644287,0.4688712845098387
124,5,AdaBoost (Discrete),0,0.55,0.9119402985074627,0.9082438130870608,100.68457341194153,0.9082438130870608
125,5,AdaBoost (Real),0,0.55,0.7492537313432835,0.734257785846785,96.71831631660461,0.734257785846785
126,5,Logistic Regression (Penalty = L2),0,0.55,0.9716417910447761,0.9714252393871028,2.044039487838745,0.9714252393871028
127,5,Naive Bayes,0,0.55,0.8925373134328358,0.8907548528862711,0.14876770973205566,0.8907548528862711
128,5,KNeighbors Classifier,1,0.55,0.9507462686567164,0.9501604552752803,2.036076307296753,0.9501604552752803
129,5,SVC Classifier,1,0.55,0.9059701492537313,0.9043185596646509,2.42356276512146,0.9043185596646509
130,5,Decision Tree,1,0.55,0.8507462686567164,0.846437639985023,0.10720467567443848,0.846437639985023
131,5,RandomForest,1,0.55,0.5059701492537313,0.5120977029607497,0.4748663902282715,0.0
132,5,AdaBoost (Discrete),1,0.55,0.9223880597014925,0.9212735722367577,92.13536286354065,0.9212735722367577
133,5,AdaBoost (Real),1,0.55,0.3447761194029851,0.4030045427896188,86.00238585472107,0.0
134,5,Logistic Regression (Penalty = L2),1,0.55,0.9731343283582089,0.9730246833077866,1.5777204036712646,0.9730246833077866
135,5,Naive Bayes,1,0.55,0.9164179104477612,0.9156188093610936,0.14097881317138672,0.9156188093610936
136,5,KNeighbors Classifier,2,0.55,0.9515151515151515,0.9509273248975693,1.8061983585357666,0.9509273248975693
137,5,SVC Classifier,2,0.55,0.9075757575757576,0.9067338862051759,2.1738486289978027,0.9067338862051759
138,5,Decision Tree,2,0.55,0.8454545454545455,0.842800065618803,0.095001220703125,0.842800065618803
139,5,RandomForest,2,0.55,0.6515151515151515,0.475048320535439,0.4283730983734131,0.475048320535439
140,5,AdaBoost (Discrete),2,0.55,0.9106060606060606,0.9099213243834106,80.01115894317627,0.9099213243834106
141,5,AdaBoost (Real),2,0.55,0.6848484848484848,0.6661931105091597,71.92268347740173,0.6661931105091597
142,5,Logistic Regression (Penalty = L2),2,0.55,0.9696969696969697,0.9695312092291439,1.5058040618896484,0.9695312092291439
143,5,Naive Bayes,2,0.55,0.9090909090909091,0.9085120049754799,0.16727662086486816,0.9085120049754799
144,6,KNeighbors Classifier,0,0.55,0.9656716417910448,0.9653442093948436,3.1709015369415283,0.9653442093948436
145,6,SVC Classifier,0,0.55,0.9388059701492537,0.9377946916247734,2.621122121810913,0.9377946916247734
146,6,Decision Tree,0,0.55,0.8626865671641791,0.8590337544942671,0.09875631332397461,0.8590337544942671
147,6,RandomForest,0,0.55,0.6880597014925374,0.5744148258787412,0.35604190826416016,0.5744148258787412
148,6,AdaBoost (Discrete),0,0.55,0.9432835820895522,0.9423392025308538,111.85122060775757,0.9423392025308538
149,6,AdaBoost (Real),0,0.55,0.9014925373134328,0.9000518149924437,96.37002944946289,0.9000518149924437
150,6,Logistic Regression (Penalty = L2),0,0.55,0.9761194029850746,0.9759086025540082,2.0456936359405518,0.9759086025540082
151,6,Naive Bayes,0,0.55,0.9074626865671642,0.9063921074191733,0.19997501373291016,0.9063921074191733
152,6,KNeighbors Classifier,1,0.55,0.9552238805970149,0.9549205148205396,2.9032206535339355,0.9549205148205396
153,6,SVC Classifier,1,0.55,0.9402985074626866,0.9397470607123803,2.327439069747925,0.9397470607123803
154,6,Decision Tree,1,0.55,0.835820895522388,0.833650068990204,0.11112213134765625,0.833650068990204
155,6,RandomForest,1,0.55,0.6447761194029851,0.5481138980275742,0.31061673164367676,0.5481138980275742
156,6,AdaBoost (Discrete),1,0.55,0.9298507462686567,0.9292308505627074,99.44583439826965,0.9292308505627074
157,6,AdaBoost (Real),1,0.55,0.34328358208955223,0.23622352002174857,99.40233778953552,0.0
158,6,Logistic Regression (Penalty = L2),1,0.55,0.9686567164179104,0.9685316095905263,2.229871988296509,0.9685316095905263
159,6,Naive Bayes,1,0.55,0.917910447761194,0.9172609635482032,0.18033337593078613,0.9172609635482032
160,6,KNeighbors Classifier,2,0.55,0.9575757575757575,0.957093986749358,2.895998477935791,0.957093986749358
161,6,SVC Classifier,2,0.55,0.9348484848484848,0.9342271136862947,2.4684696197509766,0.9342271136862947
162,6,Decision Tree,2,0.55,0.8621212121212121,0.8602958985999009,0.1152195930480957,0.8602958985999009
163,6,RandomForest,2,0.55,0.7227272727272728,0.6771432181044036,0.3083326816558838,0.6771432181044036
164,6,AdaBoost (Discrete),2,0.55,0.9303030303030303,0.9298068960958783,100.2081778049469,0.9298068960958783
165,6,AdaBoost (Real),2,0.55,0.6196969696969697,0.552002963187028,83.32172107696533,0.552002963187028
166,6,Logistic Regression (Penalty = L2),2,0.55,0.9727272727272728,0.9724961918477121,1.90924072265625,0.9724961918477121
167,6,Naive Bayes,2,0.55,0.9136363636363637,0.9125256723080114,0.18761181831359863,0.9125256723080114
168,7,KNeighbors Classifier,0,0.55,0.9641791044776119,0.9638266903226089,4.114321231842041,0.9638266903226089
169,7,SVC Classifier,0,0.55,0.9507462686567164,0.9501025508095104,2.637085437774658,0.9501025508095104
170,7,Decision Tree,0,0.55,0.8522388059701492,0.8470394638010293,0.0974726676940918,0.8470394638010293
171,7,RandomForest,0,0.55,0.6208955223880597,0.5417837321114922,0.29155826568603516,0.0
172,7,AdaBoost (Discrete),0,0.55,0.9477611940298507,0.9470199593155899,124.91336464881897,0.9470199593155899
173,7,AdaBoost (Real),0,0.55,0.7955223880597015,0.778168348279932,108.16932249069214,0.778168348279932
174,7,Logistic Regression (Penalty = L2),0,0.55,0.9776119402985075,0.9774467090727746,2.826674222946167,0.9774467090727746
175,7,Naive Bayes,0,0.55,0.9149253731343283,0.9138144577800194,0.22911834716796875,0.9138144577800194
176,7,KNeighbors Classifier,1,0.55,0.9522388059701492,0.9516803449933169,3.435817241668701,0.9516803449933169
177,7,SVC Classifier,1,0.55,0.9462686567164179,0.9458407708612027,2.3389787673950195,0.9458407708612027
178,7,Decision Tree,1,0.55,0.8208955223880597,0.8188004324755364,0.09259176254272461,0.8188004324755364
179,7,RandomForest,1,0.55,0.5985074626865672,0.3505064210190757,0.25412940979003906,0.3505064210190757
180,7,AdaBoost (Discrete),1,0.55,0.9462686567164179,0.9461227328418885,115.44736623764038,0.9461227328418885
181,7,AdaBoost (Real),1,0.55,0.282089552238806,0.15572385107347458,101.03979134559631,0.0
182,7,Logistic Regression (Penalty = L2),1,0.55,0.9686567164179104,0.9685316095905262,2.2875163555145264,0.9685316095905262
183,7,Naive Bayes,1,0.55,0.9283582089552239,0.9277948172917669,0.19988703727722168,0.9277948172917669
184,7,KNeighbors Classifier,2,0.55,0.9651515151515152,0.9649128257565289,3.2827165126800537,0.9649128257565289
185,7,SVC Classifier,2,0.55,0.95,0.9495859920960609,2.142946243286133,0.9495859920960609
186,7,Decision Tree,2,0.55,0.8409090909090909,0.8374889395081745,0.08606839179992676,0.8374889395081745
187,7,RandomForest,2,0.55,0.7742424242424243,0.7530002330481931,0.23699355125427246,0.7530002330481931
188,7,AdaBoost (Discrete),2,0.55,0.943939393939394,0.9434539782881007,102.89705538749695,0.9434539782881007
189,7,AdaBoost (Real),2,0.55,0.6121212121212121,0.5368141070565222,91.27903175354004,0.5368141070565222
190,7,Logistic Regression (Penalty = L2),2,0.55,0.9772727272727273,0.9771493796465622,1.951995849609375,0.9771493796465622
191,7,Naive Bayes,2,0.55,0.9181818181818182,0.9173968207827529,0.17637157440185547,0.9173968207827529
192,8,KNeighbors Classifier,0,0.55,0.9537313432835821,0.9528077770726121,0.5732424259185791,0.9528077770726121
193,8,SVC Classifier,0,0.55,0.8597014925373134,0.8550741930192352,0.8769023418426514,0.8550741930192352
194,8,Decision Tree,0,0.55,0.8522388059701492,0.8485573724563523,0.034764766693115234,0.8485573724563523
195,8,RandomForest,0,0.55,0.5835820895522388,0.3711973693953476,0.155015230178833,0.3711973693953476
196,8,AdaBoost (Discrete),0,0.55,0.9149253731343283,0.9130564110478572,33.99957513809204,0.9130564110478572
197,8,AdaBoost (Real),0,0.55,0.7343283582089553,0.7130031319606253,33.66599154472351,0.7130031319606253
198,8,Logistic Regression (Penalty = L2),0,0.55,0.9626865671641791,0.9624040423120898,0.7294373512268066,0.9624040423120898
199,8,Naive Bayes,0,0.55,0.8656716417910447,0.8634372618179982,0.09885430335998535,0.8634372618179982
200,8,KNeighbors Classifier,1,0.55,0.935820895522388,0.9348107392687517,0.557661771774292,0.9348107392687517
201,8,SVC Classifier,1,0.55,0.8895522388059701,0.8878292341983969,1.026179313659668,0.8878292341983969
202,8,Decision Tree,1,0.55,0.8626865671641791,0.8607396540837864,0.04120993614196777,0.8607396540837864
203,8,RandomForest,1,0.55,0.6194029850746269,0.44607165843468816,0.22355389595031738,0.44607165843468816
204,8,AdaBoost (Discrete),1,0.55,0.9164179104477612,0.9155197473618353,35.470194578170776,0.9155197473618353
205,8,AdaBoost (Real),1,0.55,0.34328358208955223,0.39598952083679456,35.40468382835388,0.0
206,8,Logistic Regression (Penalty = L2),1,0.55,0.9597014925373134,0.9595380664324575,0.7442607879638672,0.9595380664324575
207,8,Naive Bayes,1,0.55,0.891044776119403,0.8899499526618054,0.07923507690429688,0.8899499526618054
208,8,KNeighbors Classifier,2,0.55,0.95,0.949180185169229,0.7417287826538086,0.949180185169229
209,8,SVC Classifier,2,0.55,0.8742424242424243,0.8725746747519522,1.1211469173431396,0.8725746747519522
210,8,Decision Tree,2,0.55,0.8378787878787879,0.835646470333247,0.037604331970214844,0.835646470333247
211,8,RandomForest,2,0.55,0.6848484848484848,0.7292233806553676,0.1777482032775879,0.0
212,8,AdaBoost (Discrete),2,0.55,0.9212121212121213,0.9203554515100139,34.7178795337677,0.9203554515100139
213,8,AdaBoost (Real),2,0.55,0.5424242424242425,0.45185423985448797,34.30802845954895,0.0
214,8,Logistic Regression (Penalty = L2),2,0.55,0.9636363636363636,0.9634900458108284,0.7493855953216553,0.9634900458108284
215,8,Naive Bayes,2,0.55,0.8954545454545455,0.8949236904258919,0.058351993560791016,0.8949236904258919
