,feat_set_id,classifier,fold_id,feat_th,score,geo_score,exec_t,geo_score_woz
0,0,KNeighbors Classifier,0,1.0,0.8093525179856115,0.808499508510087,3.3963162899017334,0.808499508510087
1,0,SVC Classifier,0,1.0,0.8477218225419664,0.8348725340035308,3.510448932647705,0.8348725340035308
2,0,Decision Tree,0,1.0,0.75,0.7480762081959135,0.13199496269226074,0.7480762081959135
3,0,RandomForest,0,1.0,0.7583932853717026,0.7568454766859831,0.39937734603881836,0.7568454766859831
4,0,AdaBoost (Discrete),0,1.0,0.8339328537170264,0.8338985278791758,52.990784883499146,0.8338985278791758
5,0,AdaBoost (Real),0,1.0,0.8375299760191847,0.8372400418047827,47.247453927993774,0.8372400418047827
6,0,Logistic Regression (Penalty = L2),0,1.0,0.8747002398081535,0.8740322729255502,0.2829744815826416,0.8740322729255502
7,0,Naive Bayes,0,1.0,0.8081534772182254,0.7786913791133079,0.041849613189697266,0.7786913791133079
8,0,KNeighbors Classifier,1,1.0,0.7887154861944778,0.787177949177067,2.3990628719329834,0.787177949177067
9,0,SVC Classifier,1,1.0,0.84093637454982,0.8287043137385471,1.970381259918213,0.8287043137385471
10,0,Decision Tree,1,1.0,0.7046818727490997,0.7036287744422262,0.0467376708984375,0.7036287744422262
11,0,RandomForest,1,1.0,0.7635054021608644,0.7587166361267497,0.1446528434753418,0.7587166361267497
12,0,AdaBoost (Discrete),1,1.0,0.8349339735894358,0.8346771361541357,33.55386710166931,0.8346771361541357
13,0,AdaBoost (Real),1,1.0,0.8379351740696278,0.8376461294032843,35.573116064071655,0.8376461294032843
14,0,Logistic Regression (Penalty = L2),1,1.0,0.8619447779111644,0.8614065440109399,0.14461970329284668,0.8614065440109399
15,0,Naive Bayes,1,1.0,0.8073229291716687,0.7800183043456932,0.023639917373657227,0.7800183043456932
16,0,KNeighbors Classifier,2,1.0,0.8067226890756303,0.805098649886236,1.6934528350830078,0.805098649886236
17,0,SVC Classifier,2,1.0,0.8451380552220888,0.8308784388979829,1.721712350845337,0.8308784388979829
18,0,Decision Tree,2,1.0,0.7250900360144058,0.7240169175945316,0.05327796936035156,0.7240169175945316
19,0,RandomForest,2,1.0,0.7460984393757503,0.7383012044836845,0.16109728813171387,0.7383012044836845
20,0,AdaBoost (Discrete),2,1.0,0.8613445378151261,0.8612502443955635,24.497108459472656,0.8612502443955635
21,0,AdaBoost (Real),2,1.0,0.8499399759903962,0.849966590858672,24.76172184944153,0.849966590858672
22,0,Logistic Regression (Penalty = L2),2,1.0,0.8697478991596639,0.8685320193269515,0.0976262092590332,0.8685320193269515
23,0,Naive Bayes,2,1.0,0.8175270108043218,0.7897230327017709,0.02876591682434082,0.7897230327017709
