,feat_set_id,classifier,fold_id,feat_th,score,geo_score,exec_t,geo_score_woz
0,0,KNeighbors Classifier,0,0.35,0.1927710843373494,0.2385088707358538,0.8324968814849854,0.0
1,0,SVC Classifier,0,0.35,0.18143160878809356,0.11337191700951768,14.15646505355835,0.0
2,0,Decision Tree,0,0.35,0.2083628632175762,0.2835785930377232,0.21977710723876953,0.0
3,0,RandomForest,0,0.35,0.23529411764705882,0.38608100450693594,0.9685640335083008,0.0
4,0,AdaBoost (Discrete),0,0.35,0.16796598157335224,0.14708492845025065,63.051713705062866,0.0
5,0,AdaBoost (Real),0,0.35,0.14174344436569808,0.11364390386443754,274.1421420574188,0.0
6,0,Logistic Regression (Penalty = L2),0,0.35,0.2437987243090007,0.2849985125631272,3.05399489402771,0.0
7,0,Naive Bayes,0,0.35,0.04748405386250886,0.30492317522436574,0.3104405403137207,0.0
8,0,KNeighbors Classifier,1,0.35,0.19756621331424482,0.2654856872092279,0.5842394828796387,0.0
9,0,SVC Classifier,1,0.35,0.18611309949892627,0.5991328754445572,11.903010845184326,0.0
10,0,Decision Tree,1,0.35,0.21689334287759485,0.29986929334895784,0.24801945686340332,0.0
11,0,RandomForest,1,0.35,0.2526843235504653,0.29366421073806537,0.9709868431091309,0.0
12,0,AdaBoost (Discrete),1,0.35,0.20615604867573373,0.1439468324454796,55.40705609321594,0.0
13,0,AdaBoost (Real),1,0.35,0.13027916964924838,0.2198751361883009,150.63442659378052,0.0
14,0,Logistic Regression (Penalty = L2),1,0.35,0.24266284896206156,0.1815185959692114,2.7927441596984863,0.0
15,0,Naive Bayes,1,0.35,0.0744452397995705,0.5353361233077707,0.4438004493713379,0.0
16,0,KNeighbors Classifier,2,0.35,0.20287769784172663,0.3393954741122365,0.6239709854125977,0.0
17,0,SVC Classifier,2,0.35,0.19784172661870503,0.6422002450787708,11.111830949783325,0.0
18,0,Decision Tree,2,0.35,0.21294964028776978,0.3147464633399917,0.16820573806762695,0.0
19,0,RandomForest,2,0.35,0.2568345323741007,0.26881589504516284,0.7808659076690674,0.0
20,0,AdaBoost (Discrete),2,0.35,0.1553956834532374,0.132734875039128,56.085018157958984,0.0
21,0,AdaBoost (Real),2,0.35,0.11007194244604317,0.14354688165584806,142.4676673412323,0.0
22,0,Logistic Regression (Penalty = L2),2,0.35,0.2525179856115108,0.357108916235408,2.4102039337158203,0.0
23,0,Naive Bayes,2,0.35,0.05971223021582734,0.3605151804802224,0.305206298828125,0.0
24,1,KNeighbors Classifier,0,0.35,0.1998582565556343,0.26025312959525776,0.29392385482788086,0.0
25,1,SVC Classifier,0,0.35,0.1630049610205528,1.0,8.937610864639282,0.0
26,1,Decision Tree,0,0.35,0.19064493267186391,0.23828097439320878,0.1733839511871338,0.0
27,1,RandomForest,0,0.35,0.22820694542877393,0.31337264126187925,0.6781504154205322,0.0
28,1,AdaBoost (Discrete),0,0.35,0.19631467044649184,0.21069418632612283,64.13952040672302,0.0
29,1,AdaBoost (Real),0,0.35,0.1856839121190645,0.22976818289991555,119.28599381446838,0.0
30,1,Logistic Regression (Penalty = L2),0,0.35,0.24592487597448617,0.19221977609632793,2.418226480484009,0.0
31,1,Naive Bayes,0,0.35,0.1856839121190645,0.3729663148621351,0.2541015148162842,0.0
32,1,KNeighbors Classifier,1,0.35,0.20901932712956334,0.2697980648619888,0.26668763160705566,0.0
33,1,SVC Classifier,1,0.35,0.164638511095204,1.0,7.571416854858398,0.0
34,1,Decision Tree,1,0.35,0.2125984251968504,0.2809414101242435,0.242232084274292,0.0
35,1,RandomForest,1,0.35,0.25984251968503935,0.281126236597652,0.6602416038513184,0.0
36,1,AdaBoost (Discrete),1,0.35,0.2147458840372226,0.21950363745809695,50.005531311035156,0.0
37,1,AdaBoost (Real),1,0.35,0.21116678596993557,0.3145523019049791,101.90538167953491,0.0
38,1,Logistic Regression (Penalty = L2),1,0.35,0.2526843235504653,0.15812065401908812,1.99346923828125,0.0
39,1,Naive Bayes,1,0.35,0.2455261274158912,0.5265598173333905,0.21285557746887207,0.0
40,1,KNeighbors Classifier,2,0.35,0.24028776978417266,0.37837727166740276,0.2835240364074707,0.0
41,1,SVC Classifier,2,0.35,0.1647482014388489,1.0,6.185964345932007,0.0
42,1,Decision Tree,2,0.35,0.20359712230215826,0.26547135331221,0.1700289249420166,0.0
43,1,RandomForest,2,0.35,0.2762589928057554,0.24098019078602498,0.5720725059509277,0.0
44,1,AdaBoost (Discrete),2,0.35,0.2079136690647482,0.17477682506925904,41.01802158355713,0.0
45,1,AdaBoost (Real),2,0.35,0.24820143884892087,0.42561123828389447,78.52771377563477,0.0
46,1,Logistic Regression (Penalty = L2),2,0.35,0.2446043165467626,0.13366768351834432,1.6029651165008545,0.0
47,1,Naive Bayes,2,0.35,0.25611510791366904,0.587874936708788,0.1306931972503662,0.0
48,2,KNeighbors Classifier,0,0.35,0.19560595322466337,0.3679580203070389,0.23019909858703613,0.0
49,2,SVC Classifier,0,0.35,0.1630049610205528,1.0,4.863631010055542,0.0
50,2,Decision Tree,0,0.35,0.17647058823529413,0.25874433265584285,0.11205244064331055,0.0
51,2,RandomForest,0,0.35,0.221119773210489,0.27536889300747514,0.41089892387390137,0.0
52,2,AdaBoost (Discrete),0,0.35,0.1785967399007796,0.2028319028311543,29.807206630706787,0.0
53,2,AdaBoost (Real),0,0.35,0.21119773210489015,0.26858640179695953,68.41752791404724,0.0
54,2,Logistic Regression (Penalty = L2),0,0.35,0.23245924875974486,0.18997504533256573,1.507533073425293,0.0
55,2,Naive Bayes,0,0.35,0.21119773210489015,0.3850490193061864,0.17803144454956055,0.0
56,2,KNeighbors Classifier,1,0.35,0.20257695060844666,0.3219638616575487,0.1991283893585205,0.0
57,2,SVC Classifier,1,0.35,0.164638511095204,1.0,4.760518312454224,0.0
58,2,Decision Tree,1,0.35,0.19613457408732998,0.2531781257187242,0.08897042274475098,0.0
59,2,RandomForest,1,0.35,0.24266284896206156,0.2969613067258714,0.3667171001434326,0.0
60,2,AdaBoost (Discrete),1,0.35,0.18468146027201146,0.17909452334857728,28.03206467628479,0.0
61,2,AdaBoost (Real),1,0.35,0.22476735862562633,0.26061206932619135,66.51683568954468,0.0
62,2,Logistic Regression (Penalty = L2),1,0.35,0.2526843235504653,0.28695125410326916,1.4352624416351318,0.0
63,2,Naive Bayes,1,0.35,0.25697924123120974,0.5308875479302524,0.21101975440979004,0.0
64,2,KNeighbors Classifier,2,0.35,0.21726618705035972,0.2731992419174949,0.1466524600982666,0.0
65,2,SVC Classifier,2,0.35,0.1647482014388489,1.0,4.212918996810913,0.0
66,2,Decision Tree,2,0.35,0.18992805755395684,0.24293909890414966,0.0731058120727539,0.0
67,2,RandomForest,2,0.35,0.2589928057553957,0.3407437696565755,0.32405543327331543,0.0
68,2,AdaBoost (Discrete),2,0.35,0.16618705035971224,0.18210345372823414,27.295442819595337,0.0
69,2,AdaBoost (Real),2,0.35,0.23453237410071942,0.3198977224115762,60.02309274673462,0.0
70,2,Logistic Regression (Penalty = L2),2,0.35,0.2712230215827338,0.2799851779404135,1.22977614402771,0.0
71,2,Naive Bayes,2,0.35,0.26258992805755393,0.5652501124785664,0.12845492362976074,0.0
72,3,KNeighbors Classifier,0,0.35,0.2289156626506024,0.29196517603596595,0.16121125221252441,0.0
73,3,SVC Classifier,0,0.35,0.1630049610205528,1.0,3.9292373657226562,0.0
74,3,Decision Tree,0,0.35,0.20623671155209072,0.2991894986021621,0.11949610710144043,0.0
75,3,RandomForest,0,0.35,0.2303330970942594,0.2679498687088724,0.37372732162475586,0.0
76,3,AdaBoost (Discrete),0,0.35,0.18426647767540752,0.22567876404186002,27.822510242462158,0.0
77,3,AdaBoost (Real),0,0.35,0.2012756909992913,0.09515564089127473,76.38295030593872,0.0
78,3,Logistic Regression (Penalty = L2),0,0.35,0.2523033309709426,0.2861321851630712,2.167659282684326,0.0
79,3,Naive Bayes,0,0.35,0.19844082211197733,0.3614702333481971,0.20812702178955078,0.0
80,3,KNeighbors Classifier,1,0.35,0.21760916249105225,0.2496993578234826,0.211167573928833,0.0
81,3,SVC Classifier,1,0.35,0.164638511095204,1.0,6.292504072189331,0.0
82,3,Decision Tree,1,0.35,0.21188260558339297,0.33083548077272434,0.2153317928314209,0.0
83,3,RandomForest,1,0.35,0.2526843235504653,0.41302665998191496,0.6266212463378906,0.0
84,3,AdaBoost (Discrete),1,0.35,0.20257695060844666,0.22526916262255156,41.17176580429077,0.0
85,3,AdaBoost (Real),1,0.35,0.2283464566929134,0.27016416373161367,89.18083429336548,0.0
86,3,Logistic Regression (Penalty = L2),1,0.35,0.2541159627773801,0.2404333607875451,1.9623658657073975,0.0
87,3,Naive Bayes,1,0.35,0.2691481746599857,0.5680448568830819,0.20824265480041504,0.0
88,3,KNeighbors Classifier,2,0.35,0.24820143884892087,0.37881593112667045,0.20936346054077148,0.0
89,3,SVC Classifier,2,0.35,0.1647482014388489,1.0,6.030335426330566,0.0
90,3,Decision Tree,2,0.35,0.19352517985611511,0.2709581502488572,0.17271924018859863,0.0
91,3,RandomForest,2,0.35,0.2712230215827338,0.24331549974446956,0.5180037021636963,0.0
92,3,AdaBoost (Discrete),2,0.35,0.18489208633093526,0.20019761905077216,42.31987476348877,0.0
93,3,AdaBoost (Real),2,0.35,0.2251798561151079,0.16348616024271917,89.60218954086304,0.0
94,3,Logistic Regression (Penalty = L2),2,0.35,0.2798561151079137,0.2257468280309505,1.946427822113037,0.0
95,3,Naive Bayes,2,0.35,0.27482014388489207,0.60392710346928,0.1522679328918457,0.0
96,4,KNeighbors Classifier,0,0.35,0.19560595322466337,0.27838142328994925,0.14046072959899902,0.0
97,4,SVC Classifier,0,0.35,0.1630049610205528,1.0,4.993884325027466,0.0
98,4,Decision Tree,0,0.35,0.2083628632175762,0.26778058560485773,0.04920792579650879,0.0
99,4,RandomForest,0,0.35,0.2296243798724309,0.2534241004624782,0.38825130462646484,0.0
100,4,AdaBoost (Discrete),0,0.35,0.184975194897236,0.22999452980079016,28.00165605545044,0.0
101,4,AdaBoost (Real),0,0.35,0.23883770375620128,0.22631956942835285,70.56209015846252,0.0
102,4,Logistic Regression (Penalty = L2),0,0.35,0.2289156626506024,0.25671441117321686,0.8999876976013184,0.0
103,4,Naive Bayes,0,0.35,0.24096385542168675,0.35262663089531215,0.1635589599609375,0.0
104,4,KNeighbors Classifier,1,0.35,0.21689334287759485,0.2671128843718056,0.17297887802124023,0.0
105,4,SVC Classifier,1,0.35,0.164638511095204,1.0,4.652747631072998,0.0
106,4,Decision Tree,1,0.35,0.23192555476020044,0.23545244881831534,0.08729338645935059,0.0
107,4,RandomForest,1,0.35,0.24695776664280603,0.26160927867220946,0.3985745906829834,0.0
108,4,AdaBoost (Discrete),1,0.35,0.2054402290622763,0.11968502514833106,26.907044887542725,0.0
109,4,AdaBoost (Real),1,0.35,0.24982104509663564,0.23970813167899505,69.77557396888733,0.0
110,4,Logistic Regression (Penalty = L2),1,0.35,0.23908375089477452,0.2533853210829476,1.1789228916168213,0.0
111,4,Naive Bayes,1,0.35,0.2712956335003579,0.4208865783505879,0.1281743049621582,0.0
112,4,KNeighbors Classifier,2,0.35,0.21294964028776978,0.3092271457616154,0.13072943687438965,0.0
113,4,SVC Classifier,2,0.35,0.1647482014388489,1.0,4.580738067626953,0.0
114,4,Decision Tree,2,0.35,0.20863309352517986,0.2707778677949908,0.044812679290771484,0.0
115,4,RandomForest,2,0.35,0.2712230215827338,0.3124228346127362,0.3955268859863281,0.0
116,4,AdaBoost (Discrete),2,0.35,0.21942446043165467,0.16062773950928397,25.74498701095581,0.0
117,4,AdaBoost (Real),2,0.35,0.14892086330935253,0.1154878859140706,69.5962266921997,0.0
118,4,Logistic Regression (Penalty = L2),2,0.35,0.2460431654676259,0.32200998852343854,1.011448860168457,0.0
119,4,Naive Bayes,2,0.35,0.2920863309352518,0.5734247646005461,0.10448455810546875,0.0
120,6,KNeighbors Classifier,0,0.35,0.19560595322466337,0.27838142328994925,0.1324326992034912,0.0
121,6,SVC Classifier,0,0.35,0.1630049610205528,1.0,4.676803112030029,0.0
122,6,Decision Tree,0,0.35,0.2083628632175762,0.26778058560485773,0.04567241668701172,0.0
123,6,RandomForest,0,0.35,0.2296243798724309,0.2534241004624782,0.3579981327056885,0.0
124,6,AdaBoost (Discrete),0,0.35,0.184975194897236,0.22999452980079016,24.10038447380066,0.0
125,6,AdaBoost (Real),0,0.35,0.23883770375620128,0.22631956942835285,68.52425217628479,0.0
126,6,Logistic Regression (Penalty = L2),0,0.35,0.2289156626506024,0.25671441117321686,0.9983465671539307,0.0
127,6,Naive Bayes,0,0.35,0.24096385542168675,0.35262663089531215,0.09725189208984375,0.0
128,6,KNeighbors Classifier,1,0.35,0.21689334287759485,0.2671128843718056,0.132828950881958,0.0
129,6,SVC Classifier,1,0.35,0.164638511095204,1.0,4.689424276351929,0.0
130,6,Decision Tree,1,0.35,0.23192555476020044,0.23545244881831534,0.04470682144165039,0.0
131,6,RandomForest,1,0.35,0.24695776664280603,0.26160927867220946,0.4821038246154785,0.0
132,6,AdaBoost (Discrete),1,0.35,0.2054402290622763,0.11968502514833106,25.978655099868774,0.0
133,6,AdaBoost (Real),1,0.35,0.24982104509663564,0.23970813167899505,68.48135638237,0.0
134,6,Logistic Regression (Penalty = L2),1,0.35,0.23908375089477452,0.2533853210829476,0.9687955379486084,0.0
135,6,Naive Bayes,1,0.35,0.2712956335003579,0.4208865783505879,0.16467499732971191,0.0
136,6,KNeighbors Classifier,2,0.35,0.21294964028776978,0.3092271457616154,0.1344304084777832,0.0
137,6,SVC Classifier,2,0.35,0.1647482014388489,1.0,4.4872331619262695,0.0
138,6,Decision Tree,2,0.35,0.20863309352517986,0.2707778677949908,0.045574188232421875,0.0
139,6,RandomForest,2,0.35,0.2712230215827338,0.3124228346127362,0.44064760208129883,0.0
140,6,AdaBoost (Discrete),2,0.35,0.21942446043165467,0.16062773950928397,25.18253755569458,0.0
141,6,AdaBoost (Real),2,0.35,0.14892086330935253,0.1154878859140706,65.29848313331604,0.0
142,6,Logistic Regression (Penalty = L2),2,0.35,0.2460431654676259,0.32200998852343854,0.8843367099761963,0.0
143,6,Naive Bayes,2,0.35,0.2920863309352518,0.5734247646005461,0.14956998825073242,0.0
144,7,KNeighbors Classifier,0,0.35,0.17576187101346563,0.31281238884761714,0.1371757984161377,0.0
145,7,SVC Classifier,0,0.35,0.1630049610205528,1.0,4.28238582611084,0.0
146,7,Decision Tree,0,0.35,0.1793054571226081,0.2417634426756623,0.11774039268493652,0.0
147,7,RandomForest,0,0.35,0.2147413182140326,0.29421492439923164,0.4334540367126465,0.0
148,7,AdaBoost (Discrete),0,0.35,0.1778880226789511,0.21831068366089945,28.09374737739563,0.0
149,7,AdaBoost (Real),0,0.35,0.14245216158752658,0.22075428113083415,68.13980984687805,0.0
150,7,Logistic Regression (Penalty = L2),0,0.35,0.23175053153791636,0.2923788704457281,0.9862353801727295,0.0
151,7,Naive Bayes,0,0.35,0.1913536498936924,0.36552258073912747,0.13450980186462402,0.0
152,7,KNeighbors Classifier,1,0.35,0.1889763779527559,0.3124671469917454,0.1150209903717041,0.0
153,7,SVC Classifier,1,0.35,0.164638511095204,1.0,3.834523916244507,0.0
154,7,Decision Tree,1,0.35,0.1639226914817466,0.20915767259931953,0.07318449020385742,0.0
155,7,RandomForest,1,0.35,0.2691481746599857,0.2921626735412612,0.32221341133117676,0.0
156,7,AdaBoost (Discrete),1,0.35,0.16034359341445956,0.13437798643266574,26.51320481300354,0.0
157,7,AdaBoost (Real),1,0.35,0.24982104509663564,0.3104355708572273,67.0748074054718,0.0
158,7,Logistic Regression (Penalty = L2),1,0.35,0.25196850393700787,0.3038450434995941,1.001464605331421,0.0
159,7,Naive Bayes,1,0.35,0.2534001431639227,0.5406044703063184,0.22631216049194336,0.0
160,7,KNeighbors Classifier,2,0.35,0.21079136690647482,0.27498662841149374,0.12077975273132324,0.0
161,7,SVC Classifier,2,0.35,0.1647482014388489,1.0,4.2210283279418945,0.0
162,7,Decision Tree,2,0.35,0.17841726618705037,0.25227201738392624,0.08040881156921387,0.0
163,7,RandomForest,2,0.35,0.2525179856115108,0.3087405882353873,0.4798002243041992,0.0
164,7,AdaBoost (Discrete),2,0.35,0.18705035971223022,0.28766848170825055,27.33019208908081,0.0
165,7,AdaBoost (Real),2,0.35,0.12158273381294964,0.23849922465510104,62.96586012840271,0.0
166,7,Logistic Regression (Penalty = L2),2,0.35,0.24028776978417266,0.2691840947151645,0.9849824905395508,0.0
167,7,Naive Bayes,2,0.35,0.26258992805755393,0.5489251472762021,0.15561294555664062,0.0
168,8,KNeighbors Classifier,0,0.35,0.20198440822111977,0.2512085807698358,0.1011819839477539,0.0
169,8,SVC Classifier,0,0.35,0.1630049610205528,1.0,3.986994504928589,0.0
170,8,Decision Tree,0,0.35,0.184975194897236,0.27530353423851006,0.07351040840148926,0.0
171,8,RandomForest,0,0.35,0.22608079376328843,0.3014466349407884,0.324099063873291,0.0
172,8,AdaBoost (Discrete),0,0.35,0.18993621545003544,0.17089528191275077,28.037632703781128,0.0
173,8,AdaBoost (Real),0,0.35,0.19631467044649184,0.23881263007554407,65.54244351387024,0.0
174,8,Logistic Regression (Penalty = L2),0,0.35,0.23600283486888732,0.24157636929339785,1.1979057788848877,0.0
175,8,Naive Bayes,0,0.35,0.19560595322466337,0.3824835408629704,0.18574881553649902,0.0
176,8,KNeighbors Classifier,1,0.35,0.2283464566929134,0.2627414759392405,0.11003684997558594,0.0
177,8,SVC Classifier,1,0.35,0.164638511095204,1.0,4.235822916030884,0.0
178,8,Decision Tree,1,0.35,0.20257695060844666,0.29560879354400355,0.1067044734954834,0.0
179,8,RandomForest,1,0.35,0.2691481746599857,0.28723421893887885,0.3262975215911865,0.0
180,8,AdaBoost (Discrete),1,0.35,0.18682891911238367,0.20715218864394735,28.877177476882935,0.0
181,8,AdaBoost (Real),1,0.35,0.25984251968503935,0.3481592682179051,66.2784481048584,0.0
182,8,Logistic Regression (Penalty = L2),1,0.35,0.2462419470293486,0.28304169615325664,1.3178768157958984,0.0
183,8,Naive Bayes,1,0.35,0.24910522548317823,0.5299855136980812,0.16172218322753906,0.0
184,8,KNeighbors Classifier,2,0.35,0.22949640287769785,0.35845242432893254,0.15460586547851562,0.0
185,8,SVC Classifier,2,0.35,0.1647482014388489,1.0,4.59786581993103,0.0
186,8,Decision Tree,2,0.35,0.19568345323741007,0.2976470397298347,0.07747912406921387,0.0
187,8,RandomForest,2,0.35,0.26834532374100717,0.2378422797235362,0.3661637306213379,0.0
188,8,AdaBoost (Discrete),2,0.35,0.21223021582733814,0.21686805514408955,34.008819580078125,0.0
189,8,AdaBoost (Real),2,0.35,0.24820143884892087,0.42561123828389447,86.14918279647827,0.0
190,8,Logistic Regression (Penalty = L2),2,0.35,0.2474820143884892,0.22367200746614627,1.6913807392120361,0.0
191,8,Naive Bayes,2,0.35,0.26834532374100717,0.6021612633422779,0.2047889232635498,0.0
192,9,KNeighbors Classifier,0,0.35,0.18001417434443656,0.28987172240355685,0.20492839813232422,0.0
193,9,SVC Classifier,0,0.35,0.1630049610205528,1.0,5.349284887313843,0.0
194,9,Decision Tree,0,0.35,0.16583982990786675,0.23010363500024172,0.10442233085632324,0.0
195,9,RandomForest,0,0.35,0.21545003543586108,0.237279238544194,0.48911476135253906,0.0
196,9,AdaBoost (Discrete),0,0.35,0.1856839121190645,0.17163843646316523,31.14064645767212,0.0
197,9,AdaBoost (Real),0,0.35,0.16654854712969525,0.27991730755099226,79.36344718933105,0.0
198,9,Logistic Regression (Penalty = L2),0,0.35,0.22608079376328843,0.28855958672966897,1.0368781089782715,0.0
199,9,Naive Bayes,0,0.35,0.22608079376328843,0.4030725150569617,0.14172148704528809,0.0
200,9,KNeighbors Classifier,1,0.35,0.19255547602004294,0.38013690993430443,0.09876251220703125,0.0
201,9,SVC Classifier,1,0.35,0.164638511095204,1.0,5.112509489059448,0.0
202,9,Decision Tree,1,0.35,0.17108088761632068,0.24535814774225995,0.14376378059387207,0.0
203,9,RandomForest,1,0.35,0.2641374373657838,0.3841842970193307,0.4723951816558838,0.0
204,9,AdaBoost (Discrete),1,0.35,0.19971367215461705,0.230903249990065,29.83942222595215,0.0
205,9,AdaBoost (Real),1,0.35,0.1896921975662133,0.22491116289475535,78.61326551437378,0.0
206,9,Logistic Regression (Penalty = L2),1,0.35,0.24695776664280603,0.29532217150510026,1.1191890239715576,0.0
207,9,Naive Bayes,1,0.35,0.2677165354330709,0.5342124736447023,0.15330290794372559,0.0
208,9,KNeighbors Classifier,2,0.35,0.20719424460431654,0.3981476202645386,0.13238000869750977,0.0
209,9,SVC Classifier,2,0.35,0.1647482014388489,1.0,5.233439207077026,0.0
210,9,Decision Tree,2,0.35,0.1841726618705036,0.2928428143107022,0.1415727138519287,0.0
211,9,RandomForest,2,0.35,0.2647482014388489,0.2394237313249874,0.5250482559204102,0.0
212,9,AdaBoost (Discrete),2,0.35,0.18920863309352517,0.18971353590678583,30.425610065460205,0.0
213,9,AdaBoost (Real),2,0.35,0.16618705035971224,0.1830304055844576,79.13866329193115,0.0
214,9,Logistic Regression (Penalty = L2),2,0.35,0.2474820143884892,0.2274315297484235,1.2142856121063232,0.0
215,9,Naive Bayes,2,0.35,0.27050359712230215,0.47399187995015973,0.13581109046936035,0.0
216,10,KNeighbors Classifier,0,0.35,0.1998582565556343,0.26025312959525776,0.18470025062561035,0.0
217,10,SVC Classifier,0,0.35,0.1630049610205528,1.0,6.2500224113464355,0.0
218,10,Decision Tree,0,0.35,0.19418851878100638,0.24629721819505043,0.15973877906799316,0.0
219,10,RandomForest,0,0.35,0.22820694542877393,0.31337264126187925,0.47063398361206055,0.0
220,10,AdaBoost (Discrete),0,0.35,0.19631467044649184,0.21069418632612283,42.48330473899841,0.0
221,10,AdaBoost (Real),0,0.35,0.1856839121190645,0.2276372691683846,94.58213400840759,0.0
222,10,Logistic Regression (Penalty = L2),0,0.35,0.24592487597448617,0.19221977609632793,1.8332171440124512,0.0
223,10,Naive Bayes,0,0.35,0.1856839121190645,0.3729663148621351,0.22885775566101074,0.0
224,10,KNeighbors Classifier,1,0.35,0.20901932712956334,0.2697980648619888,0.23884320259094238,0.0
225,10,SVC Classifier,1,0.35,0.164638511095204,1.0,5.948208332061768,0.0
226,10,Decision Tree,1,0.35,0.19899785254115962,0.2612393131746357,0.14301753044128418,0.0
227,10,RandomForest,1,0.35,0.25984251968503935,0.281126236597652,0.5282547473907471,0.0
228,10,AdaBoost (Discrete),1,0.35,0.2147458840372226,0.21950363745809695,41.22948908805847,0.0
229,10,AdaBoost (Real),1,0.35,0.21116678596993557,0.3145523019049791,86.99770903587341,0.0
230,10,Logistic Regression (Penalty = L2),1,0.35,0.2526843235504653,0.15812065401908812,1.9246983528137207,0.0
231,10,Naive Bayes,1,0.35,0.2455261274158912,0.5265598173333905,0.19125914573669434,0.0
232,10,KNeighbors Classifier,2,0.35,0.24028776978417266,0.37837727166740276,0.2022848129272461,0.0
233,10,SVC Classifier,2,0.35,0.1647482014388489,1.0,5.740905523300171,0.0
234,10,Decision Tree,2,0.35,0.20863309352517986,0.28607287823192573,0.143873929977417,0.0
235,10,RandomForest,2,0.35,0.2762589928057554,0.24098019078602498,0.5272274017333984,0.0
236,10,AdaBoost (Discrete),2,0.35,0.2079136690647482,0.17477682506925904,38.82042098045349,0.0
237,10,AdaBoost (Real),2,0.35,0.24820143884892087,0.42561123828389447,84.37488603591919,0.0
238,10,Logistic Regression (Penalty = L2),2,0.35,0.2446043165467626,0.13366768351834432,1.7513368129730225,0.0
239,10,Naive Bayes,2,0.35,0.25611510791366904,0.587874936708788,0.18120193481445312,0.0
240,11,KNeighbors Classifier,0,0.35,0.21048901488306165,0.32473667583796356,0.7018678188323975,0.0
241,11,SVC Classifier,0,0.35,0.19631467044649184,0.43374535059637953,7.259688377380371,0.0
242,11,Decision Tree,0,0.35,0.20340184266477676,0.30824794764784474,0.16583538055419922,0.0
243,11,RandomForest,0,0.35,0.23387668320340185,0.3112441209271001,0.5297360420227051,0.0
244,11,AdaBoost (Discrete),0,0.35,0.184975194897236,0.22496124135411114,48.53424596786499,0.0
245,11,AdaBoost (Real),0,0.35,0.2083628632175762,0.22034082197579732,86.35062980651855,0.0
246,11,Logistic Regression (Penalty = L2),0,0.35,0.25584691708008506,0.26152248242221937,2.460603952407837,0.0
247,11,Naive Bayes,0,0.35,0.0885896527285613,0.3109733177195326,0.2628977298736572,0.0
248,11,KNeighbors Classifier,1,0.35,0.2147458840372226,0.29397343503821965,0.5307703018188477,0.0
249,11,SVC Classifier,1,0.35,0.21045096635647817,0.46640548688179284,6.257615804672241,0.0
250,11,Decision Tree,1,0.35,0.21116678596993557,0.2800524861134606,0.13867545127868652,0.0
251,11,RandomForest,1,0.35,0.2648532569792412,0.3733293624689494,0.4438314437866211,0.0
252,11,AdaBoost (Discrete),1,0.35,0.20830350751610593,0.25530161485401354,41.718512296676636,0.0
253,11,AdaBoost (Real),1,0.35,0.25196850393700787,0.3673063952035098,86.20041394233704,0.0
254,11,Logistic Regression (Penalty = L2),1,0.35,0.25697924123120974,0.1978530366217609,2.8822474479675293,0.0
255,11,Naive Bayes,1,0.35,0.11882605583392986,0.3808541542719384,0.24336576461791992,0.0
256,11,KNeighbors Classifier,2,0.35,0.21654676258992805,0.3143517536764661,0.5640389919281006,0.0
257,11,SVC Classifier,2,0.35,0.2143884892086331,0.45368823166620964,6.8899102210998535,0.0
258,11,Decision Tree,2,0.35,0.18633093525179856,0.2599269784746577,0.13284063339233398,0.0
259,11,RandomForest,2,0.35,0.25971223021582734,0.3818117530171415,0.4416365623474121,0.0
260,11,AdaBoost (Discrete),2,0.35,0.20359712230215826,0.277552019321644,46.94379734992981,0.0
261,11,AdaBoost (Real),2,0.35,0.25323741007194245,0.31684278993912,90.36246132850647,0.0
262,11,Logistic Regression (Penalty = L2),2,0.35,0.26618705035971224,0.19854019800882877,3.7883951663970947,0.0
263,11,Naive Bayes,2,0.35,0.11654676258992806,0.5264717575272626,0.30743980407714844,0.0
