,feat_set_id,classifier,fold_id,feat_th,score,geo_score,exec_t,geo_score_woz
0,0,KNeighbors Classifier,0,0.45,0.7925659472422062,0.7905501331386667,1.0170464515686035,0.7905501331386667
1,0,SVC Classifier,0,0.45,0.8171462829736211,0.7998692160748524,3.0687122344970703,0.7998692160748524
2,0,Decision Tree,0,0.45,0.7511990407673861,0.7507747329516217,0.11196041107177734,0.7507747329516217
3,0,RandomForest,0,0.45,0.7434052757793765,0.7370453383241381,0.39473605155944824,0.7370453383241381
4,0,AdaBoost (Discrete),0,0.45,0.8129496402877698,0.8123439985131103,37.70886278152466,0.8123439985131103
5,0,AdaBoost (Real),0,0.45,0.7973621103117506,0.7968760735450829,45.61655116081238,0.7968760735450829
6,0,Logistic Regression (Penalty = L2),0,0.45,0.8369304556354916,0.8356674239189444,0.39902544021606445,0.8356674239189444
7,0,Naive Bayes,0,0.45,0.7817745803357314,0.7491657565833898,0.09984755516052246,0.7491657565833898
8,0,KNeighbors Classifier,1,0.45,0.7719087635054022,0.769879285709975,1.630652666091919,0.769879285709975
9,0,SVC Classifier,1,0.45,0.7971188475390156,0.7772298240593083,4.517394065856934,0.7772298240593083
10,0,Decision Tree,1,0.45,0.7364945978391356,0.7365415997017383,0.13534331321716309,0.7365415997017383
11,0,RandomForest,1,0.45,0.7539015606242497,0.7398269585615259,0.4845747947692871,0.7398269585615259
12,0,AdaBoost (Discrete),1,0.45,0.7815126050420168,0.7814026217698071,53.33647060394287,0.7814026217698071
13,0,AdaBoost (Real),1,0.45,0.7809123649459784,0.7807735851435321,56.87984848022461,0.7807735851435321
14,0,Logistic Regression (Penalty = L2),1,0.45,0.8145258103241296,0.8134871837811157,0.28750109672546387,0.8134871837811157
15,0,Naive Bayes,1,0.45,0.7791116446578632,0.7475511309183581,0.04566049575805664,0.7475511309183581
16,0,KNeighbors Classifier,2,0.45,0.7899159663865546,0.7873092528508754,1.6524336338043213,0.7873092528508754
17,0,SVC Classifier,2,0.45,0.8103241296518607,0.7913608657781098,4.187196254730225,0.7913608657781098
18,0,Decision Tree,2,0.45,0.7298919567827131,0.7299035886783264,0.1327512264251709,0.7299035886783264
19,0,RandomForest,2,0.45,0.7521008403361344,0.741220561497439,0.4375166893005371,0.741220561497439
20,0,AdaBoost (Discrete),2,0.45,0.812124849939976,0.8113466355396132,51.03874111175537,0.8113466355396132
21,0,AdaBoost (Real),2,0.45,0.8067226890756303,0.8056353752669831,52.37699365615845,0.8056353752669831
22,0,Logistic Regression (Penalty = L2),2,0.45,0.8373349339735895,0.8352757051009662,0.2452075481414795,0.8352757051009662
23,0,Naive Bayes,2,0.45,0.7965186074429772,0.7689662527954931,0.06403255462646484,0.7689662527954931
24,1,KNeighbors Classifier,0,0.45,0.8099520383693045,0.8087326234032302,1.2426903247833252,0.8087326234032302
25,1,SVC Classifier,0,0.45,0.8351318944844125,0.8269319191813412,3.614988088607788,0.8269319191813412
26,1,Decision Tree,0,0.45,0.7547961630695443,0.7535346582783784,0.14300918579101562,0.7535346582783784
27,1,RandomForest,0,0.45,0.7613908872901679,0.74418525394122,0.4252192974090576,0.74418525394122
28,1,AdaBoost (Discrete),0,0.45,0.8273381294964028,0.8266496485477045,46.35882639884949,0.8266496485477045
29,1,AdaBoost (Real),0,0.45,0.829136690647482,0.8291122431379078,51.76236844062805,0.8291122431379078
30,1,Logistic Regression (Penalty = L2),0,0.45,0.8507194244604317,0.8502562459474412,0.18094134330749512,0.8502562459474412
31,1,Naive Bayes,0,0.45,0.8207434052757794,0.8084363530553412,0.07114839553833008,0.8084363530553412
32,1,KNeighbors Classifier,1,0.45,0.7929171668667467,0.7916281181255272,1.3493311405181885,0.7916281181255272
33,1,SVC Classifier,1,0.45,0.8205282112845138,0.8122613247066378,3.397190570831299,0.8122613247066378
34,1,Decision Tree,1,0.45,0.734093637454982,0.7337482079163897,0.10922980308532715,0.7337482079163897
35,1,RandomForest,1,0.45,0.7352941176470589,0.721925958165938,0.3970451354980469,0.721925958165938
36,1,AdaBoost (Discrete),1,0.45,0.8037214885954381,0.8029967789175642,45.21820259094238,0.8029967789175642
37,1,AdaBoost (Real),1,0.45,0.8085234093637454,0.8080915805602913,52.329506397247314,0.8080915805602913
38,1,Logistic Regression (Penalty = L2),1,0.45,0.8349339735894358,0.8343743639780701,0.20413541793823242,0.8343743639780701
39,1,Naive Bayes,1,0.45,0.804921968787515,0.7918920856932158,0.05515933036804199,0.7918920856932158
40,1,KNeighbors Classifier,2,0.45,0.8013205282112845,0.8003581053027817,1.257988691329956,0.8003581053027817
41,1,SVC Classifier,2,0.45,0.8355342136854742,0.8248651214992045,3.396822690963745,0.8248651214992045
42,1,Decision Tree,2,0.45,0.7310924369747899,0.7302588634349793,0.10436010360717773,0.7302588634349793
43,1,RandomForest,2,0.45,0.7773109243697479,0.76021537546206,0.35866498947143555,0.76021537546206
44,1,AdaBoost (Discrete),2,0.45,0.8061224489795918,0.8051715280558726,45.10174775123596,0.8051715280558726
45,1,AdaBoost (Real),2,0.45,0.8181272509003601,0.8171882504877355,52.81500482559204,0.8171882504877355
46,1,Logistic Regression (Penalty = L2),2,0.45,0.8463385354141657,0.8451369115557101,0.21102428436279297,0.8451369115557101
47,1,Naive Bayes,2,0.45,0.8217286914765907,0.809234760773296,0.07918071746826172,0.809234760773296
48,2,KNeighbors Classifier,0,0.45,0.789568345323741,0.7879118049614161,1.4148545265197754,0.7879118049614161
49,2,SVC Classifier,0,0.45,0.8177458033573142,0.8052936285323806,3.516136884689331,0.8052936285323806
50,2,Decision Tree,0,0.45,0.7254196642685852,0.7252921525748218,0.10779643058776855,0.7252921525748218
51,2,RandomForest,0,0.45,0.776378896882494,0.7698996093625833,0.3609941005706787,0.7698996093625833
52,2,AdaBoost (Discrete),0,0.45,0.7991606714628298,0.7982566357012786,44.943222999572754,0.7982566357012786
53,2,AdaBoost (Real),0,0.45,0.8165467625899281,0.8157780264801439,57.00132489204407,0.8157780264801439
54,2,Logistic Regression (Penalty = L2),0,0.45,0.8387290167865707,0.8377144324360114,0.42742490768432617,0.8377144324360114
55,2,Naive Bayes,0,0.45,0.7991606714628298,0.7803645372263632,0.08775115013122559,0.7803645372263632
56,2,KNeighbors Classifier,1,0.45,0.7701080432172869,0.7691362973318254,1.8862931728363037,0.7691362973318254
57,2,SVC Classifier,1,0.45,0.8127250900360145,0.8031878938059979,5.093950033187866,0.8031878938059979
58,2,Decision Tree,1,0.45,0.7130852340936374,0.7127994750042138,0.15712952613830566,0.7127994750042138
59,2,RandomForest,1,0.45,0.737094837935174,0.7221805160002098,0.5748765468597412,0.7221805160002098
60,2,AdaBoost (Discrete),1,0.45,0.7821128451380552,0.7797483642231885,64.35853862762451,0.7797483642231885
61,2,AdaBoost (Real),1,0.45,0.7839135654261705,0.7827185607586639,73.9368188381195,0.7827185607586639
62,2,Logistic Regression (Penalty = L2),1,0.45,0.8163265306122449,0.8154534294091773,0.30989956855773926,0.8154534294091773
63,2,Naive Bayes,1,0.45,0.8043217286914766,0.7889530592145148,0.11139512062072754,0.7889530592145148
64,2,KNeighbors Classifier,2,0.45,0.78031212484994,0.7789019189595957,1.8565287590026855,0.7789019189595957
65,2,SVC Classifier,2,0.45,0.8163265306122449,0.8021989459772706,5.06556248664856,0.8021989459772706
66,2,Decision Tree,2,0.45,0.723889555822329,0.7227727737941079,0.30314064025878906,0.7227727737941079
67,2,RandomForest,2,0.45,0.734093637454982,0.7079659020157041,0.6333682537078857,0.7079659020157041
68,2,AdaBoost (Discrete),2,0.45,0.7989195678271308,0.7979928497448402,64.97932767868042,0.7979928497448402
69,2,AdaBoost (Real),2,0.45,0.8061224489795918,0.8052088794983122,74.86619853973389,0.8052088794983122
70,2,Logistic Regression (Penalty = L2),2,0.45,0.8433373349339736,0.8416929754249683,0.3403947353363037,0.8416929754249683
71,2,Naive Bayes,2,0.45,0.8175270108043218,0.7995611981801463,0.06299304962158203,0.7995611981801463
72,3,KNeighbors Classifier,0,0.45,0.7985611510791367,0.7969660884325632,2.068939208984375,0.7969660884325632
73,3,SVC Classifier,0,0.45,0.8207434052757794,0.8123283772989217,5.120076894760132,0.8123283772989217
74,3,Decision Tree,0,0.45,0.7476019184652278,0.7466393876394145,0.20658278465270996,0.7466393876394145
75,3,RandomForest,0,0.45,0.7697841726618705,0.7619381229423499,0.5207560062408447,0.7619381229423499
76,3,AdaBoost (Discrete),0,0.45,0.815347721822542,0.8152870749829997,59.34318661689758,0.8152870749829997
77,3,AdaBoost (Real),0,0.45,0.8165467625899281,0.8160835373260528,70.77331638336182,0.8160835373260528
78,3,Logistic Regression (Penalty = L2),0,0.45,0.8399280575539568,0.8389737724306668,0.35082411766052246,0.8389737724306668
79,3,Naive Bayes,0,0.45,0.815947242206235,0.8054131182124329,0.09974861145019531,0.8054131182124329
80,3,KNeighbors Classifier,1,0.45,0.7809123649459784,0.7794108963435976,1.8832361698150635,0.7794108963435976
81,3,SVC Classifier,1,0.45,0.8079231692677071,0.7981203504248068,5.078509330749512,0.7981203504248068
82,3,Decision Tree,1,0.45,0.7250900360144058,0.7246818761412172,0.20669770240783691,0.7246818761412172
83,3,RandomForest,1,0.45,0.7563025210084033,0.7444676789495513,0.5729179382324219,0.7444676789495513
84,3,AdaBoost (Discrete),1,0.45,0.7899159663865546,0.7896128955626251,66.93235611915588,0.7896128955626251
85,3,AdaBoost (Real),1,0.45,0.7959183673469388,0.7957000610145744,72.20068120956421,0.7957000610145744
86,3,Logistic Regression (Penalty = L2),1,0.45,0.8211284513805522,0.819932152496555,0.30585575103759766,0.819932152496555
87,3,Naive Bayes,1,0.45,0.7935174069627852,0.7806148864025523,0.08722400665283203,0.7806148864025523
88,3,KNeighbors Classifier,2,0.45,0.7851140456182473,0.7834594808532543,1.8390510082244873,0.7834594808532543
89,3,SVC Classifier,2,0.45,0.8241296518607443,0.8137143795651538,4.566166400909424,0.8137143795651538
90,3,Decision Tree,2,0.45,0.7388955582232893,0.7384133149768919,0.16031336784362793,0.7384133149768919
91,3,RandomForest,2,0.45,0.7575030012004802,0.7439043606256086,0.5260303020477295,0.7439043606256086
92,3,AdaBoost (Discrete),2,0.45,0.8073229291716687,0.806242797980034,59.85645794868469,0.806242797980034
93,3,AdaBoost (Real),2,0.45,0.8205282112845138,0.8199255906446817,84.04708075523376,0.8199255906446817
94,3,Logistic Regression (Penalty = L2),2,0.45,0.8397358943577431,0.8383402651933035,0.3703017234802246,0.8383402651933035
95,3,Naive Bayes,2,0.45,0.8067226890756303,0.795345443574084,0.12871694564819336,0.795345443574084
96,4,KNeighbors Classifier,0,0.45,0.7913669064748201,0.7894512330219645,1.422135829925537,0.7894512330219645
97,4,SVC Classifier,0,0.45,0.802757793764988,0.7876382354266028,5.835053443908691,0.7876382354266028
98,4,Decision Tree,0,0.45,0.7410071942446043,0.7403650036460507,0.19432997703552246,0.7403650036460507
99,4,RandomForest,0,0.45,0.7553956834532374,0.7521897451345295,0.639836311340332,0.7521897451345295
100,4,AdaBoost (Discrete),0,0.45,0.7871702637889688,0.7867673998743143,69.79030966758728,0.7867673998743143
101,4,AdaBoost (Real),0,0.45,0.7787769784172662,0.7735645489031469,85.50243902206421,0.7735645489031469
102,4,Logistic Regression (Penalty = L2),0,0.45,0.829736211031175,0.8281579487702835,0.49663209915161133,0.8281579487702835
103,4,Naive Bayes,0,0.45,0.7925659472422062,0.7741034417999118,0.12689542770385742,0.7741034417999118
104,4,KNeighbors Classifier,1,0.45,0.7707082833133253,0.7688182666821881,1.4801037311553955,0.7688182666821881
105,4,SVC Classifier,1,0.45,0.7899159663865546,0.7747751152199603,5.7352564334869385,0.7747751152199603
106,4,Decision Tree,1,0.45,0.7388955582232893,0.7372287483400839,0.19247794151306152,0.7372287483400839
107,4,RandomForest,1,0.45,0.7430972388955582,0.737176556254829,0.704702615737915,0.737176556254829
108,4,AdaBoost (Discrete),1,0.45,0.7701080432172869,0.7700711695564467,69.02535963058472,0.7700711695564467
109,4,AdaBoost (Real),1,0.45,0.7791116446578632,0.7791578841173439,82.6679093837738,0.7791578841173439
110,4,Logistic Regression (Penalty = L2),1,0.45,0.8103241296518607,0.8094377659022558,0.30419278144836426,0.8094377659022558
111,4,Naive Bayes,1,0.45,0.7821128451380552,0.7619000911241885,0.06591916084289551,0.7619000911241885
112,4,KNeighbors Classifier,2,0.45,0.7797118847539015,0.7783946628299327,1.4287686347961426,0.7783946628299327
113,4,SVC Classifier,2,0.45,0.801920768307323,0.7872165155359145,6.02524995803833,0.7872165155359145
114,4,Decision Tree,2,0.45,0.7178871548619448,0.7170017576429075,0.2046046257019043,0.7170017576429075
115,4,RandomForest,2,0.45,0.7136854741896759,0.7049456439365975,0.6397509574890137,0.7049456439365975
116,4,AdaBoost (Discrete),2,0.45,0.7623049219687875,0.7606318259217518,70.63599443435669,0.7606318259217518
117,4,AdaBoost (Real),2,0.45,0.7845138055222088,0.7839855238017469,83.13568186759949,0.7839855238017469
118,4,Logistic Regression (Penalty = L2),2,0.45,0.8235294117647058,0.8215412781515833,0.37735581398010254,0.8215412781515833
119,4,Naive Bayes,2,0.45,0.7953181272509003,0.7790700407587233,0.08156824111938477,0.7790700407587233
120,5,KNeighbors Classifier,0,0.45,0.7751798561151079,0.7740738852184853,1.1385531425476074,0.7740738852184853
121,5,SVC Classifier,0,0.45,0.7973621103117506,0.7801240577717118,5.430032253265381,0.7801240577717118
122,5,Decision Tree,0,0.45,0.7170263788968825,0.7160071604840984,0.18938279151916504,0.7160071604840984
123,5,RandomForest,0,0.45,0.7511990407673861,0.7357403686357099,0.6410572528839111,0.7357403686357099
124,5,AdaBoost (Discrete),0,0.45,0.7583932853717026,0.7561785353547746,64.88918447494507,0.7561785353547746
125,5,AdaBoost (Real),0,0.45,0.7751798561151079,0.7701069072510818,77.59728002548218,0.7701069072510818
126,5,Logistic Regression (Penalty = L2),0,0.45,0.8117505995203836,0.809772668307215,0.28927040100097656,0.809772668307215
127,5,Naive Bayes,0,0.45,0.7871702637889688,0.7658321925032869,0.07336807250976562,0.7658321925032869
128,5,KNeighbors Classifier,1,0.45,0.7496998799519808,0.7478972822926017,1.1196482181549072,0.7478972822926017
129,5,SVC Classifier,1,0.45,0.7869147659063626,0.7709053523104326,5.837879657745361,0.7709053523104326
130,5,Decision Tree,1,0.45,0.7184873949579832,0.7176940338750701,0.14042139053344727,0.7176940338750701
131,5,RandomForest,1,0.45,0.7436974789915967,0.7394568492011494,0.7029826641082764,0.7394568492011494
132,5,AdaBoost (Discrete),1,0.45,0.7557022809123649,0.755697275847747,64.43072485923767,0.755697275847747
133,5,AdaBoost (Real),1,0.45,0.7623049219687875,0.7621236595779515,77.36222505569458,0.7621236595779515
134,5,Logistic Regression (Penalty = L2),1,0.45,0.7971188475390156,0.7955640691095641,0.284625768661499,0.7955640691095641
135,5,Naive Bayes,1,0.45,0.7785114045618248,0.7609188900922039,0.06920051574707031,0.7609188900922039
136,5,KNeighbors Classifier,2,0.45,0.7653061224489796,0.7639421176912433,1.2102515697479248,0.7639421176912433
137,5,SVC Classifier,2,0.45,0.7965186074429772,0.7796819348171572,5.851634979248047,0.7796819348171572
138,5,Decision Tree,2,0.45,0.6968787515006002,0.6951911970720115,0.17868494987487793,0.6951911970720115
139,5,RandomForest,2,0.45,0.7490996398559424,0.7412472532006565,0.6653263568878174,0.7412472532006565
140,5,AdaBoost (Discrete),2,0.45,0.7623049219687875,0.7611328364025018,60.64570951461792,0.7611328364025018
141,5,AdaBoost (Real),2,0.45,0.790516206482593,0.7893685410575376,76.44033527374268,0.7893685410575376
142,5,Logistic Regression (Penalty = L2),2,0.45,0.8079231692677071,0.8054953785449903,0.35683107376098633,0.8054953785449903
143,5,Naive Bayes,2,0.45,0.7971188475390156,0.7792968087292986,0.05755734443664551,0.7792968087292986
144,6,KNeighbors Classifier,0,0.45,0.7799760191846523,0.7776513879027521,1.5320734977722168,0.7776513879027521
145,6,SVC Classifier,0,0.45,0.7985611510791367,0.7853791073183868,5.99083948135376,0.7853791073183868
146,6,Decision Tree,0,0.45,0.7302158273381295,0.7282939293724684,0.19091081619262695,0.7282939293724684
147,6,RandomForest,0,0.45,0.7523980815347722,0.7482685934640537,0.5862092971801758,0.7482685934640537
148,6,AdaBoost (Discrete),0,0.45,0.763189448441247,0.7602393246210546,69.57195210456848,0.7602393246210546
149,6,AdaBoost (Real),0,0.45,0.7673860911270983,0.7610358455246353,84.27574634552002,0.7610358455246353
150,6,Logistic Regression (Penalty = L2),0,0.45,0.8225419664268585,0.8203182079193039,0.37603163719177246,0.8203182079193039
151,6,Naive Bayes,0,0.45,0.789568345323741,0.7724357793580764,0.13590431213378906,0.7724357793580764
152,6,KNeighbors Classifier,1,0.45,0.7551020408163265,0.7524481318572123,1.832895278930664,0.7524481318572123
153,6,SVC Classifier,1,0.45,0.7869147659063626,0.7712836520274827,7.039242744445801,0.7712836520274827
154,6,Decision Tree,1,0.45,0.7142857142857143,0.7131902484337267,0.3006918430328369,0.7131902484337267
155,6,RandomForest,1,0.45,0.71968787515006,0.7141337413718913,0.7583050727844238,0.7141337413718913
156,6,AdaBoost (Discrete),1,0.45,0.7460984393757503,0.743774280765769,85.79771757125854,0.743774280765769
157,6,AdaBoost (Real),1,0.45,0.7509003601440576,0.7501683348009531,103.0094153881073,0.7501683348009531
158,6,Logistic Regression (Penalty = L2),1,0.45,0.7995198079231692,0.7985658793497714,0.5679271221160889,0.7985658793497714
159,6,Naive Bayes,1,0.45,0.7707082833133253,0.7527571924740061,0.16605424880981445,0.7527571924740061
160,6,KNeighbors Classifier,2,0.45,0.7695078031212484,0.7679687904366914,2.056835174560547,0.7679687904366914
161,6,SVC Classifier,2,0.45,0.7959183673469388,0.7799837012528202,7.2811033725738525,0.7799837012528202
162,6,Decision Tree,2,0.45,0.7202881152460985,0.719940502933781,0.16192626953125,0.719940502933781
163,6,RandomForest,2,0.45,0.7106842737094838,0.7006768550481858,0.7147791385650635,0.7006768550481858
164,6,AdaBoost (Discrete),2,0.45,0.7719087635054022,0.7706284481586486,84.5422854423523,0.7706284481586486
165,6,AdaBoost (Real),2,0.45,0.748499399759904,0.7404260738432121,100.57814335823059,0.7404260738432121
166,6,Logistic Regression (Penalty = L2),2,0.45,0.8241296518607443,0.8218143285466922,0.6183569431304932,0.8218143285466922
167,6,Naive Bayes,2,0.45,0.7869147659063626,0.7718271362090239,0.15085101127624512,0.7718271362090239
168,7,KNeighbors Classifier,0,0.45,0.7667865707434053,0.7659453082459673,1.0181877613067627,0.7659453082459673
169,7,SVC Classifier,0,0.45,0.8015587529976019,0.796994078398544,6.90526270866394,0.796994078398544
170,7,Decision Tree,0,0.45,0.737410071942446,0.7360987300508598,0.23536014556884766,0.7360987300508598
171,7,RandomForest,0,0.45,0.7488009592326139,0.7454041918005001,0.7228298187255859,0.7454041918005001
172,7,AdaBoost (Discrete),0,0.45,0.7571942446043165,0.7486831840486349,73.31415700912476,0.7486831840486349
173,7,AdaBoost (Real),0,0.45,0.7553956834532374,0.7480712686061151,85.55125045776367,0.7480712686061151
174,7,Logistic Regression (Penalty = L2),0,0.45,0.8069544364508393,0.8055736221769666,0.32384490966796875,0.8055736221769666
175,7,Naive Bayes,0,0.45,0.8033573141486811,0.7996779127883662,0.15859508514404297,0.7996779127883662
176,7,KNeighbors Classifier,1,0.45,0.7653061224489796,0.764481776515095,1.134099006652832,0.764481776515095
177,7,SVC Classifier,1,0.45,0.7971188475390156,0.7927924804195885,7.090559720993042,0.7927924804195885
178,7,Decision Tree,1,0.45,0.6902761104441777,0.689265697619263,0.2260596752166748,0.689265697619263
179,7,RandomForest,1,0.45,0.7382953181272509,0.7354215551110003,0.6020801067352295,0.7354215551110003
180,7,AdaBoost (Discrete),1,0.45,0.7178871548619448,0.7099894947097929,71.40044522285461,0.7099894947097929
181,7,AdaBoost (Real),1,0.45,0.7256902761104442,0.7079717281686059,86.60960865020752,0.7079717281686059
182,7,Logistic Regression (Penalty = L2),1,0.45,0.7965186074429772,0.7953098591717158,0.3983321189880371,0.7953098591717158
183,7,Naive Bayes,1,0.45,0.7899159663865546,0.7859705419222834,0.1596987247467041,0.7859705419222834
184,7,KNeighbors Classifier,2,0.45,0.762905162064826,0.7622418229732439,1.0303966999053955,0.7622418229732439
185,7,SVC Classifier,2,0.45,0.7941176470588235,0.7887929917360627,6.889792203903198,0.7887929917360627
186,7,Decision Tree,2,0.45,0.7118847539015606,0.711410692288121,0.1614842414855957,0.711410692288121
187,7,RandomForest,2,0.45,0.7358943577430972,0.7252995680039912,0.8773987293243408,0.7252995680039912
188,7,AdaBoost (Discrete),2,0.45,0.7262905162064826,0.7187566490554265,74.01702404022217,0.7187566490554265
189,7,AdaBoost (Real),2,0.45,0.7581032412965186,0.7513601116291868,89.51875400543213,0.7513601116291868
190,7,Logistic Regression (Penalty = L2),2,0.45,0.8133253301320528,0.8125615729310075,0.47789740562438965,0.8125615729310075
191,7,Naive Bayes,2,0.45,0.7893157262905162,0.7851367246501685,0.15054631233215332,0.7851367246501685
192,8,KNeighbors Classifier,0,0.45,0.8069544364508393,0.8054581030864699,1.7824816703796387,0.8054581030864699
193,8,SVC Classifier,0,0.45,0.8243405275779376,0.8192381360732811,7.168642044067383,0.8192381360732811
194,8,Decision Tree,0,0.45,0.738009592326139,0.7376246525120196,0.23374366760253906,0.7376246525120196
195,8,RandomForest,0,0.45,0.7703836930455635,0.7690881899854884,0.7867836952209473,0.7690881899854884
196,8,AdaBoost (Discrete),0,0.45,0.8117505995203836,0.8117527485234943,82.5008316040039,0.8117527485234943
197,8,AdaBoost (Real),0,0.45,0.8195443645083933,0.8190508358109458,97.68464207649231,0.8190508358109458
198,8,Logistic Regression (Penalty = L2),0,0.45,0.8315347721822542,0.8305850159830522,0.3845975399017334,0.8305850159830522
199,8,Naive Bayes,0,0.45,0.8183453237410072,0.8122530760295875,0.16124916076660156,0.8122530760295875
200,8,KNeighbors Classifier,1,0.45,0.7821128451380552,0.7804957432885932,1.5842468738555908,0.7804957432885932
201,8,SVC Classifier,1,0.45,0.7977190876350541,0.7910819229048852,7.147848844528198,0.7910819229048852
202,8,Decision Tree,1,0.45,0.7118847539015606,0.7114920387769141,0.2301158905029297,0.7114920387769141
203,8,RandomForest,1,0.45,0.726890756302521,0.7258628989020735,0.8424379825592041,0.7258628989020735
204,8,AdaBoost (Discrete),1,0.45,0.7713085234093637,0.7696878713870523,81.06595373153687,0.7696878713870523
205,8,AdaBoost (Real),1,0.45,0.7767106842737095,0.7765433046900188,95.72326970100403,0.7765433046900188
206,8,Logistic Regression (Penalty = L2),1,0.45,0.8157262905162065,0.8151512063856906,0.36759090423583984,0.8151512063856906
207,8,Naive Bayes,1,0.45,0.790516206482593,0.7830969834104347,0.07421064376831055,0.7830969834104347
208,8,KNeighbors Classifier,2,0.45,0.787515006002401,0.7863409239676471,1.7333264350891113,0.7863409239676471
209,8,SVC Classifier,2,0.45,0.8157262905162065,0.8082951989843863,6.608789443969727,0.8082951989843863
210,8,Decision Tree,2,0.45,0.726890756302521,0.7264838707781904,0.22402358055114746,0.7264838707781904
211,8,RandomForest,2,0.45,0.698079231692677,0.6872056557582807,0.6975421905517578,0.6872056557582807
212,8,AdaBoost (Discrete),2,0.45,0.7779111644657863,0.7760461160952119,81.67325472831726,0.7760461160952119
213,8,AdaBoost (Real),2,0.45,0.7887154861944778,0.7869248933030388,96.90920090675354,0.7869248933030388
214,8,Logistic Regression (Penalty = L2),2,0.45,0.8301320528211285,0.8290784947411227,0.39591002464294434,0.8290784947411227
215,8,Naive Bayes,2,0.45,0.8043217286914766,0.7969366461364105,0.07492709159851074,0.7969366461364105
216,9,KNeighbors Classifier,0,0.45,0.7476019184652278,0.7466144477251421,0.9592785835266113,0.7466144477251421
217,9,SVC Classifier,0,0.45,0.7949640287769785,0.7882585138583452,6.572989225387573,0.7882585138583452
218,9,Decision Tree,0,0.45,0.697242206235012,0.696125133701067,0.22742438316345215,0.696125133701067
219,9,RandomForest,0,0.45,0.7326139088729017,0.7221239594025389,0.7342419624328613,0.7221239594025389
220,9,AdaBoost (Discrete),0,0.45,0.7218225419664268,0.7205542943781694,70.44790434837341,0.7205542943781694
221,9,AdaBoost (Real),0,0.45,0.7535971223021583,0.7493209529082049,86.03376770019531,0.7493209529082049
222,9,Logistic Regression (Penalty = L2),0,0.45,0.8033573141486811,0.8020531887423022,0.39076900482177734,0.8020531887423022
223,9,Naive Bayes,0,0.45,0.789568345323741,0.7822725228453233,0.08048677444458008,0.7822725228453233
224,9,KNeighbors Classifier,1,0.45,0.7430972388955582,0.7413216736761225,1.0448758602142334,0.7413216736761225
225,9,SVC Classifier,1,0.45,0.7827130852340937,0.7751908266056948,6.618151664733887,0.7751908266056948
226,9,Decision Tree,1,0.45,0.6932773109243697,0.6930462433433884,0.22650456428527832,0.6930462433433884
227,9,RandomForest,1,0.45,0.7274909963985594,0.7213205373954822,0.68794846534729,0.7213205373954822
228,9,AdaBoost (Discrete),1,0.45,0.7244897959183674,0.7219868694310569,70.79278302192688,0.7219868694310569
229,9,AdaBoost (Real),1,0.45,0.7088835534213686,0.7079016681497843,84.95270156860352,0.7079016681497843
230,9,Logistic Regression (Penalty = L2),1,0.45,0.7965186074429772,0.7948973376923996,0.30812525749206543,0.7948973376923996
231,9,Naive Bayes,1,0.45,0.7809123649459784,0.7730813948765772,0.08450675010681152,0.7730813948765772
232,9,KNeighbors Classifier,2,0.45,0.7545018007202882,0.753106944133068,1.047527551651001,0.753106944133068
233,9,SVC Classifier,2,0.45,0.7743097238895558,0.7634251550171874,6.675386667251587,0.7634251550171874
234,9,Decision Tree,2,0.45,0.7118847539015606,0.7098420042515953,0.1425023078918457,0.7098420042515953
235,9,RandomForest,2,0.45,0.7112845138055222,0.6990546856418154,0.7651469707489014,0.6990546856418154
236,9,AdaBoost (Discrete),2,0.45,0.6962785114045619,0.6959371268513258,70.58430862426758,0.6959371268513258
237,9,AdaBoost (Real),2,0.45,0.7322929171668667,0.7313501290053869,87.00878977775574,0.7313501290053869
238,9,Logistic Regression (Penalty = L2),2,0.45,0.8013205282112845,0.7996506012701781,0.41336750984191895,0.7996506012701781
239,9,Naive Bayes,2,0.45,0.7701080432172869,0.7606852430431578,0.08948516845703125,0.7606852430431578
240,10,KNeighbors Classifier,0,0.45,0.8039568345323741,0.8026389367483965,3.0215888023376465,0.8026389367483965
241,10,SVC Classifier,0,0.45,0.8309352517985612,0.8191881017409214,7.265965938568115,0.8191881017409214
242,10,Decision Tree,0,0.45,0.7595923261390888,0.7583094052227453,0.3011360168457031,0.7583094052227453
243,10,RandomForest,0,0.45,0.7601918465227818,0.7468984526183102,0.8355910778045654,0.7468984526183102
244,10,AdaBoost (Discrete),0,0.45,0.8345323741007195,0.8345474503489779,102.62568187713623,0.8345474503489779
245,10,AdaBoost (Real),0,0.45,0.8279376498800959,0.8276267429183688,115.3590145111084,0.8276267429183688
246,10,Logistic Regression (Penalty = L2),0,0.45,0.8471223021582733,0.8461159597718011,0.43961143493652344,0.8461159597718011
247,10,Naive Bayes,0,0.45,0.8015587529976019,0.776656109835666,0.1710519790649414,0.776656109835666
248,10,KNeighbors Classifier,1,0.45,0.7911164465786314,0.789975540939499,3.0436582565307617,0.789975540939499
249,10,SVC Classifier,1,0.45,0.8211284513805522,0.8109312788507699,7.573716163635254,0.8109312788507699
250,10,Decision Tree,1,0.45,0.7400960384153662,0.7398445642670811,0.40953564643859863,0.7398445642670811
251,10,RandomForest,1,0.45,0.7593037214885955,0.748980383710171,0.7417936325073242,0.748980383710171
252,10,AdaBoost (Discrete),1,0.45,0.8013205282112845,0.8011155190922341,101.81672286987305,0.8011155190922341
253,10,AdaBoost (Real),1,0.45,0.812124849939976,0.8114481908207115,116.57842016220093,0.8114481908207115
254,10,Logistic Regression (Penalty = L2),1,0.45,0.826530612244898,0.8257248834818331,0.5000534057617188,0.8257248834818331
255,10,Naive Bayes,1,0.45,0.7941176470588235,0.7720591939971231,0.08227276802062988,0.7720591939971231
256,10,KNeighbors Classifier,2,0.45,0.7977190876350541,0.7955518884616546,3.2095072269439697,0.7955518884616546
257,10,SVC Classifier,2,0.45,0.84093637454982,0.8286600887782679,7.773388385772705,0.8286600887782679
258,10,Decision Tree,2,0.45,0.7334933973589436,0.7330167059079016,0.239715576171875,0.7330167059079016
259,10,RandomForest,2,0.45,0.7791116446578632,0.7709181277003279,0.8717443943023682,0.7709181277003279
260,10,AdaBoost (Discrete),2,0.45,0.8199279711884754,0.8198824697730875,101.4532880783081,0.8198824697730875
261,10,AdaBoost (Real),2,0.45,0.8319327731092437,0.8317775311597626,117.08262729644775,0.8317775311597626
262,10,Logistic Regression (Penalty = L2),2,0.45,0.8475390156062425,0.8462410003640267,0.3994283676147461,0.8462410003640267
263,10,Naive Bayes,2,0.45,0.8145258103241296,0.7943995002526728,0.16276168823242188,0.7943995002526728
264,11,KNeighbors Classifier,0,0.45,0.814748201438849,0.8144549977892602,5.734644174575806,0.8144549977892602
265,11,SVC Classifier,0,0.45,0.8369304556354916,0.8235703870657464,8.540149211883545,0.8235703870657464
266,11,Decision Tree,0,0.45,0.7553956834532374,0.7536556960874005,0.30438780784606934,0.7536556960874005
267,11,RandomForest,0,0.45,0.7553956834532374,0.7299745650736819,0.8269908428192139,0.7299745650736819
268,11,AdaBoost (Discrete),0,0.45,0.8447242206235012,0.8447839465483659,125.67786383628845,0.8447839465483659
269,11,AdaBoost (Real),0,0.45,0.8441247002398081,0.8441754771056952,134.115807056427,0.8441754771056952
270,11,Logistic Regression (Penalty = L2),0,0.45,0.8657074340527577,0.8649965858805271,0.6747064590454102,0.8649965858805271
271,11,Naive Bayes,0,0.45,0.8057553956834532,0.7762139436063658,0.14788246154785156,0.7762139436063658
272,11,KNeighbors Classifier,1,0.45,0.7929171668667467,0.7919668838341808,5.371030569076538,0.7919668838341808
273,11,SVC Classifier,1,0.45,0.8277310924369747,0.8164984117633962,7.95816707611084,0.8164984117633962
274,11,Decision Tree,1,0.45,0.7064825930372148,0.7059524725109024,0.26641058921813965,0.7059524725109024
275,11,RandomForest,1,0.45,0.7503001200480192,0.7419531042372038,0.7562785148620605,0.7419531042372038
276,11,AdaBoost (Discrete),1,0.45,0.8223289315726291,0.8223317224700207,119.08597874641418,0.8223317224700207
277,11,AdaBoost (Real),1,0.45,0.8139255702280912,0.81341154232078,132.84185552597046,0.81341154232078
278,11,Logistic Regression (Penalty = L2),1,0.45,0.8457382953181273,0.8453742161246034,0.5155823230743408,0.8453742161246034
279,11,Naive Bayes,1,0.45,0.8013205282112845,0.7728832432667904,0.15100979804992676,0.7728832432667904
280,11,KNeighbors Classifier,2,0.45,0.8103241296518607,0.8091435857507504,5.637735605239868,0.8091435857507504
281,11,SVC Classifier,2,0.45,0.8379351740696278,0.8234326145637876,7.984252691268921,0.8234326145637876
282,11,Decision Tree,2,0.45,0.7286914765906363,0.7279272306310131,0.28532958030700684,0.7279272306310131
283,11,RandomForest,2,0.45,0.7695078031212484,0.756773862195075,0.8626308441162109,0.756773862195075
284,11,AdaBoost (Discrete),2,0.45,0.8445378151260504,0.8442128060593452,119.3210654258728,0.8442128060593452
285,11,AdaBoost (Real),2,0.45,0.8433373349339736,0.8429942462783092,125.3401210308075,0.8429942462783092
286,11,Logistic Regression (Penalty = L2),2,0.45,0.8625450180072028,0.8614073704535088,0.4445621967315674,0.8614073704535088
287,11,Naive Bayes,2,0.45,0.8139255702280912,0.7854717653066186,0.13165736198425293,0.7854717653066186
288,12,KNeighbors Classifier,0,0.45,0.710431654676259,0.7082971897060855,0.39984750747680664,0.7082971897060855
289,12,SVC Classifier,0,0.45,0.7230215827338129,0.6860746359284998,5.28315544128418,0.6860746359284998
290,12,Decision Tree,0,0.45,0.6486810551558753,0.6458269563328475,0.1910078525543213,0.6458269563328475
291,12,RandomForest,0,0.45,0.7164268585131894,0.7020887420792892,0.6382784843444824,0.7020887420792892
292,12,AdaBoost (Discrete),0,0.45,0.5995203836930456,0.5850814602402042,49.43120622634888,0.5850814602402042
293,12,AdaBoost (Real),0,0.45,0.6187050359712231,0.6133047813051502,62.165610790252686,0.6133047813051502
294,12,Logistic Regression (Penalty = L2),0,0.45,0.7553956834532374,0.7512525023653158,0.2534363269805908,0.7512525023653158
295,12,Naive Bayes,0,0.45,0.7416067146282974,0.715226210842037,0.0699458122253418,0.715226210842037
296,12,KNeighbors Classifier,1,0.45,0.6812725090036015,0.6778405430607936,0.44533443450927734,0.6778405430607936
297,12,SVC Classifier,1,0.45,0.7088835534213686,0.670962243319214,5.4097559452056885,0.670962243319214
298,12,Decision Tree,1,0.45,0.6464585834333734,0.6451952763264263,0.20221257209777832,0.6451952763264263
299,12,RandomForest,1,0.45,0.7058823529411765,0.693873560460892,0.6921067237854004,0.693873560460892
300,12,AdaBoost (Discrete),1,0.45,0.5984393757503002,0.5972046137865629,49.487059116363525,0.5972046137865629
301,12,AdaBoost (Real),1,0.45,0.6374549819927972,0.6332779596784139,62.68830180168152,0.6332779596784139
302,12,Logistic Regression (Penalty = L2),1,0.45,0.7442977190876351,0.7404437469435122,0.40160655975341797,0.7404437469435122
303,12,Naive Bayes,1,0.45,0.7256902761104442,0.6998604264982864,0.0648946762084961,0.6998604264982864
304,12,KNeighbors Classifier,2,0.45,0.6728691476590636,0.6703999675771191,0.47706174850463867,0.6703999675771191
305,12,SVC Classifier,2,0.45,0.7034813925570228,0.6608224065898458,5.480465888977051,0.6608224065898458
306,12,Decision Tree,2,0.45,0.6284513805522209,0.6280386084379995,0.19037604331970215,0.6280386084379995
307,12,RandomForest,2,0.45,0.6836734693877551,0.6775263980442511,0.7027413845062256,0.6775263980442511
308,12,AdaBoost (Discrete),2,0.45,0.6278511404561825,0.6223496894992138,48.90068817138672,0.6223496894992138
309,12,AdaBoost (Real),2,0.45,0.648859543817527,0.6422589078936168,58.93618440628052,0.6422589078936168
310,12,Logistic Regression (Penalty = L2),2,0.45,0.7442977190876351,0.7400672414594386,0.3519120216369629,0.7400672414594386
311,12,Naive Bayes,2,0.45,0.7106842737094838,0.6815764176990146,0.11822986602783203,0.6815764176990146
