,feat_set_id,classifier,fold_id,feat_th,score,geo_score,exec_t,geo_score_woz
0,0,KNeighbors Classifier,0,0.4,0.05714285714285714,1.0,0.18603301048278809,0.0
1,0,SVC Classifier,0,0.4,0.009523809523809525,1.0,0.9033434391021729,0.0
2,0,Decision Tree,0,0.4,0.05714285714285714,1.0,0.08952736854553223,0.0
3,0,RandomForest,0,0.4,0.05714285714285714,1.0,0.4417569637298584,0.0
4,0,AdaBoost (Discrete),0,0.4,0.047619047619047616,1.0,31.496288776397705,0.0
5,0,AdaBoost (Real),0,0.4,0.05714285714285714,1.0,72.85960650444031,0.0
6,0,Logistic Regression (Penalty = L2),0,0.4,0.05714285714285714,1.0,0.8840844631195068,0.0
7,0,Naive Bayes,0,0.4,0.05714285714285714,1.0,0.8046896457672119,0.0
8,0,KNeighbors Classifier,1,0.4,0.05660377358490566,1.0,0.19409847259521484,0.0
9,0,SVC Classifier,1,0.4,0.05660377358490566,1.0,0.869697093963623,0.0
10,0,Decision Tree,1,0.4,0.05660377358490566,1.0,0.0019440650939941406,0.0
11,0,RandomForest,1,0.4,0.05660377358490566,1.0,0.4330782890319824,0.0
12,0,AdaBoost (Discrete),1,0.4,0.05660377358490566,1.0,38.22516870498657,0.0
13,0,AdaBoost (Real),1,0.4,0.04716981132075472,1.0,75.22275996208191,0.0
14,0,Logistic Regression (Penalty = L2),1,0.4,0.05660377358490566,1.0,1.2308506965637207,0.0
15,0,Naive Bayes,1,0.4,0.05660377358490566,1.0,0.6580255031585693,0.0
16,0,KNeighbors Classifier,2,0.4,0.05714285714285714,1.0,0.0777590274810791,0.0
17,0,SVC Classifier,2,0.4,0.009523809523809525,1.0,0.9627776145935059,0.0
18,0,Decision Tree,2,0.4,0.05714285714285714,1.0,0.0019540786743164062,0.0
19,0,RandomForest,2,0.4,0.05714285714285714,1.0,0.48413753509521484,0.0
20,0,AdaBoost (Discrete),2,0.4,0.05714285714285714,1.0,36.704986333847046,0.0
21,0,AdaBoost (Real),2,0.4,0.05714285714285714,1.0,73.70761060714722,0.0
22,0,Logistic Regression (Penalty = L2),2,0.4,0.05714285714285714,1.0,1.0233640670776367,0.0
23,0,Naive Bayes,2,0.4,0.05714285714285714,1.0,0.7356221675872803,0.0
24,1,KNeighbors Classifier,0,0.4,1.0,1.0,0.2737576961517334,1.0
25,1,SVC Classifier,0,0.4,0.009523809523809525,1.0,0.9555387496948242,0.0
26,1,Decision Tree,0,0.4,1.0,1.0,0.09228920936584473,1.0
27,1,RandomForest,0,0.4,0.21904761904761905,1.0,0.5368924140930176,0.0
28,1,AdaBoost (Discrete),0,0.4,0.9809523809523809,1.0,36.40516662597656,0.0
29,1,AdaBoost (Real),0,0.4,0.9047619047619048,1.0,78.32605171203613,0.0
30,1,Logistic Regression (Penalty = L2),0,0.4,0.44761904761904764,1.0,1.066638469696045,0.0
31,1,Naive Bayes,0,0.4,1.0,1.0,0.6900980472564697,1.0
32,1,KNeighbors Classifier,1,0.4,1.0,1.0,0.18424677848815918,1.0
33,1,SVC Classifier,1,0.4,1.0,1.0,1.014991283416748,1.0
34,1,Decision Tree,1,0.4,1.0,1.0,0.11288881301879883,1.0
35,1,RandomForest,1,0.4,0.18867924528301888,1.0,0.7054181098937988,0.0
36,1,AdaBoost (Discrete),1,0.4,0.8962264150943396,1.0,38.9926962852478,0.0
37,1,AdaBoost (Real),1,0.4,0.9433962264150944,1.0,73.69405031204224,0.0
38,1,Logistic Regression (Penalty = L2),1,0.4,0.5849056603773585,1.0,1.6322171688079834,0.0
39,1,Naive Bayes,1,0.4,1.0,1.0,0.7004694938659668,1.0
40,1,KNeighbors Classifier,2,0.4,1.0,1.0,0.2853729724884033,1.0
41,1,SVC Classifier,2,0.4,0.009523809523809525,1.0,0.8982563018798828,0.0
42,1,Decision Tree,2,0.4,1.0,1.0,0.20194268226623535,1.0
43,1,RandomForest,2,0.4,0.18095238095238095,1.0,0.5061008930206299,0.0
44,1,AdaBoost (Discrete),2,0.4,0.9333333333333333,1.0,38.69121289253235,0.0
45,1,AdaBoost (Real),2,0.4,0.8380952380952381,1.0,74.8180205821991,0.0
46,1,Logistic Regression (Penalty = L2),2,0.4,0.5142857142857142,1.0,1.6183457374572754,0.0
47,1,Naive Bayes,2,0.4,1.0,1.0,0.6990678310394287,1.0
48,2,KNeighbors Classifier,0,0.4,1.0,1.0,0.3005974292755127,1.0
49,2,SVC Classifier,0,0.4,0.009523809523809525,1.0,1.1200261116027832,0.0
50,2,Decision Tree,0,0.4,1.0,1.0,0.10434937477111816,1.0
51,2,RandomForest,0,0.4,0.2,1.0,0.5223431587219238,0.0
52,2,AdaBoost (Discrete),0,0.4,0.819047619047619,1.0,39.27518367767334,0.0
53,2,AdaBoost (Real),0,0.4,0.8666666666666667,1.0,77.74125289916992,0.0
54,2,Logistic Regression (Penalty = L2),0,0.4,0.6857142857142857,1.0,1.1281766891479492,0.0
55,2,Naive Bayes,0,0.4,1.0,1.0,0.7184207439422607,1.0
56,2,KNeighbors Classifier,1,0.4,1.0,1.0,0.30254697799682617,1.0
57,2,SVC Classifier,1,0.4,1.0,1.0,1.0147457122802734,1.0
58,2,Decision Tree,1,0.4,1.0,1.0,0.10029816627502441,1.0
59,2,RandomForest,1,0.4,0.1792452830188679,1.0,0.70635986328125,0.0
60,2,AdaBoost (Discrete),1,0.4,0.9056603773584906,1.0,37.66199350357056,0.0
61,2,AdaBoost (Real),1,0.4,0.9433962264150944,1.0,74.29494309425354,0.0
62,2,Logistic Regression (Penalty = L2),1,0.4,0.839622641509434,1.0,1.5354173183441162,0.0
63,2,Naive Bayes,1,0.4,1.0,1.0,0.717066764831543,1.0
64,2,KNeighbors Classifier,2,0.4,1.0,1.0,0.20249128341674805,1.0
65,2,SVC Classifier,2,0.4,0.009523809523809525,1.0,1.1087820529937744,0.0
66,2,Decision Tree,2,0.4,1.0,1.0,0.09924912452697754,1.0
67,2,RandomForest,2,0.4,0.19047619047619047,1.0,0.48947954177856445,0.0
68,2,AdaBoost (Discrete),2,0.4,0.9047619047619048,1.0,38.85822319984436,0.0
69,2,AdaBoost (Real),2,0.4,0.8476190476190476,1.0,69.99285578727722,0.0
70,2,Logistic Regression (Penalty = L2),2,0.4,0.7904761904761904,1.0,1.6022546291351318,0.0
71,2,Naive Bayes,2,0.4,1.0,1.0,0.6656255722045898,1.0
72,3,KNeighbors Classifier,0,0.4,1.0,1.0,0.2042384147644043,1.0
73,3,SVC Classifier,0,0.4,0.009523809523809525,1.0,1.044048547744751,0.0
74,3,Decision Tree,0,0.4,1.0,1.0,0.09411406517028809,1.0
75,3,RandomForest,0,0.4,0.17142857142857143,1.0,0.670372724533081,0.0
76,3,AdaBoost (Discrete),0,0.4,0.8666666666666667,1.0,34.40761852264404,0.0
77,3,AdaBoost (Real),0,0.4,1.0,1.0,68.56859230995178,1.0
78,3,Logistic Regression (Penalty = L2),0,0.4,0.3047619047619048,1.0,0.9612493515014648,0.0
79,3,Naive Bayes,0,0.4,1.0,1.0,0.7457501888275146,1.0
80,3,KNeighbors Classifier,1,0.4,1.0,1.0,0.17302513122558594,1.0
81,3,SVC Classifier,1,0.4,1.0,1.0,0.8354525566101074,1.0
82,3,Decision Tree,1,0.4,1.0,1.0,0.09906315803527832,1.0
83,3,RandomForest,1,0.4,0.18867924528301888,1.0,0.5601279735565186,0.0
84,3,AdaBoost (Discrete),1,0.4,0.7924528301886793,1.0,33.42334485054016,0.0
85,3,AdaBoost (Real),1,0.4,0.9905660377358491,1.0,69.74263978004456,0.0
86,3,Logistic Regression (Penalty = L2),1,0.4,0.3584905660377358,1.0,1.2735092639923096,0.0
87,3,Naive Bayes,1,0.4,1.0,1.0,0.6026759147644043,1.0
88,3,KNeighbors Classifier,2,0.4,1.0,1.0,0.3490607738494873,1.0
89,3,SVC Classifier,2,0.4,0.009523809523809525,1.0,0.7370526790618896,0.0
90,3,Decision Tree,2,0.4,1.0,1.0,0.001697540283203125,1.0
91,3,RandomForest,2,0.4,0.20952380952380953,1.0,0.5566644668579102,0.0
92,3,AdaBoost (Discrete),2,0.4,0.8857142857142857,1.0,33.0101432800293,0.0
93,3,AdaBoost (Real),2,0.4,0.9333333333333333,1.0,65.43453788757324,0.0
94,3,Logistic Regression (Penalty = L2),2,0.4,0.3619047619047619,1.0,1.2974967956542969,0.0
95,3,Naive Bayes,2,0.4,1.0,1.0,0.7305238246917725,1.0
96,6,KNeighbors Classifier,0,0.4,0.047619047619047616,1.0,0.0032351016998291016,0.0
97,6,SVC Classifier,0,0.4,0.009523809523809525,1.0,0.9335191249847412,0.0
98,6,Decision Tree,0,0.4,0.047619047619047616,1.0,0.0901787281036377,0.0
99,6,RandomForest,0,0.4,0.047619047619047616,1.0,0.640899658203125,0.0
100,6,AdaBoost (Discrete),0,0.4,0.047619047619047616,1.0,31.187687635421753,0.0
101,6,AdaBoost (Real),0,0.4,0.047619047619047616,1.0,67.21547794342041,0.0
102,6,Logistic Regression (Penalty = L2),0,0.4,0.047619047619047616,1.0,0.6316053867340088,0.0
103,6,Naive Bayes,0,0.4,0.047619047619047616,1.0,0.7207064628601074,0.0
104,6,KNeighbors Classifier,1,0.4,0.04716981132075472,1.0,0.09201502799987793,0.0
105,6,SVC Classifier,1,0.4,0.04716981132075472,1.0,0.8277950286865234,0.0
106,6,Decision Tree,1,0.4,0.04716981132075472,1.0,0.08953356742858887,0.0
107,6,RandomForest,1,0.4,0.04716981132075472,1.0,0.4625694751739502,0.0
108,6,AdaBoost (Discrete),1,0.4,0.04716981132075472,1.0,31.149607181549072,0.0
109,6,AdaBoost (Real),1,0.4,0.04716981132075472,1.0,62.072404623031616,0.0
110,6,Logistic Regression (Penalty = L2),1,0.4,0.04716981132075472,1.0,0.8856601715087891,0.0
111,6,Naive Bayes,1,0.4,0.04716981132075472,1.0,0.66864013671875,0.0
112,6,KNeighbors Classifier,2,0.4,0.047619047619047616,1.0,0.08350205421447754,0.0
113,6,SVC Classifier,2,0.4,0.009523809523809525,1.0,0.8767759799957275,0.0
114,6,Decision Tree,2,0.4,0.047619047619047616,1.0,0.07346701622009277,0.0
115,6,RandomForest,2,0.4,0.047619047619047616,1.0,0.4230179786682129,0.0
116,6,AdaBoost (Discrete),2,0.4,0.047619047619047616,1.0,28.26462960243225,0.0
117,6,AdaBoost (Real),2,0.4,0.047619047619047616,1.0,62.13227987289429,0.0
118,6,Logistic Regression (Penalty = L2),2,0.4,0.047619047619047616,1.0,0.8699634075164795,0.0
119,6,Naive Bayes,2,0.4,0.047619047619047616,1.0,0.8442308902740479,0.0
120,7,KNeighbors Classifier,0,0.4,1.0,1.0,0.28401827812194824,1.0
121,7,SVC Classifier,0,0.4,0.009523809523809525,1.0,0.9660944938659668,0.0
122,7,Decision Tree,0,0.4,1.0,1.0,0.09738492965698242,1.0
123,7,RandomForest,0,0.4,0.19047619047619047,1.0,0.5769140720367432,0.0
124,7,AdaBoost (Discrete),0,0.4,0.9904761904761905,1.0,36.70085883140564,0.0
125,7,AdaBoost (Real),0,0.4,0.8666666666666667,1.0,69.94046306610107,0.0
126,7,Logistic Regression (Penalty = L2),0,0.4,0.3142857142857143,1.0,0.8331959247589111,0.0
127,7,Naive Bayes,0,0.4,1.0,1.0,0.7200205326080322,1.0
128,7,KNeighbors Classifier,1,0.4,1.0,1.0,0.18776726722717285,1.0
129,7,SVC Classifier,1,0.4,1.0,1.0,0.9534649848937988,1.0
130,7,Decision Tree,1,0.4,1.0,1.0,0.08838748931884766,1.0
131,7,RandomForest,1,0.4,0.18867924528301888,1.0,0.6345815658569336,0.0
132,7,AdaBoost (Discrete),1,0.4,1.0,1.0,33.39712715148926,1.0
133,7,AdaBoost (Real),1,0.4,0.9716981132075472,1.0,64.91820979118347,0.0
134,7,Logistic Regression (Penalty = L2),1,0.4,0.46226415094339623,1.0,1.3841018676757812,0.0
135,7,Naive Bayes,1,0.4,1.0,1.0,0.8276529312133789,1.0
136,7,KNeighbors Classifier,2,0.4,1.0,1.0,0.26063084602355957,1.0
137,7,SVC Classifier,2,0.4,0.009523809523809525,1.0,0.8298263549804688,0.0
138,7,Decision Tree,2,0.4,1.0,1.0,0.0031464099884033203,1.0
139,7,RandomForest,2,0.4,0.1619047619047619,1.0,0.4345369338989258,0.0
140,7,AdaBoost (Discrete),2,0.4,0.9809523809523809,1.0,33.27684187889099,0.0
141,7,AdaBoost (Real),2,0.4,0.9142857142857143,1.0,62.24211764335632,0.0
142,7,Logistic Regression (Penalty = L2),2,0.4,0.4,1.0,0.9821755886077881,0.0
143,7,Naive Bayes,2,0.4,1.0,1.0,0.6252727508544922,1.0
144,8,KNeighbors Classifier,0,0.4,1.0,1.0,0.18557953834533691,1.0
145,8,SVC Classifier,0,0.4,0.009523809523809525,1.0,1.1217916011810303,0.0
146,8,Decision Tree,0,0.4,1.0,1.0,0.10723257064819336,1.0
147,8,RandomForest,0,0.4,0.17142857142857143,1.0,0.5201056003570557,0.0
148,8,AdaBoost (Discrete),0,0.4,0.8476190476190476,1.0,31.83533215522766,0.0
149,8,AdaBoost (Real),0,0.4,0.9809523809523809,1.0,65.0264458656311,0.0
150,8,Logistic Regression (Penalty = L2),0,0.4,0.1523809523809524,1.0,0.7168710231781006,0.0
151,8,Naive Bayes,0,0.4,1.0,1.0,0.7119112014770508,1.0
152,8,KNeighbors Classifier,1,0.4,1.0,1.0,0.17025279998779297,1.0
153,8,SVC Classifier,1,0.4,1.0,1.0,0.8071246147155762,1.0
154,8,Decision Tree,1,0.4,1.0,1.0,0.08013772964477539,1.0
155,8,RandomForest,1,0.4,0.18867924528301888,1.0,0.5287981033325195,0.0
156,8,AdaBoost (Discrete),1,0.4,0.8867924528301887,1.0,30.459717273712158,0.0
157,8,AdaBoost (Real),1,0.4,0.9905660377358491,1.0,58.36713123321533,0.0
158,8,Logistic Regression (Penalty = L2),1,0.4,0.2169811320754717,1.0,0.9069778919219971,0.0
159,8,Naive Bayes,1,0.4,1.0,1.0,0.7456133365631104,1.0
160,8,KNeighbors Classifier,2,0.4,1.0,1.0,0.24740052223205566,1.0
161,8,SVC Classifier,2,0.4,0.009523809523809525,1.0,0.928058385848999,0.0
162,8,Decision Tree,2,0.4,1.0,1.0,0.08258414268493652,1.0
163,8,RandomForest,2,0.4,0.18095238095238095,1.0,0.43410301208496094,0.0
164,8,AdaBoost (Discrete),2,0.4,0.8857142857142857,1.0,30.227718114852905,0.0
165,8,AdaBoost (Real),2,0.4,0.9809523809523809,1.0,60.08973026275635,0.0
166,8,Logistic Regression (Penalty = L2),2,0.4,0.21904761904761905,1.0,0.9314281940460205,0.0
167,8,Naive Bayes,2,0.4,1.0,1.0,0.5869066715240479,1.0
168,9,KNeighbors Classifier,0,0.4,1.0,1.0,0.25201964378356934,1.0
169,9,SVC Classifier,0,0.4,0.009523809523809525,1.0,1.1064643859863281,0.0
170,9,Decision Tree,0,0.4,1.0,1.0,0.08633708953857422,1.0
171,9,RandomForest,0,0.4,0.1619047619047619,1.0,0.5964155197143555,0.0
172,9,AdaBoost (Discrete),0,0.4,0.7428571428571429,1.0,29.42474865913391,0.0
173,9,AdaBoost (Real),0,0.4,1.0,1.0,58.73415660858154,1.0
174,9,Logistic Regression (Penalty = L2),0,0.4,0.0380952380952381,1.0,0.5485939979553223,0.0
175,9,Naive Bayes,0,0.4,1.0,1.0,0.5535662174224854,1.0
176,9,KNeighbors Classifier,1,0.4,1.0,1.0,0.15847516059875488,1.0
177,9,SVC Classifier,1,0.4,1.0,1.0,0.7279152870178223,1.0
178,9,Decision Tree,1,0.4,1.0,1.0,0.07571554183959961,1.0
179,9,RandomForest,1,0.4,0.16037735849056603,1.0,0.38063621520996094,0.0
180,9,AdaBoost (Discrete),1,0.4,0.9056603773584906,1.0,25.343685388565063,0.0
181,9,AdaBoost (Real),1,0.4,1.0,1.0,52.42907905578613,1.0
182,9,Logistic Regression (Penalty = L2),1,0.4,0.05660377358490566,1.0,0.6162722110748291,0.0
183,9,Naive Bayes,1,0.4,1.0,1.0,0.6729390621185303,1.0
184,9,KNeighbors Classifier,2,0.4,1.0,1.0,0.15341567993164062,1.0
185,9,SVC Classifier,2,0.4,0.009523809523809525,1.0,0.6796514987945557,0.0
186,9,Decision Tree,2,0.4,1.0,1.0,0.0021185874938964844,1.0
187,9,RandomForest,2,0.4,0.1523809523809524,1.0,0.44948291778564453,0.0
188,9,AdaBoost (Discrete),2,0.4,0.780952380952381,1.0,26.295666217803955,0.0
189,9,AdaBoost (Real),2,0.4,0.9904761904761905,1.0,52.034754276275635,0.0
190,9,Logistic Regression (Penalty = L2),2,0.4,0.05714285714285714,1.0,0.6905338764190674,0.0
191,9,Naive Bayes,2,0.4,1.0,1.0,0.3571324348449707,1.0
192,10,KNeighbors Classifier,0,0.4,1.0,1.0,0.13834142684936523,1.0
193,10,SVC Classifier,0,0.4,0.009523809523809525,1.0,0.7452402114868164,0.0
194,10,Decision Tree,0,0.4,1.0,1.0,0.0665278434753418,1.0
195,10,RandomForest,0,0.4,0.19047619047619047,1.0,0.41498899459838867,0.0
196,10,AdaBoost (Discrete),0,0.4,0.8285714285714286,1.0,27.573179960250854,0.0
197,10,AdaBoost (Real),0,0.4,0.9238095238095239,1.0,51.69402599334717,0.0
198,10,Logistic Regression (Penalty = L2),0,0.4,0.6190476190476191,1.0,0.7923998832702637,0.0
199,10,Naive Bayes,0,0.4,1.0,1.0,0.5071759223937988,1.0
200,10,KNeighbors Classifier,1,0.4,1.0,1.0,0.17407798767089844,1.0
201,10,SVC Classifier,1,0.4,1.0,1.0,0.6546845436096191,1.0
202,10,Decision Tree,1,0.4,1.0,1.0,0.05826592445373535,1.0
203,10,RandomForest,1,0.4,0.22641509433962265,1.0,0.30057358741760254,0.0
204,10,AdaBoost (Discrete),1,0.4,0.7452830188679245,1.0,23.830512285232544,0.0
205,10,AdaBoost (Real),1,0.4,0.8490566037735849,1.0,44.25602650642395,0.0
206,10,Logistic Regression (Penalty = L2),1,0.4,0.6886792452830188,1.0,1.011570930480957,0.0
207,10,Naive Bayes,1,0.4,1.0,1.0,0.4392385482788086,1.0
208,10,KNeighbors Classifier,2,0.4,1.0,1.0,0.1219186782836914,1.0
209,10,SVC Classifier,2,0.4,0.009523809523809525,1.0,0.5886104106903076,0.0
210,10,Decision Tree,2,0.4,1.0,1.0,0.0035216808319091797,1.0
211,10,RandomForest,2,0.4,0.20952380952380953,1.0,0.3101205825805664,0.0
212,10,AdaBoost (Discrete),2,0.4,0.9238095238095239,1.0,22.334258317947388,0.0
213,10,AdaBoost (Real),2,0.4,0.9238095238095239,1.0,42.87790632247925,0.0
214,10,Logistic Regression (Penalty = L2),2,0.4,0.6761904761904762,1.0,1.0017502307891846,0.0
215,10,Naive Bayes,2,0.4,1.0,1.0,0.45102882385253906,1.0
216,11,KNeighbors Classifier,0,0.4,1.0,1.0,0.1691575050354004,1.0
217,11,SVC Classifier,0,0.4,0.009523809523809525,1.0,0.675992488861084,0.0
218,11,Decision Tree,0,0.4,1.0,1.0,0.05422472953796387,1.0
219,11,RandomForest,0,0.4,0.19047619047619047,1.0,0.38663649559020996,0.0
220,11,AdaBoost (Discrete),0,0.4,0.9809523809523809,1.0,23.10116410255432,0.0
221,11,AdaBoost (Real),0,0.4,0.8285714285714286,1.0,43.04901480674744,0.0
222,11,Logistic Regression (Penalty = L2),0,0.4,0.9047619047619048,1.0,0.7052524089813232,0.0
223,11,Naive Bayes,0,0.4,1.0,1.0,0.3913862705230713,1.0
224,11,KNeighbors Classifier,1,0.4,1.0,1.0,0.130021333694458,1.0
225,11,SVC Classifier,1,0.4,1.0,1.0,0.5234436988830566,1.0
226,11,Decision Tree,1,0.4,1.0,1.0,0.04646730422973633,1.0
227,11,RandomForest,1,0.4,0.3018867924528302,1.0,0.2753159999847412,0.0
228,11,AdaBoost (Discrete),1,0.4,0.9433962264150944,1.0,19.4205641746521,0.0
229,11,AdaBoost (Real),1,0.4,0.9716981132075472,1.0,35.718708992004395,0.0
230,11,Logistic Regression (Penalty = L2),1,0.4,0.9716981132075472,1.0,0.8543694019317627,0.0
231,11,Naive Bayes,1,0.4,1.0,1.0,0.3126246929168701,1.0
232,11,KNeighbors Classifier,2,0.4,1.0,1.0,0.13395452499389648,1.0
233,11,SVC Classifier,2,0.4,0.009523809523809525,1.0,0.5367550849914551,0.0
234,11,Decision Tree,2,0.4,1.0,1.0,0.0517275333404541,1.0
235,11,RandomForest,2,0.4,0.24761904761904763,1.0,0.24324584007263184,0.0
236,11,AdaBoost (Discrete),2,0.4,0.8380952380952381,1.0,21.522189378738403,0.0
237,11,AdaBoost (Real),2,0.4,0.9619047619047619,1.0,38.83403468132019,0.0
238,11,Logistic Regression (Penalty = L2),2,0.4,0.9428571428571428,1.0,1.0782289505004883,0.0
239,11,Naive Bayes,2,0.4,1.0,1.0,0.4805283546447754,1.0
