,feat_set_id,classifier,fold_id,feat_th,score,geo_score,exec_t,geo_score_woz
0,0,KNeighbors Classifier,0,1.0,0.9791044776119403,0.9789394329847532,6.6741437911987305,0.9789394329847532
1,0,SVC Classifier,0,1.0,0.9761194029850746,0.9759541111282376,2.1408493518829346,0.9759541111282376
2,0,Decision Tree,0,1.0,0.835820895522388,0.8327636652523929,0.09482550621032715,0.8327636652523929
3,0,RandomForest,0,1.0,0.6880597014925374,0.7461311211476899,0.26371049880981445,0.0
4,0,AdaBoost (Discrete),0,1.0,0.9298507462686567,0.9278820352482705,58.2681450843811,0.9278820352482705
5,0,AdaBoost (Real),0,1.0,0.9104477611940298,0.9094371578225515,58.476550579071045,0.9094371578225515
6,0,Logistic Regression (Penalty = L2),0,1.0,0.9492537313432836,0.9486524157422167,2.309955358505249,0.9486524157422167
7,0,Naive Bayes,0,1.0,0.926865671641791,0.9258686660127934,0.32897114753723145,0.9258686660127934
8,0,KNeighbors Classifier,1,1.0,0.9671641791044776,0.9669381419417639,6.451225757598877,0.9669381419417639
9,0,SVC Classifier,1,1.0,0.9686567164179104,0.9684850354938194,2.0690059661865234,0.9684850354938194
10,0,Decision Tree,1,1.0,0.808955223880597,0.8063964477744443,0.0739893913269043,0.8063964477744443
11,0,RandomForest,1,1.0,0.7074626865671642,0.5045868422145746,0.2391819953918457,0.5045868422145746
12,0,AdaBoost (Discrete),1,1.0,0.9417910447761194,0.9410332533173178,58.253294229507446,0.9410332533173178
13,0,AdaBoost (Real),1,1.0,0.8746268656716418,0.8734901820560487,65.09709739685059,0.8734901820560487
14,0,Logistic Regression (Penalty = L2),1,1.0,0.9477611940298507,0.9468369241411904,2.4344773292541504,0.9468369241411904
15,0,Naive Bayes,1,1.0,0.9134328358208955,0.9127727890226641,0.25890612602233887,0.9127727890226641
16,0,KNeighbors Classifier,2,1.0,0.9757575757575757,0.9756109786668183,6.878119230270386,0.9756109786668183
17,0,SVC Classifier,2,1.0,0.9666666666666667,0.9666239453637299,2.376786231994629,0.9666239453637299
18,0,Decision Tree,2,1.0,0.8666666666666667,0.8652182113377513,0.07343506813049316,0.8652182113377513
19,0,RandomForest,2,1.0,0.7348484848484849,0.5398333026058275,0.26105690002441406,0.5398333026058275
20,0,AdaBoost (Discrete),2,1.0,0.9409090909090909,0.9398517820003452,58.60041880607605,0.9398517820003452
21,0,AdaBoost (Real),2,1.0,0.6136363636363636,0.5523045988973336,56.0058069229126,0.5523045988973336
22,0,Logistic Regression (Penalty = L2),2,1.0,0.9515151515151515,0.951054592445935,2.50006365776062,0.951054592445935
23,0,Naive Bayes,2,1.0,0.9242424242424242,0.9239434547016669,0.2437729835510254,0.9239434547016669
24,1,KNeighbors Classifier,0,1.0,0.9791044776119403,0.9789394329847532,6.24023175239563,0.9789394329847532
25,1,SVC Classifier,0,1.0,0.9761194029850746,0.9759541111282376,1.9622628688812256,0.9759541111282376
26,1,Decision Tree,0,1.0,0.8119402985074626,0.8086750470005214,0.051187992095947266,0.8086750470005214
27,1,RandomForest,0,1.0,0.6880597014925374,0.7461311211476899,0.22338581085205078,0.0
28,1,AdaBoost (Discrete),0,1.0,0.9298507462686567,0.9278820352482705,52.725505352020264,0.9278820352482705
29,1,AdaBoost (Real),0,1.0,0.908955223880597,0.9077442437865757,54.49101424217224,0.9077442437865757
30,1,Logistic Regression (Penalty = L2),0,1.0,0.9492537313432836,0.9486524157422167,1.8256101608276367,0.9486524157422167
31,1,Naive Bayes,0,1.0,0.926865671641791,0.9258686660127934,0.2113199234008789,0.9258686660127934
32,1,KNeighbors Classifier,1,1.0,0.9671641791044776,0.9669381419417639,6.054238796234131,0.9669381419417639
33,1,SVC Classifier,1,1.0,0.9686567164179104,0.9684850354938194,2.027923583984375,0.9684850354938194
34,1,Decision Tree,1,1.0,0.8164179104477612,0.8121119052843163,0.06862401962280273,0.8121119052843163
35,1,RandomForest,1,1.0,0.7074626865671642,0.5045868422145746,0.2620835304260254,0.5045868422145746
36,1,AdaBoost (Discrete),1,1.0,0.9417910447761194,0.9410332533173178,51.84171915054321,0.9410332533173178
37,1,AdaBoost (Real),1,1.0,0.8865671641791045,0.8854897756119949,48.33267688751221,0.8854897756119949
38,1,Logistic Regression (Penalty = L2),1,1.0,0.9477611940298507,0.9468369241411904,1.859595775604248,0.9468369241411904
39,1,Naive Bayes,1,1.0,0.9134328358208955,0.9127727890226641,0.17795062065124512,0.9127727890226641
40,1,KNeighbors Classifier,2,1.0,0.9757575757575757,0.9756109786668183,5.1991918087005615,0.9756109786668183
41,1,SVC Classifier,2,1.0,0.9666666666666667,0.9666239453637299,2.0394575595855713,0.9666239453637299
42,1,Decision Tree,2,1.0,0.8484848484848485,0.8474701553541606,0.07129430770874023,0.8474701553541606
43,1,RandomForest,2,1.0,0.7348484848484849,0.5398333026058275,0.23917388916015625,0.5398333026058275
44,1,AdaBoost (Discrete),2,1.0,0.9409090909090909,0.9398517820003452,56.95573878288269,0.9398517820003452
45,1,AdaBoost (Real),2,1.0,0.6136363636363636,0.5523045988973336,66.23483633995056,0.5523045988973336
46,1,Logistic Regression (Penalty = L2),2,1.0,0.9515151515151515,0.951054592445935,2.7095627784729004,0.951054592445935
47,1,Naive Bayes,2,1.0,0.9242424242424242,0.9239434547016669,0.2832624912261963,0.9239434547016669
48,2,KNeighbors Classifier,0,1.0,0.9791044776119403,0.9789394329847532,6.435689687728882,0.9789394329847532
49,2,SVC Classifier,0,1.0,0.9761194029850746,0.9759541111282376,1.9628045558929443,0.9759541111282376
50,2,Decision Tree,0,1.0,0.8373134328358209,0.833958570865079,0.062468767166137695,0.833958570865079
51,2,RandomForest,0,1.0,0.6880597014925374,0.7461311211476899,0.22365689277648926,0.0
52,2,AdaBoost (Discrete),0,1.0,0.9298507462686567,0.9278820352482705,61.72324562072754,0.9278820352482705
53,2,AdaBoost (Real),0,1.0,0.9014925373134328,0.8979753262480256,59.60458207130432,0.8979753262480256
54,2,Logistic Regression (Penalty = L2),0,1.0,0.9492537313432836,0.9486524157422167,2.468264579772949,0.9486524157422167
55,2,Naive Bayes,0,1.0,0.926865671641791,0.9258686660127934,0.2510499954223633,0.9258686660127934
56,2,KNeighbors Classifier,1,1.0,0.9671641791044776,0.9669381419417639,5.963021993637085,0.9669381419417639
57,2,SVC Classifier,1,1.0,0.9686567164179104,0.9684850354938194,1.7764954566955566,0.9684850354938194
58,2,Decision Tree,1,1.0,0.8074626865671641,0.8002834048840831,0.07636117935180664,0.8002834048840831
59,2,RandomForest,1,1.0,0.7074626865671642,0.5045868422145746,0.22226214408874512,0.5045868422145746
60,2,AdaBoost (Discrete),1,1.0,0.9417910447761194,0.9410332533173178,47.20228123664856,0.9410332533173178
61,2,AdaBoost (Real),1,1.0,0.7880597014925373,0.7730722858744891,49.63274073600769,0.7730722858744891
62,2,Logistic Regression (Penalty = L2),1,1.0,0.9477611940298507,0.9468369241411904,2.0172770023345947,0.9468369241411904
63,2,Naive Bayes,1,1.0,0.9134328358208955,0.9127727890226641,0.25626611709594727,0.9127727890226641
64,2,KNeighbors Classifier,2,1.0,0.9757575757575757,0.9756109786668183,6.263735294342041,0.9756109786668183
65,2,SVC Classifier,2,1.0,0.9666666666666667,0.9666239453637299,2.1055796146392822,0.9666239453637299
66,2,Decision Tree,2,1.0,0.843939393939394,0.8418460865810383,0.05076241493225098,0.8418460865810383
67,2,RandomForest,2,1.0,0.7348484848484849,0.5398333026058275,0.25971388816833496,0.5398333026058275
68,2,AdaBoost (Discrete),2,1.0,0.9409090909090909,0.9398517820003452,49.390381813049316,0.9398517820003452
69,2,AdaBoost (Real),2,1.0,0.8833333333333333,0.8799988668046014,49.888837814331055,0.8799988668046014
70,2,Logistic Regression (Penalty = L2),2,1.0,0.9515151515151515,0.951054592445935,2.2793476581573486,0.951054592445935
71,2,Naive Bayes,2,1.0,0.9242424242424242,0.9239434547016669,0.2591667175292969,0.9239434547016669
72,3,KNeighbors Classifier,0,1.0,0.9791044776119403,0.9789394329847532,5.459005117416382,0.9789394329847532
73,3,SVC Classifier,0,1.0,0.9761194029850746,0.9759541111282376,1.8083264827728271,0.9759541111282376
74,3,Decision Tree,0,1.0,0.8626865671641791,0.8617689487392648,0.05651974678039551,0.8617689487392648
75,3,RandomForest,0,1.0,0.6880597014925374,0.7461311211476899,0.20331978797912598,0.0
76,3,AdaBoost (Discrete),0,1.0,0.9298507462686567,0.9278820352482705,47.61872673034668,0.9278820352482705
77,3,AdaBoost (Real),0,1.0,0.908955223880597,0.907052787768385,48.45347213745117,0.907052787768385
78,3,Logistic Regression (Penalty = L2),0,1.0,0.9492537313432836,0.9486524157422167,2.0895791053771973,0.9486524157422167
79,3,Naive Bayes,0,1.0,0.926865671641791,0.9258686660127934,0.24155902862548828,0.9258686660127934
80,3,KNeighbors Classifier,1,1.0,0.9671641791044776,0.9669381419417639,4.921463251113892,0.9669381419417639
81,3,SVC Classifier,1,1.0,0.9686567164179104,0.9684850354938194,1.6961827278137207,0.9684850354938194
82,3,Decision Tree,1,1.0,0.8567164179104477,0.8548021965230397,0.06402945518493652,0.8548021965230397
83,3,RandomForest,1,1.0,0.7074626865671642,0.5045868422145746,0.22471308708190918,0.5045868422145746
84,3,AdaBoost (Discrete),1,1.0,0.9417910447761194,0.9410332533173178,44.739598989486694,0.9410332533173178
85,3,AdaBoost (Real),1,1.0,0.9223880597014925,0.9215608491710148,46.183398962020874,0.9215608491710148
86,3,Logistic Regression (Penalty = L2),1,1.0,0.9477611940298507,0.9468369241411904,1.8713977336883545,0.9468369241411904
87,3,Naive Bayes,1,1.0,0.9134328358208955,0.9127727890226641,0.21668171882629395,0.9127727890226641
88,3,KNeighbors Classifier,2,1.0,0.9757575757575757,0.9756109786668183,4.747725963592529,0.9756109786668183
89,3,SVC Classifier,2,1.0,0.9666666666666667,0.9666239453637299,1.7144761085510254,0.9666239453637299
90,3,Decision Tree,2,1.0,0.8378787878787879,0.8362333013120236,0.06161689758300781,0.8362333013120236
91,3,RandomForest,2,1.0,0.7348484848484849,0.5398333026058275,0.2234795093536377,0.5398333026058275
92,3,AdaBoost (Discrete),2,1.0,0.9409090909090909,0.9398517820003452,45.62783145904541,0.9398517820003452
93,3,AdaBoost (Real),2,1.0,0.6106060606060606,0.5473589921946866,44.978376626968384,0.5473589921946866
94,3,Logistic Regression (Penalty = L2),2,1.0,0.9515151515151515,0.951054592445935,2.0331907272338867,0.951054592445935
95,3,Naive Bayes,2,1.0,0.9242424242424242,0.9239434547016669,0.2163393497467041,0.9239434547016669
96,4,KNeighbors Classifier,0,1.0,0.9791044776119403,0.9789394329847532,4.66816520690918,0.9789394329847532
97,4,SVC Classifier,0,1.0,0.9761194029850746,0.9759541111282376,1.5668139457702637,0.9759541111282376
98,4,Decision Tree,0,1.0,0.8641791044776119,0.8632993722265128,0.03711557388305664,0.8632993722265128
99,4,RandomForest,0,1.0,0.6880597014925374,0.7461311211476899,0.15935039520263672,0.0
100,4,AdaBoost (Discrete),0,1.0,0.9298507462686567,0.9278820352482705,43.53898525238037,0.9278820352482705
101,4,AdaBoost (Real),0,1.0,0.9104477611940298,0.9092625540850336,44.88379096984863,0.9092625540850336
102,4,Logistic Regression (Penalty = L2),0,1.0,0.9492537313432836,0.9486524157422167,1.5939557552337646,0.9486524157422167
103,4,Naive Bayes,0,1.0,0.926865671641791,0.9258686660127934,0.2154839038848877,0.9258686660127934
104,4,KNeighbors Classifier,1,1.0,0.9671641791044776,0.9669381419417639,4.6256115436553955,0.9669381419417639
105,4,SVC Classifier,1,1.0,0.9686567164179104,0.9684850354938194,1.4162282943725586,0.9684850354938194
106,4,Decision Tree,1,1.0,0.835820895522388,0.8333608386002755,0.05399918556213379,0.8333608386002755
107,4,RandomForest,1,1.0,0.7074626865671642,0.5045868422145746,0.1808309555053711,0.5045868422145746
108,4,AdaBoost (Discrete),1,1.0,0.9417910447761194,0.9410332533173178,41.09364104270935,0.9410332533173178
109,4,AdaBoost (Real),1,1.0,0.6582089552238806,0.6235838144739656,36.57655167579651,0.6235838144739656
110,4,Logistic Regression (Penalty = L2),1,1.0,0.9477611940298507,0.9468369241411904,1.6385173797607422,0.9468369241411904
111,4,Naive Bayes,1,1.0,0.9134328358208955,0.9127727890226641,0.18956780433654785,0.9127727890226641
112,4,KNeighbors Classifier,2,1.0,0.9757575757575757,0.9756109786668183,4.000809907913208,0.9756109786668183
113,4,SVC Classifier,2,1.0,0.9666666666666667,0.9666239453637299,1.3475110530853271,0.9666239453637299
114,4,Decision Tree,2,1.0,0.8409090909090909,0.8382674584987223,0.060384511947631836,0.8382674584987223
115,4,RandomForest,2,1.0,0.7348484848484849,0.5398333026058275,0.18841123580932617,0.5398333026058275
116,4,AdaBoost (Discrete),2,1.0,0.9409090909090909,0.9398517820003452,40.912540912628174,0.9398517820003452
117,4,AdaBoost (Real),2,1.0,0.8818181818181818,0.8766112820906186,42.371602058410645,0.8766112820906186
118,4,Logistic Regression (Penalty = L2),2,1.0,0.9515151515151515,0.951054592445935,1.7393593788146973,0.951054592445935
119,4,Naive Bayes,2,1.0,0.9242424242424242,0.9239434547016669,0.2186744213104248,0.9239434547016669
120,5,KNeighbors Classifier,0,1.0,0.9791044776119403,0.9789394329847532,4.700139284133911,0.9789394329847532
121,5,SVC Classifier,0,1.0,0.9761194029850746,0.9759541111282376,1.401149034500122,0.9759541111282376
122,5,Decision Tree,0,1.0,0.8313432835820895,0.8287324587812583,0.062160491943359375,0.8287324587812583
123,5,RandomForest,0,1.0,0.6880597014925374,0.7461311211476899,0.18905401229858398,0.0
124,5,AdaBoost (Discrete),0,1.0,0.9298507462686567,0.9278820352482705,38.97200012207031,0.9278820352482705
125,5,AdaBoost (Real),0,1.0,0.9,0.8989473977466081,36.11648941040039,0.8989473977466081
126,5,Logistic Regression (Penalty = L2),0,1.0,0.9492537313432836,0.9486524157422167,1.3603179454803467,0.9486524157422167
127,5,Naive Bayes,0,1.0,0.926865671641791,0.9258686660127934,0.1825568675994873,0.9258686660127934
128,5,KNeighbors Classifier,1,1.0,0.9671641791044776,0.9669381419417639,3.9648072719573975,0.9669381419417639
129,5,SVC Classifier,1,1.0,0.9686567164179104,0.9684850354938194,1.2653756141662598,0.9684850354938194
130,5,Decision Tree,1,1.0,0.8104477611940298,0.8072249281688448,0.06144285202026367,0.8072249281688448
131,5,RandomForest,1,1.0,0.7074626865671642,0.5045868422145746,0.16960644721984863,0.5045868422145746
132,5,AdaBoost (Discrete),1,1.0,0.9417910447761194,0.9410332533173178,33.156673431396484,0.9410332533173178
133,5,AdaBoost (Real),1,1.0,0.9,0.8994344399499135,33.37413692474365,0.8994344399499135
134,5,Logistic Regression (Penalty = L2),1,1.0,0.9477611940298507,0.9468369241411904,1.441776990890503,0.9468369241411904
135,5,Naive Bayes,1,1.0,0.9134328358208955,0.9127727890226641,0.1857302188873291,0.9127727890226641
136,5,KNeighbors Classifier,2,1.0,0.9757575757575757,0.9756109786668183,3.8076558113098145,0.9756109786668183
137,5,SVC Classifier,2,1.0,0.9666666666666667,0.9666239453637299,1.2349846363067627,0.9666239453637299
138,5,Decision Tree,2,1.0,0.8666666666666667,0.865583747128021,0.06177568435668945,0.865583747128021
139,5,RandomForest,2,1.0,0.7348484848484849,0.5398333026058275,0.16046857833862305,0.5398333026058275
140,5,AdaBoost (Discrete),2,1.0,0.9409090909090909,0.9398517820003452,34.143370628356934,0.9398517820003452
141,5,AdaBoost (Real),2,1.0,0.6954545454545454,0.6448470582809783,31.10238766670227,0.6448470582809783
142,5,Logistic Regression (Penalty = L2),2,1.0,0.9515151515151515,0.951054592445935,1.2961595058441162,0.951054592445935
143,5,Naive Bayes,2,1.0,0.9242424242424242,0.9239434547016669,0.2026205062866211,0.9239434547016669
144,6,KNeighbors Classifier,0,1.0,0.9791044776119403,0.9789394329847532,3.4391496181488037,0.9789394329847532
145,6,SVC Classifier,0,1.0,0.9761194029850746,0.9759541111282376,1.212899923324585,0.9759541111282376
146,6,Decision Tree,0,1.0,0.835820895522388,0.8333699247201689,0.046090126037597656,0.8333699247201689
147,6,RandomForest,0,1.0,0.6880597014925374,0.7461311211476899,0.11933302879333496,0.0
148,6,AdaBoost (Discrete),0,1.0,0.9298507462686567,0.9278820352482705,30.36081838607788,0.9278820352482705
149,6,AdaBoost (Real),0,1.0,0.9059701492537313,0.903752856201439,32.07300591468811,0.903752856201439
150,6,Logistic Regression (Penalty = L2),0,1.0,0.9492537313432836,0.9486524157422167,1.2267451286315918,0.9486524157422167
151,6,Naive Bayes,0,1.0,0.926865671641791,0.9258686660127934,0.17164969444274902,0.9258686660127934
152,6,KNeighbors Classifier,1,1.0,0.9671641791044776,0.9669381419417639,3.78484845161438,0.9669381419417639
153,6,SVC Classifier,1,1.0,0.9686567164179104,0.9684850354938194,1.071812391281128,0.9684850354938194
154,6,Decision Tree,1,1.0,0.8253731343283582,0.8241537925816778,0.026950836181640625,0.8241537925816778
155,6,RandomForest,1,1.0,0.7074626865671642,0.5045868422145746,0.12605977058410645,0.5045868422145746
156,6,AdaBoost (Discrete),1,1.0,0.9417910447761194,0.9410332533173178,30.175814390182495,0.9410332533173178
157,6,AdaBoost (Real),1,1.0,0.8925373134328358,0.8915065524823549,28.88216209411621,0.8915065524823549
158,6,Logistic Regression (Penalty = L2),1,1.0,0.9477611940298507,0.9468369241411904,1.2504997253417969,0.9468369241411904
159,6,Naive Bayes,1,1.0,0.9134328358208955,0.9127727890226641,0.18054962158203125,0.9127727890226641
160,6,KNeighbors Classifier,2,1.0,0.9757575757575757,0.9756109786668183,2.8754327297210693,0.9756109786668183
161,6,SVC Classifier,2,1.0,0.9666666666666667,0.9666239453637299,0.9272046089172363,0.9666239453637299
162,6,Decision Tree,2,1.0,0.8515151515151516,0.8493029452120651,0.022874832153320312,0.8493029452120651
163,6,RandomForest,2,1.0,0.7348484848484849,0.5398333026058275,0.12062764167785645,0.5398333026058275
164,6,AdaBoost (Discrete),2,1.0,0.9409090909090909,0.9398517820003452,27.213131189346313,0.9398517820003452
165,6,AdaBoost (Real),2,1.0,0.6075757575757575,0.545379760138507,28.43262267112732,0.545379760138507
166,6,Logistic Regression (Penalty = L2),2,1.0,0.9515151515151515,0.951054592445935,1.286041498184204,0.951054592445935
167,6,Naive Bayes,2,1.0,0.9242424242424242,0.9239434547016669,0.15601849555969238,0.9239434547016669
168,7,KNeighbors Classifier,0,1.0,0.9791044776119403,0.9789394329847532,2.8928446769714355,0.9789394329847532
169,7,SVC Classifier,0,1.0,0.9761194029850746,0.9759541111282376,1.1021554470062256,0.9759541111282376
170,7,Decision Tree,0,1.0,0.8402985074626865,0.8380557203229231,0.03750014305114746,0.8380557203229231
171,7,RandomForest,0,1.0,0.6880597014925374,0.7461311211476899,0.11856865882873535,0.0
172,7,AdaBoost (Discrete),0,1.0,0.9298507462686567,0.9278820352482705,26.133254051208496,0.9278820352482705
173,7,AdaBoost (Real),0,1.0,0.9253731343283582,0.9248557852198753,26.40753436088562,0.9248557852198753
174,7,Logistic Regression (Penalty = L2),0,1.0,0.9492537313432836,0.9486524157422167,1.0902016162872314,0.9486524157422167
175,7,Naive Bayes,0,1.0,0.926865671641791,0.9258686660127934,0.18668270111083984,0.9258686660127934
176,7,KNeighbors Classifier,1,1.0,0.9671641791044776,0.9669381419417639,3.150942087173462,0.9669381419417639
177,7,SVC Classifier,1,1.0,0.9686567164179104,0.9684850354938194,0.875415563583374,0.9684850354938194
178,7,Decision Tree,1,1.0,0.8119402985074626,0.8107494553900189,0.03706216812133789,0.8107494553900189
179,7,RandomForest,1,1.0,0.7074626865671642,0.5045868422145746,0.15064072608947754,0.5045868422145746
180,7,AdaBoost (Discrete),1,1.0,0.9417910447761194,0.9410332533173178,24.986431121826172,0.9410332533173178
181,7,AdaBoost (Real),1,1.0,0.7985074626865671,0.7739869725624728,24.302809715270996,0.7739869725624728
182,7,Logistic Regression (Penalty = L2),1,1.0,0.9477611940298507,0.9468369241411904,1.0425488948822021,0.9468369241411904
183,7,Naive Bayes,1,1.0,0.9134328358208955,0.9127727890226641,0.160552978515625,0.9127727890226641
184,7,KNeighbors Classifier,2,1.0,0.9757575757575757,0.9756109786668183,2.7873804569244385,0.9756109786668183
185,7,SVC Classifier,2,1.0,0.9666666666666667,0.9666239453637299,0.94610595703125,0.9666239453637299
186,7,Decision Tree,2,1.0,0.8636363636363636,0.8610586386270221,0.04475545883178711,0.8610586386270221
187,7,RandomForest,2,1.0,0.7348484848484849,0.5398333026058275,0.12006807327270508,0.5398333026058275
188,7,AdaBoost (Discrete),2,1.0,0.9409090909090909,0.9398517820003452,22.122188806533813,0.9398517820003452
189,7,AdaBoost (Real),2,1.0,0.6075757575757575,0.5462364270227621,23.047298669815063,0.5462364270227621
190,7,Logistic Regression (Penalty = L2),2,1.0,0.9515151515151515,0.951054592445935,1.1553375720977783,0.951054592445935
191,7,Naive Bayes,2,1.0,0.9242424242424242,0.9239434547016669,0.15896844863891602,0.9239434547016669
192,8,KNeighbors Classifier,0,1.0,0.9791044776119403,0.9789394329847532,2.4736313819885254,0.9789394329847532
193,8,SVC Classifier,0,1.0,0.9761194029850746,0.9759541111282376,0.7566006183624268,0.9759541111282376
194,8,Decision Tree,0,1.0,0.8582089552238806,0.8574525380686718,0.026148080825805664,0.8574525380686718
195,8,RandomForest,0,1.0,0.6880597014925374,0.7461311211476899,0.09122395515441895,0.0
196,8,AdaBoost (Discrete),0,1.0,0.9298507462686567,0.9278820352482705,22.178329467773438,0.9278820352482705
197,8,AdaBoost (Real),0,1.0,0.9134328358208955,0.9114423173154956,22.304855585098267,0.9114423173154956
198,8,Logistic Regression (Penalty = L2),0,1.0,0.9492537313432836,0.9486524157422167,0.8727254867553711,0.9486524157422167
199,8,Naive Bayes,0,1.0,0.926865671641791,0.9258686660127934,0.2050788402557373,0.9258686660127934
200,8,KNeighbors Classifier,1,1.0,0.9671641791044776,0.9669381419417639,2.3286333084106445,0.9669381419417639
201,8,SVC Classifier,1,1.0,0.9686567164179104,0.9684850354938194,0.763350248336792,0.9684850354938194
202,8,Decision Tree,1,1.0,0.8402985074626865,0.8390098679010588,0.024164199829101562,0.8390098679010588
203,8,RandomForest,1,1.0,0.7074626865671642,0.5045868422145746,0.0722508430480957,0.5045868422145746
204,8,AdaBoost (Discrete),1,1.0,0.9417910447761194,0.9410332533173178,20.12022352218628,0.9410332533173178
205,8,AdaBoost (Real),1,1.0,0.9194029850746268,0.9185259835152974,19.456629276275635,0.9185259835152974
206,8,Logistic Regression (Penalty = L2),1,1.0,0.9477611940298507,0.9468369241411904,0.8072140216827393,0.9468369241411904
207,8,Naive Bayes,1,1.0,0.9134328358208955,0.9127727890226641,0.13706278800964355,0.9127727890226641
208,8,KNeighbors Classifier,2,1.0,0.9757575757575757,0.9756109786668183,2.1596527099609375,0.9756109786668183
209,8,SVC Classifier,2,1.0,0.9666666666666667,0.9666239453637299,0.727379560470581,0.9666239453637299
210,8,Decision Tree,2,1.0,0.85,0.849001636050657,0.024361848831176758,0.849001636050657
211,8,RandomForest,2,1.0,0.7348484848484849,0.5398333026058275,0.07357501983642578,0.5398333026058275
212,8,AdaBoost (Discrete),2,1.0,0.9409090909090909,0.9398517820003452,19.264766454696655,0.9398517820003452
213,8,AdaBoost (Real),2,1.0,0.6090909090909091,0.5467281092797271,18.918660879135132,0.5467281092797271
214,8,Logistic Regression (Penalty = L2),2,1.0,0.9515151515151515,0.951054592445935,0.5275118350982666,0.951054592445935
215,8,Naive Bayes,2,1.0,0.9242424242424242,0.9239434547016669,0.12223577499389648,0.9239434547016669
216,9,KNeighbors Classifier,0,1.0,0.9791044776119403,0.9789394329847532,1.6466491222381592,0.9789394329847532
217,9,SVC Classifier,0,1.0,0.9761194029850746,0.9759541111282376,0.6682696342468262,0.9759541111282376
218,9,Decision Tree,0,1.0,0.7940298507462686,0.7902900594744896,0.02452993392944336,0.7902900594744896
219,9,RandomForest,0,1.0,0.6880597014925374,0.7461311211476899,0.07449841499328613,0.0
220,9,AdaBoost (Discrete),0,1.0,0.9298507462686567,0.9278820352482705,16.79529070854187,0.9278820352482705
221,9,AdaBoost (Real),0,1.0,0.9164179104477612,0.9153445240052793,17.28414559364319,0.9153445240052793
222,9,Logistic Regression (Penalty = L2),0,1.0,0.9492537313432836,0.9486524157422167,0.6214900016784668,0.9486524157422167
223,9,Naive Bayes,0,1.0,0.926865671641791,0.9258686660127934,0.10337233543395996,0.9258686660127934
224,9,KNeighbors Classifier,1,1.0,0.9671641791044776,0.9669381419417639,1.5564565658569336,0.9669381419417639
225,9,SVC Classifier,1,1.0,0.9686567164179104,0.9684850354938194,0.4502577781677246,0.9684850354938194
226,9,Decision Tree,1,1.0,0.8492537313432836,0.8452437082001903,0.03384757041931152,0.8452437082001903
227,9,RandomForest,1,1.0,0.7074626865671642,0.5045868422145746,0.11271500587463379,0.5045868422145746
228,9,AdaBoost (Discrete),1,1.0,0.9417910447761194,0.9410332533173178,15.430558919906616,0.9410332533173178
229,9,AdaBoost (Real),1,1.0,0.8925373134328358,0.8915462690449898,14.09526538848877,0.8915462690449898
230,9,Logistic Regression (Penalty = L2),1,1.0,0.9477611940298507,0.9468369241411904,0.8330209255218506,0.9468369241411904
231,9,Naive Bayes,1,1.0,0.9134328358208955,0.9127727890226641,0.15445232391357422,0.9127727890226641
232,9,KNeighbors Classifier,2,1.0,0.9757575757575757,0.9756109786668183,1.5439510345458984,0.9756109786668183
233,9,SVC Classifier,2,1.0,0.9666666666666667,0.9666239453637299,0.5243628025054932,0.9666239453637299
234,9,Decision Tree,2,1.0,0.853030303030303,0.8519377199311188,0.013794422149658203,0.8519377199311188
235,9,RandomForest,2,1.0,0.7348484848484849,0.5398333026058275,0.04180502891540527,0.5398333026058275
236,9,AdaBoost (Discrete),2,1.0,0.9409090909090909,0.9398517820003452,15.621532201766968,0.9398517820003452
237,9,AdaBoost (Real),2,1.0,0.6106060606060606,0.5473589921946866,13.729066610336304,0.5473589921946866
238,9,Logistic Regression (Penalty = L2),2,1.0,0.9515151515151515,0.951054592445935,0.5735609531402588,0.951054592445935
239,9,Naive Bayes,2,1.0,0.9242424242424242,0.9239434547016669,0.10196065902709961,0.9239434547016669
240,10,KNeighbors Classifier,0,1.0,0.9791044776119403,0.9789394329847532,1.1618521213531494,0.9789394329847532
241,10,SVC Classifier,0,1.0,0.9761194029850746,0.9759541111282376,0.39026904106140137,0.9759541111282376
242,10,Decision Tree,0,1.0,0.8298507462686567,0.8256059780132493,0.01354670524597168,0.8256059780132493
243,10,RandomForest,0,1.0,0.6880597014925374,0.7461311211476899,0.04454660415649414,0.0
244,10,AdaBoost (Discrete),0,1.0,0.9298507462686567,0.9278820352482705,10.373276710510254,0.9278820352482705
245,10,AdaBoost (Real),0,1.0,0.9208955223880597,0.9201299940629739,11.457131624221802,0.9201299940629739
246,10,Logistic Regression (Penalty = L2),0,1.0,0.9492537313432836,0.9486524157422167,0.561565637588501,0.9486524157422167
247,10,Naive Bayes,0,1.0,0.926865671641791,0.9258686660127934,0.07461881637573242,0.9258686660127934
248,10,KNeighbors Classifier,1,1.0,0.9671641791044776,0.9669381419417639,1.1278183460235596,0.9669381419417639
249,10,SVC Classifier,1,1.0,0.9686567164179104,0.9684850354938194,0.4161865711212158,0.9684850354938194
250,10,Decision Tree,1,1.0,0.8402985074626865,0.8367158031550919,0.009744405746459961,0.8367158031550919
251,10,RandomForest,1,1.0,0.7074626865671642,0.5045868422145746,0.041579484939575195,0.5045868422145746
252,10,AdaBoost (Discrete),1,1.0,0.9417910447761194,0.9410332533173178,11.504971742630005,0.9410332533173178
253,10,AdaBoost (Real),1,1.0,0.8895522388059701,0.888019286169939,10.082780361175537,0.888019286169939
254,10,Logistic Regression (Penalty = L2),1,1.0,0.9477611940298507,0.9468369241411904,0.5627236366271973,0.9468369241411904
255,10,Naive Bayes,1,1.0,0.9134328358208955,0.9127727890226641,0.03149223327636719,0.9127727890226641
256,10,KNeighbors Classifier,2,1.0,0.9757575757575757,0.9756109786668183,0.9525744915008545,0.9756109786668183
257,10,SVC Classifier,2,1.0,0.9666666666666667,0.9666239453637299,0.38404297828674316,0.9666239453637299
258,10,Decision Tree,2,1.0,0.8575757575757575,0.8558110366311156,0.012279272079467773,0.8558110366311156
259,10,RandomForest,2,1.0,0.7348484848484849,0.5398333026058275,0.03769946098327637,0.5398333026058275
260,10,AdaBoost (Discrete),2,1.0,0.9409090909090909,0.9398517820003452,9.142897129058838,0.9398517820003452
261,10,AdaBoost (Real),2,1.0,0.8757575757575757,0.8711397189000453,10.1243896484375,0.8711397189000453
262,10,Logistic Regression (Penalty = L2),2,1.0,0.9515151515151515,0.951054592445935,0.39965271949768066,0.951054592445935
263,10,Naive Bayes,2,1.0,0.9242424242424242,0.9239434547016669,0.03301286697387695,0.9239434547016669
264,11,KNeighbors Classifier,0,1.0,0.9791044776119403,0.9789394329847532,1.2108614444732666,0.9789394329847532
265,11,SVC Classifier,0,1.0,0.9761194029850746,0.9759541111282376,0.44574952125549316,0.9759541111282376
266,11,Decision Tree,0,1.0,0.8462686567164179,0.8448604685734615,0.015416145324707031,0.8448604685734615
267,11,RandomForest,0,1.0,0.6880597014925374,0.7461311211476899,0.04521465301513672,0.0
268,11,AdaBoost (Discrete),0,1.0,0.9298507462686567,0.9278820352482705,9.59558391571045,0.9278820352482705
269,11,AdaBoost (Real),0,1.0,0.9044776119402985,0.9027534266586179,9.96043610572815,0.9027534266586179
270,11,Logistic Regression (Penalty = L2),0,1.0,0.9492537313432836,0.9486524157422167,0.3370497226715088,0.9486524157422167
271,11,Naive Bayes,0,1.0,0.926865671641791,0.9258686660127934,0.038994789123535156,0.9258686660127934
272,11,KNeighbors Classifier,1,1.0,0.9671641791044776,0.9669381419417639,0.9770381450653076,0.9669381419417639
273,11,SVC Classifier,1,1.0,0.9686567164179104,0.9684850354938194,0.3391413688659668,0.9684850354938194
274,11,Decision Tree,1,1.0,0.8492537313432836,0.8480663601406555,0.012721776962280273,0.8480663601406555
275,11,RandomForest,1,1.0,0.7074626865671642,0.5045868422145746,0.03013443946838379,0.5045868422145746
276,11,AdaBoost (Discrete),1,1.0,0.9417910447761194,0.9410332533173178,9.172995328903198,0.9410332533173178
277,11,AdaBoost (Real),1,1.0,0.8955223880597015,0.8945590449403935,8.757873773574829,0.8945590449403935
278,11,Logistic Regression (Penalty = L2),1,1.0,0.9477611940298507,0.9468369241411904,0.36722469329833984,0.9468369241411904
279,11,Naive Bayes,1,1.0,0.9134328358208955,0.9127727890226641,0.038849592208862305,0.9127727890226641
280,11,KNeighbors Classifier,2,1.0,0.9757575757575757,0.9756109786668183,0.9222042560577393,0.9756109786668183
281,11,SVC Classifier,2,1.0,0.9666666666666667,0.9666239453637299,0.2998507022857666,0.9666239453637299
282,11,Decision Tree,2,1.0,0.8545454545454545,0.8522280736664155,0.009915828704833984,0.8522280736664155
283,11,RandomForest,2,1.0,0.7348484848484849,0.5398333026058275,0.03875017166137695,0.5398333026058275
284,11,AdaBoost (Discrete),2,1.0,0.9409090909090909,0.9398517820003452,7.72346830368042,0.9398517820003452
285,11,AdaBoost (Real),2,1.0,0.6075757575757575,0.545379760138507,7.4378135204315186,0.545379760138507
286,11,Logistic Regression (Penalty = L2),2,1.0,0.9515151515151515,0.951054592445935,0.441939115524292,0.951054592445935
287,11,Naive Bayes,2,1.0,0.9242424242424242,0.9239434547016669,0.03780245780944824,0.9239434547016669
288,12,KNeighbors Classifier,0,1.0,0.9791044776119403,0.9789394329847532,0.8174664974212646,0.9789394329847532
289,12,SVC Classifier,0,1.0,0.9761194029850746,0.9759541111282376,0.28179311752319336,0.9759541111282376
290,12,Decision Tree,0,1.0,0.8462686567164179,0.8442584612129851,0.012045621871948242,0.8442584612129851
291,12,RandomForest,0,1.0,0.6880597014925374,0.7461311211476899,0.031507015228271484,0.0
292,12,AdaBoost (Discrete),0,1.0,0.9298507462686567,0.9278820352482705,6.962872505187988,0.9278820352482705
293,12,AdaBoost (Real),0,1.0,0.917910447761194,0.9166114386397742,7.451867580413818,0.9166114386397742
294,12,Logistic Regression (Penalty = L2),0,1.0,0.9492537313432836,0.9486524157422167,0.31128740310668945,0.9486524157422167
295,12,Naive Bayes,0,1.0,0.926865671641791,0.9258686660127934,0.03691244125366211,0.9258686660127934
296,12,KNeighbors Classifier,1,1.0,0.9671641791044776,0.9669381419417639,0.8153345584869385,0.9669381419417639
297,12,SVC Classifier,1,1.0,0.9686567164179104,0.9684850354938194,0.2808530330657959,0.9684850354938194
298,12,Decision Tree,1,1.0,0.8194029850746268,0.8168178099381483,0.010850906372070312,0.8168178099381483
299,12,RandomForest,1,1.0,0.7074626865671642,0.5045868422145746,0.02966594696044922,0.5045868422145746
300,12,AdaBoost (Discrete),1,1.0,0.9417910447761194,0.9410332533173178,7.052404165267944,0.9410332533173178
301,12,AdaBoost (Real),1,1.0,0.9014925373134328,0.8997759978564005,6.804102897644043,0.8997759978564005
302,12,Logistic Regression (Penalty = L2),1,1.0,0.9477611940298507,0.9468369241411904,0.30077028274536133,0.9468369241411904
303,12,Naive Bayes,1,1.0,0.9134328358208955,0.9127727890226641,0.08292078971862793,0.9127727890226641
304,12,KNeighbors Classifier,2,1.0,0.9757575757575757,0.9756109786668183,0.7884814739227295,0.9756109786668183
305,12,SVC Classifier,2,1.0,0.9666666666666667,0.9666239453637299,0.2883765697479248,0.9666239453637299
306,12,Decision Tree,2,1.0,0.8469696969696969,0.8445556443998978,0.01004648208618164,0.8445556443998978
307,12,RandomForest,2,1.0,0.7348484848484849,0.5398333026058275,0.032721757888793945,0.5398333026058275
308,12,AdaBoost (Discrete),2,1.0,0.9409090909090909,0.9398517820003452,6.997259616851807,0.9398517820003452
309,12,AdaBoost (Real),2,1.0,0.6060606060606061,0.5443877362219194,7.146147012710571,0.5443877362219194
310,12,Logistic Regression (Penalty = L2),2,1.0,0.9515151515151515,0.951054592445935,0.3146364688873291,0.951054592445935
311,12,Naive Bayes,2,1.0,0.9242424242424242,0.9239434547016669,0.04595041275024414,0.9239434547016669
