,feat_set_id,classifier,fold_id,feat_th,score,geo_score,exec_t,geo_score_woz
0,0,KNeighbors Classifier,0,1.0,0.9538955354537496,0.94787631834706,0.7511191368103027,0.94787631834706
1,0,SVC Classifier,0,1.0,0.9569594397432156,0.9711899144463835,14.458828926086426,0.9711899144463835
2,0,Decision Tree,0,1.0,0.9528742340239277,0.9415304544868828,0.14401602745056152,0.9415304544868828
3,0,RandomForest,0,1.0,0.9833673767143274,0.9812279802095485,0.4865713119506836,0.9812279802095485
4,0,AdaBoost (Discrete),0,1.0,0.9400350160490225,0.9404728085167121,53.25476288795471,0.9404728085167121
5,0,AdaBoost (Real),0,1.0,0.9172745841844179,0.8911287558108761,55.57054352760315,0.8911287558108761
6,0,Logistic Regression (Penalty = L2),0,1.0,0.9862853807995331,0.9892993113713012,0.2269895076751709,0.9892993113713012
7,0,Naive Bayes,0,1.0,0.9620659468923256,0.9743879197638988,0.08513474464416504,0.9743879197638988
8,0,KNeighbors Classifier,1,1.0,0.8961038961038961,0.8333252580897204,0.5543150901794434,0.8333252580897204
9,0,SVC Classifier,1,1.0,0.9751933459798628,0.9828803051827577,7.562970399856567,0.9828803051827577
10,0,Decision Tree,1,1.0,0.9441120677075733,0.9285419659085269,0.09441089630126953,0.9285419659085269
11,0,RandomForest,1,1.0,0.9854078505763899,0.9876308916916071,0.22414064407348633,0.9876308916916071
12,0,AdaBoost (Discrete),1,1.0,0.962352254487086,0.9591511078827089,32.34326100349426,0.9591511078827089
13,0,AdaBoost (Real),1,1.0,0.9525755143732672,0.9465605854433546,40.17888140678406,0.9465605854433546
14,0,Logistic Regression (Penalty = L2),1,1.0,0.9854078505763899,0.9876308916916071,0.22621965408325195,0.9876308916916071
15,0,Naive Bayes,1,1.0,0.9579746096600029,0.971452202041036,0.0520176887512207,0.971452202041036
16,0,KNeighbors Classifier,2,1.0,0.9190135706989639,0.8657483598445755,0.6483769416809082,0.8657483598445755
17,0,SVC Classifier,2,1.0,0.9792791478184737,0.9860043989092296,3.7319655418395996,0.9860043989092296
18,0,Decision Tree,2,1.0,0.9521377498905589,0.923275606035139,0.046602487564086914,0.923275606035139
19,0,RandomForest,2,1.0,0.9959141981613892,0.9964590207390621,0.18060922622680664,0.9964590207390621
20,0,AdaBoost (Discrete),2,1.0,0.9087990661024369,0.8867976331621862,22.203298807144165,0.8867976331621862
21,0,AdaBoost (Real),2,1.0,0.8704217131183424,0.8556702861798936,24.37243390083313,0.8556702861798936
22,0,Logistic Regression (Penalty = L2),2,1.0,0.994309061724792,0.9954137671039203,0.06579709053039551,0.9954137671039203
23,0,Naive Bayes,2,1.0,0.9028162848387568,0.9342909385205673,0.027332067489624023,0.9342909385205673
