,feat_set_id,classifier,fold_id,feat_th,score,geo_score,exec_t,geo_score_woz
0,0,KNeighbors Classifier,0,0.95,0.7820895522388059,0.742630648658263,11.107439756393433,0.742630648658263
1,0,SVC Classifier,0,0.95,0.753731343283582,0.7237167990672361,11.234944581985474,0.7237167990672361
2,0,Decision Tree,0,0.95,0.5955223880597015,0.5703872374637454,0.672447919845581,0.5703872374637454
3,0,RandomForest,0,0.95,0.6447761194029851,0.5089848362855602,1.6727170944213867,0.5089848362855602
4,0,AdaBoost (Discrete),0,0.95,0.7388059701492538,0.7178718572428147,657.9271066188812,0.7178718572428147
5,0,AdaBoost (Real),0,0.95,0.5313432835820896,0.34048298349319206,638.0125503540039,0.34048298349319206
6,0,Logistic Regression (Penalty = L2),0,0.95,0.8059701492537313,0.7877116231013738,7.12028956413269,0.7877116231013738
7,0,Naive Bayes,0,0.95,0.7477611940298508,0.7200200919311621,0.585608959197998,0.7200200919311621
8,0,KNeighbors Classifier,1,0.95,0.8059701492537313,0.7795789554279569,11.264697074890137,0.7795789554279569
9,0,SVC Classifier,1,0.95,0.7492537313432835,0.7175267843632338,12.415924072265625,0.7175267843632338
10,0,Decision Tree,1,0.95,0.655223880597015,0.6288942577433447,0.7017946243286133,0.6288942577433447
11,0,RandomForest,1,0.95,0.664179104477612,0.5238499124802868,1.6984732151031494,0.5238499124802868
12,0,AdaBoost (Discrete),1,0.95,0.7701492537313432,0.7541946044725996,733.8698928356171,0.7541946044725996
13,0,AdaBoost (Real),1,0.95,0.4835820895522388,0.35978438906267296,673.106705904007,0.35978438906267296
14,0,Logistic Regression (Penalty = L2),1,0.95,0.7865671641791044,0.7648039485705315,6.375918865203857,0.7648039485705315
15,0,Naive Bayes,1,0.95,0.7477611940298508,0.7223081667998794,0.5527524948120117,0.7223081667998794
16,0,KNeighbors Classifier,2,0.95,0.796969696969697,0.7633468606323749,10.86601972579956,0.7633468606323749
17,0,SVC Classifier,2,0.95,0.7909090909090909,0.7442932210681629,12.222038269042969,0.7442932210681629
18,0,Decision Tree,2,0.95,0.6909090909090909,0.6641526540276308,0.702965497970581,0.6641526540276308
19,0,RandomForest,2,0.95,0.6984848484848485,0.6660813910117034,1.863703966140747,0.6660813910117034
20,0,AdaBoost (Discrete),2,0.95,0.7696969696969697,0.7523114416244985,665.3089771270752,0.7523114416244985
21,0,AdaBoost (Real),2,0.95,0.48484848484848486,0.25808953837116616,653.2412886619568,0.25808953837116616
22,0,Logistic Regression (Penalty = L2),2,0.95,0.8136363636363636,0.7951613499981331,6.493739366531372,0.7951613499981331
23,0,Naive Bayes,2,0.95,0.7712121212121212,0.7448150553392466,0.713470458984375,0.7448150553392466
24,1,KNeighbors Classifier,0,0.95,0.7865671641791044,0.7560372899198164,13.505685567855835,0.7560372899198164
25,1,SVC Classifier,0,0.95,0.755223880597015,0.7229490986693519,14.594985723495483,0.7229490986693519
26,1,Decision Tree,0,0.95,0.6373134328358209,0.6157699385081561,0.6727302074432373,0.6157699385081561
27,1,RandomForest,0,0.95,0.6417910447761194,0.5189199827412047,2.032345771789551,0.5189199827412047
28,1,AdaBoost (Discrete),0,0.95,0.7731343283582089,0.7621260917727836,691.5373339653015,0.7621260917727836
29,1,AdaBoost (Real),0,0.95,0.5328358208955224,0.34108615761380573,606.391407251358,0.34108615761380573
30,1,Logistic Regression (Penalty = L2),0,0.95,0.8044776119402985,0.787541429712379,6.263208389282227,0.787541429712379
31,1,Naive Bayes,0,0.95,0.7522388059701492,0.7231321849329665,0.5598251819610596,0.7231321849329665
32,1,KNeighbors Classifier,1,0.95,0.8,0.7637902739968723,11.751063108444214,0.7637902739968723
33,1,SVC Classifier,1,0.95,0.753731343283582,0.7200543706206024,11.733497619628906,0.7200543706206024
34,1,Decision Tree,1,0.95,0.6298507462686567,0.5999239979853167,0.6489841938018799,0.5999239979853167
35,1,RandomForest,1,0.95,0.655223880597015,0.5582860338646879,1.7080390453338623,0.5582860338646879
36,1,AdaBoost (Discrete),1,0.95,0.7567164179104477,0.7392516215413586,1628.1821236610413,0.7392516215413586
37,1,AdaBoost (Real),1,0.95,0.5194029850746269,0.446037937896442,445.690936088562,0.446037937896442
38,1,Logistic Regression (Penalty = L2),1,0.95,0.7865671641791044,0.7663249727461722,4.55057692527771,0.7663249727461722
39,1,Naive Bayes,1,0.95,0.744776119402985,0.7187353966595935,0.4153761863708496,0.7187353966595935
40,1,KNeighbors Classifier,2,0.95,0.7984848484848485,0.7673564914725437,7.960810661315918,0.7673564914725437
41,1,SVC Classifier,2,0.95,0.793939393939394,0.7576360985160209,8.965784072875977,0.7576360985160209
42,1,Decision Tree,2,0.95,0.6803030303030303,0.6577873339215601,0.4195835590362549,0.6577873339215601
43,1,RandomForest,2,0.95,0.696969696969697,0.653242515126191,1.390674352645874,0.653242515126191
44,1,AdaBoost (Discrete),2,0.95,0.7909090909090909,0.7748449309256532,422.7246763706207,0.7748449309256532
45,1,AdaBoost (Real),2,0.95,0.593939393939394,0.5312780945772427,390.415100812912,0.5312780945772427
46,1,Logistic Regression (Penalty = L2),2,0.95,0.8075757575757576,0.7898648188532629,4.39503288269043,0.7898648188532629
47,1,Naive Bayes,2,0.95,0.7772727272727272,0.7562336315449174,0.3375706672668457,0.7562336315449174
48,2,KNeighbors Classifier,0,0.95,0.7910447761194029,0.7576702294142335,7.675219297409058,0.7576702294142335
49,2,SVC Classifier,0,0.95,0.753731343283582,0.7260205236746703,8.024571895599365,0.7260205236746703
50,2,Decision Tree,0,0.95,0.6313432835820896,0.6106569502273063,0.33662939071655273,0.6106569502273063
51,2,RandomForest,0,0.95,0.6447761194029851,0.5650266820890659,1.0700139999389648,0.5650266820890659
52,2,AdaBoost (Discrete),0,0.95,0.7701492537313432,0.7594726273942726,407.57428336143494,0.7594726273942726
53,2,AdaBoost (Real),0,0.95,0.5313432835820896,0.34048298349319206,381.1374032497406,0.34048298349319206
54,2,Logistic Regression (Penalty = L2),0,0.95,0.8029850746268656,0.7858618465865425,3.1901721954345703,0.7858618465865425
55,2,Naive Bayes,0,0.95,0.7656716417910447,0.7394096873847988,0.28082752227783203,0.7394096873847988
56,2,KNeighbors Classifier,1,0.95,0.7940298507462686,0.7561389276728877,5.927014589309692,0.7561389276728877
57,2,SVC Classifier,1,0.95,0.7522388059701492,0.7199394350024951,6.670683145523071,0.7199394350024951
58,2,Decision Tree,1,0.95,0.6328358208955224,0.6095747788510134,0.3024613857269287,0.6095747788510134
59,2,RandomForest,1,0.95,0.6417910447761194,0.5062327094053818,0.8443918228149414,0.5062327094053818
60,2,AdaBoost (Discrete),1,0.95,0.7761194029850746,0.7596250981627174,343.56933426856995,0.7596250981627174
61,2,AdaBoost (Real),1,0.95,0.47761194029850745,0.3529088340243727,337.0152292251587,0.3529088340243727
62,2,Logistic Regression (Penalty = L2),1,0.95,0.7865671641791044,0.7618976276514551,3.6745247840881348,0.7618976276514551
63,2,Naive Bayes,1,0.95,0.7492537313432835,0.7223865165641467,0.21813559532165527,0.7223865165641467
64,2,KNeighbors Classifier,2,0.95,0.8121212121212121,0.7890233429800317,5.669117212295532,0.7890233429800317
65,2,SVC Classifier,2,0.95,0.793939393939394,0.7527006993400746,6.246997356414795,0.7527006993400746
66,2,Decision Tree,2,0.95,0.6484848484848484,0.6196301696123873,0.2862691879272461,0.6196301696123873
67,2,RandomForest,2,0.95,0.6666666666666666,0.6172338393702138,0.9313697814941406,0.6172338393702138
68,2,AdaBoost (Discrete),2,0.95,0.7681818181818182,0.7394499818427747,357.77755427360535,0.7394499818427747
69,2,AdaBoost (Real),2,0.95,0.7181818181818181,0.6981038582187823,321.46760535240173,0.6981038582187823
70,2,Logistic Regression (Penalty = L2),2,0.95,0.8181818181818182,0.7995452868559172,3.3418660163879395,0.7995452868559172
71,2,Naive Bayes,2,0.95,0.7727272727272727,0.7500436553041231,0.2830617427825928,0.7500436553041231
72,3,KNeighbors Classifier,0,0.95,0.7865671641791044,0.7541505359203834,5.879107475280762,0.7541505359203834
73,3,SVC Classifier,0,0.95,0.755223880597015,0.7257781530549717,6.265268564224243,0.7257781530549717
74,3,Decision Tree,0,0.95,0.6432835820895523,0.6175042222671077,0.3049182891845703,0.6175042222671077
75,3,RandomForest,0,0.95,0.6417910447761194,0.5337181234235098,0.8587527275085449,0.5337181234235098
76,3,AdaBoost (Discrete),0,0.95,0.7522388059701492,0.7390750413273138,350.1806514263153,0.7390750413273138
77,3,AdaBoost (Real),0,0.95,0.5328358208955224,0.34108615761380573,348.07935905456543,0.34108615761380573
78,3,Logistic Regression (Penalty = L2),0,0.95,0.808955223880597,0.7926388484628957,3.0868260860443115,0.7926388484628957
79,3,Naive Bayes,0,0.95,0.755223880597015,0.7271959486044085,0.31565070152282715,0.7271959486044085
80,3,KNeighbors Classifier,1,0.95,0.7985074626865671,0.7614908383000719,5.780766248703003,0.7614908383000719
81,3,SVC Classifier,1,0.95,0.7597014925373134,0.7299996101082593,6.457728862762451,0.7299996101082593
82,3,Decision Tree,1,0.95,0.6119402985074627,0.5825849498963592,0.32767701148986816,0.5825849498963592
83,3,RandomForest,1,0.95,0.6582089552238806,0.47935536159130593,1.0532646179199219,0.47935536159130593
84,3,AdaBoost (Discrete),1,0.95,0.7388059701492538,0.7137223613243447,374.39810705184937,0.7137223613243447
85,3,AdaBoost (Real),1,0.95,0.5194029850746269,0.446037937896442,378.97634983062744,0.446037937896442
86,3,Logistic Regression (Penalty = L2),1,0.95,0.7865671641791044,0.7669967733108409,3.6477978229522705,0.7669967733108409
87,3,Naive Bayes,1,0.95,0.7507462686567165,0.7254862910225404,0.44513511657714844,0.7254862910225404
88,3,KNeighbors Classifier,2,0.95,0.8015151515151515,0.7706890073490269,6.762821435928345,0.7706890073490269
89,3,SVC Classifier,2,0.95,0.7954545454545454,0.7613416498508243,7.419195890426636,0.7613416498508243
90,3,Decision Tree,2,0.95,0.65,0.6250583274960947,0.4368906021118164,0.6250583274960947
91,3,RandomForest,2,0.95,0.6924242424242424,0.5610171112217521,1.138646125793457,0.5610171112217521
92,3,AdaBoost (Discrete),2,0.95,0.7712121212121212,0.7568297376304854,360.2942535877228,0.7568297376304854
93,3,AdaBoost (Real),2,0.95,0.6666666666666666,0.6367584143918038,315.16632652282715,0.6367584143918038
94,3,Logistic Regression (Penalty = L2),2,0.95,0.8166666666666667,0.8012053144784759,3.2787458896636963,0.8012053144784759
95,3,Naive Bayes,2,0.95,0.7757575757575758,0.7518867606214676,0.424790620803833,0.7518867606214676
96,4,KNeighbors Classifier,0,0.95,0.7820895522388059,0.7395949130468014,6.063318729400635,0.7395949130468014
97,4,SVC Classifier,0,0.95,0.755223880597015,0.7281108377289066,6.914318561553955,0.7281108377289066
98,4,Decision Tree,0,0.95,0.6253731343283582,0.5907904117402774,0.3396320343017578,0.5907904117402774
99,4,RandomForest,0,0.95,0.6238805970149254,0.5040137207059802,1.0891797542572021,0.5040137207059802
100,4,AdaBoost (Discrete),0,0.95,0.7880597014925373,0.7752408997447402,342.41491985321045,0.7752408997447402
101,4,AdaBoost (Real),0,0.95,0.5313432835820896,0.34048298349319206,331.9763414859772,0.34048298349319206
102,4,Logistic Regression (Penalty = L2),0,0.95,0.808955223880597,0.7939555849781053,2.9962704181671143,0.7939555849781053
103,4,Naive Bayes,0,0.95,0.753731343283582,0.7272965320557259,0.3480224609375,0.7272965320557259
104,4,KNeighbors Classifier,1,0.95,0.8044776119402985,0.7731232639408308,5.610699653625488,0.7731232639408308
105,4,SVC Classifier,1,0.95,0.7492537313432835,0.7159718216106264,6.5211427211761475,0.7159718216106264
106,4,Decision Tree,1,0.95,0.6537313432835821,0.6337291340371962,0.3824462890625,0.6337291340371962
107,4,RandomForest,1,0.95,0.6194029850746269,0.43624238858708025,0.9023065567016602,0.43624238858708025
108,4,AdaBoost (Discrete),1,0.95,0.7626865671641792,0.7445568380912964,324.84062337875366,0.7445568380912964
109,4,AdaBoost (Real),1,0.95,0.6597014925373135,0.6321138328628174,289.7842319011688,0.6321138328628174
110,4,Logistic Regression (Penalty = L2),1,0.95,0.7880597014925373,0.7648810533737096,2.9648098945617676,0.7648810533737096
111,4,Naive Bayes,1,0.95,0.755223880597015,0.7301026644529931,0.30437755584716797,0.7301026644529931
112,4,KNeighbors Classifier,2,0.95,0.8045454545454546,0.7781517303608894,5.319879770278931,0.7781517303608894
113,4,SVC Classifier,2,0.95,0.7954545454545454,0.7588853204080876,6.105027198791504,0.7588853204080876
114,4,Decision Tree,2,0.95,0.6666666666666666,0.6406094822345677,0.2834010124206543,0.6406094822345677
115,4,RandomForest,2,0.95,0.6924242424242424,0.5610171112217521,0.907677412033081,0.5610171112217521
116,4,AdaBoost (Discrete),2,0.95,0.7606060606060606,0.7449527819122013,301.0796842575073,0.7449527819122013
117,4,AdaBoost (Real),2,0.95,0.5606060606060606,0.4802317654648188,280.3354334831238,0.4802317654648188
118,4,Logistic Regression (Penalty = L2),2,0.95,0.8166666666666667,0.7981969281928418,2.7155773639678955,0.7981969281928418
119,4,Naive Bayes,2,0.95,0.7757575757575758,0.7528291588224091,0.27280187606811523,0.7528291588224091
120,5,KNeighbors Classifier,0,0.95,0.7925373134328358,0.7626785391568497,5.006614446640015,0.7626785391568497
121,5,SVC Classifier,0,0.95,0.7567164179104477,0.7292346597275421,5.30896258354187,0.7292346597275421
122,5,Decision Tree,0,0.95,0.6940298507462687,0.6782981704613037,0.21055912971496582,0.6782981704613037
123,5,RandomForest,0,0.95,0.6268656716417911,0.5308742180580012,0.834709644317627,0.0
124,5,AdaBoost (Discrete),0,0.95,0.7582089552238805,0.7425930838836864,271.4651391506195,0.7425930838836864
125,5,AdaBoost (Real),0,0.95,0.5313432835820896,0.34048298349319206,264.7508885860443,0.34048298349319206
126,5,Logistic Regression (Penalty = L2),0,0.95,0.8029850746268656,0.7844188994841114,2.259007215499878,0.7844188994841114
127,5,Naive Bayes,0,0.95,0.7656716417910447,0.7381118468541256,0.2423849105834961,0.7381118468541256
128,5,KNeighbors Classifier,1,0.95,0.8,0.7627461153387399,4.344581127166748,0.7627461153387399
129,5,SVC Classifier,1,0.95,0.7507462686567165,0.7178312809979742,5.050807476043701,0.7178312809979742
130,5,Decision Tree,1,0.95,0.6791044776119403,0.6519353458381497,0.2355175018310547,0.6519353458381497
131,5,RandomForest,1,0.95,0.6268656716417911,0.4970510349250316,0.6624102592468262,0.4970510349250316
132,5,AdaBoost (Discrete),1,0.95,0.7611940298507462,0.74615884709886,262.2213590145111,0.74615884709886
133,5,AdaBoost (Real),1,0.95,0.5194029850746269,0.446037937896442,249.74894952774048,0.446037937896442
134,5,Logistic Regression (Penalty = L2),1,0.95,0.7865671641791044,0.767385017451074,2.1223902702331543,0.767385017451074
135,5,Naive Bayes,1,0.95,0.746268656716418,0.7211730708126858,0.23086118698120117,0.7211730708126858
136,5,KNeighbors Classifier,2,0.95,0.803030303030303,0.7743041243971173,4.153719425201416,0.7743041243971173
137,5,SVC Classifier,2,0.95,0.7954545454545454,0.7591682757364377,4.679267168045044,0.7591682757364377
138,5,Decision Tree,2,0.95,0.7075757575757575,0.6916995955338365,0.352769136428833,0.6916995955338365
139,5,RandomForest,2,0.95,0.6833333333333333,0.5146852466432391,0.7378089427947998,0.5146852466432391
140,5,AdaBoost (Discrete),2,0.95,0.7803030303030303,0.7677420099378518,226.86875414848328,0.7677420099378518
141,5,AdaBoost (Real),2,0.95,0.7333333333333333,0.7164357956213154,204.4176573753357,0.7164357956213154
142,5,Logistic Regression (Penalty = L2),2,0.95,0.8257575757575758,0.8104125162255584,1.9314696788787842,0.8104125162255584
143,5,Naive Bayes,2,0.95,0.7772727272727272,0.7551119551472467,0.23536205291748047,0.7551119551472467
144,6,KNeighbors Classifier,0,0.95,0.7880597014925373,0.7572380907971001,3.5397286415100098,0.7572380907971001
145,6,SVC Classifier,0,0.95,0.753731343283582,0.7206611355817029,3.8614108562469482,0.7206611355817029
146,6,Decision Tree,0,0.95,0.6268656716417911,0.5874647629631878,0.19969606399536133,0.5874647629631878
147,6,RandomForest,0,0.95,0.6223880597014926,0.5503111541379796,0.48438358306884766,0.5503111541379796
148,6,AdaBoost (Discrete),0,0.95,0.755223880597015,0.7410277941535323,212.62473678588867,0.7410277941535323
149,6,AdaBoost (Real),0,0.95,0.5313432835820896,0.34048298349319206,206.19663429260254,0.34048298349319206
150,6,Logistic Regression (Penalty = L2),0,0.95,0.8119402985074626,0.7973240048674232,1.9484302997589111,0.7973240048674232
151,6,Naive Bayes,0,0.95,0.7477611940298508,0.7213157983375239,0.17859983444213867,0.7213157983375239
152,6,KNeighbors Classifier,1,0.95,0.8029850746268656,0.7727740053120309,3.5982518196105957,0.7727740053120309
153,6,SVC Classifier,1,0.95,0.7507462686567165,0.719040028695167,3.913865089416504,0.719040028695167
154,6,Decision Tree,1,0.95,0.6686567164179105,0.6521588805015368,0.1753406524658203,0.6521588805015368
155,6,RandomForest,1,0.95,0.5716417910447761,0.4799125085758902,0.5368890762329102,0.4799125085758902
156,6,AdaBoost (Discrete),1,0.95,0.7582089552238805,0.7417743349963356,185.75321078300476,0.7417743349963356
157,6,AdaBoost (Real),1,0.95,0.5029850746268657,0.3746341580390796,188.70800876617432,0.3746341580390796
158,6,Logistic Regression (Penalty = L2),1,0.95,0.7910447761194029,0.7721736486042534,1.76314377784729,0.7721736486042534
159,6,Naive Bayes,1,0.95,0.7432835820895523,0.7144202597086551,0.21230697631835938,0.7144202597086551
160,6,KNeighbors Classifier,2,0.95,0.793939393939394,0.7619336217539815,3.2145864963531494,0.7619336217539815
161,6,SVC Classifier,2,0.95,0.7909090909090909,0.7496955101938233,3.5230236053466797,0.7496955101938233
162,6,Decision Tree,2,0.95,0.646969696969697,0.6301916975452941,0.15549254417419434,0.6301916975452941
163,6,RandomForest,2,0.95,0.6378787878787879,0.5709787282155733,0.5123605728149414,0.5709787282155733
164,6,AdaBoost (Discrete),2,0.95,0.7772727272727272,0.7603754510366065,177.08440017700195,0.7603754510366065
165,6,AdaBoost (Real),2,0.95,0.706060606060606,0.6711564240609857,157.85708713531494,0.6711564240609857
166,6,Logistic Regression (Penalty = L2),2,0.95,0.8121212121212121,0.792937096280671,1.7257587909698486,0.792937096280671
167,6,Naive Bayes,2,0.95,0.7727272727272727,0.7493702244074858,0.16847014427185059,0.7493702244074858
168,7,KNeighbors Classifier,0,0.95,0.7820895522388059,0.748830235760714,3.0756211280822754,0.748830235760714
169,7,SVC Classifier,0,0.95,0.753731343283582,0.7211640810209948,3.0980279445648193,0.7211640810209948
170,7,Decision Tree,0,0.95,0.6328358208955224,0.5989857447012584,0.14320826530456543,0.5989857447012584
171,7,RandomForest,0,0.95,0.5656716417910448,0.4805019445468778,0.4037508964538574,0.4805019445468778
172,7,AdaBoost (Discrete),0,0.95,0.7656716417910447,0.7534678750477972,156.61633729934692,0.7534678750477972
173,7,AdaBoost (Real),0,0.95,0.5313432835820896,0.34048298349319206,153.3766210079193,0.34048298349319206
174,7,Logistic Regression (Penalty = L2),0,0.95,0.8029850746268656,0.784967580232477,1.4273879528045654,0.784967580232477
175,7,Naive Bayes,0,0.95,0.7432835820895523,0.7145454546775741,0.1448194980621338,0.7145454546775741
176,7,KNeighbors Classifier,1,0.95,0.7970149253731343,0.7662808781518902,2.6782774925231934,0.7662808781518902
177,7,SVC Classifier,1,0.95,0.7507462686567165,0.7186888605826875,2.9251863956451416,0.7186888605826875
178,7,Decision Tree,1,0.95,0.6716417910447762,0.653388250859227,0.12148475646972656,0.653388250859227
179,7,RandomForest,1,0.95,0.5985074626865672,0.4426354641269279,0.4342186450958252,0.4426354641269279
180,7,AdaBoost (Discrete),1,0.95,0.7432835820895523,0.7275661388637117,137.3055181503296,0.7275661388637117
181,7,AdaBoost (Real),1,0.95,0.5029850746268657,0.3746341580390796,126.6161596775055,0.3746341580390796
182,7,Logistic Regression (Penalty = L2),1,0.95,0.7820895522388059,0.7601737593423059,1.132777214050293,0.7601737593423059
183,7,Naive Bayes,1,0.95,0.7402985074626866,0.7118262225092905,0.14008641242980957,0.7118262225092905
184,7,KNeighbors Classifier,2,0.95,0.7984848484848485,0.7676612429529495,2.197340726852417,0.7676612429529495
185,7,SVC Classifier,2,0.95,0.7909090909090909,0.7442932210681629,2.475328207015991,0.7442932210681629
186,7,Decision Tree,2,0.95,0.6590909090909091,0.6374176520363936,0.11959075927734375,0.6374176520363936
187,7,RandomForest,2,0.95,0.6333333333333333,0.5499379283234281,0.35860562324523926,0.5499379283234281
188,7,AdaBoost (Discrete),2,0.95,0.7803030303030303,0.7603665624866315,118.45102310180664,0.7603665624866315
189,7,AdaBoost (Real),2,0.95,0.47878787878787876,0.2547612767517785,103.39548683166504,0.2547612767517785
190,7,Logistic Regression (Penalty = L2),2,0.95,0.8136363636363636,0.794206838245699,1.2281286716461182,0.794206838245699
191,7,Naive Bayes,2,0.95,0.7727272727272727,0.7482856622049897,0.14385533332824707,0.7482856622049897
192,8,KNeighbors Classifier,0,0.95,0.7910447761194029,0.757538523104106,1.6371097564697266,0.757538523104106
193,8,SVC Classifier,0,0.95,0.7582089552238805,0.7317126491264052,1.6995370388031006,0.7317126491264052
194,8,Decision Tree,0,0.95,0.6686567164179105,0.6452699960535967,0.09667229652404785,0.6452699960535967
195,8,RandomForest,0,0.95,0.6074626865671642,0.5409160929061664,0.28943943977355957,0.5409160929061664
196,8,AdaBoost (Discrete),0,0.95,0.7611940298507462,0.7445479025438478,92.09601998329163,0.7445479025438478
197,8,AdaBoost (Real),0,0.95,0.5328358208955224,0.34108615761380573,99.91623210906982,0.34108615761380573
198,8,Logistic Regression (Penalty = L2),0,0.95,0.8074626865671641,0.7919952887576119,0.9857461452484131,0.7919952887576119
199,8,Naive Bayes,0,0.95,0.7611940298507462,0.73504445738018,0.11082029342651367,0.73504445738018
200,8,KNeighbors Classifier,1,0.95,0.8059701492537313,0.7698770263949897,1.8397812843322754,0.7698770263949897
201,8,SVC Classifier,1,0.95,0.7567164179104477,0.7271871965369984,1.926290512084961,0.7271871965369984
202,8,Decision Tree,1,0.95,0.6268656716417911,0.5978529314808188,0.0917201042175293,0.5978529314808188
203,8,RandomForest,1,0.95,0.6388059701492538,0.6700681690184029,0.2861604690551758,0.0
204,8,AdaBoost (Discrete),1,0.95,0.7701492537313432,0.7487253471718772,91.25812792778015,0.7487253471718772
205,8,AdaBoost (Real),1,0.95,0.5194029850746269,0.446037937896442,76.63241338729858,0.446037937896442
206,8,Logistic Regression (Penalty = L2),1,0.95,0.7865671641791044,0.7625189425756352,0.6959340572357178,0.7625189425756352
207,8,Naive Bayes,1,0.95,0.7507462686567165,0.7242451521130638,0.07571005821228027,0.7242451521130638
208,8,KNeighbors Classifier,2,0.95,0.8075757575757576,0.7812885544725509,1.2995543479919434,0.7812885544725509
209,8,SVC Classifier,2,0.95,0.7984848484848485,0.7643935230868387,1.3893444538116455,0.7643935230868387
210,8,Decision Tree,2,0.95,0.6954545454545454,0.6833966643425595,0.07818484306335449,0.6833966643425595
211,8,RandomForest,2,0.95,0.65,0.6174947137689223,0.21666431427001953,0.6174947137689223
212,8,AdaBoost (Discrete),2,0.95,0.7651515151515151,0.7487832790964638,76.7872383594513,0.7487832790964638
213,8,AdaBoost (Real),2,0.95,0.6590909090909091,0.6170121030954592,77.19759464263916,0.6170121030954592
214,8,Logistic Regression (Penalty = L2),2,0.95,0.8242424242424242,0.8086122354133868,0.7685501575469971,0.8086122354133868
215,8,Naive Bayes,2,0.95,0.7742424242424243,0.7508267716534157,0.08986496925354004,0.7508267716534157
