,feat_set_id,classifier,fold_id,feat_th,score,geo_score,exec_t,geo_score_woz
0,0,KNeighbors Classifier,0,0.75,0.9626865671641791,0.9623533500180836,9.730742692947388,0.9623533500180836
1,0,SVC Classifier,0,0.75,0.9402985074626866,0.9395611052519515,6.762096405029297,0.9395611052519515
2,0,Decision Tree,0,0.75,0.8507462686567164,0.8477057197539972,0.3363335132598877,0.8477057197539972
3,0,RandomForest,0,0.75,0.6985074626865672,0.5524059867264105,0.9248466491699219,0.5524059867264105
4,0,AdaBoost (Discrete),0,0.75,0.9537313432835821,0.9530166592106033,347.1165039539337,0.9530166592106033
5,0,AdaBoost (Real),0,0.75,0.7820895522388059,0.7739846941473637,304.99472880363464,0.7739846941473637
6,0,Logistic Regression (Penalty = L2),0,0.75,0.9761194029850746,0.9758392687013427,7.775865077972412,0.9758392687013427
7,0,Naive Bayes,0,0.75,0.9074626865671642,0.9062860408098673,0.5329174995422363,0.9062860408098673
8,0,KNeighbors Classifier,1,0.75,0.9462686567164179,0.945931809009636,10.946729183197021,0.945931809009636
9,0,SVC Classifier,1,0.75,0.9417910447761194,0.9411987000591827,7.988049268722534,0.9411987000591827
10,0,Decision Tree,1,0.75,0.8522388059701492,0.8506296965359972,0.36665892601013184,0.8506296965359972
11,0,RandomForest,1,0.75,0.7626865671641792,0.7197118649336594,0.8945960998535156,0.7197118649336594
12,0,AdaBoost (Discrete),1,0.75,0.9388059701492537,0.9385822477757141,355.7230176925659,0.9385822477757141
13,0,AdaBoost (Real),1,0.75,0.34776119402985073,0.23894016096523335,346.07011103630066,0.0
14,0,Logistic Regression (Penalty = L2),1,0.75,0.9656716417910448,0.9655094269686952,8.16342282295227,0.9655094269686952
15,0,Naive Bayes,1,0.75,0.9238805970149254,0.9229855291340553,0.519336462020874,0.9229855291340553
16,0,KNeighbors Classifier,2,0.75,0.9636363636363636,0.9633686245139459,11.20233964920044,0.9633686245139459
17,0,SVC Classifier,2,0.75,0.9484848484848485,0.9481657707372109,8.012065887451172,0.9481657707372109
18,0,Decision Tree,2,0.75,0.843939393939394,0.8417423853994697,0.367565393447876,0.8417423853994697
19,0,RandomForest,2,0.75,0.7651515151515151,0.7283888955629899,0.9440674781799316,0.7283888955629899
20,0,AdaBoost (Discrete),2,0.75,0.9484848484848485,0.9479943173575702,358.63020277023315,0.9479943173575702
21,0,AdaBoost (Real),2,0.75,0.42272727272727273,0.3282457707326409,319.25060200691223,0.0
22,0,Logistic Regression (Penalty = L2),2,0.75,0.9772727272727273,0.9770539129417997,8.268807649612427,0.9770539129417997
23,0,Naive Bayes,2,0.75,0.9106060606060606,0.9098485830077053,0.5126991271972656,0.9098485830077053
24,1,KNeighbors Classifier,0,0.75,0.9626865671641791,0.9622394940603965,10.878117561340332,0.9622394940603965
25,1,SVC Classifier,0,0.75,0.9552238805970149,0.9543256303398279,7.418385982513428,0.9543256303398279
26,1,Decision Tree,0,0.75,0.8134328358208955,0.8096405274200633,0.2967522144317627,0.8096405274200633
27,1,RandomForest,0,0.75,0.7089552238805971,0.643892851337386,0.8885395526885986,0.643892851337386
28,1,AdaBoost (Discrete),0,0.75,0.9522388059701492,0.9514168925634182,349.8322720527649,0.9514168925634182
29,1,AdaBoost (Real),0,0.75,0.8895522388059701,0.8882479863364493,323.55452060699463,0.8882479863364493
30,1,Logistic Regression (Penalty = L2),0,0.75,0.982089552238806,0.9817929015115444,7.131267547607422,0.9817929015115444
31,1,Naive Bayes,0,0.75,0.9119402985074627,0.9103139880817506,0.5468893051147461,0.9103139880817506
32,1,KNeighbors Classifier,1,0.75,0.9522388059701492,0.9516375845753177,9.808629989624023,0.9516375845753177
33,1,SVC Classifier,1,0.75,0.9432835820895522,0.9425913757289144,6.744521141052246,0.9425913757289144
34,1,Decision Tree,1,0.75,0.8462686567164179,0.8441441669181521,0.3013339042663574,0.8441441669181521
35,1,RandomForest,1,0.75,0.6164179104477612,0.4561491167633081,0.8292231559753418,0.4561491167633081
36,1,AdaBoost (Discrete),1,0.75,0.9492537313432836,0.9490378156627792,333.4600479602814,0.9490378156627792
37,1,AdaBoost (Real),1,0.75,0.282089552238806,0.23537415985096913,298.8854193687439,0.0
38,1,Logistic Regression (Penalty = L2),1,0.75,0.9716417910447761,0.9715402540467533,6.492927551269531,0.9715402540467533
39,1,Naive Bayes,1,0.75,0.926865671641791,0.9262827280680325,0.48282361030578613,0.9262827280680325
40,1,KNeighbors Classifier,2,0.75,0.9681818181818181,0.967933069389347,9.533491134643555,0.967933069389347
41,1,SVC Classifier,2,0.75,0.9454545454545454,0.9448551540824172,6.757464408874512,0.9448551540824172
42,1,Decision Tree,2,0.75,0.85,0.8490231668880699,0.35436224937438965,0.8490231668880699
43,1,RandomForest,2,0.75,0.6454545454545455,0.5316228435421444,0.850848913192749,0.5316228435421444
44,1,AdaBoost (Discrete),2,0.75,0.9242424242424242,0.9224626743559159,298.7815852165222,0.9224626743559159
45,1,AdaBoost (Real),2,0.75,0.7015151515151515,0.6181458645705522,266.3764235973358,0.6181458645705522
46,1,Logistic Regression (Penalty = L2),2,0.75,0.9803030303030303,0.9801847943246875,6.463677883148193,0.9801847943246875
47,1,Naive Bayes,2,0.75,0.9212121212121213,0.9206386815978671,0.419022798538208,0.9206386815978671
48,2,KNeighbors Classifier,0,0.75,0.9641791044776119,0.9638745122338396,9.135963439941406,0.9638745122338396
49,2,SVC Classifier,0,0.75,0.9522388059701492,0.9515054911943208,6.446103572845459,0.9515054911943208
50,2,Decision Tree,0,0.75,0.8477611940298507,0.8450384579876286,0.2660694122314453,0.8450384579876286
51,2,RandomForest,0,0.75,0.7611940298507462,0.6522579885119901,0.8796231746673584,0.6522579885119901
52,2,AdaBoost (Discrete),0,0.75,0.9492537313432836,0.9485109419386503,272.77302527427673,0.9485109419386503
53,2,AdaBoost (Real),0,0.75,0.6597014925373135,0.5787562055385034,226.5367546081543,0.5787562055385034
54,2,Logistic Regression (Penalty = L2),0,0.75,0.9776119402985075,0.977401130898957,5.767737627029419,0.977401130898957
55,2,Naive Bayes,0,0.75,0.9149253731343283,0.9139026013055976,0.4486508369445801,0.9139026013055976
56,2,KNeighbors Classifier,1,0.75,0.9552238805970149,0.9547360374529206,7.997629642486572,0.9547360374529206
57,2,SVC Classifier,1,0.75,0.9417910447761194,0.9412348063018107,5.488968849182129,0.9412348063018107
58,2,Decision Tree,1,0.75,0.8328358208955224,0.8307840508856957,0.17377233505249023,0.8307840508856957
59,2,RandomForest,1,0.75,0.6223880597014926,0.43558642359823535,0.6991672515869141,0.43558642359823535
60,2,AdaBoost (Discrete),1,0.75,0.9388059701492537,0.9385341782119084,248.17220735549927,0.9385341782119084
61,2,AdaBoost (Real),1,0.75,0.282089552238806,0.15572385107347458,220.947190284729,0.0
62,2,Logistic Regression (Penalty = L2),1,0.75,0.9716417910447761,0.9715625603585757,5.105866193771362,0.9715625603585757
63,2,Naive Bayes,1,0.75,0.926865671641791,0.9263996165593884,0.40662097930908203,0.9263996165593884
64,2,KNeighbors Classifier,2,0.75,0.9651515151515152,0.964911281019833,7.284718751907349,0.964911281019833
65,2,SVC Classifier,2,0.75,0.95,0.9496331074306701,5.175519227981567,0.9496331074306701
66,2,Decision Tree,2,0.75,0.8348484848484848,0.8337957622158181,0.15753912925720215,0.8337957622158181
67,2,RandomForest,2,0.75,0.7666666666666667,0.7533166034944923,0.5211174488067627,0.7533166034944923
68,2,AdaBoost (Discrete),2,0.75,0.9303030303030303,0.9288792854467948,232.3629059791565,0.9288792854467948
69,2,AdaBoost (Real),2,0.75,0.6621212121212121,0.6445432962740215,214.98836255073547,0.6445432962740215
70,2,Logistic Regression (Penalty = L2),2,0.75,0.9742424242424242,0.9740519770870313,4.744100093841553,0.9740519770870313
71,2,Naive Bayes,2,0.75,0.9136363636363637,0.9128174571338082,0.3607749938964844,0.9128174571338082
72,3,KNeighbors Classifier,0,0.75,0.9641791044776119,0.9637720082692451,3.9402318000793457,0.9637720082692451
73,3,SVC Classifier,0,0.75,0.9283582089552239,0.9270407096785496,3.727097988128662,0.9270407096785496
74,3,Decision Tree,0,0.75,0.8238805970149253,0.8164204424001005,0.15223145484924316,0.8164204424001005
75,3,RandomForest,0,0.75,0.7567164179104477,0.6927238442629138,0.48381519317626953,0.6927238442629138
76,3,AdaBoost (Discrete),0,0.75,0.9402985074626866,0.9393521424982093,162.42864298820496,0.9393521424982093
77,3,AdaBoost (Real),0,0.75,0.8059701492537313,0.7936842635700732,137.61862587928772,0.7936842635700732
78,3,Logistic Regression (Penalty = L2),0,0.75,0.9746268656716418,0.9743036916447874,3.624847888946533,0.9743036916447874
79,3,Naive Bayes,0,0.75,0.9029850746268657,0.901942988839226,0.358335018157959,0.901942988839226
80,3,KNeighbors Classifier,1,0.75,0.9447761194029851,0.9441779084327828,4.170446157455444,0.9441779084327828
81,3,SVC Classifier,1,0.75,0.9313432835820895,0.9301920969935635,3.6220898628234863,0.9301920969935635
82,3,Decision Tree,1,0.75,0.8477611940298507,0.8453755063313482,0.1452944278717041,0.8453755063313482
83,3,RandomForest,1,0.75,0.7104477611940299,0.585034818380146,0.5203874111175537,0.585034818380146
84,3,AdaBoost (Discrete),1,0.75,0.9373134328358209,0.9369374973349183,150.5926251411438,0.9369374973349183
85,3,AdaBoost (Real),1,0.75,0.34626865671641793,0.23805514875349146,140.98971223831177,0.0
86,3,Logistic Regression (Penalty = L2),1,0.75,0.9686567164179104,0.9685545364002665,3.1404635906219482,0.9685545364002665
87,3,Naive Bayes,1,0.75,0.9194029850746268,0.9184853572978731,0.20087265968322754,0.9184853572978731
88,3,KNeighbors Classifier,2,0.75,0.9636363636363636,0.9632980247801729,3.4256200790405273,0.9632980247801729
89,3,SVC Classifier,2,0.75,0.9348484848484848,0.9340792742010835,3.1738691329956055,0.9340792742010835
90,3,Decision Tree,2,0.75,0.8651515151515151,0.864204411199069,0.12759160995483398,0.864204411199069
91,3,RandomForest,2,0.75,0.7151515151515152,0.5238555165921059,0.390352725982666,0.5238555165921059
92,3,AdaBoost (Discrete),2,0.75,0.9393939393939394,0.9387130086085114,135.19901823997498,0.9387130086085114
93,3,AdaBoost (Real),2,0.75,0.6318181818181818,0.5583434343606661,122.14025211334229,0.5583434343606661
94,3,Logistic Regression (Penalty = L2),2,0.75,0.9818181818181818,0.9816816997488554,3.305727481842041,0.9816816997488554
95,3,Naive Bayes,2,0.75,0.9196969696969697,0.9190101430430909,0.2693147659301758,0.9190101430430909
96,4,KNeighbors Classifier,0,0.75,0.9641791044776119,0.9637994559397424,4.344913482666016,0.9637994559397424
97,4,SVC Classifier,0,0.75,0.9417910447761194,0.9410296082232921,3.248643159866333,0.9410296082232921
98,4,Decision Tree,0,0.75,0.8044776119402985,0.796958184031289,0.1181647777557373,0.796958184031289
99,4,RandomForest,0,0.75,0.7089552238805971,0.7464523862784066,0.48436665534973145,0.0
100,4,AdaBoost (Discrete),0,0.75,0.9507462686567164,0.9500405509507232,133.304692029953,0.9500405509507232
101,4,AdaBoost (Real),0,0.75,0.8761194029850746,0.873908280574439,107.46139144897461,0.873908280574439
102,4,Logistic Regression (Penalty = L2),0,0.75,0.9776119402985075,0.9773772659446601,2.831812620162964,0.9773772659446601
103,4,Naive Bayes,0,0.75,0.8955223880597015,0.8940315314805499,0.21122360229492188,0.8940315314805499
104,4,KNeighbors Classifier,1,0.75,0.9477611940298507,0.9473792319302625,3.5278701782226562,0.9473792319302625
105,4,SVC Classifier,1,0.75,0.9388059701492537,0.9381751082335044,2.8749470710754395,0.9381751082335044
106,4,Decision Tree,1,0.75,0.8537313432835821,0.8517410484441348,0.1078486442565918,0.8517410484441348
107,4,RandomForest,1,0.75,0.6865671641791045,0.5468692283004242,0.36167430877685547,0.5468692283004242
108,4,AdaBoost (Discrete),1,0.75,0.935820895522388,0.9354654738597938,118.60699081420898,0.9354654738597938
109,4,AdaBoost (Real),1,0.75,0.34776119402985073,0.23894016096523335,106.84482264518738,0.0
110,4,Logistic Regression (Penalty = L2),1,0.75,0.9656716417910448,0.9656008837744579,2.482783794403076,0.9656008837744579
111,4,Naive Bayes,1,0.75,0.9208955223880597,0.9201350721400526,0.22256088256835938,0.9201350721400526
112,4,KNeighbors Classifier,2,0.75,0.9621212121212122,0.9617556907014493,3.1064834594726562,0.9617556907014493
113,4,SVC Classifier,2,0.75,0.9393939393939394,0.9389790346339779,2.6324727535247803,0.9389790346339779
114,4,Decision Tree,2,0.75,0.8590909090909091,0.857193583382719,0.1268768310546875,0.857193583382719
115,4,RandomForest,2,0.75,0.7424242424242424,0.626791692426839,0.3826563358306885,0.626791692426839
116,4,AdaBoost (Discrete),2,0.75,0.9454545454545454,0.9447256683421963,112.51200866699219,0.9447256683421963
117,4,AdaBoost (Real),2,0.75,0.5181818181818182,0.27816598906828977,103.31393599510193,0.27816598906828977
118,4,Logistic Regression (Penalty = L2),2,0.75,0.9772727272727273,0.9770539129417997,2.969006061553955,0.9770539129417997
119,4,Naive Bayes,2,0.75,0.9045454545454545,0.9038180878050359,0.17597579956054688,0.9038180878050359
120,5,KNeighbors Classifier,0,0.75,0.9701492537313433,0.9698714455202159,3.4245100021362305,0.9698714455202159
121,5,SVC Classifier,0,0.75,0.9402985074626866,0.9391778804687799,2.6320245265960693,0.9391778804687799
122,5,Decision Tree,0,0.75,0.8373134328358209,0.8349807480923612,0.1256275177001953,0.8349807480923612
123,5,RandomForest,0,0.75,0.6776119402985075,0.6691533347682131,0.34846997261047363,0.0
124,5,AdaBoost (Discrete),0,0.75,0.9552238805970149,0.9546840792122566,110.37095522880554,0.9546840792122566
125,5,AdaBoost (Real),0,0.75,0.7492537313432835,0.7355125565342048,99.53004622459412,0.7355125565342048
126,5,Logistic Regression (Penalty = L2),0,0.75,0.982089552238806,0.9818888312568994,2.3442118167877197,0.9818888312568994
127,5,Naive Bayes,0,0.75,0.9074626865671642,0.9059545046701301,0.16845178604125977,0.9059545046701301
128,5,KNeighbors Classifier,1,0.75,0.9462686567164179,0.9458554964881724,2.7287278175354004,0.9458554964881724
129,5,SVC Classifier,1,0.75,0.935820895522388,0.9345307214432735,2.100947856903076,0.9345307214432735
130,5,Decision Tree,1,0.75,0.8104477611940298,0.8081977054010443,0.09207415580749512,0.8081977054010443
131,5,RandomForest,1,0.75,0.6567164179104478,0.5254897620191054,0.2713303565979004,0.5254897620191054
132,5,AdaBoost (Discrete),1,0.75,0.9507462686567164,0.9505139786554921,93.54733967781067,0.9505139786554921
133,5,AdaBoost (Real),1,0.75,0.282089552238806,0.23537415985096913,91.38842296600342,0.0
134,5,Logistic Regression (Penalty = L2),1,0.75,0.9701492537313433,0.9700114419037252,1.8207025527954102,0.9700114419037252
135,5,Naive Bayes,1,0.75,0.9208955223880597,0.9202907972001951,0.1417064666748047,0.9202907972001951
136,5,KNeighbors Classifier,2,0.75,0.9621212121212122,0.9618034098564884,2.7079854011535645,0.9618034098564884
137,5,SVC Classifier,2,0.75,0.9393939393939394,0.9386105999556825,2.1821305751800537,0.9386105999556825
138,5,Decision Tree,2,0.75,0.853030303030303,0.850847768084265,0.09543108940124512,0.850847768084265
139,5,RandomForest,2,0.75,0.7045454545454546,0.6674587325686743,0.3078279495239258,0.6674587325686743
140,5,AdaBoost (Discrete),2,0.75,0.9257575757575758,0.9246582925193645,94.62694716453552,0.9246582925193645
141,5,AdaBoost (Real),2,0.75,0.8045454545454546,0.8027390859213295,85.77549648284912,0.8027390859213295
142,5,Logistic Regression (Penalty = L2),2,0.75,0.9727272727272728,0.9724931499751842,1.7470757961273193,0.9724931499751842
143,5,Naive Bayes,2,0.75,0.9121212121212121,0.9114137220111219,0.17756390571594238,0.9114137220111219
144,6,KNeighbors Classifier,0,0.75,0.9597014925373134,0.9593262720600773,3.2948691844940186,0.9593262720600773
145,6,SVC Classifier,0,0.75,0.9507462686567164,0.9501047802391783,2.063044309616089,0.9501047802391783
146,6,Decision Tree,0,0.75,0.844776119402985,0.8400273686845157,0.06792259216308594,0.8400273686845157
147,6,RandomForest,0,0.75,0.5805970149253732,0.3663049394682345,0.24723482131958008,0.3663049394682345
148,6,AdaBoost (Discrete),0,0.75,0.9537313432835821,0.9530157690292135,95.008225440979,0.9530157690292135
149,6,AdaBoost (Real),0,0.75,0.9134328358208955,0.9121916196030764,95.93489742279053,0.9121916196030764
150,6,Logistic Regression (Penalty = L2),0,0.75,0.9776119402985075,0.9774467090727746,2.6772279739379883,0.9774467090727746
151,6,Naive Bayes,0,0.75,0.908955223880597,0.9079235958960121,0.17465782165527344,0.9079235958960121
152,6,KNeighbors Classifier,1,0.75,0.9477611940298507,0.9471378737772062,3.588904857635498,0.9471378737772062
153,6,SVC Classifier,1,0.75,0.9462686567164179,0.9455887362481198,2.329602003097534,0.9455887362481198
154,6,Decision Tree,1,0.75,0.8477611940298507,0.8460102753185477,0.09266829490661621,0.8460102753185477
155,6,RandomForest,1,0.75,0.5716417910447761,0.39430743253421735,0.28287649154663086,0.39430743253421735
156,6,AdaBoost (Discrete),1,0.75,0.9537313432835821,0.9534630261275142,99.61699342727661,0.9534630261275142
157,6,AdaBoost (Real),1,0.75,0.282089552238806,0.23537415985096913,90.25791811943054,0.0
158,6,Logistic Regression (Penalty = L2),1,0.75,0.9671641791044776,0.9670998516233342,2.027710199356079,0.9670998516233342
159,6,Naive Bayes,1,0.75,0.926865671641791,0.9262405782674831,0.14515900611877441,0.9262405782674831
160,6,KNeighbors Classifier,2,0.75,0.9621212121212122,0.961729052724156,2.8853819370269775,0.961729052724156
161,6,SVC Classifier,2,0.75,0.95,0.9495835391299413,1.398162603378296,0.9495835391299413
162,6,Decision Tree,2,0.75,0.8378787878787879,0.8366274608312427,0.04196357727050781,0.8366274608312427
163,6,RandomForest,2,0.75,0.7636363636363637,0.7482549916721348,0.17001914978027344,0.7482549916721348
164,6,AdaBoost (Discrete),2,0.75,0.9378787878787879,0.9374297505964423,91.87053370475769,0.9374297505964423
165,6,AdaBoost (Real),2,0.75,0.6621212121212121,0.6445432962740215,85.50056624412537,0.6445432962740215
166,6,Logistic Regression (Penalty = L2),2,0.75,0.9727272727272728,0.972542958839484,2.0502758026123047,0.972542958839484
167,6,Naive Bayes,2,0.75,0.9181818181818182,0.9175169989758665,0.19272422790527344,0.9175169989758665
168,7,KNeighbors Classifier,0,0.75,0.9716417910447761,0.9714482346940393,3.801194667816162,0.9714482346940393
169,7,SVC Classifier,0,0.75,0.9611940298507463,0.9606714954229025,2.056894302368164,0.9606714954229025
170,7,Decision Tree,0,0.75,0.8417910447761194,0.8369987959255656,0.08414864540100098,0.8369987959255656
171,7,RandomForest,0,0.75,0.682089552238806,0.6041891154762722,0.27853894233703613,0.6041891154762722
172,7,AdaBoost (Discrete),0,0.75,0.9507462686567164,0.9499761189652716,99.68576431274414,0.9499761189652716
173,7,AdaBoost (Real),0,0.75,0.7417910447761195,0.6990484738410249,86.9025604724884,0.6990484738410249
174,7,Logistic Regression (Penalty = L2),0,0.75,0.9835820895522388,0.983412350757979,2.4219329357147217,0.983412350757979
175,7,Naive Bayes,0,0.75,0.9164179104477612,0.9151896745128952,0.16831612586975098,0.9151896745128952
176,7,KNeighbors Classifier,1,0.75,0.9507462686567164,0.9502426659116933,2.978415012359619,0.9502426659116933
177,7,SVC Classifier,1,0.75,0.9522388059701492,0.9518424802472935,1.8678879737854004,0.9518424802472935
178,7,Decision Tree,1,0.75,0.8462686567164179,0.8457697986675736,0.09169530868530273,0.8457697986675736
179,7,RandomForest,1,0.75,0.6791044776119403,0.5769731767569266,0.21733498573303223,0.5769731767569266
180,7,AdaBoost (Discrete),1,0.75,0.9462686567164179,0.9461212181864033,95.81178784370422,0.9461212181864033
181,7,AdaBoost (Real),1,0.75,0.2865671641791045,0.17750218685961625,87.16617608070374,0.0
182,7,Logistic Regression (Penalty = L2),1,0.75,0.9701492537313433,0.9700128557610278,1.972327470779419,0.9700128557610278
183,7,Naive Bayes,1,0.75,0.9328358208955224,0.9322642791212942,0.11993646621704102,0.9322642791212942
184,7,KNeighbors Classifier,2,0.75,0.9712121212121212,0.9709881011523371,2.6934902667999268,0.9709881011523371
185,7,SVC Classifier,2,0.75,0.9621212121212122,0.9619224133799577,1.7350358963012695,0.9619224133799577
186,7,Decision Tree,2,0.75,0.8393939393939394,0.8379439206674204,0.06811046600341797,0.8379439206674204
187,7,RandomForest,2,0.75,0.7636363636363637,0.7268983038577433,0.20044732093811035,0.7268983038577433
188,7,AdaBoost (Discrete),2,0.75,0.946969696969697,0.9464995964462576,82.36492776870728,0.9464995964462576
189,7,AdaBoost (Real),2,0.75,0.40454545454545454,0.2764207254375088,77.14712834358215,0.0
190,7,Logistic Regression (Penalty = L2),2,0.75,0.9742424242424242,0.9739805944319254,2.2230958938598633,0.9739805944319254
191,7,Naive Bayes,2,0.75,0.9212121212121213,0.920640305314996,0.16811347007751465,0.920640305314996
192,8,KNeighbors Classifier,0,0.75,0.9641791044776119,0.9636800061625886,1.2170169353485107,0.9636800061625886
193,8,SVC Classifier,0,0.75,0.9328358208955224,0.9314506425269001,1.1202044486999512,0.9314506425269001
194,8,Decision Tree,0,0.75,0.8432835820895522,0.8381390507925942,0.059470415115356445,0.8381390507925942
195,8,RandomForest,0,0.75,0.6432835820895523,0.4990099359889827,0.11225605010986328,0.4990099359889827
196,8,AdaBoost (Discrete),0,0.75,0.9432835820895522,0.9427007042520227,47.651729106903076,0.9427007042520227
197,8,AdaBoost (Real),0,0.75,0.8791044776119403,0.8773733267927684,42.553765535354614,0.8773733267927684
198,8,Logistic Regression (Penalty = L2),0,0.75,0.9761194029850746,0.9757468421678206,1.1273789405822754,0.9757468421678206
199,8,Naive Bayes,0,0.75,0.9,0.8987052239958995,0.09978485107421875,0.8987052239958995
200,8,KNeighbors Classifier,1,0.75,0.9447761194029851,0.9443278295333958,1.2144191265106201,0.9443278295333958
201,8,SVC Classifier,1,0.75,0.9238805970149254,0.9230728191901793,1.0855941772460938,0.9230728191901793
202,8,Decision Tree,1,0.75,0.8626865671641791,0.8589204069940594,0.04463839530944824,0.8589204069940594
203,8,RandomForest,1,0.75,0.6402985074626866,0.45488481656893454,0.17836284637451172,0.45488481656893454
204,8,AdaBoost (Discrete),1,0.75,0.9388059701492537,0.9381908451090639,46.83705997467041,0.9381908451090639
205,8,AdaBoost (Real),1,0.75,0.34626865671641793,0.2512921487619405,46.49696493148804,0.0
206,8,Logistic Regression (Penalty = L2),1,0.75,0.9671641791044776,0.9670540348833518,1.0913417339324951,0.9670540348833518
207,8,Naive Bayes,1,0.75,0.9208955223880597,0.9203192434079255,0.1299152374267578,0.9203192434079255
208,8,KNeighbors Classifier,2,0.75,0.9621212121212122,0.9616601884156697,1.3038885593414307,0.9616601884156697
209,8,SVC Classifier,2,0.75,0.9242424242424242,0.923396902096432,1.2234220504760742,0.923396902096432
210,8,Decision Tree,2,0.75,0.8424242424242424,0.8407753085055739,0.034401893615722656,0.8407753085055739
211,8,RandomForest,2,0.75,0.6954545454545454,0.6026996180270523,0.18842053413391113,0.6026996180270523
212,8,AdaBoost (Discrete),2,0.75,0.9272727272727272,0.9245134643142193,47.76640248298645,0.9245134643142193
213,8,AdaBoost (Real),2,0.75,0.8606060606060606,0.8590941504152022,43.25933289527893,0.8590941504152022
214,8,Logistic Regression (Penalty = L2),2,0.75,0.9787878787878788,0.9785938245572409,1.013988971710205,0.9785938245572409
215,8,Naive Bayes,2,0.75,0.9151515151515152,0.9144301783735562,0.15689516067504883,0.9144301783735562
