,feat_set_id,classifier,fold_id,feat_th,score,geo_score,exec_t,geo_score_woz
0,0,KNeighbors Classifier,0,0.3,0.9859154929577465,0.9740815103815855,0.5198626518249512,0.9740815103815855
1,0,SVC Classifier,0,0.3,0.9098591549295775,0.4530153324120529,0.6165444850921631,0.4530153324120529
2,0,Decision Tree,0,0.3,0.976056338028169,0.9669907428326376,0.09048056602478027,0.9669907428326376
3,0,RandomForest,0,0.3,0.8915492957746479,0.427133255550349,0.7423126697540283,0.427133255550349
4,0,AdaBoost (Discrete),0,0.3,0.9845070422535211,0.9705393645157323,43.37332201004028,0.9705393645157323
5,0,AdaBoost (Real),0,0.3,0.9647887323943662,0.9622183480946017,64.38493394851685,0.9622183480946017
6,0,Logistic Regression (Penalty = L2),0,0.3,0.9859154929577465,0.9740815103815855,0.3907966613769531,0.9740815103815855
7,0,Naive Bayes,0,0.3,0.9802816901408451,0.9746212105531656,0.08973312377929688,0.9746212105531656
8,0,KNeighbors Classifier,1,0.3,0.9675599435825106,0.9430684036658292,0.6282613277435303,0.9430684036658292
9,0,SVC Classifier,1,0.3,0.9760225669957687,0.9369604361556937,0.6908326148986816,0.9369604361556937
10,0,Decision Tree,1,0.3,0.9548660084626234,0.9283954190417542,0.08741116523742676,0.9283954190417542
11,0,RandomForest,1,0.3,0.921015514809591,0.7591847539504456,0.5364749431610107,0.7591847539504456
12,0,AdaBoost (Discrete),1,0.3,0.9576868829337094,0.9292317088069745,44.940640926361084,0.9292317088069745
13,0,AdaBoost (Real),1,0.3,0.9576868829337094,0.9353015084006931,56.37001585960388,0.9353015084006931
14,0,Logistic Regression (Penalty = L2),1,0.3,0.9802538787023978,0.9575363765828476,0.42264866828918457,0.9575363765828476
15,0,Naive Bayes,1,0.3,0.7997179125528914,0.8601037713919562,0.10467171669006348,0.8601037713919562
16,0,KNeighbors Classifier,2,0.3,0.9900990099009901,0.9785678593350768,0.7607121467590332,0.9785678593350768
17,0,SVC Classifier,2,0.3,0.9391796322489392,0.8248573930653896,0.8084716796875,0.8248573930653896
18,0,Decision Tree,2,0.3,0.9702970297029703,0.9613179074390289,0.10699295997619629,0.9613179074390289
19,0,RandomForest,2,0.3,0.900990099009901,0.6797168723765417,0.8296267986297607,0.6797168723765417
20,0,AdaBoost (Discrete),2,0.3,0.8076379066478077,0.9026250959593279,49.02677392959595,0.9026250959593279
21,0,AdaBoost (Real),2,0.3,0.8345120226308345,0.36542729375219035,62.06828784942627,0.36542729375219035
22,0,Logistic Regression (Penalty = L2),2,0.3,0.9915134370579916,0.9791605716903751,0.404400110244751,0.9791605716903751
23,0,Naive Bayes,2,0.3,0.9674681753889675,0.9689851839288056,0.09962773323059082,0.9689851839288056
24,1,KNeighbors Classifier,0,0.3,0.9830985915492958,0.9758141385621988,0.5290427207946777,0.9758141385621988
25,1,SVC Classifier,0,0.3,0.9098591549295775,0.4530153324120529,0.7933738231658936,0.4530153324120529
26,1,Decision Tree,0,0.3,0.9859154929577465,0.9740815103815855,0.10327863693237305,0.9740815103815855
27,1,RandomForest,0,0.3,0.7859154929577464,0.31889640207164033,0.9287331104278564,0.0
28,1,AdaBoost (Discrete),0,0.3,0.8901408450704226,0.4236090741960986,47.95293688774109,0.4236090741960986
29,1,AdaBoost (Real),0,0.3,0.9154929577464789,0.943564008868173,61.595757246017456,0.943564008868173
30,1,Logistic Regression (Penalty = L2),0,0.3,0.9845070422535211,0.9705393645157323,0.46247267723083496,0.9705393645157323
31,1,Naive Bayes,0,0.3,0.9492957746478873,0.9750961659762587,0.1091759204864502,0.9750961659762587
32,1,KNeighbors Classifier,1,0.3,0.9732016925246827,0.9358274720081465,0.5502223968505859,0.9358274720081465
33,1,SVC Classifier,1,0.3,0.9760225669957687,0.9369604361556937,0.9977579116821289,0.9369604361556937
34,1,Decision Tree,1,0.3,0.9844851904090268,0.9623154932950356,0.11513805389404297,0.9623154932950356
35,1,RandomForest,1,0.3,0.8603667136812412,0.9914892069294688,0.8564565181732178,0.0
36,1,AdaBoost (Discrete),1,0.3,0.8998589562764457,0.6621963893509659,48.85828733444214,0.6621963893509659
37,1,AdaBoost (Real),1,0.3,0.849083215796897,0.9186010234150224,62.643831729888916,0.9186010234150224
38,1,Logistic Regression (Penalty = L2),1,0.3,0.9760225669957687,0.9369604361556937,0.47791028022766113,0.9369604361556937
39,1,Naive Bayes,1,0.3,0.8688293370944993,0.9306249227191036,0.20531821250915527,0.9306249227191036
40,1,KNeighbors Classifier,2,0.3,0.9801980198019802,0.9743986213026035,0.6374938488006592,0.9743986213026035
41,1,SVC Classifier,2,0.3,0.9915134370579916,0.9791605716903751,0.8674533367156982,0.9791605716903751
42,1,Decision Tree,2,0.3,0.983026874115983,0.9755934705944337,0.003019094467163086,0.9755934705944337
43,1,RandomForest,2,0.3,0.8571428571428571,0.9737945687202026,0.7386167049407959,0.0
44,1,AdaBoost (Discrete),2,0.3,0.8415841584158416,0.9065479622142673,51.39922332763672,0.9065479622142673
45,1,AdaBoost (Real),2,0.3,0.9717114568599717,0.9678662167939021,63.46126747131348,0.9678662167939021
46,1,Logistic Regression (Penalty = L2),2,0.3,0.9915134370579916,0.9791605716903751,0.39359188079833984,0.9791605716903751
47,1,Naive Bayes,2,0.3,0.8472418670438473,0.9223454219396696,0.10846972465515137,0.9223454219396696
48,2,KNeighbors Classifier,0,0.3,0.9830985915492958,0.9650248172835721,0.6949193477630615,0.9650248172835721
49,2,SVC Classifier,0,0.3,0.7971830985915493,0.4132601193179773,0.9427211284637451,0.0
50,2,Decision Tree,0,0.3,0.9774647887323944,0.962675386644056,0.11106705665588379,0.962675386644056
51,2,RandomForest,0,0.3,0.7971830985915493,0.4132601193179773,0.8909907341003418,0.0
52,2,AdaBoost (Discrete),0,0.3,0.9830985915492958,0.9650248172835721,50.06753063201904,0.9650248172835721
53,2,AdaBoost (Real),0,0.3,0.823943661971831,0.8874348919021536,62.17640209197998,0.8874348919021536
54,2,Logistic Regression (Penalty = L2),0,0.3,0.9830985915492958,0.9650248172835721,0.5416736602783203,0.9650248172835721
55,2,Naive Bayes,0,0.3,0.8492957746478873,0.6030182124902045,0.18935203552246094,0.6030182124902045
56,2,KNeighbors Classifier,1,0.3,0.9619181946403385,0.8821335446541024,0.6386709213256836,0.8821335446541024
57,2,SVC Classifier,1,0.3,0.8208744710860366,0.3388713168009762,1.0435047149658203,0.3388713168009762
58,2,Decision Tree,1,0.3,0.9478138222849083,0.8210267307722635,0.10719084739685059,0.8210267307722635
59,2,RandomForest,1,0.3,0.7997179125528914,0.3912303982179758,0.8197309970855713,0.0
60,2,AdaBoost (Discrete),1,0.3,0.9351198871650211,0.837454292581525,56.65431618690491,0.837454292581525
61,2,AdaBoost (Real),1,0.3,0.8744710860366713,0.6810348398775026,68.62012219429016,0.6810348398775026
62,2,Logistic Regression (Penalty = L2),1,0.3,0.9548660084626234,0.8476586602415042,0.41357922554016113,0.8476586602415042
63,2,Naive Bayes,1,0.3,0.768688293370945,0.5987267960562597,0.2332935333251953,0.5987267960562597
64,2,KNeighbors Classifier,2,0.3,0.9844413012729845,0.9501741460660447,0.5609502792358398,0.9501741460660447
65,2,SVC Classifier,2,0.3,0.8316831683168316,0.614451804788759,1.1238665580749512,0.0
66,2,Decision Tree,2,0.3,0.9801980198019802,0.9430164799542049,0.12289881706237793,0.9430164799542049
67,2,RandomForest,2,0.3,0.8316831683168316,0.614451804788759,0.947913408279419,0.0
68,2,AdaBoost (Discrete),2,0.3,0.8613861386138614,0.8998664227322513,54.417083740234375,0.8998664227322513
69,2,AdaBoost (Real),2,0.3,0.8387553041018387,0.8918893360323292,65.1305902004242,0.8918893360323292
70,2,Logistic Regression (Penalty = L2),2,0.3,0.9759547383309759,0.9187457900456574,0.6580071449279785,0.9187457900456574
71,2,Naive Bayes,2,0.3,0.768033946251768,0.6854996915857425,0.23316240310668945,0.6854996915857425
72,3,KNeighbors Classifier,0,0.3,0.9436619718309859,0.9616448455727088,1.1542260646820068,0.9616448455727088
73,3,SVC Classifier,0,0.3,0.9098591549295775,0.4530153324120529,1.0962045192718506,0.4530153324120529
74,3,Decision Tree,0,0.3,0.9845070422535211,0.9705393645157323,0.0019066333770751953,0.9705393645157323
75,3,RandomForest,0,0.3,0.7859154929577464,0.31889640207164033,1.179788589477539,0.0
76,3,AdaBoost (Discrete),0,0.3,0.8901408450704226,0.4236090741960986,85.70707821846008,0.4236090741960986
77,3,AdaBoost (Real),0,0.3,0.9845070422535211,0.9705393645157323,103.06301999092102,0.9705393645157323
78,3,Logistic Regression (Penalty = L2),0,0.3,0.9845070422535211,0.9705393645157323,0.6209287643432617,0.9705393645157323
79,3,Naive Bayes,0,0.3,0.9492957746478873,0.9750961659762587,0.20083403587341309,0.9750961659762587
80,3,KNeighbors Classifier,1,0.3,0.9760225669957687,0.9369604361556937,1.3999629020690918,0.9369604361556937
81,3,SVC Classifier,1,0.3,0.9760225669957687,0.9369604361556937,1.324997901916504,0.9369604361556937
82,3,Decision Tree,1,0.3,0.9760225669957687,0.9369604361556937,0.001911163330078125,0.9369604361556937
83,3,RandomForest,1,0.3,0.8603667136812412,0.9914892069294688,1.3573992252349854,0.0
84,3,AdaBoost (Discrete),1,0.3,0.9322990126939351,0.9373466751166473,82.76532554626465,0.9373466751166473
85,3,AdaBoost (Real),1,0.3,0.9746121297602257,0.927942991644796,111.7018051147461,0.927942991644796
86,3,Logistic Regression (Penalty = L2),1,0.3,0.9788434414668548,0.9445168950318586,0.3679068088531494,0.9445168950318586
87,3,Naive Bayes,1,0.3,0.8702397743300423,0.9338451038203882,0.1796712875366211,0.9338451038203882
88,3,KNeighbors Classifier,2,0.3,0.8118811881188119,0.7772522360311104,1.5812678337097168,0.7772522360311104
89,3,SVC Classifier,2,0.3,0.9915134370579916,0.9791605716903751,1.4002869129180908,0.9791605716903751
90,3,Decision Tree,2,0.3,0.9915134370579916,0.9791605716903751,0.1981954574584961,0.9791605716903751
91,3,RandomForest,2,0.3,0.9066478076379066,0.6970419054037802,1.3959996700286865,0.6970419054037802
92,3,AdaBoost (Discrete),2,0.3,0.9391796322489392,0.8248573930653896,83.53426456451416,0.8248573930653896
93,3,AdaBoost (Real),2,0.3,0.9391796322489392,0.8248573930653896,108.84525156021118,0.8248573930653896
94,3,Logistic Regression (Penalty = L2),2,0.3,0.9915134370579916,0.9791605716903751,0.49841928482055664,0.9791605716903751
95,3,Naive Bayes,2,0.3,0.8472418670438473,0.9223454219396696,0.23238134384155273,0.9223454219396696
96,4,KNeighbors Classifier,0,0.3,0.9845070422535211,0.9705393645157323,1.3522214889526367,0.9705393645157323
97,4,SVC Classifier,0,0.3,0.9098591549295775,0.4530153324120529,1.1236486434936523,0.4530153324120529
98,4,Decision Tree,0,0.3,0.9845070422535211,0.9705393645157323,0.20644736289978027,0.9705393645157323
99,4,RandomForest,0,0.3,0.8901408450704226,0.4236090741960986,1.4318280220031738,0.4236090741960986
100,4,AdaBoost (Discrete),0,0.3,0.8901408450704226,0.4236090741960986,90.18980979919434,0.4236090741960986
101,4,AdaBoost (Real),0,0.3,0.9845070422535211,0.9705393645157323,78.13415122032166,0.9705393645157323
102,4,Logistic Regression (Penalty = L2),0,0.3,0.9845070422535211,0.9705393645157323,0.20546483993530273,0.9705393645157323
103,4,Naive Bayes,0,0.3,0.9845070422535211,0.9705393645157323,0.10405445098876953,0.9705393645157323
104,4,KNeighbors Classifier,1,0.3,0.8208744710860366,0.9096412491918122,0.5303905010223389,0.9096412491918122
105,4,SVC Classifier,1,0.3,0.9760225669957687,0.9369604361556937,0.6315908432006836,0.9369604361556937
106,4,Decision Tree,1,0.3,0.9760225669957687,0.9369604361556937,0.10696172714233398,0.9369604361556937
107,4,RandomForest,1,0.3,0.9337094499294781,0.7927843292491847,0.6457047462463379,0.7927843292491847
108,4,AdaBoost (Discrete),1,0.3,0.9760225669957687,0.9369604361556937,40.19811964035034,0.9369604361556937
109,4,AdaBoost (Real),1,0.3,0.9760225669957687,0.9369604361556937,52.77980995178223,0.9369604361556937
110,4,Logistic Regression (Penalty = L2),1,0.3,0.9760225669957687,0.9369604361556937,0.24115371704101562,0.9369604361556937
111,4,Naive Bayes,1,0.3,0.7997179125528914,0.8601037713919562,0.1128387451171875,0.8601037713919562
112,4,KNeighbors Classifier,2,0.3,0.8161244695898161,0.9069233755262746,0.5428838729858398,0.9069233755262746
113,4,SVC Classifier,2,0.3,0.9391796322489392,0.8248573930653896,0.5318169593811035,0.8248573930653896
114,4,Decision Tree,2,0.3,0.9915134370579916,0.9791605716903751,0.10678935050964355,0.9791605716903751
115,4,RandomForest,2,0.3,0.9391796322489392,0.8248573930653896,0.7427322864532471,0.8248573930653896
116,4,AdaBoost (Discrete),2,0.3,0.9391796322489392,0.8248573930653896,45.57992339134216,0.8248573930653896
117,4,AdaBoost (Real),2,0.3,0.9915134370579916,0.9791605716903751,55.4397087097168,0.9791605716903751
118,4,Logistic Regression (Penalty = L2),2,0.3,0.9915134370579916,0.9791605716903751,0.23149538040161133,0.9791605716903751
119,4,Naive Bayes,2,0.3,0.8118811881188119,0.897274522572626,0.23317217826843262,0.897274522572626
120,5,KNeighbors Classifier,0,0.3,0.8718309859154929,0.5353325086049819,0.7138385772705078,0.5353325086049819
121,5,SVC Classifier,0,0.3,0.7971830985915493,0.4132601193179773,0.8009684085845947,0.0
122,5,Decision Tree,0,0.3,0.8718309859154929,0.5353325086049819,0.1227567195892334,0.5353325086049819
123,5,RandomForest,0,0.3,0.8718309859154929,0.5353325086049819,0.5851211547851562,0.5353325086049819
124,5,AdaBoost (Discrete),0,0.3,0.8718309859154929,0.5353325086049819,43.79970741271973,0.5353325086049819
125,5,AdaBoost (Real),0,0.3,0.8718309859154929,0.5353325086049819,51.479610443115234,0.5353325086049819
126,5,Logistic Regression (Penalty = L2),0,0.3,0.8718309859154929,0.5353325086049819,0.153639554977417,0.5353325086049819
127,5,Naive Bayes,0,0.3,0.7267605633802817,0.5153581025776002,0.12858009338378906,0.5153581025776002
128,5,KNeighbors Classifier,1,0.3,0.7616361071932299,0.5921532841839962,0.6890785694122314,0.5921532841839962
129,5,SVC Classifier,1,0.3,0.8208744710860366,0.3388713168009762,0.6816256046295166,0.3388713168009762
130,5,Decision Tree,1,0.3,0.8222849083215797,0.346240381909616,0.11127471923828125,0.346240381909616
131,5,RandomForest,1,0.3,0.8208744710860366,0.3388713168009762,0.7677159309387207,0.3388713168009762
132,5,AdaBoost (Discrete),1,0.3,0.8222849083215797,0.346240381909616,39.89742565155029,0.346240381909616
133,5,AdaBoost (Real),1,0.3,0.8222849083215797,0.346240381909616,48.04841160774231,0.346240381909616
134,5,Logistic Regression (Penalty = L2),1,0.3,0.8222849083215797,0.346240381909616,0.11418461799621582,0.346240381909616
135,5,Naive Bayes,1,0.3,0.7066290550070522,0.4910412691297605,0.10783743858337402,0.4910412691297605
136,5,KNeighbors Classifier,2,0.3,0.7411598302687411,0.4006371945186164,0.8592891693115234,0.4006371945186164
137,5,SVC Classifier,2,0.3,0.7793493635077794,1.0,0.6498327255249023,0.0
138,5,Decision Tree,2,0.3,0.8387553041018387,0.31928061627339377,0.11019444465637207,0.31928061627339377
139,5,RandomForest,2,0.3,0.7793493635077794,1.0,0.7474710941314697,0.0
140,5,AdaBoost (Discrete),2,0.3,0.8387553041018387,0.31928061627339377,40.60207772254944,0.31928061627339377
141,5,AdaBoost (Real),2,0.3,0.8387553041018387,0.31928061627339377,48.62239718437195,0.31928061627339377
142,5,Logistic Regression (Penalty = L2),2,0.3,0.8387553041018387,0.31928061627339377,0.09450483322143555,0.31928061627339377
143,5,Naive Bayes,2,0.3,0.7340876944837341,0.662313034308449,0.11139917373657227,0.662313034308449
144,6,KNeighbors Classifier,0,0.3,0.8352112676056338,0.9113154907768575,0.6469628810882568,0.9113154907768575
145,6,SVC Classifier,0,0.3,0.9098591549295775,0.4530153324120529,0.7425060272216797,0.4530153324120529
146,6,Decision Tree,0,0.3,0.9845070422535211,0.9705393645157323,0.10598230361938477,0.9705393645157323
147,6,RandomForest,0,0.3,0.9014084507042254,0.9561361361937124,0.7437431812286377,0.0
148,6,AdaBoost (Discrete),0,0.3,0.8901408450704226,0.4236090741960986,42.342291593551636,0.4236090741960986
149,6,AdaBoost (Real),0,0.3,0.9845070422535211,0.9705393645157323,51.27444887161255,0.9705393645157323
150,6,Logistic Regression (Penalty = L2),0,0.3,0.9845070422535211,0.9705393645157323,0.2205510139465332,0.9705393645157323
151,6,Naive Bayes,0,0.3,0.9845070422535211,0.9705393645157323,0.11570882797241211,0.9705393645157323
152,6,KNeighbors Classifier,1,0.3,0.9760225669957687,0.9369604361556937,0.6894328594207764,0.9369604361556937
153,6,SVC Classifier,1,0.3,0.9760225669957687,0.9369604361556937,0.6436209678649902,0.9369604361556937
154,6,Decision Tree,1,0.3,0.9760225669957687,0.9369604361556937,0.002912759780883789,0.9369604361556937
155,6,RandomForest,1,0.3,0.8942172073342737,0.9147320339189784,0.7825131416320801,0.0
156,6,AdaBoost (Discrete),1,0.3,0.9633286318758815,0.9355650414077324,43.122557401657104,0.9355650414077324
157,6,AdaBoost (Real),1,0.3,0.9746121297602257,0.927942991644796,54.32232618331909,0.927942991644796
158,6,Logistic Regression (Penalty = L2),1,0.3,0.9788434414668548,0.9445168950318586,0.21557116508483887,0.9445168950318586
159,6,Naive Bayes,1,0.3,0.7997179125528914,0.8601037713919562,0.12511777877807617,0.8601037713919562
160,6,KNeighbors Classifier,2,0.3,0.9915134370579916,0.9791605716903751,0.7699742317199707,0.9791605716903751
161,6,SVC Classifier,2,0.3,0.9391796322489392,0.8248573930653896,0.6552369594573975,0.8248573930653896
162,6,Decision Tree,2,0.3,0.9929278642149929,0.9826954780586864,0.001811981201171875,0.9826954780586864
163,6,RandomForest,2,0.3,0.8571428571428571,0.7491491772643939,0.564997673034668,0.0
164,6,AdaBoost (Discrete),2,0.3,0.9391796322489392,0.8248573930653896,41.74714732170105,0.8248573930653896
165,6,AdaBoost (Real),2,0.3,0.9915134370579916,0.9791605716903751,53.39832520484924,0.9791605716903751
166,6,Logistic Regression (Penalty = L2),2,0.3,0.9915134370579916,0.9791605716903751,0.11097216606140137,0.9791605716903751
167,6,Naive Bayes,2,0.3,0.8118811881188119,0.897274522572626,0.10900139808654785,0.897274522572626
168,7,KNeighbors Classifier,0,0.3,0.9408450704225352,0.9408536371412498,0.536135196685791,0.9408536371412498
169,7,SVC Classifier,0,0.3,0.7971830985915493,0.4132601193179773,0.8632636070251465,0.0
170,7,Decision Tree,0,0.3,0.976056338028169,0.9364568572363935,0.11402273178100586,0.9364568572363935
171,7,RandomForest,0,0.3,0.8718309859154929,0.5353325086049819,0.6280736923217773,0.5353325086049819
172,7,AdaBoost (Discrete),0,0.3,0.976056338028169,0.9364568572363935,41.484395265579224,0.9364568572363935
173,7,AdaBoost (Real),0,0.3,0.852112676056338,0.900970361812581,52.68909502029419,0.900970361812581
174,7,Logistic Regression (Penalty = L2),0,0.3,0.976056338028169,0.9364568572363935,0.31667256355285645,0.9364568572363935
175,7,Naive Bayes,0,0.3,0.8450704225352113,0.6100646174463319,0.0029790401458740234,0.6100646174463319
176,7,KNeighbors Classifier,1,0.3,0.8095909732016925,0.5949711872561022,0.7548849582672119,0.5949711872561022
177,7,SVC Classifier,1,0.3,0.8208744710860366,0.3388713168009762,0.759016752243042,0.3388713168009762
178,7,Decision Tree,1,0.3,0.9153737658674189,0.5969560271087193,0.0018305778503417969,0.5969560271087193
179,7,RandomForest,1,0.3,0.8208744710860366,0.3388713168009762,0.7433192729949951,0.3388713168009762
180,7,AdaBoost (Discrete),1,0.3,0.9153737658674189,0.5969560271087193,39.34213829040527,0.5969560271087193
181,7,AdaBoost (Real),1,0.3,0.6389280677009873,0.537691786432699,46.36597514152527,0.537691786432699
182,7,Logistic Regression (Penalty = L2),1,0.3,0.9153737658674189,0.5969560271087193,0.19193005561828613,0.5969560271087193
183,7,Naive Bayes,1,0.3,0.7771509167842031,0.6351349704824193,0.09499526023864746,0.6351349704824193
184,7,KNeighbors Classifier,2,0.3,0.7694483734087695,0.6913092880012537,0.5773530006408691,0.6913092880012537
185,7,SVC Classifier,2,0.3,0.8316831683168316,0.614451804788759,0.8127467632293701,0.0
186,7,Decision Tree,2,0.3,0.9094766619519095,0.9689042833036098,0.002761363983154297,0.0
187,7,RandomForest,2,0.3,0.8316831683168316,0.614451804788759,0.6741583347320557,0.0
188,7,AdaBoost (Discrete),2,0.3,0.7652050919377652,0.8858096246161654,37.33661127090454,0.0
189,7,AdaBoost (Real),2,0.3,0.7652050919377652,0.8858096246161654,50.45880484580994,0.0
190,7,Logistic Regression (Penalty = L2),2,0.3,0.9094766619519095,0.9689042833036098,0.18817377090454102,0.0
191,7,Naive Bayes,2,0.3,0.7694483734087695,0.6913092880012537,0.09948158264160156,0.6913092880012537
192,8,KNeighbors Classifier,0,0.3,0.9492957746478873,0.9750961659762587,0.57417893409729,0.9750961659762587
193,8,SVC Classifier,0,0.3,0.9098591549295775,0.4530153324120529,0.5819225311279297,0.4530153324120529
194,8,Decision Tree,0,0.3,0.9845070422535211,0.9705393645157323,0.09418296813964844,0.9705393645157323
195,8,RandomForest,0,0.3,0.8901408450704226,0.4236090741960986,0.5964946746826172,0.4236090741960986
196,8,AdaBoost (Discrete),0,0.3,0.8901408450704226,0.4236090741960986,37.24985861778259,0.4236090741960986
197,8,AdaBoost (Real),0,0.3,0.9845070422535211,0.9705393645157323,47.41298294067383,0.9705393645157323
198,8,Logistic Regression (Penalty = L2),0,0.3,0.9845070422535211,0.9705393645157323,0.16798758506774902,0.9705393645157323
199,8,Naive Bayes,0,0.3,0.9492957746478873,0.9750961659762587,0.09317469596862793,0.9750961659762587
200,8,KNeighbors Classifier,1,0.3,0.8702397743300423,0.9338451038203882,0.6668174266815186,0.9338451038203882
201,8,SVC Classifier,1,0.3,0.9760225669957687,0.9369604361556937,0.573418378829956,0.9369604361556937
202,8,Decision Tree,1,0.3,0.9760225669957687,0.9369604361556937,0.09916019439697266,0.9369604361556937
203,8,RandomForest,1,0.3,0.9337094499294781,0.7927843292491847,0.6812987327575684,0.7927843292491847
204,8,AdaBoost (Discrete),1,0.3,0.8702397743300423,0.9338451038203882,37.621166467666626,0.9338451038203882
205,8,AdaBoost (Real),1,0.3,0.9760225669957687,0.9369604361556937,45.335673093795776,0.9369604361556937
206,8,Logistic Regression (Penalty = L2),1,0.3,0.9760225669957687,0.9369604361556937,0.4536900520324707,0.9369604361556937
207,8,Naive Bayes,1,0.3,0.8702397743300423,0.9338451038203882,0.09993290901184082,0.9338451038203882
208,8,KNeighbors Classifier,2,0.3,0.8472418670438473,0.9223454219396696,0.6663699150085449,0.9223454219396696
209,8,SVC Classifier,2,0.3,0.9915134370579916,0.9791605716903751,0.5834286212921143,0.9791605716903751
210,8,Decision Tree,2,0.3,0.9915134370579916,0.9791605716903751,0.08648872375488281,0.9791605716903751
211,8,RandomForest,2,0.3,0.9391796322489392,0.8248573930653896,0.5641770362854004,0.8248573930653896
212,8,AdaBoost (Discrete),2,0.3,0.9391796322489392,0.8248573930653896,37.77808403968811,0.8248573930653896
213,8,AdaBoost (Real),2,0.3,0.9391796322489392,0.8248573930653896,48.41110682487488,0.8248573930653896
214,8,Logistic Regression (Penalty = L2),2,0.3,0.9915134370579916,0.9791605716903751,0.2147359848022461,0.9791605716903751
215,8,Naive Bayes,2,0.3,0.8472418670438473,0.9223454219396696,0.10068821907043457,0.9223454219396696
216,9,KNeighbors Classifier,0,0.3,0.9408450704225352,0.9408536371412498,0.5893683433532715,0.9408536371412498
217,9,SVC Classifier,0,0.3,0.7971830985915493,0.4132601193179773,0.6701352596282959,0.0
218,9,Decision Tree,0,0.3,0.976056338028169,0.9364568572363935,0.0017697811126708984,0.9364568572363935
219,9,RandomForest,0,0.3,0.8718309859154929,0.5353325086049819,0.6616058349609375,0.5353325086049819
220,9,AdaBoost (Discrete),0,0.3,0.976056338028169,0.9364568572363935,37.65423798561096,0.9364568572363935
221,9,AdaBoost (Real),0,0.3,0.852112676056338,0.900970361812581,48.02146863937378,0.900970361812581
222,9,Logistic Regression (Penalty = L2),0,0.3,0.976056338028169,0.9364568572363935,0.19840025901794434,0.9364568572363935
223,9,Naive Bayes,0,0.3,0.8450704225352113,0.6100646174463319,0.09514784812927246,0.6100646174463319
224,9,KNeighbors Classifier,1,0.3,0.8095909732016925,0.5949711872561022,0.5641603469848633,0.5949711872561022
225,9,SVC Classifier,1,0.3,0.8208744710860366,0.3388713168009762,0.614163875579834,0.3388713168009762
226,9,Decision Tree,1,0.3,0.9153737658674189,0.5969560271087193,0.0027549266815185547,0.5969560271087193
227,9,RandomForest,1,0.3,0.8208744710860366,0.3388713168009762,0.5591228008270264,0.3388713168009762
228,9,AdaBoost (Discrete),1,0.3,0.9153737658674189,0.5969560271087193,37.64265561103821,0.5969560271087193
229,9,AdaBoost (Real),1,0.3,0.6389280677009873,0.537691786432699,50.023377895355225,0.537691786432699
230,9,Logistic Regression (Penalty = L2),1,0.3,0.9153737658674189,0.5969560271087193,0.19931864738464355,0.5969560271087193
231,9,Naive Bayes,1,0.3,0.7771509167842031,0.6351349704824193,0.15338826179504395,0.6351349704824193
232,9,KNeighbors Classifier,2,0.3,0.7694483734087695,0.6913092880012537,0.6234629154205322,0.6913092880012537
233,9,SVC Classifier,2,0.3,0.8316831683168316,0.614451804788759,0.7304630279541016,0.0
234,9,Decision Tree,2,0.3,0.9094766619519095,0.9689042833036098,0.09908938407897949,0.0
235,9,RandomForest,2,0.3,0.8316831683168316,0.614451804788759,0.595043420791626,0.0
236,9,AdaBoost (Discrete),2,0.3,0.7652050919377652,0.8858096246161654,39.54899883270264,0.0
237,9,AdaBoost (Real),2,0.3,0.7652050919377652,0.8858096246161654,51.25059390068054,0.0
238,9,Logistic Regression (Penalty = L2),2,0.3,0.9094766619519095,0.9689042833036098,0.2076282501220703,0.0
239,9,Naive Bayes,2,0.3,0.7694483734087695,0.6913092880012537,0.10310626029968262,0.6913092880012537
240,10,KNeighbors Classifier,0,0.3,0.9901408450704225,0.9845563082523555,1.0766334533691406,0.9845563082523555
241,10,SVC Classifier,0,0.3,0.9098591549295775,0.4530153324120529,0.6609699726104736,0.4530153324120529
242,10,Decision Tree,0,0.3,0.9845070422535211,0.9705393645157323,0.0019071102142333984,0.9705393645157323
243,10,RandomForest,0,0.3,0.8901408450704226,0.4236090741960986,1.04888916015625,0.4236090741960986
244,10,AdaBoost (Discrete),0,0.3,0.8901408450704226,0.4236090741960986,46.37843298912048,0.4236090741960986
245,10,AdaBoost (Real),0,0.3,0.9845070422535211,0.9705393645157323,57.73969793319702,0.9705393645157323
246,10,Logistic Regression (Penalty = L2),0,0.3,0.9845070422535211,0.9705393645157323,0.283750057220459,0.9705393645157323
247,10,Naive Bayes,0,0.3,0.9492957746478873,0.9750961659762587,0.10849142074584961,0.9750961659762587
248,10,KNeighbors Classifier,1,0.3,0.9435825105782792,0.8865181789611445,1.1813313961029053,0.8865181789611445
249,10,SVC Classifier,1,0.3,0.9760225669957687,0.9369604361556937,0.7523798942565918,0.9369604361556937
250,10,Decision Tree,1,0.3,0.9760225669957687,0.9369604361556937,0.002619028091430664,0.9369604361556937
251,10,RandomForest,1,0.3,0.9337094499294781,0.7927843292491847,0.7548801898956299,0.7927843292491847
252,10,AdaBoost (Discrete),1,0.3,0.9322990126939351,0.9373466751166473,47.40866541862488,0.9373466751166473
253,10,AdaBoost (Real),1,0.3,0.9746121297602257,0.927942991644796,57.40411424636841,0.927942991644796
254,10,Logistic Regression (Penalty = L2),1,0.3,0.9788434414668548,0.9445168950318586,0.27442407608032227,0.9445168950318586
255,10,Naive Bayes,1,0.3,0.8702397743300423,0.9338451038203882,0.08924412727355957,0.9338451038203882
256,10,KNeighbors Classifier,2,0.3,0.9222065063649222,0.8319011083329612,1.2614223957061768,0.8319011083329612
257,10,SVC Classifier,2,0.3,0.9915134370579916,0.9791605716903751,0.9618892669677734,0.9791605716903751
258,10,Decision Tree,2,0.3,0.9915134370579916,0.9791605716903751,0.10709667205810547,0.9791605716903751
259,10,RandomForest,2,0.3,0.9391796322489392,0.8248573930653896,0.6819813251495361,0.8248573930653896
260,10,AdaBoost (Discrete),2,0.3,0.9391796322489392,0.8248573930653896,49.88433885574341,0.8248573930653896
261,10,AdaBoost (Real),2,0.3,0.9391796322489392,0.8248573930653896,52.91567087173462,0.8248573930653896
262,10,Logistic Regression (Penalty = L2),2,0.3,0.9915134370579916,0.9791605716903751,0.28514647483825684,0.9791605716903751
263,10,Naive Bayes,2,0.3,0.8472418670438473,0.9223454219396696,0.11229276657104492,0.9223454219396696
264,11,KNeighbors Classifier,0,0.3,0.9845070422535211,0.973489723170078,1.3359718322753906,0.973489723170078
265,11,SVC Classifier,0,0.3,0.9098591549295775,0.4530153324120529,0.9315640926361084,0.4530153324120529
266,11,Decision Tree,0,0.3,0.9661971830985916,0.929001358844932,0.07969307899475098,0.929001358844932
267,11,RandomForest,0,0.3,0.8816901408450705,0.41183601122357666,0.6718790531158447,0.41183601122357666
268,11,AdaBoost (Discrete),0,0.3,0.9845070422535211,0.9705393645157323,49.191243410110474,0.9705393645157323
269,11,AdaBoost (Real),0,0.3,0.9845070422535211,0.9764095103624777,61.306265115737915,0.9764095103624777
270,11,Logistic Regression (Penalty = L2),0,0.3,0.9859154929577465,0.9740815103815855,0.3140559196472168,0.9740815103815855
271,11,Naive Bayes,0,0.3,0.9605633802816902,0.9773746456826605,0.09214663505554199,0.9773746456826605
272,11,KNeighbors Classifier,1,0.3,0.9689703808180536,0.9341228644601436,0.8753125667572021,0.9341228644601436
273,11,SVC Classifier,1,0.3,0.9760225669957687,0.9369604361556937,0.8865373134613037,0.9369604361556937
274,11,Decision Tree,1,0.3,0.9449929478138223,0.8903402841774851,0.002408742904663086,0.8903402841774851
275,11,RandomForest,1,0.3,0.8871650211565585,0.6271149382637747,0.7326071262359619,0.6271149382637747
276,11,AdaBoost (Discrete),1,0.3,0.9619181946403385,0.948830592180549,46.9730589389801,0.948830592180549
277,11,AdaBoost (Real),1,0.3,0.9520451339915373,0.9503418432850491,55.655505657196045,0.9503418432850491
278,11,Logistic Regression (Penalty = L2),1,0.3,0.9703808180535967,0.9534492813263334,0.35155606269836426,0.9534492813263334
279,11,Naive Bayes,1,0.3,0.8928067700987306,0.9419023020164227,0.17345666885375977,0.9419023020164227
280,11,KNeighbors Classifier,2,0.3,0.9900990099009901,0.9815050523288019,1.145059585571289,0.9815050523288019
281,11,SVC Classifier,2,0.3,0.9915134370579916,0.9791605716903751,0.876056432723999,0.9791605716903751
282,11,Decision Tree,2,0.3,0.9702970297029703,0.9483197000498844,0.087982177734375,0.9483197000498844
283,11,RandomForest,2,0.3,0.8628005657708628,0.36216229336671174,0.6239309310913086,0.36216229336671174
284,11,AdaBoost (Discrete),2,0.3,0.9731258840169731,0.9625054539304982,44.88432550430298,0.9625054539304982
285,11,AdaBoost (Real),2,0.3,0.9801980198019802,0.9714509392074948,54.78451943397522,0.9714509392074948
286,11,Logistic Regression (Penalty = L2),2,0.3,0.9900990099009901,0.9785678593350768,0.3309941291809082,0.9785678593350768
287,11,Naive Bayes,2,0.3,0.8543140028288543,0.9232008690281576,0.08471560478210449,0.9232008690281576
288,12,KNeighbors Classifier,0,0.3,0.8718309859154929,0.5353325086049819,0.5177726745605469,0.5353325086049819
289,12,SVC Classifier,0,0.3,0.7971830985915493,0.4132601193179773,0.6110506057739258,0.0
290,12,Decision Tree,0,0.3,0.8718309859154929,0.5353325086049819,0.0819857120513916,0.5353325086049819
291,12,RandomForest,0,0.3,0.8718309859154929,0.5353325086049819,0.6255097389221191,0.5353325086049819
292,12,AdaBoost (Discrete),0,0.3,0.8718309859154929,0.5353325086049819,32.81842374801636,0.5353325086049819
293,12,AdaBoost (Real),0,0.3,0.8718309859154929,0.5353325086049819,38.802377462387085,0.5353325086049819
294,12,Logistic Regression (Penalty = L2),0,0.3,0.8718309859154929,0.5353325086049819,0.14171218872070312,0.5353325086049819
295,12,Naive Bayes,0,0.3,0.7267605633802817,0.5153581025776002,0.07657217979431152,0.5153581025776002
296,12,KNeighbors Classifier,1,0.3,0.7602256699576869,0.5795504327159492,0.36025190353393555,0.5795504327159492
297,12,SVC Classifier,1,0.3,0.8208744710860366,0.3388713168009762,0.43147706985473633,0.3388713168009762
298,12,Decision Tree,1,0.3,0.8208744710860366,0.3388713168009762,0.07090091705322266,0.3388713168009762
299,12,RandomForest,1,0.3,0.8208744710860366,0.3388713168009762,0.49530577659606934,0.3388713168009762
300,12,AdaBoost (Discrete),1,0.3,0.8208744710860366,0.3388713168009762,28.35097026824951,0.3388713168009762
301,12,AdaBoost (Real),1,0.3,0.8208744710860366,0.3388713168009762,35.40044832229614,0.3388713168009762
302,12,Logistic Regression (Penalty = L2),1,0.3,0.8208744710860366,0.3388713168009762,0.1382279396057129,0.3388713168009762
303,12,Naive Bayes,1,0.3,0.7066290550070522,0.4910412691297605,0.06324315071105957,0.4910412691297605
304,12,KNeighbors Classifier,2,0.3,0.7340876944837341,0.863686027347512,0.40901899337768555,0.0
305,12,SVC Classifier,2,0.3,0.7793493635077794,1.0,0.4001963138580322,0.0
306,12,Decision Tree,2,0.3,0.8316831683168316,0.614451804788759,0.06678557395935059,0.0
307,12,RandomForest,2,0.3,0.7793493635077794,1.0,0.4786059856414795,0.0
308,12,AdaBoost (Discrete),2,0.3,0.8316831683168316,0.614451804788759,27.85507369041443,0.0
309,12,AdaBoost (Real),2,0.3,0.8316831683168316,0.614451804788759,31.615668058395386,0.0
310,12,Logistic Regression (Penalty = L2),2,0.3,0.8316831683168316,0.614451804788759,0.2181258201599121,0.0
311,12,Naive Bayes,2,0.3,0.7340876944837341,0.662313034308449,0.06057262420654297,0.662313034308449
