,feat_set_id,classifier,fold_id,feat_th,score,geo_score,exec_t,geo_score_woz
0,0,KNeighbors Classifier,0,1.0,0.8571428571428571,0.7071067811865476,0.05178689956665039,0.7071067811865476
1,0,SVC Classifier,0,1.0,0.7142857142857143,1.0,0.02349686622619629,0.0
2,0,Decision Tree,0,1.0,0.9523809523809523,0.9128709291752769,0.0021066665649414062,0.9128709291752769
3,0,RandomForest,0,1.0,0.9523809523809523,0.9128709291752769,0.15742754936218262,0.9128709291752769
4,0,AdaBoost (Discrete),0,1.0,0.9523809523809523,0.9128709291752769,0.040290117263793945,0.9128709291752769
5,0,AdaBoost (Real),0,1.0,0.9523809523809523,0.9128709291752769,0.03722071647644043,0.9128709291752769
6,0,Logistic Regression (Penalty = L2),0,1.0,1.0,1.0,0.0503230094909668,1.0
7,0,Naive Bayes,0,1.0,0.9523809523809523,0.9128709291752769,0.022858142852783203,0.9128709291752769
8,0,KNeighbors Classifier,1,1.0,0.8095238095238095,0.6831300510639732,0.019083261489868164,0.6831300510639732
9,0,SVC Classifier,1,1.0,0.7142857142857143,1.0,0.01853156089782715,0.0
10,0,Decision Tree,1,1.0,1.0,1.0,0.0013399124145507812,1.0
11,0,RandomForest,1,1.0,0.9523809523809523,0.9128709291752769,0.14973163604736328,0.9128709291752769
12,0,AdaBoost (Discrete),1,1.0,0.9523809523809523,0.9660917830792959,0.002665996551513672,0.9660917830792959
13,0,AdaBoost (Real),1,1.0,0.9523809523809523,0.9660917830792959,0.03423595428466797,0.9660917830792959
14,0,Logistic Regression (Penalty = L2),1,1.0,0.9523809523809523,0.9660917830792959,0.03042745590209961,0.9660917830792959
15,0,Naive Bayes,1,1.0,0.9523809523809523,0.9128709291752769,0.002962827682495117,0.9128709291752769
16,0,KNeighbors Classifier,2,1.0,0.7894736842105263,0.4472135954999579,0.023564577102661133,0.4472135954999579
17,0,SVC Classifier,2,1.0,0.7368421052631579,1.0,0.0023577213287353516,0.0
18,0,Decision Tree,2,1.0,0.9473684210526315,0.8944271909999159,0.0011680126190185547,0.8944271909999159
19,0,RandomForest,2,1.0,0.8947368421052632,0.7745966692414834,0.16483664512634277,0.7745966692414834
20,0,AdaBoost (Discrete),2,1.0,0.8947368421052632,0.7745966692414834,0.036272287368774414,0.7745966692414834
21,0,AdaBoost (Real),2,1.0,0.9473684210526315,0.8944271909999159,0.03369140625,0.8944271909999159
22,0,Logistic Regression (Penalty = L2),2,1.0,0.8947368421052632,0.7745966692414834,0.0018930435180664062,0.7745966692414834
23,0,Naive Bayes,2,1.0,0.8947368421052632,0.7745966692414834,0.027178525924682617,0.7745966692414834
24,1,KNeighbors Classifier,0,1.0,0.8571428571428571,0.7071067811865476,0.0022270679473876953,0.7071067811865476
25,1,SVC Classifier,0,1.0,0.7142857142857143,1.0,0.0020482540130615234,0.0
26,1,Decision Tree,0,1.0,0.9523809523809523,0.9128709291752769,0.0012383460998535156,0.9128709291752769
27,1,RandomForest,0,1.0,0.9523809523809523,0.9128709291752769,0.17060351371765137,0.9128709291752769
28,1,AdaBoost (Discrete),0,1.0,0.9523809523809523,0.9128709291752769,0.024042367935180664,0.9128709291752769
29,1,AdaBoost (Real),0,1.0,0.9523809523809523,0.9128709291752769,0.024665117263793945,0.9128709291752769
30,1,Logistic Regression (Penalty = L2),0,1.0,1.0,1.0,0.0011799335479736328,1.0
31,1,Naive Bayes,0,1.0,0.9523809523809523,0.9128709291752769,0.019868850708007812,0.9128709291752769
32,1,KNeighbors Classifier,1,1.0,0.8095238095238095,0.6831300510639732,0.023900270462036133,0.6831300510639732
33,1,SVC Classifier,1,1.0,0.7142857142857143,1.0,0.026411771774291992,0.0
34,1,Decision Tree,1,1.0,0.9047619047619048,0.8819171036881969,0.0020508766174316406,0.8819171036881969
35,1,RandomForest,1,1.0,0.9523809523809523,0.9128709291752769,0.1757044792175293,0.9128709291752769
36,1,AdaBoost (Discrete),1,1.0,0.9523809523809523,0.9660917830792959,0.027231931686401367,0.9660917830792959
37,1,AdaBoost (Real),1,1.0,0.9523809523809523,0.9660917830792959,0.01775503158569336,0.9660917830792959
38,1,Logistic Regression (Penalty = L2),1,1.0,0.9523809523809523,0.9660917830792959,0.012336969375610352,0.9660917830792959
39,1,Naive Bayes,1,1.0,0.9523809523809523,0.9128709291752769,0.015576839447021484,0.9128709291752769
40,1,KNeighbors Classifier,2,1.0,0.7894736842105263,0.4472135954999579,0.04173088073730469,0.4472135954999579
41,1,SVC Classifier,2,1.0,0.7368421052631579,1.0,0.02997446060180664,0.0
42,1,Decision Tree,2,1.0,0.9473684210526315,0.8944271909999159,0.0017337799072265625,0.8944271909999159
43,1,RandomForest,2,1.0,0.8947368421052632,0.7745966692414834,0.1595931053161621,0.7745966692414834
44,1,AdaBoost (Discrete),2,1.0,0.8947368421052632,0.7745966692414834,0.023978710174560547,0.7745966692414834
45,1,AdaBoost (Real),2,1.0,0.9473684210526315,0.8944271909999159,0.02295994758605957,0.8944271909999159
46,1,Logistic Regression (Penalty = L2),2,1.0,0.8947368421052632,0.7745966692414834,0.0018062591552734375,0.7745966692414834
47,1,Naive Bayes,2,1.0,0.8947368421052632,0.7745966692414834,0.022362709045410156,0.7745966692414834
48,2,KNeighbors Classifier,0,1.0,0.8571428571428571,0.7071067811865476,0.02353692054748535,0.7071067811865476
49,2,SVC Classifier,0,1.0,0.7142857142857143,1.0,0.017792940139770508,0.0
50,2,Decision Tree,0,1.0,0.9523809523809523,0.9128709291752769,0.001003265380859375,0.9128709291752769
51,2,RandomForest,0,1.0,0.9523809523809523,0.9128709291752769,0.17067670822143555,0.9128709291752769
52,2,AdaBoost (Discrete),0,1.0,0.9523809523809523,0.9128709291752769,0.024482250213623047,0.9128709291752769
53,2,AdaBoost (Real),0,1.0,0.9523809523809523,0.9128709291752769,0.023194313049316406,0.9128709291752769
54,2,Logistic Regression (Penalty = L2),0,1.0,1.0,1.0,0.001920938491821289,1.0
55,2,Naive Bayes,0,1.0,0.9523809523809523,0.9128709291752769,0.0029191970825195312,0.9128709291752769
56,2,KNeighbors Classifier,1,1.0,0.8095238095238095,0.6831300510639732,0.026484251022338867,0.6831300510639732
57,2,SVC Classifier,1,1.0,0.7142857142857143,1.0,0.00113677978515625,0.0
58,2,Decision Tree,1,1.0,0.9523809523809523,0.9660917830792959,0.021584272384643555,0.9660917830792959
59,2,RandomForest,1,1.0,0.9523809523809523,0.9128709291752769,0.17314863204956055,0.9128709291752769
60,2,AdaBoost (Discrete),1,1.0,0.9523809523809523,0.9660917830792959,0.02432537078857422,0.9660917830792959
61,2,AdaBoost (Real),1,1.0,0.9523809523809523,0.9660917830792959,0.02446913719177246,0.9660917830792959
62,2,Logistic Regression (Penalty = L2),1,1.0,0.9523809523809523,0.9660917830792959,0.002115964889526367,0.9660917830792959
63,2,Naive Bayes,1,1.0,0.9523809523809523,0.9128709291752769,0.02177572250366211,0.9128709291752769
64,2,KNeighbors Classifier,2,1.0,0.7894736842105263,0.4472135954999579,0.02233576774597168,0.4472135954999579
65,2,SVC Classifier,2,1.0,0.7368421052631579,1.0,0.021661758422851562,0.0
66,2,Decision Tree,2,1.0,0.9473684210526315,0.8944271909999159,0.025591373443603516,0.8944271909999159
67,2,RandomForest,2,1.0,0.8947368421052632,0.7745966692414834,0.12066459655761719,0.7745966692414834
68,2,AdaBoost (Discrete),2,1.0,0.9473684210526315,0.8944271909999159,0.0241239070892334,0.8944271909999159
69,2,AdaBoost (Real),2,1.0,0.9473684210526315,0.8944271909999159,0.025033235549926758,0.8944271909999159
70,2,Logistic Regression (Penalty = L2),2,1.0,0.8947368421052632,0.7745966692414834,0.0011944770812988281,0.7745966692414834
71,2,Naive Bayes,2,1.0,0.8947368421052632,0.7745966692414834,0.002622365951538086,0.7745966692414834
72,3,KNeighbors Classifier,0,1.0,0.8571428571428571,0.7071067811865476,0.02295064926147461,0.7071067811865476
73,3,SVC Classifier,0,1.0,0.7142857142857143,1.0,0.002032041549682617,0.0
74,3,Decision Tree,0,1.0,0.9523809523809523,0.9128709291752769,0.0010595321655273438,0.9128709291752769
75,3,RandomForest,0,1.0,0.9523809523809523,0.9128709291752769,0.18527865409851074,0.9128709291752769
76,3,AdaBoost (Discrete),0,1.0,0.9523809523809523,0.9128709291752769,0.002712726593017578,0.9128709291752769
77,3,AdaBoost (Real),0,1.0,0.9523809523809523,0.9128709291752769,0.0249478816986084,0.9128709291752769
78,3,Logistic Regression (Penalty = L2),0,1.0,1.0,1.0,0.03339052200317383,1.0
79,3,Naive Bayes,0,1.0,0.9523809523809523,0.9128709291752769,0.03097844123840332,0.9128709291752769
80,3,KNeighbors Classifier,1,1.0,0.8095238095238095,0.6831300510639732,0.03142261505126953,0.6831300510639732
81,3,SVC Classifier,1,1.0,0.7142857142857143,1.0,0.030012130737304688,0.0
82,3,Decision Tree,1,1.0,0.7619047619047619,0.6582805886043833,0.03389930725097656,0.6582805886043833
83,3,RandomForest,1,1.0,0.9523809523809523,0.9128709291752769,0.19823360443115234,0.9128709291752769
84,3,AdaBoost (Discrete),1,1.0,0.9523809523809523,0.9660917830792959,0.0352175235748291,0.9660917830792959
85,3,AdaBoost (Real),1,1.0,0.9523809523809523,0.9660917830792959,0.06442546844482422,0.9660917830792959
86,3,Logistic Regression (Penalty = L2),1,1.0,0.9523809523809523,0.9660917830792959,0.0015566349029541016,0.9660917830792959
87,3,Naive Bayes,1,1.0,0.9523809523809523,0.9128709291752769,0.03747987747192383,0.9128709291752769
88,3,KNeighbors Classifier,2,1.0,0.7894736842105263,0.4472135954999579,0.0021326541900634766,0.4472135954999579
89,3,SVC Classifier,2,1.0,0.7368421052631579,1.0,0.030230998992919922,0.0
90,3,Decision Tree,2,1.0,0.9473684210526315,0.8944271909999159,0.0010867118835449219,0.8944271909999159
91,3,RandomForest,2,1.0,0.8947368421052632,0.7745966692414834,0.19106721878051758,0.7745966692414834
92,3,AdaBoost (Discrete),2,1.0,0.8947368421052632,0.7745966692414834,0.03220868110656738,0.7745966692414834
93,3,AdaBoost (Real),2,1.0,0.9473684210526315,0.8944271909999159,0.030645370483398438,0.8944271909999159
94,3,Logistic Regression (Penalty = L2),2,1.0,0.8947368421052632,0.7745966692414834,0.03018498420715332,0.7745966692414834
95,3,Naive Bayes,2,1.0,0.8947368421052632,0.7745966692414834,0.030387163162231445,0.7745966692414834
96,4,KNeighbors Classifier,0,1.0,0.8571428571428571,0.7071067811865476,0.0027418136596679688,0.7071067811865476
97,4,SVC Classifier,0,1.0,0.7142857142857143,1.0,0.0011515617370605469,0.0
98,4,Decision Tree,0,1.0,0.9523809523809523,0.9128709291752769,0.0016956329345703125,0.9128709291752769
99,4,RandomForest,0,1.0,0.9523809523809523,0.9128709291752769,0.1990363597869873,0.9128709291752769
100,4,AdaBoost (Discrete),0,1.0,0.9523809523809523,0.9128709291752769,0.03209209442138672,0.9128709291752769
101,4,AdaBoost (Real),0,1.0,0.9523809523809523,0.9128709291752769,0.03232312202453613,0.9128709291752769
102,4,Logistic Regression (Penalty = L2),0,1.0,1.0,1.0,0.029775142669677734,1.0
103,4,Naive Bayes,0,1.0,0.9523809523809523,0.9128709291752769,0.0015380382537841797,0.9128709291752769
104,4,KNeighbors Classifier,1,1.0,0.8095238095238095,0.6831300510639732,0.03551912307739258,0.6831300510639732
105,4,SVC Classifier,1,1.0,0.7142857142857143,1.0,0.0019066333770751953,0.0
106,4,Decision Tree,1,1.0,0.9523809523809523,0.9660917830792959,0.0010042190551757812,0.9660917830792959
107,4,RandomForest,1,1.0,0.9523809523809523,0.9128709291752769,0.21899652481079102,0.9128709291752769
108,4,AdaBoost (Discrete),1,1.0,0.9523809523809523,0.9660917830792959,0.03268623352050781,0.9660917830792959
109,4,AdaBoost (Real),1,1.0,0.9523809523809523,0.9660917830792959,0.0366363525390625,0.9660917830792959
110,4,Logistic Regression (Penalty = L2),1,1.0,0.9523809523809523,0.9660917830792959,0.0019927024841308594,0.9660917830792959
111,4,Naive Bayes,1,1.0,0.9523809523809523,0.9128709291752769,0.030388832092285156,0.9128709291752769
112,4,KNeighbors Classifier,2,1.0,0.7894736842105263,0.4472135954999579,0.03168654441833496,0.4472135954999579
113,4,SVC Classifier,2,1.0,0.7368421052631579,1.0,0.0023009777069091797,0.0
114,4,Decision Tree,2,1.0,0.8947368421052632,0.7745966692414834,0.001809835433959961,0.7745966692414834
115,4,RandomForest,2,1.0,0.8947368421052632,0.7745966692414834,0.2513468265533447,0.7745966692414834
116,4,AdaBoost (Discrete),2,1.0,0.8947368421052632,0.7745966692414834,0.033994436264038086,0.7745966692414834
117,4,AdaBoost (Real),2,1.0,0.9473684210526315,0.8944271909999159,0.03764486312866211,0.8944271909999159
118,4,Logistic Regression (Penalty = L2),2,1.0,0.8947368421052632,0.7745966692414834,0.030317306518554688,0.7745966692414834
119,4,Naive Bayes,2,1.0,0.8947368421052632,0.7745966692414834,0.030948877334594727,0.7745966692414834
120,5,KNeighbors Classifier,0,1.0,0.8571428571428571,0.7071067811865476,0.031594038009643555,0.7071067811865476
121,5,SVC Classifier,0,1.0,0.7142857142857143,1.0,0.001725912094116211,0.0
122,5,Decision Tree,0,1.0,0.8571428571428571,0.8498365855987975,0.0017652511596679688,0.8498365855987975
123,5,RandomForest,0,1.0,0.9523809523809523,0.9128709291752769,0.1955699920654297,0.9128709291752769
124,5,AdaBoost (Discrete),0,1.0,0.9523809523809523,0.9128709291752769,0.0024394989013671875,0.9128709291752769
125,5,AdaBoost (Real),0,1.0,0.9523809523809523,0.9128709291752769,0.03268718719482422,0.9128709291752769
126,5,Logistic Regression (Penalty = L2),0,1.0,1.0,1.0,0.030130863189697266,1.0
127,5,Naive Bayes,0,1.0,0.9523809523809523,0.9128709291752769,0.0022766590118408203,0.9128709291752769
128,5,KNeighbors Classifier,1,1.0,0.8095238095238095,0.6831300510639732,0.03521919250488281,0.6831300510639732
129,5,SVC Classifier,1,1.0,0.7142857142857143,1.0,0.001939535140991211,0.0
130,5,Decision Tree,1,1.0,0.8571428571428571,0.8944271909999159,0.0014963150024414062,0.8944271909999159
131,5,RandomForest,1,1.0,0.9523809523809523,0.9128709291752769,0.2574474811553955,0.9128709291752769
132,5,AdaBoost (Discrete),1,1.0,0.9523809523809523,0.9660917830792959,0.03653097152709961,0.9660917830792959
133,5,AdaBoost (Real),1,1.0,0.9523809523809523,0.9660917830792959,0.06898903846740723,0.9660917830792959
134,5,Logistic Regression (Penalty = L2),1,1.0,0.9523809523809523,0.9660917830792959,0.002191781997680664,0.9660917830792959
135,5,Naive Bayes,1,1.0,0.9523809523809523,0.9128709291752769,0.03493523597717285,0.9128709291752769
136,5,KNeighbors Classifier,2,1.0,0.7894736842105263,0.4472135954999579,0.03555607795715332,0.4472135954999579
137,5,SVC Classifier,2,1.0,0.7368421052631579,1.0,0.001977682113647461,0.0
138,5,Decision Tree,2,1.0,0.9473684210526315,0.8944271909999159,0.033965110778808594,0.8944271909999159
139,5,RandomForest,2,1.0,0.8947368421052632,0.7745966692414834,0.23437714576721191,0.7745966692414834
140,5,AdaBoost (Discrete),2,1.0,0.9473684210526315,0.8944271909999159,0.03206181526184082,0.8944271909999159
141,5,AdaBoost (Real),2,1.0,0.8947368421052632,0.7745966692414834,0.03221726417541504,0.7745966692414834
142,5,Logistic Regression (Penalty = L2),2,1.0,0.8947368421052632,0.7745966692414834,0.002000570297241211,0.7745966692414834
143,5,Naive Bayes,2,1.0,0.8947368421052632,0.7745966692414834,0.02212810516357422,0.7745966692414834
144,6,KNeighbors Classifier,0,1.0,0.8571428571428571,0.7071067811865476,0.03155708312988281,0.7071067811865476
145,6,SVC Classifier,0,1.0,0.7142857142857143,1.0,0.001984119415283203,0.0
146,6,Decision Tree,0,1.0,0.9523809523809523,0.9128709291752769,0.0017545223236083984,0.9128709291752769
147,6,RandomForest,0,1.0,0.9523809523809523,0.9128709291752769,0.25080037117004395,0.9128709291752769
148,6,AdaBoost (Discrete),0,1.0,0.9523809523809523,0.9128709291752769,0.03311347961425781,0.9128709291752769
149,6,AdaBoost (Real),0,1.0,0.9523809523809523,0.9128709291752769,0.03324699401855469,0.9128709291752769
150,6,Logistic Regression (Penalty = L2),0,1.0,1.0,1.0,0.029840707778930664,1.0
151,6,Naive Bayes,0,1.0,0.9523809523809523,0.9128709291752769,0.031111478805541992,0.9128709291752769
152,6,KNeighbors Classifier,1,1.0,0.8095238095238095,0.6831300510639732,0.03150296211242676,0.6831300510639732
153,6,SVC Classifier,1,1.0,0.7142857142857143,1.0,0.0019652843475341797,0.0
154,6,Decision Tree,1,1.0,0.9047619047619048,0.8819171036881969,0.030771493911743164,0.8819171036881969
155,6,RandomForest,1,1.0,0.9523809523809523,0.9128709291752769,0.28944873809814453,0.9128709291752769
156,6,AdaBoost (Discrete),1,1.0,0.9523809523809523,0.9660917830792959,0.06457042694091797,0.9660917830792959
157,6,AdaBoost (Real),1,1.0,0.9523809523809523,0.9660917830792959,0.004056215286254883,0.9660917830792959
158,6,Logistic Regression (Penalty = L2),1,1.0,0.9523809523809523,0.9660917830792959,0.002145051956176758,0.9660917830792959
159,6,Naive Bayes,1,1.0,0.9523809523809523,0.9128709291752769,0.03154110908508301,0.9128709291752769
160,6,KNeighbors Classifier,2,1.0,0.7894736842105263,0.4472135954999579,0.03170609474182129,0.4472135954999579
161,6,SVC Classifier,2,1.0,0.7368421052631579,1.0,0.03313159942626953,0.0
162,6,Decision Tree,2,1.0,0.9473684210526315,0.8944271909999159,0.0015499591827392578,0.8944271909999159
163,6,RandomForest,2,1.0,0.8947368421052632,0.7745966692414834,0.22470474243164062,0.7745966692414834
164,6,AdaBoost (Discrete),2,1.0,0.9473684210526315,0.8944271909999159,0.03160738945007324,0.8944271909999159
165,6,AdaBoost (Real),2,1.0,0.9473684210526315,0.8944271909999159,0.03275799751281738,0.8944271909999159
166,6,Logistic Regression (Penalty = L2),2,1.0,0.8947368421052632,0.7745966692414834,0.026501893997192383,0.7745966692414834
167,6,Naive Bayes,2,1.0,0.8947368421052632,0.7745966692414834,0.031001806259155273,0.7745966692414834
168,7,KNeighbors Classifier,0,1.0,0.8571428571428571,0.7071067811865476,0.031716108322143555,0.7071067811865476
169,7,SVC Classifier,0,1.0,0.7142857142857143,1.0,0.0020122528076171875,0.0
170,7,Decision Tree,0,1.0,0.9523809523809523,0.9128709291752769,0.001110076904296875,0.9128709291752769
171,7,RandomForest,0,1.0,0.9523809523809523,0.9128709291752769,0.1879417896270752,0.9128709291752769
172,7,AdaBoost (Discrete),0,1.0,0.9523809523809523,0.9128709291752769,0.05713701248168945,0.9128709291752769
173,7,AdaBoost (Real),0,1.0,0.9523809523809523,0.9128709291752769,0.06093716621398926,0.9128709291752769
174,7,Logistic Regression (Penalty = L2),0,1.0,1.0,1.0,0.029883623123168945,1.0
175,7,Naive Bayes,0,1.0,0.9523809523809523,0.9128709291752769,0.002804279327392578,0.9128709291752769
176,7,KNeighbors Classifier,1,1.0,0.8095238095238095,0.6831300510639732,0.003409147262573242,0.6831300510639732
177,7,SVC Classifier,1,1.0,0.7142857142857143,1.0,0.0014905929565429688,0.0
178,7,Decision Tree,1,1.0,0.8571428571428571,0.8498365855987975,0.029944181442260742,0.8498365855987975
179,7,RandomForest,1,1.0,0.9523809523809523,0.9128709291752769,0.2553400993347168,0.9128709291752769
180,7,AdaBoost (Discrete),1,1.0,0.9523809523809523,0.9660917830792959,0.0035657882690429688,0.9660917830792959
181,7,AdaBoost (Real),1,1.0,0.9523809523809523,0.9660917830792959,0.035130977630615234,0.9660917830792959
182,7,Logistic Regression (Penalty = L2),1,1.0,0.9523809523809523,0.9660917830792959,0.02634572982788086,0.9660917830792959
183,7,Naive Bayes,1,1.0,0.9523809523809523,0.9128709291752769,0.002887725830078125,0.9128709291752769
184,7,KNeighbors Classifier,2,1.0,0.7894736842105263,0.4472135954999579,0.03446340560913086,0.4472135954999579
185,7,SVC Classifier,2,1.0,0.7368421052631579,1.0,0.029807329177856445,0.0
186,7,Decision Tree,2,1.0,0.8421052631578947,0.6324555320336759,0.03383445739746094,0.6324555320336759
187,7,RandomForest,2,1.0,0.8947368421052632,0.7745966692414834,0.24979329109191895,0.7745966692414834
188,7,AdaBoost (Discrete),2,1.0,0.9473684210526315,0.8944271909999159,0.03594779968261719,0.8944271909999159
189,7,AdaBoost (Real),2,1.0,0.9473684210526315,0.8944271909999159,0.042424917221069336,0.8944271909999159
190,7,Logistic Regression (Penalty = L2),2,1.0,0.8947368421052632,0.7745966692414834,0.0344080924987793,0.7745966692414834
191,7,Naive Bayes,2,1.0,0.8947368421052632,0.7745966692414834,0.03506755828857422,0.7745966692414834
192,8,KNeighbors Classifier,0,1.0,0.8571428571428571,0.7071067811865476,0.03170180320739746,0.7071067811865476
193,8,SVC Classifier,0,1.0,0.7142857142857143,1.0,0.002237558364868164,0.0
194,8,Decision Tree,0,1.0,0.9047619047619048,0.8819171036881969,0.0010178089141845703,0.8819171036881969
195,8,RandomForest,0,1.0,0.9523809523809523,0.9128709291752769,0.23574018478393555,0.9128709291752769
196,8,AdaBoost (Discrete),0,1.0,0.9523809523809523,0.9128709291752769,0.06968116760253906,0.9128709291752769
197,8,AdaBoost (Real),0,1.0,0.9523809523809523,0.9128709291752769,0.040773630142211914,0.9128709291752769
198,8,Logistic Regression (Penalty = L2),0,1.0,1.0,1.0,0.001947641372680664,1.0
199,8,Naive Bayes,0,1.0,0.9523809523809523,0.9128709291752769,0.03458094596862793,0.9128709291752769
200,8,KNeighbors Classifier,1,1.0,0.8095238095238095,0.6831300510639732,0.03475475311279297,0.6831300510639732
201,8,SVC Classifier,1,1.0,0.7142857142857143,1.0,0.03409528732299805,0.0
202,8,Decision Tree,1,1.0,0.9523809523809523,0.9660917830792959,0.036757707595825195,0.9660917830792959
203,8,RandomForest,1,1.0,0.9523809523809523,0.9128709291752769,0.25000882148742676,0.9128709291752769
204,8,AdaBoost (Discrete),1,1.0,0.9523809523809523,0.9660917830792959,0.037191152572631836,0.9660917830792959
205,8,AdaBoost (Real),1,1.0,0.9523809523809523,0.9660917830792959,0.036856889724731445,0.9660917830792959
206,8,Logistic Regression (Penalty = L2),1,1.0,0.9523809523809523,0.9660917830792959,0.0012700557708740234,0.9660917830792959
207,8,Naive Bayes,1,1.0,0.9523809523809523,0.9128709291752769,0.023059844970703125,0.9128709291752769
208,8,KNeighbors Classifier,2,1.0,0.7894736842105263,0.4472135954999579,0.03520488739013672,0.4472135954999579
209,8,SVC Classifier,2,1.0,0.7368421052631579,1.0,0.001737833023071289,0.0
210,8,Decision Tree,2,1.0,1.0,1.0,0.0016698837280273438,1.0
211,8,RandomForest,2,1.0,0.8947368421052632,0.7745966692414834,0.28276801109313965,0.7745966692414834
212,8,AdaBoost (Discrete),2,1.0,0.9473684210526315,0.8944271909999159,0.03662896156311035,0.8944271909999159
213,8,AdaBoost (Real),2,1.0,0.8947368421052632,0.7745966692414834,0.03604483604431152,0.7745966692414834
214,8,Logistic Regression (Penalty = L2),2,1.0,0.8947368421052632,0.7745966692414834,0.034223079681396484,0.7745966692414834
215,8,Naive Bayes,2,1.0,0.8947368421052632,0.7745966692414834,0.0028455257415771484,0.7745966692414834
216,9,KNeighbors Classifier,0,1.0,0.8571428571428571,0.7071067811865476,0.035128116607666016,0.7071067811865476
217,9,SVC Classifier,0,1.0,0.7142857142857143,1.0,0.0019757747650146484,0.0
218,9,Decision Tree,0,1.0,0.9523809523809523,0.9660917830792959,0.03020501136779785,0.9660917830792959
219,9,RandomForest,0,1.0,0.9523809523809523,0.9128709291752769,0.2605893611907959,0.9128709291752769
220,9,AdaBoost (Discrete),0,1.0,0.9523809523809523,0.9128709291752769,0.03615307807922363,0.9128709291752769
221,9,AdaBoost (Real),0,1.0,0.9523809523809523,0.9128709291752769,0.03715848922729492,0.9128709291752769
222,9,Logistic Regression (Penalty = L2),0,1.0,1.0,1.0,0.03027176856994629,1.0
223,9,Naive Bayes,0,1.0,0.9523809523809523,0.9128709291752769,0.0030002593994140625,0.9128709291752769
224,9,KNeighbors Classifier,1,1.0,0.8095238095238095,0.6831300510639732,0.034757375717163086,0.6831300510639732
225,9,SVC Classifier,1,1.0,0.7142857142857143,1.0,0.0021147727966308594,0.0
226,9,Decision Tree,1,1.0,0.8571428571428571,0.7071067811865476,0.0019042491912841797,0.7071067811865476
227,9,RandomForest,1,1.0,0.9523809523809523,0.9128709291752769,0.22373485565185547,0.9128709291752769
228,9,AdaBoost (Discrete),1,1.0,0.9523809523809523,0.9660917830792959,0.03701305389404297,0.9660917830792959
229,9,AdaBoost (Real),1,1.0,0.9523809523809523,0.9660917830792959,0.04058408737182617,0.9660917830792959
230,9,Logistic Regression (Penalty = L2),1,1.0,0.9523809523809523,0.9660917830792959,0.034232378005981445,0.9660917830792959
231,9,Naive Bayes,1,1.0,0.9523809523809523,0.9128709291752769,0.001962900161743164,0.9128709291752769
232,9,KNeighbors Classifier,2,1.0,0.7894736842105263,0.4472135954999579,0.035575151443481445,0.4472135954999579
233,9,SVC Classifier,2,1.0,0.7368421052631579,1.0,0.0021278858184814453,0.0
234,9,Decision Tree,2,1.0,0.8947368421052632,0.7745966692414834,0.03395199775695801,0.7745966692414834
235,9,RandomForest,2,1.0,0.8947368421052632,0.7745966692414834,0.28987884521484375,0.7745966692414834
236,9,AdaBoost (Discrete),2,1.0,0.9473684210526315,0.8944271909999159,0.03672528266906738,0.8944271909999159
237,9,AdaBoost (Real),2,1.0,0.9473684210526315,0.8944271909999159,0.03666067123413086,0.8944271909999159
238,9,Logistic Regression (Penalty = L2),2,1.0,0.8947368421052632,0.7745966692414834,0.03419971466064453,0.7745966692414834
239,9,Naive Bayes,2,1.0,0.8947368421052632,0.7745966692414834,0.002415895462036133,0.7745966692414834
240,10,KNeighbors Classifier,0,1.0,0.8571428571428571,0.7071067811865476,0.03520774841308594,0.7071067811865476
241,10,SVC Classifier,0,1.0,0.7142857142857143,1.0,0.0013566017150878906,0.0
242,10,Decision Tree,0,1.0,0.9523809523809523,0.9128709291752769,0.0016932487487792969,0.9128709291752769
243,10,RandomForest,0,1.0,0.9523809523809523,0.9128709291752769,0.22217774391174316,0.9128709291752769
244,10,AdaBoost (Discrete),0,1.0,0.9523809523809523,0.9128709291752769,0.03861522674560547,0.9128709291752769
245,10,AdaBoost (Real),0,1.0,0.9523809523809523,0.9128709291752769,0.03654766082763672,0.9128709291752769
246,10,Logistic Regression (Penalty = L2),0,1.0,1.0,1.0,0.034326791763305664,1.0
247,10,Naive Bayes,0,1.0,0.9523809523809523,0.9128709291752769,0.03490185737609863,0.9128709291752769
248,10,KNeighbors Classifier,1,1.0,0.8095238095238095,0.6831300510639732,0.035614967346191406,0.6831300510639732
249,10,SVC Classifier,1,1.0,0.7142857142857143,1.0,0.0017333030700683594,0.0
250,10,Decision Tree,1,1.0,0.9523809523809523,0.9660917830792959,0.03423905372619629,0.9660917830792959
251,10,RandomForest,1,1.0,0.9523809523809523,0.9128709291752769,0.284837007522583,0.9128709291752769
252,10,AdaBoost (Discrete),1,1.0,0.9523809523809523,0.9660917830792959,0.03352236747741699,0.9660917830792959
253,10,AdaBoost (Real),1,1.0,0.9523809523809523,0.9660917830792959,0.03623557090759277,0.9660917830792959
254,10,Logistic Regression (Penalty = L2),1,1.0,0.9523809523809523,0.9660917830792959,0.03410220146179199,0.9660917830792959
255,10,Naive Bayes,1,1.0,0.9523809523809523,0.9128709291752769,0.0338749885559082,0.9128709291752769
256,10,KNeighbors Classifier,2,1.0,0.7894736842105263,0.4472135954999579,0.0019080638885498047,0.4472135954999579
257,10,SVC Classifier,2,1.0,0.7368421052631579,1.0,0.0016984939575195312,0.0
258,10,Decision Tree,2,1.0,1.0,1.0,0.0010199546813964844,1.0
259,10,RandomForest,2,1.0,0.8947368421052632,0.7745966692414834,0.21682357788085938,0.7745966692414834
260,10,AdaBoost (Discrete),2,1.0,0.9473684210526315,0.8944271909999159,0.03655743598937988,0.8944271909999159
261,10,AdaBoost (Real),2,1.0,0.8947368421052632,0.7745966692414834,0.034716129302978516,0.7745966692414834
262,10,Logistic Regression (Penalty = L2),2,1.0,0.8947368421052632,0.7745966692414834,0.001348257064819336,0.7745966692414834
263,10,Naive Bayes,2,1.0,0.8947368421052632,0.7745966692414834,0.034598588943481445,0.7745966692414834
264,11,KNeighbors Classifier,0,1.0,0.8571428571428571,0.7071067811865476,0.0018856525421142578,0.7071067811865476
265,11,SVC Classifier,0,1.0,0.7142857142857143,1.0,0.033980607986450195,0.0
266,11,Decision Tree,0,1.0,0.9047619047619048,0.8819171036881969,0.0016777515411376953,0.8819171036881969
267,11,RandomForest,0,1.0,0.9523809523809523,0.9128709291752769,0.21830534934997559,0.9128709291752769
268,11,AdaBoost (Discrete),0,1.0,0.9523809523809523,0.9128709291752769,0.03595399856567383,0.9128709291752769
269,11,AdaBoost (Real),0,1.0,0.9523809523809523,0.9128709291752769,0.03648257255554199,0.9128709291752769
270,11,Logistic Regression (Penalty = L2),0,1.0,1.0,1.0,0.00136566162109375,1.0
271,11,Naive Bayes,0,1.0,0.9523809523809523,0.9128709291752769,0.03388500213623047,0.9128709291752769
272,11,KNeighbors Classifier,1,1.0,0.8095238095238095,0.6831300510639732,0.03895854949951172,0.6831300510639732
273,11,SVC Classifier,1,1.0,0.7142857142857143,1.0,0.0011153221130371094,0.0
274,11,Decision Tree,1,1.0,0.9523809523809523,0.9660917830792959,0.03364682197570801,0.9660917830792959
275,11,RandomForest,1,1.0,0.9523809523809523,0.9128709291752769,0.21790599822998047,0.9128709291752769
276,11,AdaBoost (Discrete),1,1.0,0.9523809523809523,0.9660917830792959,0.0025942325592041016,0.9660917830792959
277,11,AdaBoost (Real),1,1.0,0.9523809523809523,0.9660917830792959,0.03533506393432617,0.9660917830792959
278,11,Logistic Regression (Penalty = L2),1,1.0,0.9523809523809523,0.9660917830792959,0.034192800521850586,0.9660917830792959
279,11,Naive Bayes,1,1.0,0.9523809523809523,0.9128709291752769,0.04165172576904297,0.9128709291752769
280,11,KNeighbors Classifier,2,1.0,0.7894736842105263,0.4472135954999579,0.0019195079803466797,0.4472135954999579
281,11,SVC Classifier,2,1.0,0.7368421052631579,1.0,0.03417539596557617,0.0
282,11,Decision Tree,2,1.0,0.631578947368421,0.6210590034081188,0.0333552360534668,0.6210590034081188
283,11,RandomForest,2,1.0,0.8947368421052632,0.7745966692414834,0.14201807975769043,0.7745966692414834
284,11,AdaBoost (Discrete),2,1.0,0.9473684210526315,0.8944271909999159,0.03580164909362793,0.8944271909999159
285,11,AdaBoost (Real),2,1.0,0.9473684210526315,0.8944271909999159,0.0024771690368652344,0.8944271909999159
286,11,Logistic Regression (Penalty = L2),2,1.0,0.8947368421052632,0.7745966692414834,0.03416252136230469,0.7745966692414834
287,11,Naive Bayes,2,1.0,0.8947368421052632,0.7745966692414834,0.0015151500701904297,0.7745966692414834
288,12,KNeighbors Classifier,0,1.0,0.8571428571428571,0.7071067811865476,0.034818410873413086,0.7071067811865476
289,12,SVC Classifier,0,1.0,0.7142857142857143,1.0,0.0018191337585449219,0.0
290,12,Decision Tree,0,1.0,0.8571428571428571,0.8944271909999159,0.0018007755279541016,0.8944271909999159
291,12,RandomForest,0,1.0,0.9523809523809523,0.9128709291752769,0.23462557792663574,0.9128709291752769
292,12,AdaBoost (Discrete),0,1.0,0.9523809523809523,0.9128709291752769,0.03953742980957031,0.9128709291752769
293,12,AdaBoost (Real),0,1.0,0.9523809523809523,0.9128709291752769,0.03677058219909668,0.9128709291752769
294,12,Logistic Regression (Penalty = L2),0,1.0,1.0,1.0,0.0019845962524414062,1.0
295,12,Naive Bayes,0,1.0,0.9523809523809523,0.9128709291752769,0.038750410079956055,0.9128709291752769
296,12,KNeighbors Classifier,1,1.0,0.8095238095238095,0.6831300510639732,0.03917860984802246,0.6831300510639732
297,12,SVC Classifier,1,1.0,0.7142857142857143,1.0,0.001829385757446289,0.0
298,12,Decision Tree,1,1.0,0.9523809523809523,0.9660917830792959,0.0010042190551757812,0.9660917830792959
299,12,RandomForest,1,1.0,0.9523809523809523,0.9128709291752769,0.21450185775756836,0.9128709291752769
300,12,AdaBoost (Discrete),1,1.0,0.9523809523809523,0.9660917830792959,0.003919124603271484,0.9660917830792959
301,12,AdaBoost (Real),1,1.0,0.9523809523809523,0.9660917830792959,0.036168813705444336,0.9660917830792959
302,12,Logistic Regression (Penalty = L2),1,1.0,0.9523809523809523,0.9660917830792959,0.0019176006317138672,0.9660917830792959
303,12,Naive Bayes,1,1.0,0.9523809523809523,0.9128709291752769,0.0015208721160888672,0.9128709291752769
304,12,KNeighbors Classifier,2,1.0,0.7894736842105263,0.4472135954999579,0.03429841995239258,0.4472135954999579
305,12,SVC Classifier,2,1.0,0.7368421052631579,1.0,0.0020117759704589844,0.0
306,12,Decision Tree,2,1.0,0.7894736842105263,0.4472135954999579,0.0014464855194091797,0.4472135954999579
307,12,RandomForest,2,1.0,0.8947368421052632,0.7745966692414834,0.18268346786499023,0.7745966692414834
308,12,AdaBoost (Discrete),2,1.0,0.8947368421052632,0.7745966692414834,0.03655862808227539,0.7745966692414834
309,12,AdaBoost (Real),2,1.0,0.9473684210526315,0.8944271909999159,0.0025243759155273438,0.8944271909999159
310,12,Logistic Regression (Penalty = L2),2,1.0,0.8947368421052632,0.7745966692414834,0.0372166633605957,0.7745966692414834
311,12,Naive Bayes,2,1.0,0.8947368421052632,0.7745966692414834,0.0027205944061279297,0.7745966692414834
