,feat_set_id,classifier,fold_id,feat_th,score,geo_score,exec_t,geo_score_woz
0,0,KNeighbors Classifier,0,0.7,0.6412478336221837,0.5317673138783903,0.6492495536804199,0.0
1,0,SVC Classifier,0,0.7,0.6845753899480069,0.8129520829107402,0.816774845123291,0.0
2,0,Decision Tree,0,0.7,0.8214904679376083,0.7740960774756254,0.06663370132446289,0.0
3,0,RandomForest,0,0.7,0.7001733102253033,1.0,0.4737973213195801,0.0
4,0,AdaBoost (Discrete),0,0.7,0.7435008665511266,0.6235309029471434,32.785494327545166,0.0
5,0,AdaBoost (Real),0,0.7,0.7209705372616985,0.587723421417095,45.37653112411499,0.0
6,0,Logistic Regression (Penalty = L2),0,0.7,0.6741767764298093,0.7213751564454057,0.37871623039245605,0.0
7,0,Naive Bayes,0,0.7,0.6672443674176777,0.7914018355435688,0.08188676834106445,0.0
8,0,KNeighbors Classifier,1,0.7,0.5798611111111112,0.4289100916671341,0.7965590953826904,0.0
9,0,SVC Classifier,1,0.7,0.7274305555555556,0.7636780043269571,0.8910179138183594,0.0
10,0,Decision Tree,1,0.7,0.7361111111111112,0.5081654220711082,0.09141159057617188,0.0
11,0,RandomForest,1,0.7,0.6996527777777778,0.2148885971408009,0.6756901741027832,0.0
12,0,AdaBoost (Discrete),1,0.7,0.7864583333333334,0.3832603266531163,46.13758158683777,0.0
13,0,AdaBoost (Real),1,0.7,0.71875,0.5805247525498772,61.492953062057495,0.0
14,0,Logistic Regression (Penalty = L2),1,0.7,0.7604166666666666,0.5555347616516378,0.4452497959136963,0.0
15,0,Naive Bayes,1,0.7,0.7829861111111112,0.6820345298093242,0.16532087326049805,0.0
16,0,KNeighbors Classifier,2,0.7,0.7930434782608695,0.49624985883569067,0.8847215175628662,0.0
17,0,SVC Classifier,2,0.7,0.76,0.6431303330664584,1.0130980014801025,0.0
18,0,Decision Tree,2,0.7,0.31130434782608696,0.4260724724945246,0.0908362865447998,0.4260724724945246
19,0,RandomForest,2,0.7,0.7060869565217391,0.15309310892394862,0.6249222755432129,0.0
20,0,AdaBoost (Discrete),2,0.7,0.3582608695652174,0.4747073712281076,50.16982436180115,0.4747073712281076
21,0,AdaBoost (Real),2,0.7,0.3408695652173913,0.4810133629869482,63.12975835800171,0.4810133629869482
22,0,Logistic Regression (Penalty = L2),2,0.7,0.5878260869565217,0.4939689121928252,0.4213240146636963,0.4939689121928252
23,0,Naive Bayes,2,0.7,0.5478260869565217,0.8392974277582299,0.22559332847595215,0.0
24,1,KNeighbors Classifier,0,0.7,0.658578856152513,0.552335171587467,0.8801412582397461,0.0
25,1,SVC Classifier,0,0.7,0.6845753899480069,0.8129520829107402,1.0233180522918701,0.0
26,1,Decision Tree,0,0.7,0.7920277296360485,0.5808871316722463,0.13114643096923828,0.0
27,1,RandomForest,0,0.7,0.7001733102253033,1.0,0.8153421878814697,0.0
28,1,AdaBoost (Discrete),0,0.7,0.4904679376083189,0.45750142096989754,51.928441286087036,0.0
29,1,AdaBoost (Real),0,0.7,0.21663778162911612,0.20326950298303628,63.348198652267456,0.0
30,1,Logistic Regression (Penalty = L2),0,0.7,0.6516464471403813,0.6944685089339834,0.5035302639007568,0.0
31,1,Naive Bayes,0,0.7,0.6429809358752167,0.7508927762297288,0.0036499500274658203,0.0
32,1,KNeighbors Classifier,1,0.7,0.6215277777777778,0.43097892916169106,1.0599467754364014,0.0
33,1,SVC Classifier,1,0.7,0.7274305555555556,0.7636780043269571,1.4017448425292969,0.0
34,1,Decision Tree,1,0.7,0.8072916666666666,0.5856186690210644,0.0019123554229736328,0.0
35,1,RandomForest,1,0.7,0.7274305555555556,0.3535533905932738,0.805593729019165,0.0
36,1,AdaBoost (Discrete),1,0.7,0.6440972222222222,0.5101775486431266,54.0375816822052,0.0
37,1,AdaBoost (Real),1,0.7,0.2899305555555556,0.22308872230831,67.72633790969849,0.0
38,1,Logistic Regression (Penalty = L2),1,0.7,0.7447916666666666,0.49525552075780965,0.6049962043762207,0.0
39,1,Naive Bayes,1,0.7,0.7795138888888888,0.6540502707279278,0.2538325786590576,0.0
40,1,KNeighbors Classifier,2,0.7,0.782608695652174,0.4320421363976603,1.17567777633667,0.0
41,1,SVC Classifier,2,0.7,0.7634782608695653,0.7035061518616564,1.4409797191619873,0.0
42,1,Decision Tree,2,0.7,0.1408695652173913,0.24825980438339046,0.0017936229705810547,0.0
43,1,RandomForest,2,0.7,0.7095652173913043,0.8929664868390964,0.9097445011138916,0.0
44,1,AdaBoost (Discrete),2,0.7,0.08695652173913043,0.16101465871056037,63.44930076599121,0.0
45,1,AdaBoost (Real),2,0.7,0.23304347826086957,0.33457799075757366,73.60371541976929,0.0
46,1,Logistic Regression (Penalty = L2),2,0.7,0.6313043478260869,0.4258096637678546,0.5059206485748291,0.4258096637678546
47,1,Naive Bayes,2,0.7,0.528695652173913,0.7234770261807716,0.12889790534973145,0.0
48,2,KNeighbors Classifier,0,0.7,0.6568457538994801,0.635797814864237,2.0677475929260254,0.0
49,2,SVC Classifier,0,0.7,0.6845753899480069,0.8129520829107402,1.828735113143921,0.0
50,2,Decision Tree,0,0.7,0.6325823223570191,0.4524081805497754,0.002138853073120117,0.4524081805497754
51,2,RandomForest,0,0.7,0.7001733102253033,1.0,0.8880155086517334,0.0
52,2,AdaBoost (Discrete),0,0.7,0.7521663778162911,0.6944144468157013,60.33385181427002,0.0
53,2,AdaBoost (Real),0,0.7,0.7383015597920277,0.6306125149226676,67.97119474411011,0.0
54,2,Logistic Regression (Penalty = L2),0,0.7,0.6863084922010398,0.7210131717325844,0.5273334980010986,0.0
55,2,Naive Bayes,0,0.7,0.6672443674176777,0.7914018355435688,0.11806011199951172,0.0
56,2,KNeighbors Classifier,1,0.7,0.6961805555555556,0.3630128918050201,1.7593555450439453,0.0
57,2,SVC Classifier,1,0.7,0.7274305555555556,0.7636780043269571,1.631441593170166,0.0
58,2,Decision Tree,1,0.7,0.4965277777777778,0.566234312864157,0.11537337303161621,0.0
59,2,RandomForest,1,0.7,0.6996527777777778,1.0,0.9658651351928711,0.0
60,2,AdaBoost (Discrete),1,0.7,0.7517361111111112,0.43129654708987847,56.279836654663086,0.0
61,2,AdaBoost (Real),1,0.7,0.7569444444444444,0.5746095133749713,62.46466541290283,0.0
62,2,Logistic Regression (Penalty = L2),1,0.7,0.7482638888888888,0.6268843050507011,0.48723459243774414,0.0
63,2,Naive Bayes,1,0.7,0.7829861111111112,0.6820345298093242,0.26632189750671387,0.0
64,2,KNeighbors Classifier,2,0.7,0.8330434782608696,0.7552608308349611,1.7374203205108643,0.7552608308349611
65,2,SVC Classifier,2,0.7,0.7356521739130435,0.6012871326420459,1.543062686920166,0.0
66,2,Decision Tree,2,0.7,0.5930434782608696,0.48551328267446486,0.003412008285522461,0.48551328267446486
67,2,RandomForest,2,0.7,0.7008695652173913,1.0,0.9381279945373535,0.0
68,2,AdaBoost (Discrete),2,0.7,0.36,0.49713216183188524,59.97517919540405,0.49713216183188524
69,2,AdaBoost (Real),2,0.7,0.5095652173913043,0.5866533413844934,77.1823456287384,0.5866533413844934
70,2,Logistic Regression (Penalty = L2),2,0.7,0.6052173913043478,0.52602626583304,0.6577482223510742,0.52602626583304
71,2,Naive Bayes,2,0.7,0.5478260869565217,0.8392974277582299,0.2382349967956543,0.0
72,3,KNeighbors Classifier,0,0.7,0.658578856152513,0.552335171587467,1.1245145797729492,0.0
73,3,SVC Classifier,0,0.7,0.6845753899480069,0.8129520829107402,1.2396340370178223,0.0
74,3,Decision Tree,0,0.7,0.7469670710571924,0.5549932755426551,0.0026297569274902344,0.0
75,3,RandomForest,0,0.7,0.7001733102253033,1.0,0.9964594841003418,0.0
76,3,AdaBoost (Discrete),0,0.7,0.4904679376083189,0.45750142096989754,61.124515771865845,0.0
77,3,AdaBoost (Real),0,0.7,0.21663778162911612,0.20326950298303628,79.20473384857178,0.0
78,3,Logistic Regression (Penalty = L2),0,0.7,0.6516464471403813,0.6944685089339834,0.5317502021789551,0.0
79,3,Naive Bayes,0,0.7,0.6429809358752167,0.7508927762297288,0.003354787826538086,0.0
80,3,KNeighbors Classifier,1,0.7,0.6215277777777778,0.43097892916169106,1.182481288909912,0.0
81,3,SVC Classifier,1,0.7,0.7274305555555556,0.7636780043269571,1.3241469860076904,0.0
82,3,Decision Tree,1,0.7,0.7291666666666666,0.5349592568159914,0.14255690574645996,0.0
83,3,RandomForest,1,0.7,0.7274305555555556,0.3535533905932738,1.050950288772583,0.0
84,3,AdaBoost (Discrete),1,0.7,0.6440972222222222,0.5101775486431266,61.83590912818909,0.0
85,3,AdaBoost (Real),1,0.7,0.3298611111111111,0.34531318843910114,73.8812026977539,0.0
86,3,Logistic Regression (Penalty = L2),1,0.7,0.7447916666666666,0.49525552075780965,0.5828835964202881,0.0
87,3,Naive Bayes,1,0.7,0.7795138888888888,0.6540502707279278,0.13581323623657227,0.0
88,3,KNeighbors Classifier,2,0.7,0.782608695652174,0.4320421363976603,1.3654911518096924,0.0
89,3,SVC Classifier,2,0.7,0.7634782608695653,0.7035061518616564,1.4230856895446777,0.0
90,3,Decision Tree,2,0.7,0.31478260869565217,0.37921875370735264,0.14230823516845703,0.0
91,3,RandomForest,2,0.7,0.7095652173913043,0.8929664868390964,0.8017725944519043,0.0
92,3,AdaBoost (Discrete),2,0.7,0.09043478260869565,0.1380303539944552,62.924301862716675,0.1380303539944552
93,3,AdaBoost (Real),2,0.7,0.20521739130434782,0.2499212008930899,74.44905090332031,0.0
94,3,Logistic Regression (Penalty = L2),2,0.7,0.6313043478260869,0.4258096637678546,0.5240223407745361,0.4258096637678546
95,3,Naive Bayes,2,0.7,0.528695652173913,0.7234770261807716,0.1283280849456787,0.0
96,4,KNeighbors Classifier,0,0.7,0.6412478336221837,0.5317673138783903,1.3419315814971924,0.0
97,4,SVC Classifier,0,0.7,0.6845753899480069,0.8129520829107402,1.5806307792663574,0.0
98,4,Decision Tree,0,0.7,0.561525129982669,0.3759352592605304,0.12722229957580566,0.0
99,4,RandomForest,0,0.7,0.7001733102253033,1.0,0.896226167678833,0.0
100,4,AdaBoost (Discrete),0,0.7,0.7435008665511266,0.6296561947166893,63.5162935256958,0.0
101,4,AdaBoost (Real),0,0.7,0.7209705372616985,0.587723421417095,75.27432012557983,0.0
102,4,Logistic Regression (Penalty = L2),0,0.7,0.6741767764298093,0.7213751564454057,0.7976982593536377,0.0
103,4,Naive Bayes,0,0.7,0.6672443674176777,0.7914018355435688,0.13367319107055664,0.0
104,4,KNeighbors Classifier,1,0.7,0.5798611111111112,0.4289100916671341,1.602229118347168,0.0
105,4,SVC Classifier,1,0.7,0.7274305555555556,0.7636780043269571,2.028045177459717,0.0
106,4,Decision Tree,1,0.7,0.5746527777777778,0.5653424477519801,0.15909767150878906,0.0
107,4,RandomForest,1,0.7,0.6996527777777778,0.2148885971408009,1.2692108154296875,0.0
108,4,AdaBoost (Discrete),1,0.7,0.7864583333333334,0.3832603266531163,71.17225790023804,0.0
109,4,AdaBoost (Real),1,0.7,0.7326388888888888,0.5853376125985652,80.08537292480469,0.0
110,4,Logistic Regression (Penalty = L2),1,0.7,0.7604166666666666,0.5555347616516378,0.6782212257385254,0.0
111,4,Naive Bayes,1,0.7,0.7829861111111112,0.6820345298093242,0.1759195327758789,0.0
112,4,KNeighbors Classifier,2,0.7,0.7930434782608695,0.49624985883569067,2.0677077770233154,0.0
113,4,SVC Classifier,2,0.7,0.76,0.6431303330664584,2.065431594848633,0.0
114,4,Decision Tree,2,0.7,0.7982608695652174,0.6076871903630404,0.20832109451293945,0.6076871903630404
115,4,RandomForest,2,0.7,0.7060869565217391,0.15309310892394862,1.7252197265625,0.0
116,4,AdaBoost (Discrete),2,0.7,0.3582608695652174,0.4782634801856082,60.94315004348755,0.4782634801856082
117,4,AdaBoost (Real),2,0.7,0.24521739130434783,0.3651269580627894,72.48266196250916,0.0
118,4,Logistic Regression (Penalty = L2),2,0.7,0.5878260869565217,0.4939689121928252,0.817476749420166,0.4939689121928252
119,4,Naive Bayes,2,0.7,0.5478260869565217,0.8392974277582299,0.17681121826171875,0.0
120,5,KNeighbors Classifier,0,0.7,0.658578856152513,0.552335171587467,1.387514352798462,0.0
121,5,SVC Classifier,0,0.7,0.6845753899480069,0.8129520829107402,1.5076439380645752,0.0
122,5,Decision Tree,0,0.7,0.6776429809358753,0.6270894664693659,0.1817007064819336,0.0
123,5,RandomForest,0,0.7,0.7001733102253033,1.0,1.0851209163665771,0.0
124,5,AdaBoost (Discrete),0,0.7,0.4904679376083189,0.45750142096989754,60.54355311393738,0.0
125,5,AdaBoost (Real),0,0.7,0.21663778162911612,0.20326950298303628,78.61049437522888,0.0
126,5,Logistic Regression (Penalty = L2),0,0.7,0.6516464471403813,0.6944685089339834,0.5055837631225586,0.0
127,5,Naive Bayes,0,0.7,0.6429809358752167,0.7508927762297288,0.11341691017150879,0.0
128,5,KNeighbors Classifier,1,0.7,0.6215277777777778,0.43097892916169106,1.098123550415039,0.0
129,5,SVC Classifier,1,0.7,0.7274305555555556,0.7636780043269571,1.148432731628418,0.0
130,5,Decision Tree,1,0.7,0.7552083333333334,0.5931983780386013,0.10660123825073242,0.0
131,5,RandomForest,1,0.7,0.7274305555555556,0.3535533905932738,0.654909610748291,0.0
132,5,AdaBoost (Discrete),1,0.7,0.6440972222222222,0.5101775486431266,52.231977224349976,0.0
133,5,AdaBoost (Real),1,0.7,0.3420138888888889,0.37204739509376417,65.3549211025238,0.0
134,5,Logistic Regression (Penalty = L2),1,0.7,0.7447916666666666,0.49525552075780965,0.44755029678344727,0.0
135,5,Naive Bayes,1,0.7,0.7795138888888888,0.6540502707279278,0.11758208274841309,0.0
136,5,KNeighbors Classifier,2,0.7,0.782608695652174,0.4320421363976603,1.1964313983917236,0.0
137,5,SVC Classifier,2,0.7,0.7634782608695653,0.7035061518616564,1.3016235828399658,0.0
138,5,Decision Tree,2,0.7,0.2539130434782609,0.293436068731143,0.11497378349304199,0.0
139,5,RandomForest,2,0.7,0.7095652173913043,0.8929664868390964,0.7934794425964355,0.0
140,5,AdaBoost (Discrete),2,0.7,0.10260869565217391,0.20103780333047128,51.253270626068115,0.20103780333047128
141,5,AdaBoost (Real),2,0.7,0.23304347826086957,0.33457799075757366,65.06566214561462,0.0
142,5,Logistic Regression (Penalty = L2),2,0.7,0.6313043478260869,0.4258096637678546,0.5529813766479492,0.4258096637678546
143,5,Naive Bayes,2,0.7,0.528695652173913,0.7234770261807716,0.11314678192138672,0.0
144,6,KNeighbors Classifier,0,0.7,0.6412478336221837,0.5317673138783903,1.1233844757080078,0.0
145,6,SVC Classifier,0,0.7,0.6845753899480069,0.8129520829107402,1.1168639659881592,0.0
146,6,Decision Tree,0,0.7,0.6551126516464472,0.5450478540052814,0.15451717376708984,0.0
147,6,RandomForest,0,0.7,0.7001733102253033,1.0,0.9147679805755615,0.0
148,6,AdaBoost (Discrete),0,0.7,0.7504332755632582,0.626070771729737,53.48654627799988,0.0
149,6,AdaBoost (Real),0,0.7,0.707105719237435,0.582920563852312,68.31531858444214,0.0
150,6,Logistic Regression (Penalty = L2),0,0.7,0.6741767764298093,0.7213751564454057,0.48415374755859375,0.0
151,6,Naive Bayes,0,0.7,0.6672443674176777,0.7914018355435688,0.12161445617675781,0.0
152,6,KNeighbors Classifier,1,0.7,0.5798611111111112,0.4289100916671341,1.3197541236877441,0.0
153,6,SVC Classifier,1,0.7,0.7274305555555556,0.7636780043269571,1.4503233432769775,0.0
154,6,Decision Tree,1,0.7,0.8177083333333334,0.497814496553105,0.11927986145019531,0.497814496553105
155,6,RandomForest,1,0.7,0.6996527777777778,0.2148885971408009,0.8625285625457764,0.0
156,6,AdaBoost (Discrete),1,0.7,0.7864583333333334,0.3832603266531163,57.16786766052246,0.0
157,6,AdaBoost (Real),1,0.7,0.7482638888888888,0.5923248091740977,67.2402069568634,0.0
158,6,Logistic Regression (Penalty = L2),1,0.7,0.7604166666666666,0.5555347616516378,0.4826197624206543,0.0
159,6,Naive Bayes,1,0.7,0.7829861111111112,0.6820345298093242,0.11740732192993164,0.0
160,6,KNeighbors Classifier,2,0.7,0.7930434782608695,0.49624985883569067,1.0567398071289062,0.0
161,6,SVC Classifier,2,0.7,0.76,0.6431303330664584,1.351914405822754,0.0
162,6,Decision Tree,2,0.7,0.7391304347826086,0.3897623758597691,0.002206563949584961,0.3897623758597691
163,6,RandomForest,2,0.7,0.7060869565217391,0.15309310892394862,0.8170261383056641,0.0
164,6,AdaBoost (Discrete),2,0.7,0.3652173913043478,0.4815965283693067,54.446303367614746,0.4815965283693067
165,6,AdaBoost (Real),2,0.7,0.3391304347826087,0.46871943077262584,71.14225602149963,0.46871943077262584
166,6,Logistic Regression (Penalty = L2),2,0.7,0.5878260869565217,0.4939689121928252,0.5406131744384766,0.4939689121928252
167,6,Naive Bayes,2,0.7,0.5478260869565217,0.8392974277582299,0.1451575756072998,0.0
168,7,KNeighbors Classifier,0,0.7,0.6568457538994801,0.635797814864237,2.211458444595337,0.0
169,7,SVC Classifier,0,0.7,0.6845753899480069,0.8129520829107402,1.8795053958892822,0.0
170,7,Decision Tree,0,0.7,0.6880415944540728,0.42779935882138503,0.12672734260559082,0.42779935882138503
171,7,RandomForest,0,0.7,0.7001733102253033,1.0,1.0126640796661377,0.0
172,7,AdaBoost (Discrete),0,0.7,0.7521663778162911,0.6944144468157013,71.73338866233826,0.0
173,7,AdaBoost (Real),0,0.7,0.733102253032929,0.6227431354364964,72.7516176700592,0.0
174,7,Logistic Regression (Penalty = L2),0,0.7,0.6863084922010398,0.7210131717325844,0.7490983009338379,0.0
175,7,Naive Bayes,0,0.7,0.6672443674176777,0.7914018355435688,0.15984511375427246,0.0
176,7,KNeighbors Classifier,1,0.7,0.6961805555555556,0.3630128918050201,1.8877480030059814,0.0
177,7,SVC Classifier,1,0.7,0.7274305555555556,0.7636780043269571,2.0274393558502197,0.0
178,7,Decision Tree,1,0.7,0.8107638888888888,0.5283713398002663,0.15162372589111328,0.0
179,7,RandomForest,1,0.7,0.6996527777777778,1.0,1.262251853942871,0.0
180,7,AdaBoost (Discrete),1,0.7,0.7482638888888888,0.43045169370794734,69.9198169708252,0.0
181,7,AdaBoost (Real),1,0.7,0.7708333333333334,0.5895609442641179,80.78340482711792,0.0
182,7,Logistic Regression (Penalty = L2),1,0.7,0.7482638888888888,0.6268843050507011,0.5286612510681152,0.0
183,7,Naive Bayes,1,0.7,0.7829861111111112,0.6820345298093242,0.15270328521728516,0.0
184,7,KNeighbors Classifier,2,0.7,0.8330434782608696,0.7552608308349611,2.258784770965576,0.7552608308349611
185,7,SVC Classifier,2,0.7,0.7356521739130435,0.6012871326420459,1.6248934268951416,0.0
186,7,Decision Tree,2,0.7,0.5165217391304348,0.49007057220672723,0.16681480407714844,0.0
187,7,RandomForest,2,0.7,0.7008695652173913,1.0,1.0558159351348877,0.0
188,7,AdaBoost (Discrete),2,0.7,0.3652173913043478,0.49979308913426346,70.75320935249329,0.49979308913426346
189,7,AdaBoost (Real),2,0.7,0.5704347826086956,0.5929134378210238,81.30381536483765,0.5929134378210238
190,7,Logistic Regression (Penalty = L2),2,0.7,0.6052173913043478,0.52602626583304,0.8006539344787598,0.52602626583304
191,7,Naive Bayes,2,0.7,0.5478260869565217,0.8392974277582299,0.1488182544708252,0.0
192,8,KNeighbors Classifier,0,0.7,0.658578856152513,0.552335171587467,1.17997145652771,0.0
193,8,SVC Classifier,0,0.7,0.6845753899480069,0.8129520829107402,1.3125348091125488,0.0
194,8,Decision Tree,0,0.7,0.6637781629116117,0.4771452251099374,0.002674102783203125,0.0
195,8,RandomForest,0,0.7,0.7001733102253033,1.0,1.0351252555847168,0.0
196,8,AdaBoost (Discrete),0,0.7,0.4904679376083189,0.45750142096989754,63.69733166694641,0.0
197,8,AdaBoost (Real),0,0.7,0.21663778162911612,0.20326950298303628,77.21736192703247,0.0
198,8,Logistic Regression (Penalty = L2),0,0.7,0.6516464471403813,0.6944685089339834,0.5123889446258545,0.0
199,8,Naive Bayes,0,0.7,0.6429809358752167,0.7508927762297288,0.14474749565124512,0.0
200,8,KNeighbors Classifier,1,0.7,0.6215277777777778,0.43097892916169106,1.2472035884857178,0.0
201,8,SVC Classifier,1,0.7,0.7274305555555556,0.7636780043269571,1.3843164443969727,0.0
202,8,Decision Tree,1,0.7,0.7430555555555556,0.6288022967536441,0.13993358612060547,0.0
203,8,RandomForest,1,0.7,0.7274305555555556,0.3535533905932738,1.1322596073150635,0.0
204,8,AdaBoost (Discrete),1,0.7,0.6440972222222222,0.5101775486431266,60.534568071365356,0.0
205,8,AdaBoost (Real),1,0.7,0.3107638888888889,0.32942981830672063,70.71827006340027,0.0
206,8,Logistic Regression (Penalty = L2),1,0.7,0.7447916666666666,0.49525552075780965,0.4029831886291504,0.0
207,8,Naive Bayes,1,0.7,0.7795138888888888,0.6540502707279278,0.1253969669342041,0.0
208,8,KNeighbors Classifier,2,0.7,0.782608695652174,0.4320421363976603,1.0596721172332764,0.0
209,8,SVC Classifier,2,0.7,0.7634782608695653,0.7035061518616564,1.4268684387207031,0.0
210,8,Decision Tree,2,0.7,0.6991304347826087,0.3290958079893583,0.1310436725616455,0.3290958079893583
211,8,RandomForest,2,0.7,0.7095652173913043,0.8929664868390964,0.8542261123657227,0.0
212,8,AdaBoost (Discrete),2,0.7,0.13043478260869565,0.26327401764968944,72.65574216842651,0.26327401764968944
213,8,AdaBoost (Real),2,0.7,0.23304347826086957,0.33457799075757366,79.35228109359741,0.0
214,8,Logistic Regression (Penalty = L2),2,0.7,0.6313043478260869,0.4258096637678546,0.2525515556335449,0.4258096637678546
215,8,Naive Bayes,2,0.7,0.528695652173913,0.7234770261807716,0.12163710594177246,0.0
