,feat_set_id,classifier,fold_id,feat_th,score,geo_score,exec_t,geo_score_woz
0,0,KNeighbors Classifier,0,0.3,0.7547961630695443,0.7524653198575568,3.077684164047241,0.7524653198575568
1,0,SVC Classifier,0,0.3,0.7721822541966427,0.7363583374669482,14.288472890853882,0.7363583374669482
2,0,Decision Tree,0,0.3,0.7134292565947242,0.7111501097744894,0.443406343460083,0.7111501097744894
3,0,RandomForest,0,0.3,0.736810551558753,0.712211315402784,1.4869732856750488,0.712211315402784
4,0,AdaBoost (Discrete),0,0.3,0.7266187050359713,0.7155989566735315,159.62197256088257,0.7155989566735315
5,0,AdaBoost (Real),0,0.3,0.7314148681055156,0.7238413326789686,203.25703811645508,0.7238413326789686
6,0,Logistic Regression (Penalty = L2),0,0.3,0.8099520383693045,0.807671590962336,0.9784777164459229,0.807671590962336
7,0,Naive Bayes,0,0.3,0.7517985611510791,0.7013914970032498,0.1298844814300537,0.7013914970032498
8,0,KNeighbors Classifier,1,0.3,0.7533013205282113,0.7521531326910471,2.606954574584961,0.7521531326910471
9,0,SVC Classifier,1,0.3,0.7653061224489796,0.7294418197085748,12.234869241714478,0.7294418197085748
10,0,Decision Tree,1,0.3,0.6908763505402161,0.6901523751888236,0.40414857864379883,0.6901523751888236
11,0,RandomForest,1,0.3,0.7262905162064826,0.6912812756797104,1.2850704193115234,0.6912812756797104
12,0,AdaBoost (Discrete),1,0.3,0.737094837935174,0.735650363823871,155.78037929534912,0.735650363823871
13,0,AdaBoost (Real),1,0.3,0.7310924369747899,0.7291271230953275,187.0633738040924,0.7291271230953275
14,0,Logistic Regression (Penalty = L2),1,0.3,0.7887154861944778,0.7864880928643394,1.1789636611938477,0.7864880928643394
15,0,Naive Bayes,1,0.3,0.7533013205282113,0.708296908487096,0.26695871353149414,0.708296908487096
16,0,KNeighbors Classifier,2,0.3,0.7563025210084033,0.7535125523327119,2.8771584033966064,0.7535125523327119
17,0,SVC Classifier,2,0.3,0.7677070828331333,0.7269120913812991,13.616571187973022,0.7269120913812991
18,0,Decision Tree,2,0.3,0.7040816326530612,0.70255541858115,0.4325082302093506,0.70255541858115
19,0,RandomForest,2,0.3,0.7166866746698679,0.6793086181743532,1.259934663772583,0.6793086181743532
20,0,AdaBoost (Discrete),2,0.3,0.7539015606242497,0.7532708496452852,159.45433712005615,0.7532708496452852
21,0,AdaBoost (Real),2,0.3,0.765906362545018,0.7659456545558591,178.0920283794403,0.7659456545558591
22,0,Logistic Regression (Penalty = L2),2,0.3,0.8115246098439376,0.8081738545537015,0.7223639488220215,0.8081738545537015
23,0,Naive Bayes,2,0.3,0.7533013205282113,0.6991866835579018,0.2470846176147461,0.6991866835579018
24,1,KNeighbors Classifier,0,0.3,0.776378896882494,0.7740707287141292,2.86103892326355,0.7740707287141292
25,1,SVC Classifier,0,0.3,0.802158273381295,0.7936299699511085,12.485009670257568,0.7936299699511085
26,1,Decision Tree,0,0.3,0.738009592326139,0.7356848047990913,0.2530200481414795,0.7356848047990913
27,1,RandomForest,0,0.3,0.7535971223021583,0.7408710091252323,1.5760776996612549,0.7408710091252323
28,1,AdaBoost (Discrete),0,0.3,0.7643884892086331,0.7635398971461448,137.68727707862854,0.7635398971461448
29,1,AdaBoost (Real),0,0.3,0.7511990407673861,0.7470721205789781,167.08234405517578,0.7470721205789781
30,1,Logistic Regression (Penalty = L2),0,0.3,0.8123501199040767,0.811054364470367,0.9081473350524902,0.811054364470367
31,1,Naive Bayes,0,0.3,0.7949640287769785,0.7857080890461955,0.13790583610534668,0.7857080890461955
32,1,KNeighbors Classifier,1,0.3,0.7581032412965186,0.7559872542616486,2.8462679386138916,0.7559872542616486
33,1,SVC Classifier,1,0.3,0.7863145258103241,0.7741391622282519,13.742426633834839,0.7741391622282519
34,1,Decision Tree,1,0.3,0.709483793517407,0.7086331265095734,0.4117472171783447,0.7086331265095734
35,1,RandomForest,1,0.3,0.7376950780312125,0.7253679505173801,1.4975073337554932,0.7253679505173801
36,1,AdaBoost (Discrete),1,0.3,0.7190876350540216,0.7185415230121902,148.5597746372223,0.7185415230121902
37,1,AdaBoost (Real),1,0.3,0.7328931572629052,0.7291438871153294,171.27890467643738,0.7291438871153294
38,1,Logistic Regression (Penalty = L2),1,0.3,0.8061224489795918,0.8044457166910834,0.7567613124847412,0.8044457166910834
39,1,Naive Bayes,1,0.3,0.7779111644657863,0.7667103095420659,0.28083348274230957,0.7667103095420659
40,1,KNeighbors Classifier,2,0.3,0.7671068427370948,0.7657779081143449,3.3142597675323486,0.7657779081143449
41,1,SVC Classifier,2,0.3,0.7899159663865546,0.7762906905140406,14.839076519012451,0.7762906905140406
42,1,Decision Tree,2,0.3,0.7154861944777912,0.7139480104783581,0.45153379440307617,0.7139480104783581
43,1,RandomForest,2,0.3,0.7286914765906363,0.71164595773851,1.8628089427947998,0.71164595773851
44,1,AdaBoost (Discrete),2,0.3,0.751500600240096,0.7506232163031912,178.59567308425903,0.7506232163031912
45,1,AdaBoost (Real),2,0.3,0.7617046818727491,0.7601880890656394,195.34118390083313,0.7601880890656394
46,1,Logistic Regression (Penalty = L2),2,0.3,0.8097238895558223,0.8075220714859946,0.9391117095947266,0.8075220714859946
47,1,Naive Bayes,2,0.3,0.7713085234093637,0.7580225851677613,0.16926336288452148,0.7580225851677613
48,2,KNeighbors Classifier,0,0.3,0.7583932853717026,0.7576529846462691,3.32177996635437,0.7576529846462691
49,2,SVC Classifier,0,0.3,0.7955635491606715,0.7903374037199327,12.216413974761963,0.7903374037199327
50,2,Decision Tree,0,0.3,0.7128297362110312,0.7123632742587124,0.3878176212310791,0.7123632742587124
51,2,RandomForest,0,0.3,0.7721822541966427,0.768190379120954,1.4833335876464844,0.768190379120954
52,2,AdaBoost (Discrete),0,0.3,0.7314148681055156,0.7310854824378348,143.3015067577362,0.7310854824378348
53,2,AdaBoost (Real),0,0.3,0.7535971223021583,0.7524155705327269,188.49740862846375,0.7524155705327269
54,2,Logistic Regression (Penalty = L2),0,0.3,0.7997601918465228,0.7991310535267999,0.839503288269043,0.7991310535267999
55,2,Naive Bayes,0,0.3,0.7871702637889688,0.782451988058746,0.15291976928710938,0.782451988058746
56,2,KNeighbors Classifier,1,0.3,0.7454981992797118,0.7443694540373885,3.278087615966797,0.7443694540373885
57,2,SVC Classifier,1,0.3,0.7917166866746699,0.784798230654928,16.812808752059937,0.784798230654928
58,2,Decision Tree,1,0.3,0.7022809123649459,0.7019634572746613,0.3261432647705078,0.7019634572746613
59,2,RandomForest,1,0.3,0.7503001200480192,0.7477183793542483,1.805804967880249,0.7477183793542483
60,2,AdaBoost (Discrete),1,0.3,0.7220888355342137,0.7219238215283045,157.58981108665466,0.7219238215283045
61,2,AdaBoost (Real),1,0.3,0.7304921968787516,0.729636269179122,164.73454570770264,0.729636269179122
62,2,Logistic Regression (Penalty = L2),1,0.3,0.8025210084033614,0.8016673467342066,0.5757017135620117,0.8016673467342066
63,2,Naive Bayes,1,0.3,0.7827130852340937,0.7780675448583237,0.11678814888000488,0.7780675448583237
64,2,KNeighbors Classifier,2,0.3,0.7406962785114045,0.73922574916126,2.119673013687134,0.73922574916126
65,2,SVC Classifier,2,0.3,0.7917166866746699,0.7840309891790334,10.305274724960327,0.7840309891790334
66,2,Decision Tree,2,0.3,0.6992797118847539,0.6983278922836237,0.33577990531921387,0.6983278922836237
67,2,RandomForest,2,0.3,0.7569027611044418,0.7531888028548434,1.234872817993164,0.7531888028548434
68,2,AdaBoost (Discrete),2,0.3,0.7382953181272509,0.73648892973142,114.1741852760315,0.73648892973142
69,2,AdaBoost (Real),2,0.3,0.741296518607443,0.7406707696509658,142.92255759239197,0.7406707696509658
70,2,Logistic Regression (Penalty = L2),2,0.3,0.8079231692677071,0.8066511599333706,0.6309854984283447,0.8066511599333706
71,2,Naive Bayes,2,0.3,0.790516206482593,0.7850081176709479,0.2348775863647461,0.7850081176709479
72,3,KNeighbors Classifier,0,0.3,0.7230215827338129,0.7210624716023518,0.6972842216491699,0.7210624716023518
73,3,SVC Classifier,0,0.3,0.7440047961630696,0.7255544717047341,9.679780960083008,0.7255544717047341
74,3,Decision Tree,0,0.3,0.6792565947242206,0.6785418676690174,0.23409318923950195,0.6785418676690174
75,3,RandomForest,0,0.3,0.7356115107913669,0.7189478735747709,1.186269998550415,0.7189478735747709
76,3,AdaBoost (Discrete),0,0.3,0.6163069544364509,0.6012243656984599,99.64465713500977,0.6012243656984599
77,3,AdaBoost (Real),0,0.3,0.6678657074340527,0.6652060785920977,125.15740537643433,0.6652060785920977
78,3,Logistic Regression (Penalty = L2),0,0.3,0.7685851318944844,0.7658888686424914,0.48787975311279297,0.7658888686424914
79,3,Naive Bayes,0,0.3,0.7547961630695443,0.7425068700010393,0.262021541595459,0.7425068700010393
80,3,KNeighbors Classifier,1,0.3,0.7022809123649459,0.6996344597927143,0.6582446098327637,0.6996344597927143
81,3,SVC Classifier,1,0.3,0.7220888355342137,0.6981717028413909,10.515652894973755,0.6981717028413909
82,3,Decision Tree,1,0.3,0.6710684273709484,0.6706090419118356,0.26862049102783203,0.6706090419118356
83,3,RandomForest,1,0.3,0.7172869147659063,0.7066068971321836,1.446018934249878,0.7066068971321836
84,3,AdaBoost (Discrete),1,0.3,0.6266506602641057,0.6172563993485743,99.16821551322937,0.6172563993485743
85,3,AdaBoost (Real),1,0.3,0.6224489795918368,0.6123305794626573,117.25422549247742,0.6123305794626573
86,3,Logistic Regression (Penalty = L2),1,0.3,0.7466986794717887,0.7434522878704497,0.6507899761199951,0.7434522878704497
87,3,Naive Bayes,1,0.3,0.7322929171668667,0.7181466028858726,0.12469100952148438,0.7181466028858726
88,3,KNeighbors Classifier,2,0.3,0.712484993997599,0.7080151649420944,0.717193603515625,0.7080151649420944
89,3,SVC Classifier,2,0.3,0.7244897959183674,0.7010353588123069,9.645004510879517,0.7010353588123069
90,3,Decision Tree,2,0.3,0.6584633853541416,0.6568073163999999,0.3660409450531006,0.6568073163999999
91,3,RandomForest,2,0.3,0.7016806722689075,0.6853770809323352,1.3032584190368652,0.6853770809323352
92,3,AdaBoost (Discrete),2,0.3,0.6320528211284514,0.6111340490874895,92.95732259750366,0.6111340490874895
93,3,AdaBoost (Real),2,0.3,0.6470588235294118,0.6312424265902891,124.92032551765442,0.6312424265902891
94,3,Logistic Regression (Penalty = L2),2,0.3,0.7611044417767107,0.7545151604810291,0.7786180973052979,0.7545151604810291
95,3,Naive Bayes,2,0.3,0.7328931572629052,0.7160981972688271,0.12613487243652344,0.7160981972688271
96,4,KNeighbors Classifier,0,0.3,0.6918465227817746,0.6894958028380924,0.6122260093688965,0.6894958028380924
97,4,SVC Classifier,0,0.3,0.7086330935251799,0.6851770549568924,10.072893142700195,0.6851770549568924
98,4,Decision Tree,0,0.3,0.6378896882494005,0.6352213084361175,0.2348473072052002,0.6352213084361175
99,4,RandomForest,0,0.3,0.7158273381294964,0.6989969973633021,1.0430700778961182,0.6989969973633021
100,4,AdaBoost (Discrete),0,0.3,0.6264988009592326,0.6234200836394871,96.77806878089905,0.6234200836394871
101,4,AdaBoost (Real),0,0.3,0.6360911270983214,0.6354220377384685,148.60748195648193,0.6354220377384685
102,4,Logistic Regression (Penalty = L2),0,0.3,0.7386091127098321,0.7352900399007716,0.6483440399169922,0.7352900399007716
103,4,Naive Bayes,0,0.3,0.7272182254196643,0.7086319637224561,0.29869556427001953,0.7086319637224561
104,4,KNeighbors Classifier,1,0.3,0.6584633853541416,0.6554605283171132,0.5903835296630859,0.6554605283171132
105,4,SVC Classifier,1,0.3,0.6968787515006002,0.6725538283293415,13.640840291976929,0.6725538283293415
106,4,Decision Tree,1,0.3,0.6206482593037215,0.6190565125002133,0.3161287307739258,0.6190565125002133
107,4,RandomForest,1,0.3,0.6986794717887155,0.6813098835815643,1.4825851917266846,0.6813098835815643
108,4,AdaBoost (Discrete),1,0.3,0.6032412965186075,0.5961546294576067,112.2999017238617,0.5961546294576067
109,4,AdaBoost (Real),1,0.3,0.5870348139255702,0.5808077741045696,142.0636625289917,0.5808077741045696
110,4,Logistic Regression (Penalty = L2),1,0.3,0.7280912364945978,0.725506674121286,0.61861252784729,0.725506674121286
111,4,Naive Bayes,1,0.3,0.7112845138055222,0.69729269513007,0.26738667488098145,0.69729269513007
112,4,KNeighbors Classifier,2,0.3,0.6680672268907563,0.6659546373774905,0.6932423114776611,0.6659546373774905
113,4,SVC Classifier,2,0.3,0.7028811524609844,0.6721215051989711,13.453274011611938,0.6721215051989711
114,4,Decision Tree,2,0.3,0.6374549819927972,0.6358093074889423,0.2692089080810547,0.6358093074889423
115,4,RandomForest,2,0.3,0.6866746698679472,0.6684042569408752,1.535327672958374,0.6684042569408752
116,4,AdaBoost (Discrete),2,0.3,0.5918367346938775,0.5880608609996223,107.77069044113159,0.5880608609996223
117,4,AdaBoost (Real),2,0.3,0.602641056422569,0.6005188143831166,142.89034485816956,0.6005188143831166
118,4,Logistic Regression (Penalty = L2),2,0.3,0.7334933973589436,0.7288872890479381,0.7019906044006348,0.7288872890479381
119,4,Naive Bayes,2,0.3,0.7088835534213686,0.69032301565004,0.14995217323303223,0.69032301565004
120,5,KNeighbors Classifier,0,0.3,0.7320143884892086,0.73110363961099,1.5270586013793945,0.73110363961099
121,5,SVC Classifier,0,0.3,0.7697841726618705,0.7588734450792589,14.186651468276978,0.7588734450792589
122,5,Decision Tree,0,0.3,0.6828537170263789,0.6813024191812398,0.41658830642700195,0.6813024191812398
123,5,RandomForest,0,0.3,0.7254196642685852,0.7156645838806797,1.6861648559570312,0.7156645838806797
124,5,AdaBoost (Discrete),0,0.3,0.6468824940047961,0.6358742002839562,138.9316647052765,0.6358742002839562
125,5,AdaBoost (Real),0,0.3,0.6888489208633094,0.6832968487560379,149.937269449234,0.6832968487560379
126,5,Logistic Regression (Penalty = L2),0,0.3,0.7799760191846523,0.7789938688443744,0.7140312194824219,0.7789938688443744
127,5,Naive Bayes,0,0.3,0.7697841726618705,0.7605693565727196,0.1349170207977295,0.7605693565727196
128,5,KNeighbors Classifier,1,0.3,0.7136854741896759,0.7110444026677464,1.5847854614257812,0.7110444026677464
129,5,SVC Classifier,1,0.3,0.7623049219687875,0.744996495644179,12.831143617630005,0.744996495644179
130,5,Decision Tree,1,0.3,0.6722689075630253,0.671644255218571,0.38726377487182617,0.671644255218571
131,5,RandomForest,1,0.3,0.7112845138055222,0.7028358331299834,1.5549137592315674,0.7028358331299834
132,5,AdaBoost (Discrete),1,0.3,0.6452581032412965,0.6441942687445344,123.22583985328674,0.6441942687445344
133,5,AdaBoost (Real),1,0.3,0.6506602641056423,0.6457332103654057,176.42447543144226,0.6457332103654057
134,5,Logistic Regression (Penalty = L2),1,0.3,0.776110444177671,0.7743394444467234,0.7392616271972656,0.7743394444467234
135,5,Naive Bayes,1,0.3,0.7490996398559424,0.7360362517700686,0.29158544540405273,0.7360362517700686
136,5,KNeighbors Classifier,2,0.3,0.7274909963985594,0.726577240527649,1.393707513809204,0.726577240527649
137,5,SVC Classifier,2,0.3,0.7521008403361344,0.7367090448975242,15.07203221321106,0.7367090448975242
138,5,Decision Tree,2,0.3,0.6776710684273709,0.6769953502429061,0.43574023246765137,0.6769953502429061
139,5,RandomForest,2,0.3,0.7106842737094838,0.699643058374833,1.7902367115020752,0.699643058374833
140,5,AdaBoost (Discrete),2,0.3,0.6296518607442977,0.6250508484047074,146.37600326538086,0.6250508484047074
141,5,AdaBoost (Real),2,0.3,0.6722689075630253,0.6666079920971955,196.28769207000732,0.6666079920971955
142,5,Logistic Regression (Penalty = L2),2,0.3,0.7779111644657863,0.7760091405487949,0.9560039043426514,0.7760091405487949
143,5,Naive Bayes,2,0.3,0.751500600240096,0.7394868012476387,0.45126938819885254,0.7394868012476387
144,6,KNeighbors Classifier,0,0.3,0.7709832134292566,0.770020527065233,2.6120874881744385,0.770020527065233
145,6,SVC Classifier,0,0.3,0.7943645083932853,0.7880678095557421,9.751429080963135,0.7880678095557421
146,6,Decision Tree,0,0.3,0.7050359712230215,0.7040170482407364,0.535459041595459,0.7040170482407364
147,6,RandomForest,0,0.3,0.7344124700239808,0.7263148075588068,2.094543695449829,0.7263148075588068
148,6,AdaBoost (Discrete),0,0.3,0.7260191846522782,0.7242607589633727,147.70050048828125,0.7242607589633727
149,6,AdaBoost (Real),0,0.3,0.7200239808153477,0.7117006978800194,191.24570226669312,0.7117006978800194
150,6,Logistic Regression (Penalty = L2),0,0.3,0.8033573141486811,0.8021983886555051,0.8599393367767334,0.8021983886555051
151,6,Naive Bayes,0,0.3,0.7931654676258992,0.7862745226581284,0.1969459056854248,0.7862745226581284
152,6,KNeighbors Classifier,1,0.3,0.7496998799519808,0.7471407731726881,2.1582083702087402,0.7471407731726881
153,6,SVC Classifier,1,0.3,0.7899159663865546,0.7801965828872998,15.860561847686768,0.7801965828872998
154,6,Decision Tree,1,0.3,0.7352941176470589,0.7348235392743693,0.47958970069885254,0.7348235392743693
155,6,RandomForest,1,0.3,0.7376950780312125,0.729719343141959,1.7482707500457764,0.729719343141959
156,6,AdaBoost (Discrete),1,0.3,0.6938775510204082,0.692323726788399,158.5204358100891,0.692323726788399
157,6,AdaBoost (Real),1,0.3,0.7202881152460985,0.7170241675379094,190.55418944358826,0.7170241675379094
158,6,Logistic Regression (Penalty = L2),1,0.3,0.8001200480192077,0.7983687790150967,0.773470401763916,0.7983687790150967
159,6,Naive Bayes,1,0.3,0.78031212484994,0.7723642169052907,0.1658339500427246,0.7723642169052907
160,6,KNeighbors Classifier,2,0.3,0.7521008403361344,0.7509179822771606,2.0358667373657227,0.7509179822771606
161,6,SVC Classifier,2,0.3,0.7791116446578632,0.7676348190904736,15.904443264007568,0.7676348190904736
162,6,Decision Tree,2,0.3,0.7136854741896759,0.7130619181636731,0.4759221076965332,0.7130619181636731
163,6,RandomForest,2,0.3,0.7202881152460985,0.7051293105709184,1.7363946437835693,0.7051293105709184
164,6,AdaBoost (Discrete),2,0.3,0.7100840336134454,0.7091636523839667,162.37264490127563,0.7091636523839667
165,6,AdaBoost (Real),2,0.3,0.723889555822329,0.7229350242896359,190.6590061187744,0.7229350242896359
166,6,Logistic Regression (Penalty = L2),2,0.3,0.8043217286914766,0.8024638361394555,0.8260283470153809,0.8024638361394555
167,6,Naive Bayes,2,0.3,0.7719087635054022,0.7608781363002532,0.17710256576538086,0.7608781363002532
168,7,KNeighbors Classifier,0,0.3,0.7991606714628298,0.797890138100901,8.492517709732056,0.797890138100901
169,7,SVC Classifier,0,0.3,0.8273381294964028,0.8129624614191304,17.588653326034546,0.8129624614191304
170,7,Decision Tree,0,0.3,0.7338129496402878,0.7333582638443021,0.48043179512023926,0.7333582638443021
171,7,RandomForest,0,0.3,0.7823741007194245,0.7726202198726047,2.059893846511841,0.7726202198726047
172,7,AdaBoost (Discrete),0,0.3,0.8183453237410072,0.8182938240468135,225.4705626964569,0.8182938240468135
173,7,AdaBoost (Real),0,0.3,0.8273381294964028,0.8271903256213552,250.16030955314636,0.8271903256213552
174,7,Logistic Regression (Penalty = L2),0,0.3,0.855515587529976,0.8545236104583287,1.3828725814819336,0.8545236104583287
175,7,Naive Bayes,0,0.3,0.7997601918465228,0.7709038269818883,0.3189048767089844,0.7709038269818883
176,7,KNeighbors Classifier,1,0.3,0.7821128451380552,0.7814740093000082,8.949188232421875,0.7814740093000082
177,7,SVC Classifier,1,0.3,0.8175270108043218,0.8049252713297937,16.874171018600464,0.8049252713297937
178,7,Decision Tree,1,0.3,0.726890756302521,0.7259799326519245,0.6480953693389893,0.7259799326519245
179,7,RandomForest,1,0.3,0.7460984393757503,0.7352951393783863,1.781132698059082,0.7352951393783863
180,7,AdaBoost (Discrete),1,0.3,0.7899159663865546,0.7886285521176919,217.2869007587433,0.7886285521176919
181,7,AdaBoost (Real),1,0.3,0.804921968787515,0.8037759382658167,253.75311613082886,0.8037759382658167
182,7,Logistic Regression (Penalty = L2),1,0.3,0.8277310924369747,0.8264595232768392,1.2705724239349365,0.8264595232768392
183,7,Naive Bayes,1,0.3,0.790516206482593,0.7649691852521823,0.27605199813842773,0.7649691852521823
184,7,KNeighbors Classifier,2,0.3,0.7941176470588235,0.7917177004986625,8.417722225189209,0.7917177004986625
185,7,SVC Classifier,2,0.3,0.8223289315726291,0.8075067737408741,18.413994312286377,0.8075067737408741
186,7,Decision Tree,2,0.3,0.71968787515006,0.7186410164395227,0.6440668106079102,0.7186410164395227
187,7,RandomForest,2,0.3,0.7496998799519808,0.7403415317021714,1.6791672706604004,0.7403415317021714
188,7,AdaBoost (Discrete),2,0.3,0.82953181272509,0.8289115978463188,219.55261898040771,0.8289115978463188
189,7,AdaBoost (Real),2,0.3,0.8223289315726291,0.8212449691133582,271.34912061691284,0.8212449691133582
190,7,Logistic Regression (Penalty = L2),2,0.3,0.8553421368547419,0.8537657895635518,1.2739677429199219,0.8537657895635518
191,7,Naive Bayes,2,0.3,0.8055222088835534,0.7811449672829409,0.3272275924682617,0.7811449672829409
192,8,KNeighbors Classifier,0,0.3,0.6918465227817746,0.6894958028380924,0.9449546337127686,0.6894958028380924
193,8,SVC Classifier,0,0.3,0.7086330935251799,0.6851770549568924,14.713572263717651,0.6851770549568924
194,8,Decision Tree,0,0.3,0.6205035971223022,0.6170582103099189,0.2960386276245117,0.6170582103099189
195,8,RandomForest,0,0.3,0.7158273381294964,0.6989969973633021,1.6306865215301514,0.6989969973633021
196,8,AdaBoost (Discrete),0,0.3,0.6264988009592326,0.6234200836394871,114.97150468826294,0.6234200836394871
197,8,AdaBoost (Real),0,0.3,0.6360911270983214,0.6354220377384685,142.14524245262146,0.6354220377384685
198,8,Logistic Regression (Penalty = L2),0,0.3,0.7386091127098321,0.7352900399007716,0.653679609298706,0.7352900399007716
199,8,Naive Bayes,0,0.3,0.7272182254196643,0.7086319637224561,0.13794183731079102,0.7086319637224561
200,8,KNeighbors Classifier,1,0.3,0.6584633853541416,0.6554605283171132,0.739638090133667,0.6554605283171132
201,8,SVC Classifier,1,0.3,0.6968787515006002,0.6725538283293415,13.550549983978271,0.6725538283293415
202,8,Decision Tree,1,0.3,0.6242496998799519,0.6230788271163938,0.31269407272338867,0.6230788271163938
203,8,RandomForest,1,0.3,0.6986794717887155,0.6813098835815643,1.4955723285675049,0.6813098835815643
204,8,AdaBoost (Discrete),1,0.3,0.6032412965186075,0.5961546294576067,114.0749135017395,0.5961546294576067
205,8,AdaBoost (Real),1,0.3,0.5882352941176471,0.5819215021898878,136.82813906669617,0.5819215021898878
206,8,Logistic Regression (Penalty = L2),1,0.3,0.7280912364945978,0.725506674121286,0.6161251068115234,0.725506674121286
207,8,Naive Bayes,1,0.3,0.7112845138055222,0.69729269513007,0.15067768096923828,0.69729269513007
208,8,KNeighbors Classifier,2,0.3,0.6680672268907563,0.6659546373774905,0.729572057723999,0.6659546373774905
209,8,SVC Classifier,2,0.3,0.7028811524609844,0.6721215051989711,12.599234819412231,0.6721215051989711
210,8,Decision Tree,2,0.3,0.6116446578631453,0.6107930500869346,0.2643420696258545,0.6107930500869346
211,8,RandomForest,2,0.3,0.6866746698679472,0.6684042569408752,1.6393685340881348,0.6684042569408752
212,8,AdaBoost (Discrete),2,0.3,0.5918367346938775,0.5880608609996223,102.68464469909668,0.5880608609996223
213,8,AdaBoost (Real),2,0.3,0.5972388955582233,0.5862789925683419,136.045147895813,0.5862789925683419
214,8,Logistic Regression (Penalty = L2),2,0.3,0.7334933973589436,0.7288872890479381,0.548351526260376,0.7288872890479381
215,8,Naive Bayes,2,0.3,0.7088835534213686,0.69032301565004,0.17711901664733887,0.69032301565004
