,feat_set_id,classifier,fold_id,feat_th,score,geo_score,exec_t,geo_score_woz
0,0,KNeighbors Classifier,0,0.2,0.8166666666666667,0.9335005594445988,0.31255125999450684,0.0
1,0,SVC Classifier,0,0.2,0.6833333333333333,0.5905445929237333,0.2161092758178711,0.0
2,0,Decision Tree,0,0.2,0.7833333333333333,0.573861375250308,0.0022330284118652344,0.573861375250308
3,0,RandomForest,0,0.2,0.7666666666666667,0.9306048591020996,0.9027724266052246,0.0
4,0,AdaBoost (Discrete),0,0.2,0.775,0.7878656730436847,43.41063451766968,0.0
5,0,AdaBoost (Real),0,0.2,0.7666666666666667,0.8374247492892184,46.39982724189758,0.0
6,0,Logistic Regression (Penalty = L2),0,0.2,0.875,0.7937005259840998,0.30966949462890625,0.7937005259840998
7,0,Naive Bayes,0,0.2,0.8416666666666667,0.7134096320568885,0.003005504608154297,0.7134096320568885
8,0,KNeighbors Classifier,1,0.2,0.85,0.7211247851537042,0.12412595748901367,0.7211247851537042
9,0,SVC Classifier,1,0.2,0.675,1.0,0.12159013748168945,0.0
10,0,Decision Tree,1,0.2,0.8083333333333333,0.9589233769495034,0.097869873046875,0.0
11,0,RandomForest,1,0.2,0.8666666666666667,1.0,0.682173490524292,0.0
12,0,AdaBoost (Discrete),1,0.2,0.325,1.0,37.95359992980957,0.0
13,0,AdaBoost (Real),1,0.2,0.8333333333333334,0.9748970527428702,43.744877576828,0.0
14,0,Logistic Regression (Penalty = L2),1,0.2,0.8583333333333333,0.9915242009646987,0.003420114517211914,0.0
15,0,Naive Bayes,1,0.2,0.85,0.6812920690579614,0.1000070571899414,0.6812920690579614
16,0,KNeighbors Classifier,2,0.2,0.8389830508474576,0.6069622310029172,0.09765243530273438,0.6069622310029172
17,0,SVC Classifier,2,0.2,0.6779661016949152,1.0,0.10259342193603516,0.0
18,0,Decision Tree,2,0.2,0.8305084745762712,0.5887959215002405,0.09790992736816406,0.5887959215002405
19,0,RandomForest,2,0.2,0.8305084745762712,0.9009915636585711,0.5058026313781738,0.0
20,0,AdaBoost (Discrete),2,0.2,0.8559322033898306,0.9641925040026272,38.226887464523315,0.0
21,0,AdaBoost (Real),2,0.2,0.864406779661017,1.0,46.863301038742065,0.0
22,0,Logistic Regression (Penalty = L2),2,0.2,0.847457627118644,0.6812920690579614,0.0997469425201416,0.6812920690579614
23,0,Naive Bayes,2,0.2,0.847457627118644,0.6812920690579614,0.10038876533508301,0.6812920690579614
24,1,KNeighbors Classifier,0,0.2,0.95,0.9210990757166959,0.10398149490356445,0.9210990757166959
25,1,SVC Classifier,0,0.2,0.7666666666666667,0.9187475990753426,0.10138225555419922,0.0
26,1,Decision Tree,0,0.2,0.8666666666666667,0.7561468025758357,0.0019516944885253906,0.7561468025758357
27,1,RandomForest,0,0.2,0.8333333333333334,0.8048315754718863,0.5143611431121826,0.0
28,1,AdaBoost (Discrete),0,0.2,0.8666666666666667,0.7833588094940039,38.62795066833496,0.7833588094940039
29,1,AdaBoost (Real),0,0.2,0.7833333333333333,0.8504142777123846,44.35871434211731,0.0
30,1,Logistic Regression (Penalty = L2),0,0.2,0.9666666666666667,0.9577625008329119,0.197462797164917,0.9577625008329119
31,1,Naive Bayes,0,0.2,0.95,0.9429863870292697,0.002763509750366211,0.9429863870292697
32,1,KNeighbors Classifier,1,0.2,0.9833333333333333,0.9825931938526898,0.19846653938293457,0.9825931938526898
33,1,SVC Classifier,1,0.2,0.7916666666666666,0.9671682101338347,0.10142326354980469,0.0
34,1,Decision Tree,1,0.2,0.8916666666666667,0.8937060286261196,0.0019512176513671875,0.8937060286261196
35,1,RandomForest,1,0.2,0.875,0.8981281850811303,0.7285356521606445,0.0
36,1,AdaBoost (Discrete),1,0.2,0.4666666666666667,1.0,38.638936281204224,0.0
37,1,AdaBoost (Real),1,0.2,0.65,0.5207307092599317,45.14348769187927,0.0
38,1,Logistic Regression (Penalty = L2),1,0.2,0.975,0.9720806486198328,0.10126233100891113,0.9720806486198328
39,1,Naive Bayes,1,0.2,0.8333333333333334,0.6692391081496907,0.09915852546691895,0.6692391081496907
40,1,KNeighbors Classifier,2,0.2,0.9745762711864406,0.9720806486198328,0.202012300491333,0.9720806486198328
41,1,SVC Classifier,2,0.2,0.7966101694915254,0.9671682101338347,0.19497418403625488,0.0
42,1,Decision Tree,2,0.2,0.9491525423728814,0.9422865815358938,0.09806251525878906,0.9422865815358938
43,1,RandomForest,2,0.2,0.8983050847457628,0.9272726087611759,0.6040596961975098,0.0
44,1,AdaBoost (Discrete),2,0.2,0.9661016949152542,0.9370735665844807,39.79823660850525,0.9370735665844807
45,1,AdaBoost (Real),2,0.2,0.6186440677966102,1.0,52.34647536277771,0.0
46,1,Logistic Regression (Penalty = L2),2,0.2,0.9745762711864406,0.9720806486198328,0.11928200721740723,0.9720806486198328
47,1,Naive Bayes,2,0.2,0.847457627118644,0.6812920690579614,0.22090840339660645,0.6812920690579614
48,2,KNeighbors Classifier,0,0.2,0.45,0.36592316657179336,0.10947823524475098,0.0
49,2,SVC Classifier,0,0.2,0.30833333333333335,1.0,0.10895228385925293,0.0
50,2,Decision Tree,0,0.2,0.4083333333333333,0.2559283106623534,0.11015081405639648,0.0
51,2,RandomForest,0,0.2,0.49166666666666664,0.4518881968300769,0.738032341003418,0.0
52,2,AdaBoost (Discrete),0,0.2,0.31666666666666665,0.20415040758704073,41.42194724082947,0.20415040758704073
53,2,AdaBoost (Real),0,0.2,0.45,0.270486939967567,47.8476824760437,0.0
54,2,Logistic Regression (Penalty = L2),0,0.2,0.44166666666666665,0.26701801066846986,0.10820817947387695,0.0
55,2,Naive Bayes,0,0.2,0.2,0.3174558581184664,0.1029818058013916,0.0
56,2,KNeighbors Classifier,1,0.2,0.275,0.2801413769824052,0.22167205810546875,0.0
57,2,SVC Classifier,1,0.2,0.30833333333333335,1.0,0.10981893539428711,0.0
58,2,Decision Tree,1,0.2,0.4666666666666667,0.4533196820475553,0.002060413360595703,0.0
59,2,RandomForest,1,0.2,0.5,1.0,0.7370059490203857,0.0
60,2,AdaBoost (Discrete),1,0.2,0.35833333333333334,0.29673242536400657,39.87346935272217,0.0
61,2,AdaBoost (Real),1,0.2,0.45,0.36592316657179336,48.02220296859741,0.0
62,2,Logistic Regression (Penalty = L2),1,0.2,0.49166666666666664,0.5260463199111178,0.13991212844848633,0.0
63,2,Naive Bayes,1,0.2,0.21666666666666667,0.1584680066224973,0.1479930877685547,0.1584680066224973
64,2,KNeighbors Classifier,2,0.2,0.4576271186440678,0.3825805880582172,0.28554773330688477,0.0
65,2,SVC Classifier,2,0.2,0.3135593220338983,1.0,0.19098162651062012,0.0
66,2,Decision Tree,2,0.2,0.4491525423728814,0.4213101648386271,0.0011858940124511719,0.0
67,2,RandomForest,2,0.2,0.5,1.0,1.0636355876922607,0.0
68,2,AdaBoost (Discrete),2,0.2,0.3898305084745763,0.5761166531676586,36.47805953025818,0.0
69,2,AdaBoost (Real),2,0.2,0.4406779661016949,0.32730995851318534,47.66793751716614,0.0
70,2,Logistic Regression (Penalty = L2),2,0.2,0.4661016949152542,0.43665547914533365,0.1312236785888672,0.0
71,2,Naive Bayes,2,0.2,0.2033898305084746,0.14664607023673815,0.2295241355895996,0.14664607023673815
72,3,KNeighbors Classifier,0,0.2,0.9333333333333333,0.9315040967789426,0.11746096611022949,0.9315040967789426
73,3,SVC Classifier,0,0.2,0.7583333333333333,0.8989780274079175,0.10954022407531738,0.0
74,3,Decision Tree,0,0.2,0.7916666666666666,0.7406381167867305,0.12187719345092773,0.7406381167867305
75,3,RandomForest,0,0.2,0.7833333333333333,0.9584146563694087,0.6345961093902588,0.0
76,3,AdaBoost (Discrete),0,0.2,0.8583333333333333,0.7763315135622076,48.300763845443726,0.7763315135622076
77,3,AdaBoost (Real),0,0.2,0.7666666666666667,0.8429006060306141,54.860907316207886,0.0
78,3,Logistic Regression (Penalty = L2),0,0.2,0.9666666666666667,0.9634924839989961,0.2536299228668213,0.9634924839989961
79,3,Naive Bayes,0,0.2,0.85,0.8038173816527061,0.5041234493255615,0.8038173816527061
80,3,KNeighbors Classifier,1,0.2,0.925,0.9223241040937894,0.23320317268371582,0.9223241040937894
81,3,SVC Classifier,1,0.2,0.75,0.9111389532206876,0.5112810134887695,0.0
82,3,Decision Tree,1,0.2,0.9,0.9015603500925183,0.0012559890747070312,0.9015603500925183
83,3,RandomForest,1,0.2,0.7583333333333333,0.9146912192286945,1.556196928024292,0.0
84,3,AdaBoost (Discrete),1,0.2,0.4666666666666667,1.0,84.82254958152771,0.0
85,3,AdaBoost (Real),1,0.2,0.65,0.5207307092599317,91.63154888153076,0.0
86,3,Logistic Regression (Penalty = L2),1,0.2,0.925,0.9169583156248539,0.42569446563720703,0.9169583156248539
87,3,Naive Bayes,1,0.2,0.7916666666666666,0.6870419147265601,0.2230517864227295,0.6870419147265601
88,3,KNeighbors Classifier,2,0.2,0.9491525423728814,0.9401714290217257,0.445969820022583,0.9401714290217257
89,3,SVC Classifier,2,0.2,0.788135593220339,0.9494144610579709,0.2167975902557373,0.0
90,3,Decision Tree,2,0.2,0.8983050847457628,0.8781445165953293,0.22190213203430176,0.8781445165953293
91,3,RandomForest,2,0.2,0.923728813559322,0.9593225958126531,1.0773780345916748,0.0
92,3,AdaBoost (Discrete),2,0.2,0.9322033898305084,0.8419619762844671,68.60450649261475,0.8419619762844671
93,3,AdaBoost (Real),2,0.2,0.8559322033898306,0.9911490498164198,82.85433077812195,0.0
94,3,Logistic Regression (Penalty = L2),2,0.2,0.940677966101695,0.9322052677504093,0.46144843101501465,0.9322052677504093
95,3,Naive Bayes,2,0.2,0.847457627118644,0.7211247851537042,0.22862768173217773,0.7211247851537042
96,4,KNeighbors Classifier,0,0.2,0.825,0.9273178923775837,0.43315601348876953,0.0
97,4,SVC Classifier,0,0.2,0.525,0.5,0.24319171905517578,0.0
98,4,Decision Tree,0,0.2,0.8166666666666667,0.8642415608423943,0.2333240509033203,0.0
99,4,RandomForest,0,0.2,0.7833333333333333,0.8680489398440389,1.6184608936309814,0.0
100,4,AdaBoost (Discrete),0,0.2,0.8166666666666667,0.8265195771340672,74.46225357055664,0.0
101,4,AdaBoost (Real),0,0.2,0.7833333333333333,0.854218760555029,77.88033723831177,0.0
102,4,Logistic Regression (Penalty = L2),0,0.2,0.8416666666666667,0.949421678626748,0.22425007820129395,0.0
103,4,Naive Bayes,0,0.2,0.8333333333333334,0.6593180529730915,0.21159911155700684,0.6593180529730915
104,4,KNeighbors Classifier,1,0.2,0.8333333333333334,0.6004684775880014,0.22410917282104492,0.6004684775880014
105,4,SVC Classifier,1,0.2,0.5083333333333333,1.0,0.21619915962219238,0.0
106,4,Decision Tree,1,0.2,0.8,0.9282558422651347,0.2105264663696289,0.0
107,4,RandomForest,1,0.2,0.8083333333333333,0.919208143626272,1.3028697967529297,0.0
108,4,AdaBoost (Discrete),1,0.2,0.775,0.9066448245436477,70.60606813430786,0.0
109,4,AdaBoost (Real),1,0.2,0.65,0.5207307092599317,86.02617955207825,0.0
110,4,Logistic Regression (Penalty = L2),1,0.2,0.8583333333333333,0.9871752429174099,0.2165210247039795,0.0
111,4,Naive Bayes,1,0.2,0.8333333333333334,0.6004684775880014,0.22762393951416016,0.6004684775880014
112,4,KNeighbors Classifier,2,0.2,0.8305084745762712,0.6004684775880014,0.2602689266204834,0.6004684775880014
113,4,SVC Classifier,2,0.2,0.5084745762711864,1.0,0.370039701461792,0.0
114,4,Decision Tree,2,0.2,0.8389830508474576,0.6069622310029172,0.001806497573852539,0.6069622310029172
115,4,RandomForest,2,0.2,0.8305084745762712,0.9292018856504035,1.419663906097412,0.0
116,4,AdaBoost (Discrete),2,0.2,0.7627118644067796,0.9671682101338347,77.3053412437439,0.0
117,4,AdaBoost (Real),2,0.2,0.6186440677966102,1.0,54.135154724121094,0.0
118,4,Logistic Regression (Penalty = L2),2,0.2,0.8389830508474576,0.6069622310029172,0.10709381103515625,0.6069622310029172
119,4,Naive Bayes,2,0.2,0.8389830508474576,0.6069622310029172,0.21238493919372559,0.6069622310029172
120,5,KNeighbors Classifier,0,0.2,0.4666666666666667,0.8774979183239392,0.11274027824401855,0.0
121,5,SVC Classifier,0,0.2,0.30833333333333335,1.0,0.10335683822631836,0.0
122,5,Decision Tree,0,0.2,0.49166666666666664,0.4518881968300769,0.001130819320678711,0.0
123,5,RandomForest,0,0.2,0.48333333333333334,0.4487168556720455,0.5454707145690918,0.0
124,5,AdaBoost (Discrete),0,0.2,0.325,0.45499414040480374,34.016130447387695,0.0
125,5,AdaBoost (Real),0,0.2,0.49166666666666664,0.4518881968300769,40.377843141555786,0.0
126,5,Logistic Regression (Penalty = L2),0,0.2,0.49166666666666664,0.4518881968300769,0.11863136291503906,0.0
127,5,Naive Bayes,0,0.2,0.4583333333333333,0.4260182716955024,0.10763096809387207,0.0
128,5,KNeighbors Classifier,1,0.2,0.325,0.8157589592147709,0.11909723281860352,0.0
129,5,SVC Classifier,1,0.2,0.30833333333333335,1.0,0.11619830131530762,0.0
130,5,Decision Tree,1,0.2,0.475,0.8298265333662435,0.0010838508605957031,0.0
131,5,RandomForest,1,0.2,0.5,1.0,0.4539494514465332,0.0
132,5,AdaBoost (Discrete),1,0.2,0.35833333333333334,0.8181372786756832,35.62865447998047,0.0
133,5,AdaBoost (Real),1,0.2,0.425,0.34926710282900486,43.34685230255127,0.0
134,5,Logistic Regression (Penalty = L2),1,0.2,0.5,1.0,0.0023033618927001953,0.0
135,5,Naive Bayes,1,0.2,0.2916666666666667,0.9085602964160698,0.11655354499816895,0.0
136,5,KNeighbors Classifier,2,0.2,0.5,1.0,0.24047136306762695,0.0
137,5,SVC Classifier,2,0.2,0.3135593220338983,1.0,0.11504220962524414,0.0
138,5,Decision Tree,2,0.2,0.4915254237288136,0.9787169102922159,0.0010647773742675781,0.0
139,5,RandomForest,2,0.2,0.5,1.0,0.5794832706451416,0.0
140,5,AdaBoost (Discrete),2,0.2,0.5,1.0,36.51279306411743,0.0
141,5,AdaBoost (Real),2,0.2,0.5,1.0,42.617027759552,0.0
142,5,Logistic Regression (Penalty = L2),2,0.2,0.5,1.0,0.002200603485107422,0.0
143,5,Naive Bayes,2,0.2,0.3220338983050847,1.0,0.22050881385803223,0.0
144,6,KNeighbors Classifier,0,0.2,0.8333333333333334,0.9386299922753252,0.11124348640441895,0.0
145,6,SVC Classifier,0,0.2,0.525,0.5,0.0031461715698242188,0.0
146,6,Decision Tree,0,0.2,0.7916666666666666,0.7928989062262297,0.0012018680572509766,0.0
147,6,RandomForest,0,0.2,0.8,0.8861488534339648,0.6630251407623291,0.0
148,6,AdaBoost (Discrete),0,0.2,0.8166666666666667,0.8655181418311103,35.6571683883667,0.0
149,6,AdaBoost (Real),0,0.2,0.7666666666666667,0.8429006060306141,40.34920859336853,0.0
150,6,Logistic Regression (Penalty = L2),0,0.2,0.8583333333333333,0.9897937816869885,0.19289445877075195,0.0
151,6,Naive Bayes,0,0.2,0.825,0.9871752429174099,0.09990715980529785,0.0
152,6,KNeighbors Classifier,1,0.2,0.8416666666666667,0.9665910224658814,0.09942770004272461,0.0
153,6,SVC Classifier,1,0.2,0.5083333333333333,1.0,0.10120630264282227,0.0
154,6,Decision Tree,1,0.2,0.8416666666666667,0.9832307187200764,0.00177764892578125,0.0
155,6,RandomForest,1,0.2,0.8083333333333333,0.919208143626272,0.5199265480041504,0.0
156,6,AdaBoost (Discrete),1,0.2,0.4666666666666667,1.0,35.18141961097717,0.0
157,6,AdaBoost (Real),1,0.2,0.65,0.5207307092599317,41.032063245773315,0.0
158,6,Logistic Regression (Penalty = L2),1,0.2,0.8583333333333333,0.9871752429174099,0.10736727714538574,0.0
159,6,Naive Bayes,1,0.2,0.825,0.9871752429174099,0.2204294204711914,0.0
160,6,KNeighbors Classifier,2,0.2,0.864406779661017,1.0,0.197493314743042,0.0
161,6,SVC Classifier,2,0.2,0.5084745762711864,1.0,0.10373115539550781,0.0
162,6,Decision Tree,2,0.2,0.8220338983050848,0.9641925040026272,0.001781463623046875,0.0
163,6,RandomForest,2,0.2,0.8559322033898306,0.9871752429174099,0.5198938846588135,0.0
164,6,AdaBoost (Discrete),2,0.2,0.8220338983050848,0.9641925040026272,35.88915038108826,0.0
165,6,AdaBoost (Real),2,0.2,0.8050847457627118,0.907628172652615,40.28403830528259,0.0
166,6,Logistic Regression (Penalty = L2),2,0.2,0.864406779661017,1.0,0.10405468940734863,0.0
167,6,Naive Bayes,2,0.2,0.8305084745762712,1.0,0.10798072814941406,0.0
168,7,KNeighbors Classifier,0,0.2,0.44166666666666665,1.0,0.10696697235107422,0.0
169,7,SVC Classifier,0,0.2,0.30833333333333335,1.0,0.002626180648803711,0.0
170,7,Decision Tree,0,0.2,0.44166666666666665,1.0,0.117950439453125,0.0
171,7,RandomForest,0,0.2,0.44166666666666665,1.0,0.6450231075286865,0.0
172,7,AdaBoost (Discrete),0,0.2,0.44166666666666665,1.0,34.72276425361633,0.0
173,7,AdaBoost (Real),0,0.2,0.4083333333333333,0.30597585258541515,39.14029288291931,0.0
174,7,Logistic Regression (Penalty = L2),0,0.2,0.44166666666666665,1.0,0.12265324592590332,0.0
175,7,Naive Bayes,0,0.2,0.44166666666666665,1.0,0.10375118255615234,0.0
176,7,KNeighbors Classifier,1,0.2,0.3,1.0,0.1041555404663086,0.0
177,7,SVC Classifier,1,0.2,0.30833333333333335,1.0,0.10416269302368164,0.0
178,7,Decision Tree,1,0.2,0.44166666666666665,1.0,0.0016875267028808594,0.0
179,7,RandomForest,1,0.2,0.44166666666666665,1.0,0.4295077323913574,0.0
180,7,AdaBoost (Discrete),1,0.2,0.44166666666666665,1.0,34.8447687625885,0.0
181,7,AdaBoost (Real),1,0.2,0.38333333333333336,0.27516060407455223,41.158727407455444,0.0
182,7,Logistic Regression (Penalty = L2),1,0.2,0.44166666666666665,1.0,0.0949869155883789,0.0
183,7,Naive Bayes,1,0.2,0.44166666666666665,1.0,0.0022644996643066406,0.0
184,7,KNeighbors Classifier,2,0.2,0.4491525423728814,1.0,0.10841774940490723,0.0
185,7,SVC Classifier,2,0.2,0.3135593220338983,1.0,0.1031956672668457,0.0
186,7,Decision Tree,2,0.2,0.4491525423728814,1.0,0.10931229591369629,0.0
187,7,RandomForest,2,0.2,0.4491525423728814,1.0,0.6538121700286865,0.0
188,7,AdaBoost (Discrete),2,0.2,0.3983050847457627,0.7905694150420949,35.0355269908905,0.0
189,7,AdaBoost (Real),2,0.2,0.3983050847457627,0.7905694150420949,40.90786266326904,0.0
190,7,Logistic Regression (Penalty = L2),2,0.2,0.4491525423728814,1.0,0.12218213081359863,0.0
191,7,Naive Bayes,2,0.2,0.4491525423728814,1.0,0.10302162170410156,0.0
192,8,KNeighbors Classifier,0,0.2,0.95,0.9085602964160698,0.10426211357116699,0.9085602964160698
193,8,SVC Classifier,0,0.2,0.675,0.5791460926441345,0.10781455039978027,0.0
194,8,Decision Tree,0,0.2,0.9166666666666666,0.6953143145520497,0.10536360740661621,0.6953143145520497
195,8,RandomForest,0,0.2,0.775,0.7195270834493366,0.7381665706634521,0.0
196,8,AdaBoost (Discrete),0,0.2,0.8583333333333333,0.7763315135622076,36.53599953651428,0.7763315135622076
197,8,AdaBoost (Real),0,0.2,0.7666666666666667,0.8429006060306141,41.98809480667114,0.0
198,8,Logistic Regression (Penalty = L2),0,0.2,0.9583333333333334,0.9491706774639023,0.10854029655456543,0.9491706774639023
199,8,Naive Bayes,0,0.2,0.925,0.897407387963294,0.1122584342956543,0.897407387963294
200,8,KNeighbors Classifier,1,0.2,0.9416666666666667,0.9373817745453901,0.10736751556396484,0.9373817745453901
201,8,SVC Classifier,1,0.2,0.7,0.7022798316312892,0.11373496055603027,0.0
202,8,Decision Tree,1,0.2,0.85,0.8566742080849569,0.10606670379638672,0.8566742080849569
203,8,RandomForest,1,0.2,0.825,0.8561093423445371,0.6488394737243652,0.0
204,8,AdaBoost (Discrete),1,0.2,0.4666666666666667,1.0,37.428709983825684,0.0
205,8,AdaBoost (Real),1,0.2,0.65,0.5207307092599317,41.14663887023926,0.0
206,8,Logistic Regression (Penalty = L2),1,0.2,0.95,0.9475190695520908,0.08359527587890625,0.9475190695520908
207,8,Naive Bayes,1,0.2,0.8333333333333334,0.6692391081496907,0.11571693420410156,0.6692391081496907
208,8,KNeighbors Classifier,2,0.2,0.9491525423728814,0.9429863870292697,0.08729290962219238,0.9429863870292697
209,8,SVC Classifier,2,0.2,0.6949152542372882,0.5946035575013605,0.10896444320678711,0.0
210,8,Decision Tree,2,0.2,0.9491525423728814,0.9429863870292697,0.0012555122375488281,0.9429863870292697
211,8,RandomForest,2,0.2,0.9152542372881356,0.944087511294902,0.647519588470459,0.0
212,8,AdaBoost (Discrete),2,0.2,0.9491525423728814,0.9422865815358938,35.35184860229492,0.9422865815358938
213,8,AdaBoost (Real),2,0.2,0.6186440677966102,1.0,37.83445620536804,0.0
214,8,Logistic Regression (Penalty = L2),2,0.2,0.9491525423728814,0.9429863870292697,0.09254980087280273,0.9429863870292697
215,8,Naive Bayes,2,0.2,0.8305084745762712,1.0,0.09207773208618164,0.0
216,9,KNeighbors Classifier,0,0.2,0.43333333333333335,0.9863939238321437,0.09235453605651855,0.0
217,9,SVC Classifier,0,0.2,0.30833333333333335,1.0,0.09253263473510742,0.0
218,9,Decision Tree,0,0.2,0.43333333333333335,0.9863939238321437,0.0013928413391113281,0.0
219,9,RandomForest,0,0.2,0.43333333333333335,0.9863939238321437,0.6464896202087402,0.0
220,9,AdaBoost (Discrete),0,0.2,0.43333333333333335,0.9863939238321437,30.005762338638306,0.0
221,9,AdaBoost (Real),0,0.2,0.4,0.30319409995361035,36.32706141471863,0.0
222,9,Logistic Regression (Penalty = L2),0,0.2,0.43333333333333335,0.9863939238321437,0.0952765941619873,0.0
223,9,Naive Bayes,0,0.2,0.19166666666666668,1.0,0.09550976753234863,0.0
224,9,KNeighbors Classifier,1,0.2,0.2833333333333333,0.3509991673295757,0.09610533714294434,0.0
225,9,SVC Classifier,1,0.2,0.30833333333333335,1.0,0.002810955047607422,0.0
226,9,Decision Tree,1,0.2,0.44166666666666665,1.0,0.001786947250366211,0.0
227,9,RandomForest,1,0.2,0.44166666666666665,1.0,0.5709593296051025,0.0
228,9,AdaBoost (Discrete),1,0.2,0.44166666666666665,1.0,33.49544596672058,0.0
229,9,AdaBoost (Real),1,0.2,0.38333333333333336,0.27516060407455223,37.0398964881897,0.0
230,9,Logistic Regression (Penalty = L2),1,0.2,0.44166666666666665,1.0,0.08356761932373047,0.0
231,9,Naive Bayes,1,0.2,0.2833333333333333,0.3509991673295757,0.07240939140319824,0.0
232,9,KNeighbors Classifier,2,0.2,0.4491525423728814,1.0,0.09470438957214355,0.0
233,9,SVC Classifier,2,0.2,0.3135593220338983,1.0,0.09625124931335449,0.0
234,9,Decision Tree,2,0.2,0.4491525423728814,1.0,0.0018453598022460938,0.0
235,9,RandomForest,2,0.2,0.4491525423728814,1.0,0.5703108310699463,0.0
236,9,AdaBoost (Discrete),2,0.2,0.4491525423728814,1.0,29.810367107391357,0.0
237,9,AdaBoost (Real),2,0.2,0.3983050847457627,0.7905694150420949,38.33763909339905,0.0
238,9,Logistic Regression (Penalty = L2),2,0.2,0.4491525423728814,1.0,0.1027674674987793,0.0
239,9,Naive Bayes,2,0.2,0.1864406779661017,1.0,0.09631800651550293,0.0
240,10,KNeighbors Classifier,0,0.2,0.95,0.936592398786078,0.18636560440063477,0.936592398786078
241,10,SVC Classifier,0,0.2,0.6833333333333333,0.5870274429720093,0.09706497192382812,0.0
242,10,Decision Tree,0,0.2,0.875,0.865243437676924,0.0012958049774169922,0.865243437676924
243,10,RandomForest,0,0.2,0.8333333333333334,0.9372455762294151,0.4944758415222168,0.0
244,10,AdaBoost (Discrete),0,0.2,0.8416666666666667,0.7607439337132827,31.223761558532715,0.7607439337132827
245,10,AdaBoost (Real),0,0.2,0.7833333333333333,0.854218760555029,34.77005076408386,0.0
246,10,Logistic Regression (Penalty = L2),0,0.2,0.975,0.9720806486198328,0.09725022315979004,0.9720806486198328
247,10,Naive Bayes,0,0.2,0.9083333333333333,0.8852415510019483,0.1685183048248291,0.8852415510019483
248,10,KNeighbors Classifier,1,0.2,0.9166666666666666,0.9004966766121593,0.09295296669006348,0.9004966766121593
249,10,SVC Classifier,1,0.2,0.6833333333333333,0.6923158912443155,0.09222531318664551,0.0
250,10,Decision Tree,1,0.2,0.8833333333333333,0.874732579502976,0.0011968612670898438,0.874732579502976
251,10,RandomForest,1,0.2,0.775,0.9718025939474719,0.5589981079101562,0.0
252,10,AdaBoost (Discrete),1,0.2,0.4666666666666667,1.0,33.31580138206482,0.0
253,10,AdaBoost (Real),1,0.2,0.65,0.5207307092599317,37.44604778289795,0.0
254,10,Logistic Regression (Penalty = L2),1,0.2,0.9583333333333334,0.9518558056141587,0.09629631042480469,0.9518558056141587
255,10,Naive Bayes,1,0.2,0.825,0.6620790683284955,0.0965723991394043,0.6620790683284955
256,10,KNeighbors Classifier,2,0.2,0.9322033898305084,0.9207621086651762,0.190521240234375,0.9207621086651762
257,10,SVC Classifier,2,0.2,0.6949152542372882,0.5946035575013605,0.09655094146728516,0.0
258,10,Decision Tree,2,0.2,0.923728813559322,0.8982962137318906,0.08603525161743164,0.8982962137318906
259,10,RandomForest,2,0.2,0.9661016949152542,0.9531842929969365,0.41349339485168457,0.9531842929969365
260,10,AdaBoost (Discrete),2,0.2,0.9067796610169492,0.85850375553196,33.22513461112976,0.85850375553196
261,10,AdaBoost (Real),2,0.2,0.652542372881356,0.9401507732715984,36.96953892707825,0.0
262,10,Logistic Regression (Penalty = L2),2,0.2,0.9491525423728814,0.9429863870292697,0.09775066375732422,0.9429863870292697
263,10,Naive Bayes,2,0.2,0.8389830508474576,0.6069622310029172,0.09960603713989258,0.6069622310029172
264,11,KNeighbors Classifier,0,0.2,0.9416666666666667,0.9297901808581143,0.19187712669372559,0.9297901808581143
265,11,SVC Classifier,0,0.2,0.8083333333333333,1.0,0.19926190376281738,0.0
266,11,Decision Tree,0,0.2,0.9,0.6812920690579614,0.002089262008666992,0.6812920690579614
267,11,RandomForest,0,0.2,0.775,0.9420254600938036,0.583733320236206,0.0
268,11,AdaBoost (Discrete),0,0.2,0.825,0.7481595356833938,35.40844488143921,0.7481595356833938
269,11,AdaBoost (Real),0,0.2,0.7666666666666667,0.8339947279394198,39.75183320045471,0.0
270,11,Logistic Regression (Penalty = L2),0,0.2,0.9833333333333333,0.9808798513677408,0.20510387420654297,0.9808798513677408
271,11,Naive Bayes,0,0.2,0.8333333333333334,0.7830722321699395,0.09587645530700684,0.7830722321699395
272,11,KNeighbors Classifier,1,0.2,0.925,0.9284942986945327,0.2083742618560791,0.9284942986945327
273,11,SVC Classifier,1,0.2,0.8083333333333333,1.0,0.19633078575134277,0.0
274,11,Decision Tree,1,0.2,0.8916666666666667,0.9041589330335724,0.11364269256591797,0.9041589330335724
275,11,RandomForest,1,0.2,0.775,0.9457416090031758,0.6095788478851318,0.0
276,11,AdaBoost (Discrete),1,0.2,0.325,1.0,35.89706087112427,0.0
277,11,AdaBoost (Real),1,0.2,0.8333333333333334,0.9748970527428702,42.225337743759155,0.0
278,11,Logistic Regression (Penalty = L2),1,0.2,0.975,0.9696654978825953,0.2772343158721924,0.9696654978825953
279,11,Naive Bayes,1,0.2,0.8083333333333333,0.7096322563369823,0.16155791282653809,0.7096322563369823
280,11,KNeighbors Classifier,2,0.2,0.940677966101695,0.9322052677504093,0.21770143508911133,0.9322052677504093
281,11,SVC Classifier,2,0.2,0.8135593220338984,1.0,0.3177781105041504,0.0
282,11,Decision Tree,2,0.2,0.9067796610169492,0.8521139693113023,0.09785199165344238,0.8521139693113023
283,11,RandomForest,2,0.2,0.8135593220338984,1.0,0.5029911994934082,0.0
284,11,AdaBoost (Discrete),2,0.2,0.9491525423728814,0.860595152845891,36.77868676185608,0.860595152845891
285,11,AdaBoost (Real),2,0.2,0.864406779661017,1.0,43.96077871322632,0.0
286,11,Logistic Regression (Penalty = L2),2,0.2,0.9661016949152542,0.9609668960083467,0.2908785343170166,0.9609668960083467
287,11,Naive Bayes,2,0.2,0.8305084745762712,0.73143266284911,0.20520782470703125,0.73143266284911
288,12,KNeighbors Classifier,0,0.2,0.44166666666666665,1.0,0.1034400463104248,0.0
289,12,SVC Classifier,0,0.2,0.30833333333333335,1.0,0.10740089416503906,0.0
290,12,Decision Tree,0,0.2,0.44166666666666665,1.0,0.10548901557922363,0.0
291,12,RandomForest,0,0.2,0.44166666666666665,1.0,0.6466872692108154,0.0
292,12,AdaBoost (Discrete),0,0.2,0.44166666666666665,1.0,36.281224727630615,0.0
293,12,AdaBoost (Real),0,0.2,0.4083333333333333,0.30597585258541515,42.98829793930054,0.0
294,12,Logistic Regression (Penalty = L2),0,0.2,0.44166666666666665,1.0,0.11368846893310547,0.0
295,12,Naive Bayes,0,0.2,0.44166666666666665,1.0,0.002262592315673828,0.0
296,12,KNeighbors Classifier,1,0.2,0.3,1.0,0.10685038566589355,0.0
297,12,SVC Classifier,1,0.2,0.30833333333333335,1.0,0.10840487480163574,0.0
298,12,Decision Tree,1,0.2,0.44166666666666665,1.0,0.0010766983032226562,0.0
299,12,RandomForest,1,0.2,0.44166666666666665,1.0,0.7583997249603271,0.0
300,12,AdaBoost (Discrete),1,0.2,0.44166666666666665,1.0,38.500996112823486,0.0
301,12,AdaBoost (Real),1,0.2,0.38333333333333336,0.27516060407455223,42.28266644477844,0.0
302,12,Logistic Regression (Penalty = L2),1,0.2,0.44166666666666665,1.0,0.10690760612487793,0.0
303,12,Naive Bayes,1,0.2,0.44166666666666665,1.0,0.10424971580505371,0.0
304,12,KNeighbors Classifier,2,0.2,0.4491525423728814,1.0,0.10277700424194336,0.0
305,12,SVC Classifier,2,0.2,0.3135593220338983,1.0,0.10331201553344727,0.0
306,12,Decision Tree,2,0.2,0.4491525423728814,1.0,0.10120344161987305,0.0
307,12,RandomForest,2,0.2,0.4491525423728814,1.0,0.5219724178314209,0.0
308,12,AdaBoost (Discrete),2,0.2,0.3983050847457627,0.7905694150420949,32.07601046562195,0.0
309,12,AdaBoost (Real),2,0.2,0.3983050847457627,0.7905694150420949,40.49644684791565,0.0
310,12,Logistic Regression (Penalty = L2),2,0.2,0.4491525423728814,1.0,0.08267784118652344,0.0
311,12,Naive Bayes,2,0.2,0.4491525423728814,1.0,0.10014724731445312,0.0
