,feat_set_id,classifier,fold_id,feat_th,score,geo_score,exec_t,geo_score_woz
0,0,KNeighbors Classifier,0,0.35,0.9845070422535211,0.9764095103624777,0.7987134456634521,0.9764095103624777
1,0,SVC Classifier,0,0.35,0.9098591549295775,0.4530153324120529,0.9070250988006592,0.4530153324120529
2,0,Decision Tree,0,0.35,0.9774647887323944,0.9655975286241347,0.12032198905944824,0.9655975286241347
3,0,RandomForest,0,0.35,0.8732394366197183,0.8287754140107481,0.9864485263824463,0.0
4,0,AdaBoost (Discrete),0,0.35,0.9845070422535211,0.9705393645157323,59.89287757873535,0.9705393645157323
5,0,AdaBoost (Real),0,0.35,0.9661971830985916,0.9657301250182015,82.2789785861969,0.9657301250182015
6,0,Logistic Regression (Penalty = L2),0,0.35,0.9845070422535211,0.973489723170078,0.5584311485290527,0.973489723170078
7,0,Naive Bayes,0,0.35,0.9788732394366197,0.9711153485635676,0.13738059997558594,0.9711153485635676
8,0,KNeighbors Classifier,1,0.35,0.9605077574047954,0.9338867784502106,0.788724422454834,0.9338867784502106
9,0,SVC Classifier,1,0.35,0.9760225669957687,0.9369604361556937,0.9814667701721191,0.9369604361556937
10,0,Decision Tree,1,0.35,0.9576868829337094,0.9292317088069745,0.11552691459655762,0.9292317088069745
11,0,RandomForest,1,0.35,0.8236953455571228,0.33634233212671266,0.7797420024871826,0.33634233212671266
12,0,AdaBoost (Discrete),1,0.35,0.9703808180535967,0.9184735248681712,55.83491516113281,0.9184735248681712
13,0,AdaBoost (Real),1,0.35,0.923836389280677,0.926923049086617,66.93021154403687,0.926923049086617
14,0,Logistic Regression (Penalty = L2),1,0.35,0.9717912552891397,0.9479132502113985,0.37525439262390137,0.9479132502113985
15,0,Naive Bayes,1,0.35,0.7997179125528914,0.8601037713919562,0.11563587188720703,0.8601037713919562
16,0,KNeighbors Classifier,2,0.35,0.9660537482319661,0.9625121172657743,0.5707640647888184,0.9625121172657743
17,0,SVC Classifier,2,0.35,0.9547383309759547,0.8765417770945656,0.8466436862945557,0.8765417770945656
18,0,Decision Tree,2,0.35,0.7892503536067893,0.8703762647757939,0.0991663932800293,0.8703762647757939
19,0,RandomForest,2,0.35,0.5855728429985856,0.6462925242237408,0.8128612041473389,0.6462925242237408
20,0,AdaBoost (Discrete),2,0.35,0.8585572842998586,0.903442650460876,56.84691309928894,0.903442650460876
21,0,AdaBoost (Real),2,0.35,0.7878359264497878,0.8851187090550571,65.87271356582642,0.8851187090550571
22,0,Logistic Regression (Penalty = L2),2,0.35,0.9533239038189534,0.9628984329631445,0.3597533702850342,0.9628984329631445
23,0,Naive Bayes,2,0.35,0.9547383309759547,0.9635105745348659,0.10901594161987305,0.9635105745348659
24,1,KNeighbors Classifier,0,0.35,0.9830985915492958,0.9728972155841619,0.5279302597045898,0.9728972155841619
25,1,SVC Classifier,0,0.35,0.9098591549295775,0.4530153324120529,0.7502472400665283,0.4530153324120529
26,1,Decision Tree,0,0.35,0.9788732394366197,0.9711153485635676,0.1074821949005127,0.9711153485635676
27,1,RandomForest,0,0.35,0.7859154929577464,0.31889640207164033,0.8577466011047363,0.0
28,1,AdaBoost (Discrete),0,0.35,0.8901408450704226,0.4236090741960986,50.75436878204346,0.4236090741960986
29,1,AdaBoost (Real),0,0.35,0.9253521126760563,0.9479556599505218,68.04512929916382,0.9479556599505218
30,1,Logistic Regression (Penalty = L2),0,0.35,0.9845070422535211,0.9705393645157323,0.4752488136291504,0.9705393645157323
31,1,Naive Bayes,0,0.35,0.9492957746478873,0.9750961659762587,0.1406538486480713,0.9750961659762587
32,1,KNeighbors Classifier,1,0.35,0.9746121297602257,0.9331360652822656,0.6086328029632568,0.9331360652822656
33,1,SVC Classifier,1,0.35,0.9760225669957687,0.9369604361556937,1.058570146560669,0.9369604361556937
34,1,Decision Tree,1,0.35,0.9830747531734838,0.9586977317254218,0.0025942325592041016,0.9586977317254218
35,1,RandomForest,1,0.35,0.7997179125528914,0.5042194840896107,0.8606059551239014,0.0
36,1,AdaBoost (Discrete),1,0.35,0.8998589562764457,0.6621963893509659,62.17983531951904,0.6621963893509659
37,1,AdaBoost (Real),1,0.35,0.8829337094499294,0.904020943820164,76.19271111488342,0.904020943820164
38,1,Logistic Regression (Penalty = L2),1,0.35,0.9760225669957687,0.9369604361556937,0.4579329490661621,0.9369604361556937
39,1,Naive Bayes,1,0.35,0.8702397743300423,0.9338451038203882,0.12933945655822754,0.9338451038203882
40,1,KNeighbors Classifier,2,0.35,0.9773691654879774,0.9732008344513453,0.8900878429412842,0.9732008344513453
41,1,SVC Classifier,2,0.35,0.9915134370579916,0.9791605716903751,1.1280865669250488,0.9791605716903751
42,1,Decision Tree,2,0.35,0.9646393210749646,0.9648585335823322,0.13938212394714355,0.9648585335823322
43,1,RandomForest,2,0.35,0.8486562942008486,0.7071067811865476,1.2001373767852783,0.0
44,1,AdaBoost (Discrete),2,0.35,0.8458274398868458,0.9190976999002275,62.28784966468811,0.9190976999002275
45,1,AdaBoost (Real),2,0.35,0.9618104667609618,0.9423841267991937,78.87764739990234,0.9423841267991937
46,1,Logistic Regression (Penalty = L2),2,0.35,0.9915134370579916,0.9791605716903751,0.480879545211792,0.9791605716903751
47,1,Naive Bayes,2,0.35,0.8458274398868458,0.9190976999002275,0.13681507110595703,0.9190976999002275
48,2,KNeighbors Classifier,0,0.35,0.9845070422535211,0.9705393645157323,0.6658945083618164,0.9705393645157323
49,2,SVC Classifier,0,0.35,0.9014084507042254,0.9561361361937124,1.0902180671691895,0.0
50,2,Decision Tree,0,0.35,0.9830985915492958,0.9699497292767263,0.002933025360107422,0.9699497292767263
51,2,RandomForest,0,0.35,0.8985915492957747,0.945570771714881,1.086127758026123,0.0
52,2,AdaBoost (Discrete),0,0.35,0.9549295774647887,0.9368849558186243,62.64039659500122,0.9368849558186243
53,2,AdaBoost (Real),0,0.35,0.8929577464788733,0.6469290948388514,76.91114139556885,0.6469290948388514
54,2,Logistic Regression (Penalty = L2),0,0.35,0.9845070422535211,0.9705393645157323,0.4512805938720703,0.9705393645157323
55,2,Naive Bayes,0,0.35,0.9605633802816902,0.9773746456826605,0.13675808906555176,0.9773746456826605
56,2,KNeighbors Classifier,1,0.35,0.9760225669957687,0.9369604361556937,0.8179731369018555,0.9369604361556937
57,2,SVC Classifier,1,0.35,0.9153737658674189,0.5969560271087193,1.0852360725402832,0.5969560271087193
58,2,Decision Tree,1,0.35,0.9732016925246827,0.9260645593994205,0.002981901168823242,0.9260645593994205
59,2,RandomForest,1,0.35,0.8913963328631875,0.9035079029052513,0.9497847557067871,0.0
60,2,AdaBoost (Discrete),1,0.35,0.9520451339915373,0.8618273173489894,62.77392935752869,0.8618273173489894
61,2,AdaBoost (Real),1,0.35,0.9464033850493653,0.8507970841159783,75.26636981964111,0.8507970841159783
62,2,Logistic Regression (Penalty = L2),1,0.35,0.9760225669957687,0.9369604361556937,0.38903093338012695,0.9369604361556937
63,2,Naive Bayes,1,0.35,0.8716502115655853,0.9025094468855485,0.25333595275878906,0.9025094468855485
64,2,KNeighbors Classifier,2,0.35,0.9915134370579916,0.9791605716903751,0.9312305450439453,0.9791605716903751
65,2,SVC Classifier,2,0.35,0.9094766619519095,0.9689042833036098,1.064713478088379,0.0
66,2,Decision Tree,2,0.35,0.9801980198019802,0.9743986213026035,0.13090801239013672,0.9743986213026035
67,2,RandomForest,2,0.35,0.8882602545968883,0.8864052604279183,0.7900035381317139,0.0
68,2,AdaBoost (Discrete),2,0.35,0.7015558698727016,0.8269569436890288,60.180986642837524,0.8269569436890288
69,2,AdaBoost (Real),2,0.35,0.9646393210749646,0.9706588048073671,76.43287396430969,0.9706588048073671
70,2,Logistic Regression (Penalty = L2),2,0.35,0.9915134370579916,0.9791605716903751,0.4436147212982178,0.9791605716903751
71,2,Naive Bayes,2,0.35,0.8500707213578501,0.9211538537326226,0.13260889053344727,0.9211538537326226
72,3,KNeighbors Classifier,0,0.35,0.9845070422535211,0.9705393645157323,0.7996320724487305,0.9705393645157323
73,3,SVC Classifier,0,0.35,0.9098591549295775,0.4530153324120529,0.8535575866699219,0.4530153324120529
74,3,Decision Tree,0,0.35,0.9845070422535211,0.9705393645157323,0.0029997825622558594,0.9705393645157323
75,3,RandomForest,0,0.35,0.8901408450704226,0.4236090741960986,0.9634780883789062,0.4236090741960986
76,3,AdaBoost (Discrete),0,0.35,0.8901408450704226,0.4236090741960986,66.02816224098206,0.4236090741960986
77,3,AdaBoost (Real),0,0.35,0.9845070422535211,0.9705393645157323,76.78098320960999,0.9705393645157323
78,3,Logistic Regression (Penalty = L2),0,0.35,0.9845070422535211,0.9705393645157323,0.30371832847595215,0.9705393645157323
79,3,Naive Bayes,0,0.35,0.9845070422535211,0.9705393645157323,0.1409471035003662,0.9705393645157323
80,3,KNeighbors Classifier,1,0.35,0.8208744710860366,0.9096412491918122,0.8403916358947754,0.9096412491918122
81,3,SVC Classifier,1,0.35,0.9760225669957687,0.9369604361556937,0.9804050922393799,0.9369604361556937
82,3,Decision Tree,1,0.35,0.9760225669957687,0.9369604361556937,0.002283811569213867,0.9369604361556937
83,3,RandomForest,1,0.35,0.9337094499294781,0.7927843292491847,0.9517903327941895,0.7927843292491847
84,3,AdaBoost (Discrete),1,0.35,0.9760225669957687,0.9369604361556937,59.40829253196716,0.9369604361556937
85,3,AdaBoost (Real),1,0.35,0.9760225669957687,0.9369604361556937,76.2627055644989,0.9369604361556937
86,3,Logistic Regression (Penalty = L2),1,0.35,0.9760225669957687,0.9369604361556937,0.39011502265930176,0.9369604361556937
87,3,Naive Bayes,1,0.35,0.7997179125528914,0.8601037713919562,0.1441488265991211,0.8601037713919562
88,3,KNeighbors Classifier,2,0.35,0.8161244695898161,0.9069233755262746,0.9579277038574219,0.9069233755262746
89,3,SVC Classifier,2,0.35,0.9391796322489392,0.8248573930653896,0.8374667167663574,0.8248573930653896
90,3,Decision Tree,2,0.35,0.9915134370579916,0.9791605716903751,0.13893508911132812,0.9791605716903751
91,3,RandomForest,2,0.35,0.9391796322489392,0.8248573930653896,0.9598367214202881,0.8248573930653896
92,3,AdaBoost (Discrete),2,0.35,0.9391796322489392,0.8248573930653896,59.20546889305115,0.8248573930653896
93,3,AdaBoost (Real),2,0.35,0.9915134370579916,0.9791605716903751,67.04430890083313,0.9791605716903751
94,3,Logistic Regression (Penalty = L2),2,0.35,0.9915134370579916,0.9791605716903751,0.16488003730773926,0.9791605716903751
95,3,Naive Bayes,2,0.35,0.8118811881188119,0.897274522572626,0.03061366081237793,0.897274522572626
96,4,KNeighbors Classifier,0,0.35,0.976056338028169,0.9364568572363935,0.3354983329772949,0.9364568572363935
97,4,SVC Classifier,0,0.35,0.9014084507042254,0.9561361361937124,0.3414320945739746,0.0
98,4,Decision Tree,0,0.35,0.976056338028169,0.9364568572363935,0.046805620193481445,0.9364568572363935
99,4,RandomForest,0,0.35,0.8816901408450705,0.864566219253764,0.5429739952087402,0.0
100,4,AdaBoost (Discrete),0,0.35,0.976056338028169,0.9364568572363935,41.509177684783936,0.9364568572363935
101,4,AdaBoost (Real),0,0.35,0.976056338028169,0.9364568572363935,66.96600699424744,0.9364568572363935
102,4,Logistic Regression (Penalty = L2),0,0.35,0.976056338028169,0.9364568572363935,0.24716734886169434,0.9364568572363935
103,4,Naive Bayes,0,0.35,0.8309859154929577,0.901515639968813,0.11595940589904785,0.901515639968813
104,4,KNeighbors Classifier,1,0.35,0.9167842031029619,0.6099373790634576,0.8906092643737793,0.6099373790634576
105,4,SVC Classifier,1,0.35,0.9153737658674189,0.5969560271087193,0.7652525901794434,0.5969560271087193
106,4,Decision Tree,1,0.35,0.9167842031029619,0.6099373790634576,0.0018067359924316406,0.6099373790634576
107,4,RandomForest,1,0.35,0.8730606488011283,0.8268454930564446,0.862363338470459,0.0
108,4,AdaBoost (Discrete),1,0.35,0.9167842031029619,0.6099373790634576,55.745407819747925,0.6099373790634576
109,4,AdaBoost (Real),1,0.35,0.9167842031029619,0.6099373790634576,64.77450275421143,0.6099373790634576
110,4,Logistic Regression (Penalty = L2),1,0.35,0.9167842031029619,0.6099373790634576,0.24190735816955566,0.6099373790634576
111,4,Naive Bayes,1,0.35,0.7997179125528914,0.8601037713919562,0.12445688247680664,0.8601037713919562
112,4,KNeighbors Classifier,2,0.35,0.8118811881188119,0.897274522572626,1.0079455375671387,0.897274522572626
113,4,SVC Classifier,2,0.35,0.8571428571428571,0.7491491772643939,0.7289412021636963,0.0
114,4,Decision Tree,2,0.35,0.9165487977369166,0.4325482780699497,0.149674654006958,0.4325482780699497
115,4,RandomForest,2,0.35,0.8571428571428571,0.7491491772643939,0.7693591117858887,0.0
116,4,AdaBoost (Discrete),2,0.35,0.9165487977369166,0.4325482780699497,54.06236481666565,0.4325482780699497
117,4,AdaBoost (Real),2,0.35,0.9165487977369166,0.4325482780699497,68.24016737937927,0.4325482780699497
118,4,Logistic Regression (Penalty = L2),2,0.35,0.9165487977369166,0.4325482780699497,0.28779029846191406,0.4325482780699497
119,4,Naive Bayes,2,0.35,0.8118811881188119,0.897274522572626,0.14906644821166992,0.897274522572626
120,5,KNeighbors Classifier,0,0.35,0.9845070422535211,0.9705393645157323,0.7325150966644287,0.9705393645157323
121,5,SVC Classifier,0,0.35,0.9014084507042254,0.9561361361937124,1.1035466194152832,0.0
122,5,Decision Tree,0,0.35,0.9802816901408451,0.9687683033459089,0.002947092056274414,0.9687683033459089
123,5,RandomForest,0,0.35,0.8985915492957747,0.945570771714881,1.1584208011627197,0.0
124,5,AdaBoost (Discrete),0,0.35,0.9112676056338028,0.938875132421968,63.96023154258728,0.938875132421968
125,5,AdaBoost (Real),0,0.35,0.847887323943662,0.5668961904507401,77.39577388763428,0.5668961904507401
126,5,Logistic Regression (Penalty = L2),0,0.35,0.9845070422535211,0.9705393645157323,0.3782370090484619,0.9705393645157323
127,5,Naive Bayes,0,0.35,0.9492957746478873,0.9750961659762587,0.003213167190551758,0.9750961659762587
128,5,KNeighbors Classifier,1,0.35,0.9760225669957687,0.9369604361556937,0.7311139106750488,0.9369604361556937
129,5,SVC Classifier,1,0.35,0.9153737658674189,0.5969560271087193,0.9221086502075195,0.5969560271087193
130,5,Decision Tree,1,0.35,0.9562764456981664,0.863228482207271,0.130812406539917,0.863228482207271
131,5,RandomForest,1,0.35,0.8730606488011283,0.8268454930564446,0.9326877593994141,0.0
132,5,AdaBoost (Discrete),1,0.35,0.9548660084626234,0.8627059466787352,61.10750102996826,0.8627059466787352
133,5,AdaBoost (Real),1,0.35,0.9562764456981664,0.8601811287047711,75.94844198226929,0.8601811287047711
134,5,Logistic Regression (Penalty = L2),1,0.35,0.9760225669957687,0.9369604361556937,0.42609572410583496,0.9369604361556937
135,5,Naive Bayes,1,0.35,0.8617771509167842,0.9004645697475525,0.13305163383483887,0.9004645697475525
136,5,KNeighbors Classifier,2,0.35,0.9915134370579916,0.9791605716903751,0.6786994934082031,0.9791605716903751
137,5,SVC Classifier,2,0.35,0.9094766619519095,0.9689042833036098,0.9991252422332764,0.0
138,5,Decision Tree,2,0.35,0.9915134370579916,0.9791605716903751,0.13054227828979492,0.9791605716903751
139,5,RandomForest,2,0.35,0.85997171145686,0.762648446573665,0.9322867393493652,0.0
140,5,AdaBoost (Discrete),2,0.35,0.9915134370579916,0.9791605716903751,60.97525763511658,0.9791605716903751
141,5,AdaBoost (Real),2,0.35,0.9222065063649222,0.7598842795900652,81.56746649742126,0.7598842795900652
142,5,Logistic Regression (Penalty = L2),2,0.35,0.9915134370579916,0.9791605716903751,0.542264461517334,0.9791605716903751
143,5,Naive Bayes,2,0.35,0.8458274398868458,0.9190976999002275,0.17194294929504395,0.9190976999002275
144,6,KNeighbors Classifier,0,0.35,0.9633802816901409,0.975852571572816,2.06011700630188,0.975852571572816
145,6,SVC Classifier,0,0.35,0.9098591549295775,0.4530153324120529,1.118598461151123,0.4530153324120529
146,6,Decision Tree,0,0.35,0.9845070422535211,0.9705393645157323,0.24126172065734863,0.9705393645157323
147,6,RandomForest,0,0.35,0.8929577464788733,0.42739149821032907,1.308178424835205,0.42739149821032907
148,6,AdaBoost (Discrete),0,0.35,0.8901408450704226,0.4236090741960986,76.43214106559753,0.4236090741960986
149,6,AdaBoost (Real),0,0.35,0.9788732394366197,0.968176508266845,83.15898370742798,0.968176508266845
150,6,Logistic Regression (Penalty = L2),0,0.35,0.9845070422535211,0.9705393645157323,0.4696674346923828,0.9705393645157323
151,6,Naive Bayes,0,0.35,0.9492957746478873,0.9750961659762587,0.26932191848754883,0.9750961659762587
152,6,KNeighbors Classifier,1,0.35,0.9337094499294781,0.9067698228530378,1.6278862953186035,0.9067698228530378
153,6,SVC Classifier,1,0.35,0.9760225669957687,0.9369604361556937,1.1968715190887451,0.9369604361556937
154,6,Decision Tree,1,0.35,0.9576868829337094,0.866766343390965,0.0024569034576416016,0.866766343390965
155,6,RandomForest,1,0.35,0.9337094499294781,0.7927843292491847,1.1727931499481201,0.7927843292491847
156,6,AdaBoost (Discrete),1,0.35,0.8702397743300423,0.9338451038203882,69.88473272323608,0.9338451038203882
157,6,AdaBoost (Real),1,0.35,0.9703808180535967,0.9314425296811908,80.96718382835388,0.9314425296811908
158,6,Logistic Regression (Penalty = L2),1,0.35,0.9760225669957687,0.9369604361556937,0.49093031883239746,0.9369604361556937
159,6,Naive Bayes,1,0.35,0.8702397743300423,0.9338451038203882,0.1566162109375,0.9338451038203882
160,6,KNeighbors Classifier,2,0.35,0.9632248939179632,0.9492159359996014,1.657409906387329,0.9492159359996014
161,6,SVC Classifier,2,0.35,0.9915134370579916,0.9791605716903751,0.8903076648712158,0.9791605716903751
162,6,Decision Tree,2,0.35,0.9915134370579916,0.9791605716903751,0.1501014232635498,0.9791605716903751
163,6,RandomForest,2,0.35,0.7793493635077794,1.0,1.1935715675354004,0.0
164,6,AdaBoost (Discrete),2,0.35,0.8458274398868458,0.9190976999002275,66.65217280387878,0.9190976999002275
165,6,AdaBoost (Real),2,0.35,0.7213578500707214,0.8563895954759119,82.19213843345642,0.8563895954759119
166,6,Logistic Regression (Penalty = L2),2,0.35,0.9915134370579916,0.9791605716903751,0.48589038848876953,0.9791605716903751
167,6,Naive Bayes,2,0.35,0.8458274398868458,0.9190976999002275,0.19225597381591797,0.9190976999002275
168,7,KNeighbors Classifier,0,0.35,0.9845070422535211,0.9792992186394924,1.8275935649871826,0.9792992186394924
169,7,SVC Classifier,0,0.35,0.9098591549295775,0.4530153324120529,1.2599334716796875,0.4530153324120529
170,7,Decision Tree,0,0.35,0.9197183098591549,0.7798664577400647,0.14012455940246582,0.7798664577400647
171,7,RandomForest,0,0.35,0.823943661971831,0.28832365613754857,0.9907965660095215,0.28832365613754857
172,7,AdaBoost (Discrete),0,0.35,0.9845070422535211,0.9705393645157323,77.24862217903137,0.9705393645157323
173,7,AdaBoost (Real),0,0.35,0.9859154929577465,0.9740815103815855,90.4722101688385,0.9740815103815855
174,7,Logistic Regression (Penalty = L2),0,0.35,0.9859154929577465,0.9740815103815855,0.7914037704467773,0.9740815103815855
175,7,Naive Bayes,0,0.35,0.9605633802816902,0.9746212105531656,0.19200730323791504,0.9746212105531656
176,7,KNeighbors Classifier,1,0.35,0.9619181946403385,0.9376223653311077,2.2784857749938965,0.9376223653311077
177,7,SVC Classifier,1,0.35,0.9760225669957687,0.9369604361556937,1.8855078220367432,0.9369604361556937
178,7,Decision Tree,1,0.35,0.9647390691114246,0.914542095846819,0.2068469524383545,0.914542095846819
179,7,RandomForest,1,0.35,0.8913963328631875,0.5426643535239394,1.2666542530059814,0.5426643535239394
180,7,AdaBoost (Discrete),1,0.35,0.9703808180535967,0.9184735248681712,80.0554347038269,0.9184735248681712
181,7,AdaBoost (Real),1,0.35,0.8730606488011283,0.8933176088098207,95.2735378742218,0.8933176088098207
182,7,Logistic Regression (Penalty = L2),1,0.35,0.9689703808180536,0.952862543158879,0.6819238662719727,0.952862543158879
183,7,Naive Bayes,1,0.35,0.9055007052186178,0.9451072564148725,0.13339996337890625,0.9451072564148725
184,7,KNeighbors Classifier,2,0.35,0.9660537482319661,0.9625121172657743,1.3426024913787842,0.9625121172657743
185,7,SVC Classifier,2,0.35,0.9915134370579916,0.9791605716903751,1.298938512802124,0.9791605716903751
186,7,Decision Tree,2,0.35,0.7637906647807637,0.8288906966221539,0.002446889877319336,0.8288906966221539
187,7,RandomForest,2,0.35,0.8925035360678925,0.6414247741349381,1.2447984218597412,0.6414247741349381
188,7,AdaBoost (Discrete),2,0.35,0.768033946251768,0.8490118293125583,75.05896854400635,0.8490118293125583
189,7,AdaBoost (Real),2,0.35,0.8048090523338048,0.8937335444471806,83.44293308258057,0.8937335444471806
190,7,Logistic Regression (Penalty = L2),2,0.35,0.8783592644978784,0.9292737868297294,0.5159366130828857,0.9292737868297294
191,7,Naive Bayes,2,0.35,0.8514851485148515,0.9218372025394211,0.25368452072143555,0.9218372025394211
192,8,KNeighbors Classifier,0,0.35,0.976056338028169,0.9364568572363935,0.4422037601470947,0.9364568572363935
193,8,SVC Classifier,0,0.35,0.9014084507042254,0.9561361361937124,0.7050900459289551,0.0
194,8,Decision Tree,0,0.35,0.976056338028169,0.9364568572363935,0.11818718910217285,0.9364568572363935
195,8,RandomForest,0,0.35,0.9014084507042254,0.9561361361937124,0.8046813011169434,0.0
196,8,AdaBoost (Discrete),0,0.35,0.976056338028169,0.9364568572363935,50.93643045425415,0.9364568572363935
197,8,AdaBoost (Real),0,0.35,0.976056338028169,0.9364568572363935,57.43775749206543,0.9364568572363935
198,8,Logistic Regression (Penalty = L2),0,0.35,0.976056338028169,0.9364568572363935,0.21975064277648926,0.9364568572363935
199,8,Naive Bayes,0,0.35,0.8309859154929577,0.901515639968813,0.12858843803405762,0.901515639968813
200,8,KNeighbors Classifier,1,0.35,0.7997179125528914,0.8601037713919562,0.6503691673278809,0.8601037713919562
201,8,SVC Classifier,1,0.35,0.9153737658674189,0.5969560271087193,0.734412670135498,0.5969560271087193
202,8,Decision Tree,1,0.35,0.9153737658674189,0.5969560271087193,0.09548139572143555,0.5969560271087193
203,8,RandomForest,1,0.35,0.9153737658674189,0.5969560271087193,0.7707505226135254,0.5969560271087193
204,8,AdaBoost (Discrete),1,0.35,0.9153737658674189,0.5969560271087193,46.59921932220459,0.5969560271087193
205,8,AdaBoost (Real),1,0.35,0.9153737658674189,0.5969560271087193,58.14401650428772,0.5969560271087193
206,8,Logistic Regression (Penalty = L2),1,0.35,0.9153737658674189,0.5969560271087193,0.22234773635864258,0.5969560271087193
207,8,Naive Bayes,1,0.35,0.7997179125528914,0.8601037713919562,0.1385481357574463,0.8601037713919562
208,8,KNeighbors Classifier,2,0.35,0.8118811881188119,0.897274522572626,0.5916533470153809,0.897274522572626
209,8,SVC Classifier,2,0.35,0.8571428571428571,0.7491491772643939,0.7130448818206787,0.0
210,8,Decision Tree,2,0.35,0.9094766619519095,0.9689042833036098,0.11854219436645508,0.0
211,8,RandomForest,2,0.35,0.9094766619519095,0.9689042833036098,0.720191478729248,0.0
212,8,AdaBoost (Discrete),2,0.35,0.9094766619519095,0.9689042833036098,46.689995527267456,0.0
213,8,AdaBoost (Real),2,0.35,0.9094766619519095,0.9689042833036098,59.17242670059204,0.0
214,8,Logistic Regression (Penalty = L2),2,0.35,0.9094766619519095,0.9689042833036098,0.26327943801879883,0.0
215,8,Naive Bayes,2,0.35,0.8118811881188119,0.897274522572626,0.13082194328308105,0.897274522572626
