,feat_set_id,classifier,fold_id,feat_th,score,geo_score,exec_t,geo_score_woz
0,0,KNeighbors Classifier,0,0.45,0.8050389922015597,0.8050757694429519,8.92166256904602,0.8050757694429519
1,0,SVC Classifier,0,0.45,0.8458308338332333,0.8399224251202422,10.899205684661865,0.8399224251202422
2,0,Decision Tree,0,0.45,0.7516496700659868,0.751562057072619,0.34828758239746094,0.751562057072619
3,0,RandomForest,0,0.45,0.7786442711457708,0.7640520615722939,1.0540385246276855,0.7640520615722939
4,0,AdaBoost (Discrete),0,0.45,0.8260347930413917,0.8258882495332922,157.560959815979,0.8258882495332922
5,0,AdaBoost (Real),0,0.45,0.8176364727054589,0.8160543364468474,154.0600655078888,0.8160543364468474
6,0,Logistic Regression (Penalty = L2),0,0.45,0.8710257948410318,0.8708648405026632,0.8199799060821533,0.8708648405026632
7,0,Naive Bayes,0,0.45,0.7966406718656269,0.7722988305981778,0.17249488830566406,0.7722988305981778
8,0,KNeighbors Classifier,1,0.45,0.8044391121775645,0.8044182150383872,8.294886350631714,0.8044182150383872
9,0,SVC Classifier,1,0.45,0.8470305938812237,0.8417326059785692,9.40672516822815,0.8417326059785692
10,0,Decision Tree,1,0.45,0.7354529094181164,0.7353930637797055,0.32361555099487305,0.7353930637797055
11,0,RandomForest,1,0.45,0.734253149370126,0.711984554503961,0.8841197490692139,0.711984554503961
12,0,AdaBoost (Discrete),1,0.45,0.8254349130173965,0.8249880357696427,147.87518119812012,0.8249880357696427
13,0,AdaBoost (Real),1,0.45,0.8314337132573485,0.830684266902722,156.06498336791992,0.830684266902722
14,0,Logistic Regression (Penalty = L2),1,0.45,0.8578284343131374,0.8577875492935649,0.6423029899597168,0.8577875492935649
15,0,Naive Bayes,1,0.45,0.7948410317936413,0.7701300911738364,0.13242840766906738,0.7701300911738364
16,0,KNeighbors Classifier,2,0.45,0.8331332533013205,0.8329469220153403,7.395485162734985,0.8329469220153403
17,0,SVC Classifier,2,0.45,0.8619447779111644,0.8561337394325859,9.362225770950317,0.8561337394325859
18,0,Decision Tree,2,0.45,0.7376950780312125,0.737739278384919,0.3051333427429199,0.737739278384919
19,0,RandomForest,2,0.45,0.773109243697479,0.7535648287585782,0.918428897857666,0.7535648287585782
20,0,AdaBoost (Discrete),2,0.45,0.8481392557022809,0.8475308710703804,146.0618188381195,0.8475308710703804
21,0,AdaBoost (Real),2,0.45,0.8463385354141657,0.8440702192546918,161.12915015220642,0.8440702192546918
22,0,Logistic Regression (Penalty = L2),2,0.45,0.8769507803121248,0.8768999496421181,0.588759183883667,0.8768999496421181
23,0,Naive Bayes,2,0.45,0.8073229291716687,0.7816745845235983,0.2727930545806885,0.7816745845235983
24,1,KNeighbors Classifier,0,0.45,0.8152369526094781,0.8151787706107164,8.274721384048462,0.8151787706107164
25,1,SVC Classifier,0,0.45,0.8482303539292142,0.8425196564575843,8.739553451538086,0.8425196564575843
26,1,Decision Tree,0,0.45,0.7498500299940012,0.7498541619636552,0.3044557571411133,0.7498541619636552
27,1,RandomForest,0,0.45,0.7786442711457708,0.7640520615722939,0.8408761024475098,0.7640520615722939
28,1,AdaBoost (Discrete),0,0.45,0.8212357528494301,0.8211838514080531,141.16857314109802,0.8211838514080531
29,1,AdaBoost (Real),0,0.45,0.8212357528494301,0.820798220910129,154.49761819839478,0.820798220910129
30,1,Logistic Regression (Penalty = L2),0,0.45,0.8728254349130175,0.8727602465480838,0.6420660018920898,0.8727602465480838
31,1,Naive Bayes,0,0.45,0.8032393521295741,0.7773611383894924,0.15125727653503418,0.7773611383894924
32,1,KNeighbors Classifier,1,0.45,0.8056388722255549,0.8055217815345657,7.911037445068359,0.8055217815345657
33,1,SVC Classifier,1,0.45,0.8482303539292142,0.8425287994978958,8.863164186477661,0.8425287994978958
34,1,Decision Tree,1,0.45,0.7390521895620876,0.7390257132977556,0.3826014995574951,0.7390257132977556
35,1,RandomForest,1,0.45,0.734253149370126,0.711984554503961,0.8210809230804443,0.711984554503961
36,1,AdaBoost (Discrete),1,0.45,0.8350329934013198,0.8349189229645202,139.73916029930115,0.8349189229645202
37,1,AdaBoost (Real),1,0.45,0.8224355128974206,0.8213194353896294,154.18042469024658,0.8213194353896294
38,1,Logistic Regression (Penalty = L2),1,0.45,0.862627474505099,0.8625316416253805,0.5813345909118652,0.8625316416253805
39,1,Naive Bayes,1,0.45,0.7936412717456509,0.7698474149835463,0.1960153579711914,0.7698474149835463
40,1,KNeighbors Classifier,2,0.45,0.8127250900360145,0.8124991780099866,8.162490367889404,0.8124991780099866
41,1,SVC Classifier,2,0.45,0.8571428571428571,0.8509129044766651,9.191937446594238,0.8509129044766651
42,1,Decision Tree,2,0.45,0.7436974789915967,0.7437061935357675,0.29845523834228516,0.7437061935357675
43,1,RandomForest,2,0.45,0.773109243697479,0.7535648287585782,0.8447530269622803,0.7535648287585782
44,1,AdaBoost (Discrete),2,0.45,0.84093637454982,0.8399571731913221,140.2474353313446,0.8399571731913221
45,1,AdaBoost (Real),2,0.45,0.8421368547418968,0.8393840978844875,156.12397837638855,0.8393840978844875
46,1,Logistic Regression (Penalty = L2),2,0.45,0.8745498199279712,0.8745152913192127,0.6300218105316162,0.8745152913192127
47,1,Naive Bayes,2,0.45,0.8091236494597839,0.7824196189553729,0.15577149391174316,0.7824196189553729
48,2,KNeighbors Classifier,0,0.45,0.7666466706658668,0.7659414518089217,9.47215461730957,0.7659414518089217
49,2,SVC Classifier,0,0.45,0.8062387522495501,0.789535946546823,10.221415758132935,0.789535946546823
50,2,Decision Tree,0,0.45,0.7108578284343131,0.7106377661603752,0.3299391269683838,0.7106377661603752
51,2,RandomForest,0,0.45,0.7384523095380924,0.7261977580097427,0.8390414714813232,0.7261977580097427
52,2,AdaBoost (Discrete),0,0.45,0.7918416316736653,0.7904931013435258,141.01974987983704,0.7904931013435258
53,2,AdaBoost (Real),0,0.45,0.7774445110977805,0.7756084704971095,155.50607824325562,0.7756084704971095
54,2,Logistic Regression (Penalty = L2),0,0.45,0.8404319136172765,0.8400743811708148,0.5854923725128174,0.8400743811708148
55,2,Naive Bayes,0,0.45,0.7624475104979004,0.7225637247644501,0.15967178344726562,0.7225637247644501
56,2,KNeighbors Classifier,1,0.45,0.7426514697060588,0.7419050633405635,9.620097398757935,0.7419050633405635
57,2,SVC Classifier,1,0.45,0.8086382723455309,0.7922850694916425,9.75832200050354,0.7922850694916425
58,2,Decision Tree,1,0.45,0.6952609478104379,0.6945063875142745,0.2337803840637207,0.6945063875142745
59,2,RandomForest,1,0.45,0.7336532693461307,0.7056345339133984,0.9677462577819824,0.7056345339133984
60,2,AdaBoost (Discrete),1,0.45,0.7792441511697661,0.7764389656544545,139.53953576087952,0.7764389656544545
61,2,AdaBoost (Real),1,0.45,0.7594481103779244,0.7552991135885727,154.34892058372498,0.7552991135885727
62,2,Logistic Regression (Penalty = L2),1,0.45,0.8320335932813437,0.8314426853337998,0.582883358001709,0.8314426853337998
63,2,Naive Bayes,1,0.45,0.7558488302339532,0.7107119247503302,0.1329951286315918,0.7107119247503302
64,2,KNeighbors Classifier,2,0.45,0.7695078031212484,0.7691086675034038,9.172628402709961,0.7691086675034038
65,2,SVC Classifier,2,0.45,0.8109243697478992,0.7921949753561764,10.171993732452393,0.7921949753561764
66,2,Decision Tree,2,0.45,0.7160864345738295,0.7161262895954994,0.3717632293701172,0.7161262895954994
67,2,RandomForest,2,0.45,0.7364945978391356,0.6968209014665367,0.7703347206115723,0.6968209014665367
68,2,AdaBoost (Discrete),2,0.45,0.790516206482593,0.78817663379029,141.00297617912292,0.78817663379029
69,2,AdaBoost (Real),2,0.45,0.8025210084033614,0.8008717787614209,154.44020318984985,0.8008717787614209
70,2,Logistic Regression (Penalty = L2),2,0.45,0.8355342136854742,0.8353135109255533,0.6432030200958252,0.8353135109255533
71,2,Naive Bayes,2,0.45,0.7683073229291717,0.7225859297014602,0.14921140670776367,0.7225859297014602
72,3,KNeighbors Classifier,0,0.45,0.8050389922015597,0.8050757694429519,7.318671941757202,0.8050757694429519
73,3,SVC Classifier,0,0.45,0.8458308338332333,0.8399224251202422,8.903647184371948,0.8399224251202422
74,3,Decision Tree,0,0.45,0.7534493101379725,0.753428379925585,0.3374321460723877,0.753428379925585
75,3,RandomForest,0,0.45,0.7786442711457708,0.7640520615722939,0.8592572212219238,0.7640520615722939
76,3,AdaBoost (Discrete),0,0.45,0.8272345530893821,0.8270580644814423,136.82611107826233,0.8270580644814423
77,3,AdaBoost (Real),0,0.45,0.8242351529694061,0.8229277730744864,150.3802661895752,0.8229277730744864
78,3,Logistic Regression (Penalty = L2),0,0.45,0.8710257948410318,0.8708648405026632,0.6845231056213379,0.8708648405026632
79,3,Naive Bayes,0,0.45,0.7966406718656269,0.7722988305981778,0.13541626930236816,0.7722988305981778
80,3,KNeighbors Classifier,1,0.45,0.8044391121775645,0.8044182150383872,7.483879566192627,0.8044182150383872
81,3,SVC Classifier,1,0.45,0.8470305938812237,0.8417326059785692,8.704159259796143,0.8417326059785692
82,3,Decision Tree,1,0.45,0.7240551889622076,0.7240819611503299,0.2818598747253418,0.7240819611503299
83,3,RandomForest,1,0.45,0.734253149370126,0.711984554503961,0.8110392093658447,0.711984554503961
84,3,AdaBoost (Discrete),1,0.45,0.8254349130173965,0.8249880357696427,135.89477133750916,0.8249880357696427
85,3,AdaBoost (Real),1,0.45,0.8278344331133773,0.8268326954630046,142.31983017921448,0.8268326954630046
86,3,Logistic Regression (Penalty = L2),1,0.45,0.8578284343131374,0.8577875492935649,0.5028481483459473,0.8577875492935649
87,3,Naive Bayes,1,0.45,0.7948410317936413,0.7701300911738364,0.11228299140930176,0.7701300911738364
88,3,KNeighbors Classifier,2,0.45,0.8331332533013205,0.8329469220153403,6.689191102981567,0.8329469220153403
89,3,SVC Classifier,2,0.45,0.8619447779111644,0.8561337394325859,7.768264532089233,0.8561337394325859
90,3,Decision Tree,2,0.45,0.7683073229291717,0.7681242174684363,0.31913065910339355,0.7681242174684363
91,3,RandomForest,2,0.45,0.773109243697479,0.7535648287585782,0.6384286880493164,0.7535648287585782
92,3,AdaBoost (Discrete),2,0.45,0.8481392557022809,0.8475308710703804,119.85900616645813,0.8475308710703804
93,3,AdaBoost (Real),2,0.45,0.8559423769507803,0.853687201222678,131.6847116947174,0.853687201222678
94,3,Logistic Regression (Penalty = L2),2,0.45,0.8769507803121248,0.8768999496421181,0.5679969787597656,0.8768999496421181
95,3,Naive Bayes,2,0.45,0.8073229291716687,0.7816745845235983,0.0968477725982666,0.7816745845235983
96,4,KNeighbors Classifier,0,0.45,0.8164367126574685,0.8164808567569661,5.5482399463653564,0.8164808567569661
97,4,SVC Classifier,0,0.45,0.853629274145171,0.8486540930306801,7.044229030609131,0.8486540930306801
98,4,Decision Tree,0,0.45,0.74625074985003,0.7461744568874107,0.32274723052978516,0.7461744568874107
99,4,RandomForest,0,0.45,0.7264547090581883,0.7245559753350713,0.704038143157959,0.7245559753350713
100,4,AdaBoost (Discrete),0,0.45,0.8338332333533294,0.8335093354253003,104.56143260002136,0.8335093354253003
101,4,AdaBoost (Real),0,0.45,0.8218356328734253,0.8206122124653796,116.37543153762817,0.8206122124653796
102,4,Logistic Regression (Penalty = L2),0,0.45,0.8680263947210558,0.8679412737812032,0.43692803382873535,0.8679412737812032
103,4,Naive Bayes,0,0.45,0.8038392321535693,0.778210629140312,0.12381124496459961,0.778210629140312
104,4,KNeighbors Classifier,1,0.45,0.8170365926814637,0.8170024428421455,4.784142017364502,0.8170024428421455
105,4,SVC Classifier,1,0.45,0.8482303539292142,0.8425320515254687,6.616415977478027,0.8425320515254687
106,4,Decision Tree,1,0.45,0.7450509898020395,0.744880809387632,0.24415373802185059,0.744880809387632
107,4,RandomForest,1,0.45,0.7264547090581883,0.7246794438348582,0.6888175010681152,0.7246794438348582
108,4,AdaBoost (Discrete),1,0.45,0.826634673065387,0.8263784015931993,102.90646147727966,0.8263784015931993
109,4,AdaBoost (Real),1,0.45,0.8272345530893821,0.8260122005747933,114.14279460906982,0.8260122005747933
110,4,Logistic Regression (Penalty = L2),1,0.45,0.859628074385123,0.859539475931275,0.4502413272857666,0.859539475931275
111,4,Naive Bayes,1,0.45,0.7930413917216557,0.7693497759211634,0.11669611930847168,0.7693497759211634
112,4,KNeighbors Classifier,2,0.45,0.8271308523409364,0.8271544051979021,4.863219976425171,0.8271544051979021
113,4,SVC Classifier,2,0.45,0.8589435774309724,0.8528928839358213,6.976890325546265,0.8528928839358213
114,4,Decision Tree,2,0.45,0.7346938775510204,0.7345749513830534,0.30376529693603516,0.7345749513830534
115,4,RandomForest,2,0.45,0.7779111644657863,0.7746503855794417,0.7200143337249756,0.7746503855794417
116,4,AdaBoost (Discrete),2,0.45,0.8457382953181273,0.8442004347828826,103.3730080127716,0.8442004347828826
117,4,AdaBoost (Real),2,0.45,0.8523409363745498,0.8504543101827164,116.37545967102051,0.8504543101827164
118,4,Logistic Regression (Penalty = L2),2,0.45,0.879951980792317,0.8799110941771492,0.5036883354187012,0.8799110941771492
119,4,Naive Bayes,2,0.45,0.8079231692677071,0.7810449080441171,0.13219308853149414,0.7810449080441171
120,5,KNeighbors Classifier,0,0.45,0.7840431913617276,0.7840397825240314,2.0474605560302734,0.7840397825240314
121,5,SVC Classifier,0,0.45,0.8104379124175165,0.7948989614749511,5.928207159042358,0.7948989614749511
122,5,Decision Tree,0,0.45,0.7336532693461307,0.7336763556071917,0.3354983329772949,0.7336763556071917
123,5,RandomForest,0,0.45,0.7384523095380924,0.7103629462730431,0.7397797107696533,0.7103629462730431
124,5,AdaBoost (Discrete),0,0.45,0.7708458308338332,0.7688811776625317,70.95675349235535,0.7688811776625317
125,5,AdaBoost (Real),0,0.45,0.7840431913617276,0.7833757770215335,81.46950221061707,0.7833757770215335
126,5,Logistic Regression (Penalty = L2),0,0.45,0.8338332333533294,0.8334474618246591,0.38538575172424316,0.8334474618246591
127,5,Naive Bayes,0,0.45,0.7618476304739052,0.7225945997555856,0.09392261505126953,0.7225945997555856
128,5,KNeighbors Classifier,1,0.45,0.7738452309538092,0.7737352774135949,1.9847712516784668,0.7737352774135949
129,5,SVC Classifier,1,0.45,0.8110377924415118,0.7952123138443126,5.374105930328369,0.7952123138443126
130,5,Decision Tree,1,0.45,0.7222555488902219,0.7213491638948573,0.2172410488128662,0.7213491638948573
131,5,RandomForest,1,0.45,0.7330533893221356,0.7137638867048434,0.5951063632965088,0.7137638867048434
132,5,AdaBoost (Discrete),1,0.45,0.7618476304739052,0.7572035953377007,70.28011631965637,0.7572035953377007
133,5,AdaBoost (Real),1,0.45,0.7636472705458909,0.7579848157513828,82.03256273269653,0.7579848157513828
134,5,Logistic Regression (Penalty = L2),1,0.45,0.8326334733053389,0.8319736387269078,0.41975951194763184,0.8319736387269078
135,5,Naive Bayes,1,0.45,0.7588482303539292,0.7146634986745263,0.06663250923156738,0.7146634986745263
136,5,KNeighbors Classifier,2,0.45,0.7965186074429772,0.7963838457672998,1.8029193878173828,0.7963838457672998
137,5,SVC Classifier,2,0.45,0.8115246098439376,0.7945312409213575,5.180234670639038,0.7945312409213575
138,5,Decision Tree,2,0.45,0.7250900360144058,0.724497007543212,0.22239208221435547,0.724497007543212
139,5,RandomForest,2,0.45,0.7400960384153662,0.7077664049096679,0.6286799907684326,0.7077664049096679
140,5,AdaBoost (Discrete),2,0.45,0.7863145258103241,0.779804391225743,70.61090540885925,0.779804391225743
141,5,AdaBoost (Real),2,0.45,0.7893157262905162,0.7860132421227102,81.7603816986084,0.7860132421227102
142,5,Logistic Regression (Penalty = L2),2,0.45,0.8319327731092437,0.8315676600978363,0.36678266525268555,0.8315676600978363
143,5,Naive Bayes,2,0.45,0.7677070828331333,0.721573369973074,0.11841750144958496,0.721573369973074
144,6,KNeighbors Classifier,0,0.45,0.8050389922015597,0.8050757694429519,5.466774940490723,0.8050757694429519
145,6,SVC Classifier,0,0.45,0.8458308338332333,0.8399224251202422,6.682059049606323,0.8399224251202422
146,6,Decision Tree,0,0.45,0.7450509898020395,0.7445752891510363,0.22053074836730957,0.7445752891510363
147,6,RandomForest,0,0.45,0.7786442711457708,0.7640520615722939,0.7386023998260498,0.7640520615722939
148,6,AdaBoost (Discrete),0,0.45,0.8260347930413917,0.8258882495332922,110.2739188671112,0.8258882495332922
149,6,AdaBoost (Real),0,0.45,0.8284343131373725,0.8275128611788365,123.43373036384583,0.8275128611788365
150,6,Logistic Regression (Penalty = L2),0,0.45,0.8710257948410318,0.8708648405026632,0.4909627437591553,0.8708648405026632
151,6,Naive Bayes,0,0.45,0.7966406718656269,0.7722988305981778,0.11665630340576172,0.7722988305981778
152,6,KNeighbors Classifier,1,0.45,0.8044391121775645,0.8044182150383872,6.029955148696899,0.8044182150383872
153,6,SVC Classifier,1,0.45,0.8470305938812237,0.8417326059785692,6.916331768035889,0.8417326059785692
154,6,Decision Tree,1,0.45,0.7246550689862028,0.7246863704135633,0.26450443267822266,0.7246863704135633
155,6,RandomForest,1,0.45,0.734253149370126,0.711984554503961,0.7317118644714355,0.711984554503961
156,6,AdaBoost (Discrete),1,0.45,0.8260347930413917,0.8256168378696133,105.1640293598175,0.8256168378696133
157,6,AdaBoost (Real),1,0.45,0.8278344331133773,0.8273327558018161,115.01899862289429,0.8273327558018161
158,6,Logistic Regression (Penalty = L2),1,0.45,0.8578284343131374,0.8577875492935649,0.4724314212799072,0.8577875492935649
159,6,Naive Bayes,1,0.45,0.7948410317936413,0.7701300911738364,0.11135983467102051,0.7701300911738364
160,6,KNeighbors Classifier,2,0.45,0.8331332533013205,0.8329469220153403,5.7593138217926025,0.8329469220153403
161,6,SVC Classifier,2,0.45,0.8619447779111644,0.8561337394325859,6.7678961753845215,0.8561337394325859
162,6,Decision Tree,2,0.45,0.7352941176470589,0.7353175203713737,0.2745060920715332,0.7353175203713737
163,6,RandomForest,2,0.45,0.773109243697479,0.7535648287585782,0.7657899856567383,0.7535648287585782
164,6,AdaBoost (Discrete),2,0.45,0.8475390156062425,0.8468955403442213,99.25949048995972,0.8468955403442213
165,6,AdaBoost (Real),2,0.45,0.8505402160864346,0.8484729520166814,104.51480317115784,0.8484729520166814
166,6,Logistic Regression (Penalty = L2),2,0.45,0.8769507803121248,0.8768999496421181,0.4245128631591797,0.8768999496421181
167,6,Naive Bayes,2,0.45,0.8073229291716687,0.7816745845235983,0.10715746879577637,0.7816745845235983
168,7,KNeighbors Classifier,0,0.45,0.7756448710257948,0.7754155723534514,2.350909948348999,0.7754155723534514
169,7,SVC Classifier,0,0.45,0.8068386322735452,0.7903617461707331,5.31964635848999,0.7903617461707331
170,7,Decision Tree,0,0.45,0.7180563887222555,0.7177570838509468,0.1761777400970459,0.7177570838509468
171,7,RandomForest,0,0.45,0.7360527894421116,0.7218318075812324,0.6455276012420654,0.7218318075812324
172,7,AdaBoost (Discrete),0,0.45,0.7726454709058188,0.7698519067553672,69.94409894943237,0.7698519067553672
173,7,AdaBoost (Real),0,0.45,0.7636472705458909,0.7573710337847505,79.78909373283386,0.7573710337847505
174,7,Logistic Regression (Penalty = L2),0,0.45,0.8380323935212958,0.837685240290401,0.33361172676086426,0.837685240290401
175,7,Naive Bayes,0,0.45,0.7624475104979004,0.7230769727958781,0.1046910285949707,0.7230769727958781
176,7,KNeighbors Classifier,1,0.45,0.7618476304739052,0.7615612055858877,2.3392415046691895,0.7615612055858877
177,7,SVC Classifier,1,0.45,0.8104379124175165,0.794125800063084,5.187509059906006,0.794125800063084
178,7,Decision Tree,1,0.45,0.7120575884823035,0.7120352993628736,0.15584993362426758,0.7120352993628736
179,7,RandomForest,1,0.45,0.7420515896820636,0.730512292354321,0.6271510124206543,0.730512292354321
180,7,AdaBoost (Discrete),1,0.45,0.767246550689862,0.763806597508972,66.61548519134521,0.763806597508972
181,7,AdaBoost (Real),1,0.45,0.7690461907618477,0.764761840794409,77.9723048210144,0.764761840794409
182,7,Logistic Regression (Penalty = L2),1,0.45,0.8362327534493101,0.8356293237869297,0.3515169620513916,0.8356293237869297
183,7,Naive Bayes,1,0.45,0.7576484703059388,0.71319381603672,0.10753512382507324,0.71319381603672
184,7,KNeighbors Classifier,2,0.45,0.7947178871548619,0.7941346682236144,2.370121955871582,0.7941346682236144
185,7,SVC Classifier,2,0.45,0.8115246098439376,0.7942399449275597,5.422185659408569,0.7942399449275597
186,7,Decision Tree,2,0.45,0.7346938775510204,0.7345210130779088,0.2059330940246582,0.7345210130779088
187,7,RandomForest,2,0.45,0.7418967587034814,0.710245035368406,0.6646931171417236,0.710245035368406
188,7,AdaBoost (Discrete),2,0.45,0.7779111644657863,0.7696667626487007,66.91856408119202,0.7696667626487007
189,7,AdaBoost (Real),2,0.45,0.773109243697479,0.7674075816549544,73.67463040351868,0.7674075816549544
190,7,Logistic Regression (Penalty = L2),2,0.45,0.8361344537815126,0.8357630322806434,0.32236528396606445,0.8357630322806434
191,7,Naive Bayes,2,0.45,0.7677070828331333,0.721573369973074,0.10048699378967285,0.721573369973074
192,8,KNeighbors Classifier,0,0.45,0.8164367126574685,0.8164808567569661,3.8596031665802,0.8164808567569661
193,8,SVC Classifier,0,0.45,0.853629274145171,0.8486540930306801,5.050729990005493,0.8486540930306801
194,8,Decision Tree,0,0.45,0.7366526694661067,0.7366848142615336,0.18458223342895508,0.7366848142615336
195,8,RandomForest,0,0.45,0.7264547090581883,0.7245559753350713,0.5189120769500732,0.7245559753350713
196,8,AdaBoost (Discrete),0,0.45,0.8338332333533294,0.8335093354253003,79.23047184944153,0.8335093354253003
197,8,AdaBoost (Real),0,0.45,0.8272345530893821,0.8267836908817003,86.71206736564636,0.8267836908817003
198,8,Logistic Regression (Penalty = L2),0,0.45,0.8680263947210558,0.8679412737812032,0.3275027275085449,0.8679412737812032
199,8,Naive Bayes,0,0.45,0.8038392321535693,0.778210629140312,0.0872337818145752,0.778210629140312
200,8,KNeighbors Classifier,1,0.45,0.8170365926814637,0.8170024428421455,3.704737901687622,0.8170024428421455
201,8,SVC Classifier,1,0.45,0.8482303539292142,0.8425320515254687,5.0189831256866455,0.8425320515254687
202,8,Decision Tree,1,0.45,0.7384523095380924,0.7383668350279201,0.1777021884918213,0.7383668350279201
203,8,RandomForest,1,0.45,0.7264547090581883,0.7246794438348582,0.5218713283538818,0.7246794438348582
204,8,AdaBoost (Discrete),1,0.45,0.826634673065387,0.8263784015931993,76.86856698989868,0.8263784015931993
205,8,AdaBoost (Real),1,0.45,0.8242351529694061,0.8231021532323678,89.16350531578064,0.8231021532323678
206,8,Logistic Regression (Penalty = L2),1,0.45,0.859628074385123,0.859539475931275,0.36182355880737305,0.859539475931275
207,8,Naive Bayes,1,0.45,0.7930413917216557,0.7693497759211634,0.1039888858795166,0.7693497759211634
208,8,KNeighbors Classifier,2,0.45,0.8271308523409364,0.8271544051979021,3.938598394393921,0.8271544051979021
209,8,SVC Classifier,2,0.45,0.8589435774309724,0.8528928839358213,5.1827168464660645,0.8528928839358213
210,8,Decision Tree,2,0.45,0.7623049219687875,0.762347795717837,0.19341039657592773,0.762347795717837
211,8,RandomForest,2,0.45,0.7779111644657863,0.7746503855794417,0.6209797859191895,0.7746503855794417
212,8,AdaBoost (Discrete),2,0.45,0.8457382953181273,0.8442004347828826,78.13231706619263,0.8442004347828826
213,8,AdaBoost (Real),2,0.45,0.8487394957983193,0.8457275000685004,84.63058567047119,0.8457275000685004
214,8,Logistic Regression (Penalty = L2),2,0.45,0.879951980792317,0.8799110941771492,0.3169436454772949,0.8799110941771492
215,8,Naive Bayes,2,0.45,0.8079231692677071,0.7810449080441171,0.08260321617126465,0.7810449080441171
216,9,KNeighbors Classifier,0,0.45,0.7840431913617276,0.7840397825240314,1.5868046283721924,0.7840397825240314
217,9,SVC Classifier,0,0.45,0.8104379124175165,0.7948989614749511,4.270406007766724,0.7948989614749511
218,9,Decision Tree,0,0.45,0.7426514697060588,0.7421717173756559,0.1331479549407959,0.7421717173756559
219,9,RandomForest,0,0.45,0.7384523095380924,0.7103629462730431,0.43595194816589355,0.7103629462730431
220,9,AdaBoost (Discrete),0,0.45,0.7708458308338332,0.7688811776625317,60.46913528442383,0.7688811776625317
221,9,AdaBoost (Real),0,0.45,0.7564487102579485,0.7505217981424637,68.95949006080627,0.7505217981424637
222,9,Logistic Regression (Penalty = L2),0,0.45,0.8338332333533294,0.8334474618246591,0.2871584892272949,0.8334474618246591
223,9,Naive Bayes,0,0.45,0.7618476304739052,0.7225945997555856,0.09985542297363281,0.7225945997555856
224,9,KNeighbors Classifier,1,0.45,0.7738452309538092,0.7737352774135949,1.6470253467559814,0.7737352774135949
225,9,SVC Classifier,1,0.45,0.8110377924415118,0.7952123138443126,4.508345127105713,0.7952123138443126
226,9,Decision Tree,1,0.45,0.7336532693461307,0.733416868032471,0.18918395042419434,0.733416868032471
227,9,RandomForest,1,0.45,0.7330533893221356,0.7137638867048434,0.5245096683502197,0.7137638867048434
228,9,AdaBoost (Discrete),1,0.45,0.76124775044991,0.7566817456925001,60.44617772102356,0.7566817456925001
229,9,AdaBoost (Real),1,0.45,0.7450509898020395,0.7366207317861346,70.06722974777222,0.7366207317861346
230,9,Logistic Regression (Penalty = L2),1,0.45,0.8326334733053389,0.8319736387269078,0.3552119731903076,0.8319736387269078
231,9,Naive Bayes,1,0.45,0.7588482303539292,0.7146634986745263,0.054285526275634766,0.7146634986745263
232,9,KNeighbors Classifier,2,0.45,0.7965186074429772,0.7963838457672998,1.563786506652832,0.7963838457672998
233,9,SVC Classifier,2,0.45,0.8115246098439376,0.7945312409213575,4.228973388671875,0.7945312409213575
234,9,Decision Tree,2,0.45,0.7316926770708283,0.7310147975372298,0.1745743751525879,0.7310147975372298
235,9,RandomForest,2,0.45,0.7400960384153662,0.7077664049096679,0.5266156196594238,0.7077664049096679
236,9,AdaBoost (Discrete),2,0.45,0.7863145258103241,0.779804391225743,53.60521912574768,0.779804391225743
237,9,AdaBoost (Real),2,0.45,0.7857142857142857,0.7814904291293786,64.230140209198,0.7814904291293786
238,9,Logistic Regression (Penalty = L2),2,0.45,0.8319327731092437,0.8315676600978363,0.276674747467041,0.8315676600978363
239,9,Naive Bayes,2,0.45,0.7677070828331333,0.721573369973074,0.07800173759460449,0.721573369973074
240,10,KNeighbors Classifier,0,0.45,0.8020395920815837,0.8020774945051861,4.91168475151062,0.8020774945051861
241,10,SVC Classifier,0,0.45,0.8452309538092382,0.8392296619209431,5.355927467346191,0.8392296619209431
242,10,Decision Tree,0,0.45,0.7456508698260348,0.7456058760232291,0.17742252349853516,0.7456058760232291
243,10,RandomForest,0,0.45,0.7804439112177565,0.7677233459837652,0.48843884468078613,0.7677233459837652
244,10,AdaBoost (Discrete),0,0.45,0.8224355128974206,0.822285297503766,79.25598454475403,0.822285297503766
245,10,AdaBoost (Real),0,0.45,0.8350329934013198,0.834143831940423,83.91229820251465,0.834143831940423
246,10,Logistic Regression (Penalty = L2),0,0.45,0.8734253149370126,0.8733025434646778,0.36060476303100586,0.8733025434646778
247,10,Naive Bayes,0,0.45,0.7978404319136173,0.7732984878335121,0.08426499366760254,0.7732984878335121
248,10,KNeighbors Classifier,1,0.45,0.8002399520095981,0.8002763959682638,4.451926946640015,0.8002763959682638
249,10,SVC Classifier,1,0.45,0.8482303539292142,0.8426761229072243,4.793508052825928,0.8426761229072243
250,10,Decision Tree,1,0.45,0.728254349130174,0.7278507366167776,0.19869732856750488,0.7278507366167776
251,10,RandomForest,1,0.45,0.7696460707858428,0.7592270576733996,0.43940305709838867,0.7592270576733996
252,10,AdaBoost (Discrete),1,0.45,0.8242351529694061,0.8236754521761034,78.93127107620239,0.8236754521761034
253,10,AdaBoost (Real),1,0.45,0.8260347930413917,0.8254764995933335,82.19098782539368,0.8254764995933335
254,10,Logistic Regression (Penalty = L2),1,0.45,0.8614277144571085,0.8614051150564992,0.3617985248565674,0.8614051150564992
255,10,Naive Bayes,1,0.45,0.7954409118176364,0.7709963799707369,0.09879183769226074,0.7709963799707369
256,10,KNeighbors Classifier,2,0.45,0.8337334933973589,0.83318199567899,3.9150445461273193,0.83318199567899
257,10,SVC Classifier,2,0.45,0.8613445378151261,0.8554232546751819,4.573659181594849,0.8554232546751819
258,10,Decision Tree,2,0.45,0.7394957983193278,0.7393331520553933,0.14463090896606445,0.7393331520553933
259,10,RandomForest,2,0.45,0.7695078031212484,0.7457903229106201,0.4685184955596924,0.7457903229106201
260,10,AdaBoost (Discrete),2,0.45,0.8493397358943577,0.8484146479242917,70.97936701774597,0.8484146479242917
261,10,AdaBoost (Real),2,0.45,0.8523409363745498,0.8508492121481984,77.33718848228455,0.8508492121481984
262,10,Logistic Regression (Penalty = L2),2,0.45,0.8793517406962785,0.8792694571902249,0.31296420097351074,0.8792694571902249
263,10,Naive Bayes,2,0.45,0.8073229291716687,0.7816745845235983,0.08013176918029785,0.7816745845235983
264,11,KNeighbors Classifier,0,0.45,0.7876424715056989,0.7876036486956628,6.993162155151367,0.7876036486956628
265,11,SVC Classifier,0,0.45,0.8488302339532093,0.8428380486097561,5.75445294380188,0.8428380486097561
266,11,Decision Tree,0,0.45,0.7324535092981403,0.7324228947980956,0.18061351776123047,0.7324228947980956
267,11,RandomForest,0,0.45,0.7756448710257948,0.7663594298888519,0.5737535953521729,0.7663594298888519
268,11,AdaBoost (Discrete),0,0.45,0.829634073185363,0.8296559100380319,91.69676995277405,0.8296559100380319
269,11,AdaBoost (Real),0,0.45,0.8152369526094781,0.8144217711344491,95.23050308227539,0.8144217711344491
270,11,Logistic Regression (Penalty = L2),0,0.45,0.8728254349130175,0.8727187849060591,0.3397483825683594,0.8727187849060591
271,11,Naive Bayes,0,0.45,0.7984403119376124,0.7730516040765038,0.11082649230957031,0.7730516040765038
272,11,KNeighbors Classifier,1,0.45,0.7768446310737852,0.7765959707628659,5.946265935897827,0.7765959707628659
273,11,SVC Classifier,1,0.45,0.8452309538092382,0.8394522519291592,5.013923168182373,0.8394522519291592
274,11,Decision Tree,1,0.45,0.7126574685062987,0.7123793525735947,0.16077804565429688,0.7123793525735947
275,11,RandomForest,1,0.45,0.743251349730054,0.736202088032769,0.3859589099884033,0.736202088032769
276,11,AdaBoost (Discrete),1,0.45,0.8248350329934013,0.8246590428414287,91.7151095867157,0.8246590428414287
277,11,AdaBoost (Real),1,0.45,0.8260347930413917,0.8253795342150143,106.89789724349976,0.8253795342150143
278,11,Logistic Regression (Penalty = L2),1,0.45,0.8620275944811038,0.8620156079008642,0.37616658210754395,0.8620156079008642
279,11,Naive Bayes,1,0.45,0.7948410317936413,0.7704970298440209,0.10163998603820801,0.7704970298440209
280,11,KNeighbors Classifier,2,0.45,0.7941176470588235,0.793333595839685,5.89035439491272,0.793333595839685
281,11,SVC Classifier,2,0.45,0.8601440576230492,0.8543198384829449,5.091429948806763,0.8543198384829449
282,11,Decision Tree,2,0.45,0.7394957983193278,0.7395166306086913,0.16370511054992676,0.7395166306086913
283,11,RandomForest,2,0.45,0.7791116446578632,0.768529854466384,0.38616251945495605,0.768529854466384
284,11,AdaBoost (Discrete),2,0.45,0.851140456182473,0.8504581859258245,89.7055094242096,0.8504581859258245
285,11,AdaBoost (Real),2,0.45,0.8463385354141657,0.8446125027960596,88.04989504814148,0.8446125027960596
286,11,Logistic Regression (Penalty = L2),2,0.45,0.8769507803121248,0.8768999496421181,0.3316071033477783,0.8768999496421181
287,11,Naive Bayes,2,0.45,0.8055222088835534,0.7790514957228182,0.11354970932006836,0.7790514957228182
288,12,KNeighbors Classifier,0,0.45,0.7840431913617276,0.7840397825240314,1.1215908527374268,0.7840397825240314
289,12,SVC Classifier,0,0.45,0.8104379124175165,0.7948989614749511,2.992462158203125,0.7948989614749511
290,12,Decision Tree,0,0.45,0.740251949610078,0.7397955737710022,0.12564802169799805,0.7397955737710022
291,12,RandomForest,0,0.45,0.7384523095380924,0.7103629462730431,0.355271577835083,0.7103629462730431
292,12,AdaBoost (Discrete),0,0.45,0.770245950809838,0.7682350587215349,40.830464363098145,0.7682350587215349
293,12,AdaBoost (Real),0,0.45,0.7600479904019196,0.7559838214997624,47.27753829956055,0.7559838214997624
294,12,Logistic Regression (Penalty = L2),0,0.45,0.8338332333533294,0.8334474618246591,0.21377873420715332,0.8334474618246591
295,12,Naive Bayes,0,0.45,0.7618476304739052,0.7225945997555856,0.06855106353759766,0.7225945997555856
296,12,KNeighbors Classifier,1,0.45,0.7738452309538092,0.7737352774135949,1.1871485710144043,0.7737352774135949
297,12,SVC Classifier,1,0.45,0.8110377924415118,0.7952123138443126,3.0911102294921875,0.7952123138443126
298,12,Decision Tree,1,0.45,0.7174565086982604,0.7168699811982914,0.09709715843200684,0.7168699811982914
299,12,RandomForest,1,0.45,0.7330533893221356,0.7137638867048434,0.38135814666748047,0.7137638867048434
300,12,AdaBoost (Discrete),1,0.45,0.7618476304739052,0.7572035953377007,40.9520046710968,0.7572035953377007
301,12,AdaBoost (Real),1,0.45,0.758248350329934,0.7524495070451173,47.1417236328125,0.7524495070451173
302,12,Logistic Regression (Penalty = L2),1,0.45,0.8326334733053389,0.8319736387269078,0.21086740493774414,0.8319736387269078
303,12,Naive Bayes,1,0.45,0.7588482303539292,0.7146634986745263,0.07297801971435547,0.7146634986745263
304,12,KNeighbors Classifier,2,0.45,0.7965186074429772,0.7963838457672998,1.0991592407226562,0.7963838457672998
305,12,SVC Classifier,2,0.45,0.8115246098439376,0.7945312409213575,2.9988393783569336,0.7945312409213575
306,12,Decision Tree,2,0.45,0.71968787515006,0.7190504667743806,0.09736371040344238,0.7190504667743806
307,12,RandomForest,2,0.45,0.7400960384153662,0.7077664049096679,0.3462827205657959,0.7077664049096679
308,12,AdaBoost (Discrete),2,0.45,0.7863145258103241,0.779804391225743,39.02062964439392,0.779804391225743
309,12,AdaBoost (Real),2,0.45,0.7671068427370948,0.7608238753895468,43.849345684051514,0.7608238753895468
310,12,Logistic Regression (Penalty = L2),2,0.45,0.8319327731092437,0.8315676600978363,0.22115254402160645,0.8315676600978363
311,12,Naive Bayes,2,0.45,0.7677070828331333,0.721573369973074,0.05962729454040527,0.721573369973074
