,feat_set_id,classifier,fold_id,feat_th,score,geo_score,exec_t,geo_score_woz
0,0,KNeighbors Classifier,0,0.3,0.7937608318890814,0.8733741082267049,0.23178458213806152,0.0
1,0,SVC Classifier,0,0.3,0.6845753899480069,0.8129520829107402,0.5042800903320312,0.0
2,0,Decision Tree,0,0.3,0.7417677642980935,0.8617274844321391,0.002206087112426758,0.0
3,0,RandomForest,0,0.3,0.7001733102253033,1.0,0.5184304714202881,0.0
4,0,AdaBoost (Discrete),0,0.3,0.7452339688041595,0.7844920354680928,26.222261667251587,0.0
5,0,AdaBoost (Real),0,0.3,0.7452339688041595,0.7844920354680928,38.11715292930603,0.0
6,0,Logistic Regression (Penalty = L2),0,0.3,0.7417677642980935,0.8617274844321391,0.23804163932800293,0.0
7,0,Naive Bayes,0,0.3,0.5805892547660312,0.6192878878744241,0.06726694107055664,0.0
8,0,KNeighbors Classifier,1,0.3,0.7413194444444444,0.6920039139148341,0.29500389099121094,0.0
9,0,SVC Classifier,1,0.3,0.78125,0.7990572919580082,0.5845284461975098,0.0
10,0,Decision Tree,1,0.3,0.71875,0.6234161071707248,0.0024399757385253906,0.0
11,0,RandomForest,1,0.3,0.6996527777777778,1.0,0.46360278129577637,0.0
12,0,AdaBoost (Discrete),1,0.3,0.7361111111111112,0.45621327850879984,34.975341796875,0.0
13,0,AdaBoost (Real),1,0.3,0.3125,0.4102115633234443,35.19855499267578,0.0
14,0,Logistic Regression (Penalty = L2),1,0.3,0.71875,0.6234161071707248,0.06273508071899414,0.0
15,0,Naive Bayes,1,0.3,0.6840277777777778,0.7034341761336865,0.03056812286376953,0.0
16,0,KNeighbors Classifier,2,0.3,0.7982608695652174,0.6048387456236007,0.14333820343017578,0.6048387456236007
17,0,SVC Classifier,2,0.3,0.7617391304347826,0.5617326583032773,0.29815244674682617,0.0
18,0,Decision Tree,2,0.3,0.36695652173913046,0.4927890493669933,0.038111209869384766,0.4927890493669933
19,0,RandomForest,2,0.3,0.7008695652173913,1.0,0.22236132621765137,0.0
20,0,AdaBoost (Discrete),2,0.3,0.3826086956521739,0.4559087061053287,20.87296152114868,0.4559087061053287
21,0,AdaBoost (Real),2,0.3,0.42434782608695654,0.4731429604729496,44.99715209007263,0.4731429604729496
22,0,Logistic Regression (Penalty = L2),2,0.3,0.7791304347826087,0.5744179739510636,0.20176386833190918,0.5744179739510636
23,0,Naive Bayes,2,0.3,0.46608695652173915,0.6897771060056679,0.0028951168060302734,0.0
24,1,KNeighbors Classifier,0,0.3,0.6759098786828422,0.5161699716484315,0.21053600311279297,0.0
25,1,SVC Classifier,0,0.3,0.7417677642980935,0.7407118766149331,0.4334092140197754,0.0
26,1,Decision Tree,0,0.3,0.6689774696707106,0.40085428519486466,0.06710410118103027,0.0
27,1,RandomForest,0,0.3,0.6932409012131716,0.40101588200938176,0.40895938873291016,0.0
28,1,AdaBoost (Discrete),0,0.3,0.6499133448873483,0.3958356015526993,27.097313165664673,0.0
29,1,AdaBoost (Real),0,0.3,0.7123050259965338,0.3481307672667008,49.95951175689697,0.0
30,1,Logistic Regression (Penalty = L2),0,0.3,0.7417677642980935,0.7407118766149331,0.2501838207244873,0.0
31,1,Naive Bayes,0,0.3,0.4610051993067591,0.6356906798026111,0.08402776718139648,0.0
32,1,KNeighbors Classifier,1,0.3,0.5763888888888888,0.40621719184186533,0.4370589256286621,0.0
33,1,SVC Classifier,1,0.3,0.7239583333333334,0.4956385459568428,0.5826303958892822,0.0
34,1,Decision Tree,1,0.3,0.7048611111111112,0.6255270730405678,0.08258390426635742,0.0
35,1,RandomForest,1,0.3,0.7083333333333334,0.35896766617594056,0.5027282238006592,0.0
36,1,AdaBoost (Discrete),1,0.3,0.765625,0.414767214493731,30.702637434005737,0.0
37,1,AdaBoost (Real),1,0.3,0.640625,0.44076349444485874,52.684425830841064,0.0
38,1,Logistic Regression (Penalty = L2),1,0.3,0.5763888888888888,0.583385026659088,0.22672176361083984,0.0
39,1,Naive Bayes,1,0.3,0.5225694444444444,0.5364566261102128,0.10093975067138672,0.0
40,1,KNeighbors Classifier,2,0.3,0.577391304347826,0.4954208264005628,0.4135158061981201,0.0
41,1,SVC Classifier,2,0.3,0.7617391304347826,0.5617326583032773,0.5770275592803955,0.0
42,1,Decision Tree,2,0.3,0.3026086956521739,0.2809551536390987,0.0015239715576171875,0.0
43,1,RandomForest,2,0.3,0.697391304347826,0.9950372208436724,0.6940906047821045,0.0
44,1,AdaBoost (Discrete),2,0.3,0.3356521739130435,0.35722436061064206,34.10621690750122,0.35722436061064206
45,1,AdaBoost (Real),2,0.3,0.56,0.40623412880719667,57.845768451690674,0.40623412880719667
46,1,Logistic Regression (Penalty = L2),2,0.3,0.49043478260869566,0.3389088404407241,0.2083139419555664,0.0
47,1,Naive Bayes,2,0.3,0.23652173913043478,0.46300425450416305,0.08889603614807129,0.0
48,2,KNeighbors Classifier,0,0.3,0.5979202772963604,0.5983158906937681,0.3164243698120117,0.0
49,2,SVC Classifier,0,0.3,0.6845753899480069,0.8129520829107402,0.7542843818664551,0.0
50,2,Decision Tree,0,0.3,0.5979202772963604,0.5983158906937681,0.0015459060668945312,0.0
51,2,RandomForest,0,0.3,0.7001733102253033,1.0,0.6226582527160645,0.0
52,2,AdaBoost (Discrete),0,0.3,0.5979202772963604,0.5983158906937681,39.35933065414429,0.0
53,2,AdaBoost (Real),0,0.3,0.5979202772963604,0.5983158906937681,176.72261309623718,0.0
54,2,Logistic Regression (Penalty = L2),0,0.3,0.6395147313691508,0.6832394989103653,0.21404695510864258,0.0
55,2,Naive Bayes,0,0.3,0.6204506065857885,0.6358151434753927,0.0029861927032470703,0.6358151434753927
56,2,KNeighbors Classifier,1,0.3,0.7586805555555556,0.6108736844453165,0.3271009922027588,0.6108736844453165
57,2,SVC Classifier,1,0.3,0.7274305555555556,0.7636780043269571,0.6411433219909668,0.0
58,2,Decision Tree,1,0.3,0.8350694444444444,0.7018599895316678,0.0026972293853759766,0.0
59,2,RandomForest,1,0.3,0.7013888888888888,0.5956833971812706,0.7671589851379395,0.0
60,2,AdaBoost (Discrete),1,0.3,0.7395833333333334,0.6156941468827575,41.49639368057251,0.0
61,2,AdaBoost (Real),1,0.3,0.8350694444444444,0.7018599895316678,203.70758700370789,0.0
62,2,Logistic Regression (Penalty = L2),1,0.3,0.8038194444444444,0.673564534157942,0.32537841796875,0.0
63,2,Naive Bayes,1,0.3,0.8003472222222222,0.6468642383840276,0.10339069366455078,0.6468642383840276
64,2,KNeighbors Classifier,2,0.3,0.6939130434782609,0.5371568900691215,0.42510271072387695,0.0
65,2,SVC Classifier,2,0.3,0.8052173913043478,0.7259641061200546,0.842505693435669,0.0
66,2,Decision Tree,2,0.3,0.5026086956521739,0.6123724356957945,0.10915827751159668,0.6123724356957945
67,2,RandomForest,2,0.3,0.7008695652173913,1.0,0.7363870143890381,0.0
68,2,AdaBoost (Discrete),2,0.3,0.4191304347826087,0.5683386212948147,44.74164152145386,0.5683386212948147
69,2,AdaBoost (Real),2,0.3,0.4191304347826087,0.5683386212948147,54.91263008117676,0.5683386212948147
70,2,Logistic Regression (Penalty = L2),2,0.3,0.8330434782608696,0.6989716031798449,0.3266763687133789,0.6989716031798449
71,2,Naive Bayes,2,0.3,0.8191304347826087,0.7030902540995372,0.216841459274292,0.7030902540995372
72,3,KNeighbors Classifier,0,0.3,0.6932409012131716,0.6365881169901535,0.43627071380615234,0.0
73,3,SVC Classifier,0,0.3,0.6845753899480069,0.8129520829107402,0.759601354598999,0.0
74,3,Decision Tree,0,0.3,0.6845753899480069,0.8129520829107402,0.10632824897766113,0.0
75,3,RandomForest,0,0.3,0.7417677642980935,0.7407118766149331,0.862384557723999,0.0
76,3,AdaBoost (Discrete),0,0.3,0.6845753899480069,0.8129520829107402,44.86405897140503,0.0
77,3,AdaBoost (Real),0,0.3,0.6845753899480069,0.8129520829107402,111.46728873252869,0.0
78,3,Logistic Regression (Penalty = L2),0,0.3,0.6845753899480069,0.8129520829107402,0.3495521545410156,0.0
79,3,Naive Bayes,0,0.3,0.5805892547660312,0.6192878878744241,0.002998828887939453,0.0
80,3,KNeighbors Classifier,1,0.3,0.7690972222222222,0.8841027752029671,0.3613309860229492,0.0
81,3,SVC Classifier,1,0.3,0.7690972222222222,0.8841027752029671,0.8055446147918701,0.0
82,3,Decision Tree,1,0.3,0.7690972222222222,0.8841027752029671,0.0025157928466796875,0.0
83,3,RandomForest,1,0.3,0.7604166666666666,0.5678252885462702,0.6900026798248291,0.0
84,3,AdaBoost (Discrete),1,0.3,0.7690972222222222,0.8841027752029671,52.36846303939819,0.0
85,3,AdaBoost (Real),1,0.3,0.7690972222222222,0.8841027752029671,132.00650238990784,0.0
86,3,Logistic Regression (Penalty = L2),1,0.3,0.7690972222222222,0.8841027752029671,0.42921948432922363,0.0
87,3,Naive Bayes,1,0.3,0.6076388888888888,0.761623509666802,0.2216494083404541,0.0
88,3,KNeighbors Classifier,2,0.3,0.8121739130434783,0.7823116236045576,1.0690972805023193,0.0
89,3,SVC Classifier,2,0.3,0.7617391304347826,0.5617326583032773,1.5129342079162598,0.0
90,3,Decision Tree,2,0.3,0.8121739130434783,0.7823116236045576,0.22626137733459473,0.0
91,3,RandomForest,2,0.3,0.7234782608695652,0.38239706119026057,1.6552629470825195,0.0
92,3,AdaBoost (Discrete),2,0.3,0.8121739130434783,0.7823116236045576,95.93577313423157,0.0
93,3,AdaBoost (Real),2,0.3,0.7617391304347826,0.5617326583032773,177.5860092639923,0.0
94,3,Logistic Regression (Penalty = L2),2,0.3,0.7617391304347826,0.5617326583032773,0.4574146270751953,0.0
95,3,Naive Bayes,2,0.3,0.7165217391304348,0.8093457490383623,0.23299646377563477,0.0
96,4,KNeighbors Classifier,0,0.3,0.7383015597920277,0.4233706756028292,0.6961135864257812,0.0
97,4,SVC Classifier,0,0.3,0.7417677642980935,0.7407118766149331,1.560028314590454,0.0
98,4,Decision Tree,0,0.3,0.7417677642980935,0.7407118766149331,0.002555370330810547,0.0
99,4,RandomForest,0,0.3,0.7036395147313691,0.6292092170823518,1.928591251373291,0.0
100,4,AdaBoost (Discrete),0,0.3,0.6308492201039861,0.5899025290773733,89.30813217163086,0.0
101,4,AdaBoost (Real),0,0.3,0.7036395147313691,0.7558686441295325,134.82980680465698,0.0
102,4,Logistic Regression (Penalty = L2),0,0.3,0.7417677642980935,0.7407118766149331,0.48178744316101074,0.0
103,4,Naive Bayes,0,0.3,0.3986135181975737,0.5242766356244375,0.22073888778686523,0.0
104,4,KNeighbors Classifier,1,0.3,0.7378472222222222,0.42336937219191195,0.6411716938018799,0.0
105,4,SVC Classifier,1,0.3,0.6996527777777778,1.0,1.3675103187561035,0.0
106,4,Decision Tree,1,0.3,0.8038194444444444,0.7744915485716632,0.0014955997467041016,0.0
107,4,RandomForest,1,0.3,0.6996527777777778,1.0,1.077873945236206,0.0
108,4,AdaBoost (Discrete),1,0.3,0.8038194444444444,0.7744915485716632,86.60658931732178,0.0
109,4,AdaBoost (Real),1,0.3,0.5815972222222222,0.7266671494767909,102.20456600189209,0.0
110,4,Logistic Regression (Penalty = L2),1,0.3,0.8038194444444444,0.7744915485716632,0.17165756225585938,0.0
111,4,Naive Bayes,1,0.3,0.4253472222222222,0.49943070026330544,0.0928657054901123,0.0
112,4,KNeighbors Classifier,2,0.3,0.56,0.7392096923764837,0.2796471118927002,0.0
113,4,SVC Classifier,2,0.3,0.7617391304347826,0.5617326583032773,0.5494639873504639,0.0
114,4,Decision Tree,2,0.3,0.5704347826086956,0.2641598154411926,0.0022051334381103516,0.0
115,4,RandomForest,2,0.3,0.72,0.3908516054911606,0.678807258605957,0.0
116,4,AdaBoost (Discrete),2,0.3,0.3791304347826087,0.3206820665359413,36.2015585899353,0.3206820665359413
117,4,AdaBoost (Real),2,0.3,0.3165217391304348,0.30317642339382095,71.06742262840271,0.30317642339382095
118,4,Logistic Regression (Penalty = L2),2,0.3,0.5043478260869565,0.34896337315238635,0.2261190414428711,0.34896337315238635
119,4,Naive Bayes,2,0.3,0.43478260869565216,0.5244264570065864,0.10941195487976074,0.5244264570065864
120,5,KNeighbors Classifier,0,0.3,0.7417677642980935,0.7407118766149331,0.44699597358703613,0.0
121,5,SVC Classifier,0,0.3,0.6845753899480069,0.8129520829107402,0.8015763759613037,0.0
122,5,Decision Tree,0,0.3,0.7417677642980935,0.8617274844321391,0.11071157455444336,0.0
123,5,RandomForest,0,0.3,0.6429809358752167,0.5376812956971576,0.6465129852294922,0.0
124,5,AdaBoost (Discrete),0,0.3,0.7417677642980935,0.8617274844321391,44.32542657852173,0.0
125,5,AdaBoost (Real),0,0.3,0.7417677642980935,0.8617274844321391,181.4892098903656,0.0
126,5,Logistic Regression (Penalty = L2),0,0.3,0.7417677642980935,0.8617274844321391,0.354175329208374,0.0
127,5,Naive Bayes,0,0.3,0.5233968804159446,0.7201922951672233,0.11497759819030762,0.0
128,5,KNeighbors Classifier,1,0.3,0.7065972222222222,0.753294030738896,0.3493211269378662,0.0
129,5,SVC Classifier,1,0.3,0.78125,0.7990572919580082,0.9762701988220215,0.0
130,5,Decision Tree,1,0.3,0.7916666666666666,0.8719038629079734,0.0024268627166748047,0.0
131,5,RandomForest,1,0.3,0.6649305555555556,0.5533004963001166,0.955613374710083,0.0
132,5,AdaBoost (Discrete),1,0.3,0.7916666666666666,0.8719038629079734,47.41572618484497,0.0
133,5,AdaBoost (Real),1,0.3,0.7916666666666666,0.8719038629079734,72.7512218952179,0.0
134,5,Logistic Regression (Penalty = L2),1,0.3,0.7916666666666666,0.8719038629079734,0.22707295417785645,0.0
135,5,Naive Bayes,1,0.3,0.6701388888888888,0.5937155022689299,0.22501707077026367,0.5937155022689299
136,5,KNeighbors Classifier,2,0.3,0.7234782608695652,0.37266643657948806,0.36038684844970703,0.0
137,5,SVC Classifier,2,0.3,0.7008695652173913,1.0,0.8173611164093018,0.0
138,5,Decision Tree,2,0.3,0.8382608695652174,0.8340051055773173,0.0024979114532470703,0.0
139,5,RandomForest,2,0.3,0.7008695652173913,1.0,0.8092019557952881,0.0
140,5,AdaBoost (Discrete),2,0.3,0.8382608695652174,0.8340051055773173,45.92381191253662,0.0
141,5,AdaBoost (Real),2,0.3,0.8382608695652174,0.8340051055773173,55.19170355796814,0.0
142,5,Logistic Regression (Penalty = L2),2,0.3,0.8382608695652174,0.8340051055773173,0.32215142250061035,0.0
143,5,Naive Bayes,2,0.3,0.7791304347826087,0.6214035074764954,0.224639892578125,0.6214035074764954
144,6,KNeighbors Classifier,0,0.3,0.6845753899480069,0.8129520829107402,0.42831993103027344,0.0
145,6,SVC Classifier,0,0.3,0.6845753899480069,0.8129520829107402,0.6696429252624512,0.0
146,6,Decision Tree,0,0.3,0.6845753899480069,0.8129520829107402,0.001445770263671875,0.0
147,6,RandomForest,0,0.3,0.6845753899480069,0.8129520829107402,0.6622107028961182,0.0
148,6,AdaBoost (Discrete),0,0.3,0.6845753899480069,0.8129520829107402,43.562724590301514,0.0
149,6,AdaBoost (Real),0,0.3,0.6845753899480069,0.8129520829107402,99.63024497032166,0.0
150,6,Logistic Regression (Penalty = L2),0,0.3,0.6845753899480069,0.8129520829107402,0.17516756057739258,0.0
151,6,Naive Bayes,0,0.3,0.5805892547660312,0.6192878878744241,0.08147120475769043,0.0
152,6,KNeighbors Classifier,1,0.3,0.7100694444444444,0.6538809592342826,0.2640502452850342,0.0
153,6,SVC Classifier,1,0.3,0.7690972222222222,0.8841027752029671,0.6091752052307129,0.0
154,6,Decision Tree,1,0.3,0.7690972222222222,0.8841027752029671,0.0855560302734375,0.0
155,6,RandomForest,1,0.3,0.6996527777777778,1.0,0.6114346981048584,0.0
156,6,AdaBoost (Discrete),1,0.3,0.7690972222222222,0.8841027752029671,37.82465600967407,0.0
157,6,AdaBoost (Real),1,0.3,0.7690972222222222,0.8841027752029671,77.17257595062256,0.0
158,6,Logistic Regression (Penalty = L2),1,0.3,0.7690972222222222,0.8841027752029671,0.31409335136413574,0.0
159,6,Naive Bayes,1,0.3,0.6076388888888888,0.761623509666802,0.22102761268615723,0.0
160,6,KNeighbors Classifier,2,0.3,0.88,0.9684860662631681,0.30072927474975586,0.0
161,6,SVC Classifier,2,0.3,0.7617391304347826,0.5617326583032773,0.7791056632995605,0.0
162,6,Decision Tree,2,0.3,0.7617391304347826,0.5617326583032773,0.0014979839324951172,0.0
163,6,RandomForest,2,0.3,0.7617391304347826,0.5617326583032773,0.6428072452545166,0.0
164,6,AdaBoost (Discrete),2,0.3,0.7617391304347826,0.5617326583032773,43.88690376281738,0.0
165,6,AdaBoost (Real),2,0.3,0.7617391304347826,0.5617326583032773,70.07687997817993,0.0
166,6,Logistic Regression (Penalty = L2),2,0.3,0.7617391304347826,0.5617326583032773,0.32207775115966797,0.0
167,6,Naive Bayes,2,0.3,0.7165217391304348,0.8093457490383623,0.1087191104888916,0.0
168,7,KNeighbors Classifier,0,0.3,0.4506065857885615,0.5116223467974931,0.2207505702972412,0.0
169,7,SVC Classifier,0,0.3,0.7001733102253033,1.0,0.5212278366088867,0.0
170,7,Decision Tree,0,0.3,0.5753899480069324,0.8217821782178217,0.0024378299713134766,0.0
171,7,RandomForest,0,0.3,0.7001733102253033,1.0,0.8541536331176758,0.0
172,7,AdaBoost (Discrete),0,0.3,0.5753899480069324,0.8217821782178217,41.141762256622314,0.0
173,7,AdaBoost (Real),0,0.3,0.5753899480069324,0.8217821782178217,52.73479199409485,0.0
174,7,Logistic Regression (Penalty = L2),0,0.3,0.7001733102253033,1.0,0.29279661178588867,0.0
175,7,Naive Bayes,0,0.3,0.41767764298093585,0.5598055961226205,0.09542107582092285,0.0
176,7,KNeighbors Classifier,1,0.3,0.6371527777777778,0.9106699751861043,0.2882375717163086,0.0
177,7,SVC Classifier,1,0.3,0.6996527777777778,1.0,0.47775816917419434,0.0
178,7,Decision Tree,1,0.3,0.6371527777777778,0.9106699751861043,0.09438300132751465,0.0
179,7,RandomForest,1,0.3,0.5746527777777778,0.8213399503722084,0.5646593570709229,0.0
180,7,AdaBoost (Discrete),1,0.3,0.6371527777777778,0.9106699751861043,37.04168152809143,0.0
181,7,AdaBoost (Real),1,0.3,0.6371527777777778,0.9106699751861043,79.17293524742126,0.0
182,7,Logistic Regression (Penalty = L2),1,0.3,0.5225694444444444,0.5010070503656899,0.19162631034851074,0.0
183,7,Naive Bayes,1,0.3,0.5208333333333334,0.6857142164790785,0.09103512763977051,0.0
184,7,KNeighbors Classifier,2,0.3,0.7008695652173913,1.0,0.36202216148376465,0.0
185,7,SVC Classifier,2,0.3,0.7008695652173913,1.0,0.3907332420349121,0.0
186,7,Decision Tree,2,0.3,0.7008695652173913,1.0,0.10567188262939453,0.0
187,7,RandomForest,2,0.3,0.7008695652173913,1.0,0.7436263561248779,0.0
188,7,AdaBoost (Discrete),2,0.3,0.7008695652173913,1.0,37.43478560447693,0.0
189,7,AdaBoost (Real),2,0.3,0.7008695652173913,1.0,83.74334359169006,0.0
190,7,Logistic Regression (Penalty = L2),2,0.3,0.7008695652173913,1.0,0.19322490692138672,0.0
191,7,Naive Bayes,2,0.3,0.43130434782608695,0.7472032220800768,0.0919790267944336,0.0
192,8,KNeighbors Classifier,0,0.3,0.7417677642980935,0.7407118766149331,0.18001508712768555,0.0
193,8,SVC Classifier,0,0.3,0.7417677642980935,0.7407118766149331,0.46375322341918945,0.0
194,8,Decision Tree,0,0.3,0.7417677642980935,0.7407118766149331,0.0943307876586914,0.0
195,8,RandomForest,0,0.3,0.7157712305025996,0.5249425357518518,0.6777751445770264,0.0
196,8,AdaBoost (Discrete),0,0.3,0.7417677642980935,0.7407118766149331,36.62882161140442,0.0
197,8,AdaBoost (Real),0,0.3,0.7417677642980935,0.7407118766149331,69.48749446868896,0.0
198,8,Logistic Regression (Penalty = L2),0,0.3,0.7417677642980935,0.7407118766149331,0.1759350299835205,0.0
199,8,Naive Bayes,0,0.3,0.3986135181975737,0.5242766356244375,0.08864808082580566,0.0
200,8,KNeighbors Classifier,1,0.3,0.5746527777777778,0.42675337342841646,0.18786334991455078,0.0
201,8,SVC Classifier,1,0.3,0.6996527777777778,1.0,0.4453577995300293,0.0
202,8,Decision Tree,1,0.3,0.8038194444444444,0.7744915485716632,0.08634614944458008,0.0
203,8,RandomForest,1,0.3,0.7430555555555556,0.5423124768808525,0.5827474594116211,0.0
204,8,AdaBoost (Discrete),1,0.3,0.8038194444444444,0.7744915485716632,36.544798135757446,0.0
205,8,AdaBoost (Real),1,0.3,0.8038194444444444,0.7744915485716632,110.03148698806763,0.0
206,8,Logistic Regression (Penalty = L2),1,0.3,0.8038194444444444,0.7744915485716632,0.33353185653686523,0.0
207,8,Naive Bayes,1,0.3,0.4479166666666667,0.5563501576396962,0.11101865768432617,0.0
208,8,KNeighbors Classifier,2,0.3,0.6991304347826087,0.7288822853219026,0.3323702812194824,0.0
209,8,SVC Classifier,2,0.3,0.7617391304347826,0.5617326583032773,0.584998369216919,0.0
210,8,Decision Tree,2,0.3,0.7617391304347826,0.5617326583032773,0.11025738716125488,0.0
211,8,RandomForest,2,0.3,0.7234782608695652,0.38239706119026057,0.7798943519592285,0.0
212,8,AdaBoost (Discrete),2,0.3,0.7617391304347826,0.5617326583032773,44.05958127975464,0.0
213,8,AdaBoost (Real),2,0.3,0.7617391304347826,0.5617326583032773,77.4476158618927,0.0
214,8,Logistic Regression (Penalty = L2),2,0.3,0.7617391304347826,0.5617326583032773,0.21628427505493164,0.0
215,8,Naive Bayes,2,0.3,0.5791304347826087,0.7239839164660302,0.11251330375671387,0.0
216,9,KNeighbors Classifier,0,0.3,0.7417677642980935,0.7407118766149331,0.31734514236450195,0.0
217,9,SVC Classifier,0,0.3,0.6845753899480069,0.8129520829107402,0.7234354019165039,0.0
218,9,Decision Tree,0,0.3,0.6845753899480069,0.8129520829107402,0.001522064208984375,0.0
219,9,RandomForest,0,0.3,0.6429809358752167,0.5376812956971576,0.7890017032623291,0.0
220,9,AdaBoost (Discrete),0,0.3,0.6845753899480069,0.8129520829107402,42.290616035461426,0.0
221,9,AdaBoost (Real),0,0.3,0.6845753899480069,0.8129520829107402,118.68381953239441,0.0
222,9,Logistic Regression (Penalty = L2),0,0.3,0.6845753899480069,0.8129520829107402,0.22507047653198242,0.0
223,9,Naive Bayes,0,0.3,0.5805892547660312,0.6192878878744241,0.10863184928894043,0.0
224,9,KNeighbors Classifier,1,0.3,0.7690972222222222,0.8841027752029671,0.3358879089355469,0.0
225,9,SVC Classifier,1,0.3,0.7690972222222222,0.8841027752029671,0.6982948780059814,0.0
226,9,Decision Tree,1,0.3,0.7690972222222222,0.8841027752029671,0.0015637874603271484,0.0
227,9,RandomForest,1,0.3,0.6996527777777778,1.0,0.8589015007019043,0.0
228,9,AdaBoost (Discrete),1,0.3,0.7690972222222222,0.8841027752029671,42.50299906730652,0.0
229,9,AdaBoost (Real),1,0.3,0.7690972222222222,0.8841027752029671,73.53212547302246,0.0
230,9,Logistic Regression (Penalty = L2),1,0.3,0.7690972222222222,0.8841027752029671,0.19324803352355957,0.0
231,9,Naive Bayes,1,0.3,0.6076388888888888,0.761623509666802,0.09588384628295898,0.0
232,9,KNeighbors Classifier,2,0.3,0.7617391304347826,0.5617326583032773,0.3568074703216553,0.0
233,9,SVC Classifier,2,0.3,0.7008695652173913,1.0,0.474102258682251,0.0
234,9,Decision Tree,2,0.3,0.7617391304347826,0.5617326583032773,0.10152316093444824,0.0
235,9,RandomForest,2,0.3,0.7008695652173913,1.0,0.5784785747528076,0.0
236,9,AdaBoost (Discrete),2,0.3,0.7617391304347826,0.5617326583032773,39.65155577659607,0.0
237,9,AdaBoost (Real),2,0.3,0.7617391304347826,0.5617326583032773,48.57849144935608,0.0
238,9,Logistic Regression (Penalty = L2),2,0.3,0.7617391304347826,0.5617326583032773,0.1857609748840332,0.0
239,9,Naive Bayes,2,0.3,0.7165217391304348,0.8093457490383623,0.09213542938232422,0.0
240,10,KNeighbors Classifier,0,0.3,0.6759098786828422,0.562385381853539,0.5372352600097656,0.0
241,10,SVC Classifier,0,0.3,0.6845753899480069,0.8129520829107402,0.8379969596862793,0.0
242,10,Decision Tree,0,0.3,0.6152512998266898,0.5183775377196999,0.09093332290649414,0.0
243,10,RandomForest,0,0.3,0.7001733102253033,1.0,0.6443929672241211,0.0
244,10,AdaBoost (Discrete),0,0.3,0.42980935875216636,0.4759647425641533,39.15158033370972,0.0
245,10,AdaBoost (Real),0,0.3,0.2218370883882149,0.2649102639566414,47.060643911361694,0.0
246,10,Logistic Regression (Penalty = L2),0,0.3,0.6395147313691508,0.6832394989103653,0.4373910427093506,0.0
247,10,Naive Bayes,0,0.3,0.6429809358752167,0.7508927762297288,0.1092379093170166,0.0
248,10,KNeighbors Classifier,1,0.3,0.7013888888888888,0.4390407365289393,0.6301867961883545,0.0
249,10,SVC Classifier,1,0.3,0.7274305555555556,0.7636780043269571,0.8760013580322266,0.0
250,10,Decision Tree,1,0.3,0.6909722222222222,0.43230319291249086,0.08604145050048828,0.0
251,10,RandomForest,1,0.3,0.6996527777777778,1.0,0.6098487377166748,0.0
252,10,AdaBoost (Discrete),1,0.3,0.7395833333333334,0.5594679924778646,39.140615940093994,0.0
253,10,AdaBoost (Real),1,0.3,0.3506944444444444,0.38014359549398485,46.25950479507446,0.0
254,10,Logistic Regression (Penalty = L2),1,0.3,0.71875,0.6138900896607005,0.3815000057220459,0.0
255,10,Naive Bayes,1,0.3,0.78125,0.6802396938019404,0.0892477035522461,0.0
256,10,KNeighbors Classifier,2,0.3,0.7391304347826086,0.6688816721433501,0.5958008766174316,0.0
257,10,SVC Classifier,2,0.3,0.8156521739130435,0.7609315011087744,0.783423662185669,0.0
258,10,Decision Tree,2,0.3,0.2747826086956522,0.35936549615948804,0.09049487113952637,0.0
259,10,RandomForest,2,0.3,0.711304347826087,0.2781178990227415,0.6120898723602295,0.0
260,10,AdaBoost (Discrete),2,0.3,0.24,0.2890326277064515,36.90628433227539,0.2890326277064515
261,10,AdaBoost (Real),2,0.3,0.12,0.22659794822688367,40.619295835494995,0.22659794822688367
262,10,Logistic Regression (Penalty = L2),2,0.3,0.6104347826086957,0.4215862361310502,0.3453519344329834,0.4215862361310502
263,10,Naive Bayes,2,0.3,0.528695652173913,0.7234770261807716,0.07262063026428223,0.0
264,11,KNeighbors Classifier,0,0.3,0.6967071057192374,0.5916516027851242,0.38187098503112793,0.0
265,11,SVC Classifier,0,0.3,0.6845753899480069,0.8129520829107402,0.6153969764709473,0.0
266,11,Decision Tree,0,0.3,0.6360485268630849,0.5498693567355661,0.0749976634979248,0.0
267,11,RandomForest,0,0.3,0.7261698440207972,0.5648671314898963,0.60799241065979,0.0
268,11,AdaBoost (Discrete),0,0.3,0.23743500866551126,0.24436069827658005,32.35163998603821,0.0
269,11,AdaBoost (Real),0,0.3,0.2391681109185442,0.27115004335578646,36.45839548110962,0.0
270,11,Logistic Regression (Penalty = L2),0,0.3,0.6395147313691508,0.6832394989103653,0.39242029190063477,0.0
271,11,Naive Bayes,0,0.3,0.6429809358752167,0.7508927762297288,0.06878399848937988,0.0
272,11,KNeighbors Classifier,1,0.3,0.7430555555555556,0.4490507916151869,0.467571496963501,0.0
273,11,SVC Classifier,1,0.3,0.7274305555555556,0.7636780043269571,0.691338062286377,0.0
274,11,Decision Tree,1,0.3,0.7708333333333334,0.5759390574698202,0.06668329238891602,0.0
275,11,RandomForest,1,0.3,0.6944444444444444,0.3451183851258305,0.4717824459075928,0.0
276,11,AdaBoost (Discrete),1,0.3,0.6145833333333334,0.48328555100451154,29.69974637031555,0.0
277,11,AdaBoost (Real),1,0.3,0.3940972222222222,0.41724010574566045,33.88175058364868,0.0
278,11,Logistic Regression (Penalty = L2),1,0.3,0.71875,0.6138900896607005,0.2461404800415039,0.0
279,11,Naive Bayes,1,0.3,0.78125,0.6802396938019404,0.05706954002380371,0.0
280,11,KNeighbors Classifier,2,0.3,0.7808695652173913,0.6834667707379308,0.3451812267303467,0.0
281,11,SVC Classifier,2,0.3,0.7930434782608695,0.6834487561136172,0.5459578037261963,0.0
282,11,Decision Tree,2,0.3,0.7339130434782609,0.5358772988495021,0.05887317657470703,0.0
283,11,RandomForest,2,0.3,0.7182608695652174,0.2795084971874737,0.4243505001068115,0.0
284,11,AdaBoost (Discrete),2,0.3,0.12521739130434784,0.23599415229887397,24.386672258377075,0.23599415229887397
285,11,AdaBoost (Real),2,0.3,0.10086956521739131,0.1882353342184756,30.65724754333496,0.1882353342184756
286,11,Logistic Regression (Penalty = L2),2,0.3,0.6104347826086957,0.4215862361310502,0.2423851490020752,0.4215862361310502
287,11,Naive Bayes,2,0.3,0.528695652173913,0.7234770261807716,0.0605921745300293,0.0
288,12,KNeighbors Classifier,0,0.3,0.7001733102253033,1.0,0.11518526077270508,0.0
289,12,SVC Classifier,0,0.3,0.7001733102253033,1.0,0.27576780319213867,0.0
290,12,Decision Tree,0,0.3,0.7001733102253033,1.0,0.0019419193267822266,0.0
291,12,RandomForest,0,0.3,0.7001733102253033,1.0,0.39975929260253906,0.0
292,12,AdaBoost (Discrete),0,0.3,0.7001733102253033,1.0,21.79034447669983,0.0
293,12,AdaBoost (Real),0,0.3,0.7001733102253033,1.0,81.47185254096985,0.0
294,12,Logistic Regression (Penalty = L2),0,0.3,0.7001733102253033,1.0,0.14780879020690918,0.0
295,12,Naive Bayes,0,0.3,0.5025996533795494,0.6332377902572627,0.05228471755981445,0.0
296,12,KNeighbors Classifier,1,0.3,0.6996527777777778,1.0,0.17038989067077637,0.0
297,12,SVC Classifier,1,0.3,0.6996527777777778,1.0,0.28058695793151855,0.0
298,12,Decision Tree,1,0.3,0.6996527777777778,1.0,0.0014429092407226562,0.0
299,12,RandomForest,1,0.3,0.6996527777777778,1.0,0.3872346878051758,0.0
300,12,AdaBoost (Discrete),1,0.3,0.6996527777777778,1.0,21.45690107345581,0.0
301,12,AdaBoost (Real),1,0.3,0.6996527777777778,1.0,70.81823420524597,0.0
302,12,Logistic Regression (Penalty = L2),1,0.3,0.6996527777777778,1.0,0.15885233879089355,0.0
303,12,Naive Bayes,1,0.3,0.5503472222222222,0.6848230649393702,0.04823780059814453,0.0
304,12,KNeighbors Classifier,2,0.3,0.7008695652173913,1.0,0.15837574005126953,0.0
305,12,SVC Classifier,2,0.3,0.7008695652173913,1.0,0.20956993103027344,0.0
306,12,Decision Tree,2,0.3,0.7008695652173913,1.0,0.0020363330841064453,0.0
307,12,RandomForest,2,0.3,0.7008695652173913,1.0,0.31363701820373535,0.0
308,12,AdaBoost (Discrete),2,0.3,0.7008695652173913,1.0,20.529977083206177,0.0
309,12,AdaBoost (Real),2,0.3,0.7008695652173913,1.0,31.67936110496521,0.0
310,12,Logistic Regression (Penalty = L2),2,0.3,0.7008695652173913,1.0,0.1421971321105957,0.0
311,12,Naive Bayes,2,0.3,0.6139130434782609,0.7472032220800768,0.05185985565185547,0.0
