,feat_set_id,classifier,fold_id,feat_th,score,geo_score,exec_t,geo_score_woz
0,0,KNeighbors Classifier,0,0.65,0.9746268656716418,0.9743036916447874,5.92470121383667,0.9743036916447874
1,0,SVC Classifier,0,0.65,0.9194029850746268,0.9184824843659285,7.803273439407349,0.9184824843659285
2,0,Decision Tree,0,0.65,0.691044776119403,0.6891310440677112,0.39989495277404785,0.6891310440677112
3,0,RandomForest,0,0.65,0.7059701492537314,0.6672345533373943,1.3725435733795166,0.6672345533373943
4,0,AdaBoost (Discrete),0,0.65,0.9238805970149254,0.9231808504293966,324.92555356025696,0.9231808504293966
5,0,AdaBoost (Real),0,0.65,0.8850746268656716,0.8812809002413725,330.66857171058655,0.8812809002413725
6,0,Logistic Regression (Penalty = L2),0,0.65,0.9492537313432836,0.9485155019887554,2.754215717315674,0.9485155019887554
7,0,Naive Bayes,0,0.65,0.9432835820895522,0.9428137576614497,0.2930147647857666,0.9428137576614497
8,0,KNeighbors Classifier,1,0.65,0.9597014925373134,0.9593482979420466,4.810703754425049,0.9593482979420466
9,0,SVC Classifier,1,0.65,0.9238805970149254,0.9228708335597875,6.411474227905273,0.9228708335597875
10,0,Decision Tree,1,0.65,0.7388059701492538,0.7324983128942191,0.42966341972351074,0.7324983128942191
11,0,RandomForest,1,0.65,0.7194029850746269,0.6842893191798051,1.1861448287963867,0.6842893191798051
12,0,AdaBoost (Discrete),1,0.65,0.9194029850746268,0.9181932643241832,362.503671169281,0.9181932643241832
13,0,AdaBoost (Real),1,0.65,0.8776119402985074,0.8770151914466989,409.23551750183105,0.8770151914466989
14,0,Logistic Regression (Penalty = L2),1,0.65,0.9507462686567164,0.9505567812710835,3.0668466091156006,0.9505567812710835
15,0,Naive Bayes,1,0.65,0.935820895522388,0.9353498171060204,0.38704943656921387,0.9353498171060204
16,0,KNeighbors Classifier,2,0.65,0.9681818181818181,0.9679582533536185,6.133369207382202,0.9679582533536185
17,0,SVC Classifier,2,0.65,0.9257575757575758,0.924801562625966,8.259294033050537,0.924801562625966
18,0,Decision Tree,2,0.65,0.7681818181818182,0.7612937034342068,0.3840951919555664,0.7612937034342068
19,0,RandomForest,2,0.65,0.6696969696969697,0.5861195915795601,1.434584617614746,0.5861195915795601
20,0,AdaBoost (Discrete),2,0.65,0.9348484848484848,0.9341515720422696,385.96761536598206,0.9341515720422696
21,0,AdaBoost (Real),2,0.65,0.8727272727272727,0.8669159152073916,414.3559811115265,0.8669159152073916
22,0,Logistic Regression (Penalty = L2),2,0.65,0.9484848484848485,0.948188922424459,5.996091365814209,0.948188922424459
23,0,Naive Bayes,2,0.65,0.9393939393939394,0.9390761442378773,0.45966577529907227,0.9390761442378773
24,1,KNeighbors Classifier,0,0.65,0.9761194029850746,0.9758861964604771,10.204033613204956,0.9758861964604771
25,1,SVC Classifier,0,0.65,0.9194029850746268,0.9179001760266022,9.825216054916382,0.9179001760266022
26,1,Decision Tree,0,0.65,0.7567164179104477,0.7536645529491235,0.5974006652832031,0.7536645529491235
27,1,RandomForest,0,0.65,0.6955223880597015,0.6759653229668768,2.0318245887756348,0.6759653229668768
28,1,AdaBoost (Discrete),0,0.65,0.935820895522388,0.93498318367642,446.30663299560547,0.93498318367642
29,1,AdaBoost (Real),0,0.65,0.908955223880597,0.9071241187714038,437.6070942878723,0.9071241187714038
30,1,Logistic Regression (Penalty = L2),0,0.65,0.9447761194029851,0.9439464557738078,3.6776483058929443,0.9439464557738078
31,1,Naive Bayes,0,0.65,0.9402985074626866,0.9397532360556218,0.4713304042816162,0.9397532360556218
32,1,KNeighbors Classifier,1,0.65,0.9567164179104478,0.9559271794257336,7.530674695968628,0.9559271794257336
33,1,SVC Classifier,1,0.65,0.926865671641791,0.9259575257183039,11.135539054870605,0.9259575257183039
34,1,Decision Tree,1,0.65,0.7373134328358208,0.7337810353020923,0.5327439308166504,0.7337810353020923
35,1,RandomForest,1,0.65,0.6895522388059702,0.6350359150943728,1.9202260971069336,0.6350359150943728
36,1,AdaBoost (Discrete),1,0.65,0.9164179104477612,0.9154498479414095,410.87819838523865,0.9154498479414095
37,1,AdaBoost (Real),1,0.65,0.8582089552238806,0.8554199033371852,412.73781847953796,0.8554199033371852
38,1,Logistic Regression (Penalty = L2),1,0.65,0.9447761194029851,0.9442519714589469,3.5471622943878174,0.9442519714589469
39,1,Naive Bayes,1,0.65,0.9402985074626866,0.939899292201334,0.41030192375183105,0.939899292201334
40,1,KNeighbors Classifier,2,0.65,0.9651515151515152,0.964911281019833,7.470479965209961,0.964911281019833
41,1,SVC Classifier,2,0.65,0.9227272727272727,0.9219238192501018,10.61050271987915,0.9219238192501018
42,1,Decision Tree,2,0.65,0.7272727272727273,0.7243700494353439,0.6497466564178467,0.7243700494353439
43,1,RandomForest,2,0.65,0.703030303030303,0.6934100576574422,2.220721483230591,0.6934100576574422
44,1,AdaBoost (Discrete),2,0.65,0.9318181818181818,0.9311925157336327,437.0867235660553,0.9311925157336327
45,1,AdaBoost (Real),2,0.65,0.8742424242424243,0.8730714652110009,426.47456884384155,0.8730714652110009
46,1,Logistic Regression (Penalty = L2),2,0.65,0.9575757575757575,0.9572172360216291,3.6144208908081055,0.9572172360216291
47,1,Naive Bayes,2,0.65,0.9409090909090909,0.9405782419495716,0.46076250076293945,0.9405782419495716
48,2,KNeighbors Classifier,0,0.65,0.9671641791044776,0.9663472400848275,6.515213251113892,0.9663472400848275
49,2,SVC Classifier,0,0.65,0.9134328358208955,0.9126494219532924,8.287890434265137,0.9126494219532924
50,2,Decision Tree,0,0.65,0.6791044776119403,0.6765001713132501,0.3924548625946045,0.6765001713132501
51,2,RandomForest,0,0.65,0.6358208955223881,0.6092446515082711,1.5464932918548584,0.6092446515082711
52,2,AdaBoost (Discrete),0,0.65,0.9373134328358209,0.9368620534578781,386.73705291748047,0.9368620534578781
53,2,AdaBoost (Real),0,0.65,0.8820895522388059,0.8793173271984449,386.60953855514526,0.8793173271984449
54,2,Logistic Regression (Penalty = L2),0,0.65,0.9492537313432836,0.9485455706608045,3.40032696723938,0.9485455706608045
55,2,Naive Bayes,0,0.65,0.9164179104477612,0.9157381160178929,0.44440650939941406,0.9157381160178929
56,2,KNeighbors Classifier,1,0.65,0.9402985074626866,0.9392275605926736,6.799971580505371,0.9392275605926736
57,2,SVC Classifier,1,0.65,0.9074626865671642,0.9063596340544298,8.813268184661865,0.9063596340544298
58,2,Decision Tree,1,0.65,0.7328358208955223,0.7265195744390385,0.5133872032165527,0.7265195744390385
59,2,RandomForest,1,0.65,0.6776119402985075,0.6458132221805515,1.6122534275054932,0.6458132221805515
60,2,AdaBoost (Discrete),1,0.65,0.9208955223880597,0.9201144662772908,385.827618598938,0.9201144662772908
61,2,AdaBoost (Real),1,0.65,0.8522388059701492,0.8493948821547721,389.6661229133606,0.8493948821547721
62,2,Logistic Regression (Penalty = L2),1,0.65,0.9432835820895522,0.9425747925862197,3.1824138164520264,0.9425747925862197
63,2,Naive Bayes,1,0.65,0.9149253731343283,0.9140026558717947,0.5167183876037598,0.9140026558717947
64,2,KNeighbors Classifier,2,0.65,0.9621212121212122,0.9616044711270358,6.222183704376221,0.9616044711270358
65,2,SVC Classifier,2,0.65,0.9181818181818182,0.9169082162050193,9.894849300384521,0.9169082162050193
66,2,Decision Tree,2,0.65,0.706060606060606,0.6987345048206137,0.47853708267211914,0.6987345048206137
67,2,RandomForest,2,0.65,0.7090909090909091,0.682896102678606,1.679163932800293,0.682896102678606
68,2,AdaBoost (Discrete),2,0.65,0.9227272727272727,0.9220554056775584,1378.5734498500824,0.9220554056775584
69,2,AdaBoost (Real),2,0.65,0.8863636363636364,0.8842266114475913,311.8070864677429,0.8842266114475913
70,2,Logistic Regression (Penalty = L2),2,0.65,0.95,0.949637672875685,2.76759672164917,0.949637672875685
71,2,Naive Bayes,2,0.65,0.9348484848484848,0.9345297355171205,0.3440554141998291,0.9345297355171205
72,3,KNeighbors Classifier,0,0.65,0.9791044776119403,0.9789408598552067,4.4333741664886475,0.9789408598552067
73,3,SVC Classifier,0,0.65,0.9208955223880597,0.9197930904383665,5.8338963985443115,0.9197930904383665
74,3,Decision Tree,0,0.65,0.6940298507462687,0.6854625446200384,0.2260594367980957,0.6854625446200384
75,3,RandomForest,0,0.65,0.664179104477612,0.6034190429718446,1.1771388053894043,0.6034190429718446
76,3,AdaBoost (Discrete),0,0.65,0.9432835820895522,0.9427533101758643,254.7588586807251,0.9427533101758643
77,3,AdaBoost (Real),0,0.65,0.891044776119403,0.8881335196203803,252.00987815856934,0.8881335196203803
78,3,Logistic Regression (Penalty = L2),0,0.65,0.9477611940298507,0.9470231456579601,1.9522104263305664,0.9470231456579601
79,3,Naive Bayes,0,0.65,0.9432835820895522,0.9425995398721865,0.2954397201538086,0.9425995398721865
80,3,KNeighbors Classifier,1,0.65,0.9686567164179104,0.9682247047210973,3.6307692527770996,0.9682247047210973
81,3,SVC Classifier,1,0.65,0.9208955223880597,0.9196356642581828,5.279521942138672,0.9196356642581828
82,3,Decision Tree,1,0.65,0.7044776119402985,0.7009187655948039,0.1584610939025879,0.7009187655948039
83,3,RandomForest,1,0.65,0.682089552238806,0.6527801068877908,1.1102418899536133,0.6527801068877908
84,3,AdaBoost (Discrete),1,0.65,0.9223880597014925,0.9211733130891865,218.82451605796814,0.9211733130891865
85,3,AdaBoost (Real),1,0.65,0.8626865671641791,0.8597953386280506,231.2163164615631,0.8597953386280506
86,3,Logistic Regression (Penalty = L2),1,0.65,0.9462686567164179,0.9458378780344149,2.0039095878601074,0.9458378780344149
87,3,Naive Bayes,1,0.65,0.9447761194029851,0.944424036405132,0.3025624752044678,0.944424036405132
88,3,KNeighbors Classifier,2,0.65,0.9666666666666667,0.9663855817849129,3.997284173965454,0.9663855817849129
89,3,SVC Classifier,2,0.65,0.9242424242424242,0.9236689156448045,5.362398862838745,0.9236689156448045
90,3,Decision Tree,2,0.65,0.7560606060606061,0.7530678311837775,0.21436119079589844,0.7530678311837775
91,3,RandomForest,2,0.65,0.6787878787878788,0.6622461382779358,0.96047043800354,0.6622461382779358
92,3,AdaBoost (Discrete),2,0.65,0.9378787878787879,0.9373526233560536,213.12176251411438,0.9373526233560536
93,3,AdaBoost (Real),2,0.65,0.8848484848484849,0.8830219426293205,223.81603455543518,0.8830219426293205
94,3,Logistic Regression (Penalty = L2),2,0.65,0.956060606060606,0.9558089389524732,1.795771598815918,0.9558089389524732
95,3,Naive Bayes,2,0.65,0.9424242424242424,0.9420859120698206,0.2511155605316162,0.9420859120698206
96,4,KNeighbors Classifier,0,0.65,0.9716417910447761,0.97128573047815,2.8714256286621094,0.97128573047815
97,4,SVC Classifier,0,0.65,0.9059701492537313,0.9053632415090724,4.249428987503052,0.9053632415090724
98,4,Decision Tree,0,0.65,0.7223880597014926,0.7191441796602446,0.1742236614227295,0.7191441796602446
99,4,RandomForest,0,0.65,0.7074626865671642,0.688147233288727,0.7758579254150391,0.688147233288727
100,4,AdaBoost (Discrete),0,0.65,0.9298507462686567,0.9286345676834616,176.30774307250977,0.9286345676834616
101,4,AdaBoost (Real),0,0.65,0.8522388059701492,0.8487404691727203,175.03541135787964,0.8487404691727203
102,4,Logistic Regression (Penalty = L2),0,0.65,0.9492537313432836,0.9484937248192565,1.4543628692626953,0.9484937248192565
103,4,Naive Bayes,0,0.65,0.9238805970149254,0.9231955359467329,0.17781329154968262,0.9231955359467329
104,4,KNeighbors Classifier,1,0.65,0.9641791044776119,0.9635600322789092,2.694596767425537,0.9635600322789092
105,4,SVC Classifier,1,0.65,0.9119402985074627,0.9109037718667966,3.893498659133911,0.9109037718667966
106,4,Decision Tree,1,0.65,0.7059701492537314,0.6969711375149277,0.1613471508026123,0.6969711375149277
107,4,RandomForest,1,0.65,0.7522388059701492,0.7428286328877888,0.8895008563995361,0.7428286328877888
108,4,AdaBoost (Discrete),1,0.65,0.9194029850746268,0.918911896850404,156.77895522117615,0.918911896850404
109,4,AdaBoost (Real),1,0.65,0.844776119402985,0.8434248240233716,160.81595730781555,0.8434248240233716
110,4,Logistic Regression (Penalty = L2),1,0.65,0.9477611940298507,0.9472837107252422,1.3105556964874268,0.9472837107252422
111,4,Naive Bayes,1,0.65,0.9223880597014925,0.9216496443649013,0.19635844230651855,0.9216496443649013
112,4,KNeighbors Classifier,2,0.65,0.9681818181818181,0.9678370252249839,2.313326120376587,0.9678370252249839
113,4,SVC Classifier,2,0.65,0.9181818181818182,0.9175781186697126,3.2853009700775146,0.9175781186697126
114,4,Decision Tree,2,0.65,0.7378787878787879,0.7336372086182699,0.1466810703277588,0.7336372086182699
115,4,RandomForest,2,0.65,0.7424242424242424,0.7339562219914648,0.6599874496459961,0.7339562219914648
116,4,AdaBoost (Discrete),2,0.65,0.9257575757575758,0.9254401904373121,147.42442178726196,0.9254401904373121
117,4,AdaBoost (Real),2,0.65,0.8909090909090909,0.889700016756996,179.8253870010376,0.889700016756996
118,4,Logistic Regression (Penalty = L2),2,0.65,0.9515151515151515,0.9511583418045038,1.6811256408691406,0.9511583418045038
119,4,Naive Bayes,2,0.65,0.9363636363636364,0.9361708835211761,0.17501044273376465,0.9361708835211761
120,5,KNeighbors Classifier,0,0.65,0.9716417910447761,0.9713547407997194,3.0403025150299072,0.9713547407997194
121,5,SVC Classifier,0,0.65,0.908955223880597,0.9075586634764766,4.400967359542847,0.9075586634764766
122,5,Decision Tree,0,0.65,0.7223880597014926,0.7136936109652439,0.2514224052429199,0.7136936109652439
123,5,RandomForest,0,0.65,0.6447761194029851,0.6057445459410004,0.7423994541168213,0.6057445459410004
124,5,AdaBoost (Discrete),0,0.65,0.9343283582089552,0.9335735148736859,177.50392818450928,0.9335735148736859
125,5,AdaBoost (Real),0,0.65,0.8820895522388059,0.8794806381945437,190.2134141921997,0.8794806381945437
126,5,Logistic Regression (Penalty = L2),0,0.65,0.9552238805970149,0.9544882162640465,1.562753677368164,0.9544882162640465
127,5,Naive Bayes,0,0.65,0.9208955223880597,0.9202185575226578,0.2768559455871582,0.9202185575226578
128,5,KNeighbors Classifier,1,0.65,0.9611940298507463,0.960719374162868,2.8056540489196777,0.960719374162868
129,5,SVC Classifier,1,0.65,0.9059701492537313,0.9044534558661381,4.379545211791992,0.9044534558661381
130,5,Decision Tree,1,0.65,0.7253731343283583,0.721900104740678,0.27443647384643555,0.721900104740678
131,5,RandomForest,1,0.65,0.6895522388059702,0.6594300939642951,0.8523159027099609,0.6594300939642951
132,5,AdaBoost (Discrete),1,0.65,0.9149253731343283,0.914510845588515,169.55696558952332,0.914510845588515
133,5,AdaBoost (Real),1,0.65,0.8701492537313433,0.8673352812001723,179.51689767837524,0.8673352812001723
134,5,Logistic Regression (Penalty = L2),1,0.65,0.9522388059701492,0.9516782142203298,1.5627694129943848,0.9516782142203298
135,5,Naive Bayes,1,0.65,0.9194029850746268,0.9184067665226986,0.2405076026916504,0.9184067665226986
136,5,KNeighbors Classifier,2,0.65,0.9651515151515152,0.9647165657327342,2.9497406482696533,0.9647165657327342
137,5,SVC Classifier,2,0.65,0.9136363636363637,0.912997064717602,4.432284116744995,0.912997064717602
138,5,Decision Tree,2,0.65,0.7015151515151515,0.6982242439057849,0.2077651023864746,0.6982242439057849
139,5,RandomForest,2,0.65,0.7166666666666667,0.5695967973671001,0.8384795188903809,0.5695967973671001
140,5,AdaBoost (Discrete),2,0.65,0.9272727272727272,0.9269039143668975,173.44208240509033,0.9269039143668975
141,5,AdaBoost (Real),2,0.65,0.8863636363636364,0.8848936954264317,191.24063062667847,0.8848936954264317
142,5,Logistic Regression (Penalty = L2),2,0.65,0.9545454545454546,0.9542318156058808,1.6051347255706787,0.9542318156058808
143,5,Naive Bayes,2,0.65,0.9363636363636364,0.9360684634154961,0.2514760494232178,0.9360684634154961
144,6,KNeighbors Classifier,0,0.65,0.9746268656716418,0.9742791410231056,3.738325595855713,0.9742791410231056
145,6,SVC Classifier,0,0.65,0.917910447761194,0.916680577248561,4.970137119293213,0.916680577248561
146,6,Decision Tree,0,0.65,0.691044776119403,0.6835385487031336,0.3092350959777832,0.6835385487031336
147,6,RandomForest,0,0.65,0.6955223880597015,0.6793729015028716,0.8961193561553955,0.6793729015028716
148,6,AdaBoost (Discrete),0,0.65,0.9238805970149254,0.9231520359140818,210.22610640525818,0.9231520359140818
149,6,AdaBoost (Real),0,0.65,0.8686567164179104,0.8663644708025577,244.29717683792114,0.8663644708025577
150,6,Logistic Regression (Penalty = L2),0,0.65,0.9432835820895522,0.9426294072571727,2.150005578994751,0.9426294072571727
151,6,Naive Bayes,0,0.65,0.9388059701492537,0.9383424763956102,0.2767159938812256,0.9383424763956102
152,6,KNeighbors Classifier,1,0.65,0.9582089552238806,0.9576740520140687,4.605747699737549,0.9576740520140687
153,6,SVC Classifier,1,0.65,0.9238805970149254,0.9231478028348469,6.178542375564575,0.9231478028348469
154,6,Decision Tree,1,0.65,0.7402985074626866,0.7361923797558669,0.23142552375793457,0.7361923797558669
155,6,RandomForest,1,0.65,0.7119402985074627,0.6906046208427561,1.1544158458709717,0.6906046208427561
156,6,AdaBoost (Discrete),1,0.65,0.926865671641791,0.9261489483359164,233.80162501335144,0.9261489483359164
157,6,AdaBoost (Real),1,0.65,0.755223880597015,0.7505307031796766,238.7038037776947,0.7505307031796766
158,6,Logistic Regression (Penalty = L2),1,0.65,0.9432835820895522,0.9428627494162294,2.1293437480926514,0.9428627494162294
159,6,Naive Bayes,1,0.65,0.935820895522388,0.9352995375907535,0.26778411865234375,0.9352995375907535
160,6,KNeighbors Classifier,2,0.65,0.9681818181818181,0.9678094625701186,3.7454347610473633,0.9678094625701186
161,6,SVC Classifier,2,0.65,0.9227272727272727,0.9220355066849398,5.4698827266693115,0.9220355066849398
162,6,Decision Tree,2,0.65,0.7681818181818182,0.7646804614885523,0.25851964950561523,0.7646804614885523
163,6,RandomForest,2,0.65,0.6924242424242424,0.6808797529624382,0.8448953628540039,0.6808797529624382
164,6,AdaBoost (Discrete),2,0.65,0.9363636363636364,0.9356937879858775,232.23233890533447,0.9356937879858775
165,6,AdaBoost (Real),2,0.65,0.896969696969697,0.8964814729179159,239.59999322891235,0.8964814729179159
166,6,Logistic Regression (Penalty = L2),2,0.65,0.9590909090909091,0.9588498652305969,2.277787446975708,0.9588498652305969
167,6,Naive Bayes,2,0.65,0.9378787878787879,0.937547170008419,0.2640817165374756,0.937547170008419
168,7,KNeighbors Classifier,0,0.65,0.9746268656716418,0.9742791410231056,5.50898814201355,0.9742791410231056
169,7,SVC Classifier,0,0.65,0.9283582089552239,0.9277426204171044,6.7952375411987305,0.9277426204171044
170,7,Decision Tree,0,0.65,0.6656716417910448,0.6547103037614944,0.36014723777770996,0.6547103037614944
171,7,RandomForest,0,0.65,0.6388059701492538,0.6082096168512283,1.187448263168335,0.6082096168512283
172,7,AdaBoost (Discrete),0,0.65,0.9313432835820895,0.9305124284357946,302.6031484603882,0.9305124284357946
173,7,AdaBoost (Real),0,0.65,0.8582089552238806,0.8567076087455502,289.38535952568054,0.8567076087455502
174,7,Logistic Regression (Penalty = L2),0,0.65,0.9522388059701492,0.9516106018261804,2.3205175399780273,0.9516106018261804
175,7,Naive Bayes,0,0.65,0.9417910447761194,0.9410470770095201,0.3321664333343506,0.9410470770095201
176,7,KNeighbors Classifier,1,0.65,0.9582089552238806,0.9576960399614951,5.0640318393707275,0.9576960399614951
177,7,SVC Classifier,1,0.65,0.9298507462686567,0.9290094707397111,5.882984638214111,0.9290094707397111
178,7,Decision Tree,1,0.65,0.7119402985074627,0.7065779678098846,0.3106088638305664,0.7065779678098846
179,7,RandomForest,1,0.65,0.664179104477612,0.6199396427590776,0.973334550857544,0.6199396427590776
180,7,AdaBoost (Discrete),1,0.65,0.9253731343283582,0.9247705937808925,284.8705415725708,0.9247705937808925
181,7,AdaBoost (Real),1,0.65,0.8895522388059701,0.888002914128755,311.304012298584,0.888002914128755
182,7,Logistic Regression (Penalty = L2),1,0.65,0.9522388059701492,0.9519874286848607,2.203272581100464,0.9519874286848607
183,7,Naive Bayes,1,0.65,0.9238805970149254,0.9233465644143185,0.28217482566833496,0.9233465644143185
184,7,KNeighbors Classifier,2,0.65,0.9606060606060606,0.9599921283681171,4.63724946975708,0.9599921283681171
185,7,SVC Classifier,2,0.65,0.9257575757575758,0.9247328948302422,5.977225303649902,0.9247328948302422
186,7,Decision Tree,2,0.65,0.7075757575757575,0.7014812466574138,0.23329496383666992,0.7014812466574138
187,7,RandomForest,2,0.65,0.6106060606060606,0.539613875620156,0.8912262916564941,0.539613875620156
188,7,AdaBoost (Discrete),2,0.65,0.946969696969697,0.9464964913842449,255.75566864013672,0.9464964913842449
189,7,AdaBoost (Real),2,0.65,0.8954545454545455,0.8932469440388618,252.3376429080963,0.8932469440388618
190,7,Logistic Regression (Penalty = L2),2,0.65,0.953030303030303,0.9526007897198217,1.9602231979370117,0.9526007897198217
191,7,Naive Bayes,2,0.65,0.9363636363636364,0.9360482620053321,0.2742195129394531,0.9360482620053321
192,8,KNeighbors Classifier,0,0.65,0.9746268656716418,0.9743505455585739,2.299543857574463,0.9743505455585739
193,8,SVC Classifier,0,0.65,0.9044776119402985,0.9034911807626541,3.5009548664093018,0.9034911807626541
194,8,Decision Tree,0,0.65,0.7253731343283583,0.7233168196216054,0.23038482666015625,0.7233168196216054
195,8,RandomForest,0,0.65,0.673134328358209,0.6686883228897134,0.5753066539764404,0.6686883228897134
196,8,AdaBoost (Discrete),0,0.65,0.9223880597014925,0.9208892494150492,140.2392430305481,0.9208892494150492
197,8,AdaBoost (Real),0,0.65,0.9,0.8987250969442795,152.5353558063507,0.8987250969442795
198,8,Logistic Regression (Penalty = L2),0,0.65,0.9537313432835821,0.9527902703401084,1.1982300281524658,0.9527902703401084
199,8,Naive Bayes,0,0.65,0.9208955223880597,0.9204122634474536,0.1427445411682129,0.9204122634474536
200,8,KNeighbors Classifier,1,0.65,0.9656716417910448,0.9653428023423991,2.1734225749969482,0.9653428023423991
201,8,SVC Classifier,1,0.65,0.9119402985074627,0.9108133191736859,3.0669782161712646,0.9108133191736859
202,8,Decision Tree,1,0.65,0.7208955223880597,0.7172314864385773,0.12993097305297852,0.7172314864385773
203,8,RandomForest,1,0.65,0.673134328358209,0.6562018397570609,0.7470254898071289,0.6562018397570609
204,8,AdaBoost (Discrete),1,0.65,0.9149253731343283,0.9142369064905044,132.13649773597717,0.9142369064905044
205,8,AdaBoost (Real),1,0.65,0.8537313432835821,0.8511746399817587,141.16416716575623,0.8511746399817587
206,8,Logistic Regression (Penalty = L2),1,0.65,0.9477611940298507,0.9471896455062571,1.157148838043213,0.9471896455062571
207,8,Naive Bayes,1,0.65,0.926865671641791,0.9260897222734014,0.17216753959655762,0.9260897222734014
208,8,KNeighbors Classifier,2,0.65,0.9712121212121212,0.9709628383586548,1.9893736839294434,0.9709628383586548
209,8,SVC Classifier,2,0.65,0.9151515151515152,0.9143482908062059,3.0417070388793945,0.9143482908062059
210,8,Decision Tree,2,0.65,0.7681818181818182,0.7663973521234032,0.1904609203338623,0.7663973521234032
211,8,RandomForest,2,0.65,0.7257575757575757,0.7174858192611016,0.700432300567627,0.7174858192611016
212,8,AdaBoost (Discrete),2,0.65,0.9196969696969697,0.919234830247349,120.9046277999878,0.919234830247349
213,8,AdaBoost (Real),2,0.65,0.8833333333333333,0.8827097091911991,137.83628129959106,0.8827097091911991
214,8,Logistic Regression (Penalty = L2),2,0.65,0.95,0.9495028354053248,1.059680700302124,0.9495028354053248
215,8,Naive Bayes,2,0.65,0.9393939393939394,0.9391478274204623,0.19073796272277832,0.9391478274204623
