,feat_set_id,classifier,fold_id,feat_th,score,geo_score,exec_t,geo_score_woz
0,0,KNeighbors Classifier,0,0.95,0.9816901408450704,0.9781020301371197,2.168938159942627,0.9781020301371197
1,0,SVC Classifier,0,0.95,0.9098591549295775,0.4530153324120529,1.2247951030731201,0.4530153324120529
2,0,Decision Tree,0,0.95,0.8859154929577465,0.8644001792649384,0.1576993465423584,0.8644001792649384
3,0,RandomForest,0,0.95,0.8647887323943662,0.34119311553145876,0.7795617580413818,0.34119311553145876
4,0,AdaBoost (Discrete),0,0.95,0.9042253521126761,0.906670999278281,68.0084707736969,0.906670999278281
5,0,AdaBoost (Real),0,0.95,0.9309859154929577,0.9587802898460202,77.19805693626404,0.9587802898460202
6,0,Logistic Regression (Penalty = L2),0,0.95,0.967605633802817,0.9720716547173105,0.6473536491394043,0.9720716547173105
7,0,Naive Bayes,0,0.95,0.9492957746478873,0.9696643736298215,0.19523978233337402,0.9696643736298215
8,0,KNeighbors Classifier,1,0.95,0.9816643159379408,0.9519543421581566,2.311495542526245,0.9519543421581566
9,0,SVC Classifier,1,0.95,0.9760225669957687,0.9369604361556937,1.4132001399993896,0.9369604361556937
10,0,Decision Tree,1,0.95,0.9464033850493653,0.9165978078881484,0.08948707580566406,0.9165978078881484
11,0,RandomForest,1,0.95,0.8377997179125529,0.33429141325553335,0.5252077579498291,0.33429141325553335
12,0,AdaBoost (Discrete),1,0.95,0.9647390691114246,0.896062730767775,62.93222951889038,0.896062730767775
13,0,AdaBoost (Real),1,0.95,0.9746121297602257,0.9511958742398139,73.44400119781494,0.9511958742398139
14,0,Logistic Regression (Penalty = L2),1,0.95,0.9732016925246827,0.9576354655560266,0.5384721755981445,0.9576354655560266
15,0,Naive Bayes,1,0.95,0.9492242595204513,0.9590798352858977,0.18162035942077637,0.9590798352858977
16,0,KNeighbors Classifier,2,0.95,0.9632248939179632,0.9130363100692748,1.8082239627838135,0.9130363100692748
17,0,SVC Classifier,2,0.95,0.9844413012729845,0.9610907387064838,1.217313289642334,0.9610907387064838
18,0,Decision Tree,2,0.95,0.7623762376237624,0.71191703135266,0.08798503875732422,0.71191703135266
19,0,RandomForest,2,0.95,0.8811881188118812,0.8114477237796156,0.6157312393188477,0.8114477237796156
20,0,AdaBoost (Discrete),2,0.95,0.9236209335219236,0.9263480050091923,62.25941324234009,0.9263480050091923
21,0,AdaBoost (Real),2,0.95,0.8939179632248939,0.9104595101188733,73.79812502861023,0.9104595101188733
22,0,Logistic Regression (Penalty = L2),2,0.95,0.9632248939179632,0.9300451821370445,0.5254886150360107,0.9300451821370445
23,0,Naive Bayes,2,0.95,0.925035360678925,0.9504885650651899,0.08487677574157715,0.9504885650651899
24,1,KNeighbors Classifier,0,0.95,0.9802816901408451,0.9775023353024564,2.194216012954712,0.9775023353024564
25,1,SVC Classifier,0,0.95,0.9098591549295775,0.4530153324120529,1.222855806350708,0.4530153324120529
26,1,Decision Tree,0,0.95,0.7929577464788733,0.8630254241997618,0.003437519073486328,0.8630254241997618
27,1,RandomForest,0,0.95,0.8647887323943662,0.34119311553145876,0.5295450687408447,0.34119311553145876
28,1,AdaBoost (Discrete),0,0.95,0.9690140845070423,0.9698200429812887,70.99462985992432,0.9698200429812887
29,1,AdaBoost (Real),0,0.95,0.9056338028169014,0.9472967864372446,81.08655500411987,0.9472967864372446
30,1,Logistic Regression (Penalty = L2),0,0.95,0.971830985915493,0.9738886153093352,0.5653178691864014,0.9738886153093352
31,1,Naive Bayes,0,0.95,0.9492957746478873,0.9696643736298215,0.10076737403869629,0.9696643736298215
32,1,KNeighbors Classifier,1,0.95,0.9802538787023978,0.9544743389379742,1.7902233600616455,0.9544743389379742
33,1,SVC Classifier,1,0.95,0.9760225669957687,0.9369604361556937,1.3393280506134033,0.9369604361556937
34,1,Decision Tree,1,0.95,0.9055007052186178,0.7211275968413808,0.09775614738464355,0.7211275968413808
35,1,RandomForest,1,0.95,0.8772919605077574,0.5959837843015386,0.6778786182403564,0.5959837843015386
36,1,AdaBoost (Discrete),1,0.95,0.9703808180535967,0.9184735248681712,68.71751546859741,0.9184735248681712
37,1,AdaBoost (Real),1,0.95,0.9760225669957687,0.9604716417488376,89.06038284301758,0.9604716417488376
38,1,Logistic Regression (Penalty = L2),1,0.95,0.9830747531734838,0.9586977317254218,0.6785628795623779,0.9586977317254218
39,1,Naive Bayes,1,0.95,0.9520451339915373,0.960303152728321,0.18238067626953125,0.960303152728321
40,1,KNeighbors Classifier,2,0.95,0.9632248939179632,0.9130363100692748,2.268630266189575,0.9130363100692748
41,1,SVC Classifier,2,0.95,0.9858557284299858,0.9647590595276887,1.343233346939087,0.9647590595276887
42,1,Decision Tree,2,0.95,0.7425742574257426,0.7933858151953641,0.10408496856689453,0.7933858151953641
43,1,RandomForest,2,0.95,0.8104667609618105,0.3668602943583695,0.5534915924072266,0.3668602943583695
44,1,AdaBoost (Discrete),2,0.95,0.9490806223479491,0.9243004698989746,76.30474472045898,0.9243004698989746
45,1,AdaBoost (Real),2,0.95,0.900990099009901,0.9135395725170454,86.06486535072327,0.9135395725170454
46,1,Logistic Regression (Penalty = L2),2,0.95,0.9660537482319661,0.9311856433435279,0.6837332248687744,0.9311856433435279
47,1,Naive Bayes,2,0.95,0.925035360678925,0.9504885650651899,0.10151219367980957,0.9504885650651899
48,2,KNeighbors Classifier,0,0.95,0.9802816901408451,0.9775023353024564,2.3848955631256104,0.9775023353024564
49,2,SVC Classifier,0,0.95,0.9098591549295775,0.4530153324120529,1.2864127159118652,0.4530153324120529
50,2,Decision Tree,0,0.95,0.8211267605633803,0.49812837267538135,0.17006134986877441,0.49812837267538135
51,2,RandomForest,0,0.95,0.8760563380281691,0.28797501776106194,0.7319872379302979,0.28797501776106194
52,2,AdaBoost (Discrete),0,0.95,0.8985915492957747,0.9359389158981621,77.75884580612183,0.9359389158981621
53,2,AdaBoost (Real),0,0.95,0.9042253521126761,0.9439612067530793,88.48307371139526,0.9439612067530793
54,2,Logistic Regression (Penalty = L2),0,0.95,0.971830985915493,0.976722909042524,0.5535793304443359,0.976722909042524
55,2,Naive Bayes,0,0.95,0.9492957746478873,0.9696643736298215,0.08869075775146484,0.9696643736298215
56,2,KNeighbors Classifier,1,0.95,0.9802538787023978,0.9544743389379742,2.4710822105407715,0.9544743389379742
57,2,SVC Classifier,1,0.95,0.9760225669957687,0.9369604361556937,1.559868574142456,0.9369604361556937
58,2,Decision Tree,1,0.95,0.9351198871650211,0.8855523590846825,0.18148088455200195,0.8855523590846825
59,2,RandomForest,1,0.95,0.8504936530324401,0.7213932098830056,0.7778103351593018,0.0
60,2,AdaBoost (Discrete),1,0.95,0.9703808180535967,0.9184735248681712,83.24413013458252,0.9184735248681712
61,2,AdaBoost (Real),1,0.95,0.9689703808180536,0.9399317893528756,95.35229873657227,0.9399317893528756
62,2,Logistic Regression (Penalty = L2),1,0.95,0.9732016925246827,0.9576354655560266,0.530799388885498,0.9576354655560266
63,2,Naive Bayes,1,0.95,0.9478138222849083,0.9584670045533571,0.10251331329345703,0.9584670045533571
64,2,KNeighbors Classifier,2,0.95,0.9632248939179632,0.9130363100692748,2.5979578495025635,0.9130363100692748
65,2,SVC Classifier,2,0.95,0.9844413012729845,0.9610907387064838,1.5037641525268555,0.9610907387064838
66,2,Decision Tree,2,0.95,0.7722772277227723,0.859241871639448,0.09924030303955078,0.859241871639448
67,2,RandomForest,2,0.95,0.8543140028288543,0.7354021529276429,0.7171599864959717,0.0
68,2,AdaBoost (Discrete),2,0.95,0.9490806223479491,0.9307725490478811,81.89623141288757,0.9307725490478811
69,2,AdaBoost (Real),2,0.95,0.8514851485148515,0.8825583556535177,88.36253666877747,0.8825583556535177
70,2,Logistic Regression (Penalty = L2),2,0.95,0.9646393210749646,0.920520487912849,0.4042809009552002,0.920520487912849
71,2,Naive Bayes,2,0.95,0.925035360678925,0.9504885650651899,0.15851569175720215,0.9504885650651899
72,3,KNeighbors Classifier,0,0.95,0.9802816901408451,0.9775023353024564,2.2766427993774414,0.9775023353024564
73,3,SVC Classifier,0,0.95,0.9098591549295775,0.4530153324120529,1.2816212177276611,0.4530153324120529
74,3,Decision Tree,0,0.95,0.8140845070422535,0.7838176078252984,0.09345006942749023,0.7838176078252984
75,3,RandomForest,0,0.95,0.8647887323943662,0.34119311553145876,0.8325150012969971,0.34119311553145876
76,3,AdaBoost (Discrete),0,0.95,0.8985915492957747,0.9359389158981621,77.8277280330658,0.9359389158981621
77,3,AdaBoost (Real),0,0.95,0.9352112676056338,0.9633961675910943,94.42983269691467,0.9633961675910943
78,3,Logistic Regression (Penalty = L2),0,0.95,0.9690140845070423,0.97267806264422,0.6684696674346924,0.97267806264422
79,3,Naive Bayes,0,0.95,0.9492957746478873,0.9696643736298215,0.2025001049041748,0.9696643736298215
80,3,KNeighbors Classifier,1,0.95,0.9816643159379408,0.9550524580005479,2.261822462081909,0.9550524580005479
81,3,SVC Classifier,1,0.95,0.9760225669957687,0.9369604361556937,1.562819242477417,0.9369604361556937
82,3,Decision Tree,1,0.95,0.9322990126939351,0.8397370418182014,0.20065021514892578,0.8397370418182014
83,3,RandomForest,1,0.95,0.8377997179125529,0.33429141325553335,0.7808125019073486,0.33429141325553335
84,3,AdaBoost (Discrete),1,0.95,0.9703808180535967,0.9184735248681712,82.03743624687195,0.9184735248681712
85,3,AdaBoost (Real),1,0.95,0.9788434414668548,0.9644932777531673,86.98685932159424,0.9644932777531673
86,3,Logistic Regression (Penalty = L2),1,0.95,0.9732016925246827,0.9576354655560266,0.5433616638183594,0.9576354655560266
87,3,Naive Bayes,1,0.95,0.9435825105782792,0.956623794226582,0.1865231990814209,0.956623794226582
88,3,KNeighbors Classifier,2,0.95,0.9632248939179632,0.9130363100692748,2.050668716430664,0.9130363100692748
89,3,SVC Classifier,2,0.95,0.9858557284299858,0.9647590595276887,1.061751127243042,0.9647590595276887
90,3,Decision Tree,2,0.95,0.7383309759547383,0.7582558057434198,0.09653019905090332,0.7582558057434198
91,3,RandomForest,2,0.95,0.8811881188118812,0.8114477237796156,0.8429114818572998,0.8114477237796156
92,3,AdaBoost (Discrete),2,0.95,0.8925035360678925,0.9128585555023241,77.16454839706421,0.9128585555023241
93,3,AdaBoost (Real),2,0.95,0.9123055162659123,0.9121913585422902,81.38758826255798,0.9121913585422902
94,3,Logistic Regression (Penalty = L2),2,0.95,0.9632248939179632,0.9233601839295728,0.5097486972808838,0.9233601839295728
95,3,Naive Bayes,2,0.95,0.925035360678925,0.9504885650651899,0.15011000633239746,0.9504885650651899
96,4,KNeighbors Classifier,0,0.95,0.9816901408450704,0.9781020301371197,2.17986798286438,0.9781020301371197
97,4,SVC Classifier,0,0.95,0.9098591549295775,0.4530153324120529,1.2301409244537354,0.4530153324120529
98,4,Decision Tree,0,0.95,0.7676056338028169,0.8386686409899836,0.08770108222961426,0.8386686409899836
99,4,RandomForest,0,0.95,0.8788732394366198,0.28832365613754857,0.7814757823944092,0.28832365613754857
100,4,AdaBoost (Discrete),0,0.95,0.9112676056338028,0.9330317839676678,71.835378408432,0.9330317839676678
101,4,AdaBoost (Real),0,0.95,0.9154929577464789,0.9517955496471524,83.00096201896667,0.9517955496471524
102,4,Logistic Regression (Penalty = L2),0,0.95,0.971830985915493,0.9738886153093352,0.5711250305175781,0.9738886153093352
103,4,Naive Bayes,0,0.95,0.9492957746478873,0.9696643736298215,0.17656350135803223,0.9696643736298215
104,4,KNeighbors Classifier,1,0.95,0.9788434414668548,0.9508032475140837,2.1757473945617676,0.9508032475140837
105,4,SVC Classifier,1,0.95,0.9760225669957687,0.9369604361556937,1.4643163681030273,0.9369604361556937
106,4,Decision Tree,1,0.95,0.923836389280677,0.7790453334612789,0.17759919166564941,0.7790453334612789
107,4,RandomForest,1,0.95,0.8716502115655853,0.5551019267377704,0.8875408172607422,0.5551019267377704
108,4,AdaBoost (Discrete),1,0.95,0.9703808180535967,0.9184735248681712,73.472660779953,0.9184735248681712
109,4,AdaBoost (Real),1,0.95,0.9732016925246827,0.9535365865469803,75.90380525588989,0.9535365865469803
110,4,Logistic Regression (Penalty = L2),1,0.95,0.9830747531734838,0.9586977317254218,0.5850961208343506,0.9586977317254218
111,4,Naive Bayes,1,0.95,0.9520451339915373,0.960303152728321,0.09002089500427246,0.960303152728321
112,4,KNeighbors Classifier,2,0.95,0.958981612446959,0.911367135761647,2.206857204437256,0.911367135761647
113,4,SVC Classifier,2,0.95,0.9858557284299858,0.9647590595276887,1.2854654788970947,0.9647590595276887
114,4,Decision Tree,2,0.95,0.8811881188118812,0.8995683567839674,0.18501973152160645,0.8995683567839674
115,4,RandomForest,2,0.95,0.8698727015558698,0.5118499955324423,0.7526273727416992,0.5118499955324423
116,4,AdaBoost (Discrete),2,0.95,0.8585572842998586,0.9005747037732416,68.79866814613342,0.9005747037732416
117,4,AdaBoost (Real),2,0.95,0.8330975954738331,0.8887754228443379,79.11218523979187,0.8887754228443379
118,4,Logistic Regression (Penalty = L2),2,0.95,0.9646393210749646,0.9306157621465118,0.5122332572937012,0.9306157621465118
119,4,Naive Bayes,2,0.95,0.925035360678925,0.9504885650651899,0.17844820022583008,0.9504885650651899
120,5,KNeighbors Classifier,0,0.95,0.9816901408450704,0.9781020301371197,2.1784682273864746,0.9781020301371197
121,5,SVC Classifier,0,0.95,0.9098591549295775,0.4530153324120529,1.1942658424377441,0.4530153324120529
122,5,Decision Tree,0,0.95,0.8112676056338028,0.7911558683713399,0.16640591621398926,0.7911558683713399
123,5,RandomForest,0,0.95,0.8647887323943662,0.34119311553145876,0.5992145538330078,0.34119311553145876
124,5,AdaBoost (Discrete),0,0.95,0.9042253521126761,0.906670999278281,69.4104654788971,0.906670999278281
125,5,AdaBoost (Real),0,0.95,0.8788732394366198,0.937468321446211,78.57290720939636,0.937468321446211
126,5,Logistic Regression (Penalty = L2),0,0.95,0.967605633802817,0.9720716547173105,0.4783766269683838,0.9720716547173105
127,5,Naive Bayes,0,0.95,0.9492957746478873,0.9696643736298215,0.1661376953125,0.9696643736298215
128,5,KNeighbors Classifier,1,0.95,0.9816643159379408,0.9519543421581566,2.0826900005340576,0.9519543421581566
129,5,SVC Classifier,1,0.95,0.9760225669957687,0.9369604361556937,1.2004382610321045,0.9369604361556937
130,5,Decision Tree,1,0.95,0.9548660084626234,0.8954129388569566,0.17706060409545898,0.8954129388569566
131,5,RandomForest,1,0.95,0.8377997179125529,0.33429141325553335,0.5956876277923584,0.33429141325553335
132,5,AdaBoost (Discrete),1,0.95,0.9703808180535967,0.9184735248681712,69.04022002220154,0.9184735248681712
133,5,AdaBoost (Real),1,0.95,0.9746121297602257,0.9511958742398139,72.41715288162231,0.9511958742398139
134,5,Logistic Regression (Penalty = L2),1,0.95,0.9732016925246827,0.9576354655560266,0.5067105293273926,0.9576354655560266
135,5,Naive Bayes,1,0.95,0.9492242595204513,0.9590798352858977,0.13408327102661133,0.9590798352858977
136,5,KNeighbors Classifier,2,0.95,0.9632248939179632,0.9130363100692748,1.7869715690612793,0.9130363100692748
137,5,SVC Classifier,2,0.95,0.9844413012729845,0.9610907387064838,1.0640349388122559,0.9610907387064838
138,5,Decision Tree,2,0.95,0.9688826025459689,0.9695896664211617,0.15704798698425293,0.9695896664211617
139,5,RandomForest,2,0.95,0.8811881188118812,0.8114477237796156,0.5349750518798828,0.8114477237796156
140,5,AdaBoost (Discrete),2,0.95,0.9236209335219236,0.9263480050091923,62.43865942955017,0.9263480050091923
141,5,AdaBoost (Real),2,0.95,0.8995756718528995,0.9067507240108329,66.02925181388855,0.9067507240108329
142,5,Logistic Regression (Penalty = L2),2,0.95,0.9632248939179632,0.9300451821370445,0.3998239040374756,0.9300451821370445
143,5,Naive Bayes,2,0.95,0.925035360678925,0.9504885650651899,0.13825201988220215,0.9504885650651899
144,6,KNeighbors Classifier,0,0.95,0.9816901408450704,0.9781020301371197,1.8320391178131104,0.9781020301371197
145,6,SVC Classifier,0,0.95,0.9098591549295775,0.4530153324120529,0.930025577545166,0.4530153324120529
146,6,Decision Tree,0,0.95,0.8633802816901408,0.8782867985940985,0.06500363349914551,0.8782867985940985
147,6,RandomForest,0,0.95,0.8830985915492958,0.391315405750407,0.5153224468231201,0.391315405750407
148,6,AdaBoost (Discrete),0,0.95,0.9070422535211268,0.9311468661390812,53.22608780860901,0.9311468661390812
149,6,AdaBoost (Real),0,0.95,0.9507042253521126,0.9647349852090515,57.75106739997864,0.9647349852090515
150,6,Logistic Regression (Penalty = L2),0,0.95,0.9661971830985916,0.9714644892534604,0.2885119915008545,0.9714644892534604
151,6,Naive Bayes,0,0.95,0.9492957746478873,0.9696643736298215,0.06252837181091309,0.9696643736298215
152,6,KNeighbors Classifier,1,0.95,0.9830747531734838,0.9556298780069972,1.4295125007629395,0.9556298780069972
153,6,SVC Classifier,1,0.95,0.9760225669957687,0.9369604361556937,0.9491052627563477,0.9369604361556937
154,6,Decision Tree,1,0.95,0.919605077574048,0.7899998616247672,0.06070423126220703,0.7899998616247672
155,6,RandomForest,1,0.95,0.8885754583921015,0.6394764685495609,0.47870802879333496,0.6394764685495609
156,6,AdaBoost (Discrete),1,0.95,0.9703808180535967,0.9184735248681712,45.41664719581604,0.9184735248681712
157,6,AdaBoost (Real),1,0.95,0.9717912552891397,0.9440971330100035,50.78137564659119,0.9440971330100035
158,6,Logistic Regression (Penalty = L2),1,0.95,0.9732016925246827,0.9576354655560266,0.368300199508667,0.9576354655560266
159,6,Naive Bayes,1,0.95,0.9435825105782792,0.956623794226582,0.170274019241333,0.956623794226582
160,6,KNeighbors Classifier,2,0.95,0.9632248939179632,0.9130363100692748,1.1912846565246582,0.9130363100692748
161,6,SVC Classifier,2,0.95,0.9858557284299858,0.9647590595276887,0.763843297958374,0.9647590595276887
162,6,Decision Tree,2,0.95,0.8642149929278642,0.7206052678546253,0.06011795997619629,0.7206052678546253
163,6,RandomForest,2,0.95,0.8981612446958982,0.6788934713617002,0.38439011573791504,0.6788934713617002
164,6,AdaBoost (Discrete),2,0.95,0.9236209335219236,0.9263480050091923,42.089348793029785,0.9263480050091923
165,6,AdaBoost (Real),2,0.95,0.8769448373408769,0.8999653837605851,42.173799991607666,0.8999653837605851
166,6,Logistic Regression (Penalty = L2),2,0.95,0.9632248939179632,0.9300451821370445,0.2497093677520752,0.9300451821370445
167,6,Naive Bayes,2,0.95,0.925035360678925,0.9504885650651899,0.05088162422180176,0.9504885650651899
168,7,KNeighbors Classifier,0,0.95,0.9802816901408451,0.9775023353024564,1.099198341369629,0.9775023353024564
169,7,SVC Classifier,0,0.95,0.9098591549295775,0.4530153324120529,0.6535038948059082,0.4530153324120529
170,7,Decision Tree,0,0.95,0.9056338028169014,0.9328607423902393,0.053735971450805664,0.9328607423902393
171,7,RandomForest,0,0.95,0.8647887323943662,0.34119311553145876,0.350449800491333,0.34119311553145876
172,7,AdaBoost (Discrete),0,0.95,0.9690140845070423,0.9698200429812887,37.69340181350708,0.9698200429812887
173,7,AdaBoost (Real),0,0.95,0.9,0.9447067617923817,40.27401876449585,0.9447067617923817
174,7,Logistic Regression (Penalty = L2),0,0.95,0.971830985915493,0.9738886153093352,0.2657186985015869,0.9738886153093352
175,7,Naive Bayes,0,0.95,0.9492957746478873,0.9696643736298215,0.08893847465515137,0.9696643736298215
176,7,KNeighbors Classifier,1,0.95,0.9802538787023978,0.9544743389379742,1.0772244930267334,0.9544743389379742
177,7,SVC Classifier,1,0.95,0.9760225669957687,0.9369604361556937,0.7214713096618652,0.9369604361556937
178,7,Decision Tree,1,0.95,0.921015514809591,0.7543734533427408,0.044797658920288086,0.7543734533427408
179,7,RandomForest,1,0.95,0.8772919605077574,0.5959837843015386,0.3896446228027344,0.5959837843015386
180,7,AdaBoost (Discrete),1,0.95,0.9647390691114246,0.896062730767775,33.464223861694336,0.896062730767775
181,7,AdaBoost (Real),1,0.95,0.9760225669957687,0.9604716417488376,38.66184449195862,0.9604716417488376
182,7,Logistic Regression (Penalty = L2),1,0.95,0.9830747531734838,0.9586977317254218,0.2889442443847656,0.9586977317254218
183,7,Naive Bayes,1,0.95,0.9520451339915373,0.960303152728321,0.09919285774230957,0.960303152728321
184,7,KNeighbors Classifier,2,0.95,0.9632248939179632,0.9130363100692748,0.911980390548706,0.9130363100692748
185,7,SVC Classifier,2,0.95,0.9858557284299858,0.9647590595276887,0.5294046401977539,0.9647590595276887
186,7,Decision Tree,2,0.95,0.8939179632248939,0.8305717727423868,0.036789894104003906,0.8305717727423868
187,7,RandomForest,2,0.95,0.8104667609618105,0.3668602943583695,0.33679842948913574,0.3668602943583695
188,7,AdaBoost (Discrete),2,0.95,0.9490806223479491,0.9243004698989746,33.35541224479675,0.9243004698989746
189,7,AdaBoost (Real),2,0.95,0.8486562942008486,0.8988665238353339,35.872647762298584,0.8988665238353339
190,7,Logistic Regression (Penalty = L2),2,0.95,0.9660537482319661,0.9311856433435279,0.26445722579956055,0.9311856433435279
191,7,Naive Bayes,2,0.95,0.925035360678925,0.9504885650651899,0.0713951587677002,0.9504885650651899
192,8,KNeighbors Classifier,0,0.95,0.9802816901408451,0.9775023353024564,0.956998348236084,0.9775023353024564
193,8,SVC Classifier,0,0.95,0.9098591549295775,0.4530153324120529,0.5597898960113525,0.4530153324120529
194,8,Decision Tree,0,0.95,0.9422535211267605,0.9174774130526242,0.036980628967285156,0.9174774130526242
195,8,RandomForest,0,0.95,0.8788732394366198,0.28832365613754857,0.32059335708618164,0.28832365613754857
196,8,AdaBoost (Discrete),0,0.95,0.9690140845070423,0.9698200429812887,30.44638991355896,0.9698200429812887
197,8,AdaBoost (Real),0,0.95,0.9154929577464789,0.9470230898190507,34.416356801986694,0.9470230898190507
198,8,Logistic Regression (Penalty = L2),0,0.95,0.9746478873239437,0.9750961659762587,0.24224162101745605,0.9750961659762587
199,8,Naive Bayes,0,0.95,0.9492957746478873,0.9696643736298215,0.04618477821350098,0.9696643736298215
200,8,KNeighbors Classifier,1,0.95,0.9802538787023978,0.9544743389379742,0.9232959747314453,0.9544743389379742
201,8,SVC Classifier,1,0.95,0.9760225669957687,0.9369604361556937,0.5529465675354004,0.9369604361556937
202,8,Decision Tree,1,0.95,0.9294781382228491,0.844104762200173,0.03677082061767578,0.844104762200173
203,8,RandomForest,1,0.95,0.8716502115655853,0.5551019267377704,0.3062479496002197,0.5551019267377704
204,8,AdaBoost (Discrete),1,0.95,0.9703808180535967,0.9184735248681712,29.866910696029663,0.9184735248681712
205,8,AdaBoost (Real),1,0.95,0.9774330042313117,0.9493954419911241,31.6150643825531,0.9493954419911241
206,8,Logistic Regression (Penalty = L2),1,0.95,0.9816643159379408,0.9550524580005479,0.21507740020751953,0.9550524580005479
207,8,Naive Bayes,1,0.95,0.9449929478138223,0.9572389865467684,0.06215953826904297,0.9572389865467684
208,8,KNeighbors Classifier,2,0.95,0.9632248939179632,0.9130363100692748,0.9303898811340332,0.9130363100692748
209,8,SVC Classifier,2,0.95,0.9872701555869873,0.9683996942491399,0.5106594562530518,0.9683996942491399
210,8,Decision Tree,2,0.95,0.7029702970297029,0.6893203910514036,0.03140592575073242,0.6893203910514036
211,8,RandomForest,2,0.95,0.8698727015558698,0.5118499955324423,0.2681543827056885,0.5118499955324423
212,8,AdaBoost (Discrete),2,0.95,0.9490806223479491,0.9243004698989746,26.69809365272522,0.9243004698989746
213,8,AdaBoost (Real),2,0.95,0.8359264497878359,0.8814633099057569,31.136383295059204,0.8814633099057569
214,8,Logistic Regression (Penalty = L2),2,0.95,0.9646393210749646,0.9306157621465118,0.24260163307189941,0.9306157621465118
215,8,Naive Bayes,2,0.95,0.925035360678925,0.9504885650651899,0.045906782150268555,0.9504885650651899
216,9,KNeighbors Classifier,0,0.95,0.9802816901408451,0.9775023353024564,0.8551356792449951,0.9775023353024564
217,9,SVC Classifier,0,0.95,0.9098591549295775,0.4530153324120529,0.42236757278442383,0.4530153324120529
218,9,Decision Tree,0,0.95,0.7338028169014085,0.6623698763633661,0.028769731521606445,0.6623698763633661
219,9,RandomForest,0,0.95,0.8647887323943662,0.34119311553145876,0.2654554843902588,0.34119311553145876
220,9,AdaBoost (Discrete),0,0.95,0.8985915492957747,0.9359389158981621,36.275657415390015,0.9359389158981621
221,9,AdaBoost (Real),0,0.95,0.8788732394366198,0.937468321446211,49.43826174736023,0.937468321446211
222,9,Logistic Regression (Penalty = L2),0,0.95,0.9690140845070423,0.97267806264422,0.3256847858428955,0.97267806264422
223,9,Naive Bayes,0,0.95,0.9492957746478873,0.9696643736298215,0.05856180191040039,0.9696643736298215
224,9,KNeighbors Classifier,1,0.95,0.9816643159379408,0.9550524580005479,1.2379651069641113,0.9550524580005479
225,9,SVC Classifier,1,0.95,0.9760225669957687,0.9369604361556937,0.8251588344573975,0.9369604361556937
226,9,Decision Tree,1,0.95,0.9605077574047954,0.9401648495631095,0.10178375244140625,0.9401648495631095
227,9,RandomForest,1,0.95,0.8377997179125529,0.33429141325553335,0.332627534866333,0.33429141325553335
228,9,AdaBoost (Discrete),1,0.95,0.9703808180535967,0.9184735248681712,40.172237396240234,0.9184735248681712
229,9,AdaBoost (Real),1,0.95,0.9788434414668548,0.9644932777531673,47.074238777160645,0.9644932777531673
230,9,Logistic Regression (Penalty = L2),1,0.95,0.9732016925246827,0.9576354655560266,0.3704202175140381,0.9576354655560266
231,9,Naive Bayes,1,0.95,0.9435825105782792,0.956623794226582,0.04899168014526367,0.956623794226582
232,9,KNeighbors Classifier,2,0.95,0.9632248939179632,0.9130363100692748,1.067148208618164,0.9130363100692748
233,9,SVC Classifier,2,0.95,0.9858557284299858,0.9647590595276887,0.7176005840301514,0.9647590595276887
234,9,Decision Tree,2,0.95,0.6463932107496464,0.751347881608234,0.09407973289489746,0.751347881608234
235,9,RandomForest,2,0.95,0.8811881188118812,0.8114477237796156,0.38616180419921875,0.8114477237796156
236,9,AdaBoost (Discrete),2,0.95,0.8925035360678925,0.9128585555023241,39.63492560386658,0.9128585555023241
237,9,AdaBoost (Real),2,0.95,0.8698727015558698,0.8937953667103354,45.16512751579285,0.8937953667103354
238,9,Logistic Regression (Penalty = L2),2,0.95,0.9632248939179632,0.9233601839295728,0.2933814525604248,0.9233601839295728
239,9,Naive Bayes,2,0.95,0.925035360678925,0.9504885650651899,0.09632372856140137,0.9504885650651899
240,10,KNeighbors Classifier,0,0.95,0.9802816901408451,0.9775023353024564,1.2819631099700928,0.9775023353024564
241,10,SVC Classifier,0,0.95,0.9098591549295775,0.4530153324120529,0.6835525035858154,0.4530153324120529
242,10,Decision Tree,0,0.95,0.8788732394366198,0.7398961130295558,0.04757118225097656,0.7398961130295558
243,10,RandomForest,0,0.95,0.7943661971830986,0.18323535414199785,0.3830864429473877,0.18323535414199785
244,10,AdaBoost (Discrete),0,0.95,0.8985915492957747,0.9359389158981621,40.18584108352661,0.9359389158981621
245,10,AdaBoost (Real),0,0.95,0.9056338028169014,0.9425559333526633,45.23052453994751,0.9425559333526633
246,10,Logistic Regression (Penalty = L2),0,0.95,0.971830985915493,0.976722909042524,0.29001593589782715,0.976722909042524
247,10,Naive Bayes,0,0.95,0.9492957746478873,0.9696643736298215,0.08265900611877441,0.9696643736298215
248,10,KNeighbors Classifier,1,0.95,0.9802538787023978,0.9544743389379742,1.193206787109375,0.9544743389379742
249,10,SVC Classifier,1,0.95,0.9760225669957687,0.9369604361556937,0.8138189315795898,0.9369604361556937
250,10,Decision Tree,1,0.95,0.9605077574047954,0.9303817492241766,0.05266237258911133,0.9303817492241766
251,10,RandomForest,1,0.95,0.8547249647390691,0.4773726345225945,0.2895231246948242,0.4773726345225945
252,10,AdaBoost (Discrete),1,0.95,0.9703808180535967,0.9184735248681712,39.506526708602905,0.9184735248681712
253,10,AdaBoost (Real),1,0.95,0.9689703808180536,0.9399317893528756,43.98147678375244,0.9399317893528756
254,10,Logistic Regression (Penalty = L2),1,0.95,0.9732016925246827,0.9576354655560266,0.3175027370452881,0.9576354655560266
255,10,Naive Bayes,1,0.95,0.9478138222849083,0.9584670045533571,0.04631543159484863,0.9584670045533571
256,10,KNeighbors Classifier,2,0.95,0.9632248939179632,0.9130363100692748,1.2126832008361816,0.9130363100692748
257,10,SVC Classifier,2,0.95,0.9844413012729845,0.9610907387064838,0.7253665924072266,0.9610907387064838
258,10,Decision Tree,2,0.95,0.785007072135785,0.8070004064849057,0.053005218505859375,0.8070004064849057
259,10,RandomForest,2,0.95,0.8571428571428571,0.4883038891273956,0.4265871047973633,0.4883038891273956
260,10,AdaBoost (Discrete),2,0.95,0.9490806223479491,0.9307725490478811,36.40380668640137,0.9307725490478811
261,10,AdaBoost (Real),2,0.95,0.8217821782178217,0.8690378249304351,43.90164518356323,0.8690378249304351
262,10,Logistic Regression (Penalty = L2),2,0.95,0.9646393210749646,0.920520487912849,0.32139134407043457,0.920520487912849
263,10,Naive Bayes,2,0.95,0.925035360678925,0.9504885650651899,0.09408211708068848,0.9504885650651899
264,11,KNeighbors Classifier,0,0.95,0.9802816901408451,0.9775023353024564,1.2072572708129883,0.9775023353024564
265,11,SVC Classifier,0,0.95,0.9098591549295775,0.4530153324120529,0.6720201969146729,0.4530153324120529
266,11,Decision Tree,0,0.95,0.8971830985915493,0.713444273464973,0.04480624198913574,0.713444273464973
267,11,RandomForest,0,0.95,0.8760563380281691,0.28797501776106194,0.3559131622314453,0.28797501776106194
268,11,AdaBoost (Discrete),0,0.95,0.8985915492957747,0.9359389158981621,36.805294036865234,0.9359389158981621
269,11,AdaBoost (Real),0,0.95,0.9056338028169014,0.9472967864372446,41.225117921829224,0.9472967864372446
270,11,Logistic Regression (Penalty = L2),0,0.95,0.971830985915493,0.976722909042524,0.2823915481567383,0.976722909042524
271,11,Naive Bayes,0,0.95,0.9492957746478873,0.9696643736298215,0.09552597999572754,0.9696643736298215
272,11,KNeighbors Classifier,1,0.95,0.9802538787023978,0.9544743389379742,1.0927436351776123,0.9544743389379742
273,11,SVC Classifier,1,0.95,0.9760225669957687,0.9369604361556937,0.7645316123962402,0.9369604361556937
274,11,Decision Tree,1,0.95,0.9322990126939351,0.8386912909955824,0.04770803451538086,0.8386912909955824
275,11,RandomForest,1,0.95,0.8504936530324401,0.7213932098830056,0.3102595806121826,0.0
276,11,AdaBoost (Discrete),1,0.95,0.9703808180535967,0.9184735248681712,36.73366355895996,0.9184735248681712
277,11,AdaBoost (Real),1,0.95,0.9689703808180536,0.9399317893528756,41.61251878738403,0.9399317893528756
278,11,Logistic Regression (Penalty = L2),1,0.95,0.9732016925246827,0.9576354655560266,0.3580341339111328,0.9576354655560266
279,11,Naive Bayes,1,0.95,0.9478138222849083,0.9584670045533571,0.0759437084197998,0.9584670045533571
280,11,KNeighbors Classifier,2,0.95,0.9632248939179632,0.9130363100692748,1.0353341102600098,0.9130363100692748
281,11,SVC Classifier,2,0.95,0.9844413012729845,0.9610907387064838,0.5983054637908936,0.9610907387064838
282,11,Decision Tree,2,0.95,0.9080622347949081,0.8299195683411319,0.07808089256286621,0.8299195683411319
283,11,RandomForest,2,0.95,0.8543140028288543,0.7354021529276429,0.27184581756591797,0.0
284,11,AdaBoost (Discrete),2,0.95,0.9490806223479491,0.9307725490478811,34.60790681838989,0.9307725490478811
285,11,AdaBoost (Real),2,0.95,0.8359264497878359,0.8694463226050201,40.9836642742157,0.8694463226050201
286,11,Logistic Regression (Penalty = L2),2,0.95,0.9646393210749646,0.920520487912849,0.2516951560974121,0.920520487912849
287,11,Naive Bayes,2,0.95,0.925035360678925,0.9504885650651899,0.09865117073059082,0.9504885650651899
288,12,KNeighbors Classifier,0,0.95,0.9802816901408451,0.9775023353024564,1.0981616973876953,0.9775023353024564
289,12,SVC Classifier,0,0.95,0.9098591549295775,0.4530153324120529,0.6502895355224609,0.4530153324120529
290,12,Decision Tree,0,0.95,0.8169014084507042,0.7720971280869169,0.04100370407104492,0.7720971280869169
291,12,RandomForest,0,0.95,0.8929577464788733,0.40394711222788526,0.30719661712646484,0.40394711222788526
292,12,AdaBoost (Discrete),0,0.95,0.9112676056338028,0.9330317839676678,35.532305002212524,0.9330317839676678
293,12,AdaBoost (Real),0,0.95,0.9,0.9447067617923817,38.367746114730835,0.9447067617923817
294,12,Logistic Regression (Penalty = L2),0,0.95,0.9704225352112676,0.9732837153926499,0.3528470993041992,0.9732837153926499
295,12,Naive Bayes,0,0.95,0.9492957746478873,0.9696643736298215,0.04597306251525879,0.9696643736298215
296,12,KNeighbors Classifier,1,0.95,0.9802538787023978,0.9544743389379742,0.8890745639801025,0.9544743389379742
297,12,SVC Classifier,1,0.95,0.9760225669957687,0.9369604361556937,0.6493515968322754,0.9369604361556937
298,12,Decision Tree,1,0.95,0.9421720733427362,0.8575030831723651,0.045183658599853516,0.8575030831723651
299,12,RandomForest,1,0.95,0.9069111424541608,0.7036020988556314,0.3898506164550781,0.7036020988556314
300,12,AdaBoost (Discrete),1,0.95,0.9703808180535967,0.9184735248681712,34.68501114845276,0.9184735248681712
301,12,AdaBoost (Real),1,0.95,0.9717912552891397,0.9349537231333894,36.34241795539856,0.9349537231333894
302,12,Logistic Regression (Penalty = L2),1,0.95,0.9816643159379408,0.9550524580005479,0.25298309326171875,0.9550524580005479
303,12,Naive Bayes,1,0.95,0.9449929478138223,0.9572389865467684,0.06408953666687012,0.9572389865467684
304,12,KNeighbors Classifier,2,0.95,0.9603960396039604,0.9119242062767432,0.8930237293243408,0.9119242062767432
305,12,SVC Classifier,2,0.95,0.9872701555869873,0.9683996942491399,0.5266842842102051,0.9683996942491399
306,12,Decision Tree,2,0.95,0.6831683168316832,0.7469763984184251,0.07764101028442383,0.7469763984184251
307,12,RandomForest,2,0.95,0.7256011315417256,0.7445675063493542,0.2776620388031006,0.7445675063493542
308,12,AdaBoost (Discrete),2,0.95,0.9066478076379066,0.9001939754350743,34.87678861618042,0.9001939754350743
309,12,AdaBoost (Real),2,0.95,0.8330975954738331,0.8859374183494323,39.55962777137756,0.8859374183494323
310,12,Logistic Regression (Penalty = L2),2,0.95,0.9646393210749646,0.9306157621465118,0.3596217632293701,0.9306157621465118
311,12,Naive Bayes,2,0.95,0.925035360678925,0.9504885650651899,0.09839963912963867,0.9504885650651899
