,feat_set_id,classifier,fold_id,feat_th,score,geo_score,exec_t,geo_score_woz
0,0,KNeighbors Classifier,0,0.8,0.7749,0.5610890679092885,20.455536365509033,0.5610890679092885
1,0,SVC Classifier,0,0.8,0.7795,0.09014398837291854,66.79480075836182,0.09014398837291854
2,0,Decision Tree,0,0.8,0.7272,0.5764195010539562,0.3113408088684082,0.5764195010539562
3,0,RandomForest,0,0.8,0.8052,0.47079097199502645,0.48119044303894043,0.47079097199502645
4,0,AdaBoost (Discrete),0,0.8,0.808,0.5652450874911917,107.9396903514862,0.5652450874911917
5,0,AdaBoost (Real),0,0.8,0.7867,0.5661415772978075,132.12123799324036,0.5661415772978075
6,0,Logistic Regression (Penalty = L2),0,0.8,0.8057,0.4803746456314145,0.5663092136383057,0.4803746456314145
7,0,Naive Bayes,0,0.8,0.6991,0.6687770363901733,0.16697287559509277,0.6687770363901733
8,0,KNeighbors Classifier,1,0.8,0.7754,0.5954949844620415,18.60635495185852,0.5954949844620415
9,0,SVC Classifier,1,0.8,0.7788,1.0,62.32783269882202,0.0
10,0,Decision Tree,1,0.8,0.7237,0.5872314817814552,0.35242414474487305,0.5872314817814552
11,0,RandomForest,1,0.8,0.809,0.4902246102151431,0.5422079563140869,0.4902246102151431
12,0,AdaBoost (Discrete),1,0.8,0.82,0.6139302623598549,113.33635520935059,0.6139302623598549
13,0,AdaBoost (Real),1,0.8,0.7954,0.5969188143839821,139.3564896583557,0.5969188143839821
14,0,Logistic Regression (Penalty = L2),1,0.8,0.814,0.5085035028131868,0.452725887298584,0.5085035028131868
15,0,Naive Bayes,1,0.8,0.6217,0.6649217464077112,0.13444828987121582,0.6649217464077112
16,0,KNeighbors Classifier,2,0.8,0.7818,0.5615957235157102,15.929107666015625,0.5615957235157102
17,0,SVC Classifier,2,0.8,0.7788,1.0,59.428489685058594,0.0
18,0,Decision Tree,2,0.8,0.7374,0.5725472846322142,0.32588863372802734,0.5725472846322142
19,0,RandomForest,2,0.8,0.8079,0.4330918550979268,0.49364185333251953,0.4330918550979268
20,0,AdaBoost (Discrete),2,0.8,0.821,0.5605540987622475,110.03532481193542,0.5605540987622475
21,0,AdaBoost (Real),2,0.8,0.7915,0.5595116242044255,122.639967918396,0.5595116242044255
22,0,Logistic Regression (Penalty = L2),2,0.8,0.8084,0.4442144970626748,0.507251501083374,0.4442144970626748
23,0,Naive Bayes,2,0.8,0.7633,0.6908839809298557,0.13984918594360352,0.6908839809298557
24,1,KNeighbors Classifier,0,0.8,0.7719,0.5627443073930617,13.277503252029419,0.5627443073930617
25,1,SVC Classifier,0,0.8,0.7788,1.0,57.94188404083252,0.0
26,1,Decision Tree,0,0.8,0.7083,0.5609800143247539,0.5667614936828613,0.5609800143247539
27,1,RandomForest,0,0.8,0.7932,0.34961506459676134,0.7337899208068848,0.34961506459676134
28,1,AdaBoost (Discrete),0,0.8,0.8076,0.5684522121262393,157.48360466957092,0.5684522121262393
29,1,AdaBoost (Real),0,0.8,0.7878,0.5665807098498372,173.17917919158936,0.5665807098498372
30,1,Logistic Regression (Penalty = L2),0,0.8,0.8075,0.4855783273069601,0.5268428325653076,0.4855783273069601
31,1,Naive Bayes,0,0.8,0.4357,0.5205325462320364,0.13559651374816895,0.5205325462320364
32,1,KNeighbors Classifier,1,0.8,0.7735,0.5885132633835618,15.95016074180603,0.5885132633835618
33,1,SVC Classifier,1,0.8,0.7788,1.0,50.34795093536377,0.0
34,1,Decision Tree,1,0.8,0.7291,0.5923938049544399,0.442030668258667,0.5923938049544399
35,1,RandomForest,1,0.8,0.793,0.31791192874523566,0.6696641445159912,0.31791192874523566
36,1,AdaBoost (Discrete),1,0.8,0.8201,0.6019370306498497,158.9435110092163,0.6019370306498497
37,1,AdaBoost (Real),1,0.8,0.7947,0.6061727245411668,164.71552991867065,0.6061727245411668
38,1,Logistic Regression (Penalty = L2),1,0.8,0.8123,0.49624281802440284,0.4133918285369873,0.49624281802440284
39,1,Naive Bayes,1,0.8,0.3965,0.47764692528265545,0.12408208847045898,0.47764692528265545
40,1,KNeighbors Classifier,2,0.8,0.7804,0.5607134991418165,11.74737024307251,0.5607134991418165
41,1,SVC Classifier,2,0.8,0.7788,1.0,54.316444396972656,0.0
42,1,Decision Tree,2,0.8,0.7308,0.5624611353716171,0.5354006290435791,0.5624611353716171
43,1,RandomForest,2,0.8,0.786,0.22542416360742895,0.6151354312896729,0.22542416360742895
44,1,AdaBoost (Discrete),2,0.8,0.8204,0.5638139574173617,151.46582102775574,0.5638139574173617
45,1,AdaBoost (Real),2,0.8,0.7885,0.5499531140344198,167.20510911941528,0.5499531140344198
46,1,Logistic Regression (Penalty = L2),2,0.8,0.8096,0.45201146508356704,0.5213444232940674,0.45201146508356704
47,1,Naive Bayes,2,0.8,0.4976,0.5778300595962537,0.12340569496154785,0.5778300595962537
48,2,KNeighbors Classifier,0,0.8,0.7727,0.5527727586352638,20.920902967453003,0.5527727586352638
49,2,SVC Classifier,0,0.8,0.7795,0.09014398837291854,65.23077082633972,0.09014398837291854
50,2,Decision Tree,0,0.8,0.7231,0.5622527795614183,0.4937427043914795,0.5622527795614183
51,2,RandomForest,0,0.8,0.8043,0.46877106425961906,0.5952703952789307,0.46877106425961906
52,2,AdaBoost (Discrete),0,0.8,0.8084,0.571432322782713,184.00109219551086,0.571432322782713
53,2,AdaBoost (Real),0,0.8,0.7833,0.5612174425465434,194.45558309555054,0.5612174425465434
54,2,Logistic Regression (Penalty = L2),0,0.8,0.8053,0.47855158537113107,0.5370392799377441,0.47855158537113107
55,2,Naive Bayes,0,0.8,0.6999,0.669068178875443,0.20133733749389648,0.669068178875443
56,2,KNeighbors Classifier,1,0.8,0.7742,0.5905844630505642,22.449360847473145,0.5905844630505642
57,2,SVC Classifier,1,0.8,0.7788,1.0,64.02401614189148,0.0
58,2,Decision Tree,1,0.8,0.732,0.608485605301392,0.4472818374633789,0.608485605301392
59,2,RandomForest,1,0.8,0.8139,0.5000328542152023,0.5747025012969971,0.5000328542152023
60,2,AdaBoost (Discrete),1,0.8,0.8216,0.6118545082393085,170.9126751422882,0.6118545082393085
61,2,AdaBoost (Real),1,0.8,0.7908,0.6000645674349505,193.05384349822998,0.6000645674349505
62,2,Logistic Regression (Penalty = L2),1,0.8,0.8112,0.4930066682155156,0.5579037666320801,0.4930066682155156
63,2,Naive Bayes,1,0.8,0.6219,0.6654425538269252,0.1586904525756836,0.6654425538269252
64,2,KNeighbors Classifier,2,0.8,0.7812,0.5584271325966685,20.86535882949829,0.5584271325966685
65,2,SVC Classifier,2,0.8,0.7788,1.0,66.71328234672546,0.0
66,2,Decision Tree,2,0.8,0.7367,0.5623851205091143,0.43102455139160156,0.5623851205091143
67,2,RandomForest,2,0.8,0.8103,0.45083326282351316,0.6647722721099854,0.45083326282351316
68,2,AdaBoost (Discrete),2,0.8,0.8222,0.571036262961712,180.81163430213928,0.571036262961712
69,2,AdaBoost (Real),2,0.8,0.795,0.5592060028132847,191.17482542991638,0.5592060028132847
70,2,Logistic Regression (Penalty = L2),2,0.8,0.8092,0.45418817824310664,0.43701934814453125,0.45418817824310664
71,2,Naive Bayes,2,0.8,0.7555,0.6903668109526303,0.1706838607788086,0.6903668109526303
72,3,KNeighbors Classifier,0,0.8,0.7696,0.5680797741727439,14.287901639938354,0.5680797741727439
73,3,SVC Classifier,0,0.8,0.7795,0.09014398837291854,56.71662759780884,0.09014398837291854
74,3,Decision Tree,0,0.8,0.7244,0.5770708443114719,0.46967029571533203,0.5770708443114719
75,3,RandomForest,0,0.8,0.8026,0.45898302879256186,0.6247372627258301,0.45898302879256186
76,3,AdaBoost (Discrete),0,0.8,0.8072,0.5676271265146373,141.8375163078308,0.5676271265146373
77,3,AdaBoost (Real),0,0.8,0.7857,0.5595496984326359,162.36628246307373,0.5595496984326359
78,3,Logistic Regression (Penalty = L2),0,0.8,0.8044,0.47826547485508286,0.4949517250061035,0.47826547485508286
79,3,Naive Bayes,0,0.8,0.7582,0.665394312500725,0.15015459060668945,0.665394312500725
80,3,KNeighbors Classifier,1,0.8,0.779,0.5955907498265686,13.125755071640015,0.5955907498265686
81,3,SVC Classifier,1,0.8,0.7788,1.0,58.47447180747986,0.0
82,3,Decision Tree,1,0.8,0.728,0.5916158964930722,0.45662569999694824,0.5916158964930722
83,3,RandomForest,1,0.8,0.8072,0.4783030988160522,0.653515100479126,0.4783030988160522
84,3,AdaBoost (Discrete),1,0.8,0.8202,0.6140142186354419,137.74134039878845,0.6140142186354419
85,3,AdaBoost (Real),1,0.8,0.7927,0.6017671834054799,155.44126296043396,0.6017671834054799
86,3,Logistic Regression (Penalty = L2),1,0.8,0.8127,0.4967834180136993,0.4634690284729004,0.4967834180136993
87,3,Naive Bayes,1,0.8,0.7637,0.7081735085425148,0.13689970970153809,0.7081735085425148
88,3,KNeighbors Classifier,2,0.8,0.7792,0.5520453287841668,14.4739351272583,0.5520453287841668
89,3,SVC Classifier,2,0.8,0.7788,1.0,56.17761564254761,0.0
90,3,Decision Tree,2,0.8,0.7392,0.5721915123473934,0.4281594753265381,0.5721915123473934
91,3,RandomForest,2,0.8,0.8073,0.4424827338322855,0.6236047744750977,0.4424827338322855
92,3,AdaBoost (Discrete),2,0.8,0.8208,0.5691341950547959,135.13189315795898,0.5691341950547959
93,3,AdaBoost (Real),2,0.8,0.791,0.5461213441686846,151.49451446533203,0.5461213441686846
94,3,Logistic Regression (Penalty = L2),2,0.8,0.8095,0.4524421799479965,0.443859338760376,0.4524421799479965
95,3,Naive Bayes,2,0.8,0.7811,0.6838872247327862,0.16620469093322754,0.6838872247327862
96,4,KNeighbors Classifier,0,0.8,0.7719,0.5573153253591185,9.057406902313232,0.5573153253591185
97,4,SVC Classifier,0,0.8,0.7788,1.0,44.76296019554138,0.0
98,4,Decision Tree,0,0.8,0.7178,0.5655334347369074,0.2954235076904297,0.5655334347369074
99,4,RandomForest,0,0.8,0.7931,0.340257050179211,0.5258724689483643,0.340257050179211
100,4,AdaBoost (Discrete),0,0.8,0.8085,0.5623842947651296,98.34077453613281,0.5623842947651296
101,4,AdaBoost (Real),0,0.8,0.7846,0.556148327690653,111.91680526733398,0.556148327690653
102,4,Logistic Regression (Penalty = L2),0,0.8,0.8079,0.48528858451264034,0.38578104972839355,0.48528858451264034
103,4,Naive Bayes,0,0.8,0.4339,0.5184394015070012,0.13227295875549316,0.5184394015070012
104,4,KNeighbors Classifier,1,0.8,0.772,0.5791997015532874,8.605224847793579,0.5791997015532874
105,4,SVC Classifier,1,0.8,0.7788,1.0,42.67382454872131,0.0
106,4,Decision Tree,1,0.8,0.7234,0.5713862527064952,0.2885556221008301,0.5713862527064952
107,4,RandomForest,1,0.8,0.7918,0.3036767814747179,0.46657514572143555,0.3036767814747179
108,4,AdaBoost (Discrete),1,0.8,0.8215,0.6139509688592495,91.51882004737854,0.6139509688592495
109,4,AdaBoost (Real),1,0.8,0.7958,0.5955708669870561,110.61758613586426,0.5955708669870561
110,4,Logistic Regression (Penalty = L2),1,0.8,0.8123,0.49046510415460987,0.285991907119751,0.49046510415460987
111,4,Naive Bayes,1,0.8,0.3969,0.4781291542334323,0.09962987899780273,0.4781291542334323
112,4,KNeighbors Classifier,2,0.8,0.7814,0.5630538846666976,9.610674381256104,0.5630538846666976
113,4,SVC Classifier,2,0.8,0.7788,1.0,45.607704877853394,0.0
114,4,Decision Tree,2,0.8,0.7381,0.5782457098575102,0.33069443702697754,0.5782457098575102
115,4,RandomForest,2,0.8,0.7859,0.21430951273590104,0.4204294681549072,0.21430951273590104
116,4,AdaBoost (Discrete),2,0.8,0.8219,0.5736428264297587,100.44133067131042,0.5736428264297587
117,4,AdaBoost (Real),2,0.8,0.79,0.5515468974301704,109.79965877532959,0.5515468974301704
118,4,Logistic Regression (Penalty = L2),2,0.8,0.8073,0.44153835641624317,0.3543705940246582,0.44153835641624317
119,4,Naive Bayes,2,0.8,0.4995,0.578823749168806,0.1514892578125,0.578823749168806
120,5,KNeighbors Classifier,0,0.8,0.7749,0.5610890679092885,15.166512489318848,0.5610890679092885
121,5,SVC Classifier,0,0.8,0.7795,0.09014398837291854,57.029704570770264,0.09014398837291854
122,5,Decision Tree,0,0.8,0.7198,0.5686562548862499,0.3727073669433594,0.5686562548862499
123,5,RandomForest,0,0.8,0.8052,0.47079097199502645,0.48920178413391113,0.47079097199502645
124,5,AdaBoost (Discrete),0,0.8,0.808,0.5652450874911917,105.10586357116699,0.5652450874911917
125,5,AdaBoost (Real),0,0.8,0.7867,0.5658179930453269,123.04313516616821,0.5658179930453269
126,5,Logistic Regression (Penalty = L2),0,0.8,0.8057,0.4803746456314145,0.661149263381958,0.4803746456314145
127,5,Naive Bayes,0,0.8,0.6991,0.6687770363901733,0.17483758926391602,0.6687770363901733
128,5,KNeighbors Classifier,1,0.8,0.7754,0.5954949844620415,16.35983681678772,0.5954949844620415
129,5,SVC Classifier,1,0.8,0.7788,1.0,57.16627764701843,0.0
130,5,Decision Tree,1,0.8,0.7245,0.592853490143931,0.3635573387145996,0.592853490143931
131,5,RandomForest,1,0.8,0.809,0.4902246102151431,0.5656211376190186,0.4902246102151431
132,5,AdaBoost (Discrete),1,0.8,0.82,0.6139302623598549,112.18967986106873,0.6139302623598549
133,5,AdaBoost (Real),1,0.8,0.7955,0.597263356296875,121.61252355575562,0.597263356296875
134,5,Logistic Regression (Penalty = L2),1,0.8,0.814,0.5085035028131868,0.5113682746887207,0.5085035028131868
135,5,Naive Bayes,1,0.8,0.6217,0.6649217464077112,0.1578965187072754,0.6649217464077112
136,5,KNeighbors Classifier,2,0.8,0.7818,0.5615957235157102,17.895393133163452,0.5615957235157102
137,5,SVC Classifier,2,0.8,0.7788,1.0,58.53428030014038,0.0
138,5,Decision Tree,2,0.8,0.7401,0.5796989899706904,0.36002254486083984,0.5796989899706904
139,5,RandomForest,2,0.8,0.8079,0.4330918550979268,0.5858142375946045,0.4330918550979268
140,5,AdaBoost (Discrete),2,0.8,0.821,0.5605540987622475,106.2328531742096,0.5605540987622475
141,5,AdaBoost (Real),2,0.8,0.7917,0.5599221082958848,120.72031760215759,0.5599221082958848
142,5,Logistic Regression (Penalty = L2),2,0.8,0.8084,0.4442144970626748,0.4316825866699219,0.4442144970626748
143,5,Naive Bayes,2,0.8,0.7633,0.6908839809298557,0.15250086784362793,0.6908839809298557
144,6,KNeighbors Classifier,0,0.8,0.7725,0.5683382900035766,12.463273048400879,0.5683382900035766
145,6,SVC Classifier,0,0.8,0.7795,0.09014398837291854,48.7386589050293,0.09014398837291854
146,6,Decision Tree,0,0.8,0.7247,0.5683392092335491,0.36876702308654785,0.5683392092335491
147,6,RandomForest,0,0.8,0.804,0.4738688201808611,0.4778459072113037,0.4738688201808611
148,6,AdaBoost (Discrete),0,0.8,0.809,0.5639365136247197,86.0588366985321,0.5639365136247197
149,6,AdaBoost (Real),0,0.8,0.7856,0.5601670315750567,100.5887508392334,0.5601670315750567
150,6,Logistic Regression (Penalty = L2),0,0.8,0.8052,0.47851980376157444,0.39662933349609375,0.47851980376157444
151,6,Naive Bayes,0,0.8,0.7582,0.6640319920979421,0.14692425727844238,0.6640319920979421
152,6,KNeighbors Classifier,1,0.8,0.7778,0.5971183307147362,10.614128589630127,0.5971183307147362
153,6,SVC Classifier,1,0.8,0.7788,1.0,50.245328426361084,0.0
154,6,Decision Tree,1,0.8,0.7263,0.5844419132068086,0.342609167098999,0.5844419132068086
155,6,RandomForest,1,0.8,0.816,0.5404580894583431,0.4710116386413574,0.5404580894583431
156,6,AdaBoost (Discrete),1,0.8,0.8215,0.6121190032961057,88.44005966186523,0.6121190032961057
157,6,AdaBoost (Real),1,0.8,0.7932,0.5932641430431486,98.32661652565002,0.5932641430431486
158,6,Logistic Regression (Penalty = L2),1,0.8,0.8123,0.49460127700335077,0.35018467903137207,0.49460127700335077
159,6,Naive Bayes,1,0.8,0.7638,0.7072292527175718,0.1364121437072754,0.7072292527175718
160,6,KNeighbors Classifier,2,0.8,0.7797,0.5438577395398587,9.330025434494019,0.5438577395398587
161,6,SVC Classifier,2,0.8,0.7788,1.0,47.09403967857361,0.0
162,6,Decision Tree,2,0.8,0.7333,0.5652880639958211,0.2836463451385498,0.5652880639958211
163,6,RandomForest,2,0.8,0.8178,0.5133503139822788,0.35394859313964844,0.5133503139822788
164,6,AdaBoost (Discrete),2,0.8,0.8217,0.5718676971458388,80.48114275932312,0.5718676971458388
165,6,AdaBoost (Real),2,0.8,0.7925,0.5542013970526606,91.03842949867249,0.5542013970526606
166,6,Logistic Regression (Penalty = L2),2,0.8,0.8066,0.4375346161033638,0.37445616722106934,0.4375346161033638
167,6,Naive Bayes,2,0.8,0.782,0.6848097130341615,0.13713574409484863,0.6848097130341615
168,7,KNeighbors Classifier,0,0.8,0.7719,0.5627443073930617,13.259925365447998,0.5627443073930617
169,7,SVC Classifier,0,0.8,0.7788,1.0,55.84538125991821,0.0
170,7,Decision Tree,0,0.8,0.7154,0.557146461479364,0.4880094528198242,0.557146461479364
171,7,RandomForest,0,0.8,0.7932,0.34961506459676134,0.6819088459014893,0.34961506459676134
172,7,AdaBoost (Discrete),0,0.8,0.8076,0.5684522121262393,154.1423304080963,0.5684522121262393
173,7,AdaBoost (Real),0,0.8,0.7878,0.5662568127202332,157.35017037391663,0.5662568127202332
174,7,Logistic Regression (Penalty = L2),0,0.8,0.8075,0.4855783273069601,0.3345355987548828,0.4855783273069601
175,7,Naive Bayes,0,0.8,0.4357,0.5205325462320364,0.15593552589416504,0.5205325462320364
176,7,KNeighbors Classifier,1,0.8,0.7735,0.5885132633835618,13.958109855651855,0.5885132633835618
177,7,SVC Classifier,1,0.8,0.7788,1.0,51.098695278167725,0.0
178,7,Decision Tree,1,0.8,0.7239,0.5894333053997173,0.4785339832305908,0.5894333053997173
179,7,RandomForest,1,0.8,0.793,0.31791192874523566,0.7040867805480957,0.31791192874523566
180,7,AdaBoost (Discrete),1,0.8,0.8201,0.6019370306498497,137.13359141349792,0.6019370306498497
181,7,AdaBoost (Real),1,0.8,0.7949,0.6065531627643642,141.15691781044006,0.6065531627643642
182,7,Logistic Regression (Penalty = L2),1,0.8,0.8123,0.49624281802440284,0.3322935104370117,0.49624281802440284
183,7,Naive Bayes,1,0.8,0.3965,0.47764692528265545,0.14339685440063477,0.47764692528265545
184,7,KNeighbors Classifier,2,0.8,0.7804,0.5607134991418165,10.639715194702148,0.5607134991418165
185,7,SVC Classifier,2,0.8,0.7788,1.0,45.70097470283508,0.0
186,7,Decision Tree,2,0.8,0.7266,0.563793623172765,0.47881436347961426,0.563793623172765
187,7,RandomForest,2,0.8,0.786,0.22542416360742895,0.5691630840301514,0.22542416360742895
188,7,AdaBoost (Discrete),2,0.8,0.8204,0.5638139574173617,133.05813908576965,0.5638139574173617
189,7,AdaBoost (Real),2,0.8,0.7885,0.5499531140344198,134.71753787994385,0.5499531140344198
190,7,Logistic Regression (Penalty = L2),2,0.8,0.8096,0.45201146508356704,0.42897820472717285,0.45201146508356704
191,7,Naive Bayes,2,0.8,0.4976,0.5778300595962537,0.13909530639648438,0.5778300595962537
192,8,KNeighbors Classifier,0,0.8,0.769,0.5621975938879756,5.87859582901001,0.5621975938879756
193,8,SVC Classifier,0,0.8,0.7788,1.0,34.909255504608154,0.0
194,8,Decision Tree,0,0.8,0.7175,0.5552113429213706,0.26848912239074707,0.5552113429213706
195,8,RandomForest,0,0.8,0.8023,0.4241848364959821,0.44744372367858887,0.4241848364959821
196,8,AdaBoost (Discrete),0,0.8,0.808,0.5587719306053803,86.74404978752136,0.5587719306053803
197,8,AdaBoost (Real),0,0.8,0.7853,0.552090279088179,98.23595190048218,0.552090279088179
198,8,Logistic Regression (Penalty = L2),0,0.8,0.808,0.49645876619397417,0.22824382781982422,0.49645876619397417
199,8,Naive Bayes,0,0.8,0.553,0.611294551146655,0.1251821517944336,0.611294551146655
200,8,KNeighbors Classifier,1,0.8,0.7787,0.5865523804296582,5.5436851978302,0.5865523804296582
201,8,SVC Classifier,1,0.8,0.7788,1.0,31.73890256881714,0.0
202,8,Decision Tree,1,0.8,0.7323,0.6017310087206791,0.29443836212158203,0.6017310087206791
203,8,RandomForest,1,0.8,0.808,0.45337325553886804,0.3123338222503662,0.45337325553886804
204,8,AdaBoost (Discrete),1,0.8,0.8209,0.6044545242864733,78.38351011276245,0.6044545242864733
205,8,AdaBoost (Real),1,0.8,0.7937,0.5916431236374194,75.13862895965576,0.5916431236374194
206,8,Logistic Regression (Penalty = L2),1,0.8,0.8113,0.4880572107799512,0.23235440254211426,0.4880572107799512
207,8,Naive Bayes,1,0.8,0.525,0.5991908833197547,0.11792922019958496,0.5991908833197547
208,8,KNeighbors Classifier,2,0.8,0.7842,0.5702695298236903,4.364585876464844,0.5702695298236903
209,8,SVC Classifier,2,0.8,0.7788,1.0,27.81767988204956,0.0
210,8,Decision Tree,2,0.8,0.7309,0.5710966423531194,0.2607548236846924,0.5710966423531194
211,8,RandomForest,2,0.8,0.8046,0.41326740506717496,0.40758609771728516,0.41326740506717496
212,8,AdaBoost (Discrete),2,0.8,0.8236,0.5736167182282125,76.91686248779297,0.5736167182282125
213,8,AdaBoost (Real),2,0.8,0.7905,0.5551129511654272,80.22904539108276,0.5551129511654272
214,8,Logistic Regression (Penalty = L2),2,0.8,0.805,0.4249360745372411,0.23039865493774414,0.4249360745372411
215,8,Naive Bayes,2,0.8,0.5793,0.6291255127052886,0.08601021766662598,0.6291255127052886
216,9,KNeighbors Classifier,0,0.8,0.7696,0.5680797741727439,8.146409749984741,0.5680797741727439
217,9,SVC Classifier,0,0.8,0.7795,0.09014398837291854,35.54994440078735,0.09014398837291854
218,9,Decision Tree,0,0.8,0.7146,0.5671369646531447,0.2689785957336426,0.5671369646531447
219,9,RandomForest,0,0.8,0.8026,0.45898302879256186,0.41986823081970215,0.45898302879256186
220,9,AdaBoost (Discrete),0,0.8,0.8072,0.5676271265146373,89.72396039962769,0.5676271265146373
221,9,AdaBoost (Real),0,0.8,0.7859,0.559957148322722,94.38793277740479,0.559957148322722
222,9,Logistic Regression (Penalty = L2),0,0.8,0.8044,0.47826547485508286,0.30066657066345215,0.47826547485508286
223,9,Naive Bayes,0,0.8,0.7582,0.665394312500725,0.05770468711853027,0.665394312500725
224,9,KNeighbors Classifier,1,0.8,0.779,0.5955907498265686,9.085628747940063,0.5955907498265686
225,9,SVC Classifier,1,0.8,0.7788,1.0,34.60552501678467,0.0
226,9,Decision Tree,1,0.8,0.7278,0.5862071379875419,0.1378340721130371,0.5862071379875419
227,9,RandomForest,1,0.8,0.8072,0.4783030988160522,0.34701013565063477,0.4783030988160522
228,9,AdaBoost (Discrete),1,0.8,0.8202,0.6140142186354419,71.67835569381714,0.6140142186354419
229,9,AdaBoost (Real),1,0.8,0.7928,0.6018099149648027,76.0035891532898,0.6018099149648027
230,9,Logistic Regression (Penalty = L2),1,0.8,0.8127,0.4967834180136993,0.2225193977355957,0.4967834180136993
231,9,Naive Bayes,1,0.8,0.7637,0.7081735085425148,0.09894967079162598,0.7081735085425148
232,9,KNeighbors Classifier,2,0.8,0.7792,0.5520453287841668,7.616959571838379,0.5520453287841668
233,9,SVC Classifier,2,0.8,0.7788,1.0,33.61395597457886,0.0
234,9,Decision Tree,2,0.8,0.728,0.5706531014580054,0.18415594100952148,0.5706531014580054
235,9,RandomForest,2,0.8,0.8073,0.4424827338322855,0.2306380271911621,0.4424827338322855
236,9,AdaBoost (Discrete),2,0.8,0.8208,0.5691341950547959,69.58149313926697,0.5691341950547959
237,9,AdaBoost (Real),2,0.8,0.7909,0.5457387722519124,62.189218521118164,0.5457387722519124
238,9,Logistic Regression (Penalty = L2),2,0.8,0.8095,0.4524421799479965,0.11171793937683105,0.4524421799479965
239,9,Naive Bayes,2,0.8,0.7811,0.6838872247327862,0.08993935585021973,0.6838872247327862
240,10,KNeighbors Classifier,0,0.8,0.7727,0.5527727586352638,10.853989362716675,0.5527727586352638
241,10,SVC Classifier,0,0.8,0.7795,0.09014398837291854,36.94007420539856,0.09014398837291854
242,10,Decision Tree,0,0.8,0.7272,0.5761436548936453,0.23778462409973145,0.5761436548936453
243,10,RandomForest,0,0.8,0.8043,0.46877106425961906,0.3420226573944092,0.46877106425961906
244,10,AdaBoost (Discrete),0,0.8,0.8084,0.571432322782713,83.31126356124878,0.571432322782713
245,10,AdaBoost (Real),0,0.8,0.7833,0.5612174425465434,83.86825799942017,0.5612174425465434
246,10,Logistic Regression (Penalty = L2),0,0.8,0.8053,0.47855158537113107,0.23264813423156738,0.47855158537113107
247,10,Naive Bayes,0,0.8,0.6999,0.669068178875443,0.08003044128417969,0.669068178875443
248,10,KNeighbors Classifier,1,0.8,0.7742,0.5905844630505642,12.364795923233032,0.5905844630505642
249,10,SVC Classifier,1,0.8,0.7788,1.0,32.83546543121338,0.0
250,10,Decision Tree,1,0.8,0.7272,0.5946480700073815,0.23598480224609375,0.5946480700073815
251,10,RandomForest,1,0.8,0.8139,0.5000328542152023,0.16788148880004883,0.5000328542152023
252,10,AdaBoost (Discrete),1,0.8,0.8216,0.6118545082393085,77.70979762077332,0.6118545082393085
253,10,AdaBoost (Real),1,0.8,0.7911,0.6001926814244047,82.53804111480713,0.6001926814244047
254,10,Logistic Regression (Penalty = L2),1,0.8,0.8112,0.4930066682155156,0.31519269943237305,0.4930066682155156
255,10,Naive Bayes,1,0.8,0.6219,0.6654425538269252,0.07603096961975098,0.6654425538269252
256,10,KNeighbors Classifier,2,0.8,0.7812,0.5584271325966685,11.052462577819824,0.5584271325966685
257,10,SVC Classifier,2,0.8,0.7788,1.0,35.02325892448425,0.0
258,10,Decision Tree,2,0.8,0.731,0.5806171527109749,0.16564512252807617,0.5806171527109749
259,10,RandomForest,2,0.8,0.8103,0.45083326282351316,0.3495337963104248,0.45083326282351316
260,10,AdaBoost (Discrete),2,0.8,0.8222,0.571036262961712,76.65374255180359,0.571036262961712
261,10,AdaBoost (Real),2,0.8,0.7951,0.5595796787673223,80.87675642967224,0.5595796787673223
262,10,Logistic Regression (Penalty = L2),2,0.8,0.8092,0.45418817824310664,0.14358305931091309,0.45418817824310664
263,10,Naive Bayes,2,0.8,0.7555,0.6903668109526303,0.07976746559143066,0.6903668109526303
264,11,KNeighbors Classifier,0,0.8,0.7727,0.5527727586352638,11.511273860931396,0.5527727586352638
265,11,SVC Classifier,0,0.8,0.7795,0.09014398837291854,33.39190101623535,0.09014398837291854
266,11,Decision Tree,0,0.8,0.7223,0.5604725432051625,0.17193388938903809,0.5604725432051625
267,11,RandomForest,0,0.8,0.8043,0.46877106425961906,0.3330550193786621,0.46877106425961906
268,11,AdaBoost (Discrete),0,0.8,0.8084,0.571432322782713,74.76469826698303,0.571432322782713
269,11,AdaBoost (Real),0,0.8,0.7832,0.561177722992189,82.93395113945007,0.561177722992189
270,11,Logistic Regression (Penalty = L2),0,0.8,0.8053,0.47855158537113107,0.2803690433502197,0.47855158537113107
271,11,Naive Bayes,0,0.8,0.6999,0.669068178875443,0.04219818115234375,0.669068178875443
272,11,KNeighbors Classifier,1,0.8,0.7742,0.5905844630505642,11.57023000717163,0.5905844630505642
273,11,SVC Classifier,1,0.8,0.7788,1.0,36.81255125999451,0.0
274,11,Decision Tree,1,0.8,0.7252,0.5924013010845113,0.20312285423278809,0.5924013010845113
275,11,RandomForest,1,0.8,0.8139,0.5000328542152023,0.20179390907287598,0.5000328542152023
276,11,AdaBoost (Discrete),1,0.8,0.8216,0.6118545082393085,80.78353476524353,0.6118545082393085
277,11,AdaBoost (Real),1,0.8,0.791,0.6001499797999742,82.47137594223022,0.6001499797999742
278,11,Logistic Regression (Penalty = L2),1,0.8,0.8112,0.4930066682155156,0.2944819927215576,0.4930066682155156
279,11,Naive Bayes,1,0.8,0.6219,0.6654425538269252,0.07768678665161133,0.6654425538269252
280,11,KNeighbors Classifier,2,0.8,0.7812,0.5584271325966685,11.804270505905151,0.5584271325966685
281,11,SVC Classifier,2,0.8,0.7788,1.0,40.809457540512085,0.0
282,11,Decision Tree,2,0.8,0.727,0.560805681146536,0.3890089988708496,0.560805681146536
283,11,RandomForest,2,0.8,0.8103,0.45083326282351316,0.35630059242248535,0.45083326282351316
284,11,AdaBoost (Discrete),2,0.8,0.8222,0.571036262961712,79.12838768959045,0.571036262961712
285,11,AdaBoost (Real),2,0.8,0.7951,0.5595796787673223,85.3747296333313,0.5595796787673223
286,11,Logistic Regression (Penalty = L2),2,0.8,0.8092,0.45418817824310664,0.22977519035339355,0.45418817824310664
287,11,Naive Bayes,2,0.8,0.7555,0.6903668109526303,0.07860922813415527,0.6903668109526303
288,12,KNeighbors Classifier,0,0.8,0.771,0.559517330316478,2.629359245300293,0.559517330316478
289,12,SVC Classifier,0,0.8,0.7788,1.0,17.33609104156494,0.0
290,12,Decision Tree,0,0.8,0.7245,0.5573996860444921,0.207261323928833,0.5573996860444921
291,12,RandomForest,0,0.8,0.8092,0.5052979721104135,0.21324682235717773,0.5052979721104135
292,12,AdaBoost (Discrete),0,0.8,0.8088,0.5590760241955667,32.02895998954773,0.5590760241955667
293,12,AdaBoost (Real),0,0.8,0.7874,0.5461247454958678,36.08421182632446,0.5461247454958678
294,12,Logistic Regression (Penalty = L2),0,0.8,0.8063,0.47971864351784543,0.1129920482635498,0.47971864351784543
295,12,Naive Bayes,0,0.8,0.548,0.6063981539079423,0.04822111129760742,0.6063981539079423
296,12,KNeighbors Classifier,1,0.8,0.7764,0.587672783042685,2.1371796131134033,0.587672783042685
297,12,SVC Classifier,1,0.8,0.7788,1.0,15.140899896621704,0.0
298,12,Decision Tree,1,0.8,0.7245,0.58065039403323,0.09886336326599121,0.58065039403323
299,12,RandomForest,1,0.8,0.8127,0.5024674625359968,0.297060489654541,0.5024674625359968
300,12,AdaBoost (Discrete),1,0.8,0.8214,0.6052836898806552,28.266381978988647,0.6052836898806552
301,12,AdaBoost (Real),1,0.8,0.7977,0.6015064841072031,34.49810981750488,0.6015064841072031
302,12,Logistic Regression (Penalty = L2),1,0.8,0.8118,0.4907187882856364,0.14914917945861816,0.4907187882856364
303,12,Naive Bayes,1,0.8,0.5235,0.597405625997895,0.03278470039367676,0.597405625997895
304,12,KNeighbors Classifier,2,0.8,0.7859,0.5693600667517557,1.7066535949707031,0.5693600667517557
305,12,SVC Classifier,2,0.8,0.7788,1.0,14.301581621170044,0.0
306,12,Decision Tree,2,0.8,0.7294,0.5732416105319182,0.1624903678894043,0.5732416105319182
307,12,RandomForest,2,0.8,0.8101,0.4603590616662243,0.18123650550842285,0.4603590616662243
308,12,AdaBoost (Discrete),2,0.8,0.8204,0.5676104059882283,30.306315660476685,0.5676104059882283
309,12,AdaBoost (Real),2,0.8,0.794,0.5547792722196143,38.23919677734375,0.5547792722196143
310,12,Logistic Regression (Penalty = L2),2,0.8,0.8048,0.42040388512970894,0.11255168914794922,0.42040388512970894
311,12,Naive Bayes,2,0.8,0.5923,0.6384232212232924,0.11184525489807129,0.6384232212232924
