,feat_set_id,classifier,fold_id,feat_th,score,geo_score,exec_t,geo_score_woz
0,0,KNeighbors Classifier,0,0.45,0.9522388059701492,0.9519101091165171,1.9169797897338867,0.9519101091165171
1,0,SVC Classifier,0,0.45,0.9194029850746268,0.9184152692664478,1.98213791847229,0.9184152692664478
2,0,Decision Tree,0,0.45,0.8149253731343283,0.8100234582271276,0.0911858081817627,0.8100234582271276
3,0,RandomForest,0,0.45,0.591044776119403,0.700691469777744,0.2858543395996094,0.0
4,0,AdaBoost (Discrete),0,0.45,0.9283582089552239,0.9269669421802194,73.46301651000977,0.9269669421802194
5,0,AdaBoost (Real),0,0.45,0.8746268656716418,0.8720863458378035,70.4032654762268,0.8720863458378035
6,0,Logistic Regression (Penalty = L2),0,0.45,0.9656716417910448,0.9652949075830556,2.070547342300415,0.9652949075830556
7,0,Naive Bayes,0,0.45,0.8835820895522388,0.8820684531018976,0.16014623641967773,0.8820684531018976
8,0,KNeighbors Classifier,1,0.45,0.9462686567164179,0.945863090629107,2.3153059482574463,0.945863090629107
9,0,SVC Classifier,1,0.45,0.9223880597014925,0.9218781485553931,1.909484624862671,0.9218781485553931
10,0,Decision Tree,1,0.45,0.8298507462686567,0.8278363702530807,0.06844258308410645,0.8278363702530807
11,0,RandomForest,1,0.45,0.655223880597015,0.5077450277057382,0.3033018112182617,0.5077450277057382
12,0,AdaBoost (Discrete),1,0.45,0.9194029850746268,0.9183239053718155,73.8119728565216,0.9183239053718155
13,0,AdaBoost (Real),1,0.45,0.6656716417910448,0.6409130345563887,68.24569296836853,0.6409130345563887
14,0,Logistic Regression (Penalty = L2),1,0.45,0.9611940298507463,0.961027555833266,1.8224689960479736,0.961027555833266
15,0,Naive Bayes,1,0.45,0.8955223880597015,0.894149920628285,0.1669783592224121,0.894149920628285
16,0,KNeighbors Classifier,2,0.45,0.956060606060606,0.9557155571915212,1.909071683883667,0.9557155571915212
17,0,SVC Classifier,2,0.45,0.9196969696969697,0.9188557041987823,2.0176873207092285,0.9188557041987823
18,0,Decision Tree,2,0.45,0.8545454545454545,0.8537390864911688,0.057457923889160156,0.8537390864911688
19,0,RandomForest,2,0.45,0.6303030303030303,0.6468576051088393,0.3327147960662842,0.0
20,0,AdaBoost (Discrete),2,0.45,0.9303030303030303,0.9286806789606948,74.39614868164062,0.9286806789606948
21,0,AdaBoost (Real),2,0.45,0.6666666666666666,0.5401874168810299,68.41277050971985,0.5401874168810299
22,0,Logistic Regression (Penalty = L2),2,0.45,0.9727272727272728,0.972542958839484,1.6442198753356934,0.972542958839484
23,0,Naive Bayes,2,0.45,0.8878787878787879,0.886764492779074,0.11780714988708496,0.886764492779074
24,1,KNeighbors Classifier,0,0.45,0.9626865671641791,0.9623100162148691,1.8230788707733154,0.9623100162148691
25,1,SVC Classifier,0,0.45,0.8970149253731343,0.8919466718306217,1.851360559463501,0.8919466718306217
26,1,Decision Tree,0,0.45,0.808955223880597,0.8048323532680488,0.07765555381774902,0.8048323532680488
27,1,RandomForest,0,0.45,0.6134328358208955,0.6191156085346141,0.26509594917297363,0.0
28,1,AdaBoost (Discrete),0,0.45,0.9402985074626866,0.9394227320718901,79.08540678024292,0.9394227320718901
29,1,AdaBoost (Real),0,0.45,0.9014925373134328,0.9002989285118834,72.57605481147766,0.9002989285118834
30,1,Logistic Regression (Penalty = L2),0,0.45,0.982089552238806,0.9818648567275667,1.56593656539917,0.9818648567275667
31,1,Naive Bayes,0,0.45,0.8805970149253731,0.8767785402790587,0.1537151336669922,0.8767785402790587
32,1,KNeighbors Classifier,1,0.45,0.9417910447761194,0.941274874525549,1.6693458557128906,0.941274874525549
33,1,SVC Classifier,1,0.45,0.9104477611940298,0.9085282967967682,1.986985206604004,0.9085282967967682
34,1,Decision Tree,1,0.45,0.835820895522388,0.8322304761026293,0.0947422981262207,0.8322304761026293
35,1,RandomForest,1,0.45,0.6447761194029851,0.6935724075478885,0.2918972969055176,0.0
36,1,AdaBoost (Discrete),1,0.45,0.9298507462686567,0.9293518360925637,77.6585578918457,0.9293518360925637
37,1,AdaBoost (Real),1,0.45,0.44029850746268656,0.2754945194976537,76.17643880844116,0.0
38,1,Logistic Regression (Penalty = L2),1,0.45,0.9746268656716418,0.9745344490092189,1.503476858139038,0.9745344490092189
39,1,Naive Bayes,1,0.45,0.9029850746268657,0.9017612316953243,0.19032692909240723,0.9017612316953243
40,1,KNeighbors Classifier,2,0.45,0.956060606060606,0.9555427386113606,1.841033697128296,0.9555427386113606
41,1,SVC Classifier,2,0.45,0.9121212121212121,0.9099930220431138,1.9655535221099854,0.9099930220431138
42,1,Decision Tree,2,0.45,0.8242424242424242,0.8217820960466375,0.09721231460571289,0.8217820960466375
43,1,RandomForest,2,0.45,0.6348484848484849,0.5073329626124513,0.2749607563018799,0.5073329626124513
44,1,AdaBoost (Discrete),2,0.45,0.9121212121212121,0.9112601905325693,80.21743822097778,0.9112601905325693
45,1,AdaBoost (Real),2,0.45,0.806060606060606,0.8019703043807757,68.00616073608398,0.8019703043807757
46,1,Logistic Regression (Penalty = L2),2,0.45,0.9727272727272728,0.972422641403049,1.3028700351715088,0.972422641403049
47,1,Naive Bayes,2,0.45,0.8893939393939394,0.8879094594430751,0.14083433151245117,0.8879094594430751
48,2,KNeighbors Classifier,0,0.45,0.9582089552238806,0.9579035169255619,1.7793633937835693,0.9579035169255619
49,2,SVC Classifier,0,0.45,0.9283582089552239,0.9270931401629343,1.42686128616333,0.9270931401629343
50,2,Decision Tree,0,0.45,0.8223880597014925,0.819464647675841,0.06380510330200195,0.819464647675841
51,2,RandomForest,0,0.45,0.7074626865671642,0.6051938788225479,0.2027437686920166,0.6051938788225479
52,2,AdaBoost (Discrete),0,0.45,0.9462686567164179,0.9455297322174733,64.78044772148132,0.9455297322174733
53,2,AdaBoost (Real),0,0.45,0.8880597014925373,0.8856768385440343,61.07208228111267,0.8856768385440343
54,2,Logistic Regression (Penalty = L2),0,0.45,0.9761194029850746,0.9759086025540082,1.2426774501800537,0.9759086025540082
55,2,Naive Bayes,0,0.45,0.9104477611940298,0.9088099840317383,0.13367843627929688,0.9088099840317383
56,2,KNeighbors Classifier,1,0.45,0.9552238805970149,0.9549604194416067,1.6483154296875,0.9549604194416067
57,2,SVC Classifier,1,0.45,0.9447761194029851,0.9442274042755687,1.450944423675537,0.9442274042755687
58,2,Decision Tree,1,0.45,0.8164179104477612,0.8146080288942349,0.06045103073120117,0.8146080288942349
59,2,RandomForest,1,0.45,0.6313432835820896,0.5312751434632662,0.1971573829650879,0.5312751434632662
60,2,AdaBoost (Discrete),1,0.45,0.9343283582089552,0.9338283495355769,61.546743392944336,0.9338283495355769
61,2,AdaBoost (Real),1,0.45,0.28507462686567164,0.1736360433198536,58.76491928100586,0.0
62,2,Logistic Regression (Penalty = L2),1,0.45,0.9671641791044776,0.9669366654309471,1.2023277282714844,0.9669366654309471
63,2,Naive Bayes,1,0.45,0.9298507462686567,0.9290866585984989,0.12370681762695312,0.9290866585984989
64,2,KNeighbors Classifier,2,0.45,0.9621212121212122,0.9615105231472738,1.5926716327667236,0.9615105231472738
65,2,SVC Classifier,2,0.45,0.9454545454545454,0.9449298731470553,1.4792542457580566,0.9449298731470553
66,2,Decision Tree,2,0.45,0.8590909090909091,0.857308279763199,0.07774758338928223,0.857308279763199
67,2,RandomForest,2,0.45,0.7212121212121212,0.6743840787743348,0.20167756080627441,0.6743840787743348
68,2,AdaBoost (Discrete),2,0.45,0.943939393939394,0.9432073374488712,58.65367674827576,0.9432073374488712
69,2,AdaBoost (Real),2,0.45,0.5848484848484848,0.4925911757169023,54.060569524765015,0.4925911757169023
70,2,Logistic Regression (Penalty = L2),2,0.45,0.9742424242424242,0.9740757608466152,1.1756553649902344,0.9740757608466152
71,2,Naive Bayes,2,0.45,0.9227272727272727,0.9219281237989052,0.13559222221374512,0.9219281237989052
72,3,KNeighbors Classifier,0,0.45,0.9641791044776119,0.9636580948598388,1.7033591270446777,0.9636580948598388
73,3,SVC Classifier,0,0.45,0.9298507462686567,0.928413654700888,1.4298958778381348,0.928413654700888
74,3,Decision Tree,0,0.45,0.8074626865671641,0.8035053930502307,0.05934286117553711,0.8035053930502307
75,3,RandomForest,0,0.45,0.5552238805970149,0.46429539255390406,0.22101449966430664,0.0
76,3,AdaBoost (Discrete),0,0.45,0.9402985074626866,0.9392723083251195,57.0357723236084,0.9392723083251195
77,3,AdaBoost (Real),0,0.45,0.8746268656716418,0.8732076725296658,52.928546667099,0.8732076725296658
78,3,Logistic Regression (Penalty = L2),0,0.45,0.9686567164179104,0.9683001056333326,1.323474407196045,0.9683001056333326
79,3,Naive Bayes,0,0.45,0.8970149253731343,0.8954230480340066,0.15862536430358887,0.8954230480340066
80,3,KNeighbors Classifier,1,0.45,0.9477611940298507,0.9469875065551165,1.473665475845337,0.9469875065551165
81,3,SVC Classifier,1,0.45,0.9283582089552239,0.9276040193085078,1.398860216140747,0.9276040193085078
82,3,Decision Tree,1,0.45,0.8119402985074626,0.8102107973260197,0.059565067291259766,0.8102107973260197
83,3,RandomForest,1,0.45,0.582089552238806,0.5070019408652751,0.17987585067749023,0.5070019408652751
84,3,AdaBoost (Discrete),1,0.45,0.9417910447761194,0.9415445716284138,54.115856647491455,0.9415445716284138
85,3,AdaBoost (Real),1,0.45,0.44328358208955226,0.31094222472816646,50.22544550895691,0.0
86,3,Logistic Regression (Penalty = L2),1,0.45,0.9701492537313433,0.9701033251578415,1.126429796218872,0.9701033251578415
87,3,Naive Bayes,1,0.45,0.9194029850746268,0.9183777597169185,0.20256733894348145,0.9183777597169185
88,3,KNeighbors Classifier,2,0.45,0.9621212121212122,0.9615817799058389,1.5328290462493896,0.9615817799058389
89,3,SVC Classifier,2,0.45,0.9287878787878788,0.9281947348910861,1.391434907913208,0.9281947348910861
90,3,Decision Tree,2,0.45,0.8318181818181818,0.8297201068794613,0.07066655158996582,0.8297201068794613
91,3,RandomForest,2,0.45,0.6727272727272727,0.5958930692824268,0.21747303009033203,0.5958930692824268
92,3,AdaBoost (Discrete),2,0.45,0.9212121212121213,0.9201359817953366,54.101714849472046,0.9201359817953366
93,3,AdaBoost (Real),2,0.45,0.45,0.5518728215996322,48.798455238342285,0.0
94,3,Logistic Regression (Penalty = L2),2,0.45,0.9666666666666667,0.9664594307946582,1.2870440483093262,0.9664594307946582
95,3,Naive Bayes,2,0.45,0.9166666666666666,0.9162590871194413,0.10463523864746094,0.9162590871194413
96,4,KNeighbors Classifier,0,0.45,0.9238805970149254,0.9224895976745768,0.377516508102417,0.9224895976745768
97,4,SVC Classifier,0,0.45,0.7791044776119403,0.6889851339185491,0.7700638771057129,0.6889851339185491
98,4,Decision Tree,0,0.45,0.7955223880597015,0.7918489746051807,0.03139615058898926,0.7918489746051807
99,4,RandomForest,0,0.45,0.5865671641791045,0.47862867188642777,0.15783047676086426,0.47862867188642777
100,4,AdaBoost (Discrete),0,0.45,0.8671641791044776,0.8485659531873184,26.88104510307312,0.8485659531873184
101,4,AdaBoost (Real),0,0.45,0.7716417910447761,0.7453160111637344,27.80381441116333,0.7453160111637344
102,4,Logistic Regression (Penalty = L2),0,0.45,0.9522388059701492,0.9514422538743283,0.651261568069458,0.9514422538743283
103,4,Naive Bayes,0,0.45,0.8059701492537313,0.7926982626798832,0.06127738952636719,0.7926982626798832
104,4,KNeighbors Classifier,1,0.45,0.9238805970149254,0.922784403884034,0.4541771411895752,0.922784403884034
105,4,SVC Classifier,1,0.45,0.8253731343283582,0.7854366558285282,0.7831125259399414,0.7854366558285282
106,4,Decision Tree,1,0.45,0.8119402985074626,0.808633626332995,0.041455984115600586,0.808633626332995
107,4,RandomForest,1,0.45,0.6522388059701493,0.4660524304131688,0.17865538597106934,0.4660524304131688
108,4,AdaBoost (Discrete),1,0.45,0.8895522388059701,0.8869912580187083,29.02744174003601,0.8869912580187083
109,4,AdaBoost (Real),1,0.45,0.42686567164179107,0.3422293879522522,28.209665536880493,0.0
110,4,Logistic Regression (Penalty = L2),1,0.45,0.9597014925373134,0.9594230076003143,0.5895359516143799,0.9594230076003143
111,4,Naive Bayes,1,0.45,0.8402985074626865,0.8364827247523177,0.05642104148864746,0.8364827247523177
112,4,KNeighbors Classifier,2,0.45,0.9166666666666666,0.9158064323000713,0.3938722610473633,0.9158064323000713
113,4,SVC Classifier,2,0.45,0.796969696969697,0.7274387206176081,0.8606622219085693,0.7274387206176081
114,4,Decision Tree,2,0.45,0.793939393939394,0.7929986889796796,0.058434486389160156,0.7929986889796796
115,4,RandomForest,2,0.45,0.6530303030303031,0.47923381560393175,0.21269750595092773,0.47923381560393175
116,4,AdaBoost (Discrete),2,0.45,0.8833333333333333,0.8797325638154072,29.104002237319946,0.8797325638154072
117,4,AdaBoost (Real),2,0.45,0.5121212121212121,0.49551780625069647,28.900588750839233,0.0
118,4,Logistic Regression (Penalty = L2),2,0.45,0.9712121212121212,0.9709099970298978,0.5023763179779053,0.9709099970298978
119,4,Naive Bayes,2,0.45,0.8287878787878787,0.8177770182365668,0.07939028739929199,0.8177770182365668
120,5,KNeighbors Classifier,0,0.45,0.9537313432835821,0.9531740685311799,0.6440560817718506,0.9531740685311799
121,5,SVC Classifier,0,0.45,0.8880597014925373,0.8843056000167915,0.8735425472259521,0.8843056000167915
122,5,Decision Tree,0,0.45,0.8,0.7979877829151856,0.032889366149902344,0.7979877829151856
123,5,RandomForest,0,0.45,0.5835820895522388,0.5332565416367793,0.18743395805358887,0.0
124,5,AdaBoost (Discrete),0,0.45,0.9313432835820895,0.9296668124829433,30.276630878448486,0.9296668124829433
125,5,AdaBoost (Real),0,0.45,0.7492537313432835,0.7186189607228746,28.635764837265015,0.7186189607228746
126,5,Logistic Regression (Penalty = L2),0,0.45,0.9597014925373134,0.9589198239946637,0.6955316066741943,0.9589198239946637
127,5,Naive Bayes,0,0.45,0.8850746268656716,0.8825143009237498,0.09819531440734863,0.8825143009237498
128,5,KNeighbors Classifier,1,0.45,0.9522388059701492,0.9518199490313143,0.616156816482544,0.9518199490313143
129,5,SVC Classifier,1,0.45,0.908955223880597,0.9059768338167615,0.7807931900024414,0.9059768338167615
130,5,Decision Tree,1,0.45,0.8373134328358209,0.8342720541049705,0.0318453311920166,0.8342720541049705
131,5,RandomForest,1,0.45,0.582089552238806,0.3973590774269512,0.12944936752319336,0.3973590774269512
132,5,AdaBoost (Discrete),1,0.45,0.9223880597014925,0.9218624525447898,27.127978086471558,0.9218624525447898
133,5,AdaBoost (Real),1,0.45,0.6716417910447762,0.6153511167965248,29.744349479675293,0.6153511167965248
134,5,Logistic Regression (Penalty = L2),1,0.45,0.9626865671641791,0.9623996292442434,0.7645678520202637,0.9623996292442434
135,5,Naive Bayes,1,0.45,0.8985074626865671,0.8964835318468815,0.0938410758972168,0.8964835318468815
136,5,KNeighbors Classifier,2,0.45,0.953030303030303,0.9526031341349077,0.742542028427124,0.9526031341349077
137,5,SVC Classifier,2,0.45,0.906060606060606,0.9044441674353435,0.8846831321716309,0.9044441674353435
138,5,Decision Tree,2,0.45,0.8181818181818182,0.81602617530108,0.03198814392089844,0.81602617530108
139,5,RandomForest,2,0.45,0.7,0.5770994720431414,0.16879820823669434,0.5770994720431414
140,5,AdaBoost (Discrete),2,0.45,0.9303030303030303,0.9295170249456688,29.142597198486328,0.9295170249456688
141,5,AdaBoost (Real),2,0.45,0.7257575757575757,0.7143451804354345,28.291574478149414,0.7143451804354345
142,5,Logistic Regression (Penalty = L2),2,0.45,0.9666666666666667,0.9663619857944711,0.6800596714019775,0.9663619857944711
143,5,Naive Bayes,2,0.45,0.9,0.8985537832098394,0.09009242057800293,0.8985537832098394
144,6,KNeighbors Classifier,0,0.45,0.9432835820895522,0.942247997237491,0.5089797973632812,0.942247997237491
145,6,SVC Classifier,0,0.45,0.8671641791044776,0.8646839645748592,0.8355739116668701,0.8646839645748592
146,6,Decision Tree,0,0.45,0.8029850746268656,0.7993391596847436,0.03313565254211426,0.7993391596847436
147,6,RandomForest,0,0.45,0.6283582089552239,0.6622008283839077,0.15152978897094727,0.0
148,6,AdaBoost (Discrete),0,0.45,0.9074626865671642,0.9019995129958985,25.50072193145752,0.9019995129958985
149,6,AdaBoost (Real),0,0.45,0.8820895522388059,0.8803037677981839,24.867510557174683,0.8803037677981839
150,6,Logistic Regression (Penalty = L2),0,0.45,0.9522388059701492,0.95172703195023,0.7505836486816406,0.95172703195023
151,6,Naive Bayes,0,0.45,0.8597014925373134,0.8575674924246114,0.09896492958068848,0.8575674924246114
152,6,KNeighbors Classifier,1,0.45,0.9253731343283582,0.9248175752027865,0.4938368797302246,0.9248175752027865
153,6,SVC Classifier,1,0.45,0.8895522388059701,0.888112314526108,0.8398096561431885,0.888112314526108
154,6,Decision Tree,1,0.45,0.8507462686567164,0.8498771167755582,0.025174856185913086,0.8498771167755582
155,6,RandomForest,1,0.45,0.6104477611940299,0.7449595567295908,0.11907720565795898,0.0
156,6,AdaBoost (Discrete),1,0.45,0.9134328358208955,0.9128893666606112,23.47944474220276,0.9128893666606112
157,6,AdaBoost (Real),1,0.45,0.7582089552238805,0.7494591024845274,24.36914610862732,0.7494591024845274
158,6,Logistic Regression (Penalty = L2),1,0.45,0.9537313432835821,0.9535577143547055,0.597907304763794,0.9535577143547055
159,6,Naive Bayes,1,0.45,0.8776119402985074,0.8763635841868633,0.10586667060852051,0.8763635841868633
160,6,KNeighbors Classifier,2,0.45,0.9409090909090909,0.9404841413554811,0.5752644538879395,0.9404841413554811
161,6,SVC Classifier,2,0.45,0.8893939393939394,0.887361324921365,0.6909003257751465,0.887361324921365
162,6,Decision Tree,2,0.45,0.8333333333333334,0.8319555018151449,0.02638554573059082,0.8319555018151449
163,6,RandomForest,2,0.45,0.6787878787878788,0.5314041231922517,0.12093734741210938,0.5314041231922517
164,6,AdaBoost (Discrete),2,0.45,0.8909090909090909,0.8806831493792338,24.42075538635254,0.8806831493792338
165,6,AdaBoost (Real),2,0.45,0.43787878787878787,0.37137011708266937,24.303104400634766,0.0
166,6,Logistic Regression (Penalty = L2),2,0.45,0.9666666666666667,0.9664815533485864,0.6365983486175537,0.9664815533485864
167,6,Naive Bayes,2,0.45,0.8757575757575757,0.874489106895517,0.0666191577911377,0.874489106895517
168,7,KNeighbors Classifier,0,0.45,0.9507462686567164,0.9494836662677567,0.5850865840911865,0.9494836662677567
169,7,SVC Classifier,0,0.45,0.8373134328358209,0.8157780837355544,0.794975996017456,0.8157780837355544
170,7,Decision Tree,0,0.45,0.8567164179104477,0.8516026258176407,0.035169363021850586,0.8516026258176407
171,7,RandomForest,0,0.45,0.5582089552238806,0.567376126157167,0.16634893417358398,0.0
172,7,AdaBoost (Discrete),0,0.45,0.9328358208955224,0.9321503034022299,29.596214056015015,0.9321503034022299
173,7,AdaBoost (Real),0,0.45,0.8865671641791045,0.8847812759617195,27.315725803375244,0.8847812759617195
174,7,Logistic Regression (Penalty = L2),0,0.45,0.9761194029850746,0.9757863787151225,0.5301768779754639,0.9757863787151225
175,7,Naive Bayes,0,0.45,0.8776119402985074,0.8745320234217141,0.07964825630187988,0.8745320234217141
176,7,KNeighbors Classifier,1,0.45,0.9507462686567164,0.9503163598886698,0.5659489631652832,0.9503163598886698
177,7,SVC Classifier,1,0.45,0.8761194029850746,0.8679753125592748,0.8942465782165527,0.8679753125592748
178,7,Decision Tree,1,0.45,0.8208955223880597,0.8186036331746237,0.05915713310241699,0.8186036331746237
179,7,RandomForest,1,0.45,0.5298507462686567,0.3752051157255706,0.15670323371887207,0.3752051157255706
180,7,AdaBoost (Discrete),1,0.45,0.9134328358208955,0.9122289783889055,28.580308198928833,0.9122289783889055
181,7,AdaBoost (Real),1,0.45,0.6985074626865672,0.6620911813083623,26.219094276428223,0.6620911813083623
182,7,Logistic Regression (Penalty = L2),1,0.45,0.9597014925373134,0.9594171431733736,0.4903895854949951,0.9594171431733736
183,7,Naive Bayes,1,0.45,0.9059701492537313,0.9046591258910958,0.07862305641174316,0.9046591258910958
184,7,KNeighbors Classifier,2,0.45,0.946969696969697,0.9461327594601739,0.537255048751831,0.9461327594601739
185,7,SVC Classifier,2,0.45,0.8515151515151516,0.8406474173589735,0.9069252014160156,0.8406474173589735
186,7,Decision Tree,2,0.45,0.8469696969696969,0.845289059871773,0.0357973575592041,0.845289059871773
187,7,RandomForest,2,0.45,0.5333333333333333,0.4387031420009153,0.18756818771362305,0.0
188,7,AdaBoost (Discrete),2,0.45,0.9227272727272727,0.9220050852033002,28.090869188308716,0.9220050852033002
189,7,AdaBoost (Real),2,0.45,0.7378787878787879,0.7233148406404621,27.957549333572388,0.7233148406404621
190,7,Logistic Regression (Penalty = L2),2,0.45,0.9636363636363636,0.9632235520989887,0.4386875629425049,0.9632235520989887
191,7,Naive Bayes,2,0.45,0.896969696969697,0.8962133690521731,0.06070566177368164,0.8962133690521731
192,8,KNeighbors Classifier,0,0.45,0.9477611940298507,0.9465323432691055,0.6320154666900635,0.9465323432691055
193,8,SVC Classifier,0,0.45,0.8507462686567164,0.8330441354104654,0.8434698581695557,0.8330441354104654
194,8,Decision Tree,0,0.45,0.8208955223880597,0.8152732350774987,0.024913549423217773,0.8152732350774987
195,8,RandomForest,0,0.45,0.7388059701492538,0.7067521644188368,0.12916159629821777,0.7067521644188368
196,8,AdaBoost (Discrete),0,0.45,0.9432835820895522,0.9425838693769337,29.122215270996094,0.9425838693769337
197,8,AdaBoost (Real),0,0.45,0.835820895522388,0.8310080335236598,27.83574080467224,0.8310080335236598
198,8,Logistic Regression (Penalty = L2),0,0.45,0.9671641791044776,0.9668221957617648,0.532536506652832,0.9668221957617648
199,8,Naive Bayes,0,0.45,0.8731343283582089,0.8700522585620927,0.08021378517150879,0.8700522585620927
200,8,KNeighbors Classifier,1,0.45,0.9537313432835821,0.9532984142435647,0.5601344108581543,0.9532984142435647
201,8,SVC Classifier,1,0.45,0.8805970149253731,0.8718241886936258,0.7861917018890381,0.8718241886936258
202,8,Decision Tree,1,0.45,0.8328358208955224,0.8304316436743874,0.04381966590881348,0.8304316436743874
203,8,RandomForest,1,0.45,0.7761194029850746,0.7641681102777375,0.12460684776306152,0.7641681102777375
204,8,AdaBoost (Discrete),1,0.45,0.917910447761194,0.9172147806190265,27.304320335388184,0.9172147806190265
205,8,AdaBoost (Real),1,0.45,0.8059701492537313,0.8006909132546497,25.44528818130493,0.8006909132546497
206,8,Logistic Regression (Penalty = L2),1,0.45,0.9597014925373134,0.9595863244014375,0.48982715606689453,0.9595863244014375
207,8,Naive Bayes,1,0.45,0.8955223880597015,0.8939964624808899,0.06396675109863281,0.8939964624808899
208,8,KNeighbors Classifier,2,0.45,0.9424242424242424,0.9417115358781174,0.5478215217590332,0.9417115358781174
209,8,SVC Classifier,2,0.45,0.8651515151515151,0.8528364010393269,0.6973416805267334,0.8528364010393269
210,8,Decision Tree,2,0.45,0.8287878787878787,0.8264586783466732,0.025626182556152344,0.8264586783466732
211,8,RandomForest,2,0.45,0.740909090909091,0.6401038955666789,0.12095022201538086,0.6401038955666789
212,8,AdaBoost (Discrete),2,0.45,0.8939393939393939,0.8909115988743559,25.654341459274292,0.8909115988743559
213,8,AdaBoost (Real),2,0.45,0.45,0.267539545929613,25.211931467056274,0.267539545929613
214,8,Logistic Regression (Penalty = L2),2,0.45,0.9696969696969697,0.9694349348348136,0.5090513229370117,0.9694349348348136
215,8,Naive Bayes,2,0.45,0.8924242424242425,0.8912604160722228,0.0666053295135498,0.8912604160722228
216,9,KNeighbors Classifier,0,0.45,0.9537313432835821,0.9526999994720626,0.4456005096435547,0.9526999994720626
217,9,SVC Classifier,0,0.45,0.8731343283582089,0.8701162243614277,0.7595114707946777,0.8701162243614277
218,9,Decision Tree,0,0.45,0.8671641791044776,0.864364589758544,0.04235029220581055,0.864364589758544
219,9,RandomForest,0,0.45,0.6507462686567164,0.5866661275090924,0.10155224800109863,0.5866661275090924
220,9,AdaBoost (Discrete),0,0.45,0.9328358208955224,0.9318753041681245,20.18580913543701,0.9318753041681245
221,9,AdaBoost (Real),0,0.45,0.8701492537313433,0.8667013414469386,21.106282949447632,0.8667013414469386
222,9,Logistic Regression (Penalty = L2),0,0.45,0.9701492537313433,0.9698714455202158,0.4758458137512207,0.9698714455202158
223,9,Naive Bayes,0,0.45,0.8865671641791045,0.8843956290698414,0.10310530662536621,0.8843956290698414
224,9,KNeighbors Classifier,1,0.45,0.9432835820895522,0.9426207970079399,0.4937427043914795,0.9426207970079399
225,9,SVC Classifier,1,0.45,0.9,0.8988617631592495,0.6233730316162109,0.8988617631592495
226,9,Decision Tree,1,0.45,0.808955223880597,0.8064829850984504,0.025501251220703125,0.8064829850984504
227,9,RandomForest,1,0.45,0.6567164179104478,0.5754782262941098,0.10081219673156738,0.5754782262941098
228,9,AdaBoost (Discrete),1,0.45,0.9104477611940298,0.9095227414985781,21.487106561660767,0.9095227414985781
229,9,AdaBoost (Real),1,0.45,0.744776119402985,0.6673827717312852,19.70672345161438,0.6673827717312852
230,9,Logistic Regression (Penalty = L2),1,0.45,0.9597014925373134,0.959490459670734,0.4357025623321533,0.959490459670734
231,9,Naive Bayes,1,0.45,0.908955223880597,0.9075312436663188,0.05254864692687988,0.9075312436663188
232,9,KNeighbors Classifier,2,0.45,0.946969696969697,0.9458097402516038,0.49686455726623535,0.9458097402516038
233,9,SVC Classifier,2,0.45,0.8878787878787879,0.8855325917954313,0.627610445022583,0.8855325917954313
234,9,Decision Tree,2,0.45,0.8424242424242424,0.840687677115231,0.024290084838867188,0.840687677115231
235,9,RandomForest,2,0.45,0.6818181818181818,0.4930272762563594,0.09770607948303223,0.4930272762563594
236,9,AdaBoost (Discrete),2,0.45,0.9015151515151515,0.8934838448265137,21.606165885925293,0.8934838448265137
237,9,AdaBoost (Real),2,0.45,0.4,0.2764519754819807,22.000709533691406,0.0
238,9,Logistic Regression (Penalty = L2),2,0.45,0.9712121212121212,0.970964392783353,0.45192384719848633,0.970964392783353
239,9,Naive Bayes,2,0.45,0.9090909090909091,0.9084452958987842,0.05278134346008301,0.9084452958987842
240,10,KNeighbors Classifier,0,0.45,0.9641791044776119,0.9637787995492014,1.2786829471588135,0.9637787995492014
241,10,SVC Classifier,0,0.45,0.9432835820895522,0.9422515492865251,0.9936783313751221,0.9422515492865251
242,10,Decision Tree,0,0.45,0.8686567164179104,0.8656079488380821,0.04697108268737793,0.8656079488380821
243,10,RandomForest,0,0.45,0.7522388059701492,0.6837396201388525,0.12412333488464355,0.6837396201388525
244,10,AdaBoost (Discrete),0,0.45,0.935820895522388,0.9345954749096215,44.26300644874573,0.9345954749096215
245,10,AdaBoost (Real),0,0.45,0.9029850746268657,0.9011257979487143,40.61916637420654,0.9011257979487143
246,10,Logistic Regression (Penalty = L2),0,0.45,0.9746268656716418,0.9743967079900278,1.0121567249298096,0.9743967079900278
247,10,Naive Bayes,0,0.45,0.9119402985074627,0.9101972475899234,0.14742708206176758,0.9101972475899234
248,10,KNeighbors Classifier,1,0.45,0.9507462686567164,0.9501983562577818,1.2809035778045654,0.9501983562577818
249,10,SVC Classifier,1,0.45,0.9388059701492537,0.9382682782205508,0.9112999439239502,0.9382682782205508
250,10,Decision Tree,1,0.45,0.8552238805970149,0.8540210683267168,0.043931007385253906,0.8540210683267168
251,10,RandomForest,1,0.45,0.7925373134328358,0.7668928692935212,0.12087082862854004,0.7668928692935212
252,10,AdaBoost (Discrete),1,0.45,0.9492537313432836,0.9490849399778798,41.5218141078949,0.9490849399778798
253,10,AdaBoost (Real),1,0.45,0.282089552238806,0.15572385107347458,40.647682189941406,0.0
254,10,Logistic Regression (Penalty = L2),1,0.45,0.9701492537313433,0.9700114419037252,0.9841866493225098,0.9700114419037252
255,10,Naive Bayes,1,0.45,0.9298507462686567,0.9293757757914589,0.13814926147460938,0.9293757757914589
256,10,KNeighbors Classifier,2,0.45,0.9606060606060606,0.960219545462158,1.185239553451538,0.960219545462158
257,10,SVC Classifier,2,0.45,0.9393939393939394,0.9388297256634979,1.0202276706695557,0.9388297256634979
258,10,Decision Tree,2,0.45,0.8606060606060606,0.8588803084692873,0.04798126220703125,0.8588803084692873
259,10,RandomForest,2,0.45,0.7772727272727272,0.7572127877250758,0.1415402889251709,0.7572127877250758
260,10,AdaBoost (Discrete),2,0.45,0.9378787878787879,0.93692238661879,42.13574147224426,0.93692238661879
261,10,AdaBoost (Real),2,0.45,0.8590909090909091,0.8573044217421578,37.119720697402954,0.8573044217421578
262,10,Logistic Regression (Penalty = L2),2,0.45,0.9757575757575757,0.9755886471423171,0.8989260196685791,0.9755886471423171
263,10,Naive Bayes,2,0.45,0.9196969696969697,0.9190894056416885,0.11616373062133789,0.9190894056416885
264,11,KNeighbors Classifier,0,0.45,0.9686567164179104,0.9683001056333326,1.5521612167358398,0.9683001056333326
265,11,SVC Classifier,0,0.45,0.9582089552238806,0.957742777097324,1.217799186706543,0.957742777097324
266,11,Decision Tree,0,0.45,0.8388059701492537,0.8358906140485188,0.03037405014038086,0.8358906140485188
267,11,RandomForest,0,0.45,0.673134328358209,0.6097271325800834,0.09157562255859375,0.6097271325800834
268,11,AdaBoost (Discrete),0,0.45,0.9492537313432836,0.9485941529851246,55.22343444824219,0.9485941529851246
269,11,AdaBoost (Real),0,0.45,0.7074626865671642,0.6585497922508105,52.05392074584961,0.6585497922508105
270,11,Logistic Regression (Penalty = L2),0,0.45,0.9791044776119403,0.9789162603524607,1.4158284664154053,0.9789162603524607
271,11,Naive Bayes,0,0.45,0.9134328358208955,0.9123987605440398,0.12012338638305664,0.9123987605440398
272,11,KNeighbors Classifier,1,0.45,0.9507462686567164,0.9504361361009422,1.750392198562622,0.9504361361009422
273,11,SVC Classifier,1,0.45,0.9477611940298507,0.9473314881799856,1.0798983573913574,0.9473314881799856
274,11,Decision Tree,1,0.45,0.8582089552238806,0.8545995742879501,0.049271583557128906,0.8545995742879501
275,11,RandomForest,1,0.45,0.6835820895522388,0.6486537433508885,0.11023426055908203,0.6486537433508885
276,11,AdaBoost (Discrete),1,0.45,0.9522388059701492,0.951961916385138,56.42707109451294,0.951961916385138
277,11,AdaBoost (Real),1,0.45,0.282089552238806,0.23537415985096913,54.17678761482239,0.0
278,11,Logistic Regression (Penalty = L2),1,0.45,0.9731343283582089,0.9730477164763128,1.4048583507537842,0.9730477164763128
279,11,Naive Bayes,1,0.45,0.9313432835820895,0.9307496006512112,0.09846735000610352,0.9307496006512112
280,11,KNeighbors Classifier,2,0.45,0.9666666666666667,0.9664579550148316,1.6027703285217285,0.9664579550148316
281,11,SVC Classifier,2,0.45,0.9575757575757575,0.9573394900214413,1.0783019065856934,0.9573394900214413
282,11,Decision Tree,2,0.45,0.8303030303030303,0.8283553899851224,0.03017878532409668,0.8283553899851224
283,11,RandomForest,2,0.45,0.656060606060606,0.5847269720291811,0.14699769020080566,0.5847269720291811
284,11,AdaBoost (Discrete),2,0.45,0.9363636363636364,0.9358271382776477,53.09254217147827,0.9358271382776477
285,11,AdaBoost (Real),2,0.45,0.7303030303030303,0.7125209628384103,50.269091844558716,0.7125209628384103
286,11,Logistic Regression (Penalty = L2),2,0.45,0.9772727272727273,0.9771493796465623,1.2235422134399414,0.9771493796465623
287,11,Naive Bayes,2,0.45,0.9212121212121213,0.9204346251065992,0.13949847221374512,0.9204346251065992
288,12,KNeighbors Classifier,0,0.45,0.917910447761194,0.9157734144704415,0.18651318550109863,0.9157734144704415
289,12,SVC Classifier,0,0.45,0.7656716417910447,0.6280941634549922,0.35808682441711426,0.6280941634549922
290,12,Decision Tree,0,0.45,0.7865671641791044,0.7839585912457331,0.02346634864807129,0.7839585912457331
291,12,RandomForest,0,0.45,0.573134328358209,0.5739385155584661,0.09348034858703613,0.0
292,12,AdaBoost (Discrete),0,0.45,0.8716417910447761,0.8668324550583615,11.393495321273804,0.8668324550583615
293,12,AdaBoost (Real),0,0.45,0.3880597014925373,0.3012865606331407,13.289149045944214,0.0
294,12,Logistic Regression (Penalty = L2),0,0.45,0.9223880597014925,0.9213056248222842,0.24236345291137695,0.9213056248222842
295,12,Naive Bayes,0,0.45,0.8044776119402985,0.786491371576515,0.016942262649536133,0.786491371576515
296,12,KNeighbors Classifier,1,0.45,0.9208955223880597,0.9201377924965897,0.22282171249389648,0.9201377924965897
297,12,SVC Classifier,1,0.45,0.7925373134328358,0.7428308656411234,0.4364604949951172,0.7428308656411234
298,12,Decision Tree,1,0.45,0.7940298507462686,0.7917901841577272,0.04024863243103027,0.7917901841577272
299,12,RandomForest,1,0.45,0.5462686567164179,0.3370099365838956,0.11755967140197754,0.3370099365838956
300,12,AdaBoost (Discrete),1,0.45,0.8537313432835821,0.8493353886912055,11.342826843261719,0.8493353886912055
301,12,AdaBoost (Real),1,0.45,0.41492537313432837,0.32155228364874555,13.074059009552002,0.32155228364874555
302,12,Logistic Regression (Penalty = L2),1,0.45,0.9328358208955224,0.9326163824595293,0.1792750358581543,0.9326163824595293
303,12,Naive Bayes,1,0.45,0.8552238805970149,0.8508339230812324,0.04801154136657715,0.8508339230812324
304,12,KNeighbors Classifier,2,0.45,0.9090909090909091,0.9084832174413591,0.17638850212097168,0.9084832174413591
305,12,SVC Classifier,2,0.45,0.7666666666666667,0.6707528480776986,0.29084110260009766,0.6707528480776986
306,12,Decision Tree,2,0.45,0.7803030303030303,0.7780162089355257,0.02331686019897461,0.7780162089355257
307,12,RandomForest,2,0.45,0.6484848484848484,0.5093838427465526,0.09841680526733398,0.5093838427465526
308,12,AdaBoost (Discrete),2,0.45,0.8636363636363636,0.8538213173262472,11.964814186096191,0.8538213173262472
309,12,AdaBoost (Real),2,0.45,0.6272727272727273,0.6105237540283642,12.39521861076355,0.6105237540283642
310,12,Logistic Regression (Penalty = L2),2,0.45,0.9424242424242424,0.9422339925608244,0.20989322662353516,0.9422339925608244
311,12,Naive Bayes,2,0.45,0.8393939393939394,0.8303079390465823,0.06638908386230469,0.8303079390465823
