,feat_set_id,classifier,fold_id,feat_th,score,geo_score,exec_t,geo_score_woz
0,0,KNeighbors Classifier,0,0.1,0.9647887323943662,0.907539441290753,0.9741439819335938,0.907539441290753
1,0,SVC Classifier,0,0.1,0.8901408450704226,0.4236090741960986,0.795194149017334,0.4236090741960986
2,0,Decision Tree,0,0.1,0.9647887323943662,0.907539441290753,0.0030279159545898438,0.907539441290753
3,0,RandomForest,0,0.1,0.8901408450704226,0.4236090741960986,0.8967759609222412,0.4236090741960986
4,0,AdaBoost (Discrete),0,0.1,0.9647887323943662,0.907539441290753,54.14637470245361,0.907539441290753
5,0,AdaBoost (Real),0,0.1,0.9647887323943662,0.907539441290753,75.87720894813538,0.907539441290753
6,0,Logistic Regression (Penalty = L2),0,0.1,0.9647887323943662,0.907539441290753,0.3628711700439453,0.907539441290753
7,0,Naive Bayes,0,0.1,0.9647887323943662,0.907539441290753,0.12111616134643555,0.907539441290753
8,0,KNeighbors Classifier,1,0.1,0.9548660084626234,0.8759410972579285,0.715839147567749,0.8759410972579285
9,0,SVC Classifier,1,0.1,0.9548660084626234,0.8759410972579285,0.6378209590911865,0.8759410972579285
10,0,Decision Tree,1,0.1,0.9548660084626234,0.8759410972579285,0.0016410350799560547,0.8759410972579285
11,0,RandomForest,1,0.1,0.8942172073342737,0.5580793993242377,0.8903191089630127,0.5580793993242377
12,0,AdaBoost (Discrete),1,0.1,0.9548660084626234,0.8759410972579285,56.09797787666321,0.8759410972579285
13,0,AdaBoost (Real),1,0.1,0.9576868829337094,0.8845716145882833,83.09966158866882,0.8845716145882833
14,0,Logistic Regression (Penalty = L2),1,0.1,0.9576868829337094,0.8845716145882833,0.2520270347595215,0.8845716145882833
15,0,Naive Bayes,1,0.1,0.9548660084626234,0.8759410972579285,0.12766480445861816,0.8759410972579285
16,0,KNeighbors Classifier,2,0.1,0.9405940594059405,0.8298265333662435,1.044541835784912,0.8298265333662435
17,0,SVC Classifier,2,0.1,0.9391796322489392,0.8248573930653896,0.7598958015441895,0.8248573930653896
18,0,Decision Tree,2,0.1,0.9405940594059405,0.8298265333662435,0.002751588821411133,0.8298265333662435
19,0,RandomForest,2,0.1,0.8571428571428571,0.7491491772643939,0.9321811199188232,0.0
20,0,AdaBoost (Discrete),2,0.1,0.9391796322489392,0.8248573930653896,55.064085245132446,0.8248573930653896
21,0,AdaBoost (Real),2,0.1,0.9405940594059405,0.8298265333662435,67.60044384002686,0.8298265333662435
22,0,Logistic Regression (Penalty = L2),2,0.1,0.9405940594059405,0.8298265333662435,0.2714109420776367,0.8298265333662435
23,0,Naive Bayes,2,0.1,0.9391796322489392,0.8248573930653896,0.12831544876098633,0.8248573930653896
24,1,KNeighbors Classifier,0,0.1,0.7774647887323943,1.0,0.6082885265350342,0.0
25,1,SVC Classifier,0,0.1,0.7774647887323943,1.0,0.8564248085021973,0.0
26,1,Decision Tree,0,0.1,0.7774647887323943,1.0,0.10268378257751465,0.0
27,1,RandomForest,0,0.1,0.7774647887323943,1.0,0.9929735660552979,0.0
28,1,AdaBoost (Discrete),0,0.1,0.7774647887323943,1.0,55.575024366378784,0.0
29,1,AdaBoost (Real),0,0.1,0.7774647887323943,1.0,65.77216601371765,0.0
30,1,Logistic Regression (Penalty = L2),0,0.1,0.7774647887323943,1.0,0.2480945587158203,0.0
31,1,Naive Bayes,0,0.1,0.780281690140845,0.9469631093315001,0.12445616722106934,0.0
32,1,KNeighbors Classifier,1,0.1,0.764456981664316,0.8932711255583521,0.630314826965332,0.0
33,1,SVC Classifier,1,0.1,0.7785613540197461,1.0,0.7530627250671387,0.0
34,1,Decision Tree,1,0.1,0.764456981664316,0.8932711255583521,0.12651824951171875,0.0
35,1,RandomForest,1,0.1,0.7785613540197461,1.0,1.1096882820129395,0.0
36,1,AdaBoost (Discrete),1,0.1,0.764456981664316,0.8932711255583521,57.67041015625,0.0
37,1,AdaBoost (Real),1,0.1,0.764456981664316,0.8932711255583521,65.68161964416504,0.0
38,1,Logistic Regression (Penalty = L2),1,0.1,0.764456981664316,0.8932711255583521,0.24529218673706055,0.0
39,1,Naive Bayes,1,0.1,0.7108603667136812,0.8978638094331762,0.12877297401428223,0.0
40,1,KNeighbors Classifier,2,0.1,0.7454031117397454,0.8717959332267562,0.6164100170135498,0.0
41,1,SVC Classifier,2,0.1,0.7793493635077794,1.0,0.7702844142913818,0.0
42,1,Decision Tree,2,0.1,0.7454031117397454,0.8717959332267562,0.12669777870178223,0.0
43,1,RandomForest,2,0.1,0.7793493635077794,1.0,1.122873306274414,0.0
44,1,AdaBoost (Discrete),2,0.1,0.7454031117397454,0.8717959332267562,57.235175371170044,0.0
45,1,AdaBoost (Real),2,0.1,0.7454031117397454,0.8717959332267562,68.41821193695068,0.0
46,1,Logistic Regression (Penalty = L2),2,0.1,0.7454031117397454,0.8717959332267562,0.275223970413208,0.0
47,1,Naive Bayes,2,0.1,0.693069306930693,0.8854541422979073,0.1268138885498047,0.0
48,2,KNeighbors Classifier,0,0.1,0.7774647887323943,1.0,0.6774308681488037,0.0
49,2,SVC Classifier,0,0.1,0.7774647887323943,1.0,0.683527946472168,0.0
50,2,Decision Tree,0,0.1,0.7774647887323943,1.0,0.1420755386352539,0.0
51,2,RandomForest,0,0.1,0.7774647887323943,1.0,0.9771530628204346,0.0
52,2,AdaBoost (Discrete),0,0.1,0.7774647887323943,1.0,57.7369818687439,0.0
53,2,AdaBoost (Real),0,0.1,0.7774647887323943,1.0,69.47612071037292,0.0
54,2,Logistic Regression (Penalty = L2),0,0.1,0.7774647887323943,1.0,0.2873661518096924,0.0
55,2,Naive Bayes,0,0.1,0.8112676056338028,0.967777971901898,0.13613295555114746,0.0
56,2,KNeighbors Classifier,1,0.1,0.7884344146685472,0.9101736917030304,0.8067245483398438,0.0
57,2,SVC Classifier,1,0.1,0.7785613540197461,1.0,0.761066198348999,0.0
58,2,Decision Tree,1,0.1,0.7884344146685472,0.9101736917030304,0.1346127986907959,0.0
59,2,RandomForest,1,0.1,0.7785613540197461,1.0,0.8224549293518066,0.0
60,2,AdaBoost (Discrete),1,0.1,0.7884344146685472,0.9101736917030304,58.35489344596863,0.0
61,2,AdaBoost (Real),1,0.1,0.7884344146685472,0.9101736917030304,66.81395745277405,0.0
62,2,Logistic Regression (Penalty = L2),1,0.1,0.7884344146685472,0.9101736917030304,0.2725827693939209,0.0
63,2,Naive Bayes,1,0.1,0.7348377997179125,0.9148532788043832,0.15199017524719238,0.0
64,2,KNeighbors Classifier,2,0.1,0.7652050919377652,0.8858096246161654,0.8340017795562744,0.0
65,2,SVC Classifier,2,0.1,0.7793493635077794,1.0,1.1085655689239502,0.0
66,2,Decision Tree,2,0.1,0.7652050919377652,0.8858096246161654,0.134596586227417,0.0
67,2,RandomForest,2,0.1,0.7793493635077794,1.0,0.9522795677185059,0.0
68,2,AdaBoost (Discrete),2,0.1,0.7652050919377652,0.8858096246161654,57.468332052230835,0.0
69,2,AdaBoost (Real),2,0.1,0.7652050919377652,0.8858096246161654,67.66503238677979,0.0
70,2,Logistic Regression (Penalty = L2),2,0.1,0.7652050919377652,0.8858096246161654,0.45351457595825195,0.0
71,2,Naive Bayes,2,0.1,0.7128712871287128,0.8996873826890499,0.1316838264465332,0.0
72,5,KNeighbors Classifier,0,0.1,0.7774647887323943,1.0,0.7846794128417969,0.0
73,5,SVC Classifier,0,0.1,0.7774647887323943,1.0,0.8007767200469971,0.0
74,5,Decision Tree,0,0.1,0.7774647887323943,1.0,0.0025148391723632812,0.0
75,5,RandomForest,0,0.1,0.7774647887323943,1.0,0.9524803161621094,0.0
76,5,AdaBoost (Discrete),0,0.1,0.7774647887323943,1.0,57.470110177993774,0.0
77,5,AdaBoost (Real),0,0.1,0.7774647887323943,1.0,76.8095190525055,0.0
78,5,Logistic Regression (Penalty = L2),0,0.1,0.7774647887323943,1.0,0.1545565128326416,0.0
79,5,Naive Bayes,0,0.1,0.780281690140845,0.9469631093315001,0.14110326766967773,0.0
80,5,KNeighbors Classifier,1,0.1,0.764456981664316,0.8932711255583521,0.6068253517150879,0.0
81,5,SVC Classifier,1,0.1,0.7785613540197461,1.0,1.0094902515411377,0.0
82,5,Decision Tree,1,0.1,0.764456981664316,0.8932711255583521,0.14650225639343262,0.0
83,5,RandomForest,1,0.1,0.7785613540197461,1.0,1.0036609172821045,0.0
84,5,AdaBoost (Discrete),1,0.1,0.764456981664316,0.8932711255583521,60.736762285232544,0.0
85,5,AdaBoost (Real),1,0.1,0.764456981664316,0.8932711255583521,71.77900171279907,0.0
86,5,Logistic Regression (Penalty = L2),1,0.1,0.764456981664316,0.8932711255583521,0.2846372127532959,0.0
87,5,Naive Bayes,1,0.1,0.7108603667136812,0.8978638094331762,0.12051558494567871,0.0
88,5,KNeighbors Classifier,2,0.1,0.7454031117397454,0.8717959332267562,0.7116782665252686,0.0
89,5,SVC Classifier,2,0.1,0.7793493635077794,1.0,0.9874017238616943,0.0
90,5,Decision Tree,2,0.1,0.7454031117397454,0.8717959332267562,0.14662456512451172,0.0
91,5,RandomForest,2,0.1,0.7793493635077794,1.0,1.1564784049987793,0.0
92,5,AdaBoost (Discrete),2,0.1,0.7454031117397454,0.8717959332267562,56.660656452178955,0.0
93,5,AdaBoost (Real),2,0.1,0.7454031117397454,0.8717959332267562,66.11318778991699,0.0
94,5,Logistic Regression (Penalty = L2),2,0.1,0.7454031117397454,0.8717959332267562,0.0066072940826416016,0.0
95,5,Naive Bayes,2,0.1,0.693069306930693,0.8854541422979073,0.004607200622558594,0.0
96,6,KNeighbors Classifier,0,0.1,0.7774647887323943,1.0,0.044309139251708984,0.0
97,6,SVC Classifier,0,0.1,0.7774647887323943,1.0,0.07931113243103027,0.0
98,6,Decision Tree,0,0.1,0.7774647887323943,1.0,0.0019745826721191406,0.0
99,6,RandomForest,0,0.1,0.7774647887323943,1.0,0.8031141757965088,0.0
100,6,AdaBoost (Discrete),0,0.1,0.7774647887323943,1.0,30.316236972808838,0.0
101,6,AdaBoost (Real),0,0.1,0.7774647887323943,1.0,73.77978348731995,0.0
102,6,Logistic Regression (Penalty = L2),0,0.1,0.7774647887323943,1.0,0.3180372714996338,0.0
103,6,Naive Bayes,0,0.1,0.780281690140845,0.9469631093315001,0.0038700103759765625,0.0
104,6,KNeighbors Classifier,1,0.1,0.764456981664316,0.8932711255583521,0.5721628665924072,0.0
105,6,SVC Classifier,1,0.1,0.7785613540197461,1.0,0.8304264545440674,0.0
106,6,Decision Tree,1,0.1,0.764456981664316,0.8932711255583521,0.0026712417602539062,0.0
107,6,RandomForest,1,0.1,0.7785613540197461,1.0,0.8333191871643066,0.0
108,6,AdaBoost (Discrete),1,0.1,0.764456981664316,0.8932711255583521,52.64233088493347,0.0
109,6,AdaBoost (Real),1,0.1,0.764456981664316,0.8932711255583521,62.42022180557251,0.0
110,6,Logistic Regression (Penalty = L2),1,0.1,0.764456981664316,0.8932711255583521,0.2499692440032959,0.0
111,6,Naive Bayes,1,0.1,0.7108603667136812,0.8978638094331762,0.13520097732543945,0.0
112,6,KNeighbors Classifier,2,0.1,0.7454031117397454,0.8717959332267562,0.6368210315704346,0.0
113,6,SVC Classifier,2,0.1,0.7793493635077794,1.0,0.7649133205413818,0.0
114,6,Decision Tree,2,0.1,0.7454031117397454,0.8717959332267562,0.08709359169006348,0.0
115,6,RandomForest,2,0.1,0.7793493635077794,1.0,0.8773543834686279,0.0
116,6,AdaBoost (Discrete),2,0.1,0.7454031117397454,0.8717959332267562,54.452247619628906,0.0
117,6,AdaBoost (Real),2,0.1,0.7454031117397454,0.8717959332267562,60.699164152145386,0.0
118,6,Logistic Regression (Penalty = L2),2,0.1,0.7454031117397454,0.8717959332267562,0.2488241195678711,0.0
119,6,Naive Bayes,2,0.1,0.693069306930693,0.8854541422979073,0.11902213096618652,0.0
120,7,KNeighbors Classifier,0,0.1,0.9704225352112676,0.9236054126383193,0.8925557136535645,0.9236054126383193
121,7,SVC Classifier,0,0.1,0.8901408450704226,0.4236090741960986,0.7479197978973389,0.4236090741960986
122,7,Decision Tree,0,0.1,0.9647887323943662,0.907539441290753,0.0030193328857421875,0.907539441290753
123,7,RandomForest,0,0.1,0.8901408450704226,0.4236090741960986,0.8746371269226074,0.4236090741960986
124,7,AdaBoost (Discrete),0,0.1,0.8408450704225352,0.9240628129422016,51.96245074272156,0.9240628129422016
125,7,AdaBoost (Real),0,0.1,0.9647887323943662,0.907539441290753,70.11064076423645,0.907539441290753
126,7,Logistic Regression (Penalty = L2),0,0.1,0.9647887323943662,0.907539441290753,0.3531501293182373,0.907539441290753
127,7,Naive Bayes,0,0.1,0.9492957746478873,0.9750961659762587,0.11711525917053223,0.9750961659762587
128,7,KNeighbors Classifier,1,0.1,0.9435825105782792,0.8865181789611445,1.3625590801239014,0.8865181789611445
129,7,SVC Classifier,1,0.1,0.9548660084626234,0.8759410972579285,0.9137439727783203,0.8759410972579285
130,7,Decision Tree,1,0.1,0.9548660084626234,0.8759410972579285,0.1308455467224121,0.8759410972579285
131,7,RandomForest,1,0.1,0.9097320169252469,0.6703835584804859,0.7892465591430664,0.6703835584804859
132,7,AdaBoost (Discrete),1,0.1,0.8702397743300423,0.9338451038203882,56.30086898803711,0.9338451038203882
133,7,AdaBoost (Real),1,0.1,0.9576868829337094,0.8845716145882833,73.43802881240845,0.8845716145882833
134,7,Logistic Regression (Penalty = L2),1,0.1,0.9576868829337094,0.8845716145882833,0.4451873302459717,0.8845716145882833
135,7,Naive Bayes,1,0.1,0.8279266572637518,0.8254850308025857,0.13692688941955566,0.8254850308025857
136,7,KNeighbors Classifier,2,0.1,0.9222065063649222,0.8319011083329612,1.1891014575958252,0.8319011083329612
137,7,SVC Classifier,2,0.1,0.9391796322489392,0.8248573930653896,0.9031157493591309,0.8248573930653896
138,7,Decision Tree,2,0.1,0.9391796322489392,0.8248573930653896,0.12314152717590332,0.8248573930653896
139,7,RandomForest,2,0.1,0.9066478076379066,0.6970419054037802,0.9522960186004639,0.6970419054037802
140,7,AdaBoost (Discrete),2,0.1,0.8274398868458275,0.912591793781845,55.55506658554077,0.912591793781845
141,7,AdaBoost (Real),2,0.1,0.9391796322489392,0.8248573930653896,71.11699223518372,0.8248573930653896
142,7,Logistic Regression (Penalty = L2),2,0.1,0.9391796322489392,0.8248573930653896,0.3355715274810791,0.8248573930653896
143,7,Naive Bayes,2,0.1,0.842998585572843,0.9125324922160284,0.15555477142333984,0.9125324922160284
