,feat_set_id,classifier,fold_id,feat_th,score,geo_score,exec_t,geo_score_woz
0,0,KNeighbors Classifier,0,0.05,0.7582089552238805,0.754071936266298,0.4643230438232422,0.754071936266298
1,0,SVC Classifier,0,0.05,0.6358208955223881,0.5390115885158696,1.812586784362793,0.5390115885158696
2,0,Decision Tree,0,0.05,0.6626865671641791,0.6531043694089093,0.14660310745239258,0.6531043694089093
3,0,RandomForest,0,0.05,0.5895522388059702,0.6252193645689372,0.6714708805084229,0.0
4,0,AdaBoost (Discrete),0,0.05,0.7014925373134329,0.695827406913252,44.60141396522522,0.695827406913252
5,0,AdaBoost (Real),0,0.05,0.6074626865671642,0.5796509192334062,86.16913986206055,0.5796509192334062
6,0,Logistic Regression (Penalty = L2),0,0.05,0.755223880597015,0.7478496247793811,1.4559862613677979,0.7478496247793811
7,0,Naive Bayes,0,0.05,0.6582089552238806,0.6342948077926182,0.28197360038757324,0.6342948077926182
8,0,KNeighbors Classifier,1,0.05,0.7895522388059701,0.7803703380181696,0.5648083686828613,0.7803703380181696
9,0,SVC Classifier,1,0.05,0.6447761194029851,0.5171966903149624,2.383859157562256,0.5171966903149624
10,0,Decision Tree,1,0.05,0.7,0.6970546099314066,0.09716939926147461,0.6970546099314066
11,0,RandomForest,1,0.05,0.5611940298507463,0.3967792006437096,0.6714820861816406,0.3967792006437096
12,0,AdaBoost (Discrete),1,0.05,0.6880597014925374,0.6683833328106183,51.81363821029663,0.6683833328106183
13,0,AdaBoost (Real),1,0.05,0.4462686567164179,0.3154298452779812,69.43895173072815,0.3154298452779812
14,0,Logistic Regression (Penalty = L2),1,0.05,0.7746268656716417,0.7694715859342328,1.2436974048614502,0.7694715859342328
15,0,Naive Bayes,1,0.05,0.6776119402985075,0.6463832363090534,0.16383004188537598,0.6463832363090534
16,0,KNeighbors Classifier,2,0.05,0.7909090909090909,0.7864465712618203,0.4092087745666504,0.7864465712618203
17,0,SVC Classifier,2,0.05,0.6530303030303031,0.526849660532231,2.2054412364959717,0.526849660532231
18,0,Decision Tree,2,0.05,0.693939393939394,0.6824663011148773,0.07987284660339355,0.6824663011148773
19,0,RandomForest,2,0.05,0.646969696969697,0.5799660162844874,0.6269454956054688,0.5799660162844874
20,0,AdaBoost (Discrete),2,0.05,0.703030303030303,0.6896203606855943,46.699729204177856,0.6896203606855943
21,0,AdaBoost (Real),2,0.05,0.5772727272727273,0.545564633749501,64.20089030265808,0.545564633749501
22,0,Logistic Regression (Penalty = L2),2,0.05,0.7787878787878788,0.7714804109507712,1.176710844039917,0.7714804109507712
23,0,Naive Bayes,2,0.05,0.6712121212121213,0.6348541236675325,0.1759793758392334,0.6348541236675325
24,1,KNeighbors Classifier,0,0.05,0.7298507462686568,0.711719163279544,0.31554627418518066,0.711719163279544
25,1,SVC Classifier,0,0.05,0.48059701492537316,0.38764236853160405,2.472119092941284,0.38764236853160405
26,1,Decision Tree,0,0.05,0.6417910447761194,0.6235840304218409,0.1587977409362793,0.6235840304218409
27,1,RandomForest,0,0.05,0.5223880597014925,0.4057617012979174,0.7183654308319092,0.0
28,1,AdaBoost (Discrete),0,0.05,0.6880597014925374,0.6644235900610712,64.78423285484314,0.6644235900610712
29,1,AdaBoost (Real),0,0.05,0.5253731343283582,0.4465791081402044,82.7351245880127,0.4465791081402044
30,1,Logistic Regression (Penalty = L2),0,0.05,0.808955223880597,0.7884172868867985,1.3700265884399414,0.7884172868867985
31,1,Naive Bayes,0,0.05,0.5970149253731343,0.5669557499813609,0.17122745513916016,0.5669557499813609
32,1,KNeighbors Classifier,1,0.05,0.7104477611940299,0.6966401742947691,0.24966192245483398,0.6966401742947691
33,1,SVC Classifier,1,0.05,0.5044776119402985,0.44996654355131444,2.3557984828948975,0.44996654355131444
34,1,Decision Tree,1,0.05,0.6223880597014926,0.6085393391442497,0.08879733085632324,0.6085393391442497
35,1,RandomForest,1,0.05,0.45223880597014926,0.47894402344391196,0.6714189052581787,0.0
36,1,AdaBoost (Discrete),1,0.05,0.6880597014925374,0.6619245664991684,64.59132051467896,0.6619245664991684
37,1,AdaBoost (Real),1,0.05,0.5447761194029851,0.4973063574352078,79.08401131629944,0.4973063574352078
38,1,Logistic Regression (Penalty = L2),1,0.05,0.7970149253731343,0.7811003901661874,1.2425518035888672,0.7811003901661874
39,1,Naive Bayes,1,0.05,0.6059701492537314,0.5914336841291081,0.1733689308166504,0.5914336841291081
40,1,KNeighbors Classifier,2,0.05,0.6833333333333333,0.6652708873323847,0.3707897663116455,0.6652708873323847
41,1,SVC Classifier,2,0.05,0.4954545454545455,0.39335560530256986,2.9542784690856934,0.39335560530256986
42,1,Decision Tree,2,0.05,0.603030303030303,0.5928557638607875,0.1834850311279297,0.5928557638607875
43,1,RandomForest,2,0.05,0.49696969696969695,0.4985562436134458,0.7413885593414307,0.0
44,1,AdaBoost (Discrete),2,0.05,0.6484848484848484,0.634613071400185,70.42866969108582,0.634613071400185
45,1,AdaBoost (Real),2,0.05,0.5515151515151515,0.4387693805217412,90.11048817634583,0.4387693805217412
46,1,Logistic Regression (Penalty = L2),2,0.05,0.8136363636363636,0.7984047582025424,1.737997055053711,0.7984047582025424
47,1,Naive Bayes,2,0.05,0.5954545454545455,0.5635963014505851,0.19288969039916992,0.5635963014505851
48,2,KNeighbors Classifier,0,0.05,0.9104477611940298,0.907281483979449,0.6361179351806641,0.907281483979449
49,2,SVC Classifier,0,0.05,0.7223880597014926,0.6676863452050665,2.805525541305542,0.6676863452050665
50,2,Decision Tree,0,0.05,0.7761194029850746,0.7612271166942802,0.19517230987548828,0.7612271166942802
51,2,RandomForest,0,0.05,0.6388059701492538,0.42299493219507356,0.662165641784668,0.42299493219507356
52,2,AdaBoost (Discrete),0,0.05,0.835820895522388,0.816238508387201,71.5570650100708,0.816238508387201
53,2,AdaBoost (Real),0,0.05,0.6716417910447762,0.651141084180939,86.34661269187927,0.651141084180939
54,2,Logistic Regression (Penalty = L2),0,0.05,0.9074626865671642,0.905100532819658,1.0677490234375,0.905100532819658
55,2,Naive Bayes,0,0.05,0.8611940298507462,0.8501292775607094,0.1981656551361084,0.8501292775607094
56,2,KNeighbors Classifier,1,0.05,0.891044776119403,0.8888433258556799,0.5582170486450195,0.8888433258556799
57,2,SVC Classifier,1,0.05,0.7074626865671642,0.6583770448727743,2.644139289855957,0.6583770448727743
58,2,Decision Tree,1,0.05,0.7865671641791044,0.7774557149977159,0.09776926040649414,0.7774557149977159
59,2,RandomForest,1,0.05,0.6194029850746269,0.4583758111494755,0.6464996337890625,0.4583758111494755
60,2,AdaBoost (Discrete),1,0.05,0.8552238805970149,0.8516898543889413,68.43773102760315,0.8516898543889413
61,2,AdaBoost (Real),1,0.05,0.4671641791044776,0.32527963014600186,84.60070848464966,0.0
62,2,Logistic Regression (Penalty = L2),1,0.05,0.8880597014925373,0.8865952838878577,1.0909886360168457,0.8865952838878577
63,2,Naive Bayes,1,0.05,0.8253731343283582,0.8173223516917447,0.19219279289245605,0.8173223516917447
64,2,KNeighbors Classifier,2,0.05,0.9166666666666666,0.9146945788887421,0.7302074432373047,0.9146945788887421
65,2,SVC Classifier,2,0.05,0.6848484848484848,0.595139188988376,2.720625162124634,0.595139188988376
66,2,Decision Tree,2,0.05,0.7803030303030303,0.7761351798629859,0.08526968955993652,0.7761351798629859
67,2,RandomForest,2,0.05,0.46060606060606063,0.33475341235024486,0.7863984107971191,0.0
68,2,AdaBoost (Discrete),2,0.05,0.8333333333333334,0.8292189180734983,69.54679322242737,0.8292189180734983
69,2,AdaBoost (Real),2,0.05,0.5,0.2843881325801061,78.651691198349,0.2843881325801061
70,2,Logistic Regression (Penalty = L2),2,0.05,0.8939393939393939,0.8916887506037458,0.9960956573486328,0.8916887506037458
71,2,Naive Bayes,2,0.05,0.8393939393939394,0.8301757365874561,0.16390275955200195,0.8301757365874561
72,5,KNeighbors Classifier,0,0.05,0.2835820895522388,0.1818848417848356,0.0814521312713623,0.1818848417848356
73,5,SVC Classifier,0,0.05,0.3492537313432836,0.48616044159139277,1.3928122520446777,0.0
74,5,Decision Tree,0,0.05,0.31492537313432833,0.22597494991903316,0.07985901832580566,0.22597494991903316
75,5,RandomForest,0,0.05,0.2716417910447761,0.38207693464495435,0.6344172954559326,0.0
76,5,AdaBoost (Discrete),0,0.05,0.31343283582089554,0.18780625112716728,40.45078158378601,0.18780625112716728
77,5,AdaBoost (Real),0,0.05,0.3029850746268657,0.20571055817816222,57.917694091796875,0.20571055817816222
78,5,Logistic Regression (Penalty = L2),0,0.05,0.3582089552238806,0.2445150819293784,0.3311934471130371,0.0
79,5,Naive Bayes,0,0.05,0.373134328358209,0.20234659725883036,0.1817004680633545,0.0
80,5,KNeighbors Classifier,1,0.05,0.3253731343283582,0.19555064726917498,0.08902597427368164,0.19555064726917498
81,5,SVC Classifier,1,0.05,0.34626865671641793,0.4638036092908337,1.8392081260681152,0.0
82,5,Decision Tree,1,0.05,0.32238805970149254,0.24322691922286518,0.08774852752685547,0.24322691922286518
83,5,RandomForest,1,0.05,0.26865671641791045,0.3198166644816292,0.7170588970184326,0.0
84,5,AdaBoost (Discrete),1,0.05,0.3,0.19945770445125857,38.47652578353882,0.19945770445125857
85,5,AdaBoost (Real),1,0.05,0.1701492537313433,0.12054526537255975,57.91963791847229,0.0
86,5,Logistic Regression (Penalty = L2),1,0.05,0.3402985074626866,0.19499706841831885,0.35246872901916504,0.19499706841831885
87,5,Naive Bayes,1,0.05,0.3641791044776119,0.2849781480187537,0.15813899040222168,0.0
88,5,KNeighbors Classifier,2,0.05,0.29393939393939394,0.17056339046148558,0.1707155704498291,0.17056339046148558
89,5,SVC Classifier,2,0.05,0.30454545454545456,0.22240887845358023,1.635533332824707,0.0
90,5,Decision Tree,2,0.05,0.3151515151515151,0.22921085697208382,0.0024938583374023438,0.22921085697208382
91,5,RandomForest,2,0.05,0.2590909090909091,0.19424712007434491,0.5260071754455566,0.0
92,5,AdaBoost (Discrete),2,0.05,0.3,0.20472353726592404,38.90536975860596,0.20472353726592404
93,5,AdaBoost (Real),2,0.05,0.2863636363636364,0.19394854576494627,58.24935722351074,0.0
94,5,Logistic Regression (Penalty = L2),2,0.05,0.3333333333333333,0.19656729149348776,0.40526247024536133,0.19656729149348776
95,5,Naive Bayes,2,0.05,0.3424242424242424,0.30195140027733053,0.08572888374328613,0.0
96,6,KNeighbors Classifier,0,0.05,0.2835820895522388,0.1818848417848356,0.15868115425109863,0.1818848417848356
97,6,SVC Classifier,0,0.05,0.3492537313432836,0.48616044159139277,1.620206594467163,0.0
98,6,Decision Tree,0,0.05,0.31492537313432833,0.22597494991903316,0.08407402038574219,0.22597494991903316
99,6,RandomForest,0,0.05,0.2716417910447761,0.38207693464495435,0.5790903568267822,0.0
100,6,AdaBoost (Discrete),0,0.05,0.31343283582089554,0.18780625112716728,37.29494762420654,0.18780625112716728
101,6,AdaBoost (Real),0,0.05,0.3029850746268657,0.20571055817816222,58.87064838409424,0.20571055817816222
102,6,Logistic Regression (Penalty = L2),0,0.05,0.3582089552238806,0.2445150819293784,0.32167601585388184,0.0
103,6,Naive Bayes,0,0.05,0.373134328358209,0.20234659725883036,0.07848763465881348,0.0
104,6,KNeighbors Classifier,1,0.05,0.3253731343283582,0.19555064726917498,0.0888667106628418,0.19555064726917498
105,6,SVC Classifier,1,0.05,0.34626865671641793,0.4638036092908337,1.6648690700531006,0.0
106,6,Decision Tree,1,0.05,0.32238805970149254,0.24322691922286518,0.07979607582092285,0.24322691922286518
107,6,RandomForest,1,0.05,0.26865671641791045,0.3198166644816292,0.6692428588867188,0.0
108,6,AdaBoost (Discrete),1,0.05,0.3,0.19945770445125857,37.8129518032074,0.19945770445125857
109,6,AdaBoost (Real),1,0.05,0.1701492537313433,0.12054526537255975,58.00440073013306,0.0
110,6,Logistic Regression (Penalty = L2),1,0.05,0.3402985074626866,0.19499706841831885,0.38533687591552734,0.19499706841831885
111,6,Naive Bayes,1,0.05,0.3641791044776119,0.2849781480187537,0.07204866409301758,0.0
112,6,KNeighbors Classifier,2,0.05,0.29393939393939394,0.17056339046148558,0.17536234855651855,0.17056339046148558
113,6,SVC Classifier,2,0.05,0.30454545454545456,0.22240887845358023,1.620476245880127,0.0
114,6,Decision Tree,2,0.05,0.3151515151515151,0.22921085697208382,0.002400636672973633,0.22921085697208382
115,6,RandomForest,2,0.05,0.2590909090909091,0.19424712007434491,0.5783131122589111,0.0
116,6,AdaBoost (Discrete),2,0.05,0.3,0.20472353726592404,36.867560148239136,0.20472353726592404
117,6,AdaBoost (Real),2,0.05,0.2863636363636364,0.19394854576494627,56.176276206970215,0.0
118,6,Logistic Regression (Penalty = L2),2,0.05,0.3333333333333333,0.19656729149348776,0.2993347644805908,0.19656729149348776
119,6,Naive Bayes,2,0.05,0.3424242424242424,0.30195140027733053,0.08835577964782715,0.0
120,7,KNeighbors Classifier,0,0.05,0.9582089552238806,0.9573572348609076,1.8561809062957764,0.9573572348609076
121,7,SVC Classifier,0,0.05,0.7880597014925373,0.7436049526554122,3.262805700302124,0.7436049526554122
122,7,Decision Tree,0,0.05,0.8,0.7932982558209997,0.1585674285888672,0.7932982558209997
123,7,RandomForest,0,0.05,0.5552238805970149,0.4829906564748424,0.7482414245605469,0.0
124,7,AdaBoost (Discrete),0,0.05,0.9059701492537313,0.9039961119460003,103.85613107681274,0.9039961119460003
125,7,AdaBoost (Real),0,0.05,0.7313432835820896,0.6898827488579313,106.40276980400085,0.6898827488579313
126,7,Logistic Regression (Penalty = L2),0,0.05,0.9537313432835821,0.9533013960766575,2.0951547622680664,0.9533013960766575
127,7,Naive Bayes,0,0.05,0.8656716417910447,0.8628333829129438,0.1665341854095459,0.8628333829129438
128,7,KNeighbors Classifier,1,0.05,0.9402985074626866,0.9395899510962832,1.649308443069458,0.9395899510962832
129,7,SVC Classifier,1,0.05,0.8134328358208955,0.7934766586766915,3.459007978439331,0.7934766586766915
130,7,Decision Tree,1,0.05,0.8253731343283582,0.8210387904006621,0.16318130493164062,0.8210387904006621
131,7,RandomForest,1,0.05,0.6029850746268657,0.4801654239826657,0.7674932479858398,0.4801654239826657
132,7,AdaBoost (Discrete),1,0.05,0.9,0.8989013580847711,103.75717496871948,0.8989013580847711
133,7,AdaBoost (Real),1,0.05,0.4746268656716418,0.549113902754334,111.67437863349915,0.0
134,7,Logistic Regression (Penalty = L2),1,0.05,0.9492537313432836,0.9491066286443324,1.948939323425293,0.9491066286443324
135,7,Naive Bayes,1,0.05,0.8731343283582089,0.8711171049737118,0.19073939323425293,0.8711171049737118
136,7,KNeighbors Classifier,2,0.05,0.9363636363636364,0.935497013717678,1.5908761024475098,0.935497013717678
137,7,SVC Classifier,2,0.05,0.8090909090909091,0.7760525601747786,3.4536890983581543,0.7760525601747786
138,7,Decision Tree,2,0.05,0.8333333333333334,0.8302365129958641,0.08564329147338867,0.8302365129958641
139,7,RandomForest,2,0.05,0.6393939393939394,0.5135338603433354,0.7484683990478516,0.5135338603433354
140,7,AdaBoost (Discrete),2,0.05,0.9,0.8946836359944462,104.7376127243042,0.8946836359944462
141,7,AdaBoost (Real),2,0.05,0.5454545454545454,0.39949670843538626,111.69842338562012,0.39949670843538626
142,7,Logistic Regression (Penalty = L2),2,0.05,0.9545454545454546,0.9542116467328149,1.7977635860443115,0.9542116467328149
143,7,Naive Bayes,2,0.05,0.8803030303030303,0.8790711740625461,0.2383887767791748,0.8790711740625461
