,feat_set_id,classifier,fold_id,feat_th,score,geo_score,exec_t,geo_score_woz
0,0,KNeighbors Classifier,0,0.55,0.4936507936507937,0.09887642205794972,0.2834315299987793,0.0
1,0,SVC Classifier,0,0.55,0.5301587301587302,1.0,0.7269833087921143,0.0
2,0,Decision Tree,0,0.55,0.3984126984126984,0.17099396856736784,0.0608828067779541,0.0
3,0,RandomForest,0,0.55,0.5301587301587302,1.0,0.5393078327178955,0.0
4,0,AdaBoost (Discrete),0,0.55,0.2904761904761905,0.1714848096551386,30.695575714111328,0.1714848096551386
5,0,AdaBoost (Real),0,0.55,0.2968253968253968,0.17844094351531697,53.22091579437256,0.17844094351531697
6,0,Logistic Regression (Penalty = L2),0,0.55,0.5285714285714286,0.10351496065173324,0.42702603340148926,0.0
7,0,Naive Bayes,0,0.55,0.526984126984127,0.12020129197607936,0.15082359313964844,0.0
8,0,KNeighbors Classifier,1,0.55,0.43720190779014306,0.09094502156965134,0.2550487518310547,0.09094502156965134
9,0,SVC Classifier,1,0.55,0.5294117647058824,1.0,1.0052993297576904,0.0
10,0,Decision Tree,1,0.55,0.3640699523052464,0.10677721642764854,0.07596802711486816,0.10677721642764854
11,0,RandomForest,1,0.55,0.5294117647058824,1.0,0.5306727886199951,0.0
12,0,AdaBoost (Discrete),1,0.55,0.3036565977742448,0.19978402073251275,37.394047021865845,0.19978402073251275
13,0,AdaBoost (Real),1,0.55,0.26391096979332274,0.1797109173249774,58.712724924087524,0.1797109173249774
14,0,Logistic Regression (Penalty = L2),1,0.55,0.5310015898251192,0.17079983833932866,0.5045106410980225,0.0
15,0,Naive Bayes,1,0.55,0.4419713831478537,0.19361212912107154,0.1589033603668213,0.0
16,0,KNeighbors Classifier,2,0.55,0.4840255591054313,0.08600942456088496,0.3996155261993408,0.08600942456088496
17,0,SVC Classifier,2,0.55,0.5319488817891374,1.0,1.061070442199707,0.0
18,0,Decision Tree,2,0.55,0.38498402555910544,0.13632155703138063,0.08040833473205566,0.13632155703138063
19,0,RandomForest,2,0.55,0.5319488817891374,1.0,0.746243953704834,0.0
20,0,AdaBoost (Discrete),2,0.55,0.29233226837060705,0.20443978152456865,41.00586414337158,0.20443978152456865
21,0,AdaBoost (Real),2,0.55,0.21405750798722045,0.18120869272802625,64.50719547271729,0.18120869272802625
22,0,Logistic Regression (Penalty = L2),2,0.55,0.5159744408945687,0.09979611942479258,0.5342986583709717,0.0
23,0,Naive Bayes,2,0.55,0.4776357827476038,0.19132192719779761,0.19852399826049805,0.0
24,1,KNeighbors Classifier,0,0.55,0.49047619047619045,0.09814801552414514,0.4703245162963867,0.0
25,1,SVC Classifier,0,0.55,0.5301587301587302,1.0,1.1095972061157227,0.0
26,1,Decision Tree,0,0.55,0.3984126984126984,0.11053715303737878,0.09103155136108398,0.11053715303737878
27,1,RandomForest,0,0.55,0.5301587301587302,1.0,0.7441000938415527,0.0
28,1,AdaBoost (Discrete),0,0.55,0.326984126984127,0.15171470235758724,49.37688732147217,0.15171470235758724
29,1,AdaBoost (Real),0,0.55,0.28253968253968254,0.1575450048724006,67.42598605155945,0.1575450048724006
30,1,Logistic Regression (Penalty = L2),0,0.55,0.5317460317460317,0.16970012644120452,0.5059456825256348,0.0
31,1,Naive Bayes,0,0.55,0.5380952380952381,0.14120528804106705,0.20844435691833496,0.0
32,1,KNeighbors Classifier,1,0.55,0.46740858505564387,0.12040125926461484,0.39408326148986816,0.12040125926461484
33,1,SVC Classifier,1,0.55,0.5294117647058824,1.0,1.3053312301635742,0.0
34,1,Decision Tree,1,0.55,0.3497615262321145,0.2054751182306178,0.10046553611755371,0.2054751182306178
35,1,RandomForest,1,0.55,0.5294117647058824,1.0,0.8078432083129883,0.0
36,1,AdaBoost (Discrete),1,0.55,0.32114467408585057,0.19230697901247995,56.89390969276428,0.19230697901247995
37,1,AdaBoost (Real),1,0.55,0.3386327503974563,0.1659612633339417,77.74716520309448,0.1659612633339417
38,1,Logistic Regression (Penalty = L2),1,0.55,0.5246422893481717,0.14244698370165873,0.46259069442749023,0.0
39,1,Naive Bayes,1,0.55,0.41812400635930047,0.17662670675948988,0.22234487533569336,0.0
40,1,KNeighbors Classifier,2,0.55,0.48083067092651754,0.11231648574476333,0.4441351890563965,0.0
41,1,SVC Classifier,2,0.55,0.5319488817891374,1.0,1.5505173206329346,0.0
42,1,Decision Tree,2,0.55,0.3610223642172524,0.15116462461281524,0.112579345703125,0.15116462461281524
43,1,RandomForest,2,0.55,0.5319488817891374,1.0,0.8049502372741699,0.0
44,1,AdaBoost (Discrete),2,0.55,0.3258785942492013,0.17631708510769867,59.036054611206055,0.0
45,1,AdaBoost (Real),2,0.55,0.28594249201277955,0.16249947823328806,77.89467072486877,0.16249947823328806
46,1,Logistic Regression (Penalty = L2),2,0.55,0.5271565495207667,0.14816767391092958,0.6868789196014404,0.0
47,1,Naive Bayes,2,0.55,0.4680511182108626,0.20994235938314315,0.22280526161193848,0.0
48,2,KNeighbors Classifier,0,0.55,0.5015873015873016,0.08018068713524311,0.34195995330810547,0.0
49,2,SVC Classifier,0,0.55,0.5301587301587302,1.0,1.5660243034362793,0.0
50,2,Decision Tree,0,0.55,0.4015873015873016,0.09055463014111713,0.1123800277709961,0.09055463014111713
51,2,RandomForest,0,0.55,0.5301587301587302,1.0,0.8266096115112305,0.0
52,2,AdaBoost (Discrete),0,0.55,0.34444444444444444,0.11458112157164967,50.99585700035095,0.11458112157164967
53,2,AdaBoost (Real),0,0.55,0.2904761904761905,0.16172231049516525,74.3935477733612,0.16172231049516525
54,2,Logistic Regression (Penalty = L2),0,0.55,0.5349206349206349,0.09248777010966343,0.5998985767364502,0.0
55,2,Naive Bayes,0,0.55,0.5333333333333333,0.1251816566042316,0.21017932891845703,0.0
56,2,KNeighbors Classifier,1,0.55,0.4451510333863275,0.10087657262567382,0.4275829792022705,0.0
57,2,SVC Classifier,1,0.55,0.5294117647058824,1.0,1.3256535530090332,0.0
58,2,Decision Tree,1,0.55,0.32432432432432434,0.1350509769348432,0.11546826362609863,0.1350509769348432
59,2,RandomForest,1,0.55,0.5294117647058824,1.0,0.8578131198883057,0.0
60,2,AdaBoost (Discrete),1,0.55,0.29252782193958665,0.15008896947678302,54.70592713356018,0.0
61,2,AdaBoost (Real),1,0.55,0.3179650238473768,0.18666882524465528,79.9864661693573,0.0
62,2,Logistic Regression (Penalty = L2),1,0.55,0.5214626391096979,0.1471350645741948,0.6089386940002441,0.0
63,2,Naive Bayes,1,0.55,0.42289348171701113,0.3131957996149019,0.22771668434143066,0.0
64,2,KNeighbors Classifier,2,0.55,0.46325878594249204,0.12078038946023853,0.6385784149169922,0.12078038946023853
65,2,SVC Classifier,2,0.55,0.5319488817891374,1.0,1.8960986137390137,0.0
66,2,Decision Tree,2,0.55,0.3769968051118211,0.15500085394238844,0.13278460502624512,0.15500085394238844
67,2,RandomForest,2,0.55,0.5319488817891374,1.0,1.0906176567077637,0.0
68,2,AdaBoost (Discrete),2,0.55,0.3306709265175719,0.23044449595505706,64.07236671447754,0.0
69,2,AdaBoost (Real),2,0.55,0.2971246006389776,0.148912054473459,90.14905714988708,0.148912054473459
70,2,Logistic Regression (Penalty = L2),2,0.55,0.5143769968051118,0.14344111592277348,0.636826753616333,0.0
71,2,Naive Bayes,2,0.55,0.4472843450479233,0.17445559019069118,0.2545955181121826,0.0
72,3,KNeighbors Classifier,0,0.55,0.47619047619047616,0.11302515955266824,0.3843722343444824,0.0
73,3,SVC Classifier,0,0.55,0.5301587301587302,1.0,1.458132028579712,0.0
74,3,Decision Tree,0,0.55,0.38095238095238093,0.10208659904262653,0.12815475463867188,0.10208659904262653
75,3,RandomForest,0,0.55,0.5301587301587302,1.0,1.028141975402832,0.0
76,3,AdaBoost (Discrete),0,0.55,0.3126984126984127,0.16020641536971025,59.36421489715576,0.16020641536971025
77,3,AdaBoost (Real),0,0.55,0.2650793650793651,0.16586650272841158,74.6829342842102,0.16586650272841158
78,3,Logistic Regression (Penalty = L2),0,0.55,0.5317460317460317,0.0999959601158343,0.5050017833709717,0.0
79,3,Naive Bayes,0,0.55,0.526984126984127,0.19958154571882178,0.23543953895568848,0.0
80,3,KNeighbors Classifier,1,0.55,0.4483306836248013,0.10303658525930855,0.35636305809020996,0.0
81,3,SVC Classifier,1,0.55,0.5294117647058824,1.0,1.3864786624908447,0.0
82,3,Decision Tree,1,0.55,0.3449920508744038,0.1125090097358697,0.12391161918640137,0.1125090097358697
83,3,RandomForest,1,0.55,0.5294117647058824,1.0,0.9235143661499023,0.0
84,3,AdaBoost (Discrete),1,0.55,0.3052464228934817,0.1766861898495115,57.51458740234375,0.1766861898495115
85,3,AdaBoost (Real),1,0.55,0.24324324324324326,0.1930099560554391,79.27629661560059,0.1930099560554391
86,3,Logistic Regression (Penalty = L2),1,0.55,0.5278219395866455,0.12321247217216007,0.4953739643096924,0.0
87,3,Naive Bayes,1,0.55,0.4546899841017488,0.17708437972955374,0.1296710968017578,0.0
88,3,KNeighbors Classifier,2,0.55,0.4696485623003195,0.14893377646254113,0.3808431625366211,0.0
89,3,SVC Classifier,2,0.55,0.5319488817891374,1.0,1.2817158699035645,0.0
90,3,Decision Tree,2,0.55,0.365814696485623,0.1207506185904292,0.1280345916748047,0.1207506185904292
91,3,RandomForest,2,0.55,0.5319488817891374,1.0,0.8139445781707764,0.0
92,3,AdaBoost (Discrete),2,0.55,0.31789137380191695,0.18232242022615902,61.6677131652832,0.18232242022615902
93,3,AdaBoost (Real),2,0.55,0.2268370607028754,0.18462208693508955,93.29512238502502,0.18462208693508955
94,3,Logistic Regression (Penalty = L2),2,0.55,0.5095846645367412,0.12366359931339786,0.6324517726898193,0.0
95,3,Naive Bayes,2,0.55,0.46645367412140576,0.3969747539656212,0.16446948051452637,0.0
96,4,KNeighbors Classifier,0,0.55,0.5015873015873016,0.06888795096802519,0.31625890731811523,0.0
97,4,SVC Classifier,0,0.55,0.5301587301587302,1.0,1.8497610092163086,0.0
98,4,Decision Tree,0,0.55,0.43174603174603177,0.11015865796176613,0.15511488914489746,0.11015865796176613
99,4,RandomForest,0,0.55,0.5301587301587302,1.0,1.2455291748046875,0.0
100,4,AdaBoost (Discrete),0,0.55,0.32063492063492066,0.13230286712040748,68.56053328514099,0.13230286712040748
101,4,AdaBoost (Real),0,0.55,0.17936507936507937,0.1552362219852329,99.36091732978821,0.1552362219852329
102,4,Logistic Regression (Penalty = L2),0,0.55,0.5365079365079365,0.11652728841900283,0.4039630889892578,0.0
103,4,Naive Bayes,0,0.55,0.5571428571428572,0.12602290411686543,0.14571642875671387,0.0
104,4,KNeighbors Classifier,1,0.55,0.4356120826709062,0.08891344344329288,0.38742947578430176,0.08891344344329288
105,4,SVC Classifier,1,0.55,0.5294117647058824,1.0,1.5510742664337158,0.0
106,4,Decision Tree,1,0.55,0.3465818759936407,0.157071253587936,0.14017701148986816,0.157071253587936
107,4,RandomForest,1,0.55,0.5294117647058824,1.0,0.9804410934448242,0.0
108,4,AdaBoost (Discrete),1,0.55,0.26391096979332274,0.15406773527478565,60.23666977882385,0.15406773527478565
109,4,AdaBoost (Real),1,0.55,0.21462639109697934,0.1627994613031429,66.12425589561462,0.1627994613031429
110,4,Logistic Regression (Penalty = L2),1,0.55,0.5246422893481717,0.15280861716260033,0.17189860343933105,0.0
111,4,Naive Bayes,1,0.55,0.47217806041335453,0.30131371225174275,0.06917476654052734,0.0
112,4,KNeighbors Classifier,2,0.55,0.45686900958466453,0.12927947610807267,0.11466574668884277,0.0
113,4,SVC Classifier,2,0.55,0.5319488817891374,1.0,0.5862364768981934,0.0
114,4,Decision Tree,2,0.55,0.40415335463258784,0.1359655243105958,0.05647611618041992,0.1359655243105958
115,4,RandomForest,2,0.55,0.5319488817891374,1.0,0.23435306549072266,0.0
116,4,AdaBoost (Discrete),2,0.55,0.3450479233226837,0.1330337983736372,48.712061166763306,0.1330337983736372
117,4,AdaBoost (Real),2,0.55,0.17252396166134185,0.11669375165042559,70.24262547492981,0.11669375165042559
118,4,Logistic Regression (Penalty = L2),2,0.55,0.5063897763578274,0.20005636803908003,0.3607170581817627,0.0
119,4,Naive Bayes,2,0.55,0.4776357827476038,0.4178410819506853,0.12195348739624023,0.0
120,5,KNeighbors Classifier,0,0.55,0.5,0.09605219850363537,0.24019169807434082,0.0
121,5,SVC Classifier,0,0.55,0.5301587301587302,1.0,1.1245088577270508,0.0
122,5,Decision Tree,0,0.55,0.4111111111111111,0.1234876082942673,0.18312931060791016,0.0
123,5,RandomForest,0,0.55,0.5301587301587302,1.0,0.9637010097503662,0.0
124,5,AdaBoost (Discrete),0,0.55,0.33650793650793653,0.12942120191921097,62.45864462852478,0.12942120191921097
125,5,AdaBoost (Real),0,0.55,0.1761904761904762,0.1525474846677684,85.7719054222107,0.1525474846677684
126,5,Logistic Regression (Penalty = L2),0,0.55,0.5349206349206349,0.09248777010966343,0.5065805912017822,0.0
127,5,Naive Bayes,0,0.55,0.5523809523809524,0.2510504325052503,0.13342761993408203,0.0
128,5,KNeighbors Classifier,1,0.55,0.45310015898251194,0.10161253628994751,0.391338586807251,0.0
129,5,SVC Classifier,1,0.55,0.5294117647058824,1.0,1.4195551872253418,0.0
130,5,Decision Tree,1,0.55,0.3275039745627981,0.1239048829463579,0.13246917724609375,0.0
131,5,RandomForest,1,0.55,0.5294117647058824,1.0,1.1456151008605957,0.0
132,5,AdaBoost (Discrete),1,0.55,0.2861685214626391,0.15882552214635537,60.83102107048035,0.15882552214635537
133,5,AdaBoost (Real),1,0.55,0.25119236883942764,0.15911292710945465,81.4144914150238,0.15911292710945465
134,5,Logistic Regression (Penalty = L2),1,0.55,0.5182829888712241,0.28273228065769085,0.3658609390258789,0.0
135,5,Naive Bayes,1,0.55,0.46899841017488075,0.22502990263893677,0.12414979934692383,0.0
136,5,KNeighbors Classifier,2,0.55,0.48881789137380194,0.11739668416672636,0.37170910835266113,0.0
137,5,SVC Classifier,2,0.55,0.5319488817891374,1.0,1.3546943664550781,0.0
138,5,Decision Tree,2,0.55,0.3242811501597444,0.09416053291826666,0.20415878295898438,0.09416053291826666
139,5,RandomForest,2,0.55,0.5319488817891374,1.0,1.117522954940796,0.0
140,5,AdaBoost (Discrete),2,0.55,0.2523961661341853,0.1706329800962502,58.87243390083313,0.0
141,5,AdaBoost (Real),2,0.55,0.18210862619808307,0.11621004004926211,83.15075898170471,0.11621004004926211
142,5,Logistic Regression (Penalty = L2),2,0.55,0.5159744408945687,0.2978678960628524,0.5728707313537598,0.0
143,5,Naive Bayes,2,0.55,0.48242811501597443,0.44067116604755097,0.14504432678222656,0.0
144,6,KNeighbors Classifier,0,0.55,0.5063492063492063,0.1889054136354992,0.7221765518188477,0.0
145,6,SVC Classifier,0,0.55,0.5301587301587302,1.0,2.143266201019287,0.0
146,6,Decision Tree,0,0.55,0.4142857142857143,0.14914162536966513,0.14302802085876465,0.14914162536966513
147,6,RandomForest,0,0.55,0.5301587301587302,1.0,1.2869102954864502,0.0
148,6,AdaBoost (Discrete),0,0.55,0.35079365079365077,0.12879200341152225,71.60901927947998,0.12879200341152225
149,6,AdaBoost (Real),0,0.55,0.2777777777777778,0.1612979576703113,91.60166621208191,0.1612979576703113
150,6,Logistic Regression (Penalty = L2),0,0.55,0.5222222222222223,0.1286418787547902,0.5302762985229492,0.0
151,6,Naive Bayes,0,0.55,0.5412698412698412,0.08224510655731794,0.25986266136169434,0.08224510655731794
152,6,KNeighbors Classifier,1,0.55,0.4562798092209857,0.11282432874060584,0.6527714729309082,0.0
153,6,SVC Classifier,1,0.55,0.5294117647058824,1.0,1.586381435394287,0.0
154,6,Decision Tree,1,0.55,0.3481717011128776,0.12736506748322984,0.12441563606262207,0.12736506748322984
155,6,RandomForest,1,0.55,0.5294117647058824,1.0,0.972210168838501,0.0
156,6,AdaBoost (Discrete),1,0.55,0.29252782193958665,0.1998010770617576,68.6159770488739,0.1998010770617576
157,6,AdaBoost (Real),1,0.55,0.2718600953895072,0.2054174107979896,89.77487444877625,0.2054174107979896
158,6,Logistic Regression (Penalty = L2),1,0.55,0.5246422893481717,0.14263767646460104,0.6269810199737549,0.0
159,6,Naive Bayes,1,0.55,0.41971383147853736,0.15349262800880736,0.26632070541381836,0.0
160,6,KNeighbors Classifier,2,0.55,0.5031948881789138,0.10550539938307553,0.6662983894348145,0.0
161,6,SVC Classifier,2,0.55,0.5319488817891374,1.0,1.8933167457580566,0.0
162,6,Decision Tree,2,0.55,0.3722044728434505,0.14969435993952132,0.13227128982543945,0.14969435993952132
163,6,RandomForest,2,0.55,0.5319488817891374,1.0,1.0734105110168457,0.0
164,6,AdaBoost (Discrete),2,0.55,0.3258785942492013,0.19834242472278857,76.60616683959961,0.19834242472278857
165,6,AdaBoost (Real),2,0.55,0.2955271565495208,0.18921178135666866,101.28115892410278,0.18921178135666866
166,6,Logistic Regression (Penalty = L2),2,0.55,0.5255591054313099,0.16523590793636472,0.7502918243408203,0.0
167,6,Naive Bayes,2,0.55,0.46645367412140576,0.17431013617234364,0.3024289608001709,0.0
168,7,KNeighbors Classifier,0,0.55,0.5285714285714286,0.10722384162631719,0.9653940200805664,0.0
169,7,SVC Classifier,0,0.55,0.5301587301587302,1.0,2.4841561317443848,0.0
170,7,Decision Tree,0,0.55,0.3888888888888889,0.14949059223081476,0.1529552936553955,0.14949059223081476
171,7,RandomForest,0,0.55,0.5301587301587302,1.0,1.0745537281036377,0.0
172,7,AdaBoost (Discrete),0,0.55,0.37142857142857144,0.20652164242373433,78.20781755447388,0.0
173,7,AdaBoost (Real),0,0.55,0.3476190476190476,0.1434806670004122,104.9864571094513,0.1434806670004122
174,7,Logistic Regression (Penalty = L2),0,0.55,0.5317460317460317,0.16970012644120452,0.9606399536132812,0.0
175,7,Naive Bayes,0,0.55,0.47619047619047616,0.11775011052441413,0.29030346870422363,0.11775011052441413
176,7,KNeighbors Classifier,1,0.55,0.4626391096979332,0.11448908468096154,1.145599365234375,0.0
177,7,SVC Classifier,1,0.55,0.5294117647058824,1.0,2.015418767929077,0.0
178,7,Decision Tree,1,0.55,0.32273449920508746,0.15213313069657294,0.12075424194335938,0.15213313069657294
179,7,RandomForest,1,0.55,0.5294117647058824,1.0,0.9970777034759521,0.0
180,7,AdaBoost (Discrete),1,0.55,0.32432432432432434,0.18936376822604084,78.03057956695557,0.18936376822604084
181,7,AdaBoost (Real),1,0.55,0.3322734499205087,0.14964342359641458,99.99760961532593,0.14964342359641458
182,7,Logistic Regression (Penalty = L2),1,0.55,0.5325914149443561,0.12717880714189195,0.998751163482666,0.0
183,7,Naive Bayes,1,0.55,0.3640699523052464,0.11786308738748769,0.15865731239318848,0.11786308738748769
184,7,KNeighbors Classifier,2,0.55,0.4984025559105431,0.13303426641269878,1.0083816051483154,0.0
185,7,SVC Classifier,2,0.55,0.5319488817891374,1.0,2.3419289588928223,0.0
186,7,Decision Tree,2,0.55,0.4009584664536741,0.1707298513925515,0.18148326873779297,0.1707298513925515
187,7,RandomForest,2,0.55,0.5319488817891374,1.0,1.155832290649414,0.0
188,7,AdaBoost (Discrete),2,0.55,0.28594249201277955,0.18131896344513534,75.6450526714325,0.18131896344513534
189,7,AdaBoost (Real),2,0.55,0.3083067092651757,0.1437911151784558,89.70326232910156,0.1437911151784558
190,7,Logistic Regression (Penalty = L2),2,0.55,0.5271565495207667,0.10715065628399162,0.8587076663970947,0.0
191,7,Naive Bayes,2,0.55,0.4249201277955272,0.1746145550947078,0.277817964553833,0.1746145550947078
192,8,KNeighbors Classifier,0,0.55,0.5095238095238095,0.05930340509149455,0.25687646865844727,0.0
193,8,SVC Classifier,0,0.55,0.5301587301587302,1.0,1.2735910415649414,0.0
194,8,Decision Tree,0,0.55,0.49047619047619045,0.0792049971891536,0.13144135475158691,0.0792049971891536
195,8,RandomForest,0,0.55,0.5301587301587302,1.0,0.9154717922210693,0.0
196,8,AdaBoost (Discrete),0,0.55,0.32857142857142857,0.11697017116822317,66.06712937355042,0.11697017116822317
197,8,AdaBoost (Real),0,0.55,0.173015873015873,0.17975707479343705,91.68868398666382,0.17975707479343705
198,8,Logistic Regression (Penalty = L2),0,0.55,0.5365079365079365,0.11652728841900283,0.4975917339324951,0.0
199,8,Naive Bayes,0,0.55,0.546031746031746,0.202525979700411,0.254061222076416,0.0
200,8,KNeighbors Classifier,1,0.55,0.45151033386327505,0.08834698812777049,0.2585716247558594,0.0
201,8,SVC Classifier,1,0.55,0.5294117647058824,1.0,1.4119324684143066,0.0
202,8,Decision Tree,1,0.55,0.3640699523052464,0.07713379304314946,0.12300419807434082,0.07713379304314946
203,8,RandomForest,1,0.55,0.5294117647058824,1.0,0.8863174915313721,0.0
204,8,AdaBoost (Discrete),1,0.55,0.2718600953895072,0.12440894737378355,61.639716148376465,0.12440894737378355
205,8,AdaBoost (Real),1,0.55,0.17329093799682035,0.12000763611645829,94.20455813407898,0.12000763611645829
206,8,Logistic Regression (Penalty = L2),1,0.55,0.519872813990461,0.2830440033805743,0.3693876266479492,0.0
207,8,Naive Bayes,1,0.55,0.4785373608903021,0.22003838827206013,0.11673521995544434,0.0
208,8,KNeighbors Classifier,2,0.55,0.4584664536741214,0.09998885818267253,0.24354863166809082,0.0
209,8,SVC Classifier,2,0.55,0.5319488817891374,1.0,1.4224989414215088,0.0
210,8,Decision Tree,2,0.55,0.4233226837060703,0.09643771026562518,0.002315044403076172,0.09643771026562518
211,8,RandomForest,2,0.55,0.5319488817891374,1.0,0.7242498397827148,0.0
212,8,AdaBoost (Discrete),2,0.55,0.2939297124600639,0.1847940355429712,53.56541609764099,0.0
213,8,AdaBoost (Real),2,0.55,0.16134185303514376,0.15218850002965822,67.38654232025146,0.15218850002965822
214,8,Logistic Regression (Penalty = L2),2,0.55,0.5095846645367412,0.19746814804397464,0.30527520179748535,0.0
215,8,Naive Bayes,2,0.55,0.4792332268370607,0.3721361854783635,0.10615658760070801,0.0
