,feat_set_id,classifier,fold_id,feat_th,score,geo_score,exec_t,geo_score_woz
0,0,KNeighbors Classifier,0,0.35,0.8146370725854829,0.8146267279909954,5.486655235290527,0.8146267279909954
1,0,SVC Classifier,0,0.35,0.8524295140971806,0.8461328810111874,9.183314323425293,0.8461328810111874
2,0,Decision Tree,0,0.35,0.7420515896820636,0.74187327510745,0.24153351783752441,0.74187327510745
3,0,RandomForest,0,0.35,0.7798440311937612,0.7716370330522389,0.8841044902801514,0.7716370330522389
4,0,AdaBoost (Discrete),0,0.35,0.8212357528494301,0.8200155025664687,131.64845514297485,0.8200155025664687
5,0,AdaBoost (Real),0,0.35,0.823635272945411,0.8226129696015326,155.84283757209778,0.8226129696015326
6,0,Logistic Regression (Penalty = L2),0,0.35,0.8704259148170366,0.8703096903952123,0.7547924518585205,0.8703096903952123
7,0,Naive Bayes,0,0.35,0.8050389922015597,0.7806519404869253,0.17592597007751465,0.7806519404869253
8,0,KNeighbors Classifier,1,0.35,0.8116376724655069,0.8115625087339956,6.370824575424194,0.8115625087339956
9,0,SVC Classifier,1,0.35,0.8482303539292142,0.8420178208147762,9.784029960632324,0.8420178208147762
10,0,Decision Tree,1,0.35,0.7330533893221356,0.7329752854540089,0.35234498977661133,0.7329752854540089
11,0,RandomForest,1,0.35,0.7732453509298141,0.7605925568433705,0.9639618396759033,0.7605925568433705
12,0,AdaBoost (Discrete),1,0.35,0.8176364727054589,0.8174688023164315,138.50570225715637,0.8174688023164315
13,0,AdaBoost (Real),1,0.35,0.8164367126574685,0.8160825165783147,139.92722725868225,0.8160825165783147
14,0,Logistic Regression (Penalty = L2),1,0.35,0.8614277144571085,0.861218294803445,0.5947589874267578,0.861218294803445
15,0,Naive Bayes,1,0.35,0.7990401919616077,0.7747050090426175,0.11973834037780762,0.7747050090426175
16,0,KNeighbors Classifier,2,0.35,0.8397358943577431,0.8397133828789942,5.143296957015991,0.8397133828789942
17,0,SVC Classifier,2,0.35,0.851140456182473,0.843867603741886,8.022697687149048,0.843867603741886
18,0,Decision Tree,2,0.35,0.7545018007202882,0.7544918701584936,0.28501033782958984,0.7544918701584936
19,0,RandomForest,2,0.35,0.7785114045618248,0.7647675798575039,0.7735259532928467,0.7647675798575039
20,0,AdaBoost (Discrete),2,0.35,0.8379351740696278,0.8353180194709181,125.65737986564636,0.8353180194709181
21,0,AdaBoost (Real),2,0.35,0.8379351740696278,0.8345354263752413,139.89715313911438,0.8345354263752413
22,0,Logistic Regression (Penalty = L2),2,0.35,0.8715486194477791,0.8715077485139634,0.5851876735687256,0.8715077485139634
23,0,Naive Bayes,2,0.35,0.8127250900360145,0.7865348607474745,0.19566750526428223,0.7865348607474745
24,1,KNeighbors Classifier,0,0.35,0.8098380323935213,0.8096648370500885,5.095815658569336,0.8096648370500885
25,1,SVC Classifier,0,0.35,0.8518296340731853,0.8475580070266769,8.810146570205688,0.8475580070266769
26,1,Decision Tree,0,0.35,0.7516496700659868,0.7511159056104157,0.31545138359069824,0.7511159056104157
27,1,RandomForest,0,0.35,0.7918416316736653,0.7839740269574258,0.8172833919525146,0.7839740269574258
28,1,AdaBoost (Discrete),0,0.35,0.8224355128974206,0.8220966061512315,125.85161805152893,0.8220966061512315
29,1,AdaBoost (Real),0,0.35,0.8026394721055788,0.8009375853185245,139.4738368988037,0.8009375853185245
30,1,Logistic Regression (Penalty = L2),0,0.35,0.8650269946010798,0.8649341209357515,0.5425081253051758,0.8649341209357515
31,1,Naive Bayes,0,0.35,0.8134373125374925,0.7923491434042714,0.15186619758605957,0.7923491434042714
32,1,KNeighbors Classifier,1,0.35,0.8020395920815837,0.8020342871980357,5.4468138217926025,0.8020342871980357
33,1,SVC Classifier,1,0.35,0.850629874025195,0.8456532491015164,8.614449262619019,0.8456532491015164
34,1,Decision Tree,1,0.35,0.7390521895620876,0.7388199400636326,0.22887611389160156,0.7388199400636326
35,1,RandomForest,1,0.35,0.770245950809838,0.7561852337741484,0.923133373260498,0.7561852337741484
36,1,AdaBoost (Discrete),1,0.35,0.8200359928014397,0.8190496874275917,125.04722166061401,0.8190496874275917
37,1,AdaBoost (Real),1,0.35,0.8020395920815837,0.8005086733504164,139.22071433067322,0.8005086733504164
38,1,Logistic Regression (Penalty = L2),1,0.35,0.8578284343131374,0.8577320765578997,0.5903215408325195,0.8577320765578997
39,1,Naive Bayes,1,0.35,0.8050389922015597,0.7865094067408122,0.14441800117492676,0.7865094067408122
40,1,KNeighbors Classifier,2,0.35,0.8325330132052821,0.8324336659091077,5.344699859619141,0.8324336659091077
41,1,SVC Classifier,2,0.35,0.8607442977190877,0.8548585503516177,8.45529842376709,0.8548585503516177
42,1,Decision Tree,2,0.35,0.751500600240096,0.7512214680179222,0.23400282859802246,0.7512214680179222
43,1,RandomForest,2,0.35,0.7929171668667467,0.781243601040671,0.8340053558349609,0.781243601040671
44,1,AdaBoost (Discrete),2,0.35,0.8463385354141657,0.8452898413033363,124.17910671234131,0.8452898413033363
45,1,AdaBoost (Real),2,0.35,0.8391356542617047,0.8366740090334678,140.51924085617065,0.8366740090334678
46,1,Logistic Regression (Penalty = L2),2,0.35,0.8745498199279712,0.8745233857204482,0.5606441497802734,0.8745233857204482
47,1,Naive Bayes,2,0.35,0.8157262905162065,0.7933507803666258,0.14266085624694824,0.7933507803666258
48,2,KNeighbors Classifier,0,0.35,0.7588482303539292,0.7581325176093723,6.680502653121948,0.7581325176093723
49,2,SVC Classifier,0,0.35,0.7924415116976604,0.7709539405157901,9.434112787246704,0.7709539405157901
50,2,Decision Tree,0,0.35,0.7114577084583084,0.7108598263621471,0.23072266578674316,0.7108598263621471
51,2,RandomForest,0,0.35,0.73125374925015,0.6871197320208305,0.9088084697723389,0.6871197320208305
52,2,AdaBoost (Discrete),0,0.35,0.7774445110977805,0.7723535008638145,123.53998494148254,0.7723535008638145
53,2,AdaBoost (Real),0,0.35,0.755248950209958,0.7493559184839973,137.05190205574036,0.7493559184839973
54,2,Logistic Regression (Penalty = L2),0,0.35,0.8254349130173965,0.8250445790074089,0.5005011558532715,0.8250445790074089
55,2,Naive Bayes,0,0.35,0.7588482303539292,0.7135679410613602,0.16432523727416992,0.7135679410613602
56,2,KNeighbors Classifier,1,0.35,0.7498500299940012,0.7487701392795972,6.390400409698486,0.7487701392795972
57,2,SVC Classifier,1,0.35,0.7954409118176364,0.7754353987318382,9.158390998840332,0.7754353987318382
58,2,Decision Tree,1,0.35,0.6934613077384523,0.6932746366795653,0.35443115234375,0.6932746366795653
59,2,RandomForest,1,0.35,0.7288542291541692,0.6932679414901619,0.9117565155029297,0.6932679414901619
60,2,AdaBoost (Discrete),1,0.35,0.7408518296340731,0.7330516400194603,117.09352779388428,0.7330516400194603
61,2,AdaBoost (Real),1,0.35,0.74625074985003,0.7391942324354942,132.2567961215973,0.7391942324354942
62,2,Logistic Regression (Penalty = L2),1,0.35,0.823635272945411,0.8230610420202431,0.5246565341949463,0.8230610420202431
63,2,Naive Bayes,1,0.35,0.74625074985003,0.6970951386177604,0.13923406600952148,0.6970951386177604
64,2,KNeighbors Classifier,2,0.35,0.7551020408163265,0.7538187252834363,6.347052574157715,0.7538187252834363
65,2,SVC Classifier,2,0.35,0.7995198079231692,0.7759122681506826,9.039556741714478,0.7759122681506826
66,2,Decision Tree,2,0.35,0.7112845138055222,0.7106888570631767,0.22790050506591797,0.7106888570631767
67,2,RandomForest,2,0.35,0.7394957983193278,0.7007251382698941,0.7597272396087646,0.7007251382698941
68,2,AdaBoost (Discrete),2,0.35,0.7893157262905162,0.7864396918960839,116.99585199356079,0.7864396918960839
69,2,AdaBoost (Real),2,0.35,0.7899159663865546,0.7877180343101179,132.75136518478394,0.7877180343101179
70,2,Logistic Regression (Penalty = L2),2,0.35,0.8151260504201681,0.8143923920669914,0.500563383102417,0.8143923920669914
71,2,Naive Bayes,2,0.35,0.7611044417767107,0.7113877120486947,0.16637206077575684,0.7113877120486947
72,3,KNeighbors Classifier,0,0.35,0.7996400719856028,0.7994389657938937,5.094046354293823,0.7994389657938937
73,3,SVC Classifier,0,0.35,0.8470305938812237,0.8431318183358847,7.832859754562378,0.8431318183358847
74,3,Decision Tree,0,0.35,0.7426514697060588,0.7423638181815267,0.3027615547180176,0.7423638181815267
75,3,RandomForest,0,0.35,0.7858428314337133,0.7778820652640247,0.9114961624145508,0.7778820652640247
76,3,AdaBoost (Discrete),0,0.35,0.8212357528494301,0.820784433860358,119.41165614128113,0.820784433860358
77,3,AdaBoost (Real),0,0.35,0.8128374325134973,0.8112665248578652,134.31683373451233,0.8112665248578652
78,3,Logistic Regression (Penalty = L2),0,0.35,0.8620275944811038,0.8617747501353595,0.5535812377929688,0.8617747501353595
79,3,Naive Bayes,0,0.35,0.8056388722255549,0.785280355447181,0.13127827644348145,0.785280355447181
80,3,KNeighbors Classifier,1,0.35,0.8050389922015597,0.8050624280043732,5.161457300186157,0.8050624280043732
81,3,SVC Classifier,1,0.35,0.8518296340731853,0.8476586055122788,7.830179214477539,0.8476586055122788
82,3,Decision Tree,1,0.35,0.7390521895620876,0.7390683483315847,0.29862117767333984,0.7390683483315847
83,3,RandomForest,1,0.35,0.7648470305938813,0.7556855884003633,0.8870015144348145,0.7556855884003633
84,3,AdaBoost (Discrete),1,0.35,0.8290341931613677,0.8284954632443071,115.84285163879395,0.8284954632443071
85,3,AdaBoost (Real),1,0.35,0.8260347930413917,0.8255432033609013,128.15992879867554,0.8255432033609013
86,3,Logistic Regression (Penalty = L2),1,0.35,0.8542291541691661,0.8540449550887921,0.5531003475189209,0.8540449550887921
87,3,Naive Bayes,1,0.35,0.8032393521295741,0.7842868647857189,0.14809179306030273,0.7842868647857189
88,3,KNeighbors Classifier,2,0.35,0.8205282112845138,0.8204910849702396,4.758971691131592,0.8204910849702396
89,3,SVC Classifier,2,0.35,0.8517406962785115,0.8445325013841017,7.921592712402344,0.8445325013841017
90,3,Decision Tree,2,0.35,0.7214885954381752,0.721454421996364,0.21660614013671875,0.721454421996364
91,3,RandomForest,2,0.35,0.7785114045618248,0.7675382477930746,0.8003756999969482,0.7675382477930746
92,3,AdaBoost (Discrete),2,0.35,0.8475390156062425,0.8459763616982239,114.53412652015686,0.8459763616982239
93,3,AdaBoost (Real),2,0.35,0.8493397358943577,0.8464722442742115,128.01898002624512,0.8464722442742115
94,3,Logistic Regression (Penalty = L2),2,0.35,0.8733493397358943,0.8732185178915036,0.5175044536590576,0.8732185178915036
95,3,Naive Bayes,2,0.35,0.8157262905162065,0.793619375866117,0.13617706298828125,0.793619375866117
96,4,KNeighbors Classifier,0,0.35,0.8158368326334733,0.8157194718432353,4.31328010559082,0.8157194718432353
97,4,SVC Classifier,0,0.35,0.8488302339532093,0.8434997554158359,7.678359508514404,0.8434997554158359
98,4,Decision Tree,0,0.35,0.7534493101379725,0.7534171655429036,0.2121291160583496,0.7534171655429036
99,4,RandomForest,0,0.35,0.7558488302339532,0.7547152813706046,0.7710256576538086,0.7547152813706046
100,4,AdaBoost (Discrete),0,0.35,0.8152369526094781,0.8139204548908179,107.05834698677063,0.8139204548908179
101,4,AdaBoost (Real),0,0.35,0.8170365926814637,0.8146755839843158,114.4791030883789,0.8146755839843158
102,4,Logistic Regression (Penalty = L2),0,0.35,0.8644271145770845,0.8642479241937078,0.5303459167480469,0.8642479241937078
103,4,Naive Bayes,0,0.35,0.8128374325134973,0.7930168762061377,0.12907004356384277,0.7930168762061377
104,4,KNeighbors Classifier,1,0.35,0.7978404319136173,0.7977693432137107,3.7578258514404297,0.7977693432137107
105,4,SVC Classifier,1,0.35,0.8494301139772046,0.8442430543298899,7.039978981018066,0.8442430543298899
106,4,Decision Tree,1,0.35,0.7426514697060588,0.7423057766106892,0.20046353340148926,0.7423057766106892
107,4,RandomForest,1,0.35,0.7498500299940012,0.74877726503497,0.6745650768280029,0.74877726503497
108,4,AdaBoost (Discrete),1,0.35,0.8086382723455309,0.8062345528269369,102.12800526618958,0.8062345528269369
109,4,AdaBoost (Real),1,0.35,0.8044391121775645,0.8016901208762243,115.66723608970642,0.8016901208762243
110,4,Logistic Regression (Penalty = L2),1,0.35,0.8572285542891421,0.8570779534927002,0.49503564834594727,0.8570779534927002
111,4,Naive Bayes,1,0.35,0.8062387522495501,0.7887413450204029,0.15587162971496582,0.7887413450204029
112,4,KNeighbors Classifier,2,0.35,0.8343337334933973,0.8342382060574144,4.036640167236328,0.8342382060574144
113,4,SVC Classifier,2,0.35,0.8553421368547419,0.849082987677921,7.143605947494507,0.849082987677921
114,4,Decision Tree,2,0.35,0.7791116446578632,0.7790838578632207,0.20555567741394043,0.7790838578632207
115,4,RandomForest,2,0.35,0.7719087635054022,0.7620524025409535,0.7469770908355713,0.7620524025409535
116,4,AdaBoost (Discrete),2,0.35,0.8457382953181273,0.8441744844904676,102.3890073299408,0.8441744844904676
117,4,AdaBoost (Real),2,0.35,0.8361344537815126,0.8319555304415315,113.49990344047546,0.8319555304415315
118,4,Logistic Regression (Penalty = L2),2,0.35,0.8727490996398559,0.8726906472297501,0.4683225154876709,0.8726906472297501
119,4,Naive Bayes,2,0.35,0.8199279711884754,0.7975766328532727,0.1438126564025879,0.7975766328532727
120,5,KNeighbors Classifier,0,0.35,0.7774445110977805,0.7771668026801863,1.9803409576416016,0.7771668026801863
121,5,SVC Classifier,0,0.35,0.7918416316736653,0.7690655992442011,6.600795269012451,0.7690655992442011
122,5,Decision Tree,0,0.35,0.7276544691061788,0.7272241209546593,0.19698619842529297,0.7272241209546593
123,5,RandomForest,0,0.35,0.7348530293941212,0.7302846560804024,0.7671327590942383,0.7302846560804024
124,5,AdaBoost (Discrete),0,0.35,0.7504499100179964,0.7441292031746998,78.1269302368164,0.7441292031746998
125,5,AdaBoost (Real),0,0.35,0.7546490701859628,0.7498761198152383,89.03118586540222,0.7498761198152383
126,5,Logistic Regression (Penalty = L2),0,0.35,0.8272345530893821,0.8267584017906177,0.3961658477783203,0.8267584017906177
127,5,Naive Bayes,0,0.35,0.7594481103779244,0.7145786618755212,0.1257309913635254,0.7145786618755212
128,5,KNeighbors Classifier,1,0.35,0.755248950209958,0.7547590105836347,1.8836548328399658,0.7547590105836347
129,5,SVC Classifier,1,0.35,0.7966406718656269,0.7751081968224584,5.989053249359131,0.7751081968224584
130,5,Decision Tree,1,0.35,0.7066586682663467,0.7064959938270607,0.19267511367797852,0.7064959938270607
131,5,RandomForest,1,0.35,0.7276544691061788,0.7241038828946968,0.7149226665496826,0.7241038828946968
132,5,AdaBoost (Discrete),1,0.35,0.7396520695860828,0.7320675009348026,74.92602920532227,0.7320675009348026
133,5,AdaBoost (Real),1,0.35,0.7528494301139772,0.7486792740076755,83.58406281471252,0.7486792740076755
134,5,Logistic Regression (Penalty = L2),1,0.35,0.8320335932813437,0.8315400348398054,0.40279102325439453,0.8315400348398054
135,5,Naive Bayes,1,0.35,0.7450509898020395,0.6955918378782222,0.13512420654296875,0.6955918378782222
136,5,KNeighbors Classifier,2,0.35,0.7821128451380552,0.7817655180402443,1.6863713264465332,0.7817655180402443
137,5,SVC Classifier,2,0.35,0.7995198079231692,0.776622958415859,5.6925435066223145,0.776622958415859
138,5,Decision Tree,2,0.35,0.7406962785114045,0.7392423902952541,0.23713135719299316,0.7392423902952541
139,5,RandomForest,2,0.35,0.7418967587034814,0.717191918807442,0.6095516681671143,0.717191918807442
140,5,AdaBoost (Discrete),2,0.35,0.7665066026410564,0.7586215517435471,71.32640862464905,0.7586215517435471
141,5,AdaBoost (Real),2,0.35,0.7503001200480192,0.740022551335618,87.64209699630737,0.740022551335618
142,5,Logistic Regression (Penalty = L2),2,0.35,0.8175270108043218,0.8169070388789305,0.3880038261413574,0.8169070388789305
143,5,Naive Bayes,2,0.35,0.7605042016806722,0.7120736790706856,0.06682324409484863,0.7120736790706856
144,6,KNeighbors Classifier,0,0.35,0.8122375524895021,0.8121220882462241,3.418405294418335,0.8121220882462241
145,6,SVC Classifier,0,0.35,0.8380323935212958,0.8326812639809859,6.182972431182861,0.8326812639809859
146,6,Decision Tree,0,0.35,0.7336532693461307,0.733328553586651,0.1802234649658203,0.733328553586651
147,6,RandomForest,0,0.35,0.7618476304739052,0.753539896257237,0.6794447898864746,0.753539896257237
148,6,AdaBoost (Discrete),0,0.35,0.823635272945411,0.8230746639882262,88.95918869972229,0.8230746639882262
149,6,AdaBoost (Real),0,0.35,0.8176364727054589,0.8171470947865708,101.60292649269104,0.8171470947865708
150,6,Logistic Regression (Penalty = L2),0,0.35,0.8578284343131374,0.8574178985201238,0.4136769771575928,0.8574178985201238
151,6,Naive Bayes,0,0.35,0.8116376724655069,0.7919952145126761,0.10642862319946289,0.7919952145126761
152,6,KNeighbors Classifier,1,0.35,0.8020395920815837,0.8020440412678164,3.4511990547180176,0.8020440412678164
153,6,SVC Classifier,1,0.35,0.8542291541691661,0.8498968890881134,6.180846452713013,0.8498968890881134
154,6,Decision Tree,1,0.35,0.737252549490102,0.737134166900885,0.23388981819152832,0.737134166900885
155,6,RandomForest,1,0.35,0.758248350329934,0.7446918271742908,0.7213811874389648,0.7446918271742908
156,6,AdaBoost (Discrete),1,0.35,0.8206358728254349,0.8198589390521748,90.80463862419128,0.8198589390521748
157,6,AdaBoost (Real),1,0.35,0.8152369526094781,0.8143624597348497,101.02995085716248,0.8143624597348497
158,6,Logistic Regression (Penalty = L2),1,0.35,0.8548290341931614,0.8546607050894731,0.47287487983703613,0.8546607050894731
159,6,Naive Bayes,1,0.35,0.8068386322735452,0.7888345576076362,0.12049651145935059,0.7888345576076362
160,6,KNeighbors Classifier,2,0.35,0.8301320528211285,0.8301549397571378,3.471362352371216,0.8301549397571378
161,6,SVC Classifier,2,0.35,0.851140456182473,0.845006601106104,6.097010612487793,0.845006601106104
162,6,Decision Tree,2,0.35,0.737094837935174,0.7370748680368483,0.17996954917907715,0.7370748680368483
163,6,RandomForest,2,0.35,0.7719087635054022,0.7641467059312558,0.6038317680358887,0.7641467059312558
164,6,AdaBoost (Discrete),2,0.35,0.843937575030012,0.8421257341420519,93.8604667186737,0.8421257341420519
165,6,AdaBoost (Real),2,0.35,0.8325330132052821,0.8295295010970426,112.39046883583069,0.8295295010970426
166,6,Logistic Regression (Penalty = L2),2,0.35,0.8667466986794717,0.8665769060822528,0.5458552837371826,0.8665769060822528
167,6,Naive Bayes,2,0.35,0.8151260504201681,0.7950162231732848,0.12006807327270508,0.7950162231732848
168,7,KNeighbors Classifier,0,0.35,0.7804439112177565,0.7799398253530816,1.6000149250030518,0.7799398253530816
169,7,SVC Classifier,0,0.35,0.7894421115776845,0.7690555262164034,6.256195068359375,0.7690555262164034
170,7,Decision Tree,0,0.35,0.7204559088182364,0.7200337380181915,0.17301034927368164,0.7200337380181915
171,7,RandomForest,0,0.35,0.7426514697060588,0.7343986790016195,0.7180893421173096,0.7343986790016195
172,7,AdaBoost (Discrete),0,0.35,0.7774445110977805,0.7759710219947793,71.00189590454102,0.7759710219947793
173,7,AdaBoost (Real),0,0.35,0.7126574685062987,0.6970851095945393,75.17057299613953,0.6970851095945393
174,7,Logistic Regression (Penalty = L2),0,0.35,0.8206358728254349,0.8202321095189159,0.355571985244751,0.8202321095189159
175,7,Naive Bayes,0,0.35,0.76124775044991,0.7217464692198658,0.09085869789123535,0.7217464692198658
176,7,KNeighbors Classifier,1,0.35,0.76124775044991,0.7608527200585975,1.2391939163208008,0.7608527200585975
177,7,SVC Classifier,1,0.35,0.7924415116976604,0.7731761838416209,5.230186462402344,0.7731761838416209
178,7,Decision Tree,1,0.35,0.7480503899220156,0.7478289928172791,0.1134190559387207,0.7478289928172791
179,7,RandomForest,1,0.35,0.74625074985003,0.7391649420307925,0.5919046401977539,0.7391649420307925
180,7,AdaBoost (Discrete),1,0.35,0.7180563887222555,0.7104294968670681,63.408254623413086,0.7104294968670681
181,7,AdaBoost (Real),1,0.35,0.7258548290341932,0.7174380550945041,74.69774961471558,0.7174380550945041
182,7,Logistic Regression (Penalty = L2),1,0.35,0.8254349130173965,0.8249217361889559,0.276808500289917,0.8249217361889559
183,7,Naive Bayes,1,0.35,0.755248950209958,0.7159807723398481,0.11034417152404785,0.7159807723398481
184,7,KNeighbors Classifier,2,0.35,0.7749099639855942,0.7744712801632484,1.1931993961334229,0.7744712801632484
185,7,SVC Classifier,2,0.35,0.7965186074429772,0.7757324639751106,4.720666885375977,0.7757324639751106
186,7,Decision Tree,2,0.35,0.723889555822329,0.7234492799451266,0.15476179122924805,0.7234492799451266
187,7,RandomForest,2,0.35,0.7581032412965186,0.7546947812933534,0.5161933898925781,0.7546947812933534
188,7,AdaBoost (Discrete),2,0.35,0.7683073229291717,0.7614807093930617,64.68466424942017,0.7614807093930617
189,7,AdaBoost (Real),2,0.35,0.7743097238895558,0.7675126838809021,74.47119760513306,0.7675126838809021
190,7,Logistic Regression (Penalty = L2),2,0.35,0.8187274909963985,0.8182665120426683,0.393613338470459,0.8182665120426683
191,7,Naive Bayes,2,0.35,0.7635054021608644,0.7230371890946025,0.11113858222961426,0.7230371890946025
192,8,KNeighbors Classifier,0,0.35,0.8074385122975405,0.8068973708218352,3.3600246906280518,0.8068973708218352
193,8,SVC Classifier,0,0.35,0.847630473905219,0.8448887811444286,6.053388357162476,0.8448887811444286
194,8,Decision Tree,0,0.35,0.7504499100179964,0.7503082694628225,0.23142266273498535,0.7503082694628225
195,8,RandomForest,0,0.35,0.7600479904019196,0.7537792324245195,0.7136290073394775,0.7537792324245195
196,8,AdaBoost (Discrete),0,0.35,0.8200359928014397,0.8191361128399023,85.21848011016846,0.8191361128399023
197,8,AdaBoost (Real),0,0.35,0.826634673065387,0.826400071976636,91.91583132743835,0.826400071976636
198,8,Logistic Regression (Penalty = L2),0,0.35,0.8554289142171566,0.8552945567907243,0.3149268627166748,0.8552945567907243
199,8,Naive Bayes,0,0.35,0.8182363527294542,0.8022236199617422,0.12056326866149902,0.8022236199617422
200,8,KNeighbors Classifier,1,0.35,0.8002399520095981,0.8002817966181155,3.1264281272888184,0.8002817966181155
201,8,SVC Classifier,1,0.35,0.8464307138572286,0.8425260292323843,5.518471956253052,0.8425260292323843
202,8,Decision Tree,1,0.35,0.7246550689862028,0.7246264244814168,0.20166015625,0.7246264244814168
203,8,RandomForest,1,0.35,0.755248950209958,0.7470568249638541,0.6180517673492432,0.7470568249638541
204,8,AdaBoost (Discrete),1,0.35,0.8122375524895021,0.8109875025436855,78.97641944885254,0.8109875025436855
205,8,AdaBoost (Real),1,0.35,0.8260347930413917,0.8251966814159539,88.66200661659241,0.8251966814159539
206,8,Logistic Regression (Penalty = L2),1,0.35,0.8542291541691661,0.8540949836081161,0.3505876064300537,0.8540949836081161
207,8,Naive Bayes,1,0.35,0.8068386322735452,0.7920957680524708,0.10300612449645996,0.7920957680524708
208,8,KNeighbors Classifier,2,0.35,0.8187274909963985,0.8186815093378574,3.0398354530334473,0.8186815093378574
209,8,SVC Classifier,2,0.35,0.8505402160864346,0.8450779809423351,5.42353892326355,0.8450779809423351
210,8,Decision Tree,2,0.35,0.7454981992797118,0.7454985151666127,0.20598506927490234,0.7454985151666127
211,8,RandomForest,2,0.35,0.7677070828331333,0.7610891949788618,0.5322823524475098,0.7610891949788618
212,8,AdaBoost (Discrete),2,0.35,0.843937575030012,0.8432872269400019,79.15466642379761,0.8432872269400019
213,8,AdaBoost (Real),2,0.35,0.8403361344537815,0.8389350144247968,88.94129252433777,0.8389350144247968
214,8,Logistic Regression (Penalty = L2),2,0.35,0.865546218487395,0.8654900618142252,0.30008816719055176,0.8654900618142252
215,8,Naive Bayes,2,0.35,0.8247298919567827,0.8064771762060692,0.09449553489685059,0.8064771762060692
216,9,KNeighbors Classifier,0,0.35,0.7624475104979004,0.7621386481949768,1.1618688106536865,0.7621386481949768
217,9,SVC Classifier,0,0.35,0.7864427114577085,0.7677201941801809,4.72041916847229,0.7677201941801809
218,9,Decision Tree,0,0.35,0.7180563887222555,0.7177983266206056,0.15510344505310059,0.7177983266206056
219,9,RandomForest,0,0.35,0.7540491901619676,0.7444754875731605,0.5244622230529785,0.7444754875731605
220,9,AdaBoost (Discrete),0,0.35,0.7300539892021596,0.722499014936579,53.991153717041016,0.722499014936579
221,9,AdaBoost (Real),0,0.35,0.7246550689862028,0.7141218499018954,60.98874306678772,0.7141218499018954
222,9,Logistic Regression (Penalty = L2),0,0.35,0.8176364727054589,0.8172411152427869,0.25914597511291504,0.8172411152427869
223,9,Naive Bayes,0,0.35,0.758248350329934,0.7208186270133505,0.062445878982543945,0.7208186270133505
224,9,KNeighbors Classifier,1,0.35,0.7534493101379725,0.7530991145639235,1.0070810317993164,0.7530991145639235
225,9,SVC Classifier,1,0.35,0.7858428314337133,0.7682418938110234,4.0703582763671875,0.7682418938110234
226,9,Decision Tree,1,0.35,0.7114577084583084,0.7112919399167933,0.08883833885192871,0.7112919399167933
227,9,RandomForest,1,0.35,0.7420515896820636,0.7358604165067817,0.4843912124633789,0.7358604165067817
228,9,AdaBoost (Discrete),1,0.35,0.7294541091781643,0.7231101451933956,52.87272071838379,0.7231101451933956
229,9,AdaBoost (Real),1,0.35,0.7240551889622076,0.7147960101594697,62.87231230735779,0.7147960101594697
230,9,Logistic Regression (Penalty = L2),1,0.35,0.8158368326334733,0.8151143752077648,0.2854924201965332,0.8151143752077648
231,9,Naive Bayes,1,0.35,0.7510497900419916,0.7107146253314175,0.0906674861907959,0.7107146253314175
232,9,KNeighbors Classifier,2,0.35,0.7575030012004802,0.7569395760672283,1.050426959991455,0.7569395760672283
233,9,SVC Classifier,2,0.35,0.790516206482593,0.7699919961748325,4.1159584522247314,0.7699919961748325
234,9,Decision Tree,2,0.35,0.7040816326530612,0.7033475822214911,0.0899803638458252,0.7033475822214911
235,9,RandomForest,2,0.35,0.7635054021608644,0.7544441008408349,0.4423072338104248,0.7544441008408349
236,9,AdaBoost (Discrete),2,0.35,0.7503001200480192,0.7412396571136145,49.236487865448,0.7412396571136145
237,9,AdaBoost (Real),2,0.35,0.7521008403361344,0.7438933892791436,63.32578897476196,0.7438933892791436
238,9,Logistic Regression (Penalty = L2),2,0.35,0.8109243697478992,0.8105483250408232,0.2955193519592285,0.8105483250408232
239,9,Naive Bayes,2,0.35,0.7599039615846338,0.7176306848072452,0.13917136192321777,0.7176306848072452
240,10,KNeighbors Classifier,0,0.35,0.8062387522495501,0.8062626583232245,3.459629774093628,0.8062626583232245
241,10,SVC Classifier,0,0.35,0.853629274145171,0.8481914381627456,5.1867735385894775,0.8481914381627456
242,10,Decision Tree,0,0.35,0.7516496700659868,0.7515774686957408,0.14524173736572266,0.7515774686957408
243,10,RandomForest,0,0.35,0.7696460707858428,0.7593886888611641,0.5682756900787354,0.7593886888611641
244,10,AdaBoost (Discrete),0,0.35,0.8182363527294542,0.817779587596271,80.94020247459412,0.817779587596271
245,10,AdaBoost (Real),0,0.35,0.8188362327534493,0.8168495272674076,89.72974443435669,0.8168495272674076
246,10,Logistic Regression (Penalty = L2),0,0.35,0.8680263947210558,0.8679857516573588,0.4185640811920166,0.8679857516573588
247,10,Naive Bayes,0,0.35,0.8014397120575885,0.7759297704839295,0.1027228832244873,0.7759297704839295
248,10,KNeighbors Classifier,1,0.35,0.8098380323935213,0.8098556292152138,3.2665324211120605,0.8098556292152138
249,10,SVC Classifier,1,0.35,0.8494301139772046,0.8442430543298899,4.61370325088501,0.8442430543298899
250,10,Decision Tree,1,0.35,0.7450509898020395,0.744936370438301,0.17601871490478516,0.744936370438301
251,10,RandomForest,1,0.35,0.7498500299940012,0.7428847280920847,0.5362553596496582,0.7428847280920847
252,10,AdaBoost (Discrete),1,0.35,0.8272345530893821,0.8265084068500587,72.93582129478455,0.8265084068500587
253,10,AdaBoost (Real),1,0.35,0.8212357528494301,0.8202598791440298,81.64772915840149,0.8202598791440298
254,10,Logistic Regression (Penalty = L2),1,0.35,0.8578284343131374,0.8577727495187314,0.3645815849304199,0.8577727495187314
255,10,Naive Bayes,1,0.35,0.7900419916016796,0.7657654966244413,0.12128496170043945,0.7657654966244413
256,10,KNeighbors Classifier,2,0.35,0.8199279711884754,0.8199004643165088,3.317420244216919,0.8199004643165088
257,10,SVC Classifier,2,0.35,0.858343337334934,0.8515127330433658,5.030738115310669,0.8515127330433658
258,10,Decision Tree,2,0.35,0.7509003601440576,0.7506718173067423,0.16737079620361328,0.7506718173067423
259,10,RandomForest,2,0.35,0.7653061224489796,0.7505460527005388,0.4925532341003418,0.7505460527005388
260,10,AdaBoost (Discrete),2,0.35,0.8505402160864346,0.8491391697519849,76.11024165153503,0.8491391697519849
261,10,AdaBoost (Real),2,0.35,0.8499399759903962,0.8479889529181813,81.10774993896484,0.8479889529181813
262,10,Logistic Regression (Penalty = L2),2,0.35,0.8775510204081632,0.8775668423929505,0.32891273498535156,0.8775668423929505
263,10,Naive Bayes,2,0.35,0.8103241296518607,0.7841662850207156,0.0819101333618164,0.7841662850207156
264,11,KNeighbors Classifier,0,0.35,0.8074385122975405,0.807272921353413,5.887279272079468,0.807272921353413
265,11,SVC Classifier,0,0.35,0.850629874025195,0.8452516711397203,5.929503440856934,0.8452516711397203
266,11,Decision Tree,0,0.35,0.7414517096580684,0.7413850591586292,0.2144157886505127,0.7413850591586292
267,11,RandomForest,0,0.35,0.7624475104979004,0.7572975429263413,0.5277631282806396,0.7572975429263413
268,11,AdaBoost (Discrete),0,0.35,0.8188362327534493,0.8185297654208913,89.87745022773743,0.8185297654208913
269,11,AdaBoost (Real),0,0.35,0.8248350329934013,0.8229806663854772,93.58145713806152,0.8229806663854772
270,11,Logistic Regression (Penalty = L2),0,0.35,0.8698260347930414,0.8697255897564032,0.40062808990478516,0.8697255897564032
271,11,Naive Bayes,0,0.35,0.8002399520095981,0.7749181268719788,0.08605837821960449,0.7749181268719788
272,11,KNeighbors Classifier,1,0.35,0.7990401919616077,0.7989354476201116,5.211310386657715,0.7989354476201116
273,11,SVC Classifier,1,0.35,0.8494301139772046,0.8437806001621206,5.362111806869507,0.8437806001621206
274,11,Decision Tree,1,0.35,0.7222555488902219,0.7218644382034138,0.19927573204040527,0.7218644382034138
275,11,RandomForest,1,0.35,0.7546490701859628,0.7457421976009057,0.503408670425415,0.7457421976009057
276,11,AdaBoost (Discrete),1,0.35,0.8278344331133773,0.8275692698976845,82.1100287437439,0.8275692698976845
277,11,AdaBoost (Real),1,0.35,0.8212357528494301,0.8200634469993668,96.26513028144836,0.8200634469993668
278,11,Logistic Regression (Penalty = L2),1,0.35,0.8644271145770845,0.8643923589549366,0.39508914947509766,0.8643923589549366
279,11,Naive Bayes,1,0.35,0.788242351529694,0.7639039296312091,0.10503911972045898,0.7639039296312091
280,11,KNeighbors Classifier,2,0.35,0.8229291716686674,0.8226878409747252,5.252714157104492,0.8226878409747252
281,11,SVC Classifier,2,0.35,0.8589435774309724,0.8527320502146931,5.344058275222778,0.8527320502146931
282,11,Decision Tree,2,0.35,0.7478991596638656,0.7477187933052618,0.2381129264831543,0.7477187933052618
283,11,RandomForest,2,0.35,0.7647058823529411,0.7543959765758042,0.5184535980224609,0.7543959765758042
284,11,AdaBoost (Discrete),2,0.35,0.8463385354141657,0.8453634451523657,79.03890180587769,0.8453634451523657
285,11,AdaBoost (Real),2,0.35,0.8397358943577431,0.8366409040031596,80.26594567298889,0.8366409040031596
286,11,Logistic Regression (Penalty = L2),2,0.35,0.8763505402160864,0.8763288801008938,0.34708714485168457,0.8763288801008938
287,11,Naive Bayes,2,0.35,0.8091236494597839,0.782784923598228,0.03744697570800781,0.782784923598228
288,12,KNeighbors Classifier,0,0.35,0.7546490701859628,0.7543735625901051,0.6148815155029297,0.7543735625901051
289,12,SVC Classifier,0,0.35,0.7828434313137372,0.7659184975081799,3.244330644607544,0.7659184975081799
290,12,Decision Tree,0,0.35,0.7126574685062987,0.712135560426106,0.10717606544494629,0.712135560426106
291,12,RandomForest,0,0.35,0.755248950209958,0.7371382186580064,0.37366342544555664,0.7371382186580064
292,12,AdaBoost (Discrete),0,0.35,0.7480503899220156,0.7480774967564131,37.53178787231445,0.7480774967564131
293,12,AdaBoost (Real),0,0.35,0.7498500299940012,0.7489776802689737,45.07503938674927,0.7489776802689737
294,12,Logistic Regression (Penalty = L2),0,0.35,0.8080383923215357,0.8078125576602514,0.20625925064086914,0.8078125576602514
295,12,Naive Bayes,0,0.35,0.7600479904019196,0.7283195077370918,0.08553838729858398,0.7283195077370918
296,12,KNeighbors Classifier,1,0.35,0.7516496700659868,0.7511767812927984,0.6067745685577393,0.7511767812927984
297,12,SVC Classifier,1,0.35,0.7828434313137372,0.7665664656944708,3.0898044109344482,0.7665664656944708
298,12,Decision Tree,1,0.35,0.7060587882423516,0.7057268563441866,0.06959652900695801,0.7057268563441866
299,12,RandomForest,1,0.35,0.73125374925015,0.7167981011855203,0.39032721519470215,0.7167981011855203
300,12,AdaBoost (Discrete),1,0.35,0.7306538692261547,0.7224931817354804,37.600584268569946,0.7224931817354804
301,12,AdaBoost (Real),1,0.35,0.7252549490101979,0.7183315099682702,43.595476150512695,0.7183315099682702
302,12,Logistic Regression (Penalty = L2),1,0.35,0.8140371925614877,0.8135527882923294,0.1785752773284912,0.8135527882923294
303,12,Naive Bayes,1,0.35,0.7546490701859628,0.7239755504888443,0.0709996223449707,0.7239755504888443
304,12,KNeighbors Classifier,2,0.35,0.7617046818727491,0.7614693584936139,0.6207656860351562,0.7614693584936139
305,12,SVC Classifier,2,0.35,0.7881152460984394,0.7714313574918791,2.9302539825439453,0.7714313574918791
306,12,Decision Tree,2,0.35,0.7244897959183674,0.7242833523307939,0.10430598258972168,0.7242833523307939
307,12,RandomForest,2,0.35,0.7424969987995198,0.7259118021393463,0.35307812690734863,0.7259118021393463
308,12,AdaBoost (Discrete),2,0.35,0.78031212484994,0.7802804589632838,33.109910011291504,0.7802804589632838
309,12,AdaBoost (Real),2,0.35,0.7599039615846338,0.7555794470489676,42.64375591278076,0.7555794470489676
310,12,Logistic Regression (Penalty = L2),2,0.35,0.8037214885954381,0.8032573727089287,0.3472752571105957,0.8032573727089287
311,12,Naive Bayes,2,0.35,0.765906362545018,0.7322209798428438,0.07160592079162598,0.7322209798428438
