,feat_set_id,classifier,fold_id,feat_th,score,geo_score,exec_t,geo_score_woz
0,0,KNeighbors Classifier,0,0.1,0.02857142857142857,1.0,0.20249104499816895,0.0
1,0,SVC Classifier,0,0.1,0.009523809523809525,1.0,1.500246286392212,0.0
2,0,Decision Tree,0,0.1,0.02857142857142857,1.0,0.10607337951660156,0.0
3,0,RandomForest,0,0.1,0.02857142857142857,1.0,0.7481276988983154,0.0
4,0,AdaBoost (Discrete),0,0.1,0.02857142857142857,1.0,41.291663646698,0.0
5,0,AdaBoost (Real),0,0.1,0.02857142857142857,1.0,86.08666372299194,0.0
6,0,Logistic Regression (Penalty = L2),0,0.1,0.02857142857142857,1.0,0.9162740707397461,0.0
7,0,Naive Bayes,0,0.1,0.02857142857142857,1.0,0.9378271102905273,0.0
8,0,KNeighbors Classifier,1,0.1,0.02830188679245283,1.0,0.17714929580688477,0.0
9,0,SVC Classifier,1,0.1,0.02830188679245283,1.0,0.8503994941711426,0.0
10,0,Decision Tree,1,0.1,0.02830188679245283,1.0,0.0018739700317382812,0.0
11,0,RandomForest,1,0.1,0.02830188679245283,1.0,0.6397039890289307,0.0
12,0,AdaBoost (Discrete),1,0.1,0.02830188679245283,1.0,37.033684730529785,0.0
13,0,AdaBoost (Real),1,0.1,0.02830188679245283,1.0,77.22833752632141,0.0
14,0,Logistic Regression (Penalty = L2),1,0.1,0.02830188679245283,1.0,0.9607148170471191,0.0
15,0,Naive Bayes,1,0.1,0.02830188679245283,1.0,0.8446705341339111,0.0
16,0,KNeighbors Classifier,2,0.1,0.02857142857142857,1.0,0.09657764434814453,0.0
17,0,SVC Classifier,2,0.1,0.009523809523809525,1.0,0.9736266136169434,0.0
18,0,Decision Tree,2,0.1,0.02857142857142857,1.0,0.09775042533874512,0.0
19,0,RandomForest,2,0.1,0.02857142857142857,1.0,0.6716182231903076,0.0
20,0,AdaBoost (Discrete),2,0.1,0.02857142857142857,1.0,37.64812898635864,0.0
21,0,AdaBoost (Real),2,0.1,0.02857142857142857,1.0,76.58092951774597,0.0
22,0,Logistic Regression (Penalty = L2),2,0.1,0.02857142857142857,1.0,0.8955667018890381,0.0
23,0,Naive Bayes,2,0.1,0.02857142857142857,1.0,0.9192290306091309,0.0
24,1,KNeighbors Classifier,0,0.1,1.0,1.0,0.3944108486175537,1.0
25,1,SVC Classifier,0,0.1,0.009523809523809525,1.0,1.2949228286743164,0.0
26,1,Decision Tree,0,0.1,1.0,1.0,0.0033767223358154297,1.0
27,1,RandomForest,0,0.1,0.1523809523809524,1.0,0.7331907749176025,0.0
28,1,AdaBoost (Discrete),0,0.1,0.9333333333333333,1.0,40.436933279037476,0.0
29,1,AdaBoost (Real),0,0.1,0.9714285714285714,1.0,85.19163918495178,0.0
30,1,Logistic Regression (Penalty = L2),0,0.1,0.06666666666666667,1.0,0.9636709690093994,0.0
31,1,Naive Bayes,0,0.1,1.0,1.0,0.791473388671875,1.0
32,1,KNeighbors Classifier,1,0.1,1.0,1.0,0.192734956741333,1.0
33,1,SVC Classifier,1,0.1,1.0,1.0,1.1591591835021973,1.0
34,1,Decision Tree,1,0.1,1.0,1.0,0.09656906127929688,1.0
35,1,RandomForest,1,0.1,0.18867924528301888,1.0,0.745396614074707,0.0
36,1,AdaBoost (Discrete),1,0.1,0.8113207547169812,1.0,41.07711911201477,0.0
37,1,AdaBoost (Real),1,0.1,0.9905660377358491,1.0,79.43125009536743,0.0
38,1,Logistic Regression (Penalty = L2),1,0.1,0.11320754716981132,1.0,1.071035385131836,0.0
39,1,Naive Bayes,1,0.1,1.0,1.0,0.8555989265441895,1.0
40,1,KNeighbors Classifier,2,0.1,1.0,1.0,0.27927184104919434,1.0
41,1,SVC Classifier,2,0.1,0.009523809523809525,1.0,1.034597396850586,0.0
42,1,Decision Tree,2,0.1,1.0,1.0,0.0020475387573242188,1.0
43,1,RandomForest,2,0.1,0.17142857142857143,1.0,0.7691435813903809,0.0
44,1,AdaBoost (Discrete),2,0.1,0.8285714285714286,1.0,41.44590926170349,0.0
45,1,AdaBoost (Real),2,0.1,0.9904761904761905,1.0,79.75004744529724,0.0
46,1,Logistic Regression (Penalty = L2),2,0.1,0.09523809523809523,1.0,1.2472317218780518,0.0
47,1,Naive Bayes,2,0.1,1.0,1.0,0.8621108531951904,1.0
48,2,KNeighbors Classifier,0,0.1,1.0,1.0,0.3870704174041748,1.0
49,2,SVC Classifier,0,0.1,0.009523809523809525,1.0,1.3421149253845215,0.0
50,2,Decision Tree,0,0.1,1.0,1.0,0.11651444435119629,1.0
51,2,RandomForest,0,0.1,0.24761904761904763,1.0,0.6891260147094727,0.0
52,2,AdaBoost (Discrete),0,0.1,0.8,1.0,45.95141315460205,0.0
53,2,AdaBoost (Real),0,0.1,0.8761904761904762,1.0,89.69241619110107,0.0
54,2,Logistic Regression (Penalty = L2),0,0.1,0.5333333333333333,1.0,1.1212213039398193,0.0
55,2,Naive Bayes,0,0.1,1.0,1.0,1.0135524272918701,1.0
56,2,KNeighbors Classifier,1,0.1,1.0,1.0,0.4027073383331299,1.0
57,2,SVC Classifier,1,0.1,1.0,1.0,1.3308234214782715,1.0
58,2,Decision Tree,1,0.1,1.0,1.0,0.10052204132080078,1.0
59,2,RandomForest,1,0.1,0.16981132075471697,1.0,0.7003169059753418,0.0
60,2,AdaBoost (Discrete),1,0.1,0.9245283018867925,1.0,45.076820850372314,0.0
61,2,AdaBoost (Real),1,0.1,0.8867924528301887,1.0,76.71037673950195,0.0
62,2,Logistic Regression (Penalty = L2),1,0.1,0.660377358490566,1.0,1.702064037322998,0.0
63,2,Naive Bayes,1,0.1,1.0,1.0,0.7594084739685059,1.0
64,2,KNeighbors Classifier,2,0.1,1.0,1.0,0.2379457950592041,1.0
65,2,SVC Classifier,2,0.1,0.009523809523809525,1.0,0.8451881408691406,0.0
66,2,Decision Tree,2,0.1,1.0,1.0,0.1885824203491211,1.0
67,2,RandomForest,2,0.1,0.17142857142857143,1.0,0.6862754821777344,0.0
68,2,AdaBoost (Discrete),2,0.1,0.780952380952381,1.0,41.391141414642334,0.0
69,2,AdaBoost (Real),2,0.1,0.9238095238095239,1.0,78.76326155662537,0.0
70,2,Logistic Regression (Penalty = L2),2,0.1,0.6095238095238096,1.0,1.8635668754577637,0.0
71,2,Naive Bayes,2,0.1,1.0,1.0,0.9324533939361572,1.0
72,3,KNeighbors Classifier,0,0.1,0.9047619047619048,1.0,0.3805983066558838,0.0
73,3,SVC Classifier,0,0.1,0.009523809523809525,1.0,1.4028334617614746,0.0
74,3,Decision Tree,0,0.1,0.9047619047619048,1.0,0.09929895401000977,0.0
75,3,RandomForest,0,0.1,0.1523809523809524,1.0,0.4977610111236572,0.0
76,3,AdaBoost (Discrete),0,0.1,0.6571428571428571,1.0,37.823543310165405,0.0
77,3,AdaBoost (Real),0,0.1,0.8952380952380953,1.0,78.5490984916687,0.0
78,3,Logistic Regression (Penalty = L2),0,0.1,0.08571428571428572,1.0,0.799473762512207,0.0
79,3,Naive Bayes,0,0.1,0.9047619047619048,1.0,0.7724723815917969,0.0
80,3,KNeighbors Classifier,1,0.1,0.9056603773584906,1.0,0.28268957138061523,0.0
81,3,SVC Classifier,1,0.1,0.8962264150943396,1.0,1.0827763080596924,0.0
82,3,Decision Tree,1,0.1,0.9056603773584906,1.0,0.002537965774536133,0.0
83,3,RandomForest,1,0.1,0.1792452830188679,1.0,0.6536688804626465,0.0
84,3,AdaBoost (Discrete),1,0.1,0.5943396226415094,1.0,36.58006763458252,0.0
85,3,AdaBoost (Real),1,0.1,0.8867924528301887,1.0,73.63743424415588,0.0
86,3,Logistic Regression (Penalty = L2),1,0.1,0.10377358490566038,1.0,0.8652913570404053,0.0
87,3,Naive Bayes,1,0.1,0.9056603773584906,1.0,0.5822398662567139,0.0
88,3,KNeighbors Classifier,2,0.1,0.9047619047619048,1.0,0.29387950897216797,0.0
89,3,SVC Classifier,2,0.1,0.009523809523809525,1.0,1.15663480758667,0.0
90,3,Decision Tree,2,0.1,0.9047619047619048,1.0,0.09807729721069336,0.0
91,3,RandomForest,2,0.1,0.18095238095238095,1.0,0.6843304634094238,0.0
92,3,AdaBoost (Discrete),2,0.1,0.638095238095238,1.0,37.33333206176758,0.0
93,3,AdaBoost (Real),2,0.1,0.8857142857142857,1.0,74.96784043312073,0.0
94,3,Logistic Regression (Penalty = L2),2,0.1,0.10476190476190476,1.0,1.0101077556610107,0.0
95,3,Naive Bayes,2,0.1,0.9047619047619048,1.0,0.7293636798858643,0.0
96,7,KNeighbors Classifier,0,0.1,1.0,1.0,0.2643260955810547,1.0
97,7,SVC Classifier,0,0.1,0.009523809523809525,1.0,1.287332534790039,0.0
98,7,Decision Tree,0,0.1,1.0,1.0,0.11556577682495117,1.0
99,7,RandomForest,0,0.1,0.1523809523809524,1.0,0.713752031326294,0.0
100,7,AdaBoost (Discrete),0,0.1,0.9904761904761905,1.0,37.52391004562378,0.0
101,7,AdaBoost (Real),0,0.1,1.0,1.0,77.46056151390076,1.0
102,7,Logistic Regression (Penalty = L2),0,0.1,0.06666666666666667,1.0,0.8333733081817627,0.0
103,7,Naive Bayes,0,0.1,1.0,1.0,0.9549002647399902,1.0
104,7,KNeighbors Classifier,1,0.1,1.0,1.0,0.2866027355194092,1.0
105,7,SVC Classifier,1,0.1,1.0,1.0,1.0484790802001953,1.0
106,7,Decision Tree,1,0.1,1.0,1.0,0.09239959716796875,1.0
107,7,RandomForest,1,0.1,0.18867924528301888,1.0,0.5573015213012695,0.0
108,7,AdaBoost (Discrete),1,0.1,0.9528301886792453,1.0,34.540788650512695,0.0
109,7,AdaBoost (Real),1,0.1,1.0,1.0,70.73522567749023,1.0
110,7,Logistic Regression (Penalty = L2),1,0.1,0.11320754716981132,1.0,1.2542827129364014,0.0
111,7,Naive Bayes,1,0.1,1.0,1.0,0.8811626434326172,1.0
112,7,KNeighbors Classifier,2,0.1,1.0,1.0,0.38509559631347656,1.0
113,7,SVC Classifier,2,0.1,0.009523809523809525,1.0,1.0795786380767822,0.0
114,7,Decision Tree,2,0.1,1.0,1.0,0.0913398265838623,1.0
115,7,RandomForest,2,0.1,0.17142857142857143,1.0,0.767188549041748,0.0
116,7,AdaBoost (Discrete),2,0.1,0.9523809523809523,1.0,39.70145058631897,0.0
117,7,AdaBoost (Real),2,0.1,1.0,1.0,74.04435110092163,1.0
118,7,Logistic Regression (Penalty = L2),2,0.1,0.09523809523809523,1.0,0.9431228637695312,0.0
119,7,Naive Bayes,2,0.1,1.0,1.0,0.7894036769866943,1.0
120,10,KNeighbors Classifier,0,0.1,1.0,1.0,0.19732379913330078,1.0
121,10,SVC Classifier,0,0.1,0.009523809523809525,1.0,1.1847238540649414,0.0
122,10,Decision Tree,0,0.1,1.0,1.0,0.09188508987426758,1.0
123,10,RandomForest,0,0.1,0.1523809523809524,1.0,0.7438952922821045,0.0
124,10,AdaBoost (Discrete),0,0.1,0.9714285714285714,1.0,35.4988808631897,0.0
125,10,AdaBoost (Real),0,0.1,0.9714285714285714,1.0,73.7906231880188,0.0
126,10,Logistic Regression (Penalty = L2),0,0.1,0.06666666666666667,1.0,0.7122719287872314,0.0
127,10,Naive Bayes,0,0.1,1.0,1.0,0.8064391613006592,1.0
128,10,KNeighbors Classifier,1,0.1,1.0,1.0,0.2663569450378418,1.0
129,10,SVC Classifier,1,0.1,1.0,1.0,1.00173020362854,1.0
130,10,Decision Tree,1,0.1,1.0,1.0,0.08677268028259277,1.0
131,10,RandomForest,1,0.1,0.18867924528301888,1.0,0.5343060493469238,0.0
132,10,AdaBoost (Discrete),1,0.1,0.8207547169811321,1.0,35.41123938560486,0.0
133,10,AdaBoost (Real),1,0.1,0.9716981132075472,1.0,71.84350657463074,0.0
134,10,Logistic Regression (Penalty = L2),1,0.1,0.11320754716981132,1.0,1.1712684631347656,0.0
135,10,Naive Bayes,1,0.1,1.0,1.0,0.7537684440612793,1.0
136,10,KNeighbors Classifier,2,0.1,1.0,1.0,0.3262302875518799,1.0
137,10,SVC Classifier,2,0.1,0.009523809523809525,1.0,0.975266695022583,0.0
138,10,Decision Tree,2,0.1,1.0,1.0,0.07983970642089844,1.0
139,10,RandomForest,2,0.1,0.17142857142857143,1.0,0.5695505142211914,0.0
140,10,AdaBoost (Discrete),2,0.1,0.9428571428571428,1.0,34.844348192214966,0.0
141,10,AdaBoost (Real),2,0.1,0.9904761904761905,1.0,69.78694319725037,0.0
142,10,Logistic Regression (Penalty = L2),2,0.1,0.09523809523809523,1.0,1.038919448852539,0.0
143,10,Naive Bayes,2,0.1,1.0,1.0,0.7479028701782227,1.0
144,11,KNeighbors Classifier,0,0.1,1.0,1.0,0.33069705963134766,1.0
145,11,SVC Classifier,0,0.1,0.009523809523809525,1.0,1.272141695022583,0.0
146,11,Decision Tree,0,0.1,1.0,1.0,0.0833277702331543,1.0
147,11,RandomForest,0,0.1,0.22857142857142856,1.0,0.5926783084869385,0.0
148,11,AdaBoost (Discrete),0,0.1,0.7238095238095238,1.0,39.90342092514038,0.0
149,11,AdaBoost (Real),0,0.1,0.8761904761904762,1.0,75.3274872303009,0.0
150,11,Logistic Regression (Penalty = L2),0,0.1,0.6857142857142857,1.0,1.2540628910064697,0.0
151,11,Naive Bayes,0,0.1,1.0,1.0,0.9123072624206543,1.0
152,11,KNeighbors Classifier,1,0.1,1.0,1.0,0.2322404384613037,1.0
153,11,SVC Classifier,1,0.1,1.0,1.0,1.077277660369873,1.0
154,11,Decision Tree,1,0.1,1.0,1.0,0.0030422210693359375,1.0
155,11,RandomForest,1,0.1,0.25471698113207547,1.0,0.6343660354614258,0.0
156,11,AdaBoost (Discrete),1,0.1,0.7924528301886793,1.0,37.28321838378906,0.0
157,11,AdaBoost (Real),1,0.1,0.8867924528301887,1.0,56.53300714492798,0.0
158,11,Logistic Regression (Penalty = L2),1,0.1,0.8207547169811321,1.0,1.4985637664794922,0.0
159,11,Naive Bayes,1,0.1,1.0,1.0,0.5106527805328369,1.0
160,11,KNeighbors Classifier,2,0.1,1.0,1.0,0.1573655605316162,1.0
161,11,SVC Classifier,2,0.1,0.009523809523809525,1.0,0.7421948909759521,0.0
162,11,Decision Tree,2,0.1,1.0,1.0,0.002461671829223633,1.0
163,11,RandomForest,2,0.1,0.2,1.0,0.49671339988708496,0.0
164,11,AdaBoost (Discrete),2,0.1,0.9333333333333333,1.0,29.87828540802002,0.0
165,11,AdaBoost (Real),2,0.1,0.9238095238095239,1.0,62.108848094940186,0.0
166,11,Logistic Regression (Penalty = L2),2,0.1,0.780952380952381,1.0,1.6595606803894043,0.0
167,11,Naive Bayes,2,0.1,1.0,1.0,0.713714599609375,1.0
