,feat_set_id,classifier,fold_id,feat_th,score,geo_score,exec_t,geo_score_woz
0,0,KNeighbors Classifier,0,0.6,0.7105719237435009,0.6198191590825773,0.4478483200073242,0.0
1,0,SVC Classifier,0,0.6,0.6845753899480069,0.8129520829107402,0.677027702331543,0.0
2,0,Decision Tree,0,0.6,0.6637781629116117,0.5580921962460009,0.06272053718566895,0.0
3,0,RandomForest,0,0.6,0.7001733102253033,1.0,0.5527853965759277,0.0
4,0,AdaBoost (Discrete),0,0.6,0.729636048526863,0.6300815843286437,31.724133491516113,0.0
5,0,AdaBoost (Real),0,0.6,0.7001733102253033,0.6129198307088415,43.38431358337402,0.0
6,0,Logistic Regression (Penalty = L2),0,0.6,0.6880415944540728,0.7603453162872774,0.395322322845459,0.0
7,0,Naive Bayes,0,0.6,0.6672443674176777,0.7914018355435688,0.0822608470916748,0.0
8,0,KNeighbors Classifier,1,0.6,0.7447916666666666,0.49934001010328316,0.5390274524688721,0.0
9,0,SVC Classifier,1,0.6,0.7274305555555556,0.7636780043269571,0.6136577129364014,0.0
10,0,Decision Tree,1,0.6,0.765625,0.6467513321738131,0.06602764129638672,0.0
11,0,RandomForest,1,0.6,0.6996527777777778,1.0,0.6164240837097168,0.0
12,0,AdaBoost (Discrete),1,0.6,0.7743055555555556,0.47748159228563797,36.736487865448,0.0
13,0,AdaBoost (Real),1,0.6,0.7465277777777778,0.6113398279065594,54.29418921470642,0.0
14,0,Logistic Regression (Penalty = L2),1,0.6,0.7638888888888888,0.5874287808097735,0.4226393699645996,0.0
15,0,Naive Bayes,1,0.6,0.7829861111111112,0.6820345298093242,0.10108184814453125,0.0
16,0,KNeighbors Classifier,2,0.6,0.8539130434782609,0.7080204561161934,0.5940775871276855,0.7080204561161934
17,0,SVC Classifier,2,0.6,0.8208695652173913,0.7556138122418227,0.8280372619628906,0.0
18,0,Decision Tree,2,0.6,0.7808695652173913,0.7109362412389907,0.0830533504486084,0.7109362412389907
19,0,RandomForest,2,0.6,0.7165217391304348,0.6898459005389914,0.6676204204559326,0.0
20,0,AdaBoost (Discrete),2,0.6,0.3982608695652174,0.442189535154294,40.13555073738098,0.442189535154294
21,0,AdaBoost (Real),2,0.6,0.4,0.43363812164082244,54.80144429206848,0.43363812164082244
22,0,Logistic Regression (Penalty = L2),2,0.6,0.5582608695652174,0.4862376070552159,0.41495513916015625,0.4862376070552159
23,0,Naive Bayes,2,0.6,0.5478260869565217,0.8392974277582299,0.10134625434875488,0.0
24,1,KNeighbors Classifier,0,0.6,0.6967071057192374,0.5916516027851242,0.46202898025512695,0.0
25,1,SVC Classifier,0,0.6,0.6845753899480069,0.8129520829107402,0.8712410926818848,0.0
26,1,Decision Tree,0,0.6,0.6152512998266898,0.5183775377196999,0.0020723342895507812,0.0
27,1,RandomForest,0,0.6,0.7001733102253033,1.0,0.5814099311828613,0.0
28,1,AdaBoost (Discrete),0,0.6,0.23743500866551126,0.24436069827658005,43.88465690612793,0.0
29,1,AdaBoost (Real),0,0.6,0.2391681109185442,0.27115004335578646,53.47125840187073,0.0
30,1,Logistic Regression (Penalty = L2),0,0.6,0.6395147313691508,0.6832394989103653,0.4530060291290283,0.0
31,1,Naive Bayes,0,0.6,0.6429809358752167,0.7508927762297288,0.07700014114379883,0.0
32,1,KNeighbors Classifier,1,0.6,0.703125,0.37647612287077614,0.7017245292663574,0.0
33,1,SVC Classifier,1,0.6,0.7274305555555556,0.7636780043269571,0.8417444229125977,0.0
34,1,Decision Tree,1,0.6,0.6597222222222222,0.4896453007306368,0.09893512725830078,0.0
35,1,RandomForest,1,0.6,0.6996527777777778,1.0,0.6688442230224609,0.0
36,1,AdaBoost (Discrete),1,0.6,0.7326388888888888,0.4193686103143949,44.88115406036377,0.0
37,1,AdaBoost (Real),1,0.6,0.3802083333333333,0.4067756055235739,64.37716269493103,0.0
38,1,Logistic Regression (Penalty = L2),1,0.6,0.71875,0.6138900896607005,0.47785377502441406,0.0
39,1,Naive Bayes,1,0.6,0.78125,0.6802396938019404,0.12431931495666504,0.0
40,1,KNeighbors Classifier,2,0.6,0.7513043478260869,0.7033688740374949,0.785881519317627,0.0
41,1,SVC Classifier,2,0.6,0.8434782608695652,0.837206672457254,1.1225175857543945,0.0
42,1,Decision Tree,2,0.6,0.8417391304347827,0.6338592323121077,0.002154111862182617,0.6338592323121077
43,1,RandomForest,2,0.6,0.7008695652173913,1.0,0.8999600410461426,0.0
44,1,AdaBoost (Discrete),2,0.6,0.23130434782608697,0.33336133277347624,53.027462005615234,0.0
45,1,AdaBoost (Real),2,0.6,0.24,0.30436201534141955,64.19100713729858,0.30436201534141955
46,1,Logistic Regression (Penalty = L2),2,0.6,0.6104347826086957,0.4215862361310502,0.432619571685791,0.4215862361310502
47,1,Naive Bayes,2,0.6,0.528695652173913,0.7234770261807716,0.11290121078491211,0.0
48,2,KNeighbors Classifier,0,0.6,0.6568457538994801,0.635797814864237,1.7957851886749268,0.0
49,2,SVC Classifier,0,0.6,0.6845753899480069,0.8129520829107402,1.467252492904663,0.0
50,2,Decision Tree,0,0.6,0.6325823223570191,0.4524081805497754,0.0033388137817382812,0.4524081805497754
51,2,RandomForest,0,0.6,0.7001733102253033,1.0,0.9617729187011719,0.0
52,2,AdaBoost (Discrete),0,0.6,0.7521663778162911,0.6944144468157013,55.630061626434326,0.0
53,2,AdaBoost (Real),0,0.6,0.7383015597920277,0.6306125149226676,68.42328953742981,0.0
54,2,Logistic Regression (Penalty = L2),0,0.6,0.6863084922010398,0.7210131717325844,0.48046422004699707,0.0
55,2,Naive Bayes,0,0.6,0.6672443674176777,0.7914018355435688,0.12586665153503418,0.0
56,2,KNeighbors Classifier,1,0.6,0.6961805555555556,0.3630128918050201,1.7867419719696045,0.0
57,2,SVC Classifier,1,0.6,0.7274305555555556,0.7636780043269571,1.6251888275146484,0.0
58,2,Decision Tree,1,0.6,0.4965277777777778,0.566234312864157,0.1238260269165039,0.0
59,2,RandomForest,1,0.6,0.6996527777777778,1.0,0.8674912452697754,0.0
60,2,AdaBoost (Discrete),1,0.6,0.7517361111111112,0.43129654708987847,61.462767124176025,0.0
61,2,AdaBoost (Real),1,0.6,0.7569444444444444,0.5746095133749713,72.96994352340698,0.0
62,2,Logistic Regression (Penalty = L2),1,0.6,0.7482638888888888,0.6268843050507011,0.45343852043151855,0.0
63,2,Naive Bayes,1,0.6,0.7829861111111112,0.6820345298093242,0.1300973892211914,0.0
64,2,KNeighbors Classifier,2,0.6,0.8330434782608696,0.7552608308349611,1.9325683116912842,0.7552608308349611
65,2,SVC Classifier,2,0.6,0.7356521739130435,0.6012871326420459,1.6763520240783691,0.0
66,2,Decision Tree,2,0.6,0.5930434782608696,0.48551328267446486,0.12733006477355957,0.48551328267446486
67,2,RandomForest,2,0.6,0.7008695652173913,1.0,0.7833235263824463,0.0
68,2,AdaBoost (Discrete),2,0.6,0.36,0.49713216183188524,62.672685861587524,0.49713216183188524
69,2,AdaBoost (Real),2,0.6,0.5095652173913043,0.5866533413844934,76.24325752258301,0.5866533413844934
70,2,Logistic Regression (Penalty = L2),2,0.6,0.6052173913043478,0.52602626583304,0.48000574111938477,0.52602626583304
71,2,Naive Bayes,2,0.6,0.5478260869565217,0.8392974277582299,0.2862706184387207,0.0
72,3,KNeighbors Classifier,0,0.6,0.6967071057192374,0.5916516027851242,0.616278886795044,0.0
73,3,SVC Classifier,0,0.6,0.6845753899480069,0.8129520829107402,1.1947476863861084,0.0
74,3,Decision Tree,0,0.6,0.6360485268630849,0.5498693567355661,0.12296175956726074,0.0
75,3,RandomForest,0,0.6,0.7261698440207972,0.5648671314898963,0.9892635345458984,0.0
76,3,AdaBoost (Discrete),0,0.6,0.23743500866551126,0.24436069827658005,59.515087842941284,0.0
77,3,AdaBoost (Real),0,0.6,0.2218370883882149,0.2649102639566414,72.72885632514954,0.0
78,3,Logistic Regression (Penalty = L2),0,0.6,0.6395147313691508,0.6832394989103653,0.4953944683074951,0.0
79,3,Naive Bayes,0,0.6,0.6429809358752167,0.7508927762297288,0.1486804485321045,0.0
80,3,KNeighbors Classifier,1,0.6,0.7430555555555556,0.4490507916151869,0.8731069564819336,0.0
81,3,SVC Classifier,1,0.6,0.7274305555555556,0.7636780043269571,1.3679563999176025,0.0
82,3,Decision Tree,1,0.6,0.7482638888888888,0.5102328387434264,0.13890290260314941,0.0
83,3,RandomForest,1,0.6,0.6944444444444444,0.3451183851258305,0.9518520832061768,0.0
84,3,AdaBoost (Discrete),1,0.6,0.6163194444444444,0.4387967910771173,61.31681227684021,0.0
85,3,AdaBoost (Real),1,0.6,0.3975694444444444,0.42192333943536187,74.06719732284546,0.0
86,3,Logistic Regression (Penalty = L2),1,0.6,0.71875,0.6138900896607005,0.37598156929016113,0.0
87,3,Naive Bayes,1,0.6,0.78125,0.6802396938019404,0.14376235008239746,0.0
88,3,KNeighbors Classifier,2,0.6,0.7808695652173913,0.6834667707379308,1.0800480842590332,0.0
89,3,SVC Classifier,2,0.6,0.7930434782608695,0.6834487561136172,1.3740887641906738,0.0
90,3,Decision Tree,2,0.6,0.8017391304347826,0.5823566478384888,0.002735614776611328,0.5823566478384888
91,3,RandomForest,2,0.6,0.7182608695652174,0.2795084971874737,0.9466063976287842,0.0
92,3,AdaBoost (Discrete),2,0.6,0.12521739130434784,0.23599415229887397,59.416616439819336,0.23599415229887397
93,3,AdaBoost (Real),2,0.6,0.12,0.22659794822688367,71.65851068496704,0.22659794822688367
94,3,Logistic Regression (Penalty = L2),2,0.6,0.6104347826086957,0.4215862361310502,0.45215845108032227,0.4215862361310502
95,3,Naive Bayes,2,0.6,0.528695652173913,0.7234770261807716,0.13947606086730957,0.0
96,4,KNeighbors Classifier,0,0.6,0.7105719237435009,0.6198191590825773,0.7840409278869629,0.0
97,4,SVC Classifier,0,0.6,0.6845753899480069,0.8129520829107402,1.2201282978057861,0.0
98,4,Decision Tree,0,0.6,0.6845753899480069,0.5871350021982059,0.13507962226867676,0.0
99,4,RandomForest,0,0.6,0.7001733102253033,1.0,0.8275783061981201,0.0
100,4,AdaBoost (Discrete),0,0.6,0.729636048526863,0.6300815843286437,59.87636423110962,0.0
101,4,AdaBoost (Real),0,0.6,0.7001733102253033,0.6071662381530536,70.86050939559937,0.0
102,4,Logistic Regression (Penalty = L2),0,0.6,0.6880415944540728,0.7603453162872774,0.5183022022247314,0.0
103,4,Naive Bayes,0,0.6,0.6672443674176777,0.7914018355435688,0.1410694122314453,0.0
104,4,KNeighbors Classifier,1,0.6,0.7447916666666666,0.49934001010328316,0.9318997859954834,0.0
105,4,SVC Classifier,1,0.6,0.7274305555555556,0.7636780043269571,1.219581127166748,0.0
106,4,Decision Tree,1,0.6,0.7638888888888888,0.5635668734665843,0.0027666091918945312,0.0
107,4,RandomForest,1,0.6,0.6996527777777778,1.0,1.062267541885376,0.0
108,4,AdaBoost (Discrete),1,0.6,0.7743055555555556,0.47748159228563797,59.40095281600952,0.0
109,4,AdaBoost (Real),1,0.6,0.7395833333333334,0.46834093444847047,79.38368320465088,0.0
110,4,Logistic Regression (Penalty = L2),1,0.6,0.7638888888888888,0.5874287808097735,0.6370668411254883,0.0
111,4,Naive Bayes,1,0.6,0.7829861111111112,0.6820345298093242,0.0034263134002685547,0.0
112,4,KNeighbors Classifier,2,0.6,0.8539130434782609,0.7080204561161934,1.1555392742156982,0.7080204561161934
113,4,SVC Classifier,2,0.6,0.8208695652173913,0.7556138122418227,1.1591072082519531,0.0
114,4,Decision Tree,2,0.6,0.8104347826086956,0.6586356880374273,0.14299964904785156,0.6586356880374273
115,4,RandomForest,2,0.6,0.7165217391304348,0.6898459005389914,1.012202501296997,0.0
116,4,AdaBoost (Discrete),2,0.6,0.3982608695652174,0.442189535154294,68.19028353691101,0.442189535154294
117,4,AdaBoost (Real),2,0.6,0.4434782608695652,0.497859387170501,81.77511262893677,0.497859387170501
118,4,Logistic Regression (Penalty = L2),2,0.6,0.5582608695652174,0.4862376070552159,0.6193323135375977,0.4862376070552159
119,4,Naive Bayes,2,0.6,0.5478260869565217,0.8392974277582299,0.13340282440185547,0.0
120,5,KNeighbors Classifier,0,0.6,0.6967071057192374,0.5916516027851242,0.8831925392150879,0.0
121,5,SVC Classifier,0,0.6,0.6845753899480069,0.8129520829107402,1.3312616348266602,0.0
122,5,Decision Tree,0,0.6,0.6152512998266898,0.5183775377196999,0.13037896156311035,0.0
123,5,RandomForest,0,0.6,0.7001733102253033,1.0,1.0902276039123535,0.0
124,5,AdaBoost (Discrete),0,0.6,0.23743500866551126,0.24436069827658005,62.64799618721008,0.0
125,5,AdaBoost (Real),0,0.6,0.2218370883882149,0.2649102639566414,80.95276737213135,0.0
126,5,Logistic Regression (Penalty = L2),0,0.6,0.6395147313691508,0.6832394989103653,0.4403407573699951,0.0
127,5,Naive Bayes,0,0.6,0.6429809358752167,0.7508927762297288,0.13350272178649902,0.0
128,5,KNeighbors Classifier,1,0.6,0.703125,0.37647612287077614,0.8917293548583984,0.0
129,5,SVC Classifier,1,0.6,0.7274305555555556,0.7636780043269571,1.0557091236114502,0.0
130,5,Decision Tree,1,0.6,0.75,0.5245562512028329,0.13097667694091797,0.0
131,5,RandomForest,1,0.6,0.6996527777777778,1.0,1.4901375770568848,0.0
132,5,AdaBoost (Discrete),1,0.6,0.7326388888888888,0.4193686103143949,68.92629790306091,0.0
133,5,AdaBoost (Real),1,0.6,0.3541666666666667,0.3208961626293828,72.22994256019592,0.0
134,5,Logistic Regression (Penalty = L2),1,0.6,0.71875,0.6138900896607005,0.5034873485565186,0.0
135,5,Naive Bayes,1,0.6,0.78125,0.6802396938019404,0.12914228439331055,0.0
136,5,KNeighbors Classifier,2,0.6,0.7513043478260869,0.7033688740374949,0.8827204704284668,0.0
137,5,SVC Classifier,2,0.6,0.8434782608695652,0.837206672457254,1.161529779434204,0.0
138,5,Decision Tree,2,0.6,0.76,0.5079825671873772,0.0018372535705566406,0.5079825671873772
139,5,RandomForest,2,0.6,0.7008695652173913,1.0,1.0269775390625,0.0
140,5,AdaBoost (Discrete),2,0.6,0.23130434782608697,0.33336133277347624,56.67344117164612,0.0
141,5,AdaBoost (Real),2,0.6,0.1826086956521739,0.28772388329732246,70.94749188423157,0.28772388329732246
142,5,Logistic Regression (Penalty = L2),2,0.6,0.6104347826086957,0.4215862361310502,0.3639366626739502,0.4215862361310502
143,5,Naive Bayes,2,0.6,0.528695652173913,0.7234770261807716,0.13330626487731934,0.0
144,6,KNeighbors Classifier,0,0.6,0.6949740034662045,0.6021608628095804,0.7814874649047852,0.0
145,6,SVC Classifier,0,0.6,0.6845753899480069,0.8129520829107402,1.248946189880371,0.0
146,6,Decision Tree,0,0.6,0.6984402079722704,0.6050054859335917,0.11921143531799316,0.0
147,6,RandomForest,0,0.6,0.7001733102253033,1.0,0.9832868576049805,0.0
148,6,AdaBoost (Discrete),0,0.6,0.7001733102253033,0.5929294719876936,57.12637805938721,0.0
149,6,AdaBoost (Real),0,0.6,0.7279029462738301,0.6237343122729011,73.12647676467896,0.0
150,6,Logistic Regression (Penalty = L2),0,0.6,0.6880415944540728,0.7603453162872774,0.45154285430908203,0.0
151,6,Naive Bayes,0,0.6,0.6672443674176777,0.7914018355435688,0.0034341812133789062,0.0
152,6,KNeighbors Classifier,1,0.6,0.6822916666666666,0.3503698034567765,0.9857234954833984,0.0
153,6,SVC Classifier,1,0.6,0.7274305555555556,0.7636780043269571,1.6340937614440918,0.0
154,6,Decision Tree,1,0.6,0.6857638888888888,0.48905285226333517,0.14280223846435547,0.0
155,6,RandomForest,1,0.6,0.6996527777777778,1.0,1.3346123695373535,0.0
156,6,AdaBoost (Discrete),1,0.6,0.7690972222222222,0.47749705176866003,63.475236892700195,0.0
157,6,AdaBoost (Real),1,0.6,0.7482638888888888,0.613700236755791,76.28411412239075,0.0
158,6,Logistic Regression (Penalty = L2),1,0.6,0.7638888888888888,0.5874287808097735,0.5301730632781982,0.0
159,6,Naive Bayes,1,0.6,0.7829861111111112,0.6820345298093242,0.13676166534423828,0.0
160,6,KNeighbors Classifier,2,0.6,0.84,0.7190421634462958,1.0605778694152832,0.7190421634462958
161,6,SVC Classifier,2,0.6,0.8208695652173913,0.7556138122418227,1.5696663856506348,0.0
162,6,Decision Tree,2,0.6,0.6991304347826087,0.5804862441242467,0.002857208251953125,0.5804862441242467
163,6,RandomForest,2,0.6,0.7008695652173913,1.0,0.9215686321258545,0.0
164,6,AdaBoost (Discrete),2,0.6,0.4121739130434783,0.43465343676543317,62.10555911064148,0.43465343676543317
165,6,AdaBoost (Real),2,0.6,0.5008695652173913,0.4833696838263124,73.69296669960022,0.4833696838263124
166,6,Logistic Regression (Penalty = L2),2,0.6,0.5860869565217391,0.49352409507160644,0.7450709342956543,0.49352409507160644
167,6,Naive Bayes,2,0.6,0.5478260869565217,0.8392974277582299,0.13709449768066406,0.0
168,7,KNeighbors Classifier,0,0.6,0.6568457538994801,0.635797814864237,2.144460439682007,0.0
169,7,SVC Classifier,0,0.6,0.6845753899480069,0.8129520829107402,1.731645107269287,0.0
170,7,Decision Tree,0,0.6,0.6880415944540728,0.42779935882138503,0.1313023567199707,0.42779935882138503
171,7,RandomForest,0,0.6,0.7001733102253033,1.0,0.9291069507598877,0.0
172,7,AdaBoost (Discrete),0,0.6,0.7521663778162911,0.6944144468157013,67.69541716575623,0.0
173,7,AdaBoost (Real),0,0.6,0.733102253032929,0.6227431354364964,98.86064505577087,0.0
174,7,Logistic Regression (Penalty = L2),0,0.6,0.6863084922010398,0.7210131717325844,0.9865128993988037,0.0
175,7,Naive Bayes,0,0.6,0.6672443674176777,0.7914018355435688,0.18004703521728516,0.0
176,7,KNeighbors Classifier,1,0.6,0.6961805555555556,0.3630128918050201,2.1733291149139404,0.0
177,7,SVC Classifier,1,0.6,0.7274305555555556,0.7636780043269571,2.603187084197998,0.0
178,7,Decision Tree,1,0.6,0.8107638888888888,0.5283713398002663,0.16475701332092285,0.0
179,7,RandomForest,1,0.6,0.6996527777777778,1.0,1.2520461082458496,0.0
180,7,AdaBoost (Discrete),1,0.6,0.7482638888888888,0.43045169370794734,69.18708443641663,0.0
181,7,AdaBoost (Real),1,0.6,0.7708333333333334,0.5895609442641179,72.7852132320404,0.0
182,7,Logistic Regression (Penalty = L2),1,0.6,0.7482638888888888,0.6268843050507011,0.46247196197509766,0.0
183,7,Naive Bayes,1,0.6,0.7829861111111112,0.6820345298093242,0.22272324562072754,0.0
184,7,KNeighbors Classifier,2,0.6,0.8330434782608696,0.7552608308349611,1.8490097522735596,0.7552608308349611
185,7,SVC Classifier,2,0.6,0.7356521739130435,0.6012871326420459,1.82627534866333,0.0
186,7,Decision Tree,2,0.6,0.5165217391304348,0.49007057220672723,0.003020048141479492,0.0
187,7,RandomForest,2,0.6,0.7008695652173913,1.0,0.9872488975524902,0.0
188,7,AdaBoost (Discrete),2,0.6,0.3652173913043478,0.49979308913426346,65.65975165367126,0.49979308913426346
189,7,AdaBoost (Real),2,0.6,0.5704347826086956,0.5929134378210238,77.4599609375,0.5929134378210238
190,7,Logistic Regression (Penalty = L2),2,0.6,0.6052173913043478,0.52602626583304,0.7026665210723877,0.52602626583304
191,7,Naive Bayes,2,0.6,0.5478260869565217,0.8392974277582299,0.2983067035675049,0.0
192,8,KNeighbors Classifier,0,0.6,0.6967071057192374,0.5916516027851242,0.738004207611084,0.0
193,8,SVC Classifier,0,0.6,0.6845753899480069,0.8129520829107402,1.3832588195800781,0.0
194,8,Decision Tree,0,0.6,0.6152512998266898,0.5183775377196999,0.17413616180419922,0.0
195,8,RandomForest,0,0.6,0.7261698440207972,0.5648671314898963,1.0912744998931885,0.0
196,8,AdaBoost (Discrete),0,0.6,0.23743500866551126,0.24436069827658005,64.00798630714417,0.0
197,8,AdaBoost (Real),0,0.6,0.2218370883882149,0.2649102639566414,78.40104532241821,0.0
198,8,Logistic Regression (Penalty = L2),0,0.6,0.6395147313691508,0.6832394989103653,0.5116472244262695,0.0
199,8,Naive Bayes,0,0.6,0.6429809358752167,0.7508927762297288,0.004256010055541992,0.0
200,8,KNeighbors Classifier,1,0.6,0.7430555555555556,0.4490507916151869,0.9706642627716064,0.0
201,8,SVC Classifier,1,0.6,0.7274305555555556,0.7636780043269571,1.4434022903442383,0.0
202,8,Decision Tree,1,0.6,0.6822916666666666,0.5089501847926317,0.13489627838134766,0.0
203,8,RandomForest,1,0.6,0.6944444444444444,0.3451183851258305,1.1498966217041016,0.0
204,8,AdaBoost (Discrete),1,0.6,0.6145833333333334,0.48328555100451154,63.35980772972107,0.0
205,8,AdaBoost (Real),1,0.6,0.3975694444444444,0.42192333943536187,74.47619771957397,0.0
206,8,Logistic Regression (Penalty = L2),1,0.6,0.71875,0.6138900896607005,0.45696568489074707,0.0
207,8,Naive Bayes,1,0.6,0.78125,0.6802396938019404,0.25672388076782227,0.0
208,8,KNeighbors Classifier,2,0.6,0.7808695652173913,0.6834667707379308,1.0271708965301514,0.0
209,8,SVC Classifier,2,0.6,0.7930434782608695,0.6834487561136172,1.2558715343475342,0.0
210,8,Decision Tree,2,0.6,0.8173913043478261,0.7966641817409684,0.1024472713470459,0.0
211,8,RandomForest,2,0.6,0.7182608695652174,0.2795084971874737,1.040198564529419,0.0
212,8,AdaBoost (Discrete),2,0.6,0.12521739130434784,0.23599415229887397,69.26565051078796,0.23599415229887397
213,8,AdaBoost (Real),2,0.6,0.12521739130434784,0.23599415229887397,75.56924629211426,0.23599415229887397
214,8,Logistic Regression (Penalty = L2),2,0.6,0.6104347826086957,0.4215862361310502,0.6214995384216309,0.4215862361310502
215,8,Naive Bayes,2,0.6,0.528695652173913,0.7234770261807716,0.13268399238586426,0.0
