,feat_set_id,classifier,fold_id,feat_th,score,geo_score,exec_t,geo_score_woz
0,0,KNeighbors Classifier,0,0.2,0.8328358208955224,0.8127958414648405,1.4831480979919434,0.8127958414648405
1,0,SVC Classifier,0,0.2,0.7313432835820896,0.6929852890342743,4.057771444320679,0.6929852890342743
2,0,Decision Tree,0,0.2,0.7074626865671642,0.6926695275770006,0.2723972797393799,0.6926695275770006
3,0,RandomForest,0,0.2,0.591044776119403,0.3103588593520942,1.3463516235351562,0.3103588593520942
4,0,AdaBoost (Discrete),0,0.2,0.764179104477612,0.7454899297131945,182.34208512306213,0.7454899297131945
5,0,AdaBoost (Real),0,0.2,0.5865671641791045,0.436881405944014,236.7626621723175,0.436881405944014
6,0,Logistic Regression (Penalty = L2),0,0.2,0.8044776119402985,0.7894591680047544,2.460780382156372,0.7894591680047544
7,0,Naive Bayes,0,0.2,0.7656716417910447,0.7427988112444956,0.27007365226745605,0.7427988112444956
8,0,KNeighbors Classifier,1,0.2,0.8343283582089552,0.812825322300181,2.1732795238494873,0.812825322300181
9,0,SVC Classifier,1,0.2,0.746268656716418,0.6701920440639353,5.040562868118286,0.6701920440639353
10,0,Decision Tree,1,0.2,0.7223880597014926,0.6998848250345473,0.2843513488769531,0.6998848250345473
11,0,RandomForest,1,0.2,0.5970149253731343,0.5443424305630123,1.4535284042358398,0.0
12,0,AdaBoost (Discrete),1,0.2,0.7731343283582089,0.7570764206760116,194.60617566108704,0.7570764206760116
13,0,AdaBoost (Real),1,0.2,0.5447761194029851,0.49515535731927496,200.3059995174408,0.49515535731927496
14,0,Logistic Regression (Penalty = L2),1,0.2,0.8074626865671641,0.786817543204252,1.5766401290893555,0.786817543204252
15,0,Naive Bayes,1,0.2,0.7850746268656716,0.7567244833000814,0.26106715202331543,0.7567244833000814
16,0,KNeighbors Classifier,2,0.2,0.8303030303030303,0.8043046936343511,1.7865638732910156,0.8043046936343511
17,0,SVC Classifier,2,0.2,0.7757575757575758,0.7480392387515392,4.104566335678101,0.7480392387515392
18,0,Decision Tree,2,0.2,0.7393939393939394,0.7138023347894262,0.2560572624206543,0.7138023347894262
19,0,RandomForest,2,0.2,0.6409090909090909,0.4893486894665654,1.3937253952026367,0.4893486894665654
20,0,AdaBoost (Discrete),2,0.2,0.7439393939393939,0.7208200663997496,190.29074025154114,0.7208200663997496
21,0,AdaBoost (Real),2,0.2,0.7303030303030303,0.6885105809588987,205.12479209899902,0.6885105809588987
22,0,Logistic Regression (Penalty = L2),2,0.2,0.8318181818181818,0.8171139547538647,1.9945895671844482,0.8171139547538647
23,0,Naive Bayes,2,0.2,0.793939393939394,0.7734499155763631,0.27614688873291016,0.7734499155763631
24,1,KNeighbors Classifier,0,0.2,0.8343283582089552,0.8178679184530109,1.4133532047271729,0.8178679184530109
25,1,SVC Classifier,0,0.2,0.7626865671641792,0.7353947045314182,4.074195384979248,0.7353947045314182
26,1,Decision Tree,0,0.2,0.6970149253731344,0.6801555460595301,0.3906993865966797,0.6801555460595301
27,1,RandomForest,0,0.2,0.6,0.5679592185724253,1.2734479904174805,0.0
28,1,AdaBoost (Discrete),0,0.2,0.7656716417910447,0.75413560533255,204.6674723625183,0.75413560533255
29,1,AdaBoost (Real),0,0.2,0.5417910447761194,0.38973849780849573,257.9146502017975,0.38973849780849573
30,1,Logistic Regression (Penalty = L2),0,0.2,0.8,0.7856298925948562,2.2964916229248047,0.7856298925948562
31,1,Naive Bayes,0,0.2,0.7880597014925373,0.7678911421276736,0.29737019538879395,0.7678911421276736
32,1,KNeighbors Classifier,1,0.2,0.8388059701492537,0.815633778231062,2.4236958026885986,0.815633778231062
33,1,SVC Classifier,1,0.2,0.7582089552238805,0.7053662908120618,5.865811109542847,0.7053662908120618
34,1,Decision Tree,1,0.2,0.7283582089552239,0.7092524111645894,0.5135879516601562,0.7092524111645894
35,1,RandomForest,1,0.2,0.5791044776119403,0.5080834778120171,1.8155994415283203,0.0
36,1,AdaBoost (Discrete),1,0.2,0.7597014925373134,0.7382731801484916,229.8774058818817,0.7382731801484916
37,1,AdaBoost (Real),1,0.2,0.5791044776119403,0.48533858699284727,234.25591158866882,0.48533858699284727
38,1,Logistic Regression (Penalty = L2),1,0.2,0.8059701492537313,0.7818925109498536,2.3186466693878174,0.7818925109498536
39,1,Naive Bayes,1,0.2,0.7955223880597015,0.767667622123309,0.3205106258392334,0.767667622123309
40,1,KNeighbors Classifier,2,0.2,0.843939393939394,0.8206077621801657,2.374013662338257,0.8206077621801657
41,1,SVC Classifier,2,0.2,0.803030303030303,0.7825902260506358,6.154444456100464,0.7825902260506358
42,1,Decision Tree,2,0.2,0.7303030303030303,0.7126773495067555,0.33644962310791016,0.7126773495067555
43,1,RandomForest,2,0.2,0.6257575757575757,0.43985281479123,1.5103228092193604,0.43985281479123
44,1,AdaBoost (Discrete),2,0.2,0.7696969696969697,0.7488392156071542,213.53808188438416,0.7488392156071542
45,1,AdaBoost (Real),2,0.2,0.740909090909091,0.7065598232193622,234.61801195144653,0.7065598232193622
46,1,Logistic Regression (Penalty = L2),2,0.2,0.8318181818181818,0.8167514526375973,2.0302155017852783,0.8167514526375973
47,1,Naive Bayes,2,0.2,0.806060606060606,0.7857957017537355,0.32332563400268555,0.7857957017537355
48,2,KNeighbors Classifier,0,0.2,0.8298507462686567,0.8088677821944803,2.104017734527588,0.8088677821944803
49,2,SVC Classifier,0,0.2,0.7313432835820896,0.6755386223686537,5.439656972885132,0.6755386223686537
50,2,Decision Tree,0,0.2,0.7119402985074627,0.6946605249106381,0.3203294277191162,0.6946605249106381
51,2,RandomForest,0,0.2,0.5134328358208955,0.23949390587331187,1.7956469058990479,0.23949390587331187
52,2,AdaBoost (Discrete),0,0.2,0.7402985074626866,0.7243837108022445,214.0601589679718,0.7243837108022445
53,2,AdaBoost (Real),0,0.2,0.5865671641791045,0.436881405944014,223.86004662513733,0.436881405944014
54,2,Logistic Regression (Penalty = L2),0,0.2,0.7805970149253731,0.7591432645716638,2.2740819454193115,0.7591432645716638
55,2,Naive Bayes,0,0.2,0.7597014925373134,0.7339464129762018,0.30009889602661133,0.7339464129762018
56,2,KNeighbors Classifier,1,0.2,0.8194029850746268,0.7876433160857064,2.5045487880706787,0.7876433160857064
57,2,SVC Classifier,1,0.2,0.7477611940298508,0.6866325182324876,4.12689995765686,0.6866325182324876
58,2,Decision Tree,1,0.2,0.6880597014925374,0.6656965003978176,0.30515432357788086,0.6656965003978176
59,2,RandomForest,1,0.2,0.5597014925373134,0.46964444467166044,1.402576208114624,0.0
60,2,AdaBoost (Discrete),1,0.2,0.7417910447761195,0.7294338938606669,176.58580327033997,0.7294338938606669
61,2,AdaBoost (Real),1,0.2,0.5402985074626866,0.39197184596482487,221.86339688301086,0.39197184596482487
62,2,Logistic Regression (Penalty = L2),1,0.2,0.7970149253731343,0.7760823861058181,1.9557485580444336,0.7760823861058181
63,2,Naive Bayes,1,0.2,0.7716417910447761,0.7289213691536346,0.5001471042633057,0.7289213691536346
64,2,KNeighbors Classifier,2,0.2,0.8151515151515152,0.7796466791785985,2.2157552242279053,0.7796466791785985
65,2,SVC Classifier,2,0.2,0.7696969696969697,0.7197328116325459,5.6081225872039795,0.7197328116325459
66,2,Decision Tree,2,0.2,0.7303030303030303,0.7174281527173392,0.34002184867858887,0.7174281527173392
67,2,RandomForest,2,0.2,0.6151515151515151,0.5600730829313207,1.6346852779388428,0.0
68,2,AdaBoost (Discrete),2,0.2,0.7363636363636363,0.695558253742217,200.49063086509705,0.695558253742217
69,2,AdaBoost (Real),2,0.2,0.5333333333333333,0.43479835978528786,202.26901054382324,0.43479835978528786
70,2,Logistic Regression (Penalty = L2),2,0.2,0.8075757575757576,0.7847318679423193,1.5991017818450928,0.7847318679423193
71,2,Naive Bayes,2,0.2,0.7818181818181819,0.7492495533955803,0.2510693073272705,0.7492495533955803
72,3,KNeighbors Classifier,0,0.2,0.835820895522388,0.822390163640286,1.168236255645752,0.822390163640286
73,3,SVC Classifier,0,0.2,0.7388059701492538,0.703405642424125,3.6515471935272217,0.703405642424125
74,3,Decision Tree,0,0.2,0.6776119402985075,0.6584090278253217,0.2845432758331299,0.6584090278253217
75,3,RandomForest,0,0.2,0.6238805970149254,0.4866547199814648,1.270956039428711,0.4866547199814648
76,3,AdaBoost (Discrete),0,0.2,0.744776119402985,0.7240101128543418,176.69738483428955,0.7240101128543418
77,3,AdaBoost (Real),0,0.2,0.5701492537313433,0.48996735285512355,200.83186960220337,0.48996735285512355
78,3,Logistic Regression (Penalty = L2),0,0.2,0.7895522388059701,0.7727922145966494,2.026402235031128,0.7727922145966494
79,3,Naive Bayes,0,0.2,0.7656716417910447,0.7389314383469608,0.33675479888916016,0.7389314383469608
80,3,KNeighbors Classifier,1,0.2,0.835820895522388,0.811367772648004,1.7214720249176025,0.811367772648004
81,3,SVC Classifier,1,0.2,0.746268656716418,0.6830684992109314,4.877796411514282,0.6830684992109314
82,3,Decision Tree,1,0.2,0.7343283582089553,0.7182942597566383,0.3004801273345947,0.7182942597566383
83,3,RandomForest,1,0.2,0.6343283582089553,0.528110717982149,1.4107370376586914,0.528110717982149
84,3,AdaBoost (Discrete),1,0.2,0.7731343283582089,0.7588623502333139,173.47854781150818,0.7588623502333139
85,3,AdaBoost (Real),1,0.2,0.7119402985074627,0.6852901492989198,168.55125093460083,0.6852901492989198
86,3,Logistic Regression (Penalty = L2),1,0.2,0.8074626865671641,0.7885651167606431,1.479552984237671,0.7885651167606431
87,3,Naive Bayes,1,0.2,0.7940298507462686,0.7643438583478288,0.41286706924438477,0.7643438583478288
88,3,KNeighbors Classifier,2,0.2,0.8378787878787879,0.8148554904851915,1.3930935859680176,0.8148554904851915
89,3,SVC Classifier,2,0.2,0.7757575757575758,0.7472597217524363,3.735562324523926,0.7472597217524363
90,3,Decision Tree,2,0.2,0.696969696969697,0.6794252778856483,0.14257311820983887,0.6794252778856483
91,3,RandomForest,2,0.2,0.6530303030303031,0.535964818315924,1.2565371990203857,0.535964818315924
92,3,AdaBoost (Discrete),2,0.2,0.7696969696969697,0.7536108958519269,146.68903636932373,0.7536108958519269
93,3,AdaBoost (Real),2,0.2,0.5727272727272728,0.5131413167339036,171.3622763156891,0.5131413167339036
94,3,Logistic Regression (Penalty = L2),2,0.2,0.8242424242424242,0.8090718560654124,1.8585541248321533,0.8090718560654124
95,3,Naive Bayes,2,0.2,0.793939393939394,0.7727168263181999,0.15531110763549805,0.7727168263181999
96,4,KNeighbors Classifier,0,0.2,0.8223880597014925,0.7985793342082638,1.4480268955230713,0.7985793342082638
97,4,SVC Classifier,0,0.2,0.7268656716417911,0.6671851222161045,4.508718967437744,0.6671851222161045
98,4,Decision Tree,0,0.2,0.7388059701492538,0.7159253621982549,0.32758450508117676,0.7159253621982549
99,4,RandomForest,0,0.2,0.5776119402985075,0.47031497626013485,1.2640721797943115,0.47031497626013485
100,4,AdaBoost (Discrete),0,0.2,0.7417910447761195,0.7268622083695185,169.33654642105103,0.7268622083695185
101,4,AdaBoost (Real),0,0.2,0.5865671641791045,0.436881405944014,186.63821983337402,0.436881405944014
102,4,Logistic Regression (Penalty = L2),0,0.2,0.7805970149253731,0.7630049551513689,1.9173099994659424,0.7630049551513689
103,4,Naive Bayes,0,0.2,0.7582089552238805,0.7355420320348713,0.26035070419311523,0.7355420320348713
104,4,KNeighbors Classifier,1,0.2,0.8313432835820895,0.8069375072536049,1.1197154521942139,0.8069375072536049
105,4,SVC Classifier,1,0.2,0.7402985074626866,0.6570658058237033,3.9769179821014404,0.6570658058237033
106,4,Decision Tree,1,0.2,0.6985074626865672,0.6690201747027139,0.2571394443511963,0.6690201747027139
107,4,RandomForest,1,0.2,0.6149253731343284,0.4995169021482538,1.2502901554107666,0.4995169021482538
108,4,AdaBoost (Discrete),1,0.2,0.7626865671641792,0.7534403754287335,158.45368099212646,0.7534403754287335
109,4,AdaBoost (Real),1,0.2,0.5970149253731343,0.5386126042640701,164.6135573387146,0.5386126042640701
110,4,Logistic Regression (Penalty = L2),1,0.2,0.8014925373134328,0.7803391727098319,1.4928998947143555,0.7803391727098319
111,4,Naive Bayes,1,0.2,0.7791044776119403,0.7423086154639633,0.26092076301574707,0.7423086154639633
112,4,KNeighbors Classifier,2,0.2,0.8348484848484848,0.8023046626982517,1.2076032161712646,0.8023046626982517
113,4,SVC Classifier,2,0.2,0.7545454545454545,0.6450711325683741,3.8410484790802,0.6450711325683741
114,4,Decision Tree,2,0.2,0.7045454545454546,0.6786326742595711,0.27236342430114746,0.6786326742595711
115,4,RandomForest,2,0.2,0.6363636363636364,0.4587157918093563,1.096980333328247,0.4587157918093563
116,4,AdaBoost (Discrete),2,0.2,0.7181818181818181,0.6809672908756608,152.57409691810608,0.6809672908756608
117,4,AdaBoost (Real),2,0.2,0.5712121212121212,0.43569984620504126,1226.7618153095245,0.43569984620504126
118,4,Logistic Regression (Penalty = L2),2,0.2,0.8106060606060606,0.7908153440371768,1.3132860660552979,0.7908153440371768
119,4,Naive Bayes,2,0.2,0.7893939393939394,0.7617703661912629,0.21947550773620605,0.7617703661912629
120,5,KNeighbors Classifier,0,0.2,0.8402985074626865,0.8246357159700117,0.962578535079956,0.8246357159700117
121,5,SVC Classifier,0,0.2,0.744776119402985,0.6768489770335981,3.405776023864746,0.6768489770335981
122,5,Decision Tree,0,0.2,0.7298507462686568,0.708933774391861,0.24057865142822266,0.708933774391861
123,5,RandomForest,0,0.2,0.6597014925373135,0.4821686190879044,1.0313191413879395,0.4821686190879044
124,5,AdaBoost (Discrete),0,0.2,0.744776119402985,0.7323677417896391,111.1506495475769,0.7323677417896391
125,5,AdaBoost (Real),0,0.2,0.5417910447761194,0.4154522216276673,122.71942949295044,0.4154522216276673
126,5,Logistic Regression (Penalty = L2),0,0.2,0.7835820895522388,0.7662392269711468,1.211092233657837,0.7662392269711468
127,5,Naive Bayes,0,0.2,0.755223880597015,0.7311314959279961,0.2237997055053711,0.7311314959279961
128,5,KNeighbors Classifier,1,0.2,0.8313432835820895,0.8061711562663272,0.8970646858215332,0.8061711562663272
129,5,SVC Classifier,1,0.2,0.7373134328358208,0.6580006989432851,3.0981743335723877,0.6580006989432851
130,5,Decision Tree,1,0.2,0.6925373134328359,0.6544619507887667,0.21932625770568848,0.6544619507887667
131,5,RandomForest,1,0.2,0.6313432835820896,0.6634267171418722,0.9046835899353027,0.0
132,5,AdaBoost (Discrete),1,0.2,0.7567164179104477,0.7396810571354653,111.32815909385681,0.7396810571354653
133,5,AdaBoost (Real),1,0.2,0.6791044776119403,0.6454607312948418,130.84503841400146,0.6454607312948418
134,5,Logistic Regression (Penalty = L2),1,0.2,0.7805970149253731,0.7503263389799805,1.1072998046875,0.7503263389799805
135,5,Naive Bayes,1,0.2,0.7716417910447761,0.7240624026366401,0.18508172035217285,0.7240624026366401
136,5,KNeighbors Classifier,2,0.2,0.85,0.8271108668602783,0.8818864822387695,0.8271108668602783
137,5,SVC Classifier,2,0.2,0.7681818181818182,0.6527242519068442,3.07053279876709,0.6527242519068442
138,5,Decision Tree,2,0.2,0.746969696969697,0.7289883359402366,0.2319355010986328,0.7289883359402366
139,5,RandomForest,2,0.2,0.65,0.4729066528637776,1.0438597202301025,0.4729066528637776
140,5,AdaBoost (Discrete),2,0.2,0.753030303030303,0.7314073103805272,110.50613832473755,0.7314073103805272
141,5,AdaBoost (Real),2,0.2,0.6136363636363636,0.5214091257005459,116.77506756782532,0.5214091257005459
142,5,Logistic Regression (Penalty = L2),2,0.2,0.8181818181818182,0.8014242794677898,1.015756368637085,0.8014242794677898
143,5,Naive Bayes,2,0.2,0.796969696969697,0.7689038395125756,0.2691152095794678,0.7689038395125756
144,6,KNeighbors Classifier,0,0.2,0.8462686567164179,0.8298397990005272,1.0919792652130127,0.8298397990005272
145,6,SVC Classifier,0,0.2,0.7432835820895523,0.7102805779573578,2.77305006980896,0.7102805779573578
146,6,Decision Tree,0,0.2,0.7283582089552239,0.7164610328763393,0.1729743480682373,0.7164610328763393
147,6,RandomForest,0,0.2,0.5865671641791045,0.5023332912752232,0.9883224964141846,0.0
148,6,AdaBoost (Discrete),0,0.2,0.7850746268656716,0.7733832882476315,126.22959542274475,0.7733832882476315
149,6,AdaBoost (Real),0,0.2,0.5865671641791045,0.436881405944014,142.30320835113525,0.436881405944014
150,6,Logistic Regression (Penalty = L2),0,0.2,0.7955223880597015,0.7795570884820124,1.2871990203857422,0.7795570884820124
151,6,Naive Bayes,0,0.2,0.7761194029850746,0.7533103249501393,0.20803022384643555,0.7533103249501393
152,6,KNeighbors Classifier,1,0.2,0.8507462686567164,0.8343099246518455,1.2276725769042969,0.8343099246518455
153,6,SVC Classifier,1,0.2,0.7507462686567165,0.6926982057066621,3.466444492340088,0.6926982057066621
154,6,Decision Tree,1,0.2,0.7104477611940299,0.6894625308060337,0.21230506896972656,0.6894625308060337
155,6,RandomForest,1,0.2,0.6179104477611941,0.3624456580392197,0.9755511283874512,0.3624456580392197
156,6,AdaBoost (Discrete),1,0.2,0.7582089552238805,0.74487292310024,126.58965373039246,0.74487292310024
157,6,AdaBoost (Real),1,0.2,0.7283582089552239,0.708802220857278,131.7859148979187,0.708802220857278
158,6,Logistic Regression (Penalty = L2),1,0.2,0.8074626865671641,0.7877604214078878,1.0524117946624756,0.7877604214078878
159,6,Naive Bayes,1,0.2,0.7880597014925373,0.7518602899517957,0.1897733211517334,0.7518602899517957
160,6,KNeighbors Classifier,2,0.2,0.8303030303030303,0.8010944228675958,1.2412216663360596,0.8010944228675958
161,6,SVC Classifier,2,0.2,0.7787878787878788,0.7551113156805319,3.153590440750122,0.7551113156805319
162,6,Decision Tree,2,0.2,0.7151515151515152,0.6801062583033961,0.33240652084350586,0.6801062583033961
163,6,RandomForest,2,0.2,0.6530303030303031,0.5726519488884001,0.8575708866119385,0.5726519488884001
164,6,AdaBoost (Discrete),2,0.2,0.7727272727272727,0.7468134555196072,123.20680475234985,0.7468134555196072
165,6,AdaBoost (Real),2,0.2,0.7196969696969697,0.6841955294546459,122.13614797592163,0.6841955294546459
166,6,Logistic Regression (Penalty = L2),2,0.2,0.8227272727272728,0.8070218750242163,1.202712059020996,0.8070218750242163
167,6,Naive Bayes,2,0.2,0.8015151515151515,0.7788016773739641,0.18057012557983398,0.7788016773739641
168,7,KNeighbors Classifier,0,0.2,0.8194029850746268,0.7939338623782223,1.5436007976531982,0.7939338623782223
169,7,SVC Classifier,0,0.2,0.7492537313432835,0.7185085479862934,3.2308506965637207,0.7185085479862934
170,7,Decision Tree,0,0.2,0.7238805970149254,0.7110804549631374,0.2693321704864502,0.7110804549631374
171,7,RandomForest,0,0.2,0.491044776119403,0.42881672430602835,0.8788661956787109,0.0
172,7,AdaBoost (Discrete),0,0.2,0.7671641791044777,0.7532520563951416,144.6451621055603,0.7532520563951416
173,7,AdaBoost (Real),0,0.2,0.5865671641791045,0.436881405944014,154.62114453315735,0.436881405944014
174,7,Logistic Regression (Penalty = L2),0,0.2,0.8119402985074626,0.7977406897091383,1.3881707191467285,0.7977406897091383
175,7,Naive Bayes,0,0.2,0.7835820895522388,0.7657400449399928,0.1898946762084961,0.7657400449399928
176,7,KNeighbors Classifier,1,0.2,0.8313432835820895,0.8051425977335541,1.9759221076965332,0.8051425977335541
177,7,SVC Classifier,1,0.2,0.764179104477612,0.7086171312841995,3.5370383262634277,0.7086171312841995
178,7,Decision Tree,1,0.2,0.7194029850746269,0.7010056694228403,0.1847836971282959,0.7010056694228403
179,7,RandomForest,1,0.2,0.5044776119402985,0.2742800245905398,0.897479772567749,0.2742800245905398
180,7,AdaBoost (Discrete),1,0.2,0.7835820895522388,0.7689071578341022,135.1749827861786,0.7689071578341022
181,7,AdaBoost (Real),1,0.2,0.6268656716417911,0.5569590868299273,133.84605956077576,0.5569590868299273
182,7,Logistic Regression (Penalty = L2),1,0.2,0.8014925373134328,0.7788267938829029,1.4345364570617676,0.7788267938829029
183,7,Naive Bayes,1,0.2,0.7925373134328358,0.7642666167811826,0.26567816734313965,0.7642666167811826
184,7,KNeighbors Classifier,2,0.2,0.8242424242424242,0.7944303949561399,1.8456664085388184,0.7944303949561399
185,7,SVC Classifier,2,0.2,0.8,0.7812431671224019,3.125366449356079,0.7812431671224019
186,7,Decision Tree,2,0.2,0.7212121212121212,0.7051131224137649,0.18146800994873047,0.7051131224137649
187,7,RandomForest,2,0.2,0.5212121212121212,0.389544647703093,0.8531959056854248,0.389544647703093
188,7,AdaBoost (Discrete),2,0.2,0.7757575757575758,0.7599508722084999,127.41732406616211,0.7599508722084999
189,7,AdaBoost (Real),2,0.2,0.4984848484848485,0.39464034305403184,125.8403217792511,0.0
190,7,Logistic Regression (Penalty = L2),2,0.2,0.8303030303030303,0.8147874606469894,1.0686028003692627,0.8147874606469894
191,7,Naive Bayes,2,0.2,0.7924242424242425,0.7703902332211902,0.14312005043029785,0.7703902332211902
192,8,KNeighbors Classifier,0,0.2,0.8328358208955224,0.8173345892570214,0.5206148624420166,0.8173345892570214
193,8,SVC Classifier,0,0.2,0.7388059701492538,0.6603041789655756,2.2864904403686523,0.6603041789655756
194,8,Decision Tree,0,0.2,0.7074626865671642,0.6852452775960659,0.14354848861694336,0.6852452775960659
195,8,RandomForest,0,0.2,0.6313432835820896,0.5279073119071716,0.6499781608581543,0.5279073119071716
196,8,AdaBoost (Discrete),0,0.2,0.7149253731343284,0.6946246284712693,74.46555519104004,0.6946246284712693
197,8,AdaBoost (Real),0,0.2,0.5417910447761194,0.4154522216276673,84.60173320770264,0.4154522216276673
198,8,Logistic Regression (Penalty = L2),0,0.2,0.7835820895522388,0.7672738202778702,0.7602794170379639,0.7672738202778702
199,8,Naive Bayes,0,0.2,0.755223880597015,0.7329775251059251,0.1522676944732666,0.7329775251059251
200,8,KNeighbors Classifier,1,0.2,0.826865671641791,0.8037656360937465,0.599128246307373,0.8037656360937465
201,8,SVC Classifier,1,0.2,0.7402985074626866,0.6565125961832543,2.2952256202697754,0.6565125961832543
202,8,Decision Tree,1,0.2,0.7313432835820896,0.7158782020433239,0.150862455368042,0.7158782020433239
203,8,RandomForest,1,0.2,0.5149253731343284,0.30671656323405017,0.6806614398956299,0.0
204,8,AdaBoost (Discrete),1,0.2,0.7522388059701492,0.7335035691429979,74.08558297157288,0.7335035691429979
205,8,AdaBoost (Real),1,0.2,0.6567164179104478,0.6192684344918239,82.94522213935852,0.6192684344918239
206,8,Logistic Regression (Penalty = L2),1,0.2,0.7880597014925373,0.7551843412878907,0.7069268226623535,0.7551843412878907
207,8,Naive Bayes,1,0.2,0.7835820895522388,0.744443508932318,0.14703631401062012,0.744443508932318
208,8,KNeighbors Classifier,2,0.2,0.8454545454545455,0.8249946012509658,0.5739188194274902,0.8249946012509658
209,8,SVC Classifier,2,0.2,0.7651515151515151,0.638084999486974,1.9714751243591309,0.638084999486974
210,8,Decision Tree,2,0.2,0.7181818181818181,0.6975526227277868,0.14421749114990234,0.6975526227277868
211,8,RandomForest,2,0.2,0.6515151515151515,0.5487486692535827,0.7265913486480713,0.5487486692535827
212,8,AdaBoost (Discrete),2,0.2,0.7090909090909091,0.6740616168691117,75.11138796806335,0.6740616168691117
213,8,AdaBoost (Real),2,0.2,0.6515151515151515,0.6116528742298852,95.8814070224762,0.6116528742298852
214,8,Logistic Regression (Penalty = L2),2,0.2,0.8212121212121212,0.8055338659931511,0.7856214046478271,0.8055338659931511
215,8,Naive Bayes,2,0.2,0.7984848484848485,0.7764567142673823,0.17488431930541992,0.7764567142673823
