,feat_set_id,classifier,fold_id,feat_th,score,geo_score,exec_t,geo_score_woz
0,0,KNeighbors Classifier,0,0.5,0.8039568345323741,0.8026389367483965,1.1127614974975586,0.8026389367483965
1,0,SVC Classifier,0,0.5,0.8309352517985612,0.8191881017409214,2.5777885913848877,0.8191881017409214
2,0,Decision Tree,0,0.5,0.7314148681055156,0.7295406479065496,0.09776759147644043,0.7295406479065496
3,0,RandomForest,0,0.5,0.7601918465227818,0.7468984526183102,0.3147776126861572,0.7468984526183102
4,0,AdaBoost (Discrete),0,0.5,0.8345323741007195,0.8345474503489779,33.63909697532654,0.8345474503489779
5,0,AdaBoost (Real),0,0.5,0.8219424460431655,0.821467258004523,37.37638020515442,0.821467258004523
6,0,Logistic Regression (Penalty = L2),0,0.5,0.8471223021582733,0.8461159597718011,0.20344901084899902,0.8461159597718011
7,0,Naive Bayes,0,0.5,0.8015587529976019,0.776656109835666,0.07900261878967285,0.776656109835666
8,0,KNeighbors Classifier,1,0.5,0.7911164465786314,0.789975540939499,1.2152979373931885,0.789975540939499
9,0,SVC Classifier,1,0.5,0.8211284513805522,0.8109312788507699,3.8400120735168457,0.8109312788507699
10,0,Decision Tree,1,0.5,0.7503001200480192,0.750326427428477,0.17760848999023438,0.750326427428477
11,0,RandomForest,1,0.5,0.7593037214885955,0.748980383710171,0.5278773307800293,0.748980383710171
12,0,AdaBoost (Discrete),1,0.5,0.8007202881152461,0.8004968968237534,54.816452503204346,0.8004968968237534
13,0,AdaBoost (Real),1,0.5,0.8043217286914766,0.8039488369471502,61.729395389556885,0.8039488369471502
14,0,Logistic Regression (Penalty = L2),1,0.5,0.826530612244898,0.8257248834818331,0.28395509719848633,0.8257248834818331
15,0,Naive Bayes,1,0.5,0.7941176470588235,0.7720591939971231,0.08661890029907227,0.7720591939971231
16,0,KNeighbors Classifier,2,0.5,0.7977190876350541,0.7955518884616546,1.8616080284118652,0.7955518884616546
17,0,SVC Classifier,2,0.5,0.84093637454982,0.8286600887782679,4.171139478683472,0.8286600887782679
18,0,Decision Tree,2,0.5,0.7202881152460985,0.7198732942958563,0.133070707321167,0.7198732942958563
19,0,RandomForest,2,0.5,0.7791116446578632,0.7709181277003279,0.4101383686065674,0.7709181277003279
20,0,AdaBoost (Discrete),2,0.5,0.8199279711884754,0.8198824697730875,47.93152213096619,0.8198824697730875
21,0,AdaBoost (Real),2,0.5,0.8385354141656662,0.8382427806747643,58.05291199684143,0.8382427806747643
22,0,Logistic Regression (Penalty = L2),2,0.5,0.8475390156062425,0.8462410003640267,0.2202157974243164,0.8462410003640267
23,0,Naive Bayes,2,0.5,0.8145258103241296,0.7943995002526728,0.06944823265075684,0.7943995002526728
24,1,KNeighbors Classifier,0,0.5,0.8141486810551559,0.8131078112517545,1.5047266483306885,0.8131078112517545
25,1,SVC Classifier,0,0.5,0.8387290167865707,0.8283810482214513,3.399102210998535,0.8283810482214513
26,1,Decision Tree,0,0.5,0.7488009592326139,0.7472265617692471,0.14332842826843262,0.7472265617692471
27,1,RandomForest,0,0.5,0.7434052757793765,0.732422019877675,0.3958861827850342,0.732422019877675
28,1,AdaBoost (Discrete),0,0.5,0.8333333333333334,0.8331362068202409,49.74490547180176,0.8331362068202409
29,1,AdaBoost (Real),0,0.5,0.8273381294964028,0.8270500541011748,54.9188187122345,0.8270500541011748
30,1,Logistic Regression (Penalty = L2),0,0.5,0.8573141486810552,0.8569746611188512,0.2783968448638916,0.8569746611188512
31,1,Naive Bayes,0,0.5,0.8165467625899281,0.7990368346741458,0.03880047798156738,0.7990368346741458
32,1,KNeighbors Classifier,1,0.5,0.7941176470588235,0.7928152457888443,1.409162998199463,0.7928152457888443
33,1,SVC Classifier,1,0.5,0.8241296518607443,0.815085315027045,3.6734507083892822,0.815085315027045
34,1,Decision Tree,1,0.5,0.7605042016806722,0.7588264978707502,0.15056324005126953,0.7588264978707502
35,1,RandomForest,1,0.5,0.7575030012004802,0.750585483474858,0.39246320724487305,0.750585483474858
36,1,AdaBoost (Discrete),1,0.5,0.8001200480192077,0.7998577208810446,47.619258880615234,0.7998577208810446
37,1,AdaBoost (Real),1,0.5,0.8187274909963985,0.8186192494024656,55.354321002960205,0.8186192494024656
38,1,Logistic Regression (Penalty = L2),1,0.5,0.8355342136854742,0.8349427390611818,0.24753022193908691,0.8349427390611818
39,1,Naive Bayes,1,0.5,0.801920768307323,0.7818263180873417,0.11100625991821289,0.7818263180873417
40,1,KNeighbors Classifier,2,0.5,0.7959183673469388,0.7950805862837225,1.616102933883667,0.7950805862837225
41,1,SVC Classifier,2,0.5,0.8373349339735895,0.8238045534571801,3.5347096920013428,0.8238045534571801
42,1,Decision Tree,2,0.5,0.7310924369747899,0.7309774645731869,0.1421644687652588,0.7309774645731869
43,1,RandomForest,2,0.5,0.7472989195678271,0.7392321475007029,0.43005919456481934,0.7392321475007029
44,1,AdaBoost (Discrete),2,0.5,0.8199279711884754,0.8197167901509534,48.45973014831543,0.8197167901509534
45,1,AdaBoost (Real),2,0.5,0.8145258103241296,0.8126864772689674,56.106292486190796,0.8126864772689674
46,1,Logistic Regression (Penalty = L2),2,0.5,0.8559423769507803,0.8544952560278622,0.20873785018920898,0.8544952560278622
47,1,Naive Bayes,2,0.5,0.8211284513805522,0.8027863673633912,0.032625675201416016,0.8027863673633912
48,2,KNeighbors Classifier,0,0.5,0.7907673860911271,0.7900263278983161,1.623589038848877,0.7900263278983161
49,2,SVC Classifier,0,0.5,0.8165467625899281,0.8039470633486461,3.6766300201416016,0.8039470633486461
50,2,Decision Tree,0,0.5,0.7296163069544365,0.7284333306630612,0.1124727725982666,0.7284333306630612
51,2,RandomForest,0,0.5,0.7589928057553957,0.750122394296047,0.37053728103637695,0.750122394296047
52,2,AdaBoost (Discrete),0,0.5,0.7961630695443646,0.7944915814657949,48.14622116088867,0.7944915814657949
53,2,AdaBoost (Real),0,0.5,0.8105515587529976,0.8100905108138429,69.25116896629333,0.8100905108138429
54,2,Logistic Regression (Penalty = L2),0,0.5,0.8381294964028777,0.8370778710720056,0.6212007999420166,0.8370778710720056
55,2,Naive Bayes,0,0.5,0.8003597122302158,0.7816863199833761,0.10361337661743164,0.7816863199833761
56,2,KNeighbors Classifier,1,0.5,0.7713085234093637,0.7700019828696861,2.3323395252227783,0.7700019828696861
57,2,SVC Classifier,1,0.5,0.8127250900360145,0.8031268821536832,5.479115962982178,0.8031268821536832
58,2,Decision Tree,1,0.5,0.7160864345738295,0.7155923701359979,0.2087869644165039,0.7155923701359979
59,2,RandomForest,1,0.5,0.7406962785114045,0.7287312638507217,0.5868303775787354,0.7287312638507217
60,2,AdaBoost (Discrete),1,0.5,0.7857142857142857,0.7852140245990001,66.12659668922424,0.7852140245990001
61,2,AdaBoost (Real),1,0.5,0.7773109243697479,0.7755574978917024,78.74098753929138,0.7755574978917024
62,2,Logistic Regression (Penalty = L2),1,0.5,0.8163265306122449,0.81553096987758,0.24089336395263672,0.81553096987758
63,2,Naive Bayes,1,0.5,0.8067226890756303,0.7921279548269267,0.13689446449279785,0.7921279548269267
64,2,KNeighbors Classifier,2,0.5,0.7755102040816326,0.7717986089967697,2.2782788276672363,0.7717986089967697
65,2,SVC Classifier,2,0.5,0.8163265306122449,0.8021989459772706,4.94843316078186,0.8021989459772706
66,2,Decision Tree,2,0.5,0.7274909963985594,0.7266880094497598,0.1444859504699707,0.7266880094497598
67,2,RandomForest,2,0.5,0.7755102040816326,0.765817823427368,0.5740823745727539,0.765817823427368
68,2,AdaBoost (Discrete),2,0.5,0.8073229291716687,0.8063836550400366,67.63996839523315,0.8063836550400366
69,2,AdaBoost (Real),2,0.5,0.812124849939976,0.8109918086441077,76.15356278419495,0.8109918086441077
70,2,Logistic Regression (Penalty = L2),2,0.5,0.843937575030012,0.8423419294025036,0.30783510208129883,0.8423419294025036
71,2,Naive Bayes,2,0.5,0.8157262905162065,0.7974007362979313,0.0705420970916748,0.7974007362979313
72,3,KNeighbors Classifier,0,0.5,0.8081534772182254,0.8071656879166235,2.3400487899780273,0.8071656879166235
73,3,SVC Classifier,0,0.5,0.829136690647482,0.8214530713831008,5.219336986541748,0.8214530713831008
74,3,Decision Tree,0,0.5,0.7571942446043165,0.7562115087353316,0.15653777122497559,0.7562115087353316
75,3,RandomForest,0,0.5,0.7577937649880095,0.7450899723822573,0.5785684585571289,0.7450899723822573
76,3,AdaBoost (Discrete),0,0.5,0.829736211031175,0.8296414475610775,67.72303986549377,0.8296414475610775
77,3,AdaBoost (Real),0,0.5,0.8261390887290168,0.8257452325285056,78.26750159263611,0.8257452325285056
78,3,Logistic Regression (Penalty = L2),0,0.5,0.8525179856115108,0.8517199520469563,0.33298254013061523,0.8517199520469563
79,3,Naive Bayes,0,0.5,0.8183453237410072,0.805387062124899,0.0628199577331543,0.805387062124899
80,3,KNeighbors Classifier,1,0.5,0.7983193277310925,0.7973559836724309,2.242587089538574,0.7973559836724309
81,3,SVC Classifier,1,0.5,0.8181272509003601,0.8102688303178759,5.448589563369751,0.8102688303178759
82,3,Decision Tree,1,0.5,0.7226890756302521,0.7217613028841162,0.20465946197509766,0.7217613028841162
83,3,RandomForest,1,0.5,0.7599039615846338,0.7506108602562683,0.5331733226776123,0.7506108602562683
84,3,AdaBoost (Discrete),1,0.5,0.804921968787515,0.8036645134246367,69.86844396591187,0.8036645134246367
85,3,AdaBoost (Real),1,0.5,0.8067226890756303,0.8064909177400755,85.29608058929443,0.8064909177400755
86,3,Logistic Regression (Penalty = L2),1,0.5,0.8385354141656662,0.8377511064630156,0.3238050937652588,0.8377511064630156
87,3,Naive Bayes,1,0.5,0.8037214885954381,0.7893744897691847,0.11156654357910156,0.7893744897691847
88,3,KNeighbors Classifier,2,0.5,0.7947178871548619,0.7930852950853723,2.4524521827697754,0.7930852950853723
89,3,SVC Classifier,2,0.5,0.8289315726290516,0.8184648803153808,5.6985838413238525,0.8184648803153808
90,3,Decision Tree,2,0.5,0.7322929171668667,0.7312713787844805,0.17379546165466309,0.7312713787844805
91,3,RandomForest,2,0.5,0.7593037214885955,0.7502493003567238,0.6221861839294434,0.7502493003567238
92,3,AdaBoost (Discrete),2,0.5,0.8223289315726291,0.8223530026602965,84.34997344017029,0.8223530026602965
93,3,AdaBoost (Real),2,0.5,0.8175270108043218,0.8171056358319054,97.38049125671387,0.8171056358319054
94,3,Logistic Regression (Penalty = L2),2,0.5,0.8457382953181273,0.8443536450296102,0.38392019271850586,0.8443536450296102
95,3,Naive Bayes,2,0.5,0.8187274909963985,0.8051773506527784,0.1810457706451416,0.8051773506527784
96,4,KNeighbors Classifier,0,0.5,0.8069544364508393,0.8052833264501734,1.777374505996704,0.8052833264501734
97,4,SVC Classifier,0,0.5,0.8255395683453237,0.8170924775262941,5.835801124572754,0.8170924775262941
98,4,Decision Tree,0,0.5,0.7440047961630696,0.7435065477984486,0.1936802864074707,0.7435065477984486
99,4,RandomForest,0,0.5,0.7434052757793765,0.7420208123651516,0.710418701171875,0.7420208123651516
100,4,AdaBoost (Discrete),0,0.5,0.8171462829736211,0.8165665904374356,75.44136452674866,0.8165665904374356
101,4,AdaBoost (Real),0,0.5,0.8279376498800959,0.8279136966256185,88.04169273376465,0.8279136966256185
102,4,Logistic Regression (Penalty = L2),0,0.5,0.8393285371702638,0.8383363875499565,0.33991026878356934,0.8383363875499565
103,4,Naive Bayes,0,0.5,0.8105515587529976,0.7989078013700427,0.06916069984436035,0.7989078013700427
104,4,KNeighbors Classifier,1,0.5,0.7923169267707083,0.79122304220281,1.7786993980407715,0.79122304220281
105,4,SVC Classifier,1,0.5,0.8103241296518607,0.8025775833082587,6.0710532665252686,0.8025775833082587
106,4,Decision Tree,1,0.5,0.7328931572629052,0.7323823742154394,0.24626493453979492,0.7323823742154394
107,4,RandomForest,1,0.5,0.7472989195678271,0.7412749739701504,0.7246766090393066,0.7412749739701504
108,4,AdaBoost (Discrete),1,0.5,0.7881152460984394,0.7869875595900263,74.54169511795044,0.7869875595900263
109,4,AdaBoost (Real),1,0.5,0.7983193277310925,0.7966491410283575,86.38297033309937,0.7966491410283575
110,4,Logistic Regression (Penalty = L2),1,0.5,0.8271308523409364,0.8265524037839868,0.38581371307373047,0.8265524037839868
111,4,Naive Bayes,1,0.5,0.8031212484993998,0.7920111302661313,0.12687444686889648,0.7920111302661313
112,4,KNeighbors Classifier,2,0.5,0.7935174069627852,0.7926221415817688,1.9048669338226318,0.7926221415817688
113,4,SVC Classifier,2,0.5,0.8307322929171669,0.8220278644784224,5.948664903640747,0.8220278644784224
114,4,Decision Tree,2,0.5,0.7310924369747899,0.7306648991928851,0.25594234466552734,0.7306648991928851
115,4,RandomForest,2,0.5,0.7316926770708283,0.7294216116480728,0.6413989067077637,0.7294216116480728
116,4,AdaBoost (Discrete),2,0.5,0.7887154861944778,0.7874818348502668,75.15945339202881,0.7874818348502668
117,4,AdaBoost (Real),2,0.5,0.801920768307323,0.8017666231082825,88.45615291595459,0.8017666231082825
118,4,Logistic Regression (Penalty = L2),2,0.5,0.84093637454982,0.8397597958587326,0.3404991626739502,0.8397597958587326
119,4,Naive Bayes,2,0.5,0.8115246098439376,0.8009844551020848,0.061762094497680664,0.8009844551020848
120,5,KNeighbors Classifier,0,0.5,0.7847721822541966,0.7838131377207471,1.4873242378234863,0.7838131377207471
121,5,SVC Classifier,0,0.5,0.8135491606714629,0.803879897566336,5.6897032260894775,0.803879897566336
122,5,Decision Tree,0,0.5,0.7218225419664268,0.7204937701456399,0.19037771224975586,0.7204937701456399
123,5,RandomForest,0,0.5,0.7248201438848921,0.7231062130985554,0.7554593086242676,0.7231062130985554
124,5,AdaBoost (Discrete),0,0.5,0.8045563549160671,0.8039667154043603,70.1512668132782,0.8039667154043603
125,5,AdaBoost (Real),0,0.5,0.7997601918465228,0.7987511988370941,83.06705141067505,0.7987511988370941
126,5,Logistic Regression (Penalty = L2),0,0.5,0.8273381294964028,0.8259436533564724,0.31976819038391113,0.8259436533564724
127,5,Naive Bayes,0,0.5,0.8063549160671463,0.7943203629907545,0.13008475303649902,0.7943203629907545
128,5,KNeighbors Classifier,1,0.5,0.7767106842737095,0.7757876660946089,1.4812908172607422,0.7757876660946089
129,5,SVC Classifier,1,0.5,0.8127250900360145,0.8045002961165756,6.213214635848999,0.8045002961165756
130,5,Decision Tree,1,0.5,0.7130852340936374,0.7128325174928137,0.19932937622070312,0.7128325174928137
131,5,RandomForest,1,0.5,0.7557022809123649,0.7547928611834137,0.6146566867828369,0.7547928611834137
132,5,AdaBoost (Discrete),1,0.5,0.7581032412965186,0.7574758686576462,73.7330756187439,0.7574758686576462
133,5,AdaBoost (Real),1,0.5,0.7779111644657863,0.7770095416093836,86.14255571365356,0.7770095416093836
134,5,Logistic Regression (Penalty = L2),1,0.5,0.812124849939976,0.8110972968003758,0.2993144989013672,0.8110972968003758
135,5,Naive Bayes,1,0.5,0.7971188475390156,0.7883167598218749,0.11514759063720703,0.7883167598218749
136,5,KNeighbors Classifier,2,0.5,0.78031212484994,0.7785942841894562,1.5215716361999512,0.7785942841894562
137,5,SVC Classifier,2,0.5,0.8163265306122449,0.8071058163257684,5.738153696060181,0.8071058163257684
138,5,Decision Tree,2,0.5,0.7226890756302521,0.7220363438652722,0.19188642501831055,0.7220363438652722
139,5,RandomForest,2,0.5,0.6974789915966386,0.6935589543008012,0.5679867267608643,0.6935589543008012
140,5,AdaBoost (Discrete),2,0.5,0.7845138055222088,0.7830525620141543,66.77425646781921,0.7830525620141543
141,5,AdaBoost (Real),2,0.5,0.7977190876350541,0.7958599166082584,91.9218487739563,0.7958599166082584
142,5,Logistic Regression (Penalty = L2),2,0.5,0.8415366146458584,0.8402356084601422,0.5173876285552979,0.8402356084601422
143,5,Naive Bayes,2,0.5,0.8163265306122449,0.8067928913413782,0.17914628982543945,0.8067928913413782
144,6,KNeighbors Classifier,0,0.5,0.7937649880095923,0.7915404662031512,2.337594509124756,0.7915404662031512
145,6,SVC Classifier,0,0.5,0.8249400479616307,0.8171326297050112,7.734184741973877,0.8171326297050112
146,6,Decision Tree,0,0.5,0.75,0.7494082847699013,0.25960803031921387,0.7494082847699013
147,6,RandomForest,0,0.5,0.7320143884892086,0.7259573751405923,0.9971442222595215,0.7259573751405923
148,6,AdaBoost (Discrete),0,0.5,0.8135491606714629,0.8136057531715912,98.66574931144714,0.8136057531715912
149,6,AdaBoost (Real),0,0.5,0.8063549160671463,0.8061494676163946,102.89124989509583,0.8061494676163946
150,6,Logistic Regression (Penalty = L2),0,0.5,0.8375299760191847,0.8366050168703032,0.3795430660247803,0.8366050168703032
151,6,Naive Bayes,0,0.5,0.814748201438849,0.8040612167288025,0.14348697662353516,0.8040612167288025
152,6,KNeighbors Classifier,1,0.5,0.7767106842737095,0.7742681055844787,2.0458896160125732,0.7742681055844787
153,6,SVC Classifier,1,0.5,0.8031212484993998,0.7941158350564743,6.747098922729492,0.7941158350564743
154,6,Decision Tree,1,0.5,0.7118847539015606,0.7118267904931761,0.2717621326446533,0.7118267904931761
155,6,RandomForest,1,0.5,0.7280912364945978,0.718782555760062,0.7258079051971436,0.718782555760062
156,6,AdaBoost (Discrete),1,0.5,0.7755102040816326,0.775044391491847,89.44535398483276,0.775044391491847
157,6,AdaBoost (Real),1,0.5,0.790516206482593,0.7902562565916995,107.15449357032776,0.7902562565916995
158,6,Logistic Regression (Penalty = L2),1,0.5,0.8145258103241296,0.813688566848172,0.49108171463012695,0.813688566848172
159,6,Naive Bayes,1,0.5,0.790516206482593,0.7795010658682154,0.1671738624572754,0.7795010658682154
160,6,KNeighbors Classifier,2,0.5,0.7959183673469388,0.7948625081339583,2.6473748683929443,0.7948625081339583
161,6,SVC Classifier,2,0.5,0.8211284513805522,0.8110472685943375,7.495262622833252,0.8110472685943375
162,6,Decision Tree,2,0.5,0.7322929171668667,0.7318560860389287,0.3177456855773926,0.7318560860389287
163,6,RandomForest,2,0.5,0.7539015606242497,0.7449285261301795,0.8769021034240723,0.7449285261301795
164,6,AdaBoost (Discrete),2,0.5,0.8007202881152461,0.7995135989106572,92.70528864860535,0.7995135989106572
165,6,AdaBoost (Real),2,0.5,0.8109243697478992,0.810807932680011,109.70045351982117,0.810807932680011
166,6,Logistic Regression (Penalty = L2),2,0.5,0.8415366146458584,0.8404104146138642,0.517390251159668,0.8404104146138642
167,6,Naive Bayes,2,0.5,0.8127250900360145,0.8028741778339342,0.1593918800354004,0.8028741778339342
168,7,KNeighbors Classifier,0,0.5,0.7739808153477218,0.7727402292283516,1.3617839813232422,0.7727402292283516
169,7,SVC Classifier,0,0.5,0.8129496402877698,0.8055517047970255,6.974928617477417,0.8055517047970255
170,7,Decision Tree,0,0.5,0.7284172661870504,0.7270561425916203,0.15862011909484863,0.7270561425916203
171,7,RandomForest,0,0.5,0.7595923261390888,0.7517751802967442,0.8072388172149658,0.7517751802967442
172,7,AdaBoost (Discrete),0,0.5,0.7745803357314148,0.7717529432704475,81.1595606803894,0.7717529432704475
173,7,AdaBoost (Real),0,0.5,0.7877697841726619,0.7832044725766897,97.64632201194763,0.7832044725766897
174,7,Logistic Regression (Penalty = L2),0,0.5,0.8219424460431655,0.8204663521783645,0.4347388744354248,0.8204663521783645
175,7,Naive Bayes,0,0.5,0.8141486810551559,0.8085553430099742,0.08255124092102051,0.8085553430099742
176,7,KNeighbors Classifier,1,0.5,0.7623049219687875,0.7614455728776505,1.4369227886199951,0.7614455728776505
177,7,SVC Classifier,1,0.5,0.8007202881152461,0.794322493708932,6.9837281703948975,0.794322493708932
178,7,Decision Tree,1,0.5,0.7052821128451381,0.70513189475641,0.24064230918884277,0.70513189475641
179,7,RandomForest,1,0.5,0.7190876350540216,0.7023331879125077,0.7855303287506104,0.7023331879125077
180,7,AdaBoost (Discrete),1,0.5,0.7436974789915967,0.7357939973223948,81.71674633026123,0.7357939973223948
181,7,AdaBoost (Real),1,0.5,0.7683073229291717,0.7641069365919267,96.81191349029541,0.7641069365919267
182,7,Logistic Regression (Penalty = L2),1,0.5,0.8109243697478992,0.8099248344645658,0.4702494144439697,0.8099248344645658
183,7,Naive Bayes,1,0.5,0.7893157262905162,0.782662054683175,0.1544957160949707,0.782662054683175
184,7,KNeighbors Classifier,2,0.5,0.7719087635054022,0.770651755099117,1.368086814880371,0.770651755099117
185,7,SVC Classifier,2,0.5,0.8169267707082833,0.8080533711138984,7.24379825592041,0.8080533711138984
186,7,Decision Tree,2,0.5,0.7226890756302521,0.7215993391292902,0.2400515079498291,0.7215993391292902
187,7,RandomForest,2,0.5,0.7689075630252101,0.7664359098367584,0.7955241203308105,0.7664359098367584
188,7,AdaBoost (Discrete),2,0.5,0.7671068427370948,0.7655905453252463,78.82411932945251,0.7655905453252463
189,7,AdaBoost (Real),2,0.5,0.7743097238895558,0.7707769197396477,91.68382120132446,0.7707769197396477
190,7,Logistic Regression (Penalty = L2),2,0.5,0.8271308523409364,0.8254539659430727,0.33705687522888184,0.8254539659430727
191,7,Naive Bayes,2,0.5,0.8103241296518607,0.8034539840657631,0.1472322940826416,0.8034539840657631
192,8,KNeighbors Classifier,0,0.5,0.8051558752997602,0.8041236452761088,2.198079824447632,0.8041236452761088
193,8,SVC Classifier,0,0.5,0.8345323741007195,0.8295644506745508,7.27304482460022,0.8295644506745508
194,8,Decision Tree,0,0.5,0.750599520383693,0.7494696339300693,0.29563069343566895,0.7494696339300693
195,8,RandomForest,0,0.5,0.7757793764988009,0.770743552103583,0.8292629718780518,0.770743552103583
196,8,AdaBoost (Discrete),0,0.5,0.8189448441247003,0.818594316469685,87.80877184867859,0.818594316469685
197,8,AdaBoost (Real),0,0.5,0.8123501199040767,0.8117227023658315,103.63494682312012,0.8117227023658315
198,8,Logistic Regression (Penalty = L2),0,0.5,0.8501199040767387,0.8498080530809987,0.48622727394104004,0.8498080530809987
199,8,Naive Bayes,0,0.5,0.8279376498800959,0.8209893749215567,0.1274552345275879,0.8209893749215567
200,8,KNeighbors Classifier,1,0.5,0.7839135654261705,0.7832476205181943,2.1508476734161377,0.7832476205181943
201,8,SVC Classifier,1,0.5,0.812124849939976,0.8060098446512965,6.875240325927734,0.8060098446512965
202,8,Decision Tree,1,0.5,0.71968787515006,0.7189819277887776,0.2262101173400879,0.7189819277887776
203,8,RandomForest,1,0.5,0.7563025210084033,0.7518501806958445,0.7621831893920898,0.7518501806958445
204,8,AdaBoost (Discrete),1,0.5,0.7923169267707083,0.7913075180048743,88.56575441360474,0.7913075180048743
205,8,AdaBoost (Real),1,0.5,0.7971188475390156,0.7969831438418163,104.57334303855896,0.7969831438418163
206,8,Logistic Regression (Penalty = L2),1,0.5,0.8247298919567827,0.8241872997246479,0.48334622383117676,0.8241872997246479
207,8,Naive Bayes,1,0.5,0.8061224489795918,0.7983732993544698,0.16317105293273926,0.7983732993544698
208,8,KNeighbors Classifier,2,0.5,0.7983193277310925,0.797493263016136,2.2214183807373047,0.797493263016136
209,8,SVC Classifier,2,0.5,0.8259303721488596,0.8186259426038759,6.940046072006226,0.8186259426038759
210,8,Decision Tree,2,0.5,0.7280912364945978,0.7274289958840781,0.30221033096313477,0.7274289958840781
211,8,RandomForest,2,0.5,0.726890756302521,0.7156217681262257,0.7827591896057129,0.7156217681262257
212,8,AdaBoost (Discrete),2,0.5,0.8043217286914766,0.8036412191606614,88.38984704017639,0.8036412191606614
213,8,AdaBoost (Real),2,0.5,0.8097238895558223,0.8090306543681066,101.1762900352478,0.8090306543681066
214,8,Logistic Regression (Penalty = L2),2,0.5,0.84093637454982,0.8398978048402601,0.3711378574371338,0.8398978048402601
215,8,Naive Bayes,2,0.5,0.8157262905162065,0.8073449356285693,0.1481335163116455,0.8073449356285693
216,9,KNeighbors Classifier,0,0.5,0.7476019184652278,0.7466144477251421,1.0038294792175293,0.7466144477251421
217,9,SVC Classifier,0,0.5,0.7949640287769785,0.7882585138583452,6.443862676620483,0.7882585138583452
218,9,Decision Tree,0,0.5,0.697242206235012,0.696125133701067,0.20494651794433594,0.696125133701067
219,9,RandomForest,0,0.5,0.7326139088729017,0.7221239594025389,0.759310245513916,0.7221239594025389
220,9,AdaBoost (Discrete),0,0.5,0.7218225419664268,0.7205542943781694,70.96266794204712,0.7205542943781694
221,9,AdaBoost (Real),0,0.5,0.7535971223021583,0.7493209529082049,87.45450186729431,0.7493209529082049
222,9,Logistic Regression (Penalty = L2),0,0.5,0.8033573141486811,0.8020531887423022,0.3831825256347656,0.8020531887423022
223,9,Naive Bayes,0,0.5,0.789568345323741,0.7822725228453233,0.15029168128967285,0.7822725228453233
224,9,KNeighbors Classifier,1,0.5,0.7430972388955582,0.7413216736761225,0.9898521900177002,0.7413216736761225
225,9,SVC Classifier,1,0.5,0.7827130852340937,0.7751908266056948,6.694047212600708,0.7751908266056948
226,9,Decision Tree,1,0.5,0.6932773109243697,0.6930462433433884,0.22633004188537598,0.6930462433433884
227,9,RandomForest,1,0.5,0.7274909963985594,0.7213205373954822,0.8070993423461914,0.7213205373954822
228,9,AdaBoost (Discrete),1,0.5,0.7244897959183674,0.7219868694310569,72.98671102523804,0.7219868694310569
229,9,AdaBoost (Real),1,0.5,0.7088835534213686,0.7079016681497843,83.56020951271057,0.7079016681497843
230,9,Logistic Regression (Penalty = L2),1,0.5,0.7965186074429772,0.7948973376923996,0.3652455806732178,0.7948973376923996
231,9,Naive Bayes,1,0.5,0.7809123649459784,0.7730813948765772,0.12689971923828125,0.7730813948765772
232,9,KNeighbors Classifier,2,0.5,0.7545018007202882,0.753106944133068,0.8854525089263916,0.753106944133068
233,9,SVC Classifier,2,0.5,0.7743097238895558,0.7634251550171874,6.25853419303894,0.7634251550171874
234,9,Decision Tree,2,0.5,0.7118847539015606,0.7098420042515953,0.21768546104431152,0.7098420042515953
235,9,RandomForest,2,0.5,0.7112845138055222,0.6990546856418154,0.656984806060791,0.6990546856418154
236,9,AdaBoost (Discrete),2,0.5,0.6962785114045619,0.6959371268513258,67.87031936645508,0.6959371268513258
237,9,AdaBoost (Real),2,0.5,0.7322929171668667,0.7313501290053869,82.88518190383911,0.7313501290053869
238,9,Logistic Regression (Penalty = L2),2,0.5,0.8013205282112845,0.7996506012701781,0.5223278999328613,0.7996506012701781
239,9,Naive Bayes,2,0.5,0.7701080432172869,0.7606852430431578,0.14255380630493164,0.7606852430431578
240,10,KNeighbors Classifier,0,0.5,0.8057553956834532,0.8050521003972478,4.140129089355469,0.8050521003972478
241,10,SVC Classifier,0,0.5,0.8369304556354916,0.8219018124951192,7.706871747970581,0.8219018124951192
242,10,Decision Tree,0,0.5,0.7458033573141487,0.7456249132023394,0.2823333740234375,0.7456249132023394
243,10,RandomForest,0,0.5,0.7799760191846523,0.7674825732276489,0.8646883964538574,0.7674825732276489
244,10,AdaBoost (Discrete),0,0.5,0.8387290167865707,0.8387919960481668,108.34910655021667,0.8387919960481668
245,10,AdaBoost (Real),0,0.5,0.8333333333333334,0.8329088251128314,124.06125688552856,0.8329088251128314
246,10,Logistic Regression (Penalty = L2),0,0.5,0.8651079136690647,0.8644330224098145,0.5997211933135986,0.8644330224098145
247,10,Naive Bayes,0,0.5,0.8069544364508393,0.7789346493701397,0.14763736724853516,0.7789346493701397
248,10,KNeighbors Classifier,1,0.5,0.8109243697478992,0.8102388772689647,3.89953351020813,0.8102388772689647
249,10,SVC Classifier,1,0.5,0.8313325330132053,0.820482004744897,7.520398855209351,0.820482004744897
250,10,Decision Tree,1,0.5,0.7400960384153662,0.7397223064703318,0.2863287925720215,0.7397223064703318
251,10,RandomForest,1,0.5,0.7551020408163265,0.7388031993643557,0.864990234375,0.7388031993643557
252,10,AdaBoost (Discrete),1,0.5,0.8199279711884754,0.8198850473065682,107.87539315223694,0.8198850473065682
253,10,AdaBoost (Real),1,0.5,0.8205282112845138,0.8205427240156163,119.37245440483093,0.8205427240156163
254,10,Logistic Regression (Penalty = L2),1,0.5,0.84093637454982,0.8405879638981489,0.5258409976959229,0.8405879638981489
255,10,Naive Bayes,1,0.5,0.7959183673469388,0.7679542662232233,0.1358170509338379,0.7679542662232233
256,10,KNeighbors Classifier,2,0.5,0.8043217286914766,0.8025892191888992,4.22033953666687,0.8025892191888992
257,10,SVC Classifier,2,0.5,0.8367346938775511,0.820743119423851,7.346948623657227,0.820743119423851
258,10,Decision Tree,2,0.5,0.7496998799519808,0.7494507179740594,0.20960068702697754,0.7494507179740594
259,10,RandomForest,2,0.5,0.7671068427370948,0.7627648741459752,0.7655198574066162,0.7627648741459752
260,10,AdaBoost (Discrete),2,0.5,0.8385354141656662,0.838363784519792,103.8434374332428,0.838363784519792
261,10,AdaBoost (Real),2,0.5,0.8445378151260504,0.8444611216629148,116.51453876495361,0.8444611216629148
262,10,Logistic Regression (Penalty = L2),2,0.5,0.8619447779111644,0.8605612786412383,0.5192105770111084,0.8605612786412383
263,10,Naive Bayes,2,0.5,0.8127250900360145,0.7837706677549495,0.13370680809020996,0.7837706677549495
264,11,KNeighbors Classifier,0,0.5,0.802158273381295,0.8017638864462964,6.082647085189819,0.8017638864462964
265,11,SVC Classifier,0,0.5,0.8357314148681055,0.8225150917893452,7.631154537200928,0.8225150917893452
266,11,Decision Tree,0,0.5,0.7482014388489209,0.7477910437270066,0.2748713493347168,0.7477910437270066
267,11,RandomForest,0,0.5,0.7523980815347722,0.7477554570298672,0.8130385875701904,0.7477554570298672
268,11,AdaBoost (Discrete),0,0.5,0.8375299760191847,0.8375440968800706,119.1983916759491,0.8375440968800706
269,11,AdaBoost (Real),0,0.5,0.8405275779376499,0.8404686187405922,131.70396995544434,0.8404686187405922
270,11,Logistic Regression (Penalty = L2),0,0.5,0.8651079136690647,0.8643297963251443,0.46938300132751465,0.8643297963251443
271,11,Naive Bayes,0,0.5,0.8063549160671463,0.7771082000925921,0.1448659896850586,0.7771082000925921
272,11,KNeighbors Classifier,1,0.5,0.7851140456182473,0.7836282779653471,5.824239730834961,0.7836282779653471
273,11,SVC Classifier,1,0.5,0.8277310924369747,0.8159993416824747,7.967919826507568,0.8159993416824747
274,11,Decision Tree,1,0.5,0.7460984393757503,0.745045795247539,0.27353978157043457,0.745045795247539
275,11,RandomForest,1,0.5,0.7274909963985594,0.7252310171349163,0.8869025707244873,0.7252310171349163
276,11,AdaBoost (Discrete),1,0.5,0.8145258103241296,0.8143883499746427,114.75362992286682,0.8143883499746427
277,11,AdaBoost (Real),1,0.5,0.8169267707082833,0.8165361152618625,131.77168941497803,0.8165361152618625
278,11,Logistic Regression (Penalty = L2),1,0.5,0.8457382953181273,0.8453742161246034,0.499237060546875,0.8453742161246034
279,11,Naive Bayes,1,0.5,0.8025210084033614,0.7742840467556955,0.06642293930053711,0.7742840467556955
280,11,KNeighbors Classifier,2,0.5,0.801920768307323,0.8003834691306859,6.558681488037109,0.8003834691306859
281,11,SVC Classifier,2,0.5,0.8397358943577431,0.8254951440028975,8.187104940414429,0.8254951440028975
282,11,Decision Tree,2,0.5,0.7376950780312125,0.7367550591690812,0.2738211154937744,0.7367550591690812
283,11,RandomForest,2,0.5,0.7424969987995198,0.7424339884438722,0.8859336376190186,0.7424339884438722
284,11,AdaBoost (Discrete),2,0.5,0.8493397358943577,0.8488805914475861,117.96952247619629,0.8488805914475861
285,11,AdaBoost (Real),2,0.5,0.84093637454982,0.8407821934142404,129.3075714111328,0.8407821934142404
286,11,Logistic Regression (Penalty = L2),2,0.5,0.8637454981992797,0.8624404216323349,0.4851818084716797,0.8624404216323349
287,11,Naive Bayes,2,0.5,0.8133253301320528,0.78458322182723,0.07090115547180176,0.78458322182723
288,12,KNeighbors Classifier,0,0.5,0.7320143884892086,0.73110363961099,0.5619115829467773,0.73110363961099
289,12,SVC Classifier,0,0.5,0.7697841726618705,0.7588734450792589,5.630910158157349,0.7588734450792589
290,12,Decision Tree,0,0.5,0.6774580335731415,0.6759316028221323,0.13867545127868652,0.6759316028221323
291,12,RandomForest,0,0.5,0.7254196642685852,0.7156645838806797,0.679948091506958,0.7156645838806797
292,12,AdaBoost (Discrete),0,0.5,0.6468824940047961,0.6358742002839562,58.1745228767395,0.6358742002839562
293,12,AdaBoost (Real),0,0.5,0.6546762589928058,0.6465393411603716,71.42072629928589,0.6465393411603716
294,12,Logistic Regression (Penalty = L2),0,0.5,0.7799760191846523,0.7789938688443744,0.2980184555053711,0.7789938688443744
295,12,Naive Bayes,0,0.5,0.7697841726618705,0.7605693565727196,0.15045881271362305,0.7605693565727196
296,12,KNeighbors Classifier,1,0.5,0.7136854741896759,0.7110444026677464,0.6762678623199463,0.7110444026677464
297,12,SVC Classifier,1,0.5,0.7623049219687875,0.744996495644179,5.977062463760376,0.744996495644179
298,12,Decision Tree,1,0.5,0.6770708283313326,0.6770463180624021,0.1375739574432373,0.6770463180624021
299,12,RandomForest,1,0.5,0.7112845138055222,0.7028358331299834,0.6776237487792969,0.7028358331299834
300,12,AdaBoost (Discrete),1,0.5,0.6452581032412965,0.6441942687445344,57.862138748168945,0.6441942687445344
301,12,AdaBoost (Real),1,0.5,0.6758703481392557,0.6747122335285491,67.9654712677002,0.6747122335285491
302,12,Logistic Regression (Penalty = L2),1,0.5,0.776110444177671,0.7743394444467234,0.28293752670288086,0.7743394444467234
303,12,Naive Bayes,1,0.5,0.7490996398559424,0.7360362517700686,0.06526637077331543,0.7360362517700686
304,12,KNeighbors Classifier,2,0.5,0.7274909963985594,0.726577240527649,0.5725243091583252,0.726577240527649
305,12,SVC Classifier,2,0.5,0.7521008403361344,0.7367090448975242,5.482902526855469,0.7367090448975242
306,12,Decision Tree,2,0.5,0.6914765906362546,0.6909457013018235,0.1904609203338623,0.6909457013018235
307,12,RandomForest,2,0.5,0.7106842737094838,0.699643058374833,0.7031261920928955,0.699643058374833
308,12,AdaBoost (Discrete),2,0.5,0.6296518607442977,0.6250508484047074,55.585848808288574,0.6250508484047074
309,12,AdaBoost (Real),2,0.5,0.6626650660264105,0.6593277241580058,67.6306083202362,0.6593277241580058
310,12,Logistic Regression (Penalty = L2),2,0.5,0.7779111644657863,0.7760091405487949,0.3015940189361572,0.7760091405487949
311,12,Naive Bayes,2,0.5,0.751500600240096,0.7394868012476387,0.07800769805908203,0.7394868012476387
