,feat_set_id,classifier,fold_id,feat_th,score,geo_score,exec_t,geo_score_woz
0,0,KNeighbors Classifier,0,0.95,0.49899879855826995,0.49927116510179026,10.202650308609009,0.49927116510179026
1,0,SVC Classifier,0,0.95,0.55126151381658,1.0,82.42532801628113,0.0
2,0,Decision Tree,0,0.95,0.49018822587104527,0.49269788328674274,0.4368910789489746,0.49269788328674274
3,0,RandomForest,0,0.95,0.5190228273928714,0.5158933117021456,0.96354079246521,0.5158933117021456
4,0,AdaBoost (Discrete),0,0.95,0.46655987184621545,0.44488235365136386,140.87998485565186,0.44488235365136386
5,0,AdaBoost (Real),0,0.95,0.4827793352022427,0.4722073944764164,157.25837230682373,0.4722073944764164
6,0,Logistic Regression (Penalty = L2),0,0.95,0.5456547857428915,0.5241878499132286,0.5864615440368652,0.5241878499132286
7,0,Naive Bayes,0,0.95,0.4725670804965959,0.24631842673624854,0.1927964687347412,0.24631842673624854
8,0,KNeighbors Classifier,1,0.95,0.4279991988784298,0.4302527252847516,11.89901614189148,0.4302527252847516
9,0,SVC Classifier,1,0.95,0.5509713599038654,0.9996366279069767,69.06686806678772,0.0
10,0,Decision Tree,1,0.95,0.4686561185659924,0.47112926734252414,0.42662739753723145,0.47112926734252414
11,0,RandomForest,1,0.95,0.4908872421389946,0.3347173060953684,0.7971453666687012,0.3347173060953684
12,0,AdaBoost (Discrete),1,0.95,0.4802723813338674,0.48274691239456013,127.12677693367004,0.48274691239456013
13,0,AdaBoost (Real),1,0.95,0.47406368916483077,0.476513968304771,160.09156942367554,0.476513968304771
14,0,Logistic Regression (Penalty = L2),1,0.95,0.4926897656719407,0.4872301404778492,0.417264461517334,0.4872301404778492
15,0,Naive Bayes,1,0.95,0.5123172441417985,0.4643932535990984,0.14616966247558594,0.4643932535990984
16,0,KNeighbors Classifier,2,0.95,0.4528339675545764,0.41484143043978533,7.559063673019409,0.41484143043978533
17,0,SVC Classifier,2,0.95,0.5513719206889646,0.021124141684149264,64.47848224639893,0.021124141684149264
18,0,Decision Tree,2,0.95,0.5285399559383136,0.4998404215942885,0.32132720947265625,0.4998404215942885
19,0,RandomForest,2,0.95,0.5261365912277188,0.43876075493672173,0.6383872032165527,0.43876075493672173
20,0,AdaBoost (Discrete),2,0.95,0.4922892048868416,0.4548955357838488,113.27982878684998,0.4548955357838488
21,0,AdaBoost (Real),2,0.95,0.5005007009813739,0.46030722096119925,129.7166030406952,0.46030722096119925
22,0,Logistic Regression (Penalty = L2),2,0.95,0.5281393951532145,0.3110649443501827,0.40513181686401367,0.3110649443501827
23,0,Naive Bayes,2,0.95,0.4091728419787703,0.14112142054483381,0.18634748458862305,0.14112142054483381
24,1,KNeighbors Classifier,0,0.95,0.5162194633560272,0.5159278714188087,8.25918984413147,0.5159278714188087
25,1,SVC Classifier,0,0.95,0.55126151381658,1.0,61.19942831993103,0.0
26,1,Decision Tree,0,0.95,0.5198237885462555,0.5220733257325585,0.3557150363922119,0.5220733257325585
27,1,RandomForest,0,0.95,0.5112134561473769,0.512872961320873,0.8650877475738525,0.512872961320873
28,1,AdaBoost (Discrete),0,0.95,0.44893872647176614,0.41876747027768924,107.95572710037231,0.41876747027768924
29,1,AdaBoost (Real),0,0.95,0.49839807769323186,0.49244499624453864,126.17572140693665,0.49244499624453864
30,1,Logistic Regression (Penalty = L2),0,0.95,0.5444533440128154,0.5222972822070973,0.3825228214263916,0.5222972822070973
31,1,Naive Bayes,0,0.95,0.46635963155786947,0.22062591532446182,0.16373515129089355,0.22062591532446182
32,1,KNeighbors Classifier,1,0.95,0.45343480873222514,0.4532598780903,10.839922666549683,0.4532598780903
33,1,SVC Classifier,1,0.95,0.5509713599038654,0.9996366279069767,63.39323163032532,0.0
34,1,Decision Tree,1,0.95,0.49128780292409374,0.4928684934400943,0.4263651371002197,0.4928684934400943
35,1,RandomForest,1,0.95,0.48127378329661524,0.3050901626863331,0.9344184398651123,0.3050901626863331
36,1,AdaBoost (Discrete),1,0.95,0.48127378329661524,0.4838071437512882,138.3253788948059,0.4838071437512882
37,1,AdaBoost (Real),1,0.95,0.47987182054876826,0.4823912474312843,152.3004448413849,0.4823912474312843
38,1,Logistic Regression (Penalty = L2),1,0.95,0.46024434207891046,0.45229529026557624,0.38405418395996094,0.45229529026557624
39,1,Naive Bayes,1,0.95,0.5075105147206088,0.47917736826877816,0.16055917739868164,0.47917736826877816
40,1,KNeighbors Classifier,2,0.95,0.4418185459643501,0.3870561044688483,8.573517322540283,0.3870561044688483
41,1,SVC Classifier,2,0.95,0.5513719206889646,0.021124141684149264,71.10374760627747,0.021124141684149264
42,1,Decision Tree,2,0.95,0.5287402363308632,0.4902559929651794,0.394420862197876,0.4902559929651794
43,1,RandomForest,2,0.95,0.5593831363909473,0.4716376723261451,0.8303604125976562,0.4716376723261451
44,1,AdaBoost (Discrete),2,0.95,0.47146004406168635,0.44039190588505495,132.28777933120728,0.44039190588505495
45,1,AdaBoost (Real),2,0.95,0.4978970558782295,0.45947337349760586,159.11844038963318,0.45947337349760586
46,1,Logistic Regression (Penalty = L2),2,0.95,0.5125175245343481,0.24205769114594666,0.5224788188934326,0.24205769114594666
47,1,Naive Bayes,2,0.95,0.3991588223512918,0.1436043785975207,0.15994572639465332,0.1436043785975207
48,2,KNeighbors Classifier,0,0.95,0.5146175410492592,0.5154098613184495,9.45863652229309,0.5154098613184495
49,2,SVC Classifier,0,0.95,0.55126151381658,1.0,71.44879460334778,0.0
50,2,Decision Tree,0,0.95,0.4911894273127753,0.49366726006465994,0.3965330123901367,0.49366726006465994
51,2,RandomForest,0,0.95,0.5190228273928714,0.5158933117021456,0.8408114910125732,0.5158933117021456
52,2,AdaBoost (Discrete),0,0.95,0.46615939126952344,0.444052341733547,131.46184182167053,0.444052341733547
53,2,AdaBoost (Real),0,0.95,0.48618342010412496,0.46601772524879,142.06544828414917,0.46601772524879
54,2,Logistic Regression (Penalty = L2),0,0.95,0.539247096515819,0.5194115512354388,0.5277867317199707,0.5194115512354388
55,2,Naive Bayes,0,0.95,0.40869042851421705,0.3531574934255595,0.15178203582763672,0.3531574934255595
56,2,KNeighbors Classifier,1,0.95,0.4233927498497897,0.42562594648676993,11.368410110473633,0.42562594648676993
57,2,SVC Classifier,1,0.95,0.5509713599038654,0.9996366279069767,70.58557796478271,0.0
58,2,Decision Tree,1,0.95,0.4410174243941518,0.44329855188574957,0.4610755443572998,0.44329855188574957
59,2,RandomForest,1,0.95,0.47146004406168635,0.36985512133536247,0.7946066856384277,0.36985512133536247
60,2,AdaBoost (Discrete),1,0.95,0.47546565191267776,0.47580464094986374,122.32675385475159,0.47580464094986374
61,2,AdaBoost (Real),1,0.95,0.46645303424794715,0.466986899625706,156.1295075416565,0.466986899625706
62,2,Logistic Regression (Penalty = L2),1,0.95,0.4588423793310635,0.43124386984861196,0.6727809906005859,0.43124386984861196
63,2,Naive Bayes,1,0.95,0.5015021029441218,0.5041028430587734,0.17321062088012695,0.5041028430587734
64,2,KNeighbors Classifier,2,0.95,0.4233927498497897,0.37101333436249095,11.090016841888428,0.37101333436249095
65,2,SVC Classifier,2,0.95,0.5513719206889646,0.021124141684149264,85.32965135574341,0.021124141684149264
66,2,Decision Tree,2,0.95,0.4932906068495894,0.4693517315538322,0.4549407958984375,0.4693517315538322
67,2,RandomForest,2,0.95,0.5227318245543762,0.4377397733121814,0.9372386932373047,0.4377397733121814
68,2,AdaBoost (Discrete),2,0.95,0.45063088323653117,0.41943988539605853,153.6640601158142,0.41943988539605853
69,2,AdaBoost (Real),2,0.95,0.4592429401161626,0.4186059753636234,157.6982171535492,0.4186059753636234
70,2,Logistic Regression (Penalty = L2),2,0.95,0.5293410775085119,0.2439134869373321,0.5384488105773926,0.2439134869373321
71,2,Naive Bayes,2,0.95,0.39274984978970556,0.1580611630282655,0.14951324462890625,0.1580611630282655
72,3,KNeighbors Classifier,0,0.95,0.5376451742090509,0.5386592562422295,9.421398878097534,0.5386592562422295
73,3,SVC Classifier,0,0.95,0.55126151381658,1.0,73.31703305244446,0.0
74,3,Decision Tree,0,0.95,0.5248297957549058,0.5237368158013692,0.5058271884918213,0.5237368158013692
75,3,RandomForest,0,0.95,0.5176211453744494,0.519114071345302,0.9004001617431641,0.519114071345302
76,3,AdaBoost (Discrete),0,0.95,0.47857428914697636,0.4578588880302922,136.82749724388123,0.4578588880302922
77,3,AdaBoost (Real),0,0.95,0.5004004805766921,0.48480172930060333,152.0311677455902,0.48480172930060333
78,3,Logistic Regression (Penalty = L2),0,0.95,0.5536643972767321,0.5271802707019019,0.6067643165588379,0.5271802707019019
79,3,Naive Bayes,0,0.95,0.4683620344413296,0.22412967759492378,0.21301531791687012,0.22412967759492378
80,3,KNeighbors Classifier,1,0.95,0.48988584017624676,0.49234265629879875,12.796765565872192,0.49234265629879875
81,3,SVC Classifier,1,0.95,0.5509713599038654,0.9996366279069767,76.25022864341736,0.0
82,3,Decision Tree,1,0.95,0.47907069897857,0.48065165111923747,0.39487481117248535,0.48065165111923747
83,3,RandomForest,1,0.95,0.48287602643701183,0.2835267910406695,0.707979679107666,0.2835267910406695
84,3,AdaBoost (Discrete),1,0.95,0.4808732225115161,0.4816116307521991,120.44728517532349,0.4816116307521991
85,3,AdaBoost (Real),1,0.95,0.48207490486681354,0.48260951600374835,130.7551748752594,0.48260951600374835
86,3,Logistic Regression (Penalty = L2),1,0.95,0.5309433206489085,0.4898337868459278,0.4199826717376709,0.4898337868459278
87,3,Naive Bayes,1,0.95,0.5555778089325055,0.33542817973287753,0.15127944946289062,0.33542817973287753
88,3,KNeighbors Classifier,2,0.95,0.4207891047466453,0.38308781728083025,7.312361001968384,0.38308781728083025
89,3,SVC Classifier,2,0.95,0.5513719206889646,0.021124141684149264,56.19991707801819,0.021124141684149264
90,3,Decision Tree,2,0.95,0.5019026637292209,0.48254752365410164,0.29221296310424805,0.48254752365410164
91,3,RandomForest,2,0.95,0.5593831363909473,0.4716376723261451,0.6225094795227051,0.4716376723261451
92,3,AdaBoost (Discrete),2,0.95,0.5233326657320249,0.49514639886707473,100.87073349952698,0.49514639886707473
93,3,AdaBoost (Real),2,0.95,0.5157220108151412,0.4875945800747051,107.63515281677246,0.4875945800747051
94,3,Logistic Regression (Penalty = L2),2,0.95,0.5371520128179451,0.2377710818790534,0.3237602710723877,0.2377710818790534
95,3,Naive Bayes,2,0.95,0.3999599439214901,0.1478920177669876,0.12650585174560547,0.1478920177669876
96,4,KNeighbors Classifier,0,0.95,0.5096115338406088,0.5080123032104905,4.403987646102905,0.5080123032104905
97,4,SVC Classifier,0,0.95,0.55126151381658,1.0,48.76817798614502,0.0
98,4,Decision Tree,0,0.95,0.5182218662394874,0.517216082840892,0.25707554817199707,0.517216082840892
99,4,RandomForest,0,0.95,0.4981978374048859,0.4963578592161119,0.5446839332580566,0.4963578592161119
100,4,AdaBoost (Discrete),0,0.95,0.4721665999199039,0.44037393876881953,84.3553638458252,0.44037393876881953
101,4,AdaBoost (Real),0,0.95,0.5276331597917501,0.5252014147634874,95.4611976146698,0.5252014147634874
102,4,Logistic Regression (Penalty = L2),0,0.95,0.5442531037244693,0.5240016675207249,0.24180173873901367,0.5240016675207249
103,4,Naive Bayes,0,0.95,0.47196635963155786,0.24614958054247635,0.11233162879943848,0.24614958054247635
104,4,KNeighbors Classifier,1,0.95,0.4508311636290807,0.4517107388084214,6.333254098892212,0.4517107388084214
105,4,SVC Classifier,1,0.95,0.5509713599038654,0.9996366279069767,50.3867609500885,0.0
106,4,Decision Tree,1,0.95,0.5073102343280593,0.509907624394423,0.22405552864074707,0.509907624394423
107,4,RandomForest,1,0.95,0.44882835970358503,0.4400530419645167,0.5114407539367676,0.4400530419645167
108,4,AdaBoost (Discrete),1,0.95,0.4900861205687963,0.49230165197199416,73.27086210250854,0.49230165197199416
109,4,AdaBoost (Real),1,0.95,0.4772681754456239,0.4791269459824055,86.54248642921448,0.4791269459824055
110,4,Logistic Regression (Penalty = L2),1,0.95,0.49128780292409374,0.4808862200292842,0.23428845405578613,0.4808862200292842
111,4,Naive Bayes,1,0.95,0.5057079911876627,0.5029788525357614,0.11947417259216309,0.5029788525357614
112,4,KNeighbors Classifier,2,0.95,0.4598437812938113,0.4172826305379101,4.039459705352783,0.4172826305379101
113,4,SVC Classifier,2,0.95,0.5513719206889646,0.021124141684149264,40.81801414489746,0.021124141684149264
114,4,Decision Tree,2,0.95,0.5035049068696175,0.48884384892832294,0.21336698532104492,0.48884384892832294
115,4,RandomForest,2,0.95,0.5784097736831564,0.33742161489943534,0.44814181327819824,0.33742161489943534
116,4,AdaBoost (Discrete),2,0.95,0.5141197676747447,0.4717098640287776,64.59632349014282,0.4717098640287776
117,4,AdaBoost (Real),2,0.95,0.49809733627077907,0.4651259105194989,75.13565015792847,0.4651259105194989
118,4,Logistic Regression (Penalty = L2),2,0.95,0.5235329461245743,0.2946305772124264,0.25530171394348145,0.2946305772124264
119,4,Naive Bayes,2,0.95,0.4091728419787703,0.1388966717410924,0.12402153015136719,0.1388966717410924
120,5,KNeighbors Classifier,0,0.95,0.4987985582699239,0.4990885160504606,4.118123769760132,0.4990885160504606
121,5,SVC Classifier,0,0.95,0.55126151381658,1.0,37.08998203277588,0.0
122,5,Decision Tree,0,0.95,0.5338406087304766,0.5362115025306117,0.1933276653289795,0.5362115025306117
123,5,RandomForest,0,0.95,0.4919903884661594,0.4896392259069025,0.4317493438720703,0.4896392259069025
124,5,AdaBoost (Discrete),0,0.95,0.47296756107328797,0.4386006884444193,64.78467655181885,0.4386006884444193
125,5,AdaBoost (Real),0,0.95,0.49279134961954346,0.47559042894410314,73.78074145317078,0.47559042894410314
126,5,Logistic Regression (Penalty = L2),0,0.95,0.5456547857428915,0.5233104821952896,0.23875045776367188,0.5233104821952896
127,5,Naive Bayes,0,0.95,0.49659591509811774,0.18369906323723864,0.11633157730102539,0.18369906323723864
128,5,KNeighbors Classifier,1,0.95,0.4115762066893651,0.4137130298814349,5.156204462051392,0.4137130298814349
129,5,SVC Classifier,1,0.95,0.5509713599038654,0.9996366279069767,36.71134853363037,0.0
130,5,Decision Tree,1,0.95,0.4854796715401562,0.4880363326988917,0.21333932876586914,0.4880363326988917
131,5,RandomForest,1,0.95,0.507911075505708,0.4569020206021994,0.43131232261657715,0.4569020206021994
132,5,AdaBoost (Discrete),1,0.95,0.483276587222111,0.48579251235185555,58.08305835723877,0.48579251235185555
133,5,AdaBoost (Real),1,0.95,0.47005808131383936,0.47229798662249,65.04869532585144,0.47229798662249
134,5,Logistic Regression (Penalty = L2),1,0.95,0.4932906068495894,0.47955722608516865,0.21660161018371582,0.47955722608516865
135,5,Naive Bayes,1,0.95,0.5081113558982575,0.4710614615011582,0.0965125560760498,0.4710614615011582
136,5,KNeighbors Classifier,2,0.95,0.4528339675545764,0.41484143043978533,3.2940564155578613,0.41484143043978533
137,5,SVC Classifier,2,0.95,0.5513719206889646,0.021124141684149264,30.030203819274902,0.021124141684149264
138,5,Decision Tree,2,0.95,0.5049068696174644,0.47389376847472475,0.1011660099029541,0.47389376847472475
139,5,RandomForest,2,0.95,0.5549769677548568,0.44505171709993463,0.33637499809265137,0.44505171709993463
140,5,AdaBoost (Discrete),2,0.95,0.4696575205287402,0.4447535923580409,59.04385495185852,0.4447535923580409
141,5,AdaBoost (Real),2,0.95,0.4834768676146605,0.4488482748368073,65.4427707195282,0.4488482748368073
142,5,Logistic Regression (Penalty = L2),2,0.95,0.5269377127979171,0.3106737495473082,0.24483799934387207,0.3106737495473082
143,5,Naive Bayes,2,0.95,0.4077708792309233,0.1639807825052013,0.08788633346557617,0.1639807825052013
144,6,KNeighbors Classifier,0,0.95,0.5382458950740889,0.539627169011434,3.8514530658721924,0.539627169011434
145,6,SVC Classifier,0,0.95,0.55126151381658,1.0,40.997196435928345,0.0
146,6,Decision Tree,0,0.95,0.5510612735282339,0.5539710376055847,0.15478229522705078,0.5539710376055847
147,6,RandomForest,0,0.95,0.4981978374048859,0.4963578592161119,0.37398242950439453,0.4963578592161119
148,6,AdaBoost (Discrete),0,0.95,0.4695634761714057,0.43463309167572894,57.4782190322876,0.43463309167572894
149,6,AdaBoost (Real),0,0.95,0.5238285943131759,0.5195742658723117,61.60372543334961,0.5195742658723117
150,6,Logistic Regression (Penalty = L2),0,0.95,0.5462555066079295,0.518683938076363,0.19342422485351562,0.518683938076363
151,6,Naive Bayes,0,0.95,0.46936323588305967,0.2345117977209361,0.09978508949279785,0.2345117977209361
152,6,KNeighbors Classifier,1,0.95,0.47466453034247946,0.47610852452737285,4.892172336578369,0.47610852452737285
153,6,SVC Classifier,1,0.95,0.5509713599038654,0.9996366279069767,31.169726371765137,0.0
154,6,Decision Tree,1,0.95,0.46324854796715403,0.46539391399080965,0.1586449146270752,0.46539391399080965
155,6,RandomForest,1,0.95,0.44882835970358503,0.4400530419645167,0.37978124618530273,0.4400530419645167
156,6,AdaBoost (Discrete),1,0.95,0.49769677548568,0.5002344100436813,52.64899802207947,0.5002344100436813
157,6,AdaBoost (Real),1,0.95,0.49108752253154414,0.49367171852084096,55.41828513145447,0.49367171852084096
158,6,Logistic Regression (Penalty = L2),1,0.95,0.5291407971159624,0.5127016510013499,0.15474462509155273,0.5127016510013499
159,6,Naive Bayes,1,0.95,0.5505707991187663,0.12924430456643043,0.06285881996154785,0.12924430456643043
160,6,KNeighbors Classifier,2,0.95,0.4554376126577208,0.4248162034945866,2.7638227939605713,0.4248162034945866
161,6,SVC Classifier,2,0.95,0.5513719206889646,0.021124141684149264,27.385112762451172,0.021124141684149264
162,6,Decision Tree,2,0.95,0.5033046264770679,0.49803773445837307,0.13576173782348633,0.49803773445837307
163,6,RandomForest,2,0.95,0.5848187462447426,0.3538147084545907,0.3710193634033203,0.3538147084545907
164,6,AdaBoost (Discrete),2,0.95,0.5463649108752253,0.5159072089320466,47.3640501499176,0.5159072089320466
165,6,AdaBoost (Real),2,0.95,0.5231323853394753,0.49249528094780837,49.213011026382446,0.49249528094780837
166,6,Logistic Regression (Penalty = L2),2,0.95,0.533947526537152,0.30668228866735747,0.1409614086151123,0.30668228866735747
167,6,Naive Bayes,2,0.95,0.40997396354896853,0.1412638236290425,0.04977774620056152,0.1412638236290425
168,7,KNeighbors Classifier,0,0.95,0.5162194633560272,0.5159278714188087,2.803046226501465,0.5159278714188087
169,7,SVC Classifier,0,0.95,0.55126151381658,1.0,23.23949933052063,0.0
170,7,Decision Tree,0,0.95,0.5150180216259511,0.5155989890293208,0.11162614822387695,0.5155989890293208
171,7,RandomForest,0,0.95,0.4981978374048859,0.4963578592161119,0.26280641555786133,0.4963578592161119
172,7,AdaBoost (Discrete),0,0.95,0.44973968762515015,0.41080561583325403,42.45069932937622,0.41080561583325403
173,7,AdaBoost (Real),0,0.95,0.43832599118942733,0.4114935509967872,48.127028465270996,0.4114935509967872
174,7,Logistic Regression (Penalty = L2),0,0.95,0.5448538245895074,0.5225929500950333,0.14161014556884766,0.5225929500950333
175,7,Naive Bayes,0,0.95,0.4036844213055667,0.37749474836241376,0.03710198402404785,0.37749474836241376
176,7,KNeighbors Classifier,1,0.95,0.42819947927097934,0.4276472928980913,3.106741189956665,0.4276472928980913
177,7,SVC Classifier,1,0.95,0.5509713599038654,0.9996366279069767,23.325321674346924,0.0
178,7,Decision Tree,1,0.95,0.4636491087522532,0.4655409192525628,0.08721756935119629,0.4655409192525628
179,7,RandomForest,1,0.95,0.45123172441417986,0.4448388953885121,0.23796343803405762,0.4448388953885121
180,7,AdaBoost (Discrete),1,0.95,0.4834768676146605,0.48586860798435055,40.98929691314697,0.48586860798435055
181,7,AdaBoost (Real),1,0.95,0.4764670538754256,0.478924188055252,46.96167969703674,0.478924188055252
182,7,Logistic Regression (Penalty = L2),1,0.95,0.4772681754456239,0.4624397877214189,0.13380765914916992,0.4624397877214189
183,7,Naive Bayes,1,0.95,0.5081113558982575,0.47657079136978675,0.07424402236938477,0.47657079136978675
184,7,KNeighbors Classifier,2,0.95,0.4418185459643501,0.3870561044688483,2.6149046421051025,0.3870561044688483
185,7,SVC Classifier,2,0.95,0.5513719206889646,0.021124141684149264,20.180269479751587,0.021124141684149264
186,7,Decision Tree,2,0.95,0.46685359503304624,0.44834766176566204,0.0941007137298584,0.44834766176566204
187,7,RandomForest,2,0.95,0.5806128580012017,0.3392595112459785,0.22348999977111816,0.3392595112459785
188,7,AdaBoost (Discrete),2,0.95,0.45503705187262167,0.4315143163820595,37.47334814071655,0.4315143163820595
189,7,AdaBoost (Real),2,0.95,0.4822751852593631,0.4490324755149912,43.107627153396606,0.4490324755149912
190,7,Logistic Regression (Penalty = L2),2,0.95,0.5165231323853394,0.24381907078307785,0.15215325355529785,0.24381907078307785
191,7,Naive Bayes,2,0.95,0.392549569397156,0.15893737627741955,0.0456240177154541,0.15893737627741955
192,8,KNeighbors Classifier,0,0.95,0.5408490188225871,0.5432036999577462,1.9198882579803467,0.5432036999577462
193,8,SVC Classifier,0,0.95,0.55126151381658,1.0,19.98644709587097,0.0
194,8,Decision Tree,0,0.95,0.5032038446135363,0.5032583415154354,0.09915351867675781,0.5032583415154354
195,8,RandomForest,0,0.95,0.4973968762515018,0.4893791277447358,0.25641870498657227,0.4893791277447358
196,8,AdaBoost (Discrete),0,0.95,0.4697637164597517,0.44306221365171533,34.640132427215576,0.44306221365171533
197,8,AdaBoost (Real),0,0.95,0.48658390068081697,0.46341295614344197,39.283881187438965,0.46341295614344197
198,8,Logistic Regression (Penalty = L2),0,0.95,0.552462955546656,0.5260414277090943,0.12911725044250488,0.5260414277090943
199,8,Naive Bayes,0,0.95,0.4667601121345615,0.22223048857681255,0.060415029525756836,0.22223048857681255
200,8,KNeighbors Classifier,1,0.95,0.4888844382134989,0.4914254180467712,2.903587818145752,0.4914254180467712
201,8,SVC Classifier,1,0.95,0.5509713599038654,0.9996366279069767,18.5994610786438,0.0
202,8,Decision Tree,1,0.95,0.47546565191267776,0.47783276291022575,0.13227224349975586,0.47783276291022575
203,8,RandomForest,1,0.95,0.5055077107951131,0.25333613522313436,0.13356733322143555,0.25333613522313436
204,8,AdaBoost (Discrete),1,0.95,0.4926897656719407,0.4952898114673657,28.899172067642212,0.4952898114673657
205,8,AdaBoost (Real),1,0.95,0.5027037852994192,0.5053302324993398,33.40469932556152,0.5053302324993398
206,8,Logistic Regression (Penalty = L2),1,0.95,0.522331263769277,0.47702836138282984,0.10762429237365723,0.47702836138282984
207,8,Naive Bayes,1,0.95,0.5287402363308632,0.5207097624338911,0.04444098472595215,0.5207097624338911
208,8,KNeighbors Classifier,2,0.95,0.438614059683557,0.3990080256756936,1.8711652755737305,0.3990080256756936
209,8,SVC Classifier,2,0.95,0.5513719206889646,0.021124141684149264,14.993687152862549,0.021124141684149264
210,8,Decision Tree,2,0.95,0.5295413579010615,0.5068700067063694,0.07218647003173828,0.5068700067063694
211,8,RandomForest,2,0.95,0.5593831363909473,0.4416324271728367,0.12422513961791992,0.4416324271728367
212,8,AdaBoost (Discrete),2,0.95,0.5317444422191068,0.49923700124146414,25.9540433883667,0.49923700124146414
213,8,AdaBoost (Real),2,0.95,0.515321450030042,0.48902773948688316,29.144986152648926,0.48902773948688316
214,8,Logistic Regression (Penalty = L2),2,0.95,0.5373522932104947,0.2242007725819103,0.0803072452545166,0.2242007725819103
215,8,Naive Bayes,2,0.95,0.3993591027438414,0.1425862505970096,0.02563786506652832,0.1425862505970096
216,9,KNeighbors Classifier,0,0.95,0.5376451742090509,0.5386592562422295,1.406794786453247,0.5386592562422295
217,9,SVC Classifier,0,0.95,0.55126151381658,1.0,14.013617038726807,0.0
218,9,Decision Tree,0,0.95,0.49679615538646377,0.49907682423524474,0.11607503890991211,0.49907682423524474
219,9,RandomForest,0,0.95,0.4981978374048859,0.4963578592161119,0.14371180534362793,0.4963578592161119
220,9,AdaBoost (Discrete),0,0.95,0.4839807769323188,0.4549331740923419,23.154993534088135,0.4549331740923419
221,9,AdaBoost (Real),0,0.95,0.52663195835002,0.5173685227778235,26.706684827804565,0.5173685227778235
222,9,Logistic Regression (Penalty = L2),0,0.95,0.55126151381658,0.5305717465711277,0.14406800270080566,0.5305717465711277
223,9,Naive Bayes,0,0.95,0.5484581497797357,0.9949146385760989,0.06916475296020508,0.0
224,9,KNeighbors Classifier,1,0.95,0.45964350090126177,0.46160417224995787,2.21344256401062,0.46160417224995787
225,9,SVC Classifier,1,0.95,0.5509713599038654,0.9996366279069767,14.344142198562622,0.0
226,9,Decision Tree,1,0.95,0.4346084518325656,0.43690182347532025,0.06820368766784668,0.43690182347532025
227,9,RandomForest,1,0.95,0.4560384538353695,0.4494443060039026,0.14194202423095703,0.4494443060039026
228,9,AdaBoost (Discrete),1,0.95,0.4810735029040657,0.4823423376968122,21.2579607963562,0.4823423376968122
229,9,AdaBoost (Real),1,0.95,0.48527939114760665,0.48612584312802337,25.36751365661621,0.48612584312802337
230,9,Logistic Regression (Penalty = L2),1,0.95,0.5363508912477468,0.5100743847031783,0.08050990104675293,0.5100743847031783
231,9,Naive Bayes,1,0.95,0.5601842579611456,0.3666379035561173,0.03458833694458008,0.3666379035561173
232,9,KNeighbors Classifier,2,0.95,0.4207891047466453,0.38308781728083025,1.4187262058258057,0.38308781728083025
233,9,SVC Classifier,2,0.95,0.5513719206889646,0.021124141684149264,12.389567136764526,0.021124141684149264
234,9,Decision Tree,2,0.95,0.4822751852593631,0.46921715140014053,0.054953813552856445,0.46921715140014053
235,9,RandomForest,2,0.95,0.5806128580012017,0.3392595112459785,0.10864448547363281,0.3392595112459785
236,9,AdaBoost (Discrete),2,0.95,0.5085119166833567,0.48318000936840805,16.87390375137329,0.48318000936840805
237,9,AdaBoost (Real),2,0.95,0.5211295814139796,0.48497490041994745,18.99112367630005,0.48497490041994745
238,9,Logistic Regression (Penalty = L2),2,0.95,0.5369517324253955,0.23935914792994034,0.0802466869354248,0.23935914792994034
239,9,Naive Bayes,2,0.95,0.39295013018225516,0.1608408857586764,0.03408074378967285,0.1608408857586764
240,10,KNeighbors Classifier,0,0.95,0.5146175410492592,0.5154098613184495,1.3276724815368652,0.5154098613184495
241,10,SVC Classifier,0,0.95,0.55126151381658,1.0,9.231258392333984,0.0
242,10,Decision Tree,0,0.95,0.5558670404485383,0.5582892744259041,0.03495001792907715,0.5582892744259041
243,10,RandomForest,0,0.95,0.5298358029635563,0.5149664046790728,0.08915901184082031,0.5149664046790728
244,10,AdaBoost (Discrete),0,0.95,0.46896275530636766,0.44537776226873704,16.829230546951294,0.44537776226873704
245,10,AdaBoost (Real),0,0.95,0.4945935122146576,0.47868501610238884,18.99673581123352,0.47868501610238884
246,10,Logistic Regression (Penalty = L2),0,0.95,0.5406487785342411,0.5197271056887202,0.04760265350341797,0.5197271056887202
247,10,Naive Bayes,0,0.95,0.46876251501802163,0.22644995595286435,0.0223996639251709,0.22644995595286435
248,10,KNeighbors Classifier,1,0.95,0.44081714400160227,0.4426585331897457,2.300265073776245,0.4426585331897457
249,10,SVC Classifier,1,0.95,0.5509713599038654,0.9996366279069767,8.551110744476318,0.0
250,10,Decision Tree,1,0.95,0.4562387342279191,0.45754249252703943,0.0644693374633789,0.45754249252703943
251,10,RandomForest,1,0.95,0.5095133186461045,0.4200193559261955,0.07209467887878418,0.4200193559261955
252,10,AdaBoost (Discrete),1,0.95,0.47846985780092127,0.4781604520332152,15.999869346618652,0.4781604520332152
253,10,AdaBoost (Real),1,0.95,0.47386340877228117,0.47564512662199154,18.57033395767212,0.47564512662199154
254,10,Logistic Regression (Penalty = L2),1,0.95,0.4690566793510915,0.45022920349376694,0.05295586585998535,0.45022920349376694
255,10,Naive Bayes,1,0.95,0.5017023833366714,0.5042290769166725,0.026349544525146484,0.5042290769166725
256,10,KNeighbors Classifier,2,0.95,0.4233927498497897,0.37101333436249095,1.043997049331665,0.37101333436249095
257,10,SVC Classifier,2,0.95,0.5513719206889646,0.021124141684149264,8.474535942077637,0.021124141684149264
258,10,Decision Tree,2,0.95,0.4582415381534148,0.43576357008522176,0.032618045806884766,0.43576357008522176
259,10,RandomForest,2,0.95,0.5701982775886241,0.38726006697576243,0.06457018852233887,0.38726006697576243
260,10,AdaBoost (Discrete),2,0.95,0.4634488283597036,0.42678876830410734,15.201200246810913,0.42678876830410734
261,10,AdaBoost (Real),2,0.95,0.4902864009613459,0.4491516239348051,16.310823678970337,0.4491516239348051
262,10,Logistic Regression (Penalty = L2),2,0.95,0.5319447226116564,0.2559532148514081,0.04950737953186035,0.2559532148514081
263,10,Naive Bayes,2,0.95,0.4007610654916884,0.15006769743483475,0.030492544174194336,0.15006769743483475
264,11,KNeighbors Classifier,0,0.95,0.5146175410492592,0.5154098613184495,1.1443164348602295,0.5154098613184495
265,11,SVC Classifier,0,0.95,0.55126151381658,1.0,7.626886606216431,0.0
266,11,Decision Tree,0,0.95,0.5024028834601522,0.5031716950965277,0.05499076843261719,0.5031716950965277
267,11,RandomForest,0,0.95,0.5298358029635563,0.5149664046790728,0.07972955703735352,0.5149664046790728
268,11,AdaBoost (Discrete),0,0.95,0.46936323588305967,0.4459433215597815,14.010599374771118,0.4459433215597815
269,11,AdaBoost (Real),0,0.95,0.4945935122146576,0.47868501610238884,14.796401977539062,0.47868501610238884
270,11,Logistic Regression (Penalty = L2),0,0.95,0.5406487785342411,0.5197271056887202,0.07410216331481934,0.5197271056887202
271,11,Naive Bayes,0,0.95,0.46876251501802163,0.22644995595286435,0.014373540878295898,0.22644995595286435
272,11,KNeighbors Classifier,1,0.95,0.44081714400160227,0.4426585331897457,1.4700419902801514,0.4426585331897457
273,11,SVC Classifier,1,0.95,0.5509713599038654,0.9996366279069767,6.977405786514282,0.0
274,11,Decision Tree,1,0.95,0.464650510715001,0.4662999399623635,0.036818742752075195,0.4662999399623635
275,11,RandomForest,1,0.95,0.5095133186461045,0.4200193559261955,0.09363579750061035,0.4200193559261955
276,11,AdaBoost (Discrete),1,0.95,0.47846985780092127,0.4781604520332152,14.549460172653198,0.4781604520332152
277,11,AdaBoost (Real),1,0.95,0.47386340877228117,0.47564512662199154,15.113113403320312,0.47564512662199154
278,11,Logistic Regression (Penalty = L2),1,0.95,0.4690566793510915,0.45022920349376694,0.040633440017700195,0.45022920349376694
279,11,Naive Bayes,1,0.95,0.5017023833366714,0.5042290769166725,0.013580799102783203,0.5042290769166725
280,11,KNeighbors Classifier,2,0.95,0.4233927498497897,0.37101333436249095,1.208298921585083,0.37101333436249095
281,11,SVC Classifier,2,0.95,0.5513719206889646,0.021124141684149264,8.207390546798706,0.021124141684149264
282,11,Decision Tree,2,0.95,0.5513719206889646,0.5293118852665571,0.04553580284118652,0.5293118852665571
283,11,RandomForest,2,0.95,0.5701982775886241,0.38726006697576243,0.13276910781860352,0.38726006697576243
284,11,AdaBoost (Discrete),2,0.95,0.4634488283597036,0.42678876830410734,13.962613582611084,0.42678876830410734
285,11,AdaBoost (Real),2,0.95,0.4902864009613459,0.4491516239348051,14.33522629737854,0.4491516239348051
286,11,Logistic Regression (Penalty = L2),2,0.95,0.5319447226116564,0.2559532148514081,0.057359933853149414,0.2559532148514081
287,11,Naive Bayes,2,0.95,0.4007610654916884,0.15006769743483475,0.022295475006103516,0.15006769743483475
288,12,KNeighbors Classifier,0,0.95,0.5470564677613136,0.5491248246300999,0.4881775379180908,0.5491248246300999
289,12,SVC Classifier,0,0.95,0.55126151381658,1.0,7.852320432662964,0.0
290,12,Decision Tree,0,0.95,0.5482579094913896,0.5509498161652793,0.036722660064697266,0.5509498161652793
291,12,RandomForest,0,0.95,0.4933920704845815,0.4959336455957814,0.08370304107666016,0.4959336455957814
292,12,AdaBoost (Discrete),0,0.95,0.47857428914697636,0.4461833309510602,9.996209383010864,0.4461833309510602
293,12,AdaBoost (Real),0,0.95,0.4959951942330797,0.48042924453549096,11.266063451766968,0.48042924453549096
294,12,Logistic Regression (Penalty = L2),0,0.95,0.5488586303564277,0.5266856382385938,0.04595375061035156,0.5266856382385938
295,12,Naive Bayes,0,0.95,0.55126151381658,1.0,0.028711557388305664,0.0
296,12,KNeighbors Classifier,1,0.95,0.46164630482675745,0.46405584298677655,0.6370301246643066,0.46405584298677655
297,12,SVC Classifier,1,0.95,0.5509713599038654,0.9996366279069767,7.620528936386108,0.0
298,12,Decision Tree,1,0.95,0.48608051271780495,0.4883322726564282,0.033895254135131836,0.4883322726564282
299,12,RandomForest,1,0.95,0.46685359503304624,0.40811283024425593,0.07547879219055176,0.40811283024425593
300,12,AdaBoost (Discrete),1,0.95,0.5197276186661326,0.5221773310210066,9.966610431671143,0.5221773310210066
301,12,AdaBoost (Real),1,0.95,0.5081113558982575,0.5100481581441973,11.27195143699646,0.5100481581441973
302,12,Logistic Regression (Penalty = L2),1,0.95,0.5383536951732425,0.511231778870316,0.045104265213012695,0.511231778870316
303,12,Naive Bayes,1,0.95,0.5782094932906069,0.4385160396737505,0.020491600036621094,0.4385160396737505
304,12,KNeighbors Classifier,2,0.95,0.4680552773883437,0.43498649213763646,0.5370087623596191,0.43498649213763646
305,12,SVC Classifier,2,0.95,0.5513719206889646,0.021124141684149264,5.705522775650024,0.021124141684149264
306,12,Decision Tree,2,0.95,0.5185259363108352,0.5038813347919282,0.03394675254821777,0.5038813347919282
307,12,RandomForest,2,0.95,0.5830162227117965,0.3691567362666038,0.07254695892333984,0.3691567362666038
308,12,AdaBoost (Discrete),2,0.95,0.5027037852994192,0.47607446651568297,9.457679033279419,0.47607446651568297
309,12,AdaBoost (Real),2,0.95,0.5145203284598437,0.4880333424908934,11.279892444610596,0.4880333424908934
310,12,Logistic Regression (Penalty = L2),2,0.95,0.5277388343681153,0.2771019689172886,0.04807877540588379,0.2771019689172886
311,12,Naive Bayes,2,0.95,0.40877228119367115,0.15659250129182561,0.028086185455322266,0.15659250129182561
