,feat_set_id,classifier,fold_id,feat_th,score,geo_score,exec_t,geo_score_woz
0,0,KNeighbors Classifier,0,0.85,0.7714457108578284,0.7711685482250983,39.09293270111084,0.7711685482250983
1,0,SVC Classifier,0,0.85,0.8494301139772046,0.843480571669515,30.942795753479004,0.843480571669515
2,0,Decision Tree,0,0.85,0.7018596280743852,0.7014728582730162,0.7649729251861572,0.7014728582730162
3,0,RandomForest,0,0.85,0.7594481103779244,0.7408096380498803,2.227130889892578,0.7408096380498803
4,0,AdaBoost (Discrete),0,0.85,0.8326334733053389,0.8324436307012543,503.7572305202484,0.8324436307012543
5,0,AdaBoost (Real),0,0.85,0.8308338332333534,0.83005508401398,505.4301326274872,0.83005508401398
6,0,Logistic Regression (Penalty = L2),0,0.85,0.8674265146970606,0.8672648929884254,1.8223683834075928,0.8672648929884254
7,0,Naive Bayes,0,0.85,0.8008398320335933,0.7757503066734448,0.3159518241882324,0.7757503066734448
8,0,KNeighbors Classifier,1,0.85,0.7966406718656269,0.7962236451004125,33.75836968421936,0.7962236451004125
9,0,SVC Classifier,1,0.85,0.850629874025195,0.8459358539040502,24.89897847175598,0.8459358539040502
10,0,Decision Tree,1,0.85,0.7114577084583084,0.7112134268358405,0.7637248039245605,0.7112134268358405
11,0,RandomForest,1,0.85,0.7546490701859628,0.7494270931968566,1.9072937965393066,0.7494270931968566
12,0,AdaBoost (Discrete),1,0.85,0.826634673065387,0.8263097180893102,371.3533492088318,0.8263097180893102
13,0,AdaBoost (Real),1,0.85,0.823635272945411,0.8228186367186686,429.07736253738403,0.8228186367186686
14,0,Logistic Regression (Penalty = L2),1,0.85,0.8560287942411517,0.8560207151149859,1.5822298526763916,0.8560207151149859
15,0,Naive Bayes,1,0.85,0.7954409118176364,0.7706282349680887,0.3556382656097412,0.7706282349680887
16,0,KNeighbors Classifier,2,0.85,0.801920768307323,0.8015519789383924,23.80158829689026,0.8015519789383924
17,0,SVC Classifier,2,0.85,0.8613445378151261,0.8557367279996166,20.547520399093628,0.8557367279996166
18,0,Decision Tree,2,0.85,0.7334933973589436,0.7331973141331376,0.5656278133392334,0.7331973141331376
19,0,RandomForest,2,0.85,0.7791116446578632,0.7581327031541765,1.4639391899108887,0.7581327031541765
20,0,AdaBoost (Discrete),2,0.85,0.8547418967587035,0.8541208670913708,389.04438400268555,0.8541208670913708
21,0,AdaBoost (Real),2,0.85,0.851140456182473,0.8495580652754544,470.89942932128906,0.8495580652754544
22,0,Logistic Regression (Penalty = L2),2,0.85,0.8769507803121248,0.8769209943892243,0.04346966743469238,0.8769209943892243
23,0,Naive Bayes,2,0.85,0.8037214885954381,0.7768038088213817,0.010886192321777344,0.7768038088213817
24,1,KNeighbors Classifier,0,0.85,0.7834433113377325,0.7834097829092727,13.135630369186401,0.7834097829092727
25,1,SVC Classifier,0,0.85,0.8488302339532093,0.8429975660402234,30.48021173477173,0.8429975660402234
26,1,Decision Tree,0,0.85,0.7150569886022795,0.7149977641502655,0.9156181812286377,0.7149977641502655
27,1,RandomForest,0,0.85,0.7594481103779244,0.7408096380498803,2.0756640434265137,0.7408096380498803
28,1,AdaBoost (Discrete),0,0.85,0.8278344331133773,0.8278601124099123,429.47290110588074,0.8278601124099123
29,1,AdaBoost (Real),0,0.85,0.8224355128974206,0.8221143484311869,489.41759729385376,0.8221143484311869
30,1,Logistic Regression (Penalty = L2),0,0.85,0.8680263947210558,0.8678329230641623,4.295229911804199,0.8678329230641623
31,1,Naive Bayes,0,0.85,0.8002399520095981,0.7748816045955451,0.8036637306213379,0.7748816045955451
32,1,KNeighbors Classifier,1,0.85,0.7918416316736653,0.7916360017397218,43.14097046852112,0.7916360017397218
33,1,SVC Classifier,1,0.85,0.8464307138572286,0.8411700817497771,28.000690937042236,0.8411700817497771
34,1,Decision Tree,1,0.85,0.7198560287942412,0.7195754969251255,1.2585334777832031,0.7195754969251255
35,1,RandomForest,1,0.85,0.7546490701859628,0.7494270931968566,0.47656726837158203,0.7494270931968566
36,1,AdaBoost (Discrete),1,0.85,0.826634673065387,0.8263395593669437,516.2060034275055,0.8263395593669437
37,1,AdaBoost (Real),1,0.85,0.8146370725854829,0.8139639258627951,562.3028836250305,0.8139639258627951
38,1,Logistic Regression (Penalty = L2),1,0.85,0.8608278344331134,0.860824154263653,2.109894037246704,0.860824154263653
39,1,Naive Bayes,1,0.85,0.7960407918416317,0.7718607264120017,0.47572851181030273,0.7718607264120017
40,1,KNeighbors Classifier,2,0.85,0.7929171668667467,0.7920768858132659,43.44483709335327,0.7920768858132659
41,1,SVC Classifier,2,0.85,0.8595438175270108,0.8536080208787139,34.43002724647522,0.8536080208787139
42,1,Decision Tree,2,0.85,0.7256902761104442,0.7251030382601549,0.9694557189941406,0.7251030382601549
43,1,RandomForest,2,0.85,0.7791116446578632,0.7581327031541765,2.3181726932525635,0.7581327031541765
44,1,AdaBoost (Discrete),2,0.85,0.8589435774309724,0.8584805053650815,506.1983404159546,0.8584805053650815
45,1,AdaBoost (Real),2,0.85,0.8499399759903962,0.8480273822084574,516.9645528793335,0.8480273822084574
46,1,Logistic Regression (Penalty = L2),2,0.85,0.8751500600240096,0.8750989054809274,2.2228615283966064,0.8750989054809274
47,1,Naive Bayes,2,0.85,0.8043217286914766,0.7773004865838282,0.5034794807434082,0.7773004865838282
48,2,KNeighbors Classifier,0,0.85,0.7786442711457708,0.7786080542555291,44.22524285316467,0.7786080542555291
49,2,SVC Classifier,0,0.85,0.8458308338332333,0.8399018050046198,36.24815058708191,0.8399018050046198
50,2,Decision Tree,0,0.85,0.6946610677864428,0.6935517428805257,0.7686560153961182,0.6935517428805257
51,2,RandomForest,0,0.85,0.7594481103779244,0.7408096380498803,2.2596943378448486,0.7408096380498803
52,2,AdaBoost (Discrete),0,0.85,0.826634673065387,0.8265899180830104,494.4592559337616,0.8265899180830104
53,2,AdaBoost (Real),0,0.85,0.829634073185363,0.828817780437867,507.137734413147,0.828817780437867
54,2,Logistic Regression (Penalty = L2),0,0.85,0.8698260347930414,0.8697494899949233,1.8682880401611328,0.8697494899949233
55,2,Naive Bayes,0,0.85,0.7966406718656269,0.7704809452077205,0.42000699043273926,0.7704809452077205
56,2,KNeighbors Classifier,1,0.85,0.7696460707858428,0.7690724721436895,33.32688760757446,0.7690724721436895
57,2,SVC Classifier,1,0.85,0.8482303539292142,0.8429926824378763,27.25798773765564,0.8429926824378763
58,2,Decision Tree,1,0.85,0.7114577084583084,0.7114484534177253,0.814845085144043,0.7114484534177253
59,2,RandomForest,1,0.85,0.7546490701859628,0.7494270931968566,1.8735475540161133,0.7494270931968566
60,2,AdaBoost (Discrete),1,0.85,0.8182363527294542,0.8177036396756057,429.8922564983368,0.8177036396756057
61,2,AdaBoost (Real),1,0.85,0.8242351529694061,0.8240196372072317,1502.6685855388641,0.8240196372072317
62,2,Logistic Regression (Penalty = L2),1,0.85,0.8614277144571085,0.861417826282358,0.4950215816497803,0.861417826282358
63,2,Naive Bayes,1,0.85,0.7936412717456509,0.7702181998730272,0.42919182777404785,0.7702181998730272
64,2,KNeighbors Classifier,2,0.85,0.7989195678271308,0.7986226426744982,33.60017943382263,0.7986226426744982
65,2,SVC Classifier,2,0.85,0.8607442977190877,0.8548713685512321,22.689547538757324,0.8548713685512321
66,2,Decision Tree,2,0.85,0.6968787515006002,0.6967276157172738,0.6477916240692139,0.6967276157172738
67,2,RandomForest,2,0.85,0.776110444177671,0.7544734033560074,1.5726683139801025,0.7544734033560074
68,2,AdaBoost (Discrete),2,0.85,0.8517406962785115,0.8506235180682448,335.643239736557,0.8506235180682448
69,2,AdaBoost (Real),2,0.85,0.8433373349339736,0.8411897302432232,339.1621766090393,0.8411897302432232
70,2,Logistic Regression (Penalty = L2),2,0.85,0.8745498199279712,0.8745565330211508,1.2254469394683838,0.8745565330211508
71,2,Naive Bayes,2,0.85,0.8013205282112845,0.7732610136314434,0.3005943298339844,0.7732610136314434
72,3,KNeighbors Classifier,0,0.85,0.7858428314337133,0.785885186835325,22.532654285430908,0.785885186835325
73,3,SVC Classifier,0,0.85,0.847630473905219,0.8419802711267631,18.407413482666016,0.8419802711267631
74,3,Decision Tree,0,0.85,0.7288542291541692,0.7288109729895946,0.4188079833984375,0.7288109729895946
75,3,RandomForest,0,0.85,0.7486502699460108,0.7319072225579198,1.3491506576538086,0.7319072225579198
76,3,AdaBoost (Discrete),0,0.85,0.8344331133773245,0.8342935115195468,276.2912518978119,0.8342935115195468
77,3,AdaBoost (Real),0,0.85,0.8320335932813437,0.8313578776603413,298.8410964012146,0.8313578776603413
78,3,Logistic Regression (Penalty = L2),0,0.85,0.8698260347930414,0.8697336611145442,1.12260103225708,0.8697336611145442
79,3,Naive Bayes,0,0.85,0.7996400719856028,0.774393028422764,0.3063344955444336,0.774393028422764
80,3,KNeighbors Classifier,1,0.85,0.7930413917216557,0.7929607226084248,21.113167762756348,0.7929607226084248
81,3,SVC Classifier,1,0.85,0.8482303539292142,0.8431347212957254,18.075250148773193,0.8431347212957254
82,3,Decision Tree,1,0.85,0.7126574685062987,0.7124942043075316,0.48438143730163574,0.7124942043075316
83,3,RandomForest,1,0.85,0.7096580683863227,0.6768787855945018,1.1069226264953613,0.6768787855945018
84,3,AdaBoost (Discrete),1,0.85,0.8242351529694061,0.8238625650979946,256.3796305656433,0.8238625650979946
85,3,AdaBoost (Real),1,0.85,0.8158368326334733,0.8143755568007381,278.9992015361786,0.8143755568007381
86,3,Logistic Regression (Penalty = L2),1,0.85,0.8584283143371326,0.8584298227019526,1.0788369178771973,0.8584298227019526
87,3,Naive Bayes,1,0.85,0.7966406718656269,0.7727231413488156,0.2589151859283447,0.7727231413488156
88,3,KNeighbors Classifier,2,0.85,0.812124849939976,0.8113428161396902,19.86691951751709,0.8113428161396902
89,3,SVC Classifier,2,0.85,0.8601440576230492,0.8541580261989842,17.288142681121826,0.8541580261989842
90,3,Decision Tree,2,0.85,0.7346938775510204,0.7346479773587917,0.47719573974609375,0.7346479773587917
91,3,RandomForest,2,0.85,0.7376950780312125,0.7152342914304626,1.1339986324310303,0.7152342914304626
92,3,AdaBoost (Discrete),2,0.85,0.8541416566626651,0.8536857587971614,233.9362518787384,0.8536857587971614
93,3,AdaBoost (Real),2,0.85,0.8487394957983193,0.8471855964237646,231.26635551452637,0.8471855964237646
94,3,Logistic Regression (Penalty = L2),2,0.85,0.8745498199279712,0.8744789410285682,0.8971419334411621,0.8744789410285682
95,3,Naive Bayes,2,0.85,0.8055222088835534,0.7786754937122912,0.14568281173706055,0.7786754937122912
96,4,KNeighbors Classifier,0,0.85,0.7936412717456509,0.7936763545019159,14.809236764907837,0.7936763545019159
97,4,SVC Classifier,0,0.85,0.8494301139772046,0.8439320977546937,12.725224494934082,0.8439320977546937
98,4,Decision Tree,0,0.85,0.728254349130174,0.7280816126602169,0.32142138481140137,0.7280816126602169
99,4,RandomForest,0,0.85,0.7654469106178764,0.7618378498274366,0.9670126438140869,0.7618378498274366
100,4,AdaBoost (Discrete),0,0.85,0.8386322735452909,0.838389669033943,197.940749168396,0.838389669033943
101,4,AdaBoost (Real),0,0.85,0.826634673065387,0.8250197427323611,209.00306391716003,0.8250197427323611
102,4,Logistic Regression (Penalty = L2),0,0.85,0.8674265146970606,0.8673552227766934,0.8211705684661865,0.8673552227766934
103,4,Naive Bayes,0,0.85,0.7960407918416317,0.7696034035085103,0.16078591346740723,0.7696034035085103
104,4,KNeighbors Classifier,1,0.85,0.7930413917216557,0.7924691782601899,14.785403966903687,0.7924691782601899
105,4,SVC Classifier,1,0.85,0.8494301139772046,0.8442485068987983,14.268846035003662,0.8442485068987983
106,4,Decision Tree,1,0.85,0.710257948410318,0.709975146201529,0.44133996963500977,0.709975146201529
107,4,RandomForest,1,0.85,0.7558488302339532,0.7539602483076133,1.1435878276824951,0.7539602483076133
108,4,AdaBoost (Discrete),1,0.85,0.8380323935212958,0.8378581992168553,206.0304799079895,0.8378581992168553
109,4,AdaBoost (Real),1,0.85,0.826634673065387,0.8260278755269636,215.39650297164917,0.8260278755269636
110,4,Logistic Regression (Penalty = L2),1,0.85,0.865626874625075,0.8656141165653778,0.7063755989074707,0.8656141165653778
111,4,Naive Bayes,1,0.85,0.7948410317936413,0.7719317054089717,0.1576859951019287,0.7719317054089717
112,4,KNeighbors Classifier,2,0.85,0.7941176470588235,0.7938146297508941,14.273648738861084,0.7938146297508941
113,4,SVC Classifier,2,0.85,0.8619447779111644,0.8562902447956129,12.237915992736816,0.8562902447956129
114,4,Decision Tree,2,0.85,0.7106842737094838,0.7104561782172532,0.4225003719329834,0.7104561782172532
115,4,RandomForest,2,0.85,0.7947178871548619,0.7869252085596598,0.8366198539733887,0.7869252085596598
116,4,AdaBoost (Discrete),2,0.85,0.8427370948379351,0.8412182858327472,192.52506804466248,0.8412182858327472
117,4,AdaBoost (Real),2,0.85,0.8445378151260504,0.8419231207665282,215.5106270313263,0.8419231207665282
118,4,Logistic Regression (Penalty = L2),2,0.85,0.8721488595438175,0.872127238732942,0.8336484432220459,0.872127238732942
119,4,Naive Bayes,2,0.85,0.8013205282112845,0.7732610136314434,0.16611361503601074,0.7732610136314434
120,5,KNeighbors Classifier,0,0.85,0.7834433113377325,0.7834511749194549,15.884588956832886,0.7834511749194549
121,5,SVC Classifier,0,0.85,0.8494301139772046,0.843840563889355,13.087019681930542,0.843840563889355
122,5,Decision Tree,0,0.85,0.7222555488902219,0.7221721248178674,0.4118647575378418,0.7221721248178674
123,5,RandomForest,0,0.85,0.7540491901619676,0.7370207139217427,1.116102695465088,0.7370207139217427
124,5,AdaBoost (Discrete),0,0.85,0.8332333533293341,0.833090275505184,231.20469498634338,0.833090275505184
125,5,AdaBoost (Real),0,0.85,0.8302339532093581,0.8296409760282406,239.07081389427185,0.8296409760282406
126,5,Logistic Regression (Penalty = L2),0,0.85,0.8674265146970606,0.8673475823614186,0.8753728866577148,0.8673475823614186
127,5,Naive Bayes,0,0.85,0.7960407918416317,0.7696034035085103,0.23013544082641602,0.7696034035085103
128,5,KNeighbors Classifier,1,0.85,0.7810437912417516,0.7807856456329282,17.186185598373413,0.7807856456329282
129,5,SVC Classifier,1,0.85,0.8512297540491902,0.8456039667822473,14.41031289100647,0.8456039667822473
130,5,Decision Tree,1,0.85,0.7048590281943611,0.7048797527417148,0.506460428237915,0.7048797527417148
131,5,RandomForest,1,0.85,0.7600479904019196,0.7333367666721823,1.1080045700073242,0.7333367666721823
132,5,AdaBoost (Discrete),1,0.85,0.8278344331133773,0.8275284566320241,240.5804705619812,0.8275284566320241
133,5,AdaBoost (Real),1,0.85,0.8242351529694061,0.8238268923740995,255.803808927536,0.8238268923740995
134,5,Logistic Regression (Penalty = L2),1,0.85,0.8650269946010798,0.8650048949575135,1.003516435623169,0.8650048949575135
135,5,Naive Bayes,1,0.85,0.794241151769646,0.7710759045904783,0.18928003311157227,0.7710759045904783
136,5,KNeighbors Classifier,2,0.85,0.7971188475390156,0.7965206186877657,19.695597887039185,0.7965206186877657
137,5,SVC Classifier,2,0.85,0.8643457382953181,0.8594078421489946,16.22764253616333,0.8594078421489946
138,5,Decision Tree,2,0.85,0.723889555822329,0.7238917741398272,0.5537457466125488,0.7238917741398272
139,5,RandomForest,2,0.85,0.7809123649459784,0.755239846577235,1.3457727432250977,0.755239846577235
140,5,AdaBoost (Discrete),2,0.85,0.8577430972388955,0.857174922351015,242.2152030467987,0.857174922351015
141,5,AdaBoost (Real),2,0.85,0.8475390156062425,0.8456483900386742,258.30962562561035,0.8456483900386742
142,5,Logistic Regression (Penalty = L2),2,0.85,0.8709483793517407,0.8709399927570879,1.0071136951446533,0.8709399927570879
143,5,Naive Bayes,2,0.85,0.8001200480192077,0.7718804781970482,0.2974271774291992,0.7718804781970482
144,6,KNeighbors Classifier,0,0.85,0.7780443911217756,0.7779742187770203,23.10961389541626,0.7779742187770203
145,6,SVC Classifier,0,0.85,0.8482303539292142,0.8421470538489312,18.180355072021484,0.8421470538489312
146,6,Decision Tree,0,0.85,0.7150569886022795,0.7148525739019039,0.5517609119415283,0.7148525739019039
147,6,RandomForest,0,0.85,0.7804439112177565,0.7759949472814207,1.0853888988494873,0.7759949472814207
148,6,AdaBoost (Discrete),0,0.85,0.8368326334733054,0.8368161313170908,280.28125858306885,0.8368161313170908
149,6,AdaBoost (Real),0,0.85,0.8290341931613677,0.8286588321437284,292.20087575912476,0.8286588321437284
150,6,Logistic Regression (Penalty = L2),0,0.85,0.865626874625075,0.8654002372377272,1.0080475807189941,0.8654002372377272
151,6,Naive Bayes,0,0.85,0.7984403119376124,0.7729938520271561,0.3468804359436035,0.7729938520271561
152,6,KNeighbors Classifier,1,0.85,0.7990401919616077,0.798705501249375,21.92716121673584,0.798705501249375
153,6,SVC Classifier,1,0.85,0.8470305938812237,0.8421679258122147,18.00802755355835,0.8421679258122147
154,6,Decision Tree,1,0.85,0.6976604679064187,0.6971409613442683,0.5273430347442627,0.6971409613442683
155,6,RandomForest,1,0.85,0.7648470305938813,0.7577629519291468,1.0896830558776855,0.7577629519291468
156,6,AdaBoost (Discrete),1,0.85,0.829634073185363,0.8295072348023632,261.54385638237,0.8295072348023632
157,6,AdaBoost (Real),1,0.85,0.8326334733053389,0.8323354891138415,267.16382360458374,0.8323354891138415
158,6,Logistic Regression (Penalty = L2),1,0.85,0.8608278344331134,0.8608355531904567,1.1872496604919434,0.8608355531904567
159,6,Naive Bayes,1,0.85,0.7948410317936413,0.7701300911738364,0.2241957187652588,0.7701300911738364
160,6,KNeighbors Classifier,2,0.85,0.7869147659063626,0.7864126004393206,20.349501132965088,0.7864126004393206
161,6,SVC Classifier,2,0.85,0.8577430972388955,0.8517937939502789,16.15576696395874,0.8517937939502789
162,6,Decision Tree,2,0.85,0.7076830732292917,0.706841792510716,0.44443535804748535,0.706841792510716
163,6,RandomForest,2,0.85,0.7911164465786314,0.7814335920117124,1.1093978881835938,0.7814335920117124
164,6,AdaBoost (Discrete),2,0.85,0.8541416566626651,0.8532352378141449,254.6168134212494,0.8532352378141449
165,6,AdaBoost (Real),2,0.85,0.8457382953181273,0.8436722206071141,259.4239854812622,0.8436722206071141
166,6,Logistic Regression (Penalty = L2),2,0.85,0.8751500600240096,0.875075335063013,1.010159969329834,0.875075335063013
167,6,Naive Bayes,2,0.85,0.8037214885954381,0.776418192424226,0.21099090576171875,0.776418192424226
168,7,KNeighbors Classifier,0,0.85,0.7840431913617276,0.7837489203171676,22.561221599578857,0.7837489203171676
169,7,SVC Classifier,0,0.85,0.8458308338332333,0.8395894872696271,18.461188554763794,0.8395894872696271
170,7,Decision Tree,0,0.85,0.6946610677864428,0.694689222682756,0.5007243156433105,0.694689222682756
171,7,RandomForest,0,0.85,0.7828434313137372,0.7794595578970417,0.9987301826477051,0.7794595578970417
172,7,AdaBoost (Discrete),0,0.85,0.8392321535692862,0.8392505192319132,261.150089263916,0.8392505192319132
173,7,AdaBoost (Real),0,0.85,0.8290341931613677,0.8287293110827385,251.62688827514648,0.8287293110827385
174,7,Logistic Regression (Penalty = L2),0,0.85,0.8674265146970606,0.8672644951320224,1.0423622131347656,0.8672644951320224
175,7,Naive Bayes,0,0.85,0.8002399520095981,0.7748816045955451,0.18041133880615234,0.7748816045955451
176,7,KNeighbors Classifier,1,0.85,0.7756448710257948,0.7753556022946306,18.569441080093384,0.7753556022946306
177,7,SVC Classifier,1,0.85,0.847630473905219,0.8428739984266588,15.547477722167969,0.8428739984266588
178,7,Decision Tree,1,0.85,0.7138572285542891,0.7137582645768636,0.43865108489990234,0.7137582645768636
179,7,RandomForest,1,0.85,0.7558488302339532,0.7508261666234098,0.8200058937072754,0.7508261666234098
180,7,AdaBoost (Discrete),1,0.85,0.8302339532093581,0.8299229206874323,223.8459029197693,0.8299229206874323
181,7,AdaBoost (Real),1,0.85,0.8206358728254349,0.8200174271556883,251.46673798561096,0.8200174271556883
182,7,Logistic Regression (Penalty = L2),1,0.85,0.8554289142171566,0.8553940078212201,0.9135410785675049,0.8553940078212201
183,7,Naive Bayes,1,0.85,0.7960407918416317,0.7722216985465098,0.192946195602417,0.7722216985465098
184,7,KNeighbors Classifier,2,0.85,0.7881152460984394,0.7878673849869081,18.770024061203003,0.7878673849869081
185,7,SVC Classifier,2,0.85,0.8601440576230492,0.8543187689347056,14.865070581436157,0.8543187689347056
186,7,Decision Tree,2,0.85,0.7160864345738295,0.7156935322372212,0.4862840175628662,0.7156935322372212
187,7,RandomForest,2,0.85,0.7971188475390156,0.7907648114446229,0.8920304775238037,0.7907648114446229
188,7,AdaBoost (Discrete),2,0.85,0.858343337334934,0.8579666129066809,219.07556653022766,0.8579666129066809
189,7,AdaBoost (Real),2,0.85,0.8469387755102041,0.8454241672598407,216.57061457633972,0.8454241672598407
190,7,Logistic Regression (Penalty = L2),2,0.85,0.8739495798319328,0.873930132505624,0.9377317428588867,0.873930132505624
191,7,Naive Bayes,2,0.85,0.8055222088835534,0.7779008581081963,0.21180033683776855,0.7779008581081963
192,8,KNeighbors Classifier,0,0.85,0.7924415116976604,0.7923750764637155,11.390987157821655,0.7923750764637155
193,8,SVC Classifier,0,0.85,0.8482303539292142,0.8427116788440391,9.648228168487549,0.8427116788440391
194,8,Decision Tree,0,0.85,0.7204559088182364,0.7204601164509842,0.28186774253845215,0.7204601164509842
195,8,RandomForest,0,0.85,0.7828434313137372,0.7646143427310953,0.7412369251251221,0.7646143427310953
196,8,AdaBoost (Discrete),0,0.85,0.8338332333533294,0.8333830162412225,155.26661014556885,0.8333830162412225
197,8,AdaBoost (Real),0,0.85,0.8188362327534493,0.8165390826623513,161.92976188659668,0.8165390826623513
198,8,Logistic Regression (Penalty = L2),0,0.85,0.8674265146970606,0.8673552227766934,0.6283106803894043,0.8673552227766934
199,8,Naive Bayes,0,0.85,0.7966406718656269,0.7704809452077205,0.14457178115844727,0.7704809452077205
200,8,KNeighbors Classifier,1,0.85,0.7876424715056989,0.7871733816618243,10.70928692817688,0.7871733816618243
201,8,SVC Classifier,1,0.85,0.850629874025195,0.8452081793080166,8.813104629516602,0.8452081793080166
202,8,Decision Tree,1,0.85,0.713257348530294,0.7129558409122353,0.26861572265625,0.7129558409122353
203,8,RandomForest,1,0.85,0.7258548290341932,0.6945552834805961,0.6752715110778809,0.6945552834805961
204,8,AdaBoost (Discrete),1,0.85,0.8224355128974206,0.8222663986397307,140.31465482711792,0.8222663986397307
205,8,AdaBoost (Real),1,0.85,0.8194361127774445,0.8188126712058043,148.70833683013916,0.8188126712058043
206,8,Logistic Regression (Penalty = L2),1,0.85,0.8662267546490702,0.8662237041728821,0.535142183303833,0.8662237041728821
207,8,Naive Bayes,1,0.85,0.7954409118176364,0.772785612858957,0.1333332061767578,0.772785612858957
208,8,KNeighbors Classifier,2,0.85,0.804921968787515,0.8044005763905646,8.887336015701294,0.8044005763905646
209,8,SVC Classifier,2,0.85,0.8625450180072028,0.8569957813517683,7.4173970222473145,0.8569957813517683
210,8,Decision Tree,2,0.85,0.7509003601440576,0.7509186010038181,0.23415684700012207,0.7509186010038181
211,8,RandomForest,2,0.85,0.7478991596638656,0.7205036729521319,0.6654098033905029,0.7205036729521319
212,8,AdaBoost (Discrete),2,0.85,0.8433373349339736,0.8415928722645736,128.96592617034912,0.8415928722645736
213,8,AdaBoost (Real),2,0.85,0.8385354141656662,0.8365109475508413,142.08172082901,0.8365109475508413
214,8,Logistic Regression (Penalty = L2),2,0.85,0.8733493397358943,0.8733120701595996,0.5696020126342773,0.8733120701595996
215,8,Naive Bayes,2,0.85,0.8013205282112845,0.7736569642748145,0.10042309761047363,0.7736569642748145
