,feat_set_id,classifier,fold_id,feat_th,score,geo_score,exec_t,geo_score_woz
0,0,KNeighbors Classifier,0,0.3,0.7547961630695443,0.7524653198575568,0.6205573081970215,0.7524653198575568
1,0,SVC Classifier,0,0.3,0.7721822541966427,0.7363583374669482,2.5780704021453857,0.7363583374669482
2,0,Decision Tree,0,0.3,0.7170263788968825,0.7158429657234534,0.08097410202026367,0.7158429657234534
3,0,RandomForest,0,0.3,0.736810551558753,0.712211315402784,0.3110344409942627,0.712211315402784
4,0,AdaBoost (Discrete),0,0.3,0.7266187050359713,0.7155989566735315,31.598799228668213,0.7155989566735315
5,0,AdaBoost (Real),0,0.3,0.7254196642685852,0.7126914331112766,35.235477924346924,0.7126914331112766
6,0,Logistic Regression (Penalty = L2),0,0.3,0.8099520383693045,0.807671590962336,0.2000269889831543,0.807671590962336
7,0,Naive Bayes,0,0.3,0.7517985611510791,0.7013914970032498,0.03466200828552246,0.7013914970032498
8,0,KNeighbors Classifier,1,0.3,0.7533013205282113,0.7521531326910471,0.6184525489807129,0.7521531326910471
9,0,SVC Classifier,1,0.3,0.7653061224489796,0.7294418197085748,2.720010757446289,0.7294418197085748
10,0,Decision Tree,1,0.3,0.7154861944777912,0.7153321954895183,0.08205628395080566,0.7153321954895183
11,0,RandomForest,1,0.3,0.7262905162064826,0.6912812756797104,0.27819037437438965,0.6912812756797104
12,0,AdaBoost (Discrete),1,0.3,0.737094837935174,0.735650363823871,41.462422370910645,0.735650363823871
13,0,AdaBoost (Real),1,0.3,0.748499399759904,0.7481953681281861,52.459248304367065,0.7481953681281861
14,0,Logistic Regression (Penalty = L2),1,0.3,0.7887154861944778,0.7864880928643394,0.2599773406982422,0.7864880928643394
15,0,Naive Bayes,1,0.3,0.7533013205282113,0.708296908487096,0.08073234558105469,0.708296908487096
16,0,KNeighbors Classifier,2,0.3,0.7563025210084033,0.7535125523327119,0.7291135787963867,0.7535125523327119
17,0,SVC Classifier,2,0.3,0.7677070828331333,0.7269120913812991,3.4629385471343994,0.7269120913812991
18,0,Decision Tree,2,0.3,0.698079231692677,0.6944458308980526,0.10683393478393555,0.6944458308980526
19,0,RandomForest,2,0.3,0.7166866746698679,0.6793086181743532,0.39279747009277344,0.6793086181743532
20,0,AdaBoost (Discrete),2,0.3,0.7539015606242497,0.7532708496452852,42.17038536071777,0.7532708496452852
21,0,AdaBoost (Real),2,0.3,0.7575030012004802,0.7530305092062102,46.60414981842041,0.7530305092062102
22,0,Logistic Regression (Penalty = L2),2,0.3,0.8115246098439376,0.8081738545537015,0.23058152198791504,0.8081738545537015
23,0,Naive Bayes,2,0.3,0.7533013205282113,0.6991866835579018,0.07894182205200195,0.6991866835579018
24,1,KNeighbors Classifier,0,0.3,0.776378896882494,0.7740707287141292,0.7263977527618408,0.7740707287141292
25,1,SVC Classifier,0,0.3,0.802158273381295,0.7936299699511085,3.3246147632598877,0.7936299699511085
26,1,Decision Tree,0,0.3,0.7080335731414868,0.7075337922351235,0.10846781730651855,0.7075337922351235
27,1,RandomForest,0,0.3,0.7535971223021583,0.7408710091252323,0.3558366298675537,0.7408710091252323
28,1,AdaBoost (Discrete),0,0.3,0.7643884892086331,0.7635398971461448,38.83286714553833,0.7635398971461448
29,1,AdaBoost (Real),0,0.3,0.7476019184652278,0.7456115144905321,46.06991982460022,0.7456115144905321
30,1,Logistic Regression (Penalty = L2),0,0.3,0.8123501199040767,0.811054364470367,0.18371129035949707,0.811054364470367
31,1,Naive Bayes,0,0.3,0.7949640287769785,0.7857080890461955,0.056972503662109375,0.7857080890461955
32,1,KNeighbors Classifier,1,0.3,0.7581032412965186,0.7559872542616486,0.5269870758056641,0.7559872542616486
33,1,SVC Classifier,1,0.3,0.7863145258103241,0.7741391622282519,1.3050589561462402,0.7741391622282519
34,1,Decision Tree,1,0.3,0.723889555822329,0.7222120487818502,0.021198511123657227,0.7222120487818502
35,1,RandomForest,1,0.3,0.7376950780312125,0.7253679505173801,0.08871006965637207,0.7253679505173801
36,1,AdaBoost (Discrete),1,0.3,0.71968787515006,0.7191309748950854,27.59256911277771,0.7191309748950854
37,1,AdaBoost (Real),1,0.3,0.7322929171668667,0.728887963289536,46.42135572433472,0.728887963289536
38,1,Logistic Regression (Penalty = L2),1,0.3,0.8061224489795918,0.8044457166910834,0.219832181930542,0.8044457166910834
39,1,Naive Bayes,1,0.3,0.7779111644657863,0.7667103095420659,0.0660409927368164,0.7667103095420659
40,1,KNeighbors Classifier,2,0.3,0.7671068427370948,0.7657779081143449,0.6511580944061279,0.7657779081143449
41,1,SVC Classifier,2,0.3,0.7899159663865546,0.7762906905140406,3.498656988143921,0.7762906905140406
42,1,Decision Tree,2,0.3,0.6956782713085234,0.6939822531187365,0.10596227645874023,0.6939822531187365
43,1,RandomForest,2,0.3,0.7286914765906363,0.71164595773851,0.33254384994506836,0.71164595773851
44,1,AdaBoost (Discrete),2,0.3,0.751500600240096,0.7506599503355638,38.254961013793945,0.7506599503355638
45,1,AdaBoost (Real),2,0.3,0.7563025210084033,0.7560755026222036,46.8134388923645,0.7560755026222036
46,1,Logistic Regression (Penalty = L2),2,0.3,0.8097238895558223,0.8075220714859946,0.241288423538208,0.8075220714859946
47,1,Naive Bayes,2,0.3,0.7713085234093637,0.7580225851677613,0.08574080467224121,0.7580225851677613
48,2,KNeighbors Classifier,0,0.3,0.7583932853717026,0.7576529846462691,0.7603061199188232,0.7576529846462691
49,2,SVC Classifier,0,0.3,0.7955635491606715,0.7903374037199327,3.583076238632202,0.7903374037199327
50,2,Decision Tree,0,0.3,0.7038369304556354,0.7027083475388902,0.10853242874145508,0.7027083475388902
51,2,RandomForest,0,0.3,0.7721822541966427,0.768190379120954,0.3608717918395996,0.768190379120954
52,2,AdaBoost (Discrete),0,0.3,0.7320143884892086,0.731670819343153,38.32407474517822,0.731670819343153
53,2,AdaBoost (Real),0,0.3,0.7511990407673861,0.7511483367249934,45.636638879776,0.7511483367249934
54,2,Logistic Regression (Penalty = L2),0,0.3,0.7997601918465228,0.7991310535267999,0.20398402214050293,0.7991310535267999
55,2,Naive Bayes,0,0.3,0.7871702637889688,0.782451988058746,0.06800198554992676,0.782451988058746
56,2,KNeighbors Classifier,1,0.3,0.7454981992797118,0.7443694540373885,0.6947970390319824,0.7443694540373885
57,2,SVC Classifier,1,0.3,0.7917166866746699,0.784798230654928,3.6581966876983643,0.784798230654928
58,2,Decision Tree,1,0.3,0.6962785114045619,0.6957319480546154,0.10237693786621094,0.6957319480546154
59,2,RandomForest,1,0.3,0.7503001200480192,0.7477183793542483,0.32837629318237305,0.7477183793542483
60,2,AdaBoost (Discrete),1,0.3,0.7226890756302521,0.722507430368992,38.270402669906616,0.722507430368992
61,2,AdaBoost (Real),1,0.3,0.734093637454982,0.7337383434187593,45.67454981803894,0.7337383434187593
62,2,Logistic Regression (Penalty = L2),1,0.3,0.8025210084033614,0.8016673467342066,0.20340204238891602,0.8016673467342066
63,2,Naive Bayes,1,0.3,0.7827130852340937,0.7780675448583237,0.03952622413635254,0.7780675448583237
64,2,KNeighbors Classifier,2,0.3,0.7406962785114045,0.73922574916126,0.7818295955657959,0.73922574916126
65,2,SVC Classifier,2,0.3,0.7917166866746699,0.7840309891790334,3.6916584968566895,0.7840309891790334
66,2,Decision Tree,2,0.3,0.7058823529411765,0.7043602143402994,0.062357187271118164,0.7043602143402994
67,2,RandomForest,2,0.3,0.7569027611044418,0.7531888028548434,0.4126617908477783,0.7531888028548434
68,2,AdaBoost (Discrete),2,0.3,0.7376950780312125,0.7358983208736756,44.71411395072937,0.7358983208736756
69,2,AdaBoost (Real),2,0.3,0.7358943577430972,0.7328581280485748,61.37720823287964,0.7328581280485748
70,2,Logistic Regression (Penalty = L2),2,0.3,0.8079231692677071,0.8066511599333706,0.302854061126709,0.8066511599333706
71,2,Naive Bayes,2,0.3,0.790516206482593,0.7850081176709479,0.09444522857666016,0.7850081176709479
72,3,KNeighbors Classifier,0,0.3,0.776378896882494,0.7740707287141292,0.9571664333343506,0.7740707287141292
73,3,SVC Classifier,0,0.3,0.802158273381295,0.7936299699511085,4.729915142059326,0.7936299699511085
74,3,Decision Tree,0,0.3,0.7164268585131894,0.7150856978878998,0.09871149063110352,0.7150856978878998
75,3,RandomForest,0,0.3,0.7535971223021583,0.7408710091252323,0.5346665382385254,0.7408710091252323
76,3,AdaBoost (Discrete),0,0.3,0.7643884892086331,0.7635398971461448,51.351712465286255,0.7635398971461448
77,3,AdaBoost (Real),0,0.3,0.7697841726618705,0.7685311967690884,63.023810386657715,0.7685311967690884
78,3,Logistic Regression (Penalty = L2),0,0.3,0.8123501199040767,0.811054364470367,0.3082430362701416,0.811054364470367
79,3,Naive Bayes,0,0.3,0.7949640287769785,0.7857080890461955,0.05785679817199707,0.7857080890461955
80,3,KNeighbors Classifier,1,0.3,0.7581032412965186,0.7559872542616486,0.9354629516601562,0.7559872542616486
81,3,SVC Classifier,1,0.3,0.7863145258103241,0.7741391622282519,5.090538740158081,0.7741391622282519
82,3,Decision Tree,1,0.3,0.7058823529411765,0.7055689603445862,0.10771989822387695,0.7055689603445862
83,3,RandomForest,1,0.3,0.7376950780312125,0.7253679505173801,0.6571781635284424,0.7253679505173801
84,3,AdaBoost (Discrete),1,0.3,0.71968787515006,0.7191309748950854,53.73851299285889,0.7191309748950854
85,3,AdaBoost (Real),1,0.3,0.7418967587034814,0.7413832649277431,62.515507221221924,0.7413832649277431
86,3,Logistic Regression (Penalty = L2),1,0.3,0.8061224489795918,0.8044457166910834,0.3400864601135254,0.8044457166910834
87,3,Naive Bayes,1,0.3,0.7779111644657863,0.7667103095420659,0.09020805358886719,0.7667103095420659
88,3,KNeighbors Classifier,2,0.3,0.7671068427370948,0.7657779081143449,1.1288630962371826,0.7657779081143449
89,3,SVC Classifier,2,0.3,0.7899159663865546,0.7762906905140406,5.031012773513794,0.7762906905140406
90,3,Decision Tree,2,0.3,0.7022809123649459,0.7014675526778471,0.23649072647094727,0.7014675526778471
91,3,RandomForest,2,0.3,0.7286914765906363,0.71164595773851,0.5250141620635986,0.71164595773851
92,3,AdaBoost (Discrete),2,0.3,0.7509003601440576,0.7500227174738332,56.06135153770447,0.7500227174738332
93,3,AdaBoost (Real),2,0.3,0.7545018007202882,0.7537509133357976,63.417970180511475,0.7537509133357976
94,3,Logistic Regression (Penalty = L2),2,0.3,0.8097238895558223,0.8075220714859946,0.2866685390472412,0.8075220714859946
95,3,Naive Bayes,2,0.3,0.7713085234093637,0.7580225851677613,0.1019134521484375,0.7580225851677613
96,4,KNeighbors Classifier,0,0.3,0.7230215827338129,0.7210624716023518,0.34203624725341797,0.7210624716023518
97,4,SVC Classifier,0,0.3,0.7440047961630696,0.7255544717047341,4.262737274169922,0.7255544717047341
98,4,Decision Tree,0,0.3,0.6672661870503597,0.6656928520513427,0.1437215805053711,0.6656928520513427
99,4,RandomForest,0,0.3,0.7356115107913669,0.7189478735747709,0.5165112018585205,0.7189478735747709
100,4,AdaBoost (Discrete),0,0.3,0.6163069544364509,0.6012243656984599,40.17782402038574,0.6012243656984599
101,4,AdaBoost (Real),0,0.3,0.6744604316546763,0.67362972555541,49.869606494903564,0.67362972555541
102,4,Logistic Regression (Penalty = L2),0,0.3,0.7685851318944844,0.7658888686424914,0.23051023483276367,0.7658888686424914
103,4,Naive Bayes,0,0.3,0.7547961630695443,0.7425068700010393,0.10189652442932129,0.7425068700010393
104,4,KNeighbors Classifier,1,0.3,0.7022809123649459,0.6996344597927143,0.36612629890441895,0.6996344597927143
105,4,SVC Classifier,1,0.3,0.7220888355342137,0.6981717028413909,4.437009572982788,0.6981717028413909
106,4,Decision Tree,1,0.3,0.6860744297719088,0.6847178219006554,0.14314723014831543,0.6847178219006554
107,4,RandomForest,1,0.3,0.7172869147659063,0.7066068971321836,0.5257399082183838,0.7066068971321836
108,4,AdaBoost (Discrete),1,0.3,0.6266506602641057,0.6172563993485743,42.764567852020264,0.6172563993485743
109,4,AdaBoost (Real),1,0.3,0.6356542617046819,0.6312437164116154,53.421459674835205,0.6312437164116154
110,4,Logistic Regression (Penalty = L2),1,0.3,0.7466986794717887,0.7434522878704497,0.2462151050567627,0.7434522878704497
111,4,Naive Bayes,1,0.3,0.7322929171668667,0.7181466028858726,0.05437135696411133,0.7181466028858726
112,4,KNeighbors Classifier,2,0.3,0.712484993997599,0.7080151649420944,0.3134884834289551,0.7080151649420944
113,4,SVC Classifier,2,0.3,0.7244897959183674,0.7010353588123069,4.666436672210693,0.7010353588123069
114,4,Decision Tree,2,0.3,0.6578631452581032,0.6547621952256312,0.15884613990783691,0.6547621952256312
115,4,RandomForest,2,0.3,0.7016806722689075,0.6853770809323352,0.533778190612793,0.6853770809323352
116,4,AdaBoost (Discrete),2,0.3,0.6320528211284514,0.6111340490874895,49.164233684539795,0.6111340490874895
117,4,AdaBoost (Real),2,0.3,0.6482593037214885,0.6323751155304145,68.92659878730774,0.6323751155304145
118,4,Logistic Regression (Penalty = L2),2,0.3,0.7611044417767107,0.7545151604810291,0.327786922454834,0.7545151604810291
119,4,Naive Bayes,2,0.3,0.7328931572629052,0.7160981972688271,0.14958739280700684,0.7160981972688271
120,5,KNeighbors Classifier,0,0.3,0.6918465227817746,0.6894958028380924,0.35118579864501953,0.6894958028380924
121,5,SVC Classifier,0,0.3,0.7086330935251799,0.6851770549568924,6.062028646469116,0.6851770549568924
122,5,Decision Tree,0,0.3,0.61810551558753,0.616986714191395,0.12390351295471191,0.616986714191395
123,5,RandomForest,0,0.3,0.7158273381294964,0.6989969973633021,0.5976684093475342,0.6989969973633021
124,5,AdaBoost (Discrete),0,0.3,0.6264988009592326,0.6234200836394871,50.10602641105652,0.6234200836394871
125,5,AdaBoost (Real),0,0.3,0.6360911270983214,0.6354220377384685,62.53132605552673,0.6354220377384685
126,5,Logistic Regression (Penalty = L2),0,0.3,0.7386091127098321,0.7352900399007716,0.26530933380126953,0.7352900399007716
127,5,Naive Bayes,0,0.3,0.7272182254196643,0.7086319637224561,0.11412453651428223,0.7086319637224561
128,5,KNeighbors Classifier,1,0.3,0.6584633853541416,0.6554605283171132,0.33130311965942383,0.6554605283171132
129,5,SVC Classifier,1,0.3,0.6968787515006002,0.6725538283293415,5.9248130321502686,0.6725538283293415
130,5,Decision Tree,1,0.3,0.6086434573829532,0.6050649678997326,0.12895512580871582,0.6050649678997326
131,5,RandomForest,1,0.3,0.6986794717887155,0.6813098835815643,0.6344821453094482,0.6813098835815643
132,5,AdaBoost (Discrete),1,0.3,0.6032412965186075,0.5961546294576067,47.36567831039429,0.5961546294576067
133,5,AdaBoost (Real),1,0.3,0.5882352941176471,0.5819215021898878,60.25535869598389,0.5819215021898878
134,5,Logistic Regression (Penalty = L2),1,0.3,0.7280912364945978,0.725506674121286,0.32235121726989746,0.725506674121286
135,5,Naive Bayes,1,0.3,0.7112845138055222,0.69729269513007,0.06493639945983887,0.69729269513007
136,5,KNeighbors Classifier,2,0.3,0.6680672268907563,0.6659546373774905,0.25573039054870605,0.6659546373774905
137,5,SVC Classifier,2,0.3,0.7028811524609844,0.6721215051989711,5.545469522476196,0.6721215051989711
138,5,Decision Tree,2,0.3,0.6110444177671068,0.610123960205494,0.12875771522521973,0.610123960205494
139,5,RandomForest,2,0.3,0.6866746698679472,0.6684042569408752,0.5348711013793945,0.6684042569408752
140,5,AdaBoost (Discrete),2,0.3,0.5918367346938775,0.5880608609996223,47.86762595176697,0.5880608609996223
141,5,AdaBoost (Real),2,0.3,0.602641056422569,0.6005188143831166,60.67717504501343,0.6005188143831166
142,5,Logistic Regression (Penalty = L2),2,0.3,0.7334933973589436,0.7288872890479381,0.29796528816223145,0.7288872890479381
143,5,Naive Bayes,2,0.3,0.7088835534213686,0.69032301565004,0.13393354415893555,0.69032301565004
144,6,KNeighbors Classifier,0,0.3,0.7230215827338129,0.7210624716023518,0.4339156150817871,0.7210624716023518
145,6,SVC Classifier,0,0.3,0.7440047961630696,0.7255544717047341,5.47506308555603,0.7255544717047341
146,6,Decision Tree,0,0.3,0.684052757793765,0.6834015534513168,0.19141817092895508,0.6834015534513168
147,6,RandomForest,0,0.3,0.7356115107913669,0.7189478735747709,0.6819965839385986,0.7189478735747709
148,6,AdaBoost (Discrete),0,0.3,0.6163069544364509,0.6012243656984599,52.778266191482544,0.6012243656984599
149,6,AdaBoost (Real),0,0.3,0.6690647482014388,0.6665497119137664,66.2216784954071,0.6665497119137664
150,6,Logistic Regression (Penalty = L2),0,0.3,0.7685851318944844,0.7658888686424914,0.2712998390197754,0.7658888686424914
151,6,Naive Bayes,0,0.3,0.7547961630695443,0.7425068700010393,0.13431906700134277,0.7425068700010393
152,6,KNeighbors Classifier,1,0.3,0.7022809123649459,0.6996344597927143,0.3633852005004883,0.6996344597927143
153,6,SVC Classifier,1,0.3,0.7220888355342137,0.6981717028413909,5.556581497192383,0.6981717028413909
154,6,Decision Tree,1,0.3,0.6758703481392557,0.6737319772263747,0.1922926902770996,0.6737319772263747
155,6,RandomForest,1,0.3,0.7172869147659063,0.7066068971321836,0.6323356628417969,0.7066068971321836
156,6,AdaBoost (Discrete),1,0.3,0.6266506602641057,0.6172563993485743,53.09005784988403,0.6172563993485743
157,6,AdaBoost (Real),1,0.3,0.631452581032413,0.6222500016555036,66.01310014724731,0.6222500016555036
158,6,Logistic Regression (Penalty = L2),1,0.3,0.7466986794717887,0.7434522878704497,0.3146829605102539,0.7434522878704497
159,6,Naive Bayes,1,0.3,0.7322929171668667,0.7181466028858726,0.12560653686523438,0.7181466028858726
160,6,KNeighbors Classifier,2,0.3,0.712484993997599,0.7080151649420944,0.4452633857727051,0.7080151649420944
161,6,SVC Classifier,2,0.3,0.7244897959183674,0.7010353588123069,5.687889099121094,0.7010353588123069
162,6,Decision Tree,2,0.3,0.6776710684273709,0.6752630502025535,0.20030927658081055,0.6752630502025535
163,6,RandomForest,2,0.3,0.7016806722689075,0.6853770809323352,0.633018970489502,0.6853770809323352
164,6,AdaBoost (Discrete),2,0.3,0.6320528211284514,0.6111340490874895,53.134591579437256,0.6111340490874895
165,6,AdaBoost (Real),2,0.3,0.6584633853541416,0.6436381615372432,65.25618362426758,0.6436381615372432
166,6,Logistic Regression (Penalty = L2),2,0.3,0.7611044417767107,0.7545151604810291,0.3151891231536865,0.7545151604810291
167,6,Naive Bayes,2,0.3,0.7328931572629052,0.7160981972688271,0.0689854621887207,0.7160981972688271
168,7,KNeighbors Classifier,0,0.3,0.7320143884892086,0.73110363961099,0.5754740238189697,0.73110363961099
169,7,SVC Classifier,0,0.3,0.7697841726618705,0.7588734450792589,5.836146831512451,0.7588734450792589
170,7,Decision Tree,0,0.3,0.7122302158273381,0.7115373638268362,0.19983768463134766,0.7115373638268362
171,7,RandomForest,0,0.3,0.7254196642685852,0.7156645838806797,0.6149129867553711,0.7156645838806797
172,7,AdaBoost (Discrete),0,0.3,0.6468824940047961,0.6358742002839562,57.176188230514526,0.6358742002839562
173,7,AdaBoost (Real),0,0.3,0.6798561151079137,0.6785165243557919,69.67611646652222,0.6785165243557919
174,7,Logistic Regression (Penalty = L2),0,0.3,0.7799760191846523,0.7789938688443744,0.26868510246276855,0.7789938688443744
175,7,Naive Bayes,0,0.3,0.7697841726618705,0.7605693565727196,0.12186813354492188,0.7605693565727196
176,7,KNeighbors Classifier,1,0.3,0.7136854741896759,0.7110444026677464,0.6321792602539062,0.7110444026677464
177,7,SVC Classifier,1,0.3,0.7623049219687875,0.744996495644179,5.393580436706543,0.744996495644179
178,7,Decision Tree,1,0.3,0.6578631452581032,0.6568670960962478,0.12165093421936035,0.6568670960962478
179,7,RandomForest,1,0.3,0.7112845138055222,0.7028358331299834,0.5384972095489502,0.7028358331299834
180,7,AdaBoost (Discrete),1,0.3,0.6452581032412965,0.6441942687445344,54.528383016586304,0.6441942687445344
181,7,AdaBoost (Real),1,0.3,0.6572629051620649,0.648865012534787,69.35391283035278,0.648865012534787
182,7,Logistic Regression (Penalty = L2),1,0.3,0.776110444177671,0.7743394444467234,0.29498982429504395,0.7743394444467234
183,7,Naive Bayes,1,0.3,0.7490996398559424,0.7360362517700686,0.14182162284851074,0.7360362517700686
184,7,KNeighbors Classifier,2,0.3,0.7274909963985594,0.726577240527649,0.505789041519165,0.726577240527649
185,7,SVC Classifier,2,0.3,0.7521008403361344,0.7367090448975242,5.843880891799927,0.7367090448975242
186,7,Decision Tree,2,0.3,0.687875150060024,0.6870608398787226,0.19211173057556152,0.6870608398787226
187,7,RandomForest,2,0.3,0.7106842737094838,0.699643058374833,0.6881163120269775,0.699643058374833
188,7,AdaBoost (Discrete),2,0.3,0.6296518607442977,0.6250508484047074,60.216272592544556,0.6250508484047074
189,7,AdaBoost (Real),2,0.3,0.6770708283313326,0.6730450208721307,84.96809530258179,0.6730450208721307
190,7,Logistic Regression (Penalty = L2),2,0.3,0.7779111644657863,0.7760091405487949,0.39864349365234375,0.7760091405487949
191,7,Naive Bayes,2,0.3,0.751500600240096,0.7394868012476387,0.09430623054504395,0.7394868012476387
192,8,KNeighbors Classifier,0,0.3,0.776378896882494,0.7740707287141292,1.528754711151123,0.7740707287141292
193,8,SVC Classifier,0,0.3,0.802158273381295,0.7936299699511085,7.270799875259399,0.7936299699511085
194,8,Decision Tree,0,0.3,0.7242206235011991,0.723373141070924,0.22237396240234375,0.723373141070924
195,8,RandomForest,0,0.3,0.7535971223021583,0.7408710091252323,0.6821415424346924,0.7408710091252323
196,8,AdaBoost (Discrete),0,0.3,0.7643884892086331,0.7635398971461448,80.99161577224731,0.7635398971461448
197,8,AdaBoost (Real),0,0.3,0.7607913669064749,0.7545089823859281,99.8185076713562,0.7545089823859281
198,8,Logistic Regression (Penalty = L2),0,0.3,0.8123501199040767,0.811054364470367,0.4526054859161377,0.811054364470367
199,8,Naive Bayes,0,0.3,0.7949640287769785,0.7857080890461955,0.1698453426361084,0.7857080890461955
200,8,KNeighbors Classifier,1,0.3,0.7581032412965186,0.7559872542616486,1.5217010974884033,0.7559872542616486
201,8,SVC Classifier,1,0.3,0.7863145258103241,0.7741391622282519,8.103369951248169,0.7741391622282519
202,8,Decision Tree,1,0.3,0.6902761104441777,0.6901517621040274,0.2332782745361328,0.6901517621040274
203,8,RandomForest,1,0.3,0.7376950780312125,0.7253679505173801,0.8246045112609863,0.7253679505173801
204,8,AdaBoost (Discrete),1,0.3,0.7190876350540216,0.7185415230121902,80.5016233921051,0.7185415230121902
205,8,AdaBoost (Real),1,0.3,0.7557022809123649,0.754640381327513,95.86789178848267,0.754640381327513
206,8,Logistic Regression (Penalty = L2),1,0.3,0.8061224489795918,0.8044457166910834,0.3920135498046875,0.8044457166910834
207,8,Naive Bayes,1,0.3,0.7779111644657863,0.7667103095420659,0.07288026809692383,0.7667103095420659
208,8,KNeighbors Classifier,2,0.3,0.7671068427370948,0.7657779081143449,1.3699448108673096,0.7657779081143449
209,8,SVC Classifier,2,0.3,0.7899159663865546,0.7762906905140406,7.547503232955933,0.7762906905140406
210,8,Decision Tree,2,0.3,0.7304921968787516,0.7295379600546043,0.2282111644744873,0.7295379600546043
211,8,RandomForest,2,0.3,0.7286914765906363,0.71164595773851,0.8225157260894775,0.71164595773851
212,8,AdaBoost (Discrete),2,0.3,0.751500600240096,0.7506599503355638,81.54850268363953,0.7506599503355638
213,8,AdaBoost (Real),2,0.3,0.7665066026410564,0.7644668763197019,94.50845003128052,0.7644668763197019
214,8,Logistic Regression (Penalty = L2),2,0.3,0.8097238895558223,0.8075220714859946,0.39931511878967285,0.8075220714859946
215,8,Naive Bayes,2,0.3,0.7713085234093637,0.7580225851677613,0.08878445625305176,0.7580225851677613
216,9,KNeighbors Classifier,0,0.3,0.7320143884892086,0.73110363961099,0.7358455657958984,0.73110363961099
217,9,SVC Classifier,0,0.3,0.7697841726618705,0.7588734450792589,7.231697082519531,0.7588734450792589
218,9,Decision Tree,0,0.3,0.709832134292566,0.7096441036453173,0.22661399841308594,0.7096441036453173
219,9,RandomForest,0,0.3,0.7254196642685852,0.7156645838806797,0.8139913082122803,0.7156645838806797
220,9,AdaBoost (Discrete),0,0.3,0.6468824940047961,0.6358742002839562,67.67118573188782,0.6358742002839562
221,9,AdaBoost (Real),0,0.3,0.63189448441247,0.6201853651069124,83.62327718734741,0.6201853651069124
222,9,Logistic Regression (Penalty = L2),0,0.3,0.7799760191846523,0.7789938688443744,0.3815333843231201,0.7789938688443744
223,9,Naive Bayes,0,0.3,0.7697841726618705,0.7605693565727196,0.07805323600769043,0.7605693565727196
224,9,KNeighbors Classifier,1,0.3,0.7136854741896759,0.7110444026677464,0.6837649345397949,0.7110444026677464
225,9,SVC Classifier,1,0.3,0.7623049219687875,0.744996495644179,6.955984830856323,0.744996495644179
226,9,Decision Tree,1,0.3,0.6668667466986795,0.6663159901403374,0.24383306503295898,0.6663159901403374
227,9,RandomForest,1,0.3,0.7112845138055222,0.7028358331299834,0.8344380855560303,0.7028358331299834
228,9,AdaBoost (Discrete),1,0.3,0.6452581032412965,0.6441942687445344,67.68572402000427,0.6441942687445344
229,9,AdaBoost (Real),1,0.3,0.6602641056422569,0.657642514762721,84.16961574554443,0.657642514762721
230,9,Logistic Regression (Penalty = L2),1,0.3,0.776110444177671,0.7743394444467234,0.33578014373779297,0.7743394444467234
231,9,Naive Bayes,1,0.3,0.7490996398559424,0.7360362517700686,0.15843677520751953,0.7360362517700686
232,9,KNeighbors Classifier,2,0.3,0.7274909963985594,0.726577240527649,0.719489336013794,0.726577240527649
233,9,SVC Classifier,2,0.3,0.7521008403361344,0.7367090448975242,6.945999622344971,0.7367090448975242
234,9,Decision Tree,2,0.3,0.6842737094837935,0.6831943365927561,0.1503288745880127,0.6831943365927561
235,9,RandomForest,2,0.3,0.7106842737094838,0.699643058374833,0.7637989521026611,0.699643058374833
236,9,AdaBoost (Discrete),2,0.3,0.6296518607442977,0.6250508484047074,68.53387260437012,0.6250508484047074
237,9,AdaBoost (Real),2,0.3,0.6638655462184874,0.6598158232598766,83.62651181221008,0.6598158232598766
238,9,Logistic Regression (Penalty = L2),2,0.3,0.7779111644657863,0.7760091405487949,0.36461472511291504,0.7760091405487949
239,9,Naive Bayes,2,0.3,0.751500600240096,0.7394868012476387,0.0966804027557373,0.7394868012476387
240,10,KNeighbors Classifier,0,0.3,0.776378896882494,0.7740707287141292,1.4405174255371094,0.7740707287141292
241,10,SVC Classifier,0,0.3,0.802158273381295,0.7936299699511085,7.381818056106567,0.7936299699511085
242,10,Decision Tree,0,0.3,0.6990407673860911,0.6963733139110038,0.2310793399810791,0.6963733139110038
243,10,RandomForest,0,0.3,0.7535971223021583,0.7408710091252323,0.7627170085906982,0.7408710091252323
244,10,AdaBoost (Discrete),0,0.3,0.7643884892086331,0.7635398971461448,80.6795346736908,0.7635398971461448
245,10,AdaBoost (Real),0,0.3,0.7535971223021583,0.7450623112909804,96.3746268749237,0.7450623112909804
246,10,Logistic Regression (Penalty = L2),0,0.3,0.8123501199040767,0.811054364470367,0.474623441696167,0.811054364470367
247,10,Naive Bayes,0,0.3,0.7949640287769785,0.7857080890461955,0.15543150901794434,0.7857080890461955
248,10,KNeighbors Classifier,1,0.3,0.7581032412965186,0.7559872542616486,1.5209145545959473,0.7559872542616486
249,10,SVC Classifier,1,0.3,0.7863145258103241,0.7741391622282519,7.208156585693359,0.7741391622282519
250,10,Decision Tree,1,0.3,0.7070828331332533,0.7063910049118933,0.15683746337890625,0.7063910049118933
251,10,RandomForest,1,0.3,0.7376950780312125,0.7253679505173801,0.8274147510528564,0.7253679505173801
252,10,AdaBoost (Discrete),1,0.3,0.71968787515006,0.7191309748950854,80.90161514282227,0.7191309748950854
253,10,AdaBoost (Real),1,0.3,0.7322929171668667,0.729755433469689,96.3207700252533,0.729755433469689
254,10,Logistic Regression (Penalty = L2),1,0.3,0.8061224489795918,0.8044457166910834,0.3970985412597656,0.8044457166910834
255,10,Naive Bayes,1,0.3,0.7779111644657863,0.7667103095420659,0.07787084579467773,0.7667103095420659
256,10,KNeighbors Classifier,2,0.3,0.7671068427370948,0.7657779081143449,1.602475881576538,0.7657779081143449
257,10,SVC Classifier,2,0.3,0.7899159663865546,0.7762906905140406,7.26213002204895,0.7762906905140406
258,10,Decision Tree,2,0.3,0.7148859543817527,0.713845431803473,0.2242279052734375,0.713845431803473
259,10,RandomForest,2,0.3,0.7286914765906363,0.71164595773851,0.7655766010284424,0.71164595773851
260,10,AdaBoost (Discrete),2,0.3,0.751500600240096,0.7506599503355638,81.37779116630554,0.7506599503355638
261,10,AdaBoost (Real),2,0.3,0.751500600240096,0.7481335786725561,97.81945514678955,0.7481335786725561
262,10,Logistic Regression (Penalty = L2),2,0.3,0.8097238895558223,0.8075220714859946,0.39861488342285156,0.8075220714859946
263,10,Naive Bayes,2,0.3,0.7713085234093637,0.7580225851677613,0.07855868339538574,0.7580225851677613
264,11,KNeighbors Classifier,0,0.3,0.7991606714628298,0.797890138100901,4.4162116050720215,0.797890138100901
265,11,SVC Classifier,0,0.3,0.8273381294964028,0.8129624614191304,8.355642318725586,0.8129624614191304
266,11,Decision Tree,0,0.3,0.7332134292565947,0.731278052054756,0.22924304008483887,0.731278052054756
267,11,RandomForest,0,0.3,0.7823741007194245,0.7726202198726047,0.8417537212371826,0.7726202198726047
268,11,AdaBoost (Discrete),0,0.3,0.8183453237410072,0.8182938240468135,112.14433145523071,0.8182938240468135
269,11,AdaBoost (Real),0,0.3,0.830335731414868,0.8302759992306336,126.29742121696472,0.8302759992306336
270,11,Logistic Regression (Penalty = L2),0,0.3,0.855515587529976,0.8545236104583287,0.438140869140625,0.8545236104583287
271,11,Naive Bayes,0,0.3,0.7997601918465228,0.7709038269818883,0.13581609725952148,0.7709038269818883
272,11,KNeighbors Classifier,1,0.3,0.7821128451380552,0.7814740093000082,3.75406813621521,0.7814740093000082
273,11,SVC Classifier,1,0.3,0.8175270108043218,0.8049252713297937,7.570329904556274,0.8049252713297937
274,11,Decision Tree,1,0.3,0.7292917166866747,0.7292305731419937,0.2704484462738037,0.7292305731419937
275,11,RandomForest,1,0.3,0.7460984393757503,0.7352951393783863,0.8585948944091797,0.7352951393783863
276,11,AdaBoost (Discrete),1,0.3,0.7899159663865546,0.7886285521176919,101.70159387588501,0.7886285521176919
277,11,AdaBoost (Real),1,0.3,0.7929171668667467,0.7906976112329452,116.8362033367157,0.7906976112329452
278,11,Logistic Regression (Penalty = L2),1,0.3,0.8277310924369747,0.8264595232768392,0.4996168613433838,0.8264595232768392
279,11,Naive Bayes,1,0.3,0.790516206482593,0.7649691852521823,0.1516275405883789,0.7649691852521823
280,11,KNeighbors Classifier,2,0.3,0.7941176470588235,0.7917177004986625,4.173650741577148,0.7917177004986625
281,11,SVC Classifier,2,0.3,0.8223289315726291,0.8075067737408741,8.43615460395813,0.8075067737408741
282,11,Decision Tree,2,0.3,0.7394957983193278,0.7392319194994188,0.29528331756591797,0.7392319194994188
283,11,RandomForest,2,0.3,0.7496998799519808,0.7403415317021714,0.9134211540222168,0.7403415317021714
284,11,AdaBoost (Discrete),2,0.3,0.82953181272509,0.8289695644295305,113.13171768188477,0.8289695644295305
285,11,AdaBoost (Real),2,0.3,0.8277310924369747,0.8261144134927576,128.37366008758545,0.8261144134927576
286,11,Logistic Regression (Penalty = L2),2,0.3,0.8553421368547419,0.8537657895635518,0.5221991539001465,0.8537657895635518
287,11,Naive Bayes,2,0.3,0.8055222088835534,0.7811449672829409,0.13401246070861816,0.7811449672829409
288,12,KNeighbors Classifier,0,0.3,0.6918465227817746,0.6894958028380924,0.31054019927978516,0.6894958028380924
289,12,SVC Classifier,0,0.3,0.7086330935251799,0.6851770549568924,6.270445108413696,0.6851770549568924
290,12,Decision Tree,0,0.3,0.6133093525179856,0.6118820992963652,0.14733386039733887,0.6118820992963652
291,12,RandomForest,0,0.3,0.7158273381294964,0.6989969973633021,0.7783818244934082,0.6989969973633021
292,12,AdaBoost (Discrete),0,0.3,0.6264988009592326,0.6234200836394871,52.91128945350647,0.6234200836394871
293,12,AdaBoost (Real),0,0.3,0.6360911270983214,0.6354220377384685,68.19388604164124,0.6354220377384685
294,12,Logistic Regression (Penalty = L2),0,0.3,0.7386091127098321,0.7352900399007716,0.264634370803833,0.7352900399007716
295,12,Naive Bayes,0,0.3,0.7272182254196643,0.7086319637224561,0.1343672275543213,0.7086319637224561
296,12,KNeighbors Classifier,1,0.3,0.6584633853541416,0.6554605283171132,0.3005392551422119,0.6554605283171132
297,12,SVC Classifier,1,0.3,0.6968787515006002,0.6725538283293415,6.297866344451904,0.6725538283293415
298,12,Decision Tree,1,0.3,0.6386554621848739,0.637785998006579,0.13720202445983887,0.637785998006579
299,12,RandomForest,1,0.3,0.6986794717887155,0.6813098835815643,0.6056811809539795,0.6813098835815643
300,12,AdaBoost (Discrete),1,0.3,0.6032412965186075,0.5961546294576067,50.26817727088928,0.5961546294576067
301,12,AdaBoost (Real),1,0.3,0.5882352941176471,0.5819215021898878,64.33184862136841,0.5819215021898878
302,12,Logistic Regression (Penalty = L2),1,0.3,0.7280912364945978,0.725506674121286,0.3037552833557129,0.725506674121286
303,12,Naive Bayes,1,0.3,0.7112845138055222,0.69729269513007,0.06815338134765625,0.69729269513007
304,12,KNeighbors Classifier,2,0.3,0.6680672268907563,0.6659546373774905,0.20897507667541504,0.6659546373774905
305,12,SVC Classifier,2,0.3,0.7028811524609844,0.6721215051989711,5.977643251419067,0.6721215051989711
306,12,Decision Tree,2,0.3,0.6194477791116446,0.6157186773045157,0.07075071334838867,0.6157186773045157
307,12,RandomForest,2,0.3,0.6866746698679472,0.6684042569408752,0.6591415405273438,0.6684042569408752
308,12,AdaBoost (Discrete),2,0.3,0.5918367346938775,0.5880608609996223,51.622716188430786,0.5880608609996223
309,12,AdaBoost (Real),2,0.3,0.602641056422569,0.6005188143831166,67.44580006599426,0.6005188143831166
310,12,Logistic Regression (Penalty = L2),2,0.3,0.7334933973589436,0.7288872890479381,0.3052248954772949,0.7288872890479381
311,12,Naive Bayes,2,0.3,0.7088835534213686,0.69032301565004,0.07816910743713379,0.69032301565004
