,feat_set_id,classifier,fold_id,feat_th,score,geo_score,exec_t,geo_score_woz
0,0,KNeighbors Classifier,0,0.6,0.7105719237435009,0.6198191590825773,0.37954092025756836,0.0
1,0,SVC Classifier,0,0.6,0.6845753899480069,0.8129520829107402,0.6593115329742432,0.0
2,0,Decision Tree,0,0.6,0.6845753899480069,0.5871350021982059,0.0594482421875,0.0
3,0,RandomForest,0,0.6,0.7001733102253033,1.0,0.5150167942047119,0.0
4,0,AdaBoost (Discrete),0,0.6,0.729636048526863,0.6300815843286437,28.89650058746338,0.0
5,0,AdaBoost (Real),0,0.6,0.7140381282495667,0.6183743539381974,39.54090690612793,0.0
6,0,Logistic Regression (Penalty = L2),0,0.6,0.6880415944540728,0.7603453162872774,0.2818589210510254,0.0
7,0,Naive Bayes,0,0.6,0.6672443674176777,0.7914018355435688,0.14952993392944336,0.0
8,0,KNeighbors Classifier,1,0.6,0.7447916666666666,0.49934001010328316,0.6192293167114258,0.0
9,0,SVC Classifier,1,0.6,0.7274305555555556,0.7636780043269571,0.8440289497375488,0.0
10,0,Decision Tree,1,0.6,0.6753472222222222,0.5853067485008229,0.0025131702423095703,0.0
11,0,RandomForest,1,0.6,0.6996527777777778,1.0,0.5680205821990967,0.0
12,0,AdaBoost (Discrete),1,0.6,0.7743055555555556,0.47748159228563797,35.06941366195679,0.0
13,0,AdaBoost (Real),1,0.6,0.7204861111111112,0.6037700733301047,40.503697872161865,0.0
14,0,Logistic Regression (Penalty = L2),1,0.6,0.7638888888888888,0.5874287808097735,0.31278514862060547,0.0
15,0,Naive Bayes,1,0.6,0.7829861111111112,0.6820345298093242,0.07330751419067383,0.0
16,0,KNeighbors Classifier,2,0.6,0.8539130434782609,0.7080204561161934,0.5816540718078613,0.7080204561161934
17,0,SVC Classifier,2,0.6,0.8208695652173913,0.7556138122418227,0.71917724609375,0.0
18,0,Decision Tree,2,0.6,0.8504347826086956,0.7526854519306246,0.08230400085449219,0.7526854519306246
19,0,RandomForest,2,0.6,0.7165217391304348,0.6898459005389914,0.5169641971588135,0.0
20,0,AdaBoost (Discrete),2,0.6,0.3982608695652174,0.442189535154294,36.47478628158569,0.442189535154294
21,0,AdaBoost (Real),2,0.6,0.391304347826087,0.40472056117554317,42.29230833053589,0.40472056117554317
22,0,Logistic Regression (Penalty = L2),2,0.6,0.5582608695652174,0.4862376070552159,0.4017939567565918,0.4862376070552159
23,0,Naive Bayes,2,0.6,0.5478260869565217,0.8392974277582299,0.004915475845336914,0.0
24,1,KNeighbors Classifier,0,0.6,0.6967071057192374,0.5916516027851242,0.476182222366333,0.0
25,1,SVC Classifier,0,0.6,0.6845753899480069,0.8129520829107402,0.8020753860473633,0.0
26,1,Decision Tree,0,0.6,0.6152512998266898,0.5183775377196999,0.002580881118774414,0.0
27,1,RandomForest,0,0.6,0.7001733102253033,1.0,0.5693433284759521,0.0
28,1,AdaBoost (Discrete),0,0.6,0.23743500866551126,0.24436069827658005,35.003620624542236,0.0
29,1,AdaBoost (Real),0,0.6,0.2391681109185442,0.27115004335578646,50.81355023384094,0.0
30,1,Logistic Regression (Penalty = L2),0,0.6,0.6395147313691508,0.6832394989103653,0.5186176300048828,0.0
31,1,Naive Bayes,0,0.6,0.6429809358752167,0.7508927762297288,0.07036066055297852,0.0
32,1,KNeighbors Classifier,1,0.6,0.703125,0.37647612287077614,0.674699068069458,0.0
33,1,SVC Classifier,1,0.6,0.7274305555555556,0.7636780043269571,0.9618282318115234,0.0
34,1,Decision Tree,1,0.6,0.7864583333333334,0.5775523405676826,0.09459590911865234,0.0
35,1,RandomForest,1,0.6,0.6996527777777778,1.0,0.7721023559570312,0.0
36,1,AdaBoost (Discrete),1,0.6,0.7326388888888888,0.4193686103143949,42.26207518577576,0.0
37,1,AdaBoost (Real),1,0.6,0.3715277777777778,0.39658151555342874,55.75566077232361,0.0
38,1,Logistic Regression (Penalty = L2),1,0.6,0.71875,0.6138900896607005,0.422105073928833,0.0
39,1,Naive Bayes,1,0.6,0.78125,0.6802396938019404,0.2251591682434082,0.0
40,1,KNeighbors Classifier,2,0.6,0.7513043478260869,0.7033688740374949,0.8984196186065674,0.0
41,1,SVC Classifier,2,0.6,0.8434782608695652,0.837206672457254,1.1119046211242676,0.0
42,1,Decision Tree,2,0.6,0.5495652173913044,0.41421499328901756,0.0028455257415771484,0.0
43,1,RandomForest,2,0.6,0.7008695652173913,1.0,0.7838850021362305,0.0
44,1,AdaBoost (Discrete),2,0.6,0.25043478260869567,0.34561350122029216,48.253007888793945,0.34561350122029216
45,1,AdaBoost (Real),2,0.6,0.20347826086956522,0.30157367250762024,54.922139167785645,0.30157367250762024
46,1,Logistic Regression (Penalty = L2),2,0.6,0.6104347826086957,0.4215862361310502,0.4335949420928955,0.4215862361310502
47,1,Naive Bayes,2,0.6,0.528695652173913,0.7234770261807716,0.10904788970947266,0.0
48,2,KNeighbors Classifier,0,0.6,0.6568457538994801,0.635797814864237,1.5064654350280762,0.0
49,2,SVC Classifier,0,0.6,0.6845753899480069,0.8129520829107402,1.3380706310272217,0.0
50,2,Decision Tree,0,0.6,0.6741767764298093,0.3947386309273556,0.09943270683288574,0.0
51,2,RandomForest,0,0.6,0.7001733102253033,1.0,0.7103710174560547,0.0
52,2,AdaBoost (Discrete),0,0.6,0.7521663778162911,0.6944144468157013,48.17754316329956,0.0
53,2,AdaBoost (Real),0,0.6,0.7313691507798961,0.6279488611465976,55.86115789413452,0.0
54,2,Logistic Regression (Penalty = L2),0,0.6,0.6863084922010398,0.7210131717325844,0.5190014839172363,0.0
55,2,Naive Bayes,0,0.6,0.6672443674176777,0.7914018355435688,0.20554327964782715,0.0
56,2,KNeighbors Classifier,1,0.6,0.6961805555555556,0.3630128918050201,1.4533765316009521,0.0
57,2,SVC Classifier,1,0.6,0.7274305555555556,0.7636780043269571,1.4643549919128418,0.0
58,2,Decision Tree,1,0.6,0.7690972222222222,0.7360620424468348,0.10341763496398926,0.0
59,2,RandomForest,1,0.6,0.6996527777777778,1.0,0.8311293125152588,0.0
60,2,AdaBoost (Discrete),1,0.6,0.7517361111111112,0.43129654708987847,52.852654457092285,0.0
61,2,AdaBoost (Real),1,0.6,0.7777777777777778,0.6136183382979365,59.62497806549072,0.0
62,2,Logistic Regression (Penalty = L2),1,0.6,0.7482638888888888,0.6268843050507011,0.5027410984039307,0.0
63,2,Naive Bayes,1,0.6,0.7829861111111112,0.6820345298093242,0.12068748474121094,0.0
64,2,KNeighbors Classifier,2,0.6,0.8330434782608696,0.7552608308349611,1.6917243003845215,0.7552608308349611
65,2,SVC Classifier,2,0.6,0.7356521739130435,0.6012871326420459,1.39896821975708,0.0
66,2,Decision Tree,2,0.6,0.7495652173913043,0.3576791347466741,0.0019943714141845703,0.3576791347466741
67,2,RandomForest,2,0.6,0.7008695652173913,1.0,0.7841084003448486,0.0
68,2,AdaBoost (Discrete),2,0.6,0.3652173913043478,0.49979308913426346,53.08864712715149,0.49979308913426346
69,2,AdaBoost (Real),2,0.6,0.4956521739130435,0.4877721037836525,63.74017143249512,0.4877721037836525
70,2,Logistic Regression (Penalty = L2),2,0.6,0.6052173913043478,0.52602626583304,0.8034882545471191,0.52602626583304
71,2,Naive Bayes,2,0.6,0.5478260869565217,0.8392974277582299,0.2816355228424072,0.0
72,3,KNeighbors Classifier,0,0.6,0.8110918544194108,0.5387056143157714,0.6121900081634521,0.0
73,3,SVC Classifier,0,0.6,0.6845753899480069,0.8129520829107402,1.2501976490020752,0.0
74,3,Decision Tree,0,0.6,0.8128249566724437,0.6253073795567858,0.14278912544250488,0.0
75,3,RandomForest,0,0.6,0.7001733102253033,1.0,0.8672585487365723,0.0
76,3,AdaBoost (Discrete),0,0.6,0.36741767764298094,0.40581441194728096,49.6569938659668,0.0
77,3,AdaBoost (Real),0,0.6,0.28942807625649913,0.3154991765296123,60.62799692153931,0.0
78,3,Logistic Regression (Penalty = L2),0,0.6,0.7833622183708839,0.679137370543918,0.46193814277648926,0.0
79,3,Naive Bayes,0,0.6,0.5805892547660312,0.6192878878744241,0.10824322700500488,0.0
80,3,KNeighbors Classifier,1,0.6,0.796875,0.5138402298083659,0.7702145576477051,0.0
81,3,SVC Classifier,1,0.6,0.7847222222222222,0.8290042122154554,1.0846552848815918,0.0
82,3,Decision Tree,1,0.6,0.7361111111111112,0.4643158882948986,0.10686302185058594,0.0
83,3,RandomForest,1,0.6,0.6996527777777778,1.0,0.8611798286437988,0.0
84,3,AdaBoost (Discrete),1,0.6,0.7013888888888888,0.42521565592304955,47.65271234512329,0.0
85,3,AdaBoost (Real),1,0.6,0.3715277777777778,0.2679161449185622,60.77199411392212,0.0
86,3,Logistic Regression (Penalty = L2),1,0.6,0.7100694444444444,0.32598364698774807,0.3083639144897461,0.0
87,3,Naive Bayes,1,0.6,0.6840277777777778,0.7034341761336865,0.11836028099060059,0.0
88,3,KNeighbors Classifier,2,0.6,0.7356521739130435,0.4142849266000356,0.506378173828125,0.0
89,3,SVC Classifier,2,0.6,0.7617391304347826,0.6767502123205655,1.9693663120269775,0.0
90,3,Decision Tree,2,0.6,0.7286956521739131,0.33241014195227014,0.19376707077026367,0.33241014195227014
91,3,RandomForest,2,0.6,0.7078260869565217,0.1767766952966369,0.6103391647338867,0.0
92,3,AdaBoost (Discrete),2,0.6,0.10782608695652174,0.20117689066903224,50.938814640045166,0.0
93,3,AdaBoost (Real),2,0.6,0.08869565217391304,0.16241485645850362,62.24288749694824,0.0
94,3,Logistic Regression (Penalty = L2),2,0.6,0.6678260869565218,0.5132449337600827,0.4096567630767822,0.5132449337600827
95,3,Naive Bayes,2,0.6,0.46608695652173915,0.6897771060056679,0.2642521858215332,0.0
96,4,KNeighbors Classifier,0,0.6,0.6967071057192374,0.5916516027851242,0.8020777702331543,0.0
97,4,SVC Classifier,0,0.6,0.6845753899480069,0.8129520829107402,1.4060544967651367,0.0
98,4,Decision Tree,0,0.6,0.6360485268630849,0.5498693567355661,0.13069891929626465,0.0
99,4,RandomForest,0,0.6,0.7261698440207972,0.5648671314898963,0.7890815734863281,0.0
100,4,AdaBoost (Discrete),0,0.6,0.23743500866551126,0.24436069827658005,47.22714805603027,0.0
101,4,AdaBoost (Real),0,0.6,0.2218370883882149,0.2649102639566414,61.96816325187683,0.0
102,4,Logistic Regression (Penalty = L2),0,0.6,0.6395147313691508,0.6832394989103653,0.6030881404876709,0.0
103,4,Naive Bayes,0,0.6,0.6429809358752167,0.7508927762297288,0.42170119285583496,0.0
104,4,KNeighbors Classifier,1,0.6,0.7430555555555556,0.4490507916151869,1.496445894241333,0.0
105,4,SVC Classifier,1,0.6,0.7274305555555556,0.7636780043269571,1.675886869430542,0.0
106,4,Decision Tree,1,0.6,0.6996527777777778,0.5121604907518449,0.0027582645416259766,0.0
107,4,RandomForest,1,0.6,0.6944444444444444,0.3451183851258305,1.6265387535095215,0.0
108,4,AdaBoost (Discrete),1,0.6,0.6163194444444444,0.4387967910771173,96.09440970420837,0.0
109,4,AdaBoost (Real),1,0.6,0.3975694444444444,0.42192333943536187,119.88583135604858,0.0
110,4,Logistic Regression (Penalty = L2),1,0.6,0.71875,0.6138900896607005,0.8855381011962891,0.0
111,4,Naive Bayes,1,0.6,0.78125,0.6802396938019404,0.1934518814086914,0.0
112,4,KNeighbors Classifier,2,0.6,0.7808695652173913,0.6834667707379308,1.3353147506713867,0.0
113,4,SVC Classifier,2,0.6,0.7930434782608695,0.6834487561136172,1.8510303497314453,0.0
114,4,Decision Tree,2,0.6,0.29739130434782607,0.2990804487037019,0.21470189094543457,0.0
115,4,RandomForest,2,0.6,0.7182608695652174,0.2795084971874737,1.4929375648498535,0.0
116,4,AdaBoost (Discrete),2,0.6,0.12521739130434784,0.23599415229887397,89.02966213226318,0.23599415229887397
117,4,AdaBoost (Real),2,0.6,0.10086956521739131,0.1882353342184756,119.19251871109009,0.1882353342184756
118,4,Logistic Regression (Penalty = L2),2,0.6,0.6104347826086957,0.4215862361310502,0.8452486991882324,0.4215862361310502
119,4,Naive Bayes,2,0.6,0.528695652173913,0.7234770261807716,0.14771723747253418,0.0
120,5,KNeighbors Classifier,0,0.6,0.7105719237435009,0.6198191590825773,1.0181257724761963,0.0
121,5,SVC Classifier,0,0.6,0.6845753899480069,0.8129520829107402,1.8140859603881836,0.0
122,5,Decision Tree,0,0.6,0.6568457538994801,0.5477066661010376,0.19098711013793945,0.0
123,5,RandomForest,0,0.6,0.7001733102253033,1.0,1.326538324356079,0.0
124,5,AdaBoost (Discrete),0,0.6,0.729636048526863,0.6300815843286437,96.04366207122803,0.0
125,5,AdaBoost (Real),0,0.6,0.707105719237435,0.6156591736117268,107.28649687767029,0.0
126,5,Logistic Regression (Penalty = L2),0,0.6,0.6880415944540728,0.7603453162872774,0.7753026485443115,0.0
127,5,Naive Bayes,0,0.6,0.6672443674176777,0.7914018355435688,0.4411742687225342,0.0
128,5,KNeighbors Classifier,1,0.6,0.7447916666666666,0.49934001010328316,1.6853501796722412,0.0
129,5,SVC Classifier,1,0.6,0.7274305555555556,0.7636780043269571,2.2951653003692627,0.0
130,5,Decision Tree,1,0.6,0.734375,0.5087618809093795,0.22290754318237305,0.0
131,5,RandomForest,1,0.6,0.6996527777777778,1.0,1.5406935214996338,0.0
132,5,AdaBoost (Discrete),1,0.6,0.7743055555555556,0.47748159228563797,79.99630546569824,0.0
133,5,AdaBoost (Real),1,0.6,0.7309027777777778,0.6188992106703481,57.697004556655884,0.0
134,5,Logistic Regression (Penalty = L2),1,0.6,0.7638888888888888,0.5874287808097735,0.44048595428466797,0.0
135,5,Naive Bayes,1,0.6,0.7829861111111112,0.6820345298093242,0.10929465293884277,0.0
136,5,KNeighbors Classifier,2,0.6,0.8539130434782609,0.7080204561161934,0.8575477600097656,0.7080204561161934
137,5,SVC Classifier,2,0.6,0.8208695652173913,0.7556138122418227,0.9729840755462646,0.0
138,5,Decision Tree,2,0.6,0.8365217391304348,0.6821049608876146,0.0910031795501709,0.6821049608876146
139,5,RandomForest,2,0.6,0.7165217391304348,0.6898459005389914,0.6649494171142578,0.0
140,5,AdaBoost (Discrete),2,0.6,0.3982608695652174,0.442189535154294,49.92316484451294,0.442189535154294
141,5,AdaBoost (Real),2,0.6,0.391304347826087,0.40472056117554317,61.83217263221741,0.40472056117554317
142,5,Logistic Regression (Penalty = L2),2,0.6,0.5582608695652174,0.4862376070552159,0.5128142833709717,0.4862376070552159
143,5,Naive Bayes,2,0.6,0.5478260869565217,0.8392974277582299,0.12108182907104492,0.0
144,6,KNeighbors Classifier,0,0.6,0.8006932409012132,0.8012236348977806,0.5858187675476074,0.0
145,6,SVC Classifier,0,0.6,0.6845753899480069,0.8129520829107402,1.0706558227539062,0.0
146,6,Decision Tree,0,0.6,0.7417677642980935,0.8617274844321391,0.002613544464111328,0.0
147,6,RandomForest,0,0.6,0.7417677642980935,0.7407118766149331,0.8360378742218018,0.0
148,6,AdaBoost (Discrete),0,0.6,0.75736568457539,0.4674451995773052,49.38498497009277,0.0
149,6,AdaBoost (Real),0,0.6,0.729636048526863,0.6040741934465657,89.33729290962219,0.0
150,6,Logistic Regression (Penalty = L2),0,0.6,0.7417677642980935,0.8617274844321391,0.2526214122772217,0.0
151,6,Naive Bayes,0,0.6,0.5805892547660312,0.6192878878744241,0.24505949020385742,0.0
152,6,KNeighbors Classifier,1,0.6,0.7413194444444444,0.6920039139148341,0.4835820198059082,0.0
153,6,SVC Classifier,1,0.6,0.7690972222222222,0.8841027752029671,1.1163880825042725,0.0
154,6,Decision Tree,1,0.6,0.7326388888888888,0.33946031123148374,0.0016970634460449219,0.0
155,6,RandomForest,1,0.6,0.6996527777777778,1.0,0.857900857925415,0.0
156,6,AdaBoost (Discrete),1,0.6,0.6319444444444444,0.6965949162125973,50.56891059875488,0.0
157,6,AdaBoost (Real),1,0.6,0.3159722222222222,0.42487423462558527,63.65708041191101,0.0
158,6,Logistic Regression (Penalty = L2),1,0.6,0.71875,0.6234161071707248,0.39937829971313477,0.0
159,6,Naive Bayes,1,0.6,0.6840277777777778,0.7034341761336865,0.2610130310058594,0.0
160,6,KNeighbors Classifier,2,0.6,0.7982608695652174,0.6113784932574505,0.7414078712463379,0.6113784932574505
161,6,SVC Classifier,2,0.6,0.7617391304347826,0.5617326583032773,0.9995112419128418,0.0
162,6,Decision Tree,2,0.6,0.8034782608695652,0.47278788107805786,0.0016810894012451172,0.47278788107805786
163,6,RandomForest,2,0.6,0.7339130434782609,0.4386395121145487,0.8494834899902344,0.0
164,6,AdaBoost (Discrete),2,0.6,0.44521739130434784,0.4383605066407952,48.745365619659424,0.4383605066407952
165,6,AdaBoost (Real),2,0.6,0.6226086956521739,0.28696599630804415,64.71465349197388,0.28696599630804415
166,6,Logistic Regression (Penalty = L2),2,0.6,0.7791304347826087,0.5744179739510636,0.33527445793151855,0.5744179739510636
167,6,Naive Bayes,2,0.6,0.46608695652173915,0.6897771060056679,0.22913599014282227,0.0
168,7,KNeighbors Classifier,0,0.6,0.6967071057192374,0.5916516027851242,0.7353971004486084,0.0
169,7,SVC Classifier,0,0.6,0.6845753899480069,0.8129520829107402,1.0446970462799072,0.0
170,7,Decision Tree,0,0.6,0.6360485268630849,0.5498693567355661,0.11484241485595703,0.0
171,7,RandomForest,0,0.6,0.7001733102253033,1.0,0.695650577545166,0.0
172,7,AdaBoost (Discrete),0,0.6,0.23743500866551126,0.24436069827658005,49.15070343017578,0.0
173,7,AdaBoost (Real),0,0.6,0.2218370883882149,0.2649102639566414,60.726335525512695,0.0
174,7,Logistic Regression (Penalty = L2),0,0.6,0.6395147313691508,0.6832394989103653,0.4953911304473877,0.0
175,7,Naive Bayes,0,0.6,0.6429809358752167,0.7508927762297288,0.003236055374145508,0.0
176,7,KNeighbors Classifier,1,0.6,0.703125,0.37647612287077614,0.5573599338531494,0.0
177,7,SVC Classifier,1,0.6,0.7274305555555556,0.7636780043269571,1.1073052883148193,0.0
178,7,Decision Tree,1,0.6,0.7708333333333334,0.5659098232155215,0.1262669563293457,0.0
179,7,RandomForest,1,0.6,0.6996527777777778,1.0,0.7979927062988281,0.0
180,7,AdaBoost (Discrete),1,0.6,0.7326388888888888,0.4193686103143949,47.5568311214447,0.0
181,7,AdaBoost (Real),1,0.6,0.3940972222222222,0.4190627542627451,56.142446756362915,0.0
182,7,Logistic Regression (Penalty = L2),1,0.6,0.71875,0.6138900896607005,0.35079526901245117,0.0
183,7,Naive Bayes,1,0.6,0.78125,0.6802396938019404,0.1054086685180664,0.0
184,7,KNeighbors Classifier,2,0.6,0.7513043478260869,0.7033688740374949,0.7086410522460938,0.0
185,7,SVC Classifier,2,0.6,0.8434782608695652,0.837206672457254,0.9381396770477295,0.0
186,7,Decision Tree,2,0.6,0.7739130434782608,0.510823214165285,0.0024662017822265625,0.510823214165285
187,7,RandomForest,2,0.6,0.7008695652173913,1.0,0.6204431056976318,0.0
188,7,AdaBoost (Discrete),2,0.6,0.25043478260869567,0.34561350122029216,45.052592754364014,0.34561350122029216
189,7,AdaBoost (Real),2,0.6,0.24,0.2915980343318388,54.652671575546265,0.2915980343318388
190,7,Logistic Regression (Penalty = L2),2,0.6,0.6104347826086957,0.4215862361310502,0.4902360439300537,0.4215862361310502
191,7,Naive Bayes,2,0.6,0.528695652173913,0.7234770261807716,0.10354995727539062,0.0
192,8,KNeighbors Classifier,0,0.6,0.8180242634315424,0.8418857751594582,0.32517313957214355,0.0
193,8,SVC Classifier,0,0.6,0.6845753899480069,0.8129520829107402,0.8327348232269287,0.0
194,8,Decision Tree,0,0.6,0.7608318890814558,0.8488398460006551,0.10689425468444824,0.0
195,8,RandomForest,0,0.6,0.6707105719237435,0.9579207920792079,0.7215027809143066,0.0
196,8,AdaBoost (Discrete),0,0.6,0.3882149046793761,0.4846020108407425,46.082902669906616,0.0
197,8,AdaBoost (Real),0,0.6,0.2634315424610052,0.24373333911071626,55.986594438552856,0.0
198,8,Logistic Regression (Penalty = L2),0,0.6,0.7417677642980935,0.8617274844321391,0.28382086753845215,0.0
199,8,Naive Bayes,0,0.6,0.5805892547660312,0.6192878878744241,0.10567808151245117,0.0
200,8,KNeighbors Classifier,1,0.6,0.75,0.477442939197775,0.41733503341674805,0.0
201,8,SVC Classifier,1,0.6,0.78125,0.7990572919580082,0.9252033233642578,0.0
202,8,Decision Tree,1,0.6,0.7413194444444444,0.5154007187375018,0.10292768478393555,0.0
203,8,RandomForest,1,0.6,0.7604166666666666,0.5678252885462702,0.6179096698760986,0.0
204,8,AdaBoost (Discrete),1,0.6,0.7482638888888888,0.5283713398002664,43.68640470504761,0.0
205,8,AdaBoost (Real),1,0.6,0.3645833333333333,0.3978845263465365,56.18531537055969,0.0
206,8,Logistic Regression (Penalty = L2),1,0.6,0.71875,0.6234161071707248,0.35474538803100586,0.0
207,8,Naive Bayes,1,0.6,0.6840277777777778,0.7034341761336865,0.19042420387268066,0.0
208,8,KNeighbors Classifier,2,0.6,0.7843478260869565,0.5053146070727272,0.7060489654541016,0.5053146070727272
209,8,SVC Classifier,2,0.6,0.7617391304347826,0.5617326583032773,1.0533044338226318,0.0
210,8,Decision Tree,2,0.6,0.35304347826086957,0.43711132924801893,0.0026280879974365234,0.43711132924801893
211,8,RandomForest,2,0.6,0.7182608695652174,0.2795084971874737,0.7272779941558838,0.0
212,8,AdaBoost (Discrete),2,0.6,0.5982608695652174,0.5587580829881914,43.55211806297302,0.5587580829881914
213,8,AdaBoost (Real),2,0.6,0.6017391304347826,0.28432086622513153,56.92196488380432,0.28432086622513153
214,8,Logistic Regression (Penalty = L2),2,0.6,0.8,0.48805821521986437,0.49883270263671875,0.48805821521986437
215,8,Naive Bayes,2,0.6,0.46608695652173915,0.6897771060056679,0.10393285751342773,0.0
216,9,KNeighbors Classifier,0,0.6,0.8110918544194108,0.5387056143157714,0.5245175361633301,0.0
217,9,SVC Classifier,0,0.6,0.6845753899480069,0.8129520829107402,0.8333301544189453,0.0
218,9,Decision Tree,0,0.6,0.7972270363951474,0.5877590453365311,0.10285568237304688,0.0
219,9,RandomForest,0,0.6,0.7001733102253033,1.0,0.5292613506317139,0.0
220,9,AdaBoost (Discrete),0,0.6,0.36741767764298094,0.40581441194728096,45.24051380157471,0.0
221,9,AdaBoost (Real),0,0.6,0.317157712305026,0.3479082081364375,56.48213315010071,0.0
222,9,Logistic Regression (Penalty = L2),0,0.6,0.7833622183708839,0.679137370543918,0.42713427543640137,0.0
223,9,Naive Bayes,0,0.6,0.5805892547660312,0.6192878878744241,0.11346578598022461,0.0
224,9,KNeighbors Classifier,1,0.6,0.796875,0.5138402298083659,0.7244985103607178,0.0
225,9,SVC Classifier,1,0.6,0.7847222222222222,0.8290042122154554,1.0217363834381104,0.0
226,9,Decision Tree,1,0.6,0.7152777777777778,0.4100788607499847,0.09872150421142578,0.0
227,9,RandomForest,1,0.6,0.6996527777777778,1.0,0.6294963359832764,0.0
228,9,AdaBoost (Discrete),1,0.6,0.7013888888888888,0.42521565592304955,46.393861293792725,0.0
229,9,AdaBoost (Real),1,0.6,0.2847222222222222,0.21369233316061795,54.69055104255676,0.0
230,9,Logistic Regression (Penalty = L2),1,0.6,0.7100694444444444,0.32598364698774807,0.42134571075439453,0.0
231,9,Naive Bayes,1,0.6,0.6840277777777778,0.7034341761336865,0.10585308074951172,0.0
232,9,KNeighbors Classifier,2,0.6,0.7356521739130435,0.4142849266000356,0.7305974960327148,0.0
233,9,SVC Classifier,2,0.6,0.7617391304347826,0.6767502123205655,0.9252657890319824,0.0
234,9,Decision Tree,2,0.6,0.6539130434782608,0.45446614685184805,0.10300660133361816,0.45446614685184805
235,9,RandomForest,2,0.6,0.7078260869565217,0.1767766952966369,0.5961415767669678,0.0
236,9,AdaBoost (Discrete),2,0.6,0.10782608695652174,0.20117689066903224,44.30017328262329,0.0
237,9,AdaBoost (Real),2,0.6,0.09043478260869565,0.16553898215649457,57.484113454818726,0.0
238,9,Logistic Regression (Penalty = L2),2,0.6,0.6678260869565218,0.5132449337600827,0.5013241767883301,0.5132449337600827
239,9,Naive Bayes,2,0.6,0.46608695652173915,0.6897771060056679,0.20494532585144043,0.0
240,10,KNeighbors Classifier,0,0.6,0.6741767764298093,0.5675078717845609,1.024169683456421,0.0
241,10,SVC Classifier,0,0.6,0.6845753899480069,0.8129520829107402,0.9597277641296387,0.0
242,10,Decision Tree,0,0.6,0.733102253032929,0.5489141542518593,0.10707759857177734,0.0
243,10,RandomForest,0,0.6,0.7001733102253033,0.4199540286014814,0.8486301898956299,0.0
244,10,AdaBoost (Discrete),0,0.6,0.7487001733102253,0.6330959950896453,45.82526206970215,0.0
245,10,AdaBoost (Real),0,0.6,0.7227036395147314,0.6188016175915455,52.516106605529785,0.0
246,10,Logistic Regression (Penalty = L2),0,0.6,0.6932409012131716,0.7458113231260104,0.45957112312316895,0.0
247,10,Naive Bayes,0,0.6,0.6672443674176777,0.7914018355435688,0.1170346736907959,0.0
248,10,KNeighbors Classifier,1,0.6,0.6163194444444444,0.44925026170452087,1.1976637840270996,0.0
249,10,SVC Classifier,1,0.6,0.7274305555555556,0.7636780043269571,1.285529613494873,0.0
250,10,Decision Tree,1,0.6,0.8055555555555556,0.30966093962940583,0.0027790069580078125,0.30966093962940583
251,10,RandomForest,1,0.6,0.7239583333333334,0.42760658851442285,0.7476246356964111,0.0
252,10,AdaBoost (Discrete),1,0.6,0.7916666666666666,0.3906977268904176,46.700496673583984,0.0
253,10,AdaBoost (Real),1,0.6,0.7743055555555556,0.6410769994818538,56.30068516731262,0.0
254,10,Logistic Regression (Penalty = L2),1,0.6,0.7430555555555556,0.5247803248102658,0.49067187309265137,0.0
255,10,Naive Bayes,1,0.6,0.7829861111111112,0.6820345298093242,0.1090385913848877,0.0
256,10,KNeighbors Classifier,2,0.6,0.7773913043478261,0.44479750225479026,1.0520963668823242,0.44479750225479026
257,10,SVC Classifier,2,0.6,0.7530434782608696,0.5985404082828448,1.3186454772949219,0.0
258,10,Decision Tree,2,0.6,0.7356521739130435,0.42719894956405396,0.0018382072448730469,0.42719894956405396
259,10,RandomForest,2,0.6,0.7060869565217391,0.15309310892394862,0.7618658542633057,0.0
260,10,AdaBoost (Discrete),2,0.6,0.40869565217391307,0.501007423896477,41.06029653549194,0.501007423896477
261,10,AdaBoost (Real),2,0.6,0.3234782608695652,0.3996983473511857,47.094959020614624,0.3996983473511857
262,10,Logistic Regression (Penalty = L2),2,0.6,0.6086956521739131,0.4992153355053947,0.40715527534484863,0.4992153355053947
263,10,Naive Bayes,2,0.6,0.5478260869565217,0.8392974277582299,0.09976506233215332,0.0
264,11,KNeighbors Classifier,0,0.6,0.6568457538994801,0.635797814864237,1.5972871780395508,0.0
265,11,SVC Classifier,0,0.6,0.6845753899480069,0.8129520829107402,1.0747532844543457,0.0
266,11,Decision Tree,0,0.6,0.6325823223570191,0.23571164288298738,0.09107184410095215,0.0
267,11,RandomForest,0,0.6,0.7001733102253033,1.0,0.7626223564147949,0.0
268,11,AdaBoost (Discrete),0,0.6,0.7521663778162911,0.6944144468157013,47.90526843070984,0.0
269,11,AdaBoost (Real),0,0.6,0.7313691507798961,0.6220896794104745,55.04743838310242,0.0
270,11,Logistic Regression (Penalty = L2),0,0.6,0.6863084922010398,0.7210131717325844,0.37921762466430664,0.0
271,11,Naive Bayes,0,0.6,0.6672443674176777,0.7914018355435688,0.25390005111694336,0.0
272,11,KNeighbors Classifier,1,0.6,0.6961805555555556,0.3630128918050201,1.3725838661193848,0.0
273,11,SVC Classifier,1,0.6,0.7274305555555556,0.7636780043269571,1.3298211097717285,0.0
274,11,Decision Tree,1,0.6,0.6996527777777778,0.5584404290852446,0.002474546432495117,0.0
275,11,RandomForest,1,0.6,0.6996527777777778,1.0,0.772519588470459,0.0
276,11,AdaBoost (Discrete),1,0.6,0.7517361111111112,0.43129654708987847,47.18379092216492,0.0
277,11,AdaBoost (Real),1,0.6,0.7690972222222222,0.5572880389795307,54.078694105148315,0.0
278,11,Logistic Regression (Penalty = L2),1,0.6,0.7482638888888888,0.6268843050507011,0.39417505264282227,0.0
279,11,Naive Bayes,1,0.6,0.7829861111111112,0.6820345298093242,0.21958088874816895,0.0
280,11,KNeighbors Classifier,2,0.6,0.8330434782608696,0.7552608308349611,1.4574387073516846,0.7552608308349611
281,11,SVC Classifier,2,0.6,0.7356521739130435,0.6012871326420459,1.1792635917663574,0.0
282,11,Decision Tree,2,0.6,0.4330434782608696,0.34050967714647484,0.0031099319458007812,0.34050967714647484
283,11,RandomForest,2,0.6,0.7008695652173913,1.0,0.6766245365142822,0.0
284,11,AdaBoost (Discrete),2,0.6,0.3634782608695652,0.49891083840597705,44.56423902511597,0.49891083840597705
285,11,AdaBoost (Real),2,0.6,0.5304347826086957,0.5946496597352795,47.56557512283325,0.5946496597352795
286,11,Logistic Regression (Penalty = L2),2,0.6,0.6052173913043478,0.52602626583304,0.6140110492706299,0.52602626583304
287,11,Naive Bayes,2,0.6,0.5478260869565217,0.8392974277582299,0.14274263381958008,0.0
288,12,KNeighbors Classifier,0,0.6,0.8006932409012132,0.8012236348977806,0.32187795639038086,0.0
289,12,SVC Classifier,0,0.6,0.6845753899480069,0.8129520829107402,0.6417050361633301,0.0
290,12,Decision Tree,0,0.6,0.7417677642980935,0.8617274844321391,0.0016396045684814453,0.0
291,12,RandomForest,0,0.6,0.7417677642980935,0.7407118766149331,0.4871640205383301,0.0
292,12,AdaBoost (Discrete),0,0.6,0.75736568457539,0.4674451995773052,35.345884799957275,0.0
293,12,AdaBoost (Real),0,0.6,0.7469670710571924,0.7541397712323992,42.53808951377869,0.0
294,12,Logistic Regression (Penalty = L2),0,0.6,0.7417677642980935,0.8617274844321391,0.21657848358154297,0.0
295,12,Naive Bayes,0,0.6,0.5805892547660312,0.6192878878744241,0.14568710327148438,0.0
296,12,KNeighbors Classifier,1,0.6,0.7413194444444444,0.6920039139148341,0.4145212173461914,0.0
297,12,SVC Classifier,1,0.6,0.7690972222222222,0.8841027752029671,0.7153518199920654,0.0
298,12,Decision Tree,1,0.6,0.7326388888888888,0.33946031123148374,0.05954265594482422,0.0
299,12,RandomForest,1,0.6,0.6996527777777778,1.0,0.510228157043457,0.0
300,12,AdaBoost (Discrete),1,0.6,0.6319444444444444,0.6965949162125973,31.782660961151123,0.0
301,12,AdaBoost (Real),1,0.6,0.3263888888888889,0.4485257902109938,39.25115132331848,0.0
302,12,Logistic Regression (Penalty = L2),1,0.6,0.71875,0.6234161071707248,0.2664024829864502,0.0
303,12,Naive Bayes,1,0.6,0.6840277777777778,0.7034341761336865,0.07721757888793945,0.0
304,12,KNeighbors Classifier,2,0.6,0.7982608695652174,0.6113784932574505,0.38918519020080566,0.6113784932574505
305,12,SVC Classifier,2,0.6,0.7617391304347826,0.5617326583032773,0.6227381229400635,0.0
306,12,Decision Tree,2,0.6,0.8069565217391305,0.6783869293067258,0.0018131732940673828,0.6783869293067258
307,12,RandomForest,2,0.6,0.7339130434782609,0.4386395121145487,0.5278065204620361,0.0
308,12,AdaBoost (Discrete),2,0.6,0.44521739130434784,0.4383605066407952,30.226710081100464,0.4383605066407952
309,12,AdaBoost (Real),2,0.6,0.6539130434782608,0.3330182178065554,37.57714319229126,0.3330182178065554
310,12,Logistic Regression (Penalty = L2),2,0.6,0.7791304347826087,0.5744179739510636,0.22838592529296875,0.5744179739510636
311,12,Naive Bayes,2,0.6,0.46608695652173915,0.6897771060056679,0.0612788200378418,0.0
