,feat_set_id,classifier,fold_id,feat_th,score,geo_score,exec_t,geo_score_woz
0,0,KNeighbors Classifier,0,0.5,0.9333333333333333,1.0,0.3675858974456787,0.0
1,0,SVC Classifier,0,0.5,0.009523809523809525,1.0,0.9080104827880859,0.0
2,0,Decision Tree,0,0.5,0.9333333333333333,1.0,0.09075236320495605,0.0
3,0,RandomForest,0,0.5,0.1619047619047619,1.0,0.5341963768005371,0.0
4,0,AdaBoost (Discrete),0,0.5,0.6476190476190476,1.0,33.35975241661072,0.0
5,0,AdaBoost (Real),0,0.5,0.9333333333333333,1.0,114.61934804916382,0.0
6,0,Logistic Regression (Penalty = L2),0,0.5,0.1523809523809524,1.0,0.9500627517700195,0.0
7,0,Naive Bayes,0,0.5,0.9333333333333333,1.0,0.7895286083221436,0.0
8,0,KNeighbors Classifier,1,0.5,0.9339622641509434,1.0,0.20490264892578125,0.0
9,0,SVC Classifier,1,0.5,0.9245283018867925,1.0,0.8998126983642578,0.0
10,0,Decision Tree,1,0.5,0.9339622641509434,1.0,0.0016031265258789062,0.0
11,0,RandomForest,1,0.5,0.16037735849056603,1.0,0.4907491207122803,0.0
12,0,AdaBoost (Discrete),1,0.5,0.6132075471698113,1.0,32.27210855484009,0.0
13,0,AdaBoost (Real),1,0.5,0.9150943396226415,1.0,63.71234631538391,0.0
14,0,Logistic Regression (Penalty = L2),1,0.5,0.1509433962264151,1.0,1.0759093761444092,0.0
15,0,Naive Bayes,1,0.5,0.9339622641509434,1.0,0.5772185325622559,0.0
16,0,KNeighbors Classifier,2,0.5,0.9333333333333333,1.0,0.2940964698791504,0.0
17,0,SVC Classifier,2,0.5,0.009523809523809525,1.0,0.7658934593200684,0.0
18,0,Decision Tree,2,0.5,0.9333333333333333,1.0,0.09401583671569824,0.0
19,0,RandomForest,2,0.5,0.17142857142857143,1.0,0.4724888801574707,0.0
20,0,AdaBoost (Discrete),2,0.5,0.6095238095238096,1.0,30.466845989227295,0.0
21,0,AdaBoost (Real),2,0.5,0.9142857142857143,1.0,66.51908206939697,0.0
22,0,Logistic Regression (Penalty = L2),2,0.5,0.1523809523809524,1.0,1.46187424659729,0.0
23,0,Naive Bayes,2,0.5,0.9333333333333333,1.0,0.9646737575531006,0.0
24,1,KNeighbors Classifier,0,0.5,1.0,1.0,0.2893960475921631,1.0
25,1,SVC Classifier,0,0.5,0.009523809523809525,1.0,1.1859605312347412,0.0
26,1,Decision Tree,0,0.5,1.0,1.0,0.09685206413269043,1.0
27,1,RandomForest,0,0.5,0.17142857142857143,1.0,0.7685072422027588,0.0
28,1,AdaBoost (Discrete),0,0.5,0.8952380952380953,1.0,46.84678649902344,0.0
29,1,AdaBoost (Real),0,0.5,0.8761904761904762,1.0,88.72613620758057,0.0
30,1,Logistic Regression (Penalty = L2),0,0.5,0.5714285714285714,1.0,1.3833942413330078,0.0
31,1,Naive Bayes,0,0.5,1.0,1.0,0.9164104461669922,1.0
32,1,KNeighbors Classifier,1,0.5,1.0,1.0,0.287569522857666,1.0
33,1,SVC Classifier,1,0.5,1.0,1.0,1.2413995265960693,1.0
34,1,Decision Tree,1,0.5,1.0,1.0,0.09741449356079102,1.0
35,1,RandomForest,1,0.5,0.19811320754716982,1.0,0.8682816028594971,0.0
36,1,AdaBoost (Discrete),1,0.5,0.9528301886792453,1.0,47.53258681297302,0.0
37,1,AdaBoost (Real),1,0.5,0.8018867924528302,1.0,85.16769075393677,0.0
38,1,Logistic Regression (Penalty = L2),1,0.5,0.7735849056603774,1.0,2.0344057083129883,0.0
39,1,Naive Bayes,1,0.5,1.0,1.0,0.8167681694030762,1.0
40,1,KNeighbors Classifier,2,0.5,1.0,1.0,0.27584028244018555,1.0
41,1,SVC Classifier,2,0.5,0.009523809523809525,1.0,1.182288408279419,0.0
42,1,Decision Tree,2,0.5,1.0,1.0,0.1891944408416748,1.0
43,1,RandomForest,2,0.5,0.19047619047619047,1.0,0.6768913269042969,0.0
44,1,AdaBoost (Discrete),2,0.5,0.8380952380952381,1.0,47.061307191848755,0.0
45,1,AdaBoost (Real),2,0.5,0.8380952380952381,1.0,84.55823040008545,0.0
46,1,Logistic Regression (Penalty = L2),2,0.5,0.7047619047619048,1.0,2.1615946292877197,0.0
47,1,Naive Bayes,2,0.5,1.0,1.0,0.8807311058044434,1.0
48,2,KNeighbors Classifier,0,0.5,1.0,1.0,0.28946566581726074,1.0
49,2,SVC Classifier,0,0.5,0.009523809523809525,1.0,1.2262353897094727,0.0
50,2,Decision Tree,0,0.5,1.0,1.0,0.08495330810546875,1.0
51,2,RandomForest,0,0.5,0.21904761904761905,1.0,0.7075150012969971,0.0
52,2,AdaBoost (Discrete),0,0.5,0.9142857142857143,1.0,49.34173631668091,0.0
53,2,AdaBoost (Real),0,0.5,0.8380952380952381,1.0,92.89719223976135,0.0
54,2,Logistic Regression (Penalty = L2),0,0.5,0.6952380952380952,1.0,1.5145442485809326,0.0
55,2,Naive Bayes,0,0.5,1.0,1.0,0.9101259708404541,1.0
56,2,KNeighbors Classifier,1,0.5,1.0,1.0,0.3975710868835449,1.0
57,2,SVC Classifier,1,0.5,1.0,1.0,1.2178254127502441,1.0
58,2,Decision Tree,1,0.5,1.0,1.0,0.10029363632202148,1.0
59,2,RandomForest,1,0.5,0.1792452830188679,1.0,0.7954871654510498,0.0
60,2,AdaBoost (Discrete),1,0.5,0.8679245283018868,1.0,47.56427812576294,0.0
61,2,AdaBoost (Real),1,0.5,0.839622641509434,1.0,83.43069815635681,0.0
62,2,Logistic Regression (Penalty = L2),1,0.5,0.8207547169811321,1.0,1.9823336601257324,0.0
63,2,Naive Bayes,1,0.5,1.0,1.0,0.7715089321136475,1.0
64,2,KNeighbors Classifier,2,0.5,1.0,1.0,0.2825038433074951,1.0
65,2,SVC Classifier,2,0.5,0.009523809523809525,1.0,1.3362913131713867,0.0
66,2,Decision Tree,2,0.5,1.0,1.0,0.09940958023071289,1.0
67,2,RandomForest,2,0.5,0.2,1.0,0.8141062259674072,0.0
68,2,AdaBoost (Discrete),2,0.5,0.6190476190476191,1.0,43.98388171195984,0.0
69,2,AdaBoost (Real),2,0.5,0.8952380952380953,1.0,79.84995126724243,0.0
70,2,Logistic Regression (Penalty = L2),2,0.5,0.780952380952381,1.0,2.0215775966644287,0.0
71,2,Naive Bayes,2,0.5,1.0,1.0,0.9750657081604004,1.0
72,3,KNeighbors Classifier,0,0.5,1.0,1.0,0.3969099521636963,1.0
73,3,SVC Classifier,0,0.5,0.009523809523809525,1.0,1.2158989906311035,0.0
74,3,Decision Tree,0,0.5,1.0,1.0,0.0028836727142333984,1.0
75,3,RandomForest,0,0.5,0.18095238095238095,1.0,0.7028543949127197,0.0
76,3,AdaBoost (Discrete),0,0.5,0.8666666666666667,1.0,45.90508580207825,0.0
77,3,AdaBoost (Real),0,0.5,0.9809523809523809,1.0,89.006178855896,0.0
78,3,Logistic Regression (Penalty = L2),0,0.5,0.3619047619047619,1.0,1.132171392440796,0.0
79,3,Naive Bayes,0,0.5,1.0,1.0,0.9882404804229736,1.0
80,3,KNeighbors Classifier,1,0.5,1.0,1.0,0.3975808620452881,1.0
81,3,SVC Classifier,1,0.5,1.0,1.0,1.2089991569519043,1.0
82,3,Decision Tree,1,0.5,1.0,1.0,0.002889871597290039,1.0
83,3,RandomForest,1,0.5,0.24528301886792453,1.0,0.8081791400909424,0.0
84,3,AdaBoost (Discrete),1,0.5,0.8867924528301887,1.0,41.4474458694458,0.0
85,3,AdaBoost (Real),1,0.5,0.9716981132075472,1.0,76.02024221420288,0.0
86,3,Logistic Regression (Penalty = L2),1,0.5,0.41509433962264153,1.0,1.457258939743042,0.0
87,3,Naive Bayes,1,0.5,1.0,1.0,0.8403177261352539,1.0
88,3,KNeighbors Classifier,2,0.5,1.0,1.0,0.26866579055786133,1.0
89,3,SVC Classifier,2,0.5,0.009523809523809525,1.0,1.0901703834533691,0.0
90,3,Decision Tree,2,0.5,1.0,1.0,0.11007833480834961,1.0
91,3,RandomForest,2,0.5,0.24761904761904763,1.0,0.6464946269989014,0.0
92,3,AdaBoost (Discrete),2,0.5,0.8952380952380953,1.0,40.00528049468994,0.0
93,3,AdaBoost (Real),2,0.5,0.9809523809523809,1.0,74.91196131706238,0.0
94,3,Logistic Regression (Penalty = L2),2,0.5,0.41904761904761906,1.0,1.507120132446289,0.0
95,3,Naive Bayes,2,0.5,1.0,1.0,0.7694122791290283,1.0
96,4,KNeighbors Classifier,0,0.5,0.9047619047619048,1.0,0.2797415256500244,0.0
97,4,SVC Classifier,0,0.5,0.009523809523809525,1.0,1.146047592163086,0.0
98,4,Decision Tree,0,0.5,0.9047619047619048,1.0,0.09135055541992188,0.0
99,4,RandomForest,0,0.5,0.1523809523809524,1.0,0.7171146869659424,0.0
100,4,AdaBoost (Discrete),0,0.5,0.638095238095238,1.0,37.01162385940552,0.0
101,4,AdaBoost (Real),0,0.5,0.9047619047619048,1.0,75.47501707077026,0.0
102,4,Logistic Regression (Penalty = L2),0,0.5,0.0761904761904762,1.0,0.7445948123931885,0.0
103,4,Naive Bayes,0,0.5,0.9047619047619048,1.0,0.708641767501831,0.0
104,4,KNeighbors Classifier,1,0.5,0.9056603773584906,1.0,0.25236940383911133,0.0
105,4,SVC Classifier,1,0.5,0.9056603773584906,1.0,1.1295983791351318,0.0
106,4,Decision Tree,1,0.5,0.9056603773584906,1.0,0.08885407447814941,0.0
107,4,RandomForest,1,0.5,0.16037735849056603,1.0,0.5362775325775146,0.0
108,4,AdaBoost (Discrete),1,0.5,0.6509433962264151,1.0,36.043808698654175,0.0
109,4,AdaBoost (Real),1,0.5,0.8867924528301887,1.0,72.85977029800415,0.0
110,4,Logistic Regression (Penalty = L2),1,0.5,0.08490566037735849,1.0,0.8700311183929443,0.0
111,4,Naive Bayes,1,0.5,0.9056603773584906,1.0,0.7445409297943115,0.0
112,4,KNeighbors Classifier,2,0.5,0.9047619047619048,1.0,0.2772364616394043,0.0
113,4,SVC Classifier,2,0.5,0.009523809523809525,1.0,1.086970567703247,0.0
114,4,Decision Tree,2,0.5,0.9047619047619048,1.0,0.09171319007873535,0.0
115,4,RandomForest,2,0.5,0.18095238095238095,1.0,0.761136531829834,0.0
116,4,AdaBoost (Discrete),2,0.5,0.580952380952381,1.0,36.845353841781616,0.0
117,4,AdaBoost (Real),2,0.5,0.8952380952380953,1.0,68.12703204154968,0.0
118,4,Logistic Regression (Penalty = L2),2,0.5,0.08571428571428572,1.0,0.9588918685913086,0.0
119,4,Naive Bayes,2,0.5,0.9047619047619048,1.0,0.7605664730072021,0.0
120,6,KNeighbors Classifier,0,0.5,0.9238095238095239,1.0,0.25599026679992676,0.0
121,6,SVC Classifier,0,0.5,0.009523809523809525,1.0,1.1609649658203125,0.0
122,6,Decision Tree,0,0.5,0.9238095238095239,1.0,0.09479832649230957,0.0
123,6,RandomForest,0,0.5,0.10476190476190476,1.0,0.6511542797088623,0.0
124,6,AdaBoost (Discrete),0,0.5,0.638095238095238,1.0,36.92447352409363,0.0
125,6,AdaBoost (Real),0,0.5,0.9047619047619048,1.0,75.13171553611755,0.0
126,6,Logistic Regression (Penalty = L2),0,0.5,0.12380952380952381,1.0,0.815692663192749,0.0
127,6,Naive Bayes,0,0.5,0.9238095238095239,1.0,0.7101571559906006,0.0
128,6,KNeighbors Classifier,1,0.5,0.9245283018867925,1.0,0.26367855072021484,0.0
129,6,SVC Classifier,1,0.5,0.9150943396226415,1.0,1.0432887077331543,0.0
130,6,Decision Tree,1,0.5,0.9245283018867925,1.0,0.0870974063873291,0.0
131,6,RandomForest,1,0.5,0.16037735849056603,1.0,0.7181119918823242,0.0
132,6,AdaBoost (Discrete),1,0.5,0.5943396226415094,1.0,35.782984018325806,0.0
133,6,AdaBoost (Real),1,0.5,0.9056603773584906,1.0,68.97475576400757,0.0
134,6,Logistic Regression (Penalty = L2),1,0.5,0.1320754716981132,1.0,1.3203446865081787,0.0
135,6,Naive Bayes,1,0.5,0.9245283018867925,1.0,0.7410659790039062,0.0
136,6,KNeighbors Classifier,2,0.5,0.9238095238095239,1.0,0.1700301170349121,0.0
137,6,SVC Classifier,2,0.5,0.009523809523809525,1.0,0.838486909866333,0.0
138,6,Decision Tree,2,0.5,0.9238095238095239,1.0,0.08241915702819824,0.0
139,6,RandomForest,2,0.5,0.1619047619047619,1.0,0.5582726001739502,0.0
140,6,AdaBoost (Discrete),2,0.5,0.7142857142857143,1.0,34.3298819065094,0.0
141,6,AdaBoost (Real),2,0.5,0.9047619047619048,1.0,67.66023135185242,0.0
142,6,Logistic Regression (Penalty = L2),2,0.5,0.13333333333333333,1.0,1.1503441333770752,0.0
143,6,Naive Bayes,2,0.5,0.9238095238095239,1.0,0.7726671695709229,0.0
144,7,KNeighbors Classifier,0,0.5,1.0,1.0,0.2682228088378906,1.0
145,7,SVC Classifier,0,0.5,0.009523809523809525,1.0,0.9299991130828857,0.0
146,7,Decision Tree,0,0.5,1.0,1.0,0.07623982429504395,1.0
147,7,RandomForest,0,0.5,0.20952380952380953,1.0,0.49706006050109863,0.0
148,7,AdaBoost (Discrete),0,0.5,0.8857142857142857,1.0,39.00519371032715,0.0
149,7,AdaBoost (Real),0,0.5,0.8095238095238095,1.0,75.26143503189087,0.0
150,7,Logistic Regression (Penalty = L2),0,0.5,0.5523809523809524,1.0,0.9820055961608887,0.0
151,7,Naive Bayes,0,0.5,1.0,1.0,0.6250331401824951,1.0
152,7,KNeighbors Classifier,1,0.5,1.0,1.0,0.23581409454345703,1.0
153,7,SVC Classifier,1,0.5,1.0,1.0,0.9630990028381348,1.0
154,7,Decision Tree,1,0.5,1.0,1.0,0.08839678764343262,1.0
155,7,RandomForest,1,0.5,0.16981132075471697,1.0,0.517444372177124,0.0
156,7,AdaBoost (Discrete),1,0.5,0.9150943396226415,1.0,35.95869994163513,0.0
157,7,AdaBoost (Real),1,0.5,0.8207547169811321,1.0,65.6369960308075,0.0
158,7,Logistic Regression (Penalty = L2),1,0.5,0.6981132075471698,1.0,1.2869892120361328,0.0
159,7,Naive Bayes,1,0.5,1.0,1.0,0.6287360191345215,1.0
160,7,KNeighbors Classifier,2,0.5,1.0,1.0,0.14895296096801758,1.0
161,7,SVC Classifier,2,0.5,0.009523809523809525,1.0,0.9351179599761963,0.0
162,7,Decision Tree,2,0.5,1.0,1.0,0.07624340057373047,1.0
163,7,RandomForest,2,0.5,0.19047619047619047,1.0,0.5557479858398438,0.0
164,7,AdaBoost (Discrete),2,0.5,0.8666666666666667,1.0,33.58966565132141,0.0
165,7,AdaBoost (Real),2,0.5,0.9428571428571428,1.0,53.51973485946655,0.0
166,7,Logistic Regression (Penalty = L2),2,0.5,0.638095238095238,1.0,1.12068510055542,0.0
167,7,Naive Bayes,2,0.5,1.0,1.0,0.5431036949157715,1.0
168,8,KNeighbors Classifier,0,0.5,1.0,1.0,0.12109708786010742,1.0
169,8,SVC Classifier,0,0.5,0.009523809523809525,1.0,0.6470015048980713,0.0
170,8,Decision Tree,0,0.5,1.0,1.0,0.0021390914916992188,1.0
171,8,RandomForest,0,0.5,0.18095238095238095,1.0,0.41551733016967773,0.0
172,8,AdaBoost (Discrete),0,0.5,0.9904761904761905,1.0,26.24173069000244,0.0
173,8,AdaBoost (Real),0,0.5,0.9714285714285714,1.0,53.85960841178894,0.0
174,8,Logistic Regression (Penalty = L2),0,0.5,0.17142857142857143,1.0,0.5915112495422363,0.0
175,8,Naive Bayes,0,0.5,1.0,1.0,0.5486321449279785,1.0
176,8,KNeighbors Classifier,1,0.5,1.0,1.0,0.17121553421020508,1.0
177,8,SVC Classifier,1,0.5,1.0,1.0,0.5918362140655518,1.0
178,8,Decision Tree,1,0.5,1.0,1.0,0.05257415771484375,1.0
179,8,RandomForest,1,0.5,0.18867924528301888,1.0,0.421375036239624,0.0
180,8,AdaBoost (Discrete),1,0.5,0.9528301886792453,1.0,24.702864170074463,0.0
181,8,AdaBoost (Real),1,0.5,0.9528301886792453,1.0,43.78855347633362,0.0
182,8,Logistic Regression (Penalty = L2),1,0.5,0.2641509433962264,1.0,0.6295228004455566,0.0
183,8,Naive Bayes,1,0.5,1.0,1.0,0.4703640937805176,1.0
184,8,KNeighbors Classifier,2,0.5,1.0,1.0,0.15813827514648438,1.0
185,8,SVC Classifier,2,0.5,0.009523809523809525,1.0,0.5807220935821533,0.0
186,8,Decision Tree,2,0.5,1.0,1.0,0.05164623260498047,1.0
187,8,RandomForest,2,0.5,0.18095238095238095,1.0,0.3591315746307373,0.0
188,8,AdaBoost (Discrete),2,0.5,0.9904761904761905,1.0,21.712092638015747,0.0
189,8,AdaBoost (Real),2,0.5,0.9714285714285714,1.0,43.03589844703674,0.0
190,8,Logistic Regression (Penalty = L2),2,0.5,0.26666666666666666,1.0,0.6202964782714844,0.0
191,8,Naive Bayes,2,0.5,1.0,1.0,0.450275182723999,1.0
192,9,KNeighbors Classifier,0,0.5,1.0,1.0,0.15337800979614258,1.0
193,9,SVC Classifier,0,0.5,0.009523809523809525,1.0,0.7154531478881836,0.0
194,9,Decision Tree,0,0.5,1.0,1.0,0.05049753189086914,1.0
195,9,RandomForest,0,0.5,0.1523809523809524,1.0,0.3704683780670166,0.0
196,9,AdaBoost (Discrete),0,0.5,0.9428571428571428,1.0,20.682538747787476,0.0
197,9,AdaBoost (Real),0,0.5,0.9714285714285714,1.0,39.35617160797119,0.0
198,9,Logistic Regression (Penalty = L2),0,0.5,0.06666666666666667,1.0,0.4002830982208252,0.0
199,9,Naive Bayes,0,0.5,1.0,1.0,0.47231078147888184,1.0
200,9,KNeighbors Classifier,1,0.5,1.0,1.0,0.13046765327453613,1.0
201,9,SVC Classifier,1,0.5,1.0,1.0,0.496976375579834,1.0
202,9,Decision Tree,1,0.5,1.0,1.0,0.04901862144470215,1.0
203,9,RandomForest,1,0.5,0.18867924528301888,1.0,0.3102083206176758,0.0
204,9,AdaBoost (Discrete),1,0.5,0.9716981132075472,1.0,17.854472875595093,0.0
205,9,AdaBoost (Real),1,0.5,1.0,1.0,35.21311330795288,1.0
206,9,Logistic Regression (Penalty = L2),1,0.5,0.11320754716981132,1.0,0.44937944412231445,0.0
207,9,Naive Bayes,1,0.5,1.0,1.0,0.35339784622192383,1.0
208,9,KNeighbors Classifier,2,0.5,1.0,1.0,0.1236567497253418,1.0
209,9,SVC Classifier,2,0.5,0.009523809523809525,1.0,0.48920631408691406,0.0
210,9,Decision Tree,2,0.5,1.0,1.0,0.0024101734161376953,1.0
211,9,RandomForest,2,0.5,0.17142857142857143,1.0,0.30570292472839355,0.0
212,9,AdaBoost (Discrete),2,0.5,0.9619047619047619,1.0,17.805238008499146,0.0
213,9,AdaBoost (Real),2,0.5,0.9809523809523809,1.0,34.22135543823242,0.0
214,9,Logistic Regression (Penalty = L2),2,0.5,0.09523809523809523,1.0,0.489116907119751,0.0
215,9,Naive Bayes,2,0.5,1.0,1.0,0.2809913158416748,1.0
216,10,KNeighbors Classifier,0,0.5,1.0,1.0,0.16263341903686523,1.0
217,10,SVC Classifier,0,0.5,0.009523809523809525,1.0,0.5032031536102295,0.0
218,10,Decision Tree,0,0.5,1.0,1.0,0.0034155845642089844,1.0
219,10,RandomForest,0,0.5,0.21904761904761905,1.0,0.280667781829834,0.0
220,10,AdaBoost (Discrete),0,0.5,0.819047619047619,1.0,19.027143239974976,0.0
221,10,AdaBoost (Real),0,0.5,0.8857142857142857,1.0,35.82621502876282,0.0
222,10,Logistic Regression (Penalty = L2),0,0.5,0.7619047619047619,1.0,0.5743227005004883,0.0
223,10,Naive Bayes,0,0.5,1.0,1.0,0.3937833309173584,1.0
224,10,KNeighbors Classifier,1,0.5,1.0,1.0,0.10197877883911133,1.0
225,10,SVC Classifier,1,0.5,1.0,1.0,0.4707803726196289,1.0
226,10,Decision Tree,1,0.5,1.0,1.0,0.040032148361206055,1.0
227,10,RandomForest,1,0.5,0.22641509433962265,1.0,0.3354322910308838,0.0
228,10,AdaBoost (Discrete),1,0.5,0.7452830188679245,1.0,18.994747400283813,0.0
229,10,AdaBoost (Real),1,0.5,0.9433962264150944,1.0,33.6217565536499,0.0
230,10,Logistic Regression (Penalty = L2),1,0.5,0.8301886792452831,1.0,0.7650575637817383,0.0
231,10,Naive Bayes,1,0.5,1.0,1.0,0.3397226333618164,1.0
232,10,KNeighbors Classifier,2,0.5,1.0,1.0,0.10763263702392578,1.0
233,10,SVC Classifier,2,0.5,0.009523809523809525,1.0,0.4425361156463623,0.0
234,10,Decision Tree,2,0.5,1.0,1.0,0.03555107116699219,1.0
235,10,RandomForest,2,0.5,0.24761904761904763,1.0,0.24772143363952637,0.0
236,10,AdaBoost (Discrete),2,0.5,0.7619047619047619,1.0,16.778952598571777,0.0
237,10,AdaBoost (Real),2,0.5,0.8952380952380953,1.0,30.72109341621399,0.0
238,10,Logistic Regression (Penalty = L2),2,0.5,0.8095238095238095,1.0,0.7422211170196533,0.0
239,10,Naive Bayes,2,0.5,1.0,1.0,0.3471696376800537,1.0
240,11,KNeighbors Classifier,0,0.5,1.0,1.0,0.18109130859375,1.0
241,11,SVC Classifier,0,0.5,0.009523809523809525,1.0,0.5338542461395264,0.0
242,11,Decision Tree,0,0.5,1.0,1.0,0.031321048736572266,1.0
243,11,RandomForest,0,0.5,0.19047619047619047,1.0,0.24702954292297363,0.0
244,11,AdaBoost (Discrete),0,0.5,0.9619047619047619,1.0,17.568382024765015,0.0
245,11,AdaBoost (Real),0,0.5,0.8761904761904762,1.0,33.26937699317932,0.0
246,11,Logistic Regression (Penalty = L2),0,0.5,0.9047619047619048,1.0,0.5512361526489258,0.0
247,11,Naive Bayes,0,0.5,1.0,1.0,0.42896199226379395,1.0
248,11,KNeighbors Classifier,1,0.5,1.0,1.0,0.09933662414550781,1.0
249,11,SVC Classifier,1,0.5,1.0,1.0,0.3687398433685303,1.0
250,11,Decision Tree,1,0.5,1.0,1.0,0.0353398323059082,1.0
251,11,RandomForest,1,0.5,0.3018867924528302,1.0,0.2521791458129883,0.0
252,11,AdaBoost (Discrete),1,0.5,0.9056603773584906,1.0,16.187976360321045,0.0
253,11,AdaBoost (Real),1,0.5,0.9339622641509434,1.0,27.521613597869873,0.0
254,11,Logistic Regression (Penalty = L2),1,0.5,0.9716981132075472,1.0,0.6976511478424072,0.0
255,11,Naive Bayes,1,0.5,1.0,1.0,0.3198049068450928,1.0
256,11,KNeighbors Classifier,2,0.5,1.0,1.0,0.09217667579650879,1.0
257,11,SVC Classifier,2,0.5,0.009523809523809525,1.0,0.41298913955688477,0.0
258,11,Decision Tree,2,0.5,1.0,1.0,0.026613712310791016,1.0
259,11,RandomForest,2,0.5,0.24761904761904763,1.0,0.24719905853271484,0.0
260,11,AdaBoost (Discrete),2,0.5,0.9714285714285714,1.0,16.157875299453735,0.0
261,11,AdaBoost (Real),2,0.5,0.9809523809523809,1.0,29.05077862739563,0.0
262,11,Logistic Regression (Penalty = L2),2,0.5,0.9428571428571428,1.0,0.6631662845611572,0.0
263,11,Naive Bayes,2,0.5,1.0,1.0,0.17302727699279785,1.0
