,feat_set_id,classifier,fold_id,feat_th,score,geo_score,exec_t,geo_score_woz
0,0,KNeighbors Classifier,0,0.35,0.7817745803357314,0.7801218712045113,0.6188180446624756,0.7801218712045113
1,0,SVC Classifier,0,0.35,0.7913669064748201,0.7643621566028229,2.4129257202148438,0.7643621566028229
2,0,Decision Tree,0,0.35,0.7014388489208633,0.7007005910317471,0.07195663452148438,0.7007005910317471
3,0,RandomForest,0,0.35,0.7793764988009593,0.7729387009043903,0.26314449310302734,0.7729387009043903
4,0,AdaBoost (Discrete),0,0.35,0.7817745803357314,0.7805701861704469,27.816537618637085,0.7805701861704469
5,0,AdaBoost (Real),0,0.35,0.7595923261390888,0.7542114208678882,35.879822731018066,0.7542114208678882
6,0,Logistic Regression (Penalty = L2),0,0.35,0.8231414868105515,0.8215431416404102,0.22802948951721191,0.8215431416404102
7,0,Naive Bayes,0,0.35,0.7667865707434053,0.7222246528275624,0.05305290222167969,0.7222246528275624
8,0,KNeighbors Classifier,1,0.35,0.7551020408163265,0.7536366738005787,0.5736126899719238,0.7536366738005787
9,0,SVC Classifier,1,0.35,0.7725090036014406,0.7404047492386141,2.2090022563934326,0.7404047492386141
10,0,Decision Tree,1,0.35,0.712484993997599,0.71221322793926,0.06959033012390137,0.71221322793926
11,0,RandomForest,1,0.35,0.7400960384153662,0.7350401848241522,0.24031376838684082,0.7350401848241522
12,0,AdaBoost (Discrete),1,0.35,0.7442977190876351,0.74195806936195,38.51479387283325,0.74195806936195
13,0,AdaBoost (Real),1,0.35,0.7509003601440576,0.7509058016545603,51.02669143676758,0.7509058016545603
14,0,Logistic Regression (Penalty = L2),1,0.35,0.7941176470588235,0.7930341137860794,0.23233461380004883,0.7930341137860794
15,0,Naive Bayes,1,0.35,0.7569027611044418,0.7152179684546058,0.05675697326660156,0.7152179684546058
16,0,KNeighbors Classifier,2,0.35,0.7671068427370948,0.7643582302419539,0.8835723400115967,0.7643582302419539
17,0,SVC Classifier,2,0.35,0.7845138055222088,0.7527128012446339,3.460604429244995,0.7527128012446339
18,0,Decision Tree,2,0.35,0.709483793517407,0.7085696339673015,0.10827970504760742,0.7085696339673015
19,0,RandomForest,2,0.35,0.7208883553421368,0.7151966288899219,0.39624857902526855,0.7151966288899219
20,0,AdaBoost (Discrete),2,0.35,0.7551020408163265,0.751005845062397,44.46251559257507,0.751005845062397
21,0,AdaBoost (Real),2,0.35,0.7737094837935174,0.770735153551046,52.888129234313965,0.770735153551046
22,0,Logistic Regression (Penalty = L2),2,0.35,0.819327731092437,0.816375173655407,0.23055434226989746,0.816375173655407
23,0,Naive Bayes,2,0.35,0.7605042016806722,0.7125216958412527,0.08689212799072266,0.7125216958412527
24,1,KNeighbors Classifier,0,0.35,0.8069544364508393,0.8054581030864699,0.862553596496582,0.8054581030864699
25,1,SVC Classifier,0,0.35,0.8243405275779376,0.8192381360732811,3.2114198207855225,0.8192381360732811
26,1,Decision Tree,0,0.35,0.738009592326139,0.7373518823869231,0.07375144958496094,0.7373518823869231
27,1,RandomForest,0,0.35,0.7703836930455635,0.7690881899854884,0.38652968406677246,0.7690881899854884
28,1,AdaBoost (Discrete),0,0.35,0.8117505995203836,0.8117527485234943,39.320048332214355,0.8117527485234943
29,1,AdaBoost (Real),0,0.35,0.8063549160671463,0.804007601086618,46.862608432769775,0.804007601086618
30,1,Logistic Regression (Penalty = L2),0,0.35,0.8315347721822542,0.8305850159830522,0.2488245964050293,0.8305850159830522
31,1,Naive Bayes,0,0.35,0.8183453237410072,0.8122530760295875,0.04206371307373047,0.8122530760295875
32,1,KNeighbors Classifier,1,0.35,0.7821128451380552,0.7804957432885932,1.0169341564178467,0.7804957432885932
33,1,SVC Classifier,1,0.35,0.7977190876350541,0.7910819229048852,3.614255666732788,0.7910819229048852
34,1,Decision Tree,1,0.35,0.6884753901560624,0.6884154641635823,0.11507773399353027,0.6884154641635823
35,1,RandomForest,1,0.35,0.726890756302521,0.7258628989020735,0.3610649108886719,0.7258628989020735
36,1,AdaBoost (Discrete),1,0.35,0.7719087635054022,0.7702997062006414,39.22158408164978,0.7702997062006414
37,1,AdaBoost (Real),1,0.35,0.7839135654261705,0.783862213397959,46.62083625793457,0.783862213397959
38,1,Logistic Regression (Penalty = L2),1,0.35,0.8157262905162065,0.8151512063856906,0.21820831298828125,0.8151512063856906
39,1,Naive Bayes,1,0.35,0.790516206482593,0.7830969834104347,0.041796207427978516,0.7830969834104347
40,1,KNeighbors Classifier,2,0.35,0.787515006002401,0.7863409239676471,0.8283891677856445,0.7863409239676471
41,1,SVC Classifier,2,0.35,0.8157262905162065,0.8082951989843863,3.190669059753418,0.8082951989843863
42,1,Decision Tree,2,0.35,0.7154861944777912,0.7150406862029577,0.11061763763427734,0.7150406862029577
43,1,RandomForest,2,0.35,0.698079231692677,0.6872056557582807,0.30754518508911133,0.6872056557582807
44,1,AdaBoost (Discrete),2,0.35,0.7779111644657863,0.7760461160952119,39.346211433410645,0.7760461160952119
45,1,AdaBoost (Real),2,0.35,0.7887154861944778,0.7864163095791162,46.77964639663696,0.7864163095791162
46,1,Logistic Regression (Penalty = L2),2,0.35,0.8301320528211285,0.8290784947411227,0.19921636581420898,0.8290784947411227
47,1,Naive Bayes,2,0.35,0.8043217286914766,0.7969366461364105,0.0392918586730957,0.7969366461364105
48,2,KNeighbors Classifier,0,0.35,0.7841726618705036,0.783279154626151,0.8567798137664795,0.783279154626151
49,2,SVC Classifier,0,0.35,0.8177458033573142,0.8112072083522562,3.23486328125,0.8112072083522562
50,2,Decision Tree,0,0.35,0.7242206235011991,0.7239609434138699,0.11537814140319824,0.7239609434138699
51,2,RandomForest,0,0.35,0.7392086330935251,0.723968593572686,0.3363161087036133,0.723968593572686
52,2,AdaBoost (Discrete),0,0.35,0.7739808153477218,0.7692886650223328,39.108845472335815,0.7692886650223328
53,2,AdaBoost (Real),0,0.35,0.7871702637889688,0.7837446019159688,46.48303985595703,0.7837446019159688
54,2,Logistic Regression (Penalty = L2),0,0.35,0.8189448441247003,0.817541538791154,0.3265495300292969,0.817541538791154
55,2,Naive Bayes,0,0.35,0.8141486810551559,0.8081386357159017,0.06678342819213867,0.8081386357159017
56,2,KNeighbors Classifier,1,0.35,0.7466986794717887,0.746009446334521,0.7895243167877197,0.746009446334521
57,2,SVC Classifier,1,0.35,0.8001200480192077,0.7938601405813555,3.2978508472442627,0.7938601405813555
58,2,Decision Tree,1,0.35,0.7076830732292917,0.7074165078376107,0.11603045463562012,0.7074165078376107
59,2,RandomForest,1,0.35,0.7605042016806722,0.755033252469188,0.4058644771575928,0.755033252469188
60,2,AdaBoost (Discrete),1,0.35,0.7466986794717887,0.7440489045482491,39.507893562316895,0.7440489045482491
61,2,AdaBoost (Real),1,0.35,0.7388955582232893,0.7301098005887409,47.922723054885864,0.7301098005887409
62,2,Logistic Regression (Penalty = L2),1,0.35,0.8097238895558223,0.8086344701993765,0.23645448684692383,0.8086344701993765
63,2,Naive Bayes,1,0.35,0.7863145258103241,0.7799229032159977,0.08175301551818848,0.7799229032159977
64,2,KNeighbors Classifier,2,0.35,0.7623049219687875,0.7616134944235619,0.9381000995635986,0.7616134944235619
65,2,SVC Classifier,2,0.35,0.8151260504201681,0.8063662961080013,4.045405149459839,0.8063662961080013
66,2,Decision Tree,2,0.35,0.7004801920768308,0.6995505707679542,0.1046290397644043,0.6995505707679542
67,2,RandomForest,2,0.35,0.7683073229291717,0.7610577430092494,0.4807419776916504,0.7610577430092494
68,2,AdaBoost (Discrete),2,0.35,0.7701080432172869,0.7682399622396234,56.63927721977234,0.7682399622396234
69,2,AdaBoost (Real),2,0.35,0.7773109243697479,0.7742016515287421,66.5653965473175,0.7742016515287421
70,2,Logistic Regression (Penalty = L2),2,0.35,0.8277310924369747,0.8261874560112155,0.26496386528015137,0.8261874560112155
71,2,Naive Bayes,2,0.35,0.8067226890756303,0.8000184653537906,0.05750775337219238,0.8000184653537906
72,3,KNeighbors Classifier,0,0.35,0.7829736211031175,0.7822670832199644,1.2545804977416992,0.7822670832199644
73,3,SVC Classifier,0,0.35,0.8015587529976019,0.7929726797949469,4.713363885879517,0.7929726797949469
74,3,Decision Tree,0,0.35,0.7110311750599521,0.7089008183849698,0.15201807022094727,0.7089008183849698
75,3,RandomForest,0,0.35,0.7302158273381295,0.7180220509011641,0.5266268253326416,0.7180220509011641
76,3,AdaBoost (Discrete),0,0.35,0.7589928057553957,0.7538549215886776,55.93519186973572,0.7538549215886776
77,3,AdaBoost (Real),0,0.35,0.7577937649880095,0.7548640166244752,67.05660629272461,0.7548640166244752
78,3,Logistic Regression (Penalty = L2),0,0.35,0.8189448441247003,0.8177201317195556,0.26518702507019043,0.8177201317195556
79,3,Naive Bayes,0,0.35,0.7949640287769785,0.7849996244913199,0.053954362869262695,0.7849996244913199
80,3,KNeighbors Classifier,1,0.35,0.762905162064826,0.7605639838419826,1.2124311923980713,0.7605639838419826
81,3,SVC Classifier,1,0.35,0.7899159663865546,0.777928232280118,4.688643217086792,0.777928232280118
82,3,Decision Tree,1,0.35,0.7028811524609844,0.7023485125569798,0.0980997085571289,0.7023485125569798
83,3,RandomForest,1,0.35,0.7130852340936374,0.7035960887714804,0.520244836807251,0.7035960887714804
84,3,AdaBoost (Discrete),1,0.35,0.741296518607443,0.7412486137776041,56.245513916015625,0.7412486137776041
85,3,AdaBoost (Real),1,0.35,0.7605042016806722,0.7594886463351772,61.52694225311279,0.7594886463351772
86,3,Logistic Regression (Penalty = L2),1,0.35,0.812124849939976,0.8100044903341413,0.23940014839172363,0.8100044903341413
87,3,Naive Bayes,1,0.35,0.7779111644657863,0.7654629278082999,0.057520151138305664,0.7654629278082999
88,3,KNeighbors Classifier,2,0.35,0.7599039615846338,0.7568695465584553,1.1108677387237549,0.7568695465584553
89,3,SVC Classifier,2,0.35,0.7911164465786314,0.7768715137362142,4.182329893112183,0.7768715137362142
90,3,Decision Tree,2,0.35,0.7250900360144058,0.7237171026283057,0.14629673957824707,0.7237171026283057
91,3,RandomForest,2,0.35,0.7118847539015606,0.7027448384494903,0.4592437744140625,0.7027448384494903
92,3,AdaBoost (Discrete),2,0.35,0.7551020408163265,0.7543726979036288,54.08770799636841,0.7543726979036288
93,3,AdaBoost (Real),2,0.35,0.7779111644657863,0.774693833257959,68.6687023639679,0.774693833257959
94,3,Logistic Regression (Penalty = L2),2,0.35,0.8157262905162065,0.8134826651064627,0.26764869689941406,0.8134826651064627
95,3,Naive Bayes,2,0.35,0.7713085234093637,0.7568853284831973,0.09474539756774902,0.7568853284831973
96,4,KNeighbors Classifier,0,0.35,0.7517985611510791,0.7509835900284,0.48814845085144043,0.7509835900284
97,4,SVC Classifier,0,0.35,0.7799760191846523,0.7652713123190085,4.3786256313323975,0.7652713123190085
98,4,Decision Tree,0,0.35,0.6960431654676259,0.6944564797820368,0.15580272674560547,0.6944564797820368
99,4,RandomForest,0,0.35,0.7200239808153477,0.7089332413931431,0.5164787769317627,0.7089332413931431
100,4,AdaBoost (Discrete),0,0.35,0.7116306954436451,0.7088863235690522,44.40599274635315,0.7088863235690522
101,4,AdaBoost (Real),0,0.35,0.7008393285371702,0.6921274548543785,50.77312111854553,0.6921274548543785
102,4,Logistic Regression (Penalty = L2),0,0.35,0.7955635491606715,0.7939927944665142,0.22042417526245117,0.7939927944665142
103,4,Naive Bayes,0,0.35,0.7799760191846523,0.7664492848649971,0.08773016929626465,0.7664492848649971
104,4,KNeighbors Classifier,1,0.35,0.7376950780312125,0.7370950329780963,0.34195375442504883,0.7370950329780963
105,4,SVC Classifier,1,0.35,0.7611044417767107,0.7417124069669003,3.8585000038146973,0.7417124069669003
106,4,Decision Tree,1,0.35,0.6920768307322929,0.6911331254423844,0.14533638954162598,0.6911331254423844
107,4,RandomForest,1,0.35,0.71968787515006,0.7053362203741428,0.47884654998779297,0.7053362203741428
108,4,AdaBoost (Discrete),1,0.35,0.656062424969988,0.6479620508522156,41.23738384246826,0.6479620508522156
109,4,AdaBoost (Real),1,0.35,0.6746698679471789,0.6665459244163925,58.463478803634644,0.6665459244163925
110,4,Logistic Regression (Penalty = L2),1,0.35,0.7749099639855942,0.7737467738379342,0.2961297035217285,0.7737467738379342
111,4,Naive Bayes,1,0.35,0.7569027611044418,0.7404274480928351,0.061142683029174805,0.7404274480928351
112,4,KNeighbors Classifier,2,0.35,0.7376950780312125,0.7360393565611035,0.5239191055297852,0.7360393565611035
113,4,SVC Classifier,2,0.35,0.7683073229291717,0.7493224389269186,5.5340657234191895,0.7493224389269186
114,4,Decision Tree,2,0.35,0.695078031212485,0.694080009018287,0.132737398147583,0.694080009018287
115,4,RandomForest,2,0.35,0.709483793517407,0.6947502491663701,0.5791745185852051,0.6947502491663701
116,4,AdaBoost (Discrete),2,0.35,0.6638655462184874,0.6624814907174094,54.60542273521423,0.6624814907174094
117,4,AdaBoost (Real),2,0.35,0.6350540216086434,0.616389379255422,68.46236038208008,0.616389379255422
118,4,Logistic Regression (Penalty = L2),2,0.35,0.7929171668667467,0.789894056196437,0.2680642604827881,0.789894056196437
119,4,Naive Bayes,2,0.35,0.7719087635054022,0.7571760888437026,0.11575746536254883,0.7571760888437026
120,5,KNeighbors Classifier,0,0.35,0.7326139088729017,0.7313512572672638,0.39765048027038574,0.7313512572672638
121,5,SVC Classifier,0,0.35,0.7541966426858513,0.7360594258367152,5.398977756500244,0.7360594258367152
122,5,Decision Tree,0,0.35,0.6900479616306955,0.6887291105425242,0.20228314399719238,0.6887291105425242
123,5,RandomForest,0,0.35,0.7356115107913669,0.7312817483933683,0.6733276844024658,0.7312817483933683
124,5,AdaBoost (Discrete),0,0.35,0.7062350119904077,0.6984911831346857,51.388129234313965,0.6984911831346857
125,5,AdaBoost (Real),0,0.35,0.697841726618705,0.6943360874760062,61.93143558502197,0.6943360874760062
126,5,Logistic Regression (Penalty = L2),0,0.35,0.7739808153477218,0.7716931121090275,0.32128095626831055,0.7716931121090275
127,5,Naive Bayes,0,0.35,0.763189448441247,0.7519165210437465,0.06041884422302246,0.7519165210437465
128,5,KNeighbors Classifier,1,0.35,0.7148859543817527,0.7134538116923571,0.3798398971557617,0.7134538116923571
129,5,SVC Classifier,1,0.35,0.7322929171668667,0.71037232384421,5.223570108413696,0.71037232384421
130,5,Decision Tree,1,0.35,0.6746698679471789,0.673487104327856,0.18990874290466309,0.673487104327856
131,5,RandomForest,1,0.35,0.7274909963985594,0.7190614197376896,0.7016537189483643,0.7190614197376896
132,5,AdaBoost (Discrete),1,0.35,0.6626650660264105,0.6486279547442586,50.134591579437256,0.6486279547442586
133,5,AdaBoost (Real),1,0.35,0.6818727490996399,0.6716882713608642,62.65249013900757,0.6716882713608642
134,5,Logistic Regression (Penalty = L2),1,0.35,0.7599039615846338,0.7586805158066782,0.24857234954833984,0.7586805158066782
135,5,Naive Bayes,1,0.35,0.7418967587034814,0.7323593771768914,0.13417768478393555,0.7323593771768914
136,5,KNeighbors Classifier,2,0.35,0.7154861944777912,0.7138895319461374,0.451033353805542,0.7138895319461374
137,5,SVC Classifier,2,0.35,0.748499399759904,0.7260676121201322,5.462816476821899,0.7260676121201322
138,5,Decision Tree,2,0.35,0.6728691476590636,0.6716165738778318,0.13042688369750977,0.6716165738778318
139,5,RandomForest,2,0.35,0.7244897959183674,0.7158166241339002,0.6952052116394043,0.7158166241339002
140,5,AdaBoost (Discrete),2,0.35,0.6728691476590636,0.6575604951312307,49.97150635719299,0.6575604951312307
141,5,AdaBoost (Real),2,0.35,0.6476590636254502,0.6125346251436521,63.623849391937256,0.6125346251436521
142,5,Logistic Regression (Penalty = L2),2,0.35,0.776110444177671,0.7731169508018672,0.2596890926361084,0.7731169508018672
143,5,Naive Bayes,2,0.35,0.7569027611044418,0.7458927844840687,0.12731504440307617,0.7458927844840687
144,6,KNeighbors Classifier,0,0.35,0.7230215827338129,0.7210624716023518,0.3883845806121826,0.7210624716023518
145,6,SVC Classifier,0,0.35,0.7440047961630696,0.7255544717047341,5.2502851486206055,0.7255544717047341
146,6,Decision Tree,0,0.35,0.684052757793765,0.6834015534513168,0.13348150253295898,0.6834015534513168
147,6,RandomForest,0,0.35,0.7356115107913669,0.7189478735747709,0.6338942050933838,0.7189478735747709
148,6,AdaBoost (Discrete),0,0.35,0.6163069544364509,0.6012243656984599,49.43412470817566,0.6012243656984599
149,6,AdaBoost (Real),0,0.35,0.6690647482014388,0.6665497119137664,62.64793848991394,0.6665497119137664
150,6,Logistic Regression (Penalty = L2),0,0.35,0.7685851318944844,0.7658888686424914,0.271014928817749,0.7658888686424914
151,6,Naive Bayes,0,0.35,0.7547961630695443,0.7425068700010393,0.0849766731262207,0.7425068700010393
152,6,KNeighbors Classifier,1,0.35,0.7022809123649459,0.6996344597927143,0.2675931453704834,0.6996344597927143
153,6,SVC Classifier,1,0.35,0.7220888355342137,0.6981717028413909,5.325159311294556,0.6981717028413909
154,6,Decision Tree,1,0.35,0.6758703481392557,0.6737319772263747,0.19925379753112793,0.6737319772263747
155,6,RandomForest,1,0.35,0.7172869147659063,0.7066068971321836,0.6561501026153564,0.7066068971321836
156,6,AdaBoost (Discrete),1,0.35,0.6266506602641057,0.6172563993485743,49.5053346157074,0.6172563993485743
157,6,AdaBoost (Real),1,0.35,0.631452581032413,0.6222500016555036,63.1734664440155,0.6222500016555036
158,6,Logistic Regression (Penalty = L2),1,0.35,0.7466986794717887,0.7434522878704497,0.2518343925476074,0.7434522878704497
159,6,Naive Bayes,1,0.35,0.7322929171668667,0.7181466028858726,0.06013178825378418,0.7181466028858726
160,6,KNeighbors Classifier,2,0.35,0.712484993997599,0.7080151649420944,0.3603248596191406,0.7080151649420944
161,6,SVC Classifier,2,0.35,0.7244897959183674,0.7010353588123069,5.287801742553711,0.7010353588123069
162,6,Decision Tree,2,0.35,0.6776710684273709,0.6752630502025535,0.19118309020996094,0.6752630502025535
163,6,RandomForest,2,0.35,0.7016806722689075,0.6853770809323352,0.5787324905395508,0.6853770809323352
164,6,AdaBoost (Discrete),2,0.35,0.6320528211284514,0.6111340490874895,49.93490743637085,0.6111340490874895
165,6,AdaBoost (Real),2,0.35,0.6584633853541416,0.6436381615372432,60.6683554649353,0.6436381615372432
166,6,Logistic Regression (Penalty = L2),2,0.35,0.7611044417767107,0.7545151604810291,0.2374715805053711,0.7545151604810291
167,6,Naive Bayes,2,0.35,0.7328931572629052,0.7160981972688271,0.056574344635009766,0.7160981972688271
168,7,KNeighbors Classifier,0,0.35,0.7320143884892086,0.73110363961099,0.4868948459625244,0.73110363961099
169,7,SVC Classifier,0,0.35,0.7697841726618705,0.7588734450792589,5.151248455047607,0.7588734450792589
170,7,Decision Tree,0,0.35,0.7122302158273381,0.7115373638268362,0.17378878593444824,0.7115373638268362
171,7,RandomForest,0,0.35,0.7254196642685852,0.7156645838806797,0.6033484935760498,0.7156645838806797
172,7,AdaBoost (Discrete),0,0.35,0.6468824940047961,0.6358742002839562,50.73680400848389,0.6358742002839562
173,7,AdaBoost (Real),0,0.35,0.6798561151079137,0.6785165243557919,66.91258573532104,0.6785165243557919
174,7,Logistic Regression (Penalty = L2),0,0.35,0.7799760191846523,0.7789938688443744,0.30344605445861816,0.7789938688443744
175,7,Naive Bayes,0,0.35,0.7697841726618705,0.7605693565727196,0.12640881538391113,0.7605693565727196
176,7,KNeighbors Classifier,1,0.35,0.7136854741896759,0.7110444026677464,0.532250165939331,0.7110444026677464
177,7,SVC Classifier,1,0.35,0.7623049219687875,0.744996495644179,5.429504871368408,0.744996495644179
178,7,Decision Tree,1,0.35,0.6578631452581032,0.6568670960962478,0.1951465606689453,0.6568670960962478
179,7,RandomForest,1,0.35,0.7112845138055222,0.7028358331299834,0.5777537822723389,0.7028358331299834
180,7,AdaBoost (Discrete),1,0.35,0.6452581032412965,0.6441942687445344,54.53541684150696,0.6441942687445344
181,7,AdaBoost (Real),1,0.35,0.6572629051620649,0.648865012534787,67.10221791267395,0.648865012534787
182,7,Logistic Regression (Penalty = L2),1,0.35,0.776110444177671,0.7743394444467234,0.3004000186920166,0.7743394444467234
183,7,Naive Bayes,1,0.35,0.7490996398559424,0.7360362517700686,0.06521725654602051,0.7360362517700686
184,7,KNeighbors Classifier,2,0.35,0.7274909963985594,0.726577240527649,0.5143632888793945,0.726577240527649
185,7,SVC Classifier,2,0.35,0.7521008403361344,0.7367090448975242,5.218228816986084,0.7367090448975242
186,7,Decision Tree,2,0.35,0.687875150060024,0.6870608398787226,0.19398164749145508,0.6870608398787226
187,7,RandomForest,2,0.35,0.7106842737094838,0.699643058374833,0.6514952182769775,0.699643058374833
188,7,AdaBoost (Discrete),2,0.35,0.6296518607442977,0.6250508484047074,66.20446515083313,0.6250508484047074
189,7,AdaBoost (Real),2,0.35,0.6770708283313326,0.6730450208721307,83.79105138778687,0.6730450208721307
190,7,Logistic Regression (Penalty = L2),2,0.35,0.7779111644657863,0.7760091405487949,0.3670809268951416,0.7760091405487949
191,7,Naive Bayes,2,0.35,0.751500600240096,0.7394868012476387,0.08075737953186035,0.7394868012476387
192,8,KNeighbors Classifier,0,0.35,0.776378896882494,0.7740707287141292,1.3582801818847656,0.7740707287141292
193,8,SVC Classifier,0,0.35,0.802158273381295,0.7936299699511085,7.510591506958008,0.7936299699511085
194,8,Decision Tree,0,0.35,0.7242206235011991,0.723373141070924,0.16120433807373047,0.723373141070924
195,8,RandomForest,0,0.35,0.7535971223021583,0.7408710091252323,0.7762529850006104,0.7408710091252323
196,8,AdaBoost (Discrete),0,0.35,0.7643884892086331,0.7635398971461448,80.1837260723114,0.7635398971461448
197,8,AdaBoost (Real),0,0.35,0.7607913669064749,0.7545089823859281,93.27556991577148,0.7545089823859281
198,8,Logistic Regression (Penalty = L2),0,0.35,0.8123501199040767,0.811054364470367,0.3812882900238037,0.811054364470367
199,8,Naive Bayes,0,0.35,0.7949640287769785,0.7857080890461955,0.12270259857177734,0.7857080890461955
200,8,KNeighbors Classifier,1,0.35,0.7581032412965186,0.7559872542616486,1.4859099388122559,0.7559872542616486
201,8,SVC Classifier,1,0.35,0.7863145258103241,0.7741391622282519,7.137300491333008,0.7741391622282519
202,8,Decision Tree,1,0.35,0.6902761104441777,0.6901517621040274,0.16149640083312988,0.6901517621040274
203,8,RandomForest,1,0.35,0.7376950780312125,0.7253679505173801,0.751967191696167,0.7253679505173801
204,8,AdaBoost (Discrete),1,0.35,0.7190876350540216,0.7185415230121902,80.61945247650146,0.7185415230121902
205,8,AdaBoost (Real),1,0.35,0.7557022809123649,0.754640381327513,94.06395244598389,0.754640381327513
206,8,Logistic Regression (Penalty = L2),1,0.35,0.8061224489795918,0.8044457166910834,0.4223930835723877,0.8044457166910834
207,8,Naive Bayes,1,0.35,0.7779111644657863,0.7667103095420659,0.1582927703857422,0.7667103095420659
208,8,KNeighbors Classifier,2,0.35,0.7671068427370948,0.7657779081143449,1.408278226852417,0.7657779081143449
209,8,SVC Classifier,2,0.35,0.7899159663865546,0.7762906905140406,6.654932022094727,0.7762906905140406
210,8,Decision Tree,2,0.35,0.7304921968787516,0.7295379600546043,0.23044300079345703,0.7295379600546043
211,8,RandomForest,2,0.35,0.7286914765906363,0.71164595773851,0.6012589931488037,0.71164595773851
212,8,AdaBoost (Discrete),2,0.35,0.751500600240096,0.7506599503355638,77.21074891090393,0.7506599503355638
213,8,AdaBoost (Real),2,0.35,0.7665066026410564,0.7644668763197019,91.56798219680786,0.7644668763197019
214,8,Logistic Regression (Penalty = L2),2,0.35,0.8097238895558223,0.8075220714859946,0.381591796875,0.8075220714859946
215,8,Naive Bayes,2,0.35,0.7713085234093637,0.7580225851677613,0.17371559143066406,0.7580225851677613
216,9,KNeighbors Classifier,0,0.35,0.7320143884892086,0.73110363961099,0.5983076095581055,0.73110363961099
217,9,SVC Classifier,0,0.35,0.7697841726618705,0.7588734450792589,6.5986456871032715,0.7588734450792589
218,9,Decision Tree,0,0.35,0.709832134292566,0.7096441036453173,0.22044658660888672,0.7096441036453173
219,9,RandomForest,0,0.35,0.7254196642685852,0.7156645838806797,0.7446906566619873,0.7156645838806797
220,9,AdaBoost (Discrete),0,0.35,0.6468824940047961,0.6358742002839562,66.88984322547913,0.6358742002839562
221,9,AdaBoost (Real),0,0.35,0.63189448441247,0.6201853651069124,82.90240550041199,0.6201853651069124
222,9,Logistic Regression (Penalty = L2),0,0.35,0.7799760191846523,0.7789938688443744,0.40206408500671387,0.7789938688443744
223,9,Naive Bayes,0,0.35,0.7697841726618705,0.7605693565727196,0.08217263221740723,0.7605693565727196
224,9,KNeighbors Classifier,1,0.35,0.7136854741896759,0.7110444026677464,0.8002259731292725,0.7110444026677464
225,9,SVC Classifier,1,0.35,0.7623049219687875,0.744996495644179,6.824829339981079,0.744996495644179
226,9,Decision Tree,1,0.35,0.6668667466986795,0.6663159901403374,0.16226482391357422,0.6663159901403374
227,9,RandomForest,1,0.35,0.7112845138055222,0.7028358331299834,0.7983505725860596,0.7028358331299834
228,9,AdaBoost (Discrete),1,0.35,0.6452581032412965,0.6441942687445344,67.65428876876831,0.6441942687445344
229,9,AdaBoost (Real),1,0.35,0.6602641056422569,0.657642514762721,79.81654739379883,0.657642514762721
230,9,Logistic Regression (Penalty = L2),1,0.35,0.776110444177671,0.7743394444467234,0.33500003814697266,0.7743394444467234
231,9,Naive Bayes,1,0.35,0.7490996398559424,0.7360362517700686,0.15041613578796387,0.7360362517700686
232,9,KNeighbors Classifier,2,0.35,0.7274909963985594,0.726577240527649,0.7117877006530762,0.726577240527649
233,9,SVC Classifier,2,0.35,0.7521008403361344,0.7367090448975242,6.354009389877319,0.7367090448975242
234,9,Decision Tree,2,0.35,0.6842737094837935,0.6831943365927561,0.1546921730041504,0.6831943365927561
235,9,RandomForest,2,0.35,0.7106842737094838,0.699643058374833,0.7604587078094482,0.699643058374833
236,9,AdaBoost (Discrete),2,0.35,0.6296518607442977,0.6250508484047074,65.29324793815613,0.6250508484047074
237,9,AdaBoost (Real),2,0.35,0.6638655462184874,0.6598158232598766,79.75896716117859,0.6598158232598766
238,9,Logistic Regression (Penalty = L2),2,0.35,0.7779111644657863,0.7760091405487949,0.36795520782470703,0.7760091405487949
239,9,Naive Bayes,2,0.35,0.751500600240096,0.7394868012476387,0.07718181610107422,0.7394868012476387
240,10,KNeighbors Classifier,0,0.35,0.8069544364508393,0.8052833264501734,2.0189208984375,0.8052833264501734
241,10,SVC Classifier,0,0.35,0.8255395683453237,0.8170924775262941,6.793076276779175,0.8170924775262941
242,10,Decision Tree,0,0.35,0.7464028776978417,0.7449791339391263,0.15063095092773438,0.7449791339391263
243,10,RandomForest,0,0.35,0.7434052757793765,0.7420208123651516,0.8787941932678223,0.7420208123651516
244,10,AdaBoost (Discrete),0,0.35,0.8177458033573142,0.8171861404402411,87.90748262405396,0.8171861404402411
245,10,AdaBoost (Real),0,0.35,0.8183453237410072,0.8182176928813281,102.73590898513794,0.8182176928813281
246,10,Logistic Regression (Penalty = L2),0,0.35,0.8393285371702638,0.8383363875499565,0.47210264205932617,0.8383363875499565
247,10,Naive Bayes,0,0.35,0.8105515587529976,0.7989078013700427,0.1510484218597412,0.7989078013700427
248,10,KNeighbors Classifier,1,0.35,0.7923169267707083,0.79122304220281,2.2000555992126465,0.79122304220281
249,10,SVC Classifier,1,0.35,0.8103241296518607,0.8025775833082587,7.097283601760864,0.8025775833082587
250,10,Decision Tree,1,0.35,0.7292917166866747,0.728921754387441,0.2250807285308838,0.728921754387441
251,10,RandomForest,1,0.35,0.7472989195678271,0.7412749739701504,0.9026212692260742,0.7412749739701504
252,10,AdaBoost (Discrete),1,0.35,0.7881152460984394,0.7869875595900263,87.83521556854248,0.7869875595900263
253,10,AdaBoost (Real),1,0.35,0.7935174069627852,0.7922620830764252,103.27544069290161,0.7922620830764252
254,10,Logistic Regression (Penalty = L2),1,0.35,0.8271308523409364,0.8265524037839868,0.4031696319580078,0.8265524037839868
255,10,Naive Bayes,1,0.35,0.8031212484993998,0.7920111302661313,0.16261529922485352,0.7920111302661313
256,10,KNeighbors Classifier,2,0.35,0.7935174069627852,0.7926221415817688,2.159959316253662,0.7926221415817688
257,10,SVC Classifier,2,0.35,0.8307322929171669,0.8220278644784224,6.974585056304932,0.8220278644784224
258,10,Decision Tree,2,0.35,0.7382953181272509,0.7380004859782587,0.20409417152404785,0.7380004859782587
259,10,RandomForest,2,0.35,0.7316926770708283,0.7294216116480728,0.7614288330078125,0.7294216116480728
260,10,AdaBoost (Discrete),2,0.35,0.7887154861944778,0.7874818348502668,88.54448342323303,0.7874818348502668
261,10,AdaBoost (Real),2,0.35,0.8031212484993998,0.8026373065540295,103.03029918670654,0.8026373065540295
262,10,Logistic Regression (Penalty = L2),2,0.35,0.84093637454982,0.8397597958587326,0.4056522846221924,0.8397597958587326
263,10,Naive Bayes,2,0.35,0.8115246098439376,0.8009844551020848,0.15420031547546387,0.8009844551020848
264,11,KNeighbors Classifier,0,0.35,0.8081534772182254,0.8077963773163146,5.193809270858765,0.8077963773163146
265,11,SVC Classifier,0,0.35,0.8369304556354916,0.8241260441839984,8.16785478591919,0.8241260441839984
266,11,Decision Tree,0,0.35,0.7583932853717026,0.7568570989572837,0.30289316177368164,0.7568570989572837
267,11,RandomForest,0,0.35,0.7745803357314148,0.767782555502451,0.6867728233337402,0.767782555502451
268,11,AdaBoost (Discrete),0,0.35,0.8351318944844125,0.8351699468209631,117.68046450614929,0.8351699468209631
269,11,AdaBoost (Real),0,0.35,0.8351318944844125,0.8348575496732544,135.81467485427856,0.8348575496732544
270,11,Logistic Regression (Penalty = L2),0,0.35,0.8603117505995204,0.8592926834640517,0.5150883197784424,0.8592926834640517
271,11,Naive Bayes,0,0.35,0.7937649880095923,0.7603142640003032,0.15926837921142578,0.7603142640003032
272,11,KNeighbors Classifier,1,0.35,0.7887154861944778,0.78702885069972,4.946743726730347,0.78702885069972
273,11,SVC Classifier,1,0.35,0.82953181272509,0.8171812713382108,8.355001211166382,0.8171812713382108
274,11,Decision Tree,1,0.35,0.7418967587034814,0.741753277080198,0.22823262214660645,0.741753277080198
275,11,RandomForest,1,0.35,0.7569027611044418,0.7373801602846632,0.9141342639923096,0.7373801602846632
276,11,AdaBoost (Discrete),1,0.35,0.7971188475390156,0.7968200316497067,118.86388278007507,0.7968200316497067
277,11,AdaBoost (Real),1,0.35,0.801920768307323,0.8015325147826585,133.85283970832825,0.8015325147826585
278,11,Logistic Regression (Penalty = L2),1,0.35,0.8355342136854742,0.8347963375636125,0.5824871063232422,0.8347963375636125
279,11,Naive Bayes,1,0.35,0.7965186074429772,0.7692663046702136,0.14253520965576172,0.7692663046702136
280,11,KNeighbors Classifier,2,0.35,0.7983193277310925,0.7966547361106007,5.217004299163818,0.7966547361106007
281,11,SVC Classifier,2,0.35,0.8415366146458584,0.828231854784188,8.428714036941528,0.828231854784188
282,11,Decision Tree,2,0.35,0.7346938775510204,0.7332730511581403,0.23575472831726074,0.7332730511581403
283,11,RandomForest,2,0.35,0.7695078031212484,0.752564059337348,0.8539626598358154,0.752564059337348
284,11,AdaBoost (Discrete),2,0.35,0.843937575030012,0.8435300894617712,119.39084339141846,0.8435300894617712
285,11,AdaBoost (Real),2,0.35,0.8379351740696278,0.8371502565649506,133.52231788635254,0.8371502565649506
286,11,Logistic Regression (Penalty = L2),2,0.35,0.8607442977190877,0.8591669469281831,0.5554373264312744,0.8591669469281831
287,11,Naive Bayes,2,0.35,0.8091236494597839,0.7819114034758852,0.1517198085784912,0.7819114034758852
288,12,KNeighbors Classifier,0,0.35,0.6918465227817746,0.6894958028380924,0.29669976234436035,0.6894958028380924
289,12,SVC Classifier,0,0.35,0.7086330935251799,0.6851770549568924,6.033528089523315,0.6851770549568924
290,12,Decision Tree,0,0.35,0.6133093525179856,0.6118820992963652,0.15138030052185059,0.6118820992963652
291,12,RandomForest,0,0.35,0.7158273381294964,0.6989969973633021,0.683020830154419,0.6989969973633021
292,12,AdaBoost (Discrete),0,0.35,0.6264988009592326,0.6234200836394871,53.02858638763428,0.6234200836394871
293,12,AdaBoost (Real),0,0.35,0.6360911270983214,0.6354220377384685,69.36739611625671,0.6354220377384685
294,12,Logistic Regression (Penalty = L2),0,0.35,0.7386091127098321,0.7352900399007716,0.26072096824645996,0.7352900399007716
295,12,Naive Bayes,0,0.35,0.7272182254196643,0.7086319637224561,0.13866925239562988,0.7086319637224561
296,12,KNeighbors Classifier,1,0.35,0.6584633853541416,0.6554605283171132,0.38163161277770996,0.6554605283171132
297,12,SVC Classifier,1,0.35,0.6968787515006002,0.6725538283293415,6.221797227859497,0.6725538283293415
298,12,Decision Tree,1,0.35,0.6386554621848739,0.637785998006579,0.07912373542785645,0.637785998006579
299,12,RandomForest,1,0.35,0.6986794717887155,0.6813098835815643,0.6153576374053955,0.6813098835815643
300,12,AdaBoost (Discrete),1,0.35,0.6032412965186075,0.5961546294576067,53.16595935821533,0.5961546294576067
301,12,AdaBoost (Real),1,0.35,0.5882352941176471,0.5819215021898878,68.5737943649292,0.5819215021898878
302,12,Logistic Regression (Penalty = L2),1,0.35,0.7280912364945978,0.725506674121286,0.27468395233154297,0.725506674121286
303,12,Naive Bayes,1,0.35,0.7112845138055222,0.69729269513007,0.07737088203430176,0.69729269513007
304,12,KNeighbors Classifier,2,0.35,0.6680672268907563,0.6659546373774905,0.28388214111328125,0.6659546373774905
305,12,SVC Classifier,2,0.35,0.7028811524609844,0.6721215051989711,6.032562971115112,0.6721215051989711
306,12,Decision Tree,2,0.35,0.6194477791116446,0.6157186773045157,0.1604294776916504,0.6157186773045157
307,12,RandomForest,2,0.35,0.6866746698679472,0.6684042569408752,0.7486729621887207,0.6684042569408752
308,12,AdaBoost (Discrete),2,0.35,0.5918367346938775,0.5880608609996223,51.31946611404419,0.5880608609996223
309,12,AdaBoost (Real),2,0.35,0.602641056422569,0.6005188143831166,66.35348987579346,0.6005188143831166
310,12,Logistic Regression (Penalty = L2),2,0.35,0.7334933973589436,0.7288872890479381,0.2829413414001465,0.7288872890479381
311,12,Naive Bayes,2,0.35,0.7088835534213686,0.69032301565004,0.0731039047241211,0.69032301565004
