,feat_set_id,classifier,fold_id,feat_th,score,geo_score,exec_t,geo_score_woz
0,0,KNeighbors Classifier,0,0.65,0.6227544910179641,0.7040808008860376,1.967618703842163,0.7040808008860376
1,0,SVC Classifier,0,0.65,0.592814371257485,0.2902397809308411,1.8152387142181396,0.0
2,0,Decision Tree,0,0.65,0.5149700598802395,0.5639388819380087,0.09543061256408691,0.5639388819380087
3,0,RandomForest,0,0.65,0.592814371257485,0.2438093199376099,0.43508481979370117,0.2438093199376099
4,0,AdaBoost (Discrete),0,0.65,0.437125748502994,0.34329817136034474,35.98896288871765,0.34329817136034474
5,0,AdaBoost (Real),0,0.65,0.6107784431137725,0.6860621925574227,42.45124101638794,0.6860621925574227
6,0,Logistic Regression (Penalty = L2),0,0.65,0.5808383233532934,0.681866975476474,0.28407764434814453,0.681866975476474
7,0,Naive Bayes,0,0.65,0.46706586826347307,0.525271256626669,0.1573801040649414,0.525271256626669
8,0,KNeighbors Classifier,1,0.65,0.5515151515151515,0.654351626975434,1.582021713256836,0.654351626975434
9,0,SVC Classifier,1,0.65,0.5818181818181818,0.9947780321927768,1.8428456783294678,0.0
10,0,Decision Tree,1,0.65,0.5393939393939394,0.6435609748144865,0.10288572311401367,0.6435609748144865
11,0,RandomForest,1,0.65,0.5818181818181818,0.9947780321927768,0.33567357063293457,0.0
12,0,AdaBoost (Discrete),1,0.65,0.5757575757575758,0.623722882326302,34.283732175827026,0.623722882326302
13,0,AdaBoost (Real),1,0.65,0.5454545454545454,0.6435609748144865,38.83188557624817,0.6435609748144865
14,0,Logistic Regression (Penalty = L2),1,0.65,0.5818181818181818,0.6599092704944058,0.15563464164733887,0.6599092704944058
15,0,Naive Bayes,1,0.65,0.49696969696969695,0.5717329581629295,0.14684295654296875,0.5717329581629295
16,0,KNeighbors Classifier,2,0.65,0.5393939393939394,0.6435609748144865,1.907240390777588,0.6435609748144865
17,0,SVC Classifier,2,0.65,0.6060606060606061,0.46206375934610827,1.8283193111419678,0.46206375934610827
18,0,Decision Tree,2,0.65,0.6060606060606061,0.667788145051214,0.09544730186462402,0.667788145051214
19,0,RandomForest,2,0.65,0.5818181818181818,0.9947780321927768,0.3839433193206787,0.0
20,0,AdaBoost (Discrete),2,0.65,0.43636363636363634,0.5692225725524779,37.26688814163208,0.5692225725524779
21,0,AdaBoost (Real),2,0.65,0.5151515151515151,0.6090747909993272,40.01498341560364,0.6090747909993272
22,0,Logistic Regression (Penalty = L2),2,0.65,0.5393939393939394,0.6399655870870427,0.17378497123718262,0.6399655870870427
23,0,Naive Bayes,2,0.65,0.49696969696969695,0.5836666096061082,0.19648098945617676,0.5836666096061082
24,1,KNeighbors Classifier,0,0.65,0.5688622754491018,0.6742049002196551,1.2936375141143799,0.6742049002196551
25,1,SVC Classifier,0,0.65,0.5988023952095808,0.33333333333333337,1.3154096603393555,0.0
26,1,Decision Tree,0,0.65,0.5688622754491018,0.6501052721852144,0.09871387481689453,0.6501052721852144
27,1,RandomForest,0,0.65,0.5748502994011976,1.0,0.3851625919342041,0.0
28,1,AdaBoost (Discrete),0,0.65,0.5988023952095808,0.7066094851429235,30.899956703186035,0.7066094851429235
29,1,AdaBoost (Real),0,0.65,0.5748502994011976,0.6908399383584118,31.29191255569458,0.6908399383584118
30,1,Logistic Regression (Penalty = L2),0,0.65,0.688622754491018,0.7610634098106709,0.12425732612609863,0.7610634098106709
31,1,Naive Bayes,0,0.65,0.47904191616766467,0.4926459905662744,0.09800362586975098,0.4926459905662744
32,1,KNeighbors Classifier,1,0.65,0.49696969696969695,0.6103110761053288,1.265026330947876,0.6103110761053288
33,1,SVC Classifier,1,0.65,0.5818181818181818,1.0,1.2960960865020752,0.0
34,1,Decision Tree,1,0.65,0.5333333333333333,0.6239852815504942,0.09422016143798828,0.6239852815504942
35,1,RandomForest,1,0.65,0.5878787878787879,0.12126781251816648,0.33516454696655273,0.0
36,1,AdaBoost (Discrete),1,0.65,0.45454545454545453,0.554504412212268,30.746596813201904,0.554504412212268
37,1,AdaBoost (Real),1,0.65,0.48484848484848486,0.5913589956143608,31.789555311203003,0.5913589956143608
38,1,Logistic Regression (Penalty = L2),1,0.65,0.6303030303030303,0.7366934138216488,0.17123007774353027,0.7366934138216488
39,1,Naive Bayes,1,0.65,0.46060606060606063,0.49794911558783184,0.13611173629760742,0.49794911558783184
40,1,KNeighbors Classifier,2,0.65,0.47878787878787876,0.5876858636081601,1.3304839134216309,0.5876858636081601
41,1,SVC Classifier,2,0.65,0.6,0.3339455162794333,1.2853188514709473,0.0
42,1,Decision Tree,2,0.65,0.5151515151515151,0.6340512923306705,0.09399771690368652,0.6340512923306705
43,1,RandomForest,2,0.65,0.5818181818181818,1.0,0.3717377185821533,0.0
44,1,AdaBoost (Discrete),2,0.65,0.509090909090909,0.6398408860731518,30.777670860290527,0.6398408860731518
45,1,AdaBoost (Real),2,0.65,0.5878787878787879,0.7000933582299681,30.80475354194641,0.7000933582299681
46,1,Logistic Regression (Penalty = L2),2,0.65,0.5878787878787879,0.6941039725344165,0.1750781536102295,0.6941039725344165
47,1,Naive Bayes,2,0.65,0.45454545454545453,0.5137135743406683,0.09723687171936035,0.5137135743406683
48,2,KNeighbors Classifier,0,0.65,0.5149700598802395,0.6422719158302672,1.383286714553833,0.6422719158302672
49,2,SVC Classifier,0,0.65,0.5748502994011976,0.2052305172662957,1.4097654819488525,0.0
50,2,Decision Tree,0,0.65,0.5808383233532934,0.6790412271880225,0.04964876174926758,0.6790412271880225
51,2,RandomForest,0,0.65,0.592814371257485,0.2438093199376099,0.37876224517822266,0.2438093199376099
52,2,AdaBoost (Discrete),0,0.65,0.437125748502994,0.34329817136034474,31.780811309814453,0.34329817136034474
53,2,AdaBoost (Real),0,0.65,0.6107784431137725,0.6899953899145445,34.44067406654358,0.6899953899145445
54,2,Logistic Regression (Penalty = L2),0,0.65,0.49101796407185627,0.6195172613552342,0.18737578392028809,0.6195172613552342
55,2,Naive Bayes,0,0.65,0.4491017964071856,0.5163666337264373,0.1985177993774414,0.5163666337264373
56,2,KNeighbors Classifier,1,0.65,0.47878787878787876,0.5876858636081601,1.405107021331787,0.5876858636081601
57,2,SVC Classifier,1,0.65,0.5818181818181818,0.9947780321927768,1.3622896671295166,0.0
58,2,Decision Tree,1,0.65,0.5212121212121212,0.6447914959270326,0.1021270751953125,0.6447914959270326
59,2,RandomForest,1,0.65,0.593939393939394,0.24499865251482233,0.3499786853790283,0.24499865251482233
60,2,AdaBoost (Discrete),1,0.65,0.41818181818181815,0.3640632172700595,32.03300333023071,0.3640632172700595
61,2,AdaBoost (Real),1,0.65,0.5575757575757576,0.6580278368475444,36.22150659561157,0.6580278368475444
62,2,Logistic Regression (Penalty = L2),1,0.65,0.4666666666666667,0.5904816070919543,0.29135632514953613,0.5904816070919543
63,2,Naive Bayes,1,0.65,0.4303030303030303,0.5233978098358734,0.09637308120727539,0.5233978098358734
64,2,KNeighbors Classifier,2,0.65,0.5272727272727272,0.649061762731388,1.2164325714111328,0.649061762731388
65,2,SVC Classifier,2,0.65,0.593939393939394,0.4777858488946908,1.2542388439178467,0.4777858488946908
66,2,Decision Tree,2,0.65,0.5212121212121212,0.6447914959270326,0.047998905181884766,0.6447914959270326
67,2,RandomForest,2,0.65,0.593939393939394,0.24499865251482233,0.3364415168762207,0.24499865251482233
68,2,AdaBoost (Discrete),2,0.65,0.43636363636363634,0.5692225725524779,30.6176655292511,0.5692225725524779
69,2,AdaBoost (Real),2,0.65,0.5575757575757576,0.6544708601462536,34.2316210269928,0.6544708601462536
70,2,Logistic Regression (Penalty = L2),2,0.65,0.503030303030303,0.6141256193608323,0.21549606323242188,0.6141256193608323
71,2,Naive Bayes,2,0.65,0.45454545454545453,0.5489690621400171,0.12431669235229492,0.5489690621400171
72,3,KNeighbors Classifier,0,0.65,0.5808383233532934,0.6790412271880225,1.3204822540283203,0.6790412271880225
73,3,SVC Classifier,0,0.65,0.5688622754491018,0.9895833333333334,1.38261079788208,0.0
74,3,Decision Tree,0,0.65,0.5449101796407185,0.6364864769028697,0.08575296401977539,0.6364864769028697
75,3,RandomForest,0,0.65,0.5748502994011976,0.11975720203651022,0.37714123725891113,0.0
76,3,AdaBoost (Discrete),0,0.65,0.41317365269461076,0.39009474880274697,28.7754385471344,0.0
77,3,AdaBoost (Real),0,0.65,0.5808383233532934,0.6908399383584118,27.083065032958984,0.6908399383584118
78,3,Logistic Regression (Penalty = L2),0,0.65,0.6467065868263473,0.7382310310598578,0.1804955005645752,0.7382310310598578
79,3,Naive Bayes,0,0.65,0.47305389221556887,0.5197416748522441,0.11580514907836914,0.5197416748522441
80,3,KNeighbors Classifier,1,0.65,0.5696969696969697,0.6841038692715277,1.058121919631958,0.6841038692715277
81,3,SVC Classifier,1,0.65,0.5818181818181818,1.0,1.159118413925171,0.0
82,3,Decision Tree,1,0.65,0.5515151515151515,0.650874793832672,0.09404373168945312,0.650874793832672
83,3,RandomForest,1,0.65,0.5878787878787879,1.0,0.33168959617614746,0.0
84,3,AdaBoost (Discrete),1,0.65,0.5333333333333333,0.6141256193608323,23.923797845840454,0.6141256193608323
85,3,AdaBoost (Real),1,0.65,0.5818181818181818,0.7011336173502295,24.755373001098633,0.7011336173502295
86,3,Logistic Regression (Penalty = L2),1,0.65,0.6060606060606061,0.7201415213419243,0.13358116149902344,0.7201415213419243
87,3,Naive Bayes,1,0.65,0.47878787878787876,0.5415844714200836,0.14215826988220215,0.5415844714200836
88,3,KNeighbors Classifier,2,0.65,0.4727272727272727,0.60421863502675,1.0627448558807373,0.60421863502675
89,3,SVC Classifier,2,0.65,0.593939393939394,0.17149858514250885,1.0113868713378906,0.0
90,3,Decision Tree,2,0.65,0.5757575757575758,0.681365233591485,0.03668832778930664,0.681365233591485
91,3,RandomForest,2,0.65,0.5818181818181818,0.9947780321927768,0.30634450912475586,0.0
92,3,AdaBoost (Discrete),2,0.65,0.503030303030303,0.6205567217966603,23.86703062057495,0.6205567217966603
93,3,AdaBoost (Real),2,0.65,0.5575757575757576,0.6671004121804862,26.19782543182373,0.6671004121804862
94,3,Logistic Regression (Penalty = L2),2,0.65,0.5454545454545454,0.6654901635440462,0.11254525184631348,0.6654901635440462
95,3,Naive Bayes,2,0.65,0.46060606060606063,0.5462446050749434,0.09036445617675781,0.5462446050749434
96,4,KNeighbors Classifier,0,0.65,0.5808383233532934,0.6908399383584118,1.1624925136566162,0.6908399383584118
97,4,SVC Classifier,0,0.65,0.5988023952095808,0.33333333333333337,1.1139724254608154,0.0
98,4,Decision Tree,0,0.65,0.5568862275449101,0.6548334766539591,0.04486417770385742,0.6548334766539591
99,4,RandomForest,0,0.65,0.5748502994011976,1.0,0.304105281829834,0.0
100,4,AdaBoost (Discrete),0,0.65,0.5748502994011976,0.6917875937828168,25.431597232818604,0.6917875937828168
101,4,AdaBoost (Real),0,0.65,0.5688622754491018,0.6840247967444385,26.163281440734863,0.6840247967444385
102,4,Logistic Regression (Penalty = L2),0,0.65,0.6407185628742516,0.7297309050846212,0.11997509002685547,0.7297309050846212
103,4,Naive Bayes,0,0.65,0.49101796407185627,0.4975727773091722,0.11592793464660645,0.4975727773091722
104,4,KNeighbors Classifier,1,0.65,0.5212121212121212,0.6380899444807125,1.3310139179229736,0.6380899444807125
105,4,SVC Classifier,1,0.65,0.5818181818181818,1.0,1.1763832569122314,0.0
106,4,Decision Tree,1,0.65,0.6121212121212121,0.6894088903613095,0.045537710189819336,0.6894088903613095
107,4,RandomForest,1,0.65,0.5818181818181818,1.0,0.3901340961456299,0.0
108,4,AdaBoost (Discrete),1,0.65,0.48484848484848486,0.6108589319435868,25.367008209228516,0.6108589319435868
109,4,AdaBoost (Real),1,0.65,0.4666666666666667,0.5613933701811722,22.568711757659912,0.5613933701811722
110,4,Logistic Regression (Penalty = L2),1,0.65,0.6545454545454545,0.7570147956600648,0.12092018127441406,0.7570147956600648
111,4,Naive Bayes,1,0.65,0.503030303030303,0.5263632998046983,0.15040993690490723,0.5263632998046983
112,4,KNeighbors Classifier,2,0.65,0.4666666666666667,0.5760738301029461,1.0913443565368652,0.5760738301029461
113,4,SVC Classifier,2,0.65,0.6,0.3339455162794333,1.0016863346099854,0.0
114,4,Decision Tree,2,0.65,0.5878787878787879,0.6758209257597321,0.07802987098693848,0.6758209257597321
115,4,RandomForest,2,0.65,0.6,0.24126911181028848,0.32086825370788574,0.0
116,4,AdaBoost (Discrete),2,0.65,0.5333333333333333,0.6610797399042941,24.36170530319214,0.6610797399042941
117,4,AdaBoost (Real),2,0.65,0.5696969696969697,0.6886560251395649,24.363826751708984,0.6886560251395649
118,4,Logistic Regression (Penalty = L2),2,0.65,0.5757575757575758,0.6861706608900693,0.1201322078704834,0.6861706608900693
119,4,Naive Bayes,2,0.65,0.47878787878787876,0.525070018672476,0.11187577247619629,0.525070018672476
120,5,KNeighbors Classifier,0,0.65,0.49700598802395207,0.627158399034931,1.0061612129211426,0.627158399034931
121,5,SVC Classifier,0,0.65,0.5748502994011976,0.2052305172662957,1.0512311458587646,0.0
122,5,Decision Tree,0,0.65,0.6167664670658682,0.6933612743506347,0.08556628227233887,0.6933612743506347
123,5,RandomForest,0,0.65,0.5988023952095808,0.3843166266583483,0.28903651237487793,0.3843166266583483
124,5,AdaBoost (Discrete),0,0.65,0.437125748502994,0.34329817136034474,23.94542670249939,0.34329817136034474
125,5,AdaBoost (Real),0,0.65,0.5988023952095808,0.6663645974514727,25.415262699127197,0.6663645974514727
126,5,Logistic Regression (Penalty = L2),0,0.65,0.49101796407185627,0.606665479498799,0.12732386589050293,0.606665479498799
127,5,Naive Bayes,0,0.65,0.46706586826347307,0.525271256626669,0.09640216827392578,0.525271256626669
128,5,KNeighbors Classifier,1,0.65,0.4909090909090909,0.5949870556711115,0.9657483100891113,0.5949870556711115
129,5,SVC Classifier,1,0.65,0.5818181818181818,0.9947780321927768,1.0364091396331787,0.0
130,5,Decision Tree,1,0.65,0.5212121212121212,0.6501507945768054,0.04456591606140137,0.6501507945768054
131,5,RandomForest,1,0.65,0.5878787878787879,1.0,0.309675931930542,0.0
132,5,AdaBoost (Discrete),1,0.65,0.4121212121212121,0.3379663528019703,23.66885471343994,0.3379663528019703
133,5,AdaBoost (Real),1,0.65,0.5454545454545454,0.6435609748144865,25.163819789886475,0.6435609748144865
134,5,Logistic Regression (Penalty = L2),1,0.65,0.48484848484848486,0.6025355660438075,0.153334379196167,0.6025355660438075
135,5,Naive Bayes,1,0.65,0.4909090909090909,0.5685915048814884,0.09259963035583496,0.5685915048814884
136,5,KNeighbors Classifier,2,0.65,0.5212121212121212,0.6428203976645589,1.0182113647460938,0.6428203976645589
137,5,SVC Classifier,2,0.65,0.593939393939394,0.4777858488946908,1.0989301204681396,0.4777858488946908
138,5,Decision Tree,2,0.65,0.4727272727272727,0.5974290868895751,0.045101165771484375,0.5974290868895751
139,5,RandomForest,2,0.65,0.593939393939394,0.24499865251482233,0.35085344314575195,0.24499865251482233
140,5,AdaBoost (Discrete),2,0.65,0.43636363636363634,0.5692225725524779,24.123470783233643,0.5692225725524779
141,5,AdaBoost (Real),2,0.65,0.5454545454545454,0.6537548083052067,26.68014168739319,0.6537548083052067
142,5,Logistic Regression (Penalty = L2),2,0.65,0.4666666666666667,0.5801986042015974,0.1609809398651123,0.5801986042015974
143,5,Naive Bayes,2,0.65,0.49696969696969695,0.5836666096061082,0.14026832580566406,0.5836666096061082
144,6,KNeighbors Classifier,0,0.65,0.5748502994011976,0.6780575832800562,0.971520185470581,0.6780575832800562
145,6,SVC Classifier,0,0.65,0.5688622754491018,0.9895833333333334,1.0248594284057617,0.0
146,6,Decision Tree,0,0.65,0.5329341317365269,0.6294529014198351,0.0446629524230957,0.6294529014198351
147,6,RandomForest,0,0.65,0.5808383233532934,0.1693622593118876,0.31122875213623047,0.0
148,6,AdaBoost (Discrete),0,0.65,0.41317365269461076,0.39009474880274697,23.476635932922363,0.0
149,6,AdaBoost (Real),0,0.65,0.5449101796407185,0.6679474171686484,25.15678882598877,0.6679474171686484
150,6,Logistic Regression (Penalty = L2),0,0.65,0.6766467065868264,0.7653828179076829,0.09981226921081543,0.7653828179076829
151,6,Naive Bayes,0,0.65,0.48502994011976047,0.525271256626669,0.12249588966369629,0.525271256626669
152,6,KNeighbors Classifier,1,0.65,0.5696969696969697,0.6873615558748829,0.9964802265167236,0.6873615558748829
153,6,SVC Classifier,1,0.65,0.5818181818181818,1.0,1.0609979629516602,0.0
154,6,Decision Tree,1,0.65,0.5575757575757576,0.6580278368475444,0.04426860809326172,0.6580278368475444
155,6,RandomForest,1,0.65,0.5878787878787879,1.0,0.30799078941345215,0.0
156,6,AdaBoost (Discrete),1,0.65,0.5212121212121212,0.6124966312870558,24.337024688720703,0.6124966312870558
157,6,AdaBoost (Real),1,0.65,0.5575757575757576,0.6786044041487267,25.662484884262085,0.6786044041487267
158,6,Logistic Regression (Penalty = L2),1,0.65,0.6181818181818182,0.7304306474771364,0.1273038387298584,0.7304306474771364
159,6,Naive Bayes,1,0.65,0.503030303030303,0.5531726642757387,0.08650422096252441,0.5531726642757387
160,6,KNeighbors Classifier,2,0.65,0.48484848484848486,0.6149368826809706,0.9314830303192139,0.6149368826809706
161,6,SVC Classifier,2,0.65,0.593939393939394,0.17149858514250885,1.0515904426574707,0.0
162,6,Decision Tree,2,0.65,0.5272727272727272,0.6524379574788458,0.0444033145904541,0.6524379574788458
163,6,RandomForest,2,0.65,0.5878787878787879,1.0,0.2671358585357666,0.0
164,6,AdaBoost (Discrete),2,0.65,0.49696969696969695,0.6103110761053288,23.41304612159729,0.6103110761053288
165,6,AdaBoost (Real),2,0.65,0.5575757575757576,0.6757091089268243,26.739997386932373,0.6757091089268243
166,6,Logistic Regression (Penalty = L2),2,0.65,0.5636363636363636,0.6815851352474145,0.1240384578704834,0.6815851352474145
167,6,Naive Bayes,2,0.65,0.48484848484848486,0.5654149497475027,0.11261940002441406,0.5654149497475027
168,7,KNeighbors Classifier,0,0.65,0.5149700598802395,0.6283077450373054,1.0318996906280518,0.6283077450373054
169,7,SVC Classifier,0,0.65,0.592814371257485,0.23951440407302044,0.9244093894958496,0.0
170,7,Decision Tree,0,0.65,0.5568862275449101,0.6772905491600731,0.05686378479003906,0.6772905491600731
171,7,RandomForest,0,0.65,0.5808383233532934,0.1203858530857692,0.3115272521972656,0.0
172,7,AdaBoost (Discrete),0,0.65,0.5508982035928144,0.6664779054960731,25.64694118499756,0.6664779054960731
173,7,AdaBoost (Real),0,0.65,0.5149700598802395,0.6414168552128009,27.414453983306885,0.6414168552128009
174,7,Logistic Regression (Penalty = L2),0,0.65,0.5389221556886228,0.6288172183965881,0.13303327560424805,0.6288172183965881
175,7,Naive Bayes,0,0.65,0.47904191616766467,0.4926459905662744,0.06291389465332031,0.4926459905662744
176,7,KNeighbors Classifier,1,0.65,0.5272727272727272,0.6289294911490091,0.9236321449279785,0.6289294911490091
177,7,SVC Classifier,1,0.65,0.5818181818181818,1.0,0.9904265403747559,0.0
178,7,Decision Tree,1,0.65,0.503030303030303,0.6341782803757905,0.05262494087219238,0.6341782803757905
179,7,RandomForest,1,0.65,0.593939393939394,0.17149858514250885,0.3135664463043213,0.0
180,7,AdaBoost (Discrete),1,0.65,0.5515151515151515,0.6769370647417922,25.612688779830933,0.6769370647417922
181,7,AdaBoost (Real),1,0.65,0.48484848484848486,0.6202914132043424,28.036030769348145,0.6202914132043424
182,7,Logistic Regression (Penalty = L2),1,0.65,0.5393939393939394,0.6273765725056446,0.14544248580932617,0.6273765725056446
183,7,Naive Bayes,1,0.65,0.46060606060606063,0.49794911558783184,0.06581521034240723,0.49794911558783184
184,7,KNeighbors Classifier,2,0.65,0.4303030303030303,0.5530057443306996,0.950059175491333,0.5530057443306996
185,7,SVC Classifier,2,0.65,0.5878787878787879,0.31065632609231775,0.8646814823150635,0.0
186,7,Decision Tree,2,0.65,0.5515151515151515,0.6714323544203868,0.05633187294006348,0.6714323544203868
187,7,RandomForest,2,0.65,0.5818181818181818,0.23742903996690853,0.3683617115020752,0.0
188,7,AdaBoost (Discrete),2,0.65,0.503030303030303,0.6341782803757905,25.894639253616333,0.6341782803757905
189,7,AdaBoost (Real),2,0.65,0.5696969696969697,0.6841038692715277,30.07638430595398,0.6841038692715277
190,7,Logistic Regression (Penalty = L2),2,0.65,0.45454545454545453,0.554504412212268,0.1283435821533203,0.554504412212268
191,7,Naive Bayes,2,0.65,0.45454545454545453,0.5137135743406683,0.17821240425109863,0.5137135743406683
192,8,KNeighbors Classifier,0,0.65,0.6347305389221557,0.6395055834817612,1.0053694248199463,0.0
193,8,SVC Classifier,0,0.65,0.5748502994011976,1.0,1.0430908203125,0.0
194,8,Decision Tree,0,0.65,0.5568862275449101,0.4930066485916346,0.05051231384277344,0.0
195,8,RandomForest,0,0.65,0.6107784431137725,0.29488391230979427,0.3652918338775635,0.0
196,8,AdaBoost (Discrete),0,0.65,0.6047904191616766,0.6167939547439613,28.053106546401978,0.0
197,8,AdaBoost (Real),0,0.65,0.5988023952095808,0.6099021858695888,31.470113039016724,0.0
198,8,Logistic Regression (Penalty = L2),0,0.65,0.6107784431137725,0.6025559488525398,0.28850579261779785,0.0
199,8,Naive Bayes,0,0.65,0.46706586826347307,0.4761333178461085,0.0574495792388916,0.4761333178461085
200,8,KNeighbors Classifier,1,0.65,0.5818181818181818,0.6996763876976021,1.061328649520874,0.6996763876976021
201,8,SVC Classifier,1,0.65,0.5818181818181818,1.0,1.0707635879516602,0.0
202,8,Decision Tree,1,0.65,0.6242424242424243,0.6286657205823252,0.060756683349609375,0.0
203,8,RandomForest,1,0.65,0.5818181818181818,1.0,0.45496225357055664,0.0
204,8,AdaBoost (Discrete),1,0.65,0.6363636363636364,0.6483387519305798,27.08260226249695,0.0
205,8,AdaBoost (Real),1,0.65,0.6242424242424243,0.6371370554684294,27.205762147903442,0.0
206,8,Logistic Regression (Penalty = L2),1,0.65,0.6666666666666666,0.6715507368448513,0.14574742317199707,0.0
207,8,Naive Bayes,1,0.65,0.4666666666666667,0.5104029703445759,0.00550389289855957,0.5104029703445759
208,8,KNeighbors Classifier,2,0.65,0.5272727272727272,0.650874793832672,0.9095849990844727,0.650874793832672
209,8,SVC Classifier,2,0.65,0.5818181818181818,1.0,1.0021395683288574,0.0
210,8,Decision Tree,2,0.65,0.5878787878787879,0.5909862146297095,0.055907487869262695,0.0
211,8,RandomForest,2,0.65,0.6060606060606061,0.24253562503633297,0.389575719833374,0.0
212,8,AdaBoost (Discrete),2,0.65,0.5454545454545454,0.5547533014684961,24.5251886844635,0.0
213,8,AdaBoost (Real),2,0.65,0.49696969696969695,0.49769690162020597,24.06171751022339,0.0
214,8,Logistic Regression (Penalty = L2),2,0.65,0.5636363636363636,0.5746908802505372,0.1311047077178955,0.0
215,8,Naive Bayes,2,0.65,0.43636363636363634,0.4870016134438437,0.0847172737121582,0.4870016134438437
216,9,KNeighbors Classifier,0,0.65,0.5209580838323353,0.6258763872853138,0.7772860527038574,0.6258763872853138
217,9,SVC Classifier,0,0.65,0.5688622754491018,0.9895833333333334,0.8302078247070312,0.0
218,9,Decision Tree,0,0.65,0.5748502994011976,0.6933612743506347,0.0512080192565918,0.6933612743506347
219,9,RandomForest,0,0.65,0.5868263473053892,1.0,0.3112831115722656,0.0
220,9,AdaBoost (Discrete),0,0.65,0.41317365269461076,0.39009474880274697,22.406545162200928,0.0
221,9,AdaBoost (Real),0,0.65,0.562874251497006,0.6648880731370418,26.979843854904175,0.6648880731370418
222,9,Logistic Regression (Penalty = L2),0,0.65,0.5868263473053892,0.6966947932603809,0.1605069637298584,0.6966947932603809
223,9,Naive Bayes,0,0.65,0.47305389221556887,0.5197416748522441,0.047353267669677734,0.5197416748522441
224,9,KNeighbors Classifier,1,0.65,0.45454545454545453,0.5429736008685693,0.8309400081634521,0.5429736008685693
225,9,SVC Classifier,1,0.65,0.5818181818181818,1.0,0.7795305252075195,0.0
226,9,Decision Tree,1,0.65,0.49696969696969695,0.6307315912310941,0.05263566970825195,0.6307315912310941
227,9,RandomForest,1,0.65,0.593939393939394,0.24499865251482233,0.3597536087036133,0.24499865251482233
228,9,AdaBoost (Discrete),1,0.65,0.4909090909090909,0.5746856950120153,24.662862062454224,0.5746856950120153
229,9,AdaBoost (Real),1,0.65,0.5757575757575758,0.6951622208151544,25.73901391029358,0.6951622208151544
230,9,Logistic Regression (Penalty = L2),1,0.65,0.49696969696969695,0.623722882326302,0.11463427543640137,0.623722882326302
231,9,Naive Bayes,1,0.65,0.4727272727272727,0.538608672507971,0.1034398078918457,0.538608672507971
232,9,KNeighbors Classifier,2,0.65,0.46060606060606063,0.5579701547631802,0.8428819179534912,0.5579701547631802
233,9,SVC Classifier,2,0.65,0.5878787878787879,0.12126781251816648,0.7181310653686523,0.0
234,9,Decision Tree,2,0.65,0.43636363636363634,0.576995549802924,0.04716229438781738,0.576995549802924
235,9,RandomForest,2,0.65,0.593939393939394,0.24499865251482233,0.3016178607940674,0.24499865251482233
236,9,AdaBoost (Discrete),2,0.65,0.41818181818181815,0.5481205769203976,23.785649061203003,0.5481205769203976
237,9,AdaBoost (Real),2,0.65,0.5818181818181818,0.7005098326638468,26.24693274497986,0.7005098326638468
238,9,Logistic Regression (Penalty = L2),2,0.65,0.5272727272727272,0.6469946730546923,0.11896920204162598,0.6469946730546923
239,9,Naive Bayes,2,0.65,0.46060606060606063,0.5462446050749434,0.05239272117614746,0.5462446050749434
240,10,KNeighbors Classifier,0,0.65,0.6467065868263473,0.7306746864067946,1.769587755203247,0.7306746864067946
241,10,SVC Classifier,0,0.65,0.592814371257485,0.2902397809308411,1.690614938735962,0.0
242,10,Decision Tree,0,0.65,0.5209580838323353,0.6046075753562526,0.09540510177612305,0.6046075753562526
243,10,RandomForest,0,0.65,0.5748502994011976,1.0,0.3379347324371338,0.0
244,10,AdaBoost (Discrete),0,0.65,0.437125748502994,0.34329817136034474,35.59487318992615,0.34329817136034474
245,10,AdaBoost (Real),0,0.65,0.6047904191616766,0.6865963427206895,37.30425572395325,0.6865963427206895
246,10,Logistic Regression (Penalty = L2),0,0.65,0.6167664670658682,0.6893606191883215,0.17866826057434082,0.6893606191883215
247,10,Naive Bayes,0,0.65,0.4550898203592814,0.5193688327767603,0.14767742156982422,0.5193688327767603
248,10,KNeighbors Classifier,1,0.65,0.5818181818181818,0.6922975088348078,1.840022325515747,0.6922975088348078
249,10,SVC Classifier,1,0.65,0.5818181818181818,0.9947780321927768,1.870276689529419,0.0
250,10,Decision Tree,1,0.65,0.5333333333333333,0.6325234519700399,0.09196138381958008,0.6325234519700399
251,10,RandomForest,1,0.65,0.5878787878787879,0.24414499175196025,0.33119630813598633,0.24414499175196025
252,10,AdaBoost (Discrete),1,0.65,0.5878787878787879,0.6718851073252298,33.926637172698975,0.6718851073252298
253,10,AdaBoost (Real),1,0.65,0.6181818181818182,0.6927234071328422,35.543797731399536,0.6927234071328422
254,10,Logistic Regression (Penalty = L2),1,0.65,0.5757575757575758,0.6650286584282477,0.2648952007293701,0.6650286584282477
255,10,Naive Bayes,1,0.65,0.45454545454545453,0.5429736008685693,0.15168237686157227,0.5429736008685693
256,10,KNeighbors Classifier,2,0.65,0.5151515151515151,0.6284127041528227,1.826481580734253,0.6284127041528227
257,10,SVC Classifier,2,0.65,0.6060606060606061,0.46206375934610827,1.8027164936065674,0.46206375934610827
258,10,Decision Tree,2,0.65,0.5818181818181818,0.6723372508717325,0.09519457817077637,0.6723372508717325
259,10,RandomForest,2,0.65,0.5757575757575758,0.9895833333333334,0.3964076042175293,0.0
260,10,AdaBoost (Discrete),2,0.65,0.43636363636363634,0.5692225725524779,34.26048755645752,0.5692225725524779
261,10,AdaBoost (Real),2,0.65,0.5272727272727272,0.6360770290723415,37.93309020996094,0.6360770290723415
262,10,Logistic Regression (Penalty = L2),2,0.65,0.5393939393939394,0.6468726676448499,0.14440155029296875,0.6468726676448499
263,10,Naive Bayes,2,0.65,0.4666666666666667,0.5613933701811722,0.10171627998352051,0.5613933701811722
264,11,KNeighbors Classifier,0,0.65,0.6287425149700598,0.6999967136458812,1.6260814666748047,0.6999967136458812
265,11,SVC Classifier,0,0.65,0.5868263473053892,0.26495145850196566,1.7628202438354492,0.0
266,11,Decision Tree,0,0.65,0.5868263473053892,0.6761917630820112,0.08807563781738281,0.6761917630820112
267,11,RandomForest,0,0.65,0.5748502994011976,0.24124271543573797,0.31084370613098145,0.24124271543573797
268,11,AdaBoost (Discrete),0,0.65,0.437125748502994,0.34329817136034474,34.13365578651428,0.34329817136034474
269,11,AdaBoost (Real),0,0.65,0.5868263473053892,0.68563427278786,39.82387948036194,0.68563427278786
270,11,Logistic Regression (Penalty = L2),0,0.65,0.6047904191616766,0.6742049002196551,0.1401205062866211,0.6742049002196551
271,11,Naive Bayes,0,0.65,0.4491017964071856,0.5163666337264373,0.1850879192352295,0.5163666337264373
272,11,KNeighbors Classifier,1,0.65,0.5454545454545454,0.6566096690099397,1.7518868446350098,0.6566096690099397
273,11,SVC Classifier,1,0.65,0.5818181818181818,0.9947780321927768,1.6300811767578125,0.0
274,11,Decision Tree,1,0.65,0.5212121212121212,0.6075569272759603,0.09400343894958496,0.6075569272759603
275,11,RandomForest,1,0.65,0.5878787878787879,1.0,0.31358957290649414,0.0
276,11,AdaBoost (Discrete),1,0.65,0.5757575757575758,0.6169557313153966,33.61643719673157,0.6169557313153966
277,11,AdaBoost (Real),1,0.65,0.48484848484848486,0.5714203649031516,34.50316905975342,0.5714203649031516
278,11,Logistic Regression (Penalty = L2),1,0.65,0.5696969696969697,0.6615467691941467,0.15755987167358398,0.6615467691941467
279,11,Naive Bayes,1,0.65,0.43636363636363634,0.5267316437316311,0.14070653915405273,0.5267316437316311
280,11,KNeighbors Classifier,2,0.65,0.5272727272727272,0.6158806592503815,1.5791363716125488,0.6158806592503815
281,11,SVC Classifier,2,0.65,0.6060606060606061,0.46206375934610827,1.620307207107544,0.46206375934610827
282,11,Decision Tree,2,0.65,0.5272727272727272,0.6249019454015914,0.10783839225769043,0.6249019454015914
283,11,RandomForest,2,0.65,0.593939393939394,0.24499865251482233,0.41596174240112305,0.24499865251482233
284,11,AdaBoost (Discrete),2,0.65,0.43636363636363634,0.5692225725524779,30.746814727783203,0.5692225725524779
285,11,AdaBoost (Real),2,0.65,0.5333333333333333,0.6398408860731518,32.67317318916321,0.6398408860731518
286,11,Logistic Regression (Penalty = L2),2,0.65,0.5393939393939394,0.6435609748144865,0.1534106731414795,0.6435609748144865
287,11,Naive Bayes,2,0.65,0.45454545454545453,0.5489690621400171,0.21863198280334473,0.5489690621400171
288,12,KNeighbors Classifier,0,0.65,0.48502994011976047,0.48373296821806844,0.5709216594696045,0.0
289,12,SVC Classifier,0,0.65,0.5748502994011976,1.0,0.5702028274536133,0.0
290,12,Decision Tree,0,0.65,0.592814371257485,0.5991640714704636,0.04345417022705078,0.0
291,12,RandomForest,0,0.65,0.5868263473053892,0.20742555849952674,0.3071615695953369,0.0
292,12,AdaBoost (Discrete),0,0.65,0.5748502994011976,0.5303300858899106,19.82943058013916,0.0
293,12,AdaBoost (Real),0,0.65,0.5449101796407185,0.49909338094043154,20.17813515663147,0.0
294,12,Logistic Regression (Penalty = L2),0,0.65,0.6047904191616766,0.6094069343174583,0.13567829132080078,0.0
295,12,Naive Bayes,0,0.65,0.47305389221556887,0.47856261151880786,0.12644696235656738,0.47856261151880786
296,12,KNeighbors Classifier,1,0.65,0.5454545454545454,0.6615467691941467,0.631037712097168,0.6615467691941467
297,12,SVC Classifier,1,0.65,0.5818181818181818,1.0,0.6661398410797119,0.0
298,12,Decision Tree,1,0.65,0.593939393939394,0.6044412830919826,0.039749860763549805,0.0
299,12,RandomForest,1,0.65,0.5757575757575758,0.11999795749895732,0.25344252586364746,0.0
300,12,AdaBoost (Discrete),1,0.65,0.6181818181818182,0.599351160610781,20.611937046051025,0.0
301,12,AdaBoost (Real),1,0.65,0.6727272727272727,0.622298081276798,19.865843534469604,0.0
302,12,Logistic Regression (Penalty = L2),1,0.65,0.5818181818181818,0.5857791861290061,0.11182737350463867,0.0
303,12,Naive Bayes,1,0.65,0.4909090909090909,0.5211514396594348,0.0717160701751709,0.5211514396594348
304,12,KNeighbors Classifier,2,0.65,0.49696969696969695,0.6103110761053288,0.6384210586547852,0.6103110761053288
305,12,SVC Classifier,2,0.65,0.5818181818181818,1.0,0.5867862701416016,0.0
306,12,Decision Tree,2,0.65,0.5696969696969697,0.5752237416355278,0.04082679748535156,0.0
307,12,RandomForest,2,0.65,0.5818181818181818,1.0,0.3196380138397217,0.0
308,12,AdaBoost (Discrete),2,0.65,0.5757575757575758,0.5598384746041118,21.213353633880615,0.0
309,12,AdaBoost (Real),2,0.65,0.5575757575757576,0.5,23.069077730178833,0.0
310,12,Logistic Regression (Penalty = L2),2,0.65,0.5878787878787879,0.5987118525241847,0.20646095275878906,0.0
311,12,Naive Bayes,2,0.65,0.45454545454545453,0.49525744617296386,0.045027732849121094,0.49525744617296386
