,feat_set_id,classifier,fold_id,feat_th,score,geo_score,exec_t,geo_score_woz
0,0,KNeighbors Classifier,0,0.95,0.7340764331210191,0.8455857904980735,21.881263494491577,0.0
1,0,SVC Classifier,0,0.95,0.7346072186836518,0.8486899801791715,30.439542055130005,0.0
2,0,Decision Tree,0,0.95,0.720276008492569,0.8090948477227461,0.3138706684112549,0.0
3,0,RandomForest,0,0.95,0.589171974522293,0.5672116609979888,0.7264747619628906,0.0
4,0,AdaBoost (Discrete),0,0.95,0.7234607218683652,0.8171667502714705,88.52906322479248,0.0
5,0,AdaBoost (Real),0,0.95,0.3619957537154989,0.35011387244385067,127.89281487464905,0.35011387244385067
6,0,Logistic Regression (Penalty = L2),0,0.95,0.7367303609341825,0.37182262850934894,1.5629527568817139,0.37182262850934894
7,0,Naive Bayes,0,0.95,0.6358811040339702,0.7411988693440721,0.4613680839538574,0.7411988693440721
8,0,KNeighbors Classifier,1,0.95,0.7777777777777778,0.26077324862933543,22.030335187911987,0.26077324862933543
9,0,SVC Classifier,1,0.95,0.7676767676767676,0.6174804095865509,27.91835880279541,0.0
10,0,Decision Tree,1,0.95,0.7533227006911217,0.27509262963764747,0.3116166591644287,0.0
11,0,RandomForest,1,0.95,0.7698032961190856,0.9975777114203086,0.6734762191772461,0.0
12,0,AdaBoost (Discrete),1,0.95,0.7947900053163212,0.6772366109985666,79.03028512001038,0.0
13,0,AdaBoost (Real),1,0.95,0.7804359383306751,0.9822786963053242,112.75069904327393,0.0
14,0,Logistic Regression (Penalty = L2),1,0.95,0.7666135034556087,0.6169183639901882,1.6499311923980713,0.0
15,0,Naive Bayes,1,0.95,0.8543328017012227,0.9341766402374898,0.4593174457550049,0.9341766402374898
16,0,KNeighbors Classifier,2,0.95,0.3853113358169239,0.2834212963845766,16.686704874038696,0.2834212963845766
17,0,SVC Classifier,2,0.95,0.3571048430015966,0.3455925591338455,12.495505332946777,0.0
18,0,Decision Tree,2,0.95,0.3709419904204364,0.3286110181216786,0.24158859252929688,0.0
19,0,RandomForest,2,0.95,0.2825971261309207,0.18422154731498122,0.5787334442138672,0.0
20,0,AdaBoost (Discrete),2,0.95,0.464608834486429,0.2272413839024291,73.33534741401672,0.2272413839024291
21,0,AdaBoost (Real),2,0.95,0.3677488025545503,0.784611766697512,88.32502293586731,0.0
22,0,Logistic Regression (Penalty = L2),2,0.95,0.3751995742416179,0.36889231476638806,1.4689733982086182,0.0
23,0,Naive Bayes,2,0.95,0.39861628525811604,0.39795049660148546,0.4287142753601074,0.39795049660148546
24,1,KNeighbors Classifier,0,0.95,0.7340764331210191,0.8455857904980735,18.144211292266846,0.0
25,1,SVC Classifier,0,0.95,0.7346072186836518,0.8486899801791715,22.019254446029663,0.0
26,1,Decision Tree,0,0.95,0.7287685774946921,0.8040599452035703,0.21447992324829102,0.0
27,1,RandomForest,0,0.95,0.6257961783439491,0.7510560865461375,0.4825878143310547,0.0
28,1,AdaBoost (Discrete),0,0.95,0.7234607218683652,0.8171667502714705,74.49976587295532,0.0
29,1,AdaBoost (Real),0,0.95,0.3211252653927813,0.31169803187753203,81.38748049736023,0.0
30,1,Logistic Regression (Penalty = L2),0,0.95,0.7367303609341825,0.37182262850934894,1.3658981323242188,0.37182262850934894
31,1,Naive Bayes,0,0.95,0.6358811040339702,0.7411988693440721,0.3899044990539551,0.7411988693440721
32,1,KNeighbors Classifier,1,0.95,0.7777777777777778,0.26077324862933543,16.88686227798462,0.26077324862933543
33,1,SVC Classifier,1,0.95,0.7676767676767676,0.6174804095865509,20.454405069351196,0.0
34,1,Decision Tree,1,0.95,0.7533227006911217,0.6916650237799168,0.2277674674987793,0.0
35,1,RandomForest,1,0.95,0.7586390217969166,0.9848922834816614,0.49579572677612305,0.0
36,1,AdaBoost (Discrete),1,0.95,0.7947900053163212,0.6772366109985666,69.12667417526245,0.0
37,1,AdaBoost (Real),1,0.95,0.7804359383306751,0.9822786963053242,83.07975029945374,0.0
38,1,Logistic Regression (Penalty = L2),1,0.95,0.7666135034556087,0.6169183639901882,1.3110830783843994,0.0
39,1,Naive Bayes,1,0.95,0.8543328017012227,0.9341766402374898,0.39907026290893555,0.9341766402374898
40,1,KNeighbors Classifier,2,0.95,0.3853113358169239,0.2834212963845766,13.998661756515503,0.2834212963845766
41,1,SVC Classifier,2,0.95,0.3571048430015966,0.3455925591338455,10.778926372528076,0.0
42,1,Decision Tree,2,0.95,0.36668440659925494,0.32803499872711733,0.162200927734375,0.0
43,1,RandomForest,2,0.95,0.28100053219797766,0.18372364881323205,0.5148727893829346,0.0
44,1,AdaBoost (Discrete),2,0.95,0.464608834486429,0.2272413839024291,60.570738792419434,0.2272413839024291
45,1,AdaBoost (Real),2,0.95,0.3677488025545503,0.784611766697512,72.96554803848267,0.0
46,1,Logistic Regression (Penalty = L2),2,0.95,0.3751995742416179,0.36889231476638806,0.9034242630004883,0.0
47,1,Naive Bayes,2,0.95,0.39861628525811604,0.39795049660148546,0.2811558246612549,0.39795049660148546
48,2,KNeighbors Classifier,0,0.95,0.7340764331210191,0.8455857904980735,13.590685367584229,0.0
49,2,SVC Classifier,0,0.95,0.7346072186836518,0.8486899801791715,19.12306523323059,0.0
50,2,Decision Tree,0,0.95,0.690552016985138,0.805085146778457,0.1525888442993164,0.0
51,2,RandomForest,0,0.95,0.589171974522293,0.5672116609979888,0.40377068519592285,0.0
52,2,AdaBoost (Discrete),0,0.95,0.7234607218683652,0.8171667502714705,61.029967308044434,0.0
53,2,AdaBoost (Real),0,0.95,0.3211252653927813,0.31169803187753203,62.11706328392029,0.0
54,2,Logistic Regression (Penalty = L2),0,0.95,0.7367303609341825,0.37182262850934894,1.0022499561309814,0.37182262850934894
55,2,Naive Bayes,0,0.95,0.6358811040339702,0.7411988693440721,0.2818410396575928,0.7411988693440721
56,2,KNeighbors Classifier,1,0.95,0.7777777777777778,0.26077324862933543,13.031517744064331,0.26077324862933543
57,2,SVC Classifier,1,0.95,0.7676767676767676,0.6174804095865509,17.44208574295044,0.0
58,2,Decision Tree,1,0.95,0.7533227006911217,0.6757324654416789,0.13033342361450195,0.0
59,2,RandomForest,1,0.95,0.7698032961190856,0.9975777114203086,0.46611952781677246,0.0
60,2,AdaBoost (Discrete),1,0.95,0.7947900053163212,0.6772366109985666,49.45883345603943,0.0
61,2,AdaBoost (Real),1,0.95,0.7804359383306751,0.9822786963053242,59.65467810630798,0.0
62,2,Logistic Regression (Penalty = L2),1,0.95,0.7666135034556087,0.6169183639901882,0.9033231735229492,0.0
63,2,Naive Bayes,1,0.95,0.8543328017012227,0.9341766402374898,0.24440383911132812,0.9341766402374898
64,2,KNeighbors Classifier,2,0.95,0.3853113358169239,0.2834212963845766,10.336457967758179,0.2834212963845766
65,2,SVC Classifier,2,0.95,0.3571048430015966,0.3455925591338455,8.026028394699097,0.0
66,2,Decision Tree,2,0.95,0.36668440659925494,0.32903024258124014,0.1280500888824463,0.0
67,2,RandomForest,2,0.95,0.2825971261309207,0.18422154731498122,0.4124886989593506,0.0
68,2,AdaBoost (Discrete),2,0.95,0.464608834486429,0.2272413839024291,46.01000952720642,0.2272413839024291
69,2,AdaBoost (Real),2,0.95,0.3677488025545503,0.784611766697512,54.98103427886963,0.0
70,2,Logistic Regression (Penalty = L2),2,0.95,0.3751995742416179,0.36889231476638806,0.7543766498565674,0.0
71,2,Naive Bayes,2,0.95,0.39861628525811604,0.39795049660148546,0.233994722366333,0.39795049660148546
72,3,KNeighbors Classifier,0,0.95,0.7340764331210191,0.8455857904980735,10.433897256851196,0.0
73,3,SVC Classifier,0,0.95,0.7346072186836518,0.8486899801791715,14.782427787780762,0.0
74,3,Decision Tree,0,0.95,0.7287685774946921,0.8047384777689074,0.1527400016784668,0.0
75,3,RandomForest,0,0.95,0.5801486199575372,0.650062031779499,0.3206143379211426,0.0
76,3,AdaBoost (Discrete),0,0.95,0.7590233545647559,0.7472535134772463,45.31711935997009,0.0
77,3,AdaBoost (Real),0,0.95,0.3211252653927813,0.31169803187753203,53.67589807510376,0.0
78,3,Logistic Regression (Penalty = L2),0,0.95,0.7367303609341825,0.37182262850934894,0.8517763614654541,0.37182262850934894
79,3,Naive Bayes,0,0.95,0.6358811040339702,0.7411988693440721,0.22486543655395508,0.7411988693440721
80,3,KNeighbors Classifier,1,0.95,0.7777777777777778,0.26077324862933543,10.686830759048462,0.26077324862933543
81,3,SVC Classifier,1,0.95,0.7676767676767676,0.6174804095865509,14.709320783615112,0.0
82,3,Decision Tree,1,0.95,0.7533227006911217,0.6325465240991146,0.14261436462402344,0.0
83,3,RandomForest,1,0.95,0.7698032961190856,0.9975777114203086,0.3176870346069336,0.0
84,3,AdaBoost (Discrete),1,0.95,0.7947900053163212,0.6772366109985666,42.61609649658203,0.0
85,3,AdaBoost (Real),1,0.95,0.7804359383306751,0.9822786963053242,53.678359031677246,0.0
86,3,Logistic Regression (Penalty = L2),1,0.95,0.7666135034556087,0.6169183639901882,0.9567067623138428,0.0
87,3,Naive Bayes,1,0.95,0.8543328017012227,0.9341766402374898,0.24832701683044434,0.9341766402374898
88,3,KNeighbors Classifier,2,0.95,0.3853113358169239,0.2834212963845766,8.688073873519897,0.2834212963845766
89,3,SVC Classifier,2,0.95,0.3571048430015966,0.3455925591338455,7.198853969573975,0.0
90,3,Decision Tree,2,0.95,0.3853113358169239,0.3303857854891765,0.11437654495239258,0.0
91,3,RandomForest,2,0.95,0.28100053219797766,0.18372364881323205,0.3093702793121338,0.0
92,3,AdaBoost (Discrete),2,0.95,0.464608834486429,0.2272413839024291,39.031516313552856,0.2272413839024291
93,3,AdaBoost (Real),2,0.95,0.3677488025545503,0.784611766697512,45.999842405319214,0.0
94,3,Logistic Regression (Penalty = L2),2,0.95,0.3751995742416179,0.36889231476638806,0.7514398097991943,0.0
95,3,Naive Bayes,2,0.95,0.39861628525811604,0.39795049660148546,0.22566890716552734,0.39795049660148546
96,4,KNeighbors Classifier,0,0.95,0.7340764331210191,0.8455857904980735,9.965679407119751,0.0
97,4,SVC Classifier,0,0.95,0.7346072186836518,0.8486899801791715,12.748950719833374,0.0
98,4,Decision Tree,0,0.95,0.7016985138004246,0.7922335654828241,0.09723877906799316,0.0
99,4,RandomForest,0,0.95,0.6257961783439491,0.7510560865461375,0.2676658630371094,0.0
100,4,AdaBoost (Discrete),0,0.95,0.7590233545647559,0.7472535134772463,37.89182686805725,0.0
101,4,AdaBoost (Real),0,0.95,0.3211252653927813,0.31169803187753203,44.78080224990845,0.0
102,4,Logistic Regression (Penalty = L2),0,0.95,0.7367303609341825,0.37182262850934894,0.770362138748169,0.37182262850934894
103,4,Naive Bayes,0,0.95,0.6358811040339702,0.7411988693440721,0.22797822952270508,0.7411988693440721
104,4,KNeighbors Classifier,1,0.95,0.7777777777777778,0.26077324862933543,9.728584051132202,0.26077324862933543
105,4,SVC Classifier,1,0.95,0.7676767676767676,0.6174804095865509,12.47571849822998,0.0
106,4,Decision Tree,1,0.95,0.7533227006911217,0.6393407259855997,0.09339690208435059,0.0
107,4,RandomForest,1,0.95,0.7586390217969166,0.9848922834816614,0.2940027713775635,0.0
108,4,AdaBoost (Discrete),1,0.95,0.7947900053163212,0.6772366109985666,37.10611295700073,0.0
109,4,AdaBoost (Real),1,0.95,0.7804359383306751,0.9822786963053242,45.71477770805359,0.0
110,4,Logistic Regression (Penalty = L2),1,0.95,0.7666135034556087,0.6169183639901882,0.7772901058197021,0.0
111,4,Naive Bayes,1,0.95,0.8543328017012227,0.9341766402374898,0.20372915267944336,0.9341766402374898
112,4,KNeighbors Classifier,2,0.95,0.3853113358169239,0.2834212963845766,8.160851001739502,0.2834212963845766
113,4,SVC Classifier,2,0.95,0.3571048430015966,0.3455925591338455,6.012144088745117,0.0
114,4,Decision Tree,2,0.95,0.36668440659925494,0.32935457070509666,0.09748363494873047,0.0
115,4,RandomForest,2,0.95,0.28100053219797766,0.18372364881323205,0.2640058994293213,0.0
116,4,AdaBoost (Discrete),2,0.95,0.464608834486429,0.2272413839024291,35.633195638656616,0.2272413839024291
117,4,AdaBoost (Real),2,0.95,0.3677488025545503,0.784611766697512,44.30066728591919,0.0
118,4,Logistic Regression (Penalty = L2),2,0.95,0.3751995742416179,0.36889231476638806,0.7156112194061279,0.0
119,4,Naive Bayes,2,0.95,0.39861628525811604,0.39795049660148546,0.20427918434143066,0.39795049660148546
120,5,KNeighbors Classifier,0,0.95,0.7340764331210191,0.8455857904980735,9.346906423568726,0.0
121,5,SVC Classifier,0,0.95,0.7346072186836518,0.8486899801791715,12.659925699234009,0.0
122,5,Decision Tree,0,0.95,0.7287685774946921,0.827102300783135,0.1401066780090332,0.0
123,5,RandomForest,0,0.95,0.589171974522293,0.5672116609979888,0.2989921569824219,0.0
124,5,AdaBoost (Discrete),0,0.95,0.7234607218683652,0.8171667502714705,37.89723873138428,0.0
125,5,AdaBoost (Real),0,0.95,0.3211252653927813,0.31169803187753203,42.245299339294434,0.0
126,5,Logistic Regression (Penalty = L2),0,0.95,0.7367303609341825,0.37182262850934894,0.7628166675567627,0.37182262850934894
127,5,Naive Bayes,0,0.95,0.6358811040339702,0.7411988693440721,0.23002099990844727,0.7411988693440721
128,5,KNeighbors Classifier,1,0.95,0.7777777777777778,0.26077324862933543,10.156878471374512,0.26077324862933543
129,5,SVC Classifier,1,0.95,0.7676767676767676,0.6174804095865509,12.981284141540527,0.0
130,5,Decision Tree,1,0.95,0.7533227006911217,0.6255005561249454,0.09988737106323242,0.0
131,5,RandomForest,1,0.95,0.7698032961190856,0.9975777114203086,0.23801970481872559,0.0
132,5,AdaBoost (Discrete),1,0.95,0.7947900053163212,0.6772366109985666,37.41408348083496,0.0
133,5,AdaBoost (Real),1,0.95,0.7804359383306751,0.9822786963053242,45.67838788032532,0.0
134,5,Logistic Regression (Penalty = L2),1,0.95,0.7666135034556087,0.6169183639901882,0.644615650177002,0.0
135,5,Naive Bayes,1,0.95,0.8543328017012227,0.9341766402374898,0.21436572074890137,0.9341766402374898
136,5,KNeighbors Classifier,2,0.95,0.3853113358169239,0.2834212963845766,7.574193239212036,0.2834212963845766
137,5,SVC Classifier,2,0.95,0.3571048430015966,0.3455925591338455,5.237687110900879,0.0
138,5,Decision Tree,2,0.95,0.3751995742416179,0.36207316391245287,0.08085465431213379,0.0
139,5,RandomForest,2,0.95,0.2825971261309207,0.18422154731498122,0.2598400115966797,0.0
140,5,AdaBoost (Discrete),2,0.95,0.464608834486429,0.2272413839024291,33.53767442703247,0.2272413839024291
141,5,AdaBoost (Real),2,0.95,0.3677488025545503,0.784611766697512,38.04505372047424,0.0
142,5,Logistic Regression (Penalty = L2),2,0.95,0.3751995742416179,0.36889231476638806,0.5854804515838623,0.0
143,5,Naive Bayes,2,0.95,0.39861628525811604,0.39795049660148546,0.1839609146118164,0.39795049660148546
144,6,KNeighbors Classifier,0,0.95,0.7340764331210191,0.8455857904980735,7.991316556930542,0.0
145,6,SVC Classifier,0,0.95,0.7346072186836518,0.8486899801791715,9.681992292404175,0.0
146,6,Decision Tree,0,0.95,0.7287685774946921,0.8135093144115638,0.07940006256103516,0.0
147,6,RandomForest,0,0.95,0.5801486199575372,0.650062031779499,0.2191762924194336,0.0
148,6,AdaBoost (Discrete),0,0.95,0.7234607218683652,0.8171667502714705,33.21627998352051,0.0
149,6,AdaBoost (Real),0,0.95,0.3211252653927813,0.31169803187753203,34.296690225601196,0.0
150,6,Logistic Regression (Penalty = L2),0,0.95,0.7367303609341825,0.37182262850934894,0.5861296653747559,0.37182262850934894
151,6,Naive Bayes,0,0.95,0.6358811040339702,0.7411988693440721,0.18331313133239746,0.7411988693440721
152,6,KNeighbors Classifier,1,0.95,0.7777777777777778,0.26077324862933543,7.152303457260132,0.26077324862933543
153,6,SVC Classifier,1,0.95,0.7676767676767676,0.6174804095865509,9.48973035812378,0.0
154,6,Decision Tree,1,0.95,0.7533227006911217,0.6325465240991146,0.08187365531921387,0.0
155,6,RandomForest,1,0.95,0.7698032961190856,0.9975777114203086,0.22362327575683594,0.0
156,6,AdaBoost (Discrete),1,0.95,0.7947900053163212,0.6772366109985666,27.07214641571045,0.0
157,6,AdaBoost (Real),1,0.95,0.7804359383306751,0.9822786963053242,33.20617699623108,0.0
158,6,Logistic Regression (Penalty = L2),1,0.95,0.7666135034556087,0.6169183639901882,0.6274914741516113,0.0
159,6,Naive Bayes,1,0.95,0.8543328017012227,0.9341766402374898,0.18820452690124512,0.9341766402374898
160,6,KNeighbors Classifier,2,0.95,0.3853113358169239,0.2834212963845766,6.208365201950073,0.2834212963845766
161,6,SVC Classifier,2,0.95,0.3571048430015966,0.3455925591338455,4.352598428726196,0.0
162,6,Decision Tree,2,0.95,0.36668440659925494,0.3283704974480539,0.05575084686279297,0.0
163,6,RandomForest,2,0.95,0.28100053219797766,0.18372364881323205,0.22622060775756836,0.0
164,6,AdaBoost (Discrete),2,0.95,0.464608834486429,0.2272413839024291,24.977044105529785,0.2272413839024291
165,6,AdaBoost (Real),2,0.95,0.3677488025545503,0.784611766697512,30.8004412651062,0.0
166,6,Logistic Regression (Penalty = L2),2,0.95,0.3751995742416179,0.36889231476638806,0.4917166233062744,0.0
167,6,Naive Bayes,2,0.95,0.39861628525811604,0.39795049660148546,0.18832755088806152,0.39795049660148546
168,7,KNeighbors Classifier,0,0.95,0.7340764331210191,0.8455857904980735,6.174335956573486,0.0
169,7,SVC Classifier,0,0.95,0.7346072186836518,0.8486899801791715,9.78490424156189,0.0
170,7,Decision Tree,0,0.95,0.6778131634819533,0.7919998734103308,0.06393957138061523,0.0
171,7,RandomForest,0,0.95,0.6257961783439491,0.7510560865461375,0.24195480346679688,0.0
172,7,AdaBoost (Discrete),0,0.95,0.7234607218683652,0.8171667502714705,28.28159475326538,0.0
173,7,AdaBoost (Real),0,0.95,0.3619957537154989,0.35011387244385067,30.355069398880005,0.35011387244385067
174,7,Logistic Regression (Penalty = L2),0,0.95,0.7367303609341825,0.37182262850934894,0.5115547180175781,0.37182262850934894
175,7,Naive Bayes,0,0.95,0.6358811040339702,0.7411988693440721,0.1963355541229248,0.7411988693440721
176,7,KNeighbors Classifier,1,0.95,0.7777777777777778,0.26077324862933543,5.985707998275757,0.26077324862933543
177,7,SVC Classifier,1,0.95,0.7676767676767676,0.6174804095865509,9.076551914215088,0.0
178,7,Decision Tree,1,0.95,0.7533227006911217,0.658389115679958,0.06543207168579102,0.0
179,7,RandomForest,1,0.95,0.7586390217969166,0.9848922834816614,0.188706636428833,0.0
180,7,AdaBoost (Discrete),1,0.95,0.7947900053163212,0.6772366109985666,29.214462518692017,0.0
181,7,AdaBoost (Real),1,0.95,0.7804359383306751,0.9822786963053242,31.311593770980835,0.0
182,7,Logistic Regression (Penalty = L2),1,0.95,0.7666135034556087,0.6169183639901882,0.5778110027313232,0.0
183,7,Naive Bayes,1,0.95,0.8543328017012227,0.9341766402374898,0.1435554027557373,0.9341766402374898
184,7,KNeighbors Classifier,2,0.95,0.3853113358169239,0.2834212963845766,4.98859977722168,0.2834212963845766
185,7,SVC Classifier,2,0.95,0.3571048430015966,0.3455925591338455,3.4593963623046875,0.0
186,7,Decision Tree,2,0.95,0.36668440659925494,0.32903024258124014,0.06248331069946289,0.0
187,7,RandomForest,2,0.95,0.28100053219797766,0.18372364881323205,0.16178226470947266,0.0
188,7,AdaBoost (Discrete),2,0.95,0.464608834486429,0.2272413839024291,20.5443913936615,0.2272413839024291
189,7,AdaBoost (Real),2,0.95,0.3677488025545503,0.784611766697512,24.72131848335266,0.0
190,7,Logistic Regression (Penalty = L2),2,0.95,0.3751995742416179,0.36889231476638806,0.4246077537536621,0.0
191,7,Naive Bayes,2,0.95,0.39861628525811604,0.39795049660148546,0.14565587043762207,0.39795049660148546
192,8,KNeighbors Classifier,0,0.95,0.7340764331210191,0.8455857904980735,4.921999454498291,0.0
193,8,SVC Classifier,0,0.95,0.7346072186836518,0.8486899801791715,6.881288051605225,0.0
194,8,Decision Tree,0,0.95,0.690552016985138,0.8099822240569987,0.09053897857666016,0.0
195,8,RandomForest,0,0.95,0.5636942675159236,0.6103938443016036,0.18665862083435059,0.0
196,8,AdaBoost (Discrete),0,0.95,0.7234607218683652,0.8171667502714705,21.636803150177002,0.0
197,8,AdaBoost (Real),0,0.95,0.3211252653927813,0.31169803187753203,26.72217297554016,0.0
198,8,Logistic Regression (Penalty = L2),0,0.95,0.7367303609341825,0.37182262850934894,0.5075256824493408,0.37182262850934894
199,8,Naive Bayes,0,0.95,0.6358811040339702,0.7411988693440721,0.1753711700439453,0.7411988693440721
200,8,KNeighbors Classifier,1,0.95,0.7777777777777778,0.26077324862933543,5.373637914657593,0.26077324862933543
201,8,SVC Classifier,1,0.95,0.7676767676767676,0.6174804095865509,7.373895883560181,0.0
202,8,Decision Tree,1,0.95,0.7533227006911217,0.6325465240991146,0.06606483459472656,0.0
203,8,RandomForest,1,0.95,0.7565124933545986,0.9824574409842733,0.13806700706481934,0.0
204,8,AdaBoost (Discrete),1,0.95,0.7947900053163212,0.6772366109985666,22.735756397247314,0.0
205,8,AdaBoost (Real),1,0.95,0.7804359383306751,0.9822786963053242,28.62369465827942,0.0
206,8,Logistic Regression (Penalty = L2),1,0.95,0.7666135034556087,0.6169183639901882,0.5661218166351318,0.0
207,8,Naive Bayes,1,0.95,0.8543328017012227,0.9341766402374898,0.17453503608703613,0.9341766402374898
208,8,KNeighbors Classifier,2,0.95,0.3853113358169239,0.2834212963845766,5.120920181274414,0.2834212963845766
209,8,SVC Classifier,2,0.95,0.3571048430015966,0.3455925591338455,3.780043363571167,0.0
210,8,Decision Tree,2,0.95,0.3602980308674827,0.3209795061856517,0.0899803638458252,0.0
211,8,RandomForest,2,0.95,0.30175625332623734,0.18999722543518244,0.2186141014099121,0.0
212,8,AdaBoost (Discrete),2,0.95,0.464608834486429,0.2272413839024291,23.031208276748657,0.2272413839024291
213,8,AdaBoost (Real),2,0.95,0.3677488025545503,0.784611766697512,27.25493550300598,0.0
214,8,Logistic Regression (Penalty = L2),2,0.95,0.3751995742416179,0.36889231476638806,0.4428744316101074,0.0
215,8,Naive Bayes,2,0.95,0.39861628525811604,0.39795049660148546,0.17780160903930664,0.39795049660148546
216,9,KNeighbors Classifier,0,0.95,0.7340764331210191,0.8455857904980735,4.871713161468506,0.0
217,9,SVC Classifier,0,0.95,0.7346072186836518,0.8486899801791715,7.266674280166626,0.0
218,9,Decision Tree,0,0.95,0.6778131634819533,0.7777855011316265,0.04739069938659668,0.0
219,9,RandomForest,0,0.95,0.5801486199575372,0.650062031779499,0.138214111328125,0.0
220,9,AdaBoost (Discrete),0,0.95,0.7590233545647559,0.7472535134772463,24.598398447036743,0.0
221,9,AdaBoost (Real),0,0.95,0.3211252653927813,0.31169803187753203,28.2425754070282,0.0
222,9,Logistic Regression (Penalty = L2),0,0.95,0.7367303609341825,0.37182262850934894,0.3998606204986572,0.37182262850934894
223,9,Naive Bayes,0,0.95,0.6358811040339702,0.7411988693440721,0.1803131103515625,0.7411988693440721
224,9,KNeighbors Classifier,1,0.95,0.7777777777777778,0.26077324862933543,5.865587949752808,0.26077324862933543
225,9,SVC Classifier,1,0.95,0.7676767676767676,0.6174804095865509,6.9447407722473145,0.0
226,9,Decision Tree,1,0.95,0.7533227006911217,0.2822469333505115,0.06818747520446777,0.0
227,9,RandomForest,1,0.95,0.7698032961190856,0.9975777114203086,0.16988492012023926,0.0
228,9,AdaBoost (Discrete),1,0.95,0.7947900053163212,0.6772366109985666,21.86136507987976,0.0
229,9,AdaBoost (Real),1,0.95,0.7804359383306751,0.9822786963053242,27.062960386276245,0.0
230,9,Logistic Regression (Penalty = L2),1,0.95,0.7666135034556087,0.6169183639901882,0.4072413444519043,0.0
231,9,Naive Bayes,1,0.95,0.8543328017012227,0.9341766402374898,0.12232637405395508,0.9341766402374898
232,9,KNeighbors Classifier,2,0.95,0.3853113358169239,0.2834212963845766,4.259044408798218,0.2834212963845766
233,9,SVC Classifier,2,0.95,0.3571048430015966,0.3455925591338455,3.2996811866760254,0.0
234,9,Decision Tree,2,0.95,0.3773283661522086,0.4462322579900501,0.05001115798950195,0.0
235,9,RandomForest,2,0.95,0.28100053219797766,0.18372364881323205,0.16777706146240234,0.0
236,9,AdaBoost (Discrete),2,0.95,0.464608834486429,0.2272413839024291,20.580120086669922,0.2272413839024291
237,9,AdaBoost (Real),2,0.95,0.3677488025545503,0.784611766697512,24.361543893814087,0.0
238,9,Logistic Regression (Penalty = L2),2,0.95,0.3751995742416179,0.36889231476638806,0.3712189197540283,0.0
239,9,Naive Bayes,2,0.95,0.39861628525811604,0.39795049660148546,0.14370965957641602,0.39795049660148546
240,10,KNeighbors Classifier,0,0.95,0.7340764331210191,0.8455857904980735,5.103203535079956,0.0
241,10,SVC Classifier,0,0.95,0.7346072186836518,0.8486899801791715,6.837100267410278,0.0
242,10,Decision Tree,0,0.95,0.6778131634819533,0.805785337541635,0.0666966438293457,0.0
243,10,RandomForest,0,0.95,0.589171974522293,0.5672116609979888,0.14000821113586426,0.0
244,10,AdaBoost (Discrete),0,0.95,0.7234607218683652,0.8171667502714705,21.585272789001465,0.0
245,10,AdaBoost (Real),0,0.95,0.3211252653927813,0.31169803187753203,21.625559329986572,0.0
246,10,Logistic Regression (Penalty = L2),0,0.95,0.7367303609341825,0.37182262850934894,0.34851789474487305,0.37182262850934894
247,10,Naive Bayes,0,0.95,0.6358811040339702,0.7411988693440721,0.16147208213806152,0.7411988693440721
248,10,KNeighbors Classifier,1,0.95,0.7777777777777778,0.26077324862933543,4.6175994873046875,0.26077324862933543
249,10,SVC Classifier,1,0.95,0.7676767676767676,0.6174804095865509,6.331287145614624,0.0
250,10,Decision Tree,1,0.95,0.7533227006911217,0.2998688778883322,0.047496795654296875,0.0
251,10,RandomForest,1,0.95,0.7698032961190856,0.9975777114203086,0.10009026527404785,0.0
252,10,AdaBoost (Discrete),1,0.95,0.7947900053163212,0.6772366109985666,18.084717750549316,0.0
253,10,AdaBoost (Real),1,0.95,0.7804359383306751,0.9822786963053242,22.66503930091858,0.0
254,10,Logistic Regression (Penalty = L2),1,0.95,0.7666135034556087,0.6169183639901882,0.37790560722351074,0.0
255,10,Naive Bayes,1,0.95,0.8543328017012227,0.9341766402374898,0.10386371612548828,0.9341766402374898
256,10,KNeighbors Classifier,2,0.95,0.3853113358169239,0.2834212963845766,3.9621782302856445,0.2834212963845766
257,10,SVC Classifier,2,0.95,0.3571048430015966,0.3455925591338455,2.5838184356689453,0.0
258,10,Decision Tree,2,0.95,0.3709419904204364,0.32997816416078074,0.032561540603637695,0.0
259,10,RandomForest,2,0.95,0.2825971261309207,0.18422154731498122,0.07275009155273438,0.0
260,10,AdaBoost (Discrete),2,0.95,0.464608834486429,0.2272413839024291,17.744528770446777,0.2272413839024291
261,10,AdaBoost (Real),2,0.95,0.3677488025545503,0.784611766697512,19.633394241333008,0.0
262,10,Logistic Regression (Penalty = L2),2,0.95,0.3751995742416179,0.36889231476638806,0.3235137462615967,0.0
263,10,Naive Bayes,2,0.95,0.39861628525811604,0.39795049660148546,0.13252639770507812,0.39795049660148546
264,11,KNeighbors Classifier,0,0.95,0.7340764331210191,0.8455857904980735,4.17927360534668,0.0
265,11,SVC Classifier,0,0.95,0.7346072186836518,0.8486899801791715,5.271860122680664,0.0
266,11,Decision Tree,0,0.95,0.7287685774946921,0.8087819544312839,0.046669721603393555,0.0
267,11,RandomForest,0,0.95,0.589171974522293,0.5672116609979888,0.10243940353393555,0.0
268,11,AdaBoost (Discrete),0,0.95,0.7590233545647559,0.7472535134772463,15.391367197036743,0.0
269,11,AdaBoost (Real),0,0.95,0.3211252653927813,0.31169803187753203,17.999080657958984,0.0
270,11,Logistic Regression (Penalty = L2),0,0.95,0.7367303609341825,0.37182262850934894,0.26035189628601074,0.37182262850934894
271,11,Naive Bayes,0,0.95,0.6358811040339702,0.7411988693440721,0.14957284927368164,0.7411988693440721
272,11,KNeighbors Classifier,1,0.95,0.7777777777777778,0.26077324862933543,4.012032747268677,0.26077324862933543
273,11,SVC Classifier,1,0.95,0.7676767676767676,0.6174804095865509,5.318710565567017,0.0
274,11,Decision Tree,1,0.95,0.7533227006911217,0.6459018199025707,0.027363300323486328,0.0
275,11,RandomForest,1,0.95,0.7698032961190856,0.9975777114203086,0.15305542945861816,0.0
276,11,AdaBoost (Discrete),1,0.95,0.7947900053163212,0.6772366109985666,15.086666822433472,0.0
277,11,AdaBoost (Real),1,0.95,0.7804359383306751,0.9822786963053242,18.33775520324707,0.0
278,11,Logistic Regression (Penalty = L2),1,0.95,0.7666135034556087,0.6169183639901882,0.28868937492370605,0.0
279,11,Naive Bayes,1,0.95,0.8543328017012227,0.9341766402374898,0.13223028182983398,0.9341766402374898
280,11,KNeighbors Classifier,2,0.95,0.3853113358169239,0.2834212963845766,3.335270881652832,0.2834212963845766
281,11,SVC Classifier,2,0.95,0.3571048430015966,0.3455925591338455,2.379911184310913,0.0
282,11,Decision Tree,2,0.95,0.3571048430015966,0.31869152866451794,0.028208494186401367,0.0
283,11,RandomForest,2,0.95,0.2825971261309207,0.18422154731498122,0.09906840324401855,0.0
284,11,AdaBoost (Discrete),2,0.95,0.464608834486429,0.2272413839024291,13.911975383758545,0.2272413839024291
285,11,AdaBoost (Real),2,0.95,0.3677488025545503,0.784611766697512,17.334553718566895,0.0
286,11,Logistic Regression (Penalty = L2),2,0.95,0.3751995742416179,0.36889231476638806,0.2146015167236328,0.0
287,11,Naive Bayes,2,0.95,0.39861628525811604,0.39795049660148546,0.0937185287475586,0.39795049660148546
288,12,KNeighbors Classifier,0,0.95,0.7340764331210191,0.8455857904980735,3.0577471256256104,0.0
289,12,SVC Classifier,0,0.95,0.7346072186836518,0.8486899801791715,4.081423282623291,0.0
290,12,Decision Tree,0,0.95,0.7117834394904459,0.7931757546415303,0.028865575790405273,0.0
291,12,RandomForest,0,0.95,0.5636942675159236,0.6103938443016036,0.09516525268554688,0.0
292,12,AdaBoost (Discrete),0,0.95,0.7234607218683652,0.8171667502714705,12.945755243301392,0.0
293,12,AdaBoost (Real),0,0.95,0.3211252653927813,0.31169803187753203,14.650965690612793,0.0
294,12,Logistic Regression (Penalty = L2),0,0.95,0.7367303609341825,0.37182262850934894,0.22711849212646484,0.37182262850934894
295,12,Naive Bayes,0,0.95,0.6358811040339702,0.7411988693440721,0.08468127250671387,0.7411988693440721
296,12,KNeighbors Classifier,1,0.95,0.7777777777777778,0.26077324862933543,2.9122560024261475,0.26077324862933543
297,12,SVC Classifier,1,0.95,0.7676767676767676,0.6174804095865509,3.7975916862487793,0.0
298,12,Decision Tree,1,0.95,0.7533227006911217,0.6701208424772659,0.04370260238647461,0.0
299,12,RandomForest,1,0.95,0.7565124933545986,0.9824574409842733,0.09866833686828613,0.0
300,12,AdaBoost (Discrete),1,0.95,0.7947900053163212,0.6772366109985666,11.941606521606445,0.0
301,12,AdaBoost (Real),1,0.95,0.7804359383306751,0.9822786963053242,15.207978248596191,0.0
302,12,Logistic Regression (Penalty = L2),1,0.95,0.7666135034556087,0.6169183639901882,0.23241591453552246,0.0
303,12,Naive Bayes,1,0.95,0.8543328017012227,0.9341766402374898,0.0839698314666748,0.9341766402374898
304,12,KNeighbors Classifier,2,0.95,0.3853113358169239,0.2834212963845766,2.429711103439331,0.2834212963845766
305,12,SVC Classifier,2,0.95,0.3571048430015966,0.3455925591338455,1.86794114112854,0.0
306,12,Decision Tree,2,0.95,0.3709419904204364,0.3286110181216786,0.026951074600219727,0.0
307,12,RandomForest,2,0.95,0.30175625332623734,0.18999722543518244,0.08087921142578125,0.0
308,12,AdaBoost (Discrete),2,0.95,0.464608834486429,0.2272413839024291,11.417561769485474,0.2272413839024291
309,12,AdaBoost (Real),2,0.95,0.3677488025545503,0.784611766697512,12.61239767074585,0.0
310,12,Logistic Regression (Penalty = L2),2,0.95,0.3751995742416179,0.36889231476638806,0.20426440238952637,0.0
311,12,Naive Bayes,2,0.95,0.39861628525811604,0.39795049660148546,0.09365057945251465,0.39795049660148546
