,feat_set_id,classifier,fold_id,feat_th,score,geo_score,exec_t,geo_score_woz
0,0,KNeighbors Classifier,0,0.35,0.7404458598726115,0.8634795796129672,10.499733209609985,0.0
1,0,SVC Classifier,0,0.35,0.6459660297239915,0.6318731002306498,20.84507131576538,0.0
2,0,Decision Tree,0,0.35,0.685244161358811,0.8526120246919198,0.1837141513824463,0.0
3,0,RandomForest,0,0.35,0.5636942675159236,0.6103938443016036,0.9338240623474121,0.0
4,0,AdaBoost (Discrete),0,0.35,0.7170912951167728,0.8397220682362341,73.92528080940247,0.0
5,0,AdaBoost (Real),0,0.35,0.37579617834394907,0.30468253772394677,137.4284267425537,0.0
6,0,Logistic Regression (Penalty = L2),0,0.35,0.7361995753715499,0.873942562614331,1.872298002243042,0.0
7,0,Naive Bayes,0,0.35,0.5636942675159236,0.6917567592162651,0.44540905952453613,0.6917567592162651
8,0,KNeighbors Classifier,1,0.35,0.8027644869750132,0.6191038282799199,10.62417221069336,0.0
9,0,SVC Classifier,1,0.35,0.7713981924508241,0.6192357015520555,19.257426738739014,0.0
10,0,Decision Tree,1,0.35,0.7666135034556087,0.6169761377004175,0.1641697883605957,0.0
11,0,RandomForest,1,0.35,0.7267410951621478,0.9481123179819073,0.8575639724731445,0.0
12,0,AdaBoost (Discrete),1,0.35,0.6629452418926103,0.5408452882338743,73.47895550727844,0.0
13,0,AdaBoost (Real),1,0.35,0.3902179691653376,0.47006764384170935,135.89211177825928,0.0
14,0,Logistic Regression (Penalty = L2),1,0.35,0.7666135034556087,0.6169761377004175,1.5714175701141357,0.0
15,0,Naive Bayes,1,0.35,0.7814992025518341,0.8981027474611979,0.38129663467407227,0.8981027474611979
16,0,KNeighbors Classifier,2,0.35,0.5013304949441192,0.5265678349473656,15.308093547821045,0.5265678349473656
17,0,SVC Classifier,2,0.35,0.34113890367216604,0.3580808722899428,7.7045207023620605,0.0
18,0,Decision Tree,2,0.35,0.38850452368281,0.4466937733593734,0.15098333358764648,0.0
19,0,RandomForest,2,0.35,0.3081426290580096,0.2522457743563452,0.7106485366821289,0.0
20,0,AdaBoost (Discrete),2,0.35,0.4390633315593401,0.4419630836585762,60.43217992782593,0.4419630836585762
21,0,AdaBoost (Real),2,0.35,0.3672166045769026,0.4209230970989335,87.52554059028625,0.0
22,0,Logistic Regression (Penalty = L2),2,0.35,0.37626397019691327,0.386282842134697,1.4930198192596436,0.0
23,0,Naive Bayes,2,0.35,0.33422032996274614,0.436037975614631,0.3018763065338135,0.436037975614631
24,1,KNeighbors Classifier,0,0.35,0.7112526539278131,0.8637625547419967,5.275536775588989,0.0
25,1,SVC Classifier,0,0.35,0.6693205944798302,0.6664218658119808,15.199544429779053,0.0
26,1,Decision Tree,0,0.35,0.7107218683651805,0.8635406788959284,0.14296245574951172,0.0
27,1,RandomForest,0,0.35,0.6242038216560509,0.7214884749298683,0.7229373455047607,0.0
28,1,AdaBoost (Discrete),0,0.35,0.5652866242038217,0.6588139335520611,62.3239426612854,0.0
29,1,AdaBoost (Real),0,0.35,0.30148619957537154,0.23780772013658005,90.52047348022461,0.0
30,1,Logistic Regression (Penalty = L2),0,0.35,0.7107218683651805,0.8635406788959284,1.6217186450958252,0.0
31,1,Naive Bayes,0,0.35,0.7091295116772823,0.7697079316448898,0.2882263660430908,0.7697079316448898
32,1,KNeighbors Classifier,1,0.35,0.7995746943115364,0.593493346356364,4.770949125289917,0.0
33,1,SVC Classifier,1,0.35,0.7713981924508241,0.6192357015520555,18.322471380233765,0.0
34,1,Decision Tree,1,0.35,0.7666135034556087,0.6169761377004175,0.11156058311462402,0.0
35,1,RandomForest,1,0.35,0.7698032961190856,0.9975777114203086,0.8413841724395752,0.0
36,1,AdaBoost (Discrete),1,0.35,0.8011695906432749,0.9255152611699503,78.73026490211487,0.0
37,1,AdaBoost (Real),1,0.35,0.42317916002126527,0.4004413668701287,144.72256445884705,0.0
38,1,Logistic Regression (Penalty = L2),1,0.35,0.7666135034556087,0.6169761377004175,2.005993127822876,0.0
39,1,Naive Bayes,1,0.35,0.8947368421052632,0.9515272721018165,0.3580894470214844,0.9515272721018165
40,1,KNeighbors Classifier,2,0.35,0.4523682810005322,0.37271829271869145,15.113393545150757,0.37271829271869145
41,1,SVC Classifier,2,0.35,0.31293241085683876,0.2877798912828133,8.23536729812622,0.0
42,1,Decision Tree,2,0.35,0.38850452368281,0.4466937733593734,0.09507989883422852,0.0
43,1,RandomForest,2,0.35,0.30175625332623734,0.18999722543518244,0.995349645614624,0.0
44,1,AdaBoost (Discrete),2,0.35,0.4566258648217137,0.39716360077546004,77.6325933933258,0.39716360077546004
45,1,AdaBoost (Real),2,0.35,0.2985630654603513,0.6167575033112543,98.27703857421875,0.0
46,1,Logistic Regression (Penalty = L2),2,0.35,0.37360298030867484,0.3677257586636381,1.5540196895599365,0.0
47,1,Naive Bayes,2,0.35,0.37679616817456096,0.3635621794426912,0.3096745014190674,0.3635621794426912
48,2,KNeighbors Classifier,0,0.35,0.7420382165605095,0.8613400010629058,11.492139339447021,0.0
49,2,SVC Classifier,0,0.35,0.6963906581740976,0.7182299195910284,19.075024366378784,0.0
50,2,Decision Tree,0,0.35,0.7361995753715499,0.873942562614331,0.16838407516479492,0.0
51,2,RandomForest,0,0.35,0.7165605095541401,0.9372618028725737,0.8475856781005859,0.0
52,2,AdaBoost (Discrete),0,0.35,0.8508492569002123,0.6248114672801873,69.30650782585144,0.6248114672801873
53,2,AdaBoost (Real),0,0.35,0.6475583864118896,0.6729369329093424,98.72415065765381,0.0
54,2,Logistic Regression (Penalty = L2),0,0.35,0.7361995753715499,0.873942562614331,1.6648964881896973,0.0
55,2,Naive Bayes,0,0.35,0.37579617834394907,0.5029375804701693,0.3249528408050537,0.5029375804701693
56,2,KNeighbors Classifier,1,0.35,0.8298777246145668,0.4841586384515546,11.58793306350708,0.4841586384515546
57,2,SVC Classifier,1,0.35,0.7713981924508241,0.6192357015520555,21.184098958969116,0.0
58,2,Decision Tree,1,0.35,0.7660818713450293,0.6166653730147104,0.07804560661315918,0.0
59,2,RandomForest,1,0.35,0.7698032961190856,0.9975777114203086,0.8400428295135498,0.0
60,2,AdaBoost (Discrete),1,0.35,0.8771929824561403,0.8304602625549715,73.20741844177246,0.8304602625549715
61,2,AdaBoost (Real),1,0.35,0.7240829346092504,0.8817136220829183,110.84819483757019,0.0
62,2,Logistic Regression (Penalty = L2),1,0.35,0.7666135034556087,0.6169761377004175,2.150615930557251,0.0
63,2,Naive Bayes,1,0.35,0.5459861775651249,0.6457165186144487,0.40079236030578613,0.6457165186144487
64,2,KNeighbors Classifier,2,0.35,0.4321447578499202,0.3574201734349816,18.758657455444336,0.3574201734349816
65,2,SVC Classifier,2,0.35,0.31293241085683876,0.2877798912828133,10.392288208007812,0.0
66,2,Decision Tree,2,0.35,0.3778605641298563,0.36918866219451113,0.19847679138183594,0.0
67,2,RandomForest,2,0.35,0.30175625332623734,0.18999722543518244,0.988060712814331,0.0
68,2,AdaBoost (Discrete),2,0.35,0.45290047897817987,0.3069688008227896,77.06858730316162,0.3069688008227896
69,2,AdaBoost (Real),2,0.35,0.42309739222990955,0.20984549355196083,111.42589735984802,0.0
70,2,Logistic Regression (Penalty = L2),2,0.35,0.37360298030867484,0.3677257586636381,1.5963199138641357,0.0
71,2,Naive Bayes,2,0.35,0.35178286322511976,0.3816510562774438,0.3402414321899414,0.3816510562774438
72,3,KNeighbors Classifier,0,0.35,0.6863057324840764,0.8530786982197881,3.620851516723633,0.0
73,3,SVC Classifier,0,0.35,0.5976645435244161,0.6172929621719077,11.731389284133911,0.0
74,3,Decision Tree,0,0.35,0.685244161358811,0.8526120246919198,0.09663033485412598,0.0
75,3,RandomForest,0,0.35,0.5981953290870489,0.6909553927994988,0.8216190338134766,0.0
76,3,AdaBoost (Discrete),0,0.35,0.6878980891719745,0.8537767995621033,63.027868032455444,0.0
77,3,AdaBoost (Real),0,0.35,0.583864118895966,0.7030242453103447,99.86816024780273,0.0
78,3,Logistic Regression (Penalty = L2),0,0.35,0.7361995753715499,0.873942562614331,1.4657363891601562,0.0
79,3,Naive Bayes,0,0.35,0.5636942675159236,0.6917567592162651,0.2678499221801758,0.6917567592162651
80,3,KNeighbors Classifier,1,0.35,0.8314726209463051,0.9280500649721211,3.526556968688965,0.0
81,3,SVC Classifier,1,0.35,0.7708665603402446,0.6117284268903497,12.610464334487915,0.0
82,3,Decision Tree,1,0.35,0.7666135034556087,0.6169761377004175,0.17386102676391602,0.0
83,3,RandomForest,1,0.35,0.7698032961190856,0.9975777114203086,0.8975579738616943,0.0
84,3,AdaBoost (Discrete),1,0.35,0.5560871876661351,0.5198466234277026,59.20260167121887,0.0
85,3,AdaBoost (Real),1,0.35,0.11057947900053164,0.22831633431223128,95.70614171028137,0.0
86,3,Logistic Regression (Penalty = L2),1,0.35,0.7666135034556087,0.6169761377004175,1.383718729019165,0.0
87,3,Naive Bayes,1,0.35,0.7814992025518341,0.8981027474611979,0.2711758613586426,0.8981027474611979
88,3,KNeighbors Classifier,2,0.35,0.49920170303352845,0.3385377367045252,3.991100311279297,0.3385377367045252
89,3,SVC Classifier,2,0.35,0.35125066524747206,0.4226093162152993,5.115489959716797,0.0
90,3,Decision Tree,2,0.35,0.41192123469930814,0.500228416923857,0.17719292640686035,0.0
91,3,RandomForest,2,0.35,0.2825971261309207,0.18422154731498122,0.9189715385437012,0.0
92,3,AdaBoost (Discrete),2,0.35,0.4241617881852049,0.43254080799275213,58.99195218086243,0.43254080799275213
93,3,AdaBoost (Real),2,0.35,0.34167110164981374,0.7593265827288596,92.25298070907593,0.0
94,3,Logistic Regression (Penalty = L2),2,0.35,0.37360298030867484,0.3677257586636381,1.3288683891296387,0.0
95,3,Naive Bayes,2,0.35,0.32570516232038316,0.3714863479747674,0.2596404552459717,0.3714863479747674
96,4,KNeighbors Classifier,0,0.35,0.7372611464968153,0.8743653700510113,5.6195595264434814,0.0
97,4,SVC Classifier,0,0.35,0.6953290870488322,0.7178826128910483,12.442822217941284,0.0
98,4,Decision Tree,0,0.35,0.7361995753715499,0.873942562614331,0.15799689292907715,0.0
99,4,RandomForest,0,0.35,0.4288747346072187,0.8361711547020709,0.7569944858551025,0.0
100,4,AdaBoost (Discrete),0,0.35,0.7308917197452229,0.7772444736617224,53.57022452354431,0.7772444736617224
101,4,AdaBoost (Real),0,0.35,0.7139065817409767,0.7343828849275283,87.83607006072998,0.0
102,4,Logistic Regression (Penalty = L2),0,0.35,0.6953290870488322,0.7178826128910483,1.182518720626831,0.0
103,4,Naive Bayes,0,0.35,0.30148619957537154,0.7130482340039412,0.1978132724761963,0.0
104,4,KNeighbors Classifier,1,0.35,0.8506113769271664,0.5275581641441045,6.744098663330078,0.5275581641441045
105,4,SVC Classifier,1,0.35,0.7086656034024456,0.9408094915518899,14.121776819229126,0.0
106,4,Decision Tree,1,0.35,0.7713981924508241,0.6192357015520555,0.07654356956481934,0.0
107,4,RandomForest,1,0.35,0.4375332270069112,0.35956704423367314,0.6844441890716553,0.0
108,4,AdaBoost (Discrete),1,0.35,0.8288144603934078,0.853285762129396,54.141353368759155,0.0
109,4,AdaBoost (Real),1,0.35,0.7581073896863371,0.9024015581275366,86.40347504615784,0.0
110,4,Logistic Regression (Penalty = L2),1,0.35,0.7612971823498139,0.9836905212116516,1.1677680015563965,0.0
111,4,Naive Bayes,1,0.35,0.5082402977139819,0.9676511362883462,0.25037097930908203,0.0
112,4,KNeighbors Classifier,2,0.35,0.47472059606173495,0.6163337139794967,5.728609800338745,0.0
113,4,SVC Classifier,2,0.35,0.36615220862160724,0.5418427308184528,7.703038930892944,0.0
114,4,Decision Tree,2,0.35,0.3948908994145822,0.5702541050612239,0.08576345443725586,0.0
115,4,RandomForest,2,0.35,0.30175625332623734,0.18999722543518244,0.7464625835418701,0.0
116,4,AdaBoost (Discrete),2,0.35,0.3959552953698776,0.5566798500525099,51.74655508995056,0.0
117,4,AdaBoost (Real),2,0.35,0.3853113358169239,0.49456822664737865,85.0450587272644,0.0
118,4,Logistic Regression (Penalty = L2),2,0.35,0.30867482703565724,0.28635519460172354,0.9062018394470215,0.0
119,4,Naive Bayes,2,0.35,0.21873336881319852,0.29752551339063393,0.1771554946899414,0.29752551339063393
120,5,KNeighbors Classifier,0,0.35,0.7372611464968153,0.8743653700510113,3.4899213314056396,0.0
121,5,SVC Classifier,0,0.35,0.6979830148619958,0.7187496234053726,11.931559562683105,0.0
122,5,Decision Tree,0,0.35,0.7361995753715499,0.873942562614331,0.1503734588623047,0.0
123,5,RandomForest,0,0.35,0.5621019108280255,0.6891504470964788,0.8295040130615234,0.0
124,5,AdaBoost (Discrete),0,0.35,0.7346072186836518,0.8733068132293391,53.352365493774414,0.0
125,5,AdaBoost (Real),0,0.35,0.667728237791932,0.7037376143105313,88.10176301002502,0.0
126,5,Logistic Regression (Penalty = L2),0,0.35,0.7361995753715499,0.873942562614331,1.423384189605713,0.0
127,5,Naive Bayes,0,0.35,0.4012738853503185,0.5600004021131864,0.24505376815795898,0.5600004021131864
128,5,KNeighbors Classifier,1,0.35,0.8118022328548644,0.7391284121449712,3.744640588760376,0.0
129,5,SVC Classifier,1,0.35,0.7814992025518341,0.9154061101596771,13.212481021881104,0.0
130,5,Decision Tree,1,0.35,0.7666135034556087,0.6169761377004175,0.09685707092285156,0.0
131,5,RandomForest,1,0.35,0.7698032961190856,0.9975777114203086,0.7519018650054932,0.0
132,5,AdaBoost (Discrete),1,0.35,0.8936735778841042,0.9249572251754373,57.15005135536194,0.9249572251754373
133,5,AdaBoost (Real),1,0.35,0.7581073896863371,0.9024015581275366,88.90861368179321,0.0
134,5,Logistic Regression (Penalty = L2),1,0.35,0.7666135034556087,0.6169761377004175,1.3093602657318115,0.0
135,5,Naive Bayes,1,0.35,0.5374800637958532,0.6188127976150575,0.24857044219970703,0.6188127976150575
136,5,KNeighbors Classifier,2,0.35,0.4103246407663651,0.403459531221613,3.5054662227630615,0.403459531221613
137,5,SVC Classifier,2,0.35,0.31293241085683876,0.2877798912828133,4.850751161575317,0.0
138,5,Decision Tree,2,0.35,0.36934539648749337,0.3340941445866145,0.16150879859924316,0.0
139,5,RandomForest,2,0.35,0.30867482703565724,0.25526510982958206,0.7761318683624268,0.0
140,5,AdaBoost (Discrete),2,0.35,0.3709419904204364,0.3667994855377931,55.21688795089722,0.0
141,5,AdaBoost (Real),2,0.35,0.4018094731240021,0.2351292726633175,87.39721989631653,0.0
142,5,Logistic Regression (Penalty = L2),2,0.35,0.37360298030867484,0.3677257586636381,1.178473711013794,0.0
143,5,Naive Bayes,2,0.35,0.34167110164981374,0.35119575661706315,0.24706578254699707,0.35119575661706315
144,6,KNeighbors Classifier,0,0.35,0.7361995753715499,0.873942562614331,7.097605228424072,0.0
145,6,SVC Classifier,0,0.35,0.6947983014861996,0.6743992684398227,16.758971452713013,0.0
146,6,Decision Tree,0,0.35,0.685244161358811,0.8526120246919198,0.15801429748535156,0.0
147,6,RandomForest,0,0.35,0.6502123142250531,0.7815678276732434,0.7807056903839111,0.0
148,6,AdaBoost (Discrete),0,0.35,0.7691082802547771,0.8611461464850387,62.193538427352905,0.0
149,6,AdaBoost (Real),0,0.35,0.5392781316348195,0.5690237806114667,91.07345008850098,0.0
150,6,Logistic Regression (Penalty = L2),0,0.35,0.7361995753715499,0.873942562614331,1.4151954650878906,0.0
151,6,Naive Bayes,0,0.35,0.6926751592356688,0.7637543016892311,0.23039603233337402,0.7637543016892311
152,6,KNeighbors Classifier,1,0.35,0.809144072301967,0.7482994405283315,9.07788634300232,0.0
153,6,SVC Classifier,1,0.35,0.7713981924508241,0.6192357015520555,16.759686708450317,0.0
154,6,Decision Tree,1,0.35,0.7666135034556087,0.6169761377004175,0.1398460865020752,0.0
155,6,RandomForest,1,0.35,0.7698032961190856,0.9975777114203086,0.7009105682373047,0.0
156,6,AdaBoost (Discrete),1,0.35,0.7910685805422647,0.626160245392542,64.63016605377197,0.0
157,6,AdaBoost (Real),1,0.35,0.41360978203083465,0.5444756784187212,99.62154650688171,0.0
158,6,Logistic Regression (Penalty = L2),1,0.35,0.7666135034556087,0.6169761377004175,1.4477431774139404,0.0
159,6,Naive Bayes,1,0.35,0.8649654439128124,0.9388998258529409,0.3114025592803955,0.9388998258529409
160,6,KNeighbors Classifier,2,0.35,0.48962213943587013,0.5086942537244169,12.100627422332764,0.5086942537244169
161,6,SVC Classifier,2,0.35,0.31293241085683876,0.2877798912828133,6.582805871963501,0.0
162,6,Decision Tree,2,0.35,0.3778605641298563,0.36918866219451113,0.14324665069580078,0.0
163,6,RandomForest,2,0.35,0.30175625332623734,0.18999722543518244,0.6101522445678711,0.0
164,6,AdaBoost (Discrete),2,0.35,0.45343267695582756,0.28867752207356784,62.892345905303955,0.0
165,6,AdaBoost (Real),2,0.35,0.2985630654603513,0.6167575033112543,89.79716110229492,0.0
166,6,Logistic Regression (Penalty = L2),2,0.35,0.3778605641298563,0.36918866219451113,1.316030740737915,0.0
167,6,Naive Bayes,2,0.35,0.369877594465141,0.4305056987500547,0.31108593940734863,0.4305056987500547
168,7,KNeighbors Classifier,0,0.35,0.7383227176220807,0.8731056290960454,14.812675714492798,0.0
169,7,SVC Classifier,0,0.35,0.6953290870488322,0.7178826128910483,25.071178436279297,0.0
170,7,Decision Tree,0,0.35,0.7351380042462845,0.8213065744588854,0.22389674186706543,0.0
171,7,RandomForest,0,0.35,0.5981953290870489,0.6909553927994988,0.9013307094573975,0.0
172,7,AdaBoost (Discrete),0,0.35,0.7170912951167728,0.8507228692087404,84.86185240745544,0.0
173,7,AdaBoost (Real),0,0.35,0.31475583864118895,0.36003689309827996,106.7349705696106,0.0
174,7,Logistic Regression (Penalty = L2),0,0.35,0.7361995753715499,0.873942562614331,1.8393819332122803,0.0
175,7,Naive Bayes,0,0.35,0.7096602972399151,0.7698961933706894,0.4516584873199463,0.7698961933706894
176,7,KNeighbors Classifier,1,0.35,0.835725677830941,0.5519044266067261,15.22792100906372,0.5519044266067261
177,7,SVC Classifier,1,0.35,0.7713981924508241,0.6192357015520555,25.90505862236023,0.0
178,7,Decision Tree,1,0.35,0.7618288144603934,0.6146301460076471,0.22828292846679688,0.0
179,7,RandomForest,1,0.35,0.7171717171717171,0.9362714184961617,0.760106086730957,0.0
180,7,AdaBoost (Discrete),1,0.35,0.8809144072301966,0.9325620089947243,82.39682483673096,0.0
181,7,AdaBoost (Real),1,0.35,0.7873471557682084,0.7661823442831777,111.1471529006958,0.0
182,7,Logistic Regression (Penalty = L2),1,0.35,0.7676767676767676,0.6251943134108254,2.215623378753662,0.0
183,7,Naive Bayes,1,0.35,0.896863370547581,0.9523978389766097,0.43263816833496094,0.9523978389766097
184,7,KNeighbors Classifier,2,0.35,0.4262905800957956,0.349747559519586,28.398082971572876,0.349747559519586
185,7,SVC Classifier,2,0.35,0.36562001064395955,0.3563869576720052,10.952977418899536,0.0
186,7,Decision Tree,2,0.35,0.3863757317722193,0.4227934385041027,0.14562487602233887,0.0
187,7,RandomForest,2,0.35,0.30175625332623734,0.1920633718646669,0.8029518127441406,0.0
188,7,AdaBoost (Discrete),2,0.35,0.4550292708887706,0.3821885179795102,81.32651877403259,0.3821885179795102
189,7,AdaBoost (Real),2,0.35,0.5002660989888238,0.36002806998159675,109.01521849632263,0.0
190,7,Logistic Regression (Penalty = L2),2,0.35,0.37360298030867484,0.3677257586636381,1.4556212425231934,0.0
191,7,Naive Bayes,2,0.35,0.3847791378392762,0.39332753590265496,0.3745238780975342,0.39332753590265496
192,8,KNeighbors Classifier,0,0.35,0.7372611464968153,0.8743653700510113,2.187957525253296,0.0
193,8,SVC Classifier,0,0.35,0.6953290870488322,0.7178826128910483,8.53957724571228,0.0
194,8,Decision Tree,0,0.35,0.7361995753715499,0.873942562614331,0.003387451171875,0.0
195,8,RandomForest,0,0.35,0.5621019108280255,0.6891504470964788,0.8277187347412109,0.0
196,8,AdaBoost (Discrete),0,0.35,0.6809978768577495,0.8507350399963358,40.940733671188354,0.0
197,8,AdaBoost (Real),0,0.35,0.7139065817409767,0.7343828849275283,66.80099391937256,0.0
198,8,Logistic Regression (Penalty = L2),0,0.35,0.6953290870488322,0.7178826128910483,0.8253874778747559,0.0
199,8,Naive Bayes,0,0.35,0.30148619957537154,0.7130482340039412,0.14449548721313477,0.0
200,8,KNeighbors Classifier,1,0.35,0.7963849016480595,0.9217332808888964,2.127035140991211,0.0
201,8,SVC Classifier,1,0.35,0.7086656034024456,0.9408094915518899,8.647510528564453,0.0
202,8,Decision Tree,1,0.35,0.7713981924508241,0.6192357015520555,0.13335061073303223,0.0
203,8,RandomForest,1,0.35,0.46570972886762363,0.36124458679499194,0.7724230289459229,0.0
204,8,AdaBoost (Discrete),1,0.35,0.7761828814460393,0.9503083423381676,40.77854013442993,0.0
205,8,AdaBoost (Real),1,0.35,0.7713981924508241,0.6192357015520555,68.29251742362976,0.0
206,8,Logistic Regression (Penalty = L2),1,0.35,0.7612971823498139,0.9836905212116516,0.8576233386993408,0.0
207,8,Naive Bayes,1,0.35,0.24614566719829878,0.5585159570432394,0.14560389518737793,0.0
208,8,KNeighbors Classifier,2,0.35,0.3842469398616285,0.3252396824634681,1.9131367206573486,0.0
209,8,SVC Classifier,2,0.35,0.36615220862160724,0.5418427308184528,4.947498798370361,0.0
210,8,Decision Tree,2,0.35,0.38956891963810536,0.5575646064263753,0.08012986183166504,0.0
211,8,RandomForest,2,0.35,0.2825971261309207,0.18422154731498122,0.5806350708007812,0.0
212,8,AdaBoost (Discrete),2,0.35,0.31931878658861096,0.3279575995512061,39.16129279136658,0.0
213,8,AdaBoost (Real),2,0.35,0.3853113358169239,0.49456822664737865,65.03120303153992,0.0
214,8,Logistic Regression (Penalty = L2),2,0.35,0.30867482703565724,0.28635519460172354,0.6926424503326416,0.0
215,8,Naive Bayes,2,0.35,0.21128259712613093,0.482982538545234,0.11985230445861816,0.0
