,feat_set_id,classifier,fold_id,feat_th,score,geo_score,exec_t,geo_score_woz
0,0,KNeighbors Classifier,0,0.6,0.4291417165668663,0.4811959720538876,0.11686134338378906,0.0
1,0,SVC Classifier,0,0.6,0.3093812375249501,1.0,0.390230655670166,0.0
2,0,Decision Tree,0,0.6,0.4151696606786427,0.45330584716813055,0.035784006118774414,0.0
3,0,RandomForest,0,0.6,0.43912175648702595,0.28472952937787704,0.25200486183166504,0.0
4,0,AdaBoost (Discrete),0,0.6,0.4111776447105788,0.4494489620462363,15.023066759109497,0.0
5,0,AdaBoost (Real),0,0.6,0.2155688622754491,0.24510707324600767,29.797016143798828,0.24510707324600767
6,0,Logistic Regression (Penalty = L2),0,0.6,0.4750499001996008,0.43875102831750623,0.21339893341064453,0.0
7,0,Naive Bayes,0,0.6,0.0718562874251497,0.7364756974677535,0.08834385871887207,0.0
8,0,KNeighbors Classifier,1,0.6,0.4678714859437751,0.4887906585569954,0.14564251899719238,0.0
9,0,SVC Classifier,1,0.6,0.3092369477911647,1.0,0.6154236793518066,0.0
10,0,Decision Tree,1,0.6,0.42168674698795183,0.4665455339426905,0.050971269607543945,0.0
11,0,RandomForest,1,0.6,0.4598393574297189,0.5180330603061801,0.34468531608581543,0.0
12,0,AdaBoost (Discrete),1,0.6,0.3855421686746988,0.43882928174294455,20.90278720855713,0.0
13,0,AdaBoost (Real),1,0.6,0.37349397590361444,0.4481618150188564,27.63440990447998,0.0
14,0,Logistic Regression (Penalty = L2),1,0.6,0.46586345381526106,0.3883645817730628,0.25430846214294434,0.0
15,0,Naive Bayes,1,0.6,0.1706827309236948,0.663085942556331,0.05016756057739258,0.0
16,0,KNeighbors Classifier,2,0.6,0.4121212121212121,0.45137820231072395,0.14482760429382324,0.0
17,0,SVC Classifier,2,0.6,0.3111111111111111,1.0,0.6113739013671875,0.0
18,0,Decision Tree,2,0.6,0.3717171717171717,0.3387354604878751,0.04397845268249512,0.3387354604878751
19,0,RandomForest,2,0.6,0.45252525252525255,0.4071757002002686,0.2995576858520508,0.0
20,0,AdaBoost (Discrete),2,0.6,0.36363636363636365,0.4016428837084956,21.768822193145752,0.0
21,0,AdaBoost (Real),2,0.6,0.2909090909090909,0.32584629691314193,30.891968965530396,0.0
22,0,Logistic Regression (Penalty = L2),2,0.6,0.4585858585858586,0.43289753508924705,0.28925466537475586,0.0
23,0,Naive Bayes,2,0.6,0.08080808080808081,0.6357148395449027,0.053594112396240234,0.0
24,1,KNeighbors Classifier,0,0.6,0.4930139720558882,0.4728901849697838,0.19924163818359375,0.0
25,1,SVC Classifier,0,0.6,0.3093812375249501,1.0,0.47935986518859863,0.0
26,1,Decision Tree,0,0.6,0.4291417165668663,0.33874250263218125,0.05954575538635254,0.33874250263218125
27,1,RandomForest,0,0.6,0.42714570858283435,0.6806988167181982,0.35195279121398926,0.0
28,1,AdaBoost (Discrete),0,0.6,0.3992015968063872,0.39686209361047947,27.156360387802124,0.0
29,1,AdaBoost (Real),0,0.6,0.4630738522954092,0.3539651257192577,39.28998112678528,0.3539651257192577
30,1,Logistic Regression (Penalty = L2),0,0.6,0.5129740518962076,0.5069972964138504,0.25775909423828125,0.0
31,1,Naive Bayes,0,0.6,0.08782435129740519,0.5351014735305113,0.13121795654296875,0.0
32,1,KNeighbors Classifier,1,0.6,0.4799196787148594,0.4053797757546552,0.2460765838623047,0.4053797757546552
33,1,SVC Classifier,1,0.6,0.3092369477911647,1.0,0.8416213989257812,0.0
34,1,Decision Tree,1,0.6,0.42570281124497994,0.41366928441537826,0.0600130558013916,0.0
35,1,RandomForest,1,0.6,0.4397590361445783,0.23936844133807533,0.5109596252441406,0.0
36,1,AdaBoost (Discrete),1,0.6,0.43172690763052207,0.42107338158075797,33.170881032943726,0.0
37,1,AdaBoost (Real),1,0.6,0.3815261044176707,0.30189781278095235,43.71610426902771,0.0
38,1,Logistic Regression (Penalty = L2),1,0.6,0.5140562248995983,0.4299903822638917,0.37850022315979004,0.0
39,1,Naive Bayes,1,0.6,0.19678714859437751,0.5315704570336527,0.07464885711669922,0.0
40,1,KNeighbors Classifier,2,0.6,0.4585858585858586,0.4671764969405951,0.21258306503295898,0.0
41,1,SVC Classifier,2,0.6,0.3111111111111111,1.0,1.0222947597503662,0.0
42,1,Decision Tree,2,0.6,0.4505050505050505,0.3542229411244421,0.07198619842529297,0.3542229411244421
43,1,RandomForest,2,0.6,0.44646464646464645,0.3320732410337717,0.44061899185180664,0.0
44,1,AdaBoost (Discrete),2,0.6,0.4202020202020202,0.4514725193002375,35.472501277923584,0.0
45,1,AdaBoost (Real),2,0.6,0.2202020202020202,0.2997216559004232,47.23872184753418,0.0
46,1,Logistic Regression (Penalty = L2),2,0.6,0.5171717171717172,0.4418583772747309,0.32568788528442383,0.0
47,1,Naive Bayes,2,0.6,0.08080808080808081,0.6376619519710673,0.05794978141784668,0.0
48,2,KNeighbors Classifier,0,0.6,0.3313373253493014,0.3040847941095876,0.14143657684326172,0.0
49,2,SVC Classifier,0,0.6,0.3093812375249501,1.0,0.9444758892059326,0.0
50,2,Decision Tree,0,0.6,0.31137724550898205,0.34226802697604175,0.07088041305541992,0.0
51,2,RandomForest,0,0.6,0.3852295409181637,0.6428605075354059,0.5279719829559326,0.0
52,2,AdaBoost (Discrete),0,0.6,0.3313373253493014,0.30238139474757286,33.510075092315674,0.0
53,2,AdaBoost (Real),0,0.6,0.34331337325349304,0.22776947174228157,51.869251012802124,0.22776947174228157
54,2,Logistic Regression (Penalty = L2),0,0.6,0.4091816367265469,0.27576393501324603,0.3822345733642578,0.0
55,2,Naive Bayes,0,0.6,0.09181636726546906,0.46844656663756157,0.08503580093383789,0.0
56,2,KNeighbors Classifier,1,0.6,0.3755020080321285,0.3385527149814774,0.33895134925842285,0.0
57,2,SVC Classifier,1,0.6,0.3092369477911647,1.0,0.968623161315918,0.0
58,2,Decision Tree,1,0.6,0.3152610441767068,0.27628436346532265,0.08781838417053223,0.0
59,2,RandomForest,1,0.6,0.46184738955823296,0.41225178716715627,0.5786192417144775,0.0
60,2,AdaBoost (Discrete),1,0.6,0.3453815261044177,0.3031651233761057,38.696428298950195,0.0
61,2,AdaBoost (Real),1,0.6,0.2891566265060241,0.18751232613442204,56.807987451553345,0.18751232613442204
62,2,Logistic Regression (Penalty = L2),1,0.6,0.4457831325301205,0.4395550283555263,0.3998751640319824,0.0
63,2,Naive Bayes,1,0.6,0.14056224899598393,0.22835023283601635,0.19999361038208008,0.0
64,2,KNeighbors Classifier,2,0.6,0.3595959595959596,0.29188709000460217,0.30094361305236816,0.0
65,2,SVC Classifier,2,0.6,0.3111111111111111,1.0,1.1182665824890137,0.0
66,2,Decision Tree,2,0.6,0.3373737373737374,0.3122448468382275,0.0999593734741211,0.0
67,2,RandomForest,2,0.6,0.4101010101010101,0.3796748531636259,0.79960036277771,0.0
68,2,AdaBoost (Discrete),2,0.6,0.28888888888888886,0.2605474264365393,44.11709690093994,0.0
69,2,AdaBoost (Real),2,0.6,0.2727272727272727,0.21957558351677478,64.78056168556213,0.0
70,2,Logistic Regression (Penalty = L2),2,0.6,0.43232323232323233,0.2830876521259102,0.5244379043579102,0.0
71,2,Naive Bayes,2,0.6,0.10505050505050505,0.3981701335088907,0.1045536994934082,0.0
72,3,KNeighbors Classifier,0,0.6,0.42115768463073855,0.2791637111803087,0.4196503162384033,0.0
73,3,SVC Classifier,0,0.6,0.3093812375249501,1.0,1.185741901397705,0.0
74,3,Decision Tree,0,0.6,0.32335329341317365,0.2984993477647934,0.002536773681640625,0.0
75,3,RandomForest,0,0.6,0.437125748502994,0.5689972757299393,0.624272346496582,0.0
76,3,AdaBoost (Discrete),0,0.6,0.36327345309381237,0.25221412712463676,48.53081655502319,0.25221412712463676
77,3,AdaBoost (Real),0,0.6,0.3333333333333333,0.23981651613889932,66.47744178771973,0.0
78,3,Logistic Regression (Penalty = L2),0,0.6,0.46706586826347307,0.49245983512315933,0.5175285339355469,0.0
79,3,Naive Bayes,0,0.6,0.10578842315369262,0.3803374807517129,0.2103273868560791,0.0
80,3,KNeighbors Classifier,1,0.6,0.42570281124497994,0.323016611087744,0.4310457706451416,0.0
81,3,SVC Classifier,1,0.6,0.3092369477911647,1.0,1.2844130992889404,0.0
82,3,Decision Tree,1,0.6,0.40160642570281124,0.29891124932784086,0.10397648811340332,0.29891124932784086
83,3,RandomForest,1,0.6,0.4718875502008032,0.6767238500293462,0.7262239456176758,0.0
84,3,AdaBoost (Discrete),1,0.6,0.38755020080321284,0.3274220198619316,49.412567377090454,0.3274220198619316
85,3,AdaBoost (Real),1,0.6,0.24899598393574296,0.24837149179429888,67.25781655311584,0.24837149179429888
86,3,Logistic Regression (Penalty = L2),1,0.6,0.4678714859437751,0.5051040620973367,0.42987585067749023,0.0
87,3,Naive Bayes,1,0.6,0.1606425702811245,0.22378521227646198,0.1097259521484375,0.0
88,3,KNeighbors Classifier,2,0.6,0.4,0.2862357443133188,0.3317091464996338,0.0
89,3,SVC Classifier,2,0.6,0.3111111111111111,1.0,1.2230868339538574,0.0
90,3,Decision Tree,2,0.6,0.32727272727272727,0.2809540513777271,0.10794758796691895,0.0
91,3,RandomForest,2,0.6,0.4303030303030303,0.32528591030408555,0.6633594036102295,0.0
92,3,AdaBoost (Discrete),2,0.6,0.3656565656565657,0.330094813565867,49.16971206665039,0.0
93,3,AdaBoost (Real),2,0.6,0.33131313131313134,0.2499610357413572,71.13402915000916,0.2499610357413572
94,3,Logistic Regression (Penalty = L2),2,0.6,0.4707070707070707,0.444076494894478,0.5167105197906494,0.0
95,3,Naive Bayes,2,0.6,0.10101010101010101,0.3851186220698594,0.12746620178222656,0.0
96,4,KNeighbors Classifier,0,0.6,0.4251497005988024,0.4065784065726626,0.5252985954284668,0.0
97,4,SVC Classifier,0,0.6,0.3093812375249501,1.0,1.2826497554779053,0.0
98,4,Decision Tree,0,0.6,0.41317365269461076,0.3804562149102658,0.1116480827331543,0.0
99,4,RandomForest,0,0.6,0.4550898203592814,0.6158318632434197,0.7687685489654541,0.0
100,4,AdaBoost (Discrete),0,0.6,0.3273453093812375,0.3432263640288627,46.56600284576416,0.0
101,4,AdaBoost (Real),0,0.6,0.43313373253493015,0.2907075903575915,65.22514152526855,0.0
102,4,Logistic Regression (Penalty = L2),0,0.6,0.45109780439121755,0.5459135166675028,0.48459959030151367,0.0
103,4,Naive Bayes,0,0.6,0.07584830339321358,0.7708763375575994,0.21418356895446777,0.0
104,4,KNeighbors Classifier,1,0.6,0.4036144578313253,0.34540708820854255,0.24145293235778809,0.0
105,4,SVC Classifier,1,0.6,0.3092369477911647,1.0,1.0880839824676514,0.0
106,4,Decision Tree,1,0.6,0.3714859437751004,0.353716152126114,0.10656380653381348,0.353716152126114
107,4,RandomForest,1,0.6,0.46184738955823296,0.6546080293060498,0.7585506439208984,0.0
108,4,AdaBoost (Discrete),1,0.6,0.3293172690763052,0.32103888749048504,46.39448285102844,0.0
109,4,AdaBoost (Real),1,0.6,0.40562248995983935,0.34807113928848926,74.88891530036926,0.0
110,4,Logistic Regression (Penalty = L2),1,0.6,0.4578313253012048,0.3310693551005833,0.47132086753845215,0.0
111,4,Naive Bayes,1,0.6,0.1686746987951807,0.6609010760833647,0.11357569694519043,0.0
112,4,KNeighbors Classifier,2,0.6,0.45252525252525255,0.4216970502226025,0.33380889892578125,0.0
113,4,SVC Classifier,2,0.6,0.3111111111111111,1.0,1.1767845153808594,0.0
114,4,Decision Tree,2,0.6,0.402020202020202,0.3559952082116899,0.002368927001953125,0.0
115,4,RandomForest,2,0.6,0.4707070707070707,0.6709504858400984,0.8898162841796875,0.0
116,4,AdaBoost (Discrete),2,0.6,0.33131313131313134,0.31468365110045066,50.03468632698059,0.0
117,4,AdaBoost (Real),2,0.6,0.25656565656565655,0.2817038030307094,70.64378213882446,0.0
118,4,Logistic Regression (Penalty = L2),2,0.6,0.4666666666666667,0.3988099075568885,0.43315958976745605,0.0
119,4,Naive Bayes,2,0.6,0.07474747474747474,0.5763906560686533,0.12385129928588867,0.0
120,5,KNeighbors Classifier,0,0.6,0.31736526946107785,0.327845125942889,0.21718287467956543,0.0
121,5,SVC Classifier,0,0.6,0.3093812375249501,1.0,1.197554349899292,0.0
122,5,Decision Tree,0,0.6,0.3253493013972056,0.28231863768892984,0.11199593544006348,0.28231863768892984
123,5,RandomForest,0,0.6,0.37924151696606784,0.43791323726815484,0.6885921955108643,0.0
124,5,AdaBoost (Discrete),0,0.6,0.26746506986027946,0.27900127411439535,63.263442039489746,0.0
125,5,AdaBoost (Real),0,0.6,0.3912175648702595,0.3163966950741339,122.9448914527893,0.0
126,5,Logistic Regression (Penalty = L2),0,0.6,0.34331337325349304,0.37512063826575737,0.8218283653259277,0.0
127,5,Naive Bayes,0,0.6,0.05788423153692615,0.49775775714949005,0.19875836372375488,0.0
128,5,KNeighbors Classifier,1,0.6,0.3353413654618474,0.350069626640913,0.581646203994751,0.0
129,5,SVC Classifier,1,0.6,0.3092369477911647,1.0,2.360271692276001,0.0
130,5,Decision Tree,1,0.6,0.30522088353413657,0.3225020213847465,0.21950387954711914,0.0
131,5,RandomForest,1,0.6,0.39357429718875503,0.4120748705602752,1.7691371440887451,0.0
132,5,AdaBoost (Discrete),1,0.6,0.28313253012048195,0.29084974485112025,89.91859912872314,0.0
133,5,AdaBoost (Real),1,0.6,0.2991967871485944,0.21867103730855963,121.17275261878967,0.0
134,5,Logistic Regression (Penalty = L2),1,0.6,0.3755020080321285,0.216031753865228,0.9501402378082275,0.0
135,5,Naive Bayes,1,0.6,0.1465863453815261,0.4987592899129482,0.45457911491394043,0.0
136,5,KNeighbors Classifier,2,0.6,0.3212121212121212,0.3095507055198985,0.4491713047027588,0.0
137,5,SVC Classifier,2,0.6,0.3111111111111111,1.0,1.9365358352661133,0.0
138,5,Decision Tree,2,0.6,0.30505050505050507,0.2533283047989158,0.1878662109375,0.2533283047989158
139,5,RandomForest,2,0.6,0.36363636363636365,0.34447548483442947,0.9953255653381348,0.0
140,5,AdaBoost (Discrete),2,0.6,0.2828282828282828,0.31988569384883553,90.93419361114502,0.0
141,5,AdaBoost (Real),2,0.6,0.14545454545454545,0.1816978972795412,122.4318494796753,0.0
142,5,Logistic Regression (Penalty = L2),2,0.6,0.37777777777777777,0.29135505200267614,0.8355226516723633,0.0
143,5,Naive Bayes,2,0.6,0.0707070707070707,0.6760089784203515,0.2489166259765625,0.0
144,6,KNeighbors Classifier,0,0.6,0.3253493013972056,0.22891499741597696,0.764660120010376,0.0
145,6,SVC Classifier,0,0.6,0.3093812375249501,1.0,2.1808717250823975,0.0
146,6,Decision Tree,0,0.6,0.3313373253493014,0.22780701870547684,0.0017435550689697266,0.0
147,6,RandomForest,0,0.6,0.3273453093812375,0.8919770128851846,1.2873480319976807,0.0
148,6,AdaBoost (Discrete),0,0.6,0.3073852295409182,0.25858085471567743,86.00906586647034,0.0
149,6,AdaBoost (Real),0,0.6,0.2834331337325349,0.2114782243137804,107.26084208488464,0.0
150,6,Logistic Regression (Penalty = L2),0,0.6,0.35528942115768464,0.6064744727468859,0.4268200397491455,0.0
151,6,Naive Bayes,0,0.6,0.05788423153692615,0.49775775714949005,0.11349272727966309,0.0
152,6,KNeighbors Classifier,1,0.6,0.3232931726907631,0.30127175053790667,0.43388795852661133,0.0
153,6,SVC Classifier,1,0.6,0.3092369477911647,1.0,0.9809379577636719,0.0
154,6,Decision Tree,1,0.6,0.3473895582329317,0.19759751879626059,0.09798431396484375,0.0
155,6,RandomForest,1,0.6,0.321285140562249,0.23282834490740756,0.8602132797241211,0.0
156,6,AdaBoost (Discrete),1,0.6,0.26305220883534136,0.2877187027481065,44.46730017662048,0.0
157,6,AdaBoost (Real),1,0.6,0.1285140562248996,0.18320858954617725,63.55580949783325,0.0
158,6,Logistic Regression (Penalty = L2),1,0.6,0.357429718875502,0.5642905240500535,0.330186128616333,0.0
159,6,Naive Bayes,1,0.6,0.1465863453815261,0.4987592899129482,0.1159355640411377,0.0
160,6,KNeighbors Classifier,2,0.6,0.28484848484848485,0.24603297244745,0.3192145824432373,0.0
161,6,SVC Classifier,2,0.6,0.3111111111111111,1.0,1.0813608169555664,0.0
162,6,Decision Tree,2,0.6,0.32525252525252524,0.24860584309511527,0.0016582012176513672,0.0
163,6,RandomForest,2,0.6,0.3292929292929293,0.41412387656655203,0.6499688625335693,0.0
164,6,AdaBoost (Discrete),2,0.6,0.27070707070707073,0.29924704832018495,45.246150732040405,0.0
165,6,AdaBoost (Real),2,0.6,0.29494949494949496,0.2738534160364876,65.28974866867065,0.0
166,6,Logistic Regression (Penalty = L2),2,0.6,0.35555555555555557,0.29108952138580996,0.3951592445373535,0.0
167,6,Naive Bayes,2,0.6,0.06262626262626263,0.6081597120648925,0.10943937301635742,0.0
168,7,KNeighbors Classifier,0,0.6,0.3253493013972056,0.22891499741597696,0.22065186500549316,0.0
169,7,SVC Classifier,0,0.6,0.3093812375249501,1.0,1.1806602478027344,0.0
170,7,Decision Tree,0,0.6,0.3313373253493014,0.22780701870547684,0.1108083724975586,0.0
171,7,RandomForest,0,0.6,0.3273453093812375,0.8919770128851846,0.8457427024841309,0.0
172,7,AdaBoost (Discrete),0,0.6,0.3073852295409182,0.25858085471567743,45.197516202926636,0.0
173,7,AdaBoost (Real),0,0.6,0.2215568862275449,0.2828703300543793,64.48503303527832,0.0
174,7,Logistic Regression (Penalty = L2),0,0.6,0.35528942115768464,0.6064744727468859,0.445725679397583,0.0
175,7,Naive Bayes,0,0.6,0.05788423153692615,0.49775775714949005,0.22701168060302734,0.0
176,7,KNeighbors Classifier,1,0.6,0.3232931726907631,0.30127175053790667,0.3242318630218506,0.0
177,7,SVC Classifier,1,0.6,0.3092369477911647,1.0,1.1933107376098633,0.0
178,7,Decision Tree,1,0.6,0.3514056224899598,0.21383724784953256,0.10678529739379883,0.0
179,7,RandomForest,1,0.6,0.321285140562249,0.23282834490740756,0.8568456172943115,0.0
180,7,AdaBoost (Discrete),1,0.6,0.26305220883534136,0.2877187027481065,45.270777463912964,0.0
181,7,AdaBoost (Real),1,0.6,0.18072289156626506,0.1991633856086116,67.29895305633545,0.0
182,7,Logistic Regression (Penalty = L2),1,0.6,0.357429718875502,0.5642905240500535,0.4824380874633789,0.0
183,7,Naive Bayes,1,0.6,0.1465863453815261,0.4987592899129482,0.22253179550170898,0.0
184,7,KNeighbors Classifier,2,0.6,0.28484848484848485,0.24603297244745,0.33504343032836914,0.0
185,7,SVC Classifier,2,0.6,0.3111111111111111,1.0,1.1563777923583984,0.0
186,7,Decision Tree,2,0.6,0.32525252525252524,0.24860584309511527,0.11477041244506836,0.0
187,7,RandomForest,2,0.6,0.3292929292929293,0.41412387656655203,0.7803468704223633,0.0
188,7,AdaBoost (Discrete),2,0.6,0.27070707070707073,0.29924704832018495,47.79451251029968,0.0
189,7,AdaBoost (Real),2,0.6,0.30303030303030304,0.27939259415627754,68.27315068244934,0.0
190,7,Logistic Regression (Penalty = L2),2,0.6,0.35555555555555557,0.29108952138580996,0.4372432231903076,0.0
191,7,Naive Bayes,2,0.6,0.06262626262626263,0.6081597120648925,0.2193138599395752,0.0
192,8,KNeighbors Classifier,0,0.6,0.3652694610778443,0.28461446125057377,0.3068051338195801,0.0
193,8,SVC Classifier,0,0.6,0.3093812375249501,1.0,1.2302420139312744,0.0
194,8,Decision Tree,0,0.6,0.34530938123752497,0.30380580030392046,0.11228775978088379,0.0
195,8,RandomForest,0,0.6,0.43912175648702595,0.5512199052864096,0.7713761329650879,0.0
196,8,AdaBoost (Discrete),0,0.6,0.3273453093812375,0.25468787117535513,49.50694131851196,0.25468787117535513
197,8,AdaBoost (Real),0,0.6,0.19760479041916168,0.2277227347305289,67.58230924606323,0.0
198,8,Logistic Regression (Penalty = L2),0,0.6,0.42115768463073855,0.47593358641431105,0.45281481742858887,0.0
199,8,Naive Bayes,0,0.6,0.0658682634730539,0.35184005424639375,0.10875916481018066,0.0
200,8,KNeighbors Classifier,1,0.6,0.3253012048192771,0.2951252026966833,0.43464040756225586,0.0
201,8,SVC Classifier,1,0.6,0.3092369477911647,1.0,1.1880505084991455,0.0
202,8,Decision Tree,1,0.6,0.3293172690763052,0.271237009253556,0.1079854965209961,0.0
203,8,RandomForest,1,0.6,0.41767068273092367,0.4056671311415438,0.7583582401275635,0.0
204,8,AdaBoost (Discrete),1,0.6,0.3253012048192771,0.3126714504231237,47.585708141326904,0.0
205,8,AdaBoost (Real),1,0.6,0.28714859437751006,0.2557291122963918,61.678229570388794,0.0
206,8,Logistic Regression (Penalty = L2),1,0.6,0.42168674698795183,0.3703477884388677,0.4212157726287842,0.0
207,8,Naive Bayes,1,0.6,0.1606425702811245,0.3507580093804558,0.19435906410217285,0.0
208,8,KNeighbors Classifier,2,0.6,0.3616161616161616,0.28182418404301185,0.39628005027770996,0.0
209,8,SVC Classifier,2,0.6,0.3111111111111111,1.0,1.2264611721038818,0.0
210,8,Decision Tree,2,0.6,0.30505050505050507,0.23347057157166234,0.09968400001525879,0.0
211,8,RandomForest,2,0.6,0.3898989898989899,0.4491789846244763,0.7039825916290283,0.0
212,8,AdaBoost (Discrete),2,0.6,0.33535353535353535,0.31495589062620344,43.70660901069641,0.0
213,8,AdaBoost (Real),2,0.6,0.2222222222222222,0.20164126026932333,63.06136727333069,0.0
214,8,Logistic Regression (Penalty = L2),2,0.6,0.4262626262626263,0.36383424845222906,0.312652587890625,0.0
215,8,Naive Bayes,2,0.6,0.07676767676767676,0.6078093568605883,0.20749592781066895,0.0
216,9,KNeighbors Classifier,0,0.6,0.3852295409181637,0.29094607181294346,0.3133432865142822,0.0
217,9,SVC Classifier,0,0.6,0.3093812375249501,1.0,1.284463882446289,0.0
218,9,Decision Tree,0,0.6,0.3413173652694611,0.3027277295972095,0.0988764762878418,0.0
219,9,RandomForest,0,0.6,0.3812375249500998,0.48879230701636367,0.6169891357421875,0.0
220,9,AdaBoost (Discrete),0,0.6,0.3193612774451098,0.16026503518256638,45.34174680709839,0.16026503518256638
221,9,AdaBoost (Real),0,0.6,0.3473053892215569,0.24499688745201684,60.91007900238037,0.0
222,9,Logistic Regression (Penalty = L2),0,0.6,0.3972055888223553,0.610393605345566,0.26674675941467285,0.0
223,9,Naive Bayes,0,0.6,0.09381237524950099,0.4861963890919669,0.08886170387268066,0.0
224,9,KNeighbors Classifier,1,0.6,0.3634538152610442,0.3018818890603774,0.35202574729919434,0.0
225,9,SVC Classifier,1,0.6,0.3092369477911647,1.0,0.8905332088470459,0.0
226,9,Decision Tree,1,0.6,0.3473895582329317,0.2599361258941265,0.09104228019714355,0.0
227,9,RandomForest,1,0.6,0.44377510040160645,0.3538821714576192,0.5221097469329834,0.0
228,9,AdaBoost (Discrete),1,0.6,0.3815261044176707,0.23414020207611877,36.531490325927734,0.23414020207611877
229,9,AdaBoost (Real),1,0.6,0.3333333333333333,0.32438866743667266,53.789358615875244,0.0
230,9,Logistic Regression (Penalty = L2),1,0.6,0.41967871485943775,0.37276417305913095,0.3704075813293457,0.0
231,9,Naive Bayes,1,0.6,0.13855421686746988,0.2620404693036111,0.11940193176269531,0.0
232,9,KNeighbors Classifier,2,0.6,0.3292929292929293,0.2429363950803514,0.28641748428344727,0.0
233,9,SVC Classifier,2,0.6,0.3111111111111111,1.0,1.0593159198760986,0.0
234,9,Decision Tree,2,0.6,0.32323232323232326,0.26606183066225636,0.0020737648010253906,0.0
235,9,RandomForest,2,0.6,0.41414141414141414,0.7511762756784494,0.6680662631988525,0.0
236,9,AdaBoost (Discrete),2,0.6,0.30707070707070705,0.25524674913296064,36.98713803291321,0.0
237,9,AdaBoost (Real),2,0.6,0.2808080808080808,0.3660204864238984,52.20549440383911,0.0
238,9,Logistic Regression (Penalty = L2),2,0.6,0.4161616161616162,0.2513134834915701,0.3744475841522217,0.0
239,9,Naive Bayes,2,0.6,0.09292929292929293,0.30620904738480903,0.10509610176086426,0.0
240,10,KNeighbors Classifier,0,0.6,0.5209580838323353,0.5414107704758029,0.2744934558868408,0.0
241,10,SVC Classifier,0,0.6,0.3093812375249501,1.0,1.1704561710357666,0.0
242,10,Decision Tree,0,0.6,0.48902195608782434,0.45745290733748295,0.09471535682678223,0.0
243,10,RandomForest,0,0.6,0.45109780439121755,0.2768168689779958,0.6773154735565186,0.0
244,10,AdaBoost (Discrete),0,0.6,0.49500998003992014,0.5007797604527435,43.53862118721008,0.0
245,10,AdaBoost (Real),0,0.6,0.2714570858283433,0.27945909576472794,56.26632285118103,0.27945909576472794
246,10,Logistic Regression (Penalty = L2),0,0.6,0.5768463073852296,0.5246904905780504,0.3733537197113037,0.0
247,10,Naive Bayes,0,0.6,0.12375249500998003,0.2945802783794665,0.10855340957641602,0.0
248,10,KNeighbors Classifier,1,0.6,0.5461847389558233,0.5351543757773826,0.34725356101989746,0.0
249,10,SVC Classifier,1,0.6,0.3092369477911647,1.0,1.0152931213378906,0.0
250,10,Decision Tree,1,0.6,0.4497991967871486,0.3783359989502806,0.08812999725341797,0.0
251,10,RandomForest,1,0.6,0.5622489959839357,0.5895941436874921,0.6531851291656494,0.0
252,10,AdaBoost (Discrete),1,0.6,0.4939759036144578,0.5180354666040494,39.763606786727905,0.0
253,10,AdaBoost (Real),1,0.6,0.3433734939759036,0.3445612064985491,55.29973244667053,0.3445612064985491
254,10,Logistic Regression (Penalty = L2),1,0.6,0.5903614457831325,0.5848712434206008,0.27466487884521484,0.0
255,10,Naive Bayes,1,0.6,0.21285140562248997,0.3860491600499613,0.17965912818908691,0.0
256,10,KNeighbors Classifier,2,0.6,0.5494949494949495,0.5135003813236351,0.4436182975769043,0.0
257,10,SVC Classifier,2,0.6,0.3111111111111111,1.0,1.1133592128753662,0.0
258,10,Decision Tree,2,0.6,0.4686868686868687,0.4020766954341825,0.09127402305603027,0.0
259,10,RandomForest,2,0.6,0.4686868686868687,0.3817159181209077,0.599740743637085,0.0
260,10,AdaBoost (Discrete),2,0.6,0.46464646464646464,0.42751461723393436,42.951772689819336,0.0
261,10,AdaBoost (Real),2,0.6,0.2808080808080808,0.3156018782510775,65.01536440849304,0.0
262,10,Logistic Regression (Penalty = L2),2,0.6,0.5757575757575758,0.5091462651866212,0.45585155487060547,0.0
263,10,Naive Bayes,2,0.6,0.12525252525252525,0.5057380642056387,0.11008977890014648,0.0
264,11,KNeighbors Classifier,0,0.6,0.5209580838323353,0.5414107704758029,0.3305697441101074,0.0
265,11,SVC Classifier,0,0.6,0.3093812375249501,1.0,1.2461068630218506,0.0
266,11,Decision Tree,0,0.6,0.5089820359281437,0.48950490141989816,0.11541032791137695,0.0
267,11,RandomForest,0,0.6,0.45109780439121755,0.2768168689779958,0.7559268474578857,0.0
268,11,AdaBoost (Discrete),0,0.6,0.49500998003992014,0.5007797604527435,47.05314302444458,0.0
269,11,AdaBoost (Real),0,0.6,0.3532934131736527,0.290969103484263,65.5739676952362,0.290969103484263
270,11,Logistic Regression (Penalty = L2),0,0.6,0.5768463073852296,0.5246904905780504,0.5659558773040771,0.0
271,11,Naive Bayes,0,0.6,0.12375249500998003,0.2945802783794665,0.11756610870361328,0.0
272,11,KNeighbors Classifier,1,0.6,0.5461847389558233,0.5351543757773826,0.5404782295227051,0.0
273,11,SVC Classifier,1,0.6,0.3092369477911647,1.0,1.3598265647888184,0.0
274,11,Decision Tree,1,0.6,0.4879518072289157,0.4864013973817834,0.10723352432250977,0.0
275,11,RandomForest,1,0.6,0.5622489959839357,0.5895941436874921,0.7583856582641602,0.0
276,11,AdaBoost (Discrete),1,0.6,0.4939759036144578,0.5180354666040494,46.45461654663086,0.0
277,11,AdaBoost (Real),1,0.6,0.41164658634538154,0.363854651348592,64.28684139251709,0.0
278,11,Logistic Regression (Penalty = L2),1,0.6,0.5903614457831325,0.5848712434206008,0.42531275749206543,0.0
279,11,Naive Bayes,1,0.6,0.21285140562248997,0.3860491600499613,0.2074568271636963,0.0
280,11,KNeighbors Classifier,2,0.6,0.5494949494949495,0.5135003813236351,0.42110562324523926,0.0
281,11,SVC Classifier,2,0.6,0.3111111111111111,1.0,1.1563780307769775,0.0
282,11,Decision Tree,2,0.6,0.4868686868686869,0.4706415990484708,0.10771727561950684,0.0
283,11,RandomForest,2,0.6,0.4686868686868687,0.3817159181209077,0.7301619052886963,0.0
284,11,AdaBoost (Discrete),2,0.6,0.46464646464646464,0.42751461723393436,44.080328702926636,0.0
285,11,AdaBoost (Real),2,0.6,0.4222222222222222,0.4532012887188125,61.88529992103577,0.0
286,11,Logistic Regression (Penalty = L2),2,0.6,0.5757575757575758,0.5091462651866212,0.5305283069610596,0.0
287,11,Naive Bayes,2,0.6,0.12525252525252525,0.5057380642056387,0.09347105026245117,0.0
288,12,KNeighbors Classifier,0,0.6,0.3253493013972056,0.22891499741597696,0.18532705307006836,0.0
289,12,SVC Classifier,0,0.6,0.3093812375249501,1.0,0.9273180961608887,0.0
290,12,Decision Tree,0,0.6,0.3333333333333333,0.22812969584935847,0.09415602684020996,0.0
291,12,RandomForest,0,0.6,0.3273453093812375,0.8919770128851846,0.6357748508453369,0.0
292,12,AdaBoost (Discrete),0,0.6,0.3073852295409182,0.25858085471567743,36.19896221160889,0.0
293,12,AdaBoost (Real),0,0.6,0.26746506986027946,0.2809863916971101,50.338255643844604,0.0
294,12,Logistic Regression (Penalty = L2),0,0.6,0.35528942115768464,0.6064744727468859,0.26219677925109863,0.0
295,12,Naive Bayes,0,0.6,0.05788423153692615,0.49775775714949005,0.18233036994934082,0.0
296,12,KNeighbors Classifier,1,0.6,0.3232931726907631,0.30127175053790667,0.2651393413543701,0.0
297,12,SVC Classifier,1,0.6,0.3092369477911647,1.0,0.8930339813232422,0.0
298,12,Decision Tree,1,0.6,0.3493975903614458,0.21341712455685677,0.0025420188903808594,0.0
299,12,RandomForest,1,0.6,0.321285140562249,0.23282834490740756,0.5927114486694336,0.0
300,12,AdaBoost (Discrete),1,0.6,0.26305220883534136,0.2877187027481065,33.37881779670715,0.0
301,12,AdaBoost (Real),1,0.6,0.17670682730923695,0.21977007132142512,49.5215380191803,0.0
302,12,Logistic Regression (Penalty = L2),1,0.6,0.357429718875502,0.5642905240500535,0.267911434173584,0.0
303,12,Naive Bayes,1,0.6,0.1465863453815261,0.4987592899129482,0.08856678009033203,0.0
304,12,KNeighbors Classifier,2,0.6,0.28484848484848485,0.24603297244745,0.0871884822845459,0.0
305,12,SVC Classifier,2,0.6,0.3111111111111111,1.0,0.7984440326690674,0.0
306,12,Decision Tree,2,0.6,0.32525252525252524,0.24860584309511527,0.001622915267944336,0.0
307,12,RandomForest,2,0.6,0.3292929292929293,0.41412387656655203,0.6284434795379639,0.0
308,12,AdaBoost (Discrete),2,0.6,0.27070707070707073,0.29924704832018495,34.74565243721008,0.0
309,12,AdaBoost (Real),2,0.6,0.29292929292929293,0.2690781957366548,48.52384281158447,0.0
310,12,Logistic Regression (Penalty = L2),2,0.6,0.35555555555555557,0.29108952138580996,0.2515087127685547,0.0
311,12,Naive Bayes,2,0.6,0.06262626262626263,0.6081597120648925,0.1736617088317871,0.0
