,feat_set_id,classifier,fold_id,feat_th,score,geo_score,exec_t,geo_score_woz
0,0,KNeighbors Classifier,0,0.6,0.9761194029850746,0.9759086025540082,13.358438730239868,0.9759086025540082
1,0,SVC Classifier,0,0.6,0.9686567164179104,0.9683918267830254,5.229172706604004,0.9683918267830254
2,0,Decision Tree,0,0.6,0.8477611940298507,0.8440662328885787,0.17676830291748047,0.8440662328885787
3,0,RandomForest,0,0.6,0.6850746268656717,0.7480957074353871,0.8376190662384033,0.0
4,0,AdaBoost (Discrete),0,0.6,0.9373134328358209,0.9365262536787377,134.88487195968628,0.9365262536787377
5,0,AdaBoost (Real),0,0.6,0.8597014925373134,0.8550947468927647,177.47488260269165,0.8550947468927647
6,0,Logistic Regression (Penalty = L2),0,0.6,0.9447761194029851,0.9444708956204728,6.005533695220947,0.9444708956204728
7,0,Naive Bayes,0,0.6,0.9149253731343283,0.914162205801622,0.5574057102203369,0.914162205801622
8,0,KNeighbors Classifier,1,0.6,0.9641791044776119,0.9639879465787746,13.686536073684692,0.9639879465787746
9,0,SVC Classifier,1,0.6,0.9552238805970149,0.9551298438481359,5.272160768508911,0.9551298438481359
10,0,Decision Tree,1,0.6,0.8149253731343283,0.8121676634014251,0.19288372993469238,0.8121676634014251
11,0,RandomForest,1,0.6,0.655223880597015,0.6880034665579637,0.9660863876342773,0.0
12,0,AdaBoost (Discrete),1,0.6,0.9313432835820895,0.9308498978723185,136.7507026195526,0.9308498978723185
13,0,AdaBoost (Real),1,0.6,0.9164179104477612,0.9160230793538092,170.57576823234558,0.9160230793538092
14,0,Logistic Regression (Penalty = L2),1,0.6,0.926865671641791,0.926073977041881,5.25583553314209,0.926073977041881
15,0,Naive Bayes,1,0.6,0.8925373134328358,0.8910217829534464,0.4464836120605469,0.8910217829534464
16,0,KNeighbors Classifier,2,0.6,0.9696969696969697,0.969357750048221,11.6703519821167,0.969357750048221
17,0,SVC Classifier,2,0.6,0.9651515151515152,0.964813992114615,5.125671863555908,0.964813992114615
18,0,Decision Tree,2,0.6,0.8424242424242424,0.8387989551067768,0.1815030574798584,0.8387989551067768
19,0,RandomForest,2,0.6,0.6636363636363637,0.7140973778841282,0.8095662593841553,0.0
20,0,AdaBoost (Discrete),2,0.6,0.9454545454545454,0.9450894630931457,125.18702936172485,0.9450894630931457
21,0,AdaBoost (Real),2,0.6,0.8939393939393939,0.8919336173864577,139.82919931411743,0.8919336173864577
22,0,Logistic Regression (Penalty = L2),2,0.6,0.95,0.9494159853652401,5.934401273727417,0.9494159853652401
23,0,Naive Bayes,2,0.6,0.9075757575757576,0.9071048935155068,0.5707073211669922,0.9071048935155068
24,1,KNeighbors Classifier,0,0.6,0.9761194029850746,0.975885501664989,12.724409818649292,0.975885501664989
25,1,SVC Classifier,0,0.6,0.9671641791044776,0.9669144653260319,5.540726661682129,0.9669144653260319
26,1,Decision Tree,0,0.6,0.8253731343283582,0.8235552751430546,0.1759963035583496,0.8235552751430546
27,1,RandomForest,0,0.6,0.691044776119403,0.7571444818463854,0.7858154773712158,0.0
28,1,AdaBoost (Discrete),0,0.6,0.9343283582089552,0.9335004980445473,127.08173155784607,0.9335004980445473
29,1,AdaBoost (Real),0,0.6,0.8850746268656716,0.8836706406525194,131.28428888320923,0.8836706406525194
30,1,Logistic Regression (Penalty = L2),0,0.6,0.9507462686567164,0.9502215575753643,4.936709880828857,0.9502215575753643
31,1,Naive Bayes,0,0.6,0.9298507462686567,0.929269411600904,0.48407745361328125,0.929269411600904
32,1,KNeighbors Classifier,1,0.6,0.9716417910447761,0.9714698145623348,12.103262424468994,0.9714698145623348
33,1,SVC Classifier,1,0.6,0.9641791044776119,0.9640364628499191,4.704535961151123,0.9640364628499191
34,1,Decision Tree,1,0.6,0.7985074626865671,0.7906494177420176,0.17096948623657227,0.7906494177420176
35,1,RandomForest,1,0.6,0.7134328358208956,0.5599732082026113,0.7544159889221191,0.5599732082026113
36,1,AdaBoost (Discrete),1,0.6,0.9328358208955224,0.9318114726177625,117.50808548927307,0.9318114726177625
37,1,AdaBoost (Real),1,0.6,0.9238805970149254,0.9228446839302028,128.44752049446106,0.9228446839302028
38,1,Logistic Regression (Penalty = L2),1,0.6,0.9462686567164179,0.9458525379451218,4.8311192989349365,0.9458525379451218
39,1,Naive Bayes,1,0.6,0.9194029850746268,0.9189893595889376,0.5261757373809814,0.9189893595889376
40,1,KNeighbors Classifier,2,0.6,0.9772727272727273,0.9771963704084604,11.112601280212402,0.9771963704084604
41,1,SVC Classifier,2,0.6,0.9621212121212122,0.9619224133799577,4.694861650466919,0.9619224133799577
42,1,Decision Tree,2,0.6,0.8363636363636363,0.8340274892665253,0.1721055507659912,0.8340274892665253
43,1,RandomForest,2,0.6,0.7090909090909091,0.5909902509570746,0.755812406539917,0.5909902509570746
44,1,AdaBoost (Discrete),2,0.6,0.9393939393939394,0.9389196582243814,120.95496892929077,0.9389196582243814
45,1,AdaBoost (Real),2,0.6,0.9045454545454545,0.9021016083619839,134.0381679534912,0.9021016083619839
46,1,Logistic Regression (Penalty = L2),2,0.6,0.9454545454545454,0.9450111164631423,5.214254379272461,0.9450111164631423
47,1,Naive Bayes,2,0.6,0.9106060606060606,0.9101906673142705,0.44818639755249023,0.9101906673142705
48,2,KNeighbors Classifier,0,0.6,0.9611940298507463,0.9601889206649816,11.785204887390137,0.9601889206649816
49,2,SVC Classifier,0,0.6,0.9656716417910448,0.9652727451716085,5.148256301879883,0.9652727451716085
50,2,Decision Tree,0,0.6,0.8014925373134328,0.7969991174899411,0.17203736305236816,0.7969991174899411
51,2,RandomForest,0,0.6,0.6268656716417911,0.6368188811889629,0.8081309795379639,0.0
52,2,AdaBoost (Discrete),0,0.6,0.9447761194029851,0.9440178523853264,117.02881789207458,0.9440178523853264
53,2,AdaBoost (Real),0,0.6,0.8985074626865671,0.8967393751058723,122.87869954109192,0.8967393751058723
54,2,Logistic Regression (Penalty = L2),0,0.6,0.9492537313432836,0.9487219421050573,4.491448402404785,0.9487219421050573
55,2,Naive Bayes,0,0.6,0.9044776119402985,0.9031364972568723,0.45893359184265137,0.9031364972568723
56,2,KNeighbors Classifier,1,0.6,0.9537313432835821,0.9532765934488421,10.801502704620361,0.9532765934488421
57,2,SVC Classifier,1,0.6,0.9686567164179104,0.9684405972729713,4.6013383865356445,0.9684405972729713
58,2,Decision Tree,1,0.6,0.8373134328358209,0.8357814556289739,0.14142680168151855,0.8357814556289739
59,2,RandomForest,1,0.6,0.664179104477612,0.6768211586919833,0.8176734447479248,0.0
60,2,AdaBoost (Discrete),1,0.6,0.935820895522388,0.9357007092897628,108.99810481071472,0.9357007092897628
61,2,AdaBoost (Real),1,0.6,0.6567164179104478,0.6375053417912011,111.83359169960022,0.6375053417912011
62,2,Logistic Regression (Penalty = L2),1,0.6,0.9388059701492537,0.9382667761393251,4.653707027435303,0.9382667761393251
63,2,Naive Bayes,1,0.6,0.8895522388059701,0.8881385692266268,0.4922151565551758,0.8881385692266268
64,2,KNeighbors Classifier,2,0.6,0.9696969696969697,0.9696015081488653,11.371530771255493,0.9696015081488653
65,2,SVC Classifier,2,0.6,0.9590909090909091,0.9589941325062695,4.938220500946045,0.9589941325062695
66,2,Decision Tree,2,0.6,0.8378787878787879,0.8355982931807566,0.08349299430847168,0.8355982931807566
67,2,RandomForest,2,0.6,0.706060606060606,0.756373282197751,0.7286250591278076,0.0
68,2,AdaBoost (Discrete),2,0.6,0.9348484848484848,0.9345525542486424,105.77132320404053,0.9345525542486424
69,2,AdaBoost (Real),2,0.6,0.8409090909090909,0.833726843408687,112.87965297698975,0.833726843408687
70,2,Logistic Regression (Penalty = L2),2,0.6,0.946969696969697,0.946216941392542,4.369552373886108,0.946216941392542
71,2,Naive Bayes,2,0.6,0.9015151515151515,0.9012085205236823,0.4572460651397705,0.9012085205236823
72,3,KNeighbors Classifier,0,0.6,0.9656716417910448,0.9653229039704622,7.381666421890259,0.9653229039704622
73,3,SVC Classifier,0,0.6,0.9611940298507463,0.9609578785499391,3.084894895553589,0.9609578785499391
74,3,Decision Tree,0,0.6,0.8373134328358209,0.832943237393804,0.15045833587646484,0.832943237393804
75,3,RandomForest,0,0.6,0.6940298507462687,0.7322801799602159,0.6183598041534424,0.0
76,3,AdaBoost (Discrete),0,0.6,0.9313432835820895,0.9305780841992343,82.83847689628601,0.9305780841992343
77,3,AdaBoost (Real),0,0.6,0.8582089552238806,0.8401125364510128,90.15466737747192,0.8401125364510128
78,3,Logistic Regression (Penalty = L2),0,0.6,0.9343283582089552,0.9338945464777029,3.1979475021362305,0.9338945464777029
79,3,Naive Bayes,0,0.6,0.8895522388059701,0.8887074742569934,0.38253140449523926,0.8887074742569934
80,3,KNeighbors Classifier,1,0.6,0.9611940298507463,0.9609784744805012,6.7885212898254395,0.9609784744805012
81,3,SVC Classifier,1,0.6,0.9522388059701492,0.9521022395896245,3.2536938190460205,0.9521022395896245
82,3,Decision Tree,1,0.6,0.8313432835820895,0.8283147204887139,0.14324235916137695,0.8283147204887139
83,3,RandomForest,1,0.6,0.6417910447761194,0.6074194281194185,0.6449697017669678,0.0
84,3,AdaBoost (Discrete),1,0.6,0.9208955223880597,0.920314652644527,76.02521920204163,0.920314652644527
85,3,AdaBoost (Real),1,0.6,0.8880597014925373,0.8869491527417867,89.40713334083557,0.8869491527417867
86,3,Logistic Regression (Penalty = L2),1,0.6,0.9223880597014925,0.9219070173478041,3.370201826095581,0.9219070173478041
87,3,Naive Bayes,1,0.6,0.8925373134328358,0.8916501946344519,0.347104549407959,0.8916501946344519
88,3,KNeighbors Classifier,2,0.6,0.9666666666666667,0.9665028843452573,6.75147819519043,0.9665028843452573
89,3,SVC Classifier,2,0.6,0.9681818181818181,0.9679567752850955,3.3585596084594727,0.9679567752850955
90,3,Decision Tree,2,0.6,0.8454545454545455,0.8443269708475277,0.058653831481933594,0.8443269708475277
91,3,RandomForest,2,0.6,0.6863636363636364,0.7197025297036447,0.6035130023956299,0.0
92,3,AdaBoost (Discrete),2,0.6,0.9393939393939394,0.9391265528083254,80.1627128124237,0.9391265528083254
93,3,AdaBoost (Real),2,0.6,0.9015151515151515,0.8996535751496862,90.36643028259277,0.8996535751496862
94,3,Logistic Regression (Penalty = L2),2,0.6,0.943939393939394,0.9431058954799034,3.2814364433288574,0.9431058954799034
95,3,Naive Bayes,2,0.6,0.8924242424242425,0.8916489467565808,0.376115083694458,0.8916489467565808
96,4,KNeighbors Classifier,0,0.6,0.9522388059701492,0.9519348058313337,5.475099086761475,0.9519348058313337
97,4,SVC Classifier,0,0.6,0.9462686567164179,0.9461241775698619,2.9889001846313477,0.9461241775698619
98,4,Decision Tree,0,0.6,0.7970149253731343,0.7949120699430953,0.12992095947265625,0.7949120699430953
99,4,RandomForest,0,0.6,0.6597014925373135,0.5311395418504965,0.6430869102478027,0.5311395418504965
100,4,AdaBoost (Discrete),0,0.6,0.9328358208955224,0.9322999264597709,69.18477129936218,0.9322999264597709
101,4,AdaBoost (Real),0,0.6,0.8805970149253731,0.8799098372794412,73.10797381401062,0.8799098372794412
102,4,Logistic Regression (Penalty = L2),0,0.6,0.9164179104477612,0.915682432636191,2.7694249153137207,0.915682432636191
103,4,Naive Bayes,0,0.6,0.8925373134328358,0.891306562655468,0.2522919178009033,0.891306562655468
104,4,KNeighbors Classifier,1,0.6,0.9477611940298507,0.947472009596239,5.184300422668457,0.947472009596239
105,4,SVC Classifier,1,0.6,0.9462686567164179,0.9458617119716697,2.5519309043884277,0.9458617119716697
106,4,Decision Tree,1,0.6,0.8373134328358209,0.8351594805731147,0.06696200370788574,0.8351594805731147
107,4,RandomForest,1,0.6,0.5925373134328358,0.4813047119417584,0.4592719078063965,0.0
108,4,AdaBoost (Discrete),1,0.6,0.917910447761194,0.9177360074588599,61.5790696144104,0.9177360074588599
109,4,AdaBoost (Real),1,0.6,0.9044776119402985,0.9035249826808837,71.10142111778259,0.9035249826808837
110,4,Logistic Regression (Penalty = L2),1,0.6,0.917910447761194,0.9170313899184606,2.4497878551483154,0.9170313899184606
111,4,Naive Bayes,1,0.6,0.8611940298507462,0.8579957917666945,0.2652587890625,0.8579957917666945
112,4,KNeighbors Classifier,2,0.6,0.9590909090909091,0.9588513293928821,5.292033910751343,0.9588513293928821
113,4,SVC Classifier,2,0.6,0.956060606060606,0.9556160604820682,2.666804075241089,0.9556160604820682
114,4,Decision Tree,2,0.6,0.8393939393939394,0.837732698254245,0.13247442245483398,0.837732698254245
115,4,RandomForest,2,0.6,0.7848484848484848,0.7758557105591779,0.4518249034881592,0.7758557105591779
116,4,AdaBoost (Discrete),2,0.6,0.9409090909090909,0.9407015359208589,65.95313668251038,0.9407015359208589
117,4,AdaBoost (Real),2,0.6,0.8984848484848484,0.897920627447922,77.08653235435486,0.897920627447922
118,4,Logistic Regression (Penalty = L2),2,0.6,0.946969696969697,0.9463020692722007,2.865445137023926,0.9463020692722007
119,4,Naive Bayes,2,0.6,0.8954545454545455,0.8949391608244246,0.2988111972808838,0.8949391608244246
120,5,KNeighbors Classifier,0,0.6,0.9597014925373134,0.9588411609161114,5.750282526016235,0.9588411609161114
121,5,SVC Classifier,0,0.6,0.9611940298507463,0.9608896068779866,2.948868751525879,0.9608896068779866
122,5,Decision Tree,0,0.6,0.7656716417910447,0.7593642735661957,0.13452935218811035,0.7593642735661957
123,5,RandomForest,0,0.6,0.6567164179104478,0.6015994685629031,0.7216432094573975,0.0
124,5,AdaBoost (Discrete),0,0.6,0.9194029850746268,0.9183362742867754,69.0632176399231,0.9183362742867754
125,5,AdaBoost (Real),0,0.6,0.5044776119402985,0.4640973905337039,75.41514945030212,0.0
126,5,Logistic Regression (Penalty = L2),0,0.6,0.935820895522388,0.9349675006050188,2.9052886962890625,0.9349675006050188
127,5,Naive Bayes,0,0.6,0.9014925373134328,0.8993778394311537,0.24463844299316406,0.8993778394311537
128,5,KNeighbors Classifier,1,0.6,0.9641791044776119,0.9639194596343164,4.9977171421051025,0.9639194596343164
129,5,SVC Classifier,1,0.6,0.9597014925373134,0.9591058248794757,2.6637823581695557,0.9591058248794757
130,5,Decision Tree,1,0.6,0.8253731343283582,0.8220530143960372,0.1242380142211914,0.8220530143960372
131,5,RandomForest,1,0.6,0.6835820895522388,0.7068635832348531,0.5674903392791748,0.0
132,5,AdaBoost (Discrete),1,0.6,0.8940298507462686,0.8905769666140197,62.57883286476135,0.8905769666140197
133,5,AdaBoost (Real),1,0.6,0.8701492537313433,0.867277309627164,73.05648255348206,0.867277309627164
134,5,Logistic Regression (Penalty = L2),1,0.6,0.9238805970149254,0.9231512204022332,2.302765130996704,0.9231512204022332
135,5,Naive Bayes,1,0.6,0.8880597014925373,0.8850392567234849,0.2678678035736084,0.8850392567234849
136,5,KNeighbors Classifier,2,0.6,0.9606060606060606,0.9602100855792817,5.235243797302246,0.9602100855792817
137,5,SVC Classifier,2,0.6,0.9484848484848485,0.9482629736541153,2.466249704360962,0.9482629736541153
138,5,Decision Tree,2,0.6,0.8409090909090909,0.8374728040197105,0.11798882484436035,0.8374728040197105
139,5,RandomForest,2,0.6,0.6803030303030303,0.37736628134742195,0.42012882232666016,0.37736628134742195
140,5,AdaBoost (Discrete),2,0.6,0.9257575757575758,0.9249842785022617,58.848509073257446,0.9249842785022617
141,5,AdaBoost (Real),2,0.6,0.896969696969697,0.895974332243233,65.46589827537537,0.895974332243233
142,5,Logistic Regression (Penalty = L2),2,0.6,0.9454545454545454,0.9450801522686881,2.3038341999053955,0.9450801522686881
143,5,Naive Bayes,2,0.6,0.8893939393939394,0.8876301014099329,0.23745989799499512,0.8876301014099329
144,6,KNeighbors Classifier,0,0.6,0.9791044776119403,0.9789619091798016,8.744114398956299,0.9789619091798016
145,6,SVC Classifier,0,0.6,0.9716417910447761,0.9714245150900918,3.375439167022705,0.9714245150900918
146,6,Decision Tree,0,0.6,0.817910447761194,0.8152313186542516,0.12256002426147461,0.8152313186542516
147,6,RandomForest,0,0.6,0.746268656716418,0.8130856029939851,0.5656521320343018,0.0
148,6,AdaBoost (Discrete),0,0.6,0.9417910447761194,0.9410116479343602,85.78995561599731,0.9410116479343602
149,6,AdaBoost (Real),0,0.6,0.908955223880597,0.9078831076755138,87.40710735321045,0.9078831076755138
150,6,Logistic Regression (Penalty = L2),0,0.6,0.9492537313432836,0.9488223944349687,3.4305059909820557,0.9488223944349687
151,6,Naive Bayes,0,0.6,0.9208955223880597,0.920480815929082,0.33882617950439453,0.920480815929082
152,6,KNeighbors Classifier,1,0.6,0.9626865671641791,0.9623533500180836,8.047332763671875,0.9623533500180836
153,6,SVC Classifier,1,0.6,0.9641791044776119,0.9640136429882225,3.078869581222534,0.9640136429882225
154,6,Decision Tree,1,0.6,0.8567164179104477,0.854206507145065,0.16124296188354492,0.854206507145065
155,6,RandomForest,1,0.6,0.7373134328358208,0.6531627093917861,0.4490184783935547,0.6531627093917861
156,6,AdaBoost (Discrete),1,0.6,0.9283582089552239,0.9278550127767557,80.91327285766602,0.9278550127767557
157,6,AdaBoost (Real),1,0.6,0.6462686567164179,0.591839783266039,88.03694343566895,0.591839783266039
158,6,Logistic Regression (Penalty = L2),1,0.6,0.9477611940298507,0.9472784821687378,3.3793323040008545,0.9472784821687378
159,6,Naive Bayes,1,0.6,0.908955223880597,0.9081590822851241,0.39212965965270996,0.9081590822851241
160,6,KNeighbors Classifier,2,0.6,0.9712121212121212,0.9710095316120095,7.616764545440674,0.9710095316120095
161,6,SVC Classifier,2,0.6,0.9636363636363636,0.9633914291069454,3.264887809753418,0.9633914291069454
162,6,Decision Tree,2,0.6,0.843939393939394,0.8427043518815692,0.11202216148376465,0.8427043518815692
163,6,RandomForest,2,0.6,0.7227272727272728,0.5959724834361178,0.4570276737213135,0.5959724834361178
164,6,AdaBoost (Discrete),2,0.6,0.9318181818181818,0.9312600558246932,77.57994055747986,0.9312600558246932
165,6,AdaBoost (Real),2,0.6,0.9045454545454545,0.9034062664998892,85.04194045066833,0.9034062664998892
166,6,Logistic Regression (Penalty = L2),2,0.6,0.9545454545454546,0.9541107039984352,3.515298843383789,0.9541107039984352
167,6,Naive Bayes,2,0.6,0.9136363636363637,0.913411152855494,0.3388972282409668,0.913411152855494
168,7,KNeighbors Classifier,0,0.6,0.982089552238806,0.9819804082806206,11.431602478027344,0.9819804082806206
169,7,SVC Classifier,0,0.6,0.9746268656716418,0.9744652127838919,4.171172380447388,0.9744652127838919
170,7,Decision Tree,0,0.6,0.8373134328358209,0.835167774781378,0.16366958618164062,0.835167774781378
171,7,RandomForest,0,0.6,0.6567164179104478,0.6616072595029526,0.5195233821868896,0.0
172,7,AdaBoost (Discrete),0,0.6,0.9432835820895522,0.9422423838214955,110.60958909988403,0.9422423838214955
173,7,AdaBoost (Real),0,0.6,0.9014925373134328,0.9004936559866702,116.22548031806946,0.9004936559866702
174,7,Logistic Regression (Penalty = L2),0,0.6,0.9507462686567164,0.9503178110203053,4.567075729370117,0.9503178110203053
175,7,Naive Bayes,0,0.6,0.9194029850746268,0.9185373991190986,0.4783782958984375,0.9185373991190986
176,7,KNeighbors Classifier,1,0.6,0.9671641791044776,0.9668686898931075,12.555914163589478,0.9668686898931075
177,7,SVC Classifier,1,0.6,0.9671641791044776,0.967029734080962,4.223615646362305,0.967029734080962
178,7,Decision Tree,1,0.6,0.8522388059701492,0.8496531057269093,0.16003632545471191,0.8496531057269093
179,7,RandomForest,1,0.6,0.6492537313432836,0.6526844949326946,0.5397331714630127,0.0
180,7,AdaBoost (Discrete),1,0.6,0.935820895522388,0.9353564540602464,107.81294751167297,0.9353564540602464
181,7,AdaBoost (Real),1,0.6,0.9,0.8992106714422493,107.83957076072693,0.8992106714422493
182,7,Logistic Regression (Penalty = L2),1,0.6,0.9537313432835821,0.9530035358122426,4.755020618438721,0.9530035358122426
183,7,Naive Bayes,1,0.6,0.9164179104477612,0.9156753289686782,0.5114142894744873,0.9156753289686782
184,7,KNeighbors Classifier,2,0.6,0.9742424242424242,0.9741240912830254,12.58699107170105,0.9741240912830254
185,7,SVC Classifier,2,0.6,0.9651515151515152,0.9651028695058245,4.298527956008911,0.9651028695058245
186,7,Decision Tree,2,0.6,0.8515151515151516,0.8502544276633489,0.14765453338623047,0.8502544276633489
187,7,RandomForest,2,0.6,0.7212121212121212,0.6251522858089278,0.5779678821563721,0.6251522858089278
188,7,AdaBoost (Discrete),2,0.6,0.9333333333333333,0.9328590751458392,107.20128154754639,0.9328590751458392
189,7,AdaBoost (Real),2,0.6,0.8696969696969697,0.864841676316622,103.66302442550659,0.864841676316622
190,7,Logistic Regression (Penalty = L2),2,0.6,0.956060606060606,0.9556650049406286,3.983520746231079,0.9556650049406286
191,7,Naive Bayes,2,0.6,0.9181818181818182,0.9178267196176224,0.401592493057251,0.9178267196176224
192,8,KNeighbors Classifier,0,0.6,0.9388059701492537,0.9374929774396231,2.650451183319092,0.9374929774396231
193,8,SVC Classifier,0,0.6,0.9343283582089552,0.9340368489554371,1.642439842224121,0.9340368489554371
194,8,Decision Tree,0,0.6,0.8253731343283582,0.8241293530466345,0.08647274971008301,0.8241293530466345
195,8,RandomForest,0,0.6,0.6268656716417911,0.5765051115017223,0.4000113010406494,0.0
196,8,AdaBoost (Discrete),0,0.6,0.9014925373134328,0.8992118517998595,38.03546380996704,0.8992118517998595
197,8,AdaBoost (Real),0,0.6,0.4791044776119403,0.3030408735687705,45.55105924606323,0.3030408735687705
198,8,Logistic Regression (Penalty = L2),0,0.6,0.9164179104477612,0.9158837380891944,1.5241672992706299,0.9158837380891944
199,8,Naive Bayes,0,0.6,0.8537313432835821,0.848918866183265,0.17185473442077637,0.848918866183265
200,8,KNeighbors Classifier,1,0.6,0.9402985074626866,0.9395654188047109,2.78544282913208,0.9395654188047109
201,8,SVC Classifier,1,0.6,0.935820895522388,0.9351696610871316,1.647308111190796,0.9351696610871316
202,8,Decision Tree,1,0.6,0.8208955223880597,0.8193321983599988,0.04034066200256348,0.8193321983599988
203,8,RandomForest,1,0.6,0.5985074626865672,0.4827239710606566,0.40123486518859863,0.0
204,8,AdaBoost (Discrete),1,0.6,0.8850746268656716,0.8828776658501233,38.58267402648926,0.8828776658501233
205,8,AdaBoost (Real),1,0.6,0.6059701492537314,0.5604746727632058,45.326531648635864,0.5604746727632058
206,8,Logistic Regression (Penalty = L2),1,0.6,0.9253731343283582,0.9244608403506106,1.5333871841430664,0.9244608403506106
207,8,Naive Bayes,1,0.6,0.8552238805970149,0.8522638511917354,0.17045021057128906,0.8522638511917354
208,8,KNeighbors Classifier,2,0.6,0.953030303030303,0.9526519242783045,2.802887439727783,0.9526519242783045
209,8,SVC Classifier,2,0.6,0.943939393939394,0.9436912225354196,1.654266357421875,0.9436912225354196
210,8,Decision Tree,2,0.6,0.85,0.8492651500954711,0.04543423652648926,0.8492651500954711
211,8,RandomForest,2,0.6,0.65,0.5593304379928086,0.3413116931915283,0.0
212,8,AdaBoost (Discrete),2,0.6,0.9181818181818182,0.9171638701621796,37.317604541778564,0.9171638701621796
213,8,AdaBoost (Real),2,0.6,0.9030303030303031,0.9019165190801743,42.96652913093567,0.9019165190801743
214,8,Logistic Regression (Penalty = L2),2,0.6,0.9378787878787879,0.9374549472730859,1.4769904613494873,0.9374549472730859
215,8,Naive Bayes,2,0.6,0.8803030303030303,0.8782310040554736,0.2061769962310791,0.8782310040554736
