,feat_set_id,classifier,fold_id,feat_th,score,geo_score,exec_t,geo_score_woz
0,0,KNeighbors Classifier,0,0.2,0.9432835820895522,0.9422077296535974,1.5894980430603027,0.9422077296535974
1,0,SVC Classifier,0,0.2,0.8850746268656716,0.8834531884187226,4.663327217102051,0.8834531884187226
2,0,Decision Tree,0,0.2,0.753731343283582,0.7483471368570996,0.2986164093017578,0.7483471368570996
3,0,RandomForest,0,0.2,0.6567164179104478,0.6161227873719148,1.531236171722412,0.6161227873719148
4,0,AdaBoost (Discrete),0,0.2,0.9029850746268657,0.9022934354806231,156.14666390419006,0.9022934354806231
5,0,AdaBoost (Real),0,0.2,0.8776119402985074,0.8743969946096933,199.87156891822815,0.8743969946096933
6,0,Logistic Regression (Penalty = L2),0,0.2,0.9164179104477612,0.9156192572578467,1.6521062850952148,0.9156192572578467
7,0,Naive Bayes,0,0.2,0.8970149253731343,0.8963553155889895,0.42127060890197754,0.8963553155889895
8,0,KNeighbors Classifier,1,0.2,0.9537313432835821,0.9532403364138528,1.2607452869415283,0.9532403364138528
9,0,SVC Classifier,1,0.2,0.8716417910447761,0.8695655721573421,3.4014408588409424,0.8695655721573421
10,0,Decision Tree,1,0.2,0.7746268656716417,0.7685403051593777,0.22348785400390625,0.7685403051593777
11,0,RandomForest,1,0.2,0.6328358208955224,0.5499739004700049,1.2194101810455322,0.5499739004700049
12,0,AdaBoost (Discrete),1,0.2,0.9014925373134328,0.900859414317103,131.08248710632324,0.900859414317103
13,0,AdaBoost (Real),1,0.2,0.8746268656716418,0.8738067946487539,165.16976642608643,0.8738067946487539
14,0,Logistic Regression (Penalty = L2),1,0.2,0.9223880597014925,0.921488883148951,1.5135161876678467,0.921488883148951
15,0,Naive Bayes,1,0.2,0.9104477611940298,0.9101515670120697,0.255615234375,0.9101515670120697
16,0,KNeighbors Classifier,2,0.2,0.956060606060606,0.9558563630492438,1.4625194072723389,0.9558563630492438
17,0,SVC Classifier,2,0.2,0.8742424242424243,0.8719604332015332,4.078460454940796,0.8719604332015332
18,0,Decision Tree,2,0.2,0.7454545454545455,0.7367439263638286,0.3643379211425781,0.7367439263638286
19,0,RandomForest,2,0.2,0.6060606060606061,0.5415246325646625,1.1107170581817627,0.5415246325646625
20,0,AdaBoost (Discrete),2,0.2,0.9196969696969697,0.9180906652698783,159.2849748134613,0.9180906652698783
21,0,AdaBoost (Real),2,0.2,0.8712121212121212,0.8676418792672245,191.9491250514984,0.8676418792672245
22,0,Logistic Regression (Penalty = L2),2,0.2,0.9287878787878788,0.9281486832052563,1.852247714996338,0.9281486832052563
23,0,Naive Bayes,2,0.2,0.9303030303030303,0.9300024002458961,0.34421300888061523,0.9300024002458961
24,1,KNeighbors Classifier,0,0.2,0.9552238805970149,0.9546871405715033,1.6957652568817139,0.9546871405715033
25,1,SVC Classifier,0,0.2,0.8492537313432836,0.8471333751903422,4.709435224533081,0.8471333751903422
26,1,Decision Tree,0,0.2,0.7313432835820896,0.7247148336286101,0.15513086318969727,0.7247148336286101
27,1,RandomForest,0,0.2,0.6343283582089553,0.5956560992439185,1.3096370697021484,0.5956560992439185
28,1,AdaBoost (Discrete),0,0.2,0.8716417910447761,0.8701471815883737,174.62266850471497,0.8701471815883737
29,1,AdaBoost (Real),0,0.2,0.8492537313432836,0.847495268562499,186.84469985961914,0.847495268562499
30,1,Logistic Regression (Penalty = L2),0,0.2,0.8865671641791045,0.884899201654162,2.0726332664489746,0.884899201654162
31,1,Naive Bayes,0,0.2,0.9074626865671642,0.9063858554563679,0.43818044662475586,0.9063858554563679
32,1,KNeighbors Classifier,1,0.2,0.9417910447761194,0.9406971559223744,1.769826889038086,0.9406971559223744
33,1,SVC Classifier,1,0.2,0.8432835820895522,0.8398114234611181,5.499317646026611,0.8398114234611181
34,1,Decision Tree,1,0.2,0.7835820895522388,0.7809462909749748,0.30998730659484863,0.7809462909749748
35,1,RandomForest,1,0.2,0.6582089552238806,0.6327143272530052,1.3653569221496582,0.6327143272530052
36,1,AdaBoost (Discrete),1,0.2,0.891044776119403,0.8893137283181298,180.6679084300995,0.8893137283181298
37,1,AdaBoost (Real),1,0.2,0.8388059701492537,0.8362822971881722,168.64073991775513,0.8362822971881722
38,1,Logistic Regression (Penalty = L2),1,0.2,0.9029850746268657,0.901738752141828,1.6426303386688232,0.901738752141828
39,1,Naive Bayes,1,0.2,0.8850746268656716,0.88352008467027,0.24835705757141113,0.88352008467027
40,1,KNeighbors Classifier,2,0.2,0.9606060606060606,0.9604563881589246,1.4261255264282227,0.9604563881589246
41,1,SVC Classifier,2,0.2,0.8560606060606061,0.8543515779444787,4.4793641567230225,0.8543515779444787
42,1,Decision Tree,2,0.2,0.7727272727272727,0.7688562667596343,0.2918529510498047,0.7688562667596343
43,1,RandomForest,2,0.2,0.6484848484848484,0.5780180217188507,1.135915756225586,0.5780180217188507
44,1,AdaBoost (Discrete),2,0.2,0.8984848484848484,0.8972217828438234,157.1580684185028,0.8972217828438234
45,1,AdaBoost (Real),2,0.2,0.8696969696969697,0.8691553983606038,206.2928819656372,0.8691553983606038
46,1,Logistic Regression (Penalty = L2),2,0.2,0.9015151515151515,0.9011792817498615,1.9780120849609375,0.9011792817498615
47,1,Naive Bayes,2,0.2,0.9,0.8995588981595359,0.2883157730102539,0.8995588981595359
48,2,KNeighbors Classifier,0,0.2,0.9014925373134328,0.8991165626979332,1.888397216796875,0.8991165626979332
49,2,SVC Classifier,0,0.2,0.8044776119402985,0.7931255698012032,5.160918712615967,0.7931255698012032
50,2,Decision Tree,0,0.2,0.6791044776119403,0.6704687197406566,0.3037581443786621,0.6704687197406566
51,2,RandomForest,0,0.2,0.6059701492537314,0.5806991782967064,1.508174180984497,0.5806991782967064
52,2,AdaBoost (Discrete),0,0.2,0.8119402985074626,0.8083422711378133,197.70559668540955,0.8083422711378133
53,2,AdaBoost (Real),0,0.2,0.7835820895522388,0.7771305046447471,227.8425269126892,0.7771305046447471
54,2,Logistic Regression (Penalty = L2),0,0.2,0.8402985074626865,0.8357096344716268,2.2991268634796143,0.8357096344716268
55,2,Naive Bayes,0,0.2,0.8462686567164179,0.843890328690435,0.3958287239074707,0.843890328690435
56,2,KNeighbors Classifier,1,0.2,0.9104477611940298,0.908638457230763,2.5597825050354004,0.908638457230763
57,2,SVC Classifier,1,0.2,0.8029850746268656,0.7875968503391104,5.58433198928833,0.7875968503391104
58,2,Decision Tree,1,0.2,0.6835820895522388,0.6740477951809839,0.3286142349243164,0.6740477951809839
59,2,RandomForest,1,0.2,0.6805970149253732,0.6501786868098834,1.4799091815948486,0.6501786868098834
60,2,AdaBoost (Discrete),1,0.2,0.8343283582089552,0.8292941152608995,196.53835558891296,0.8292941152608995
61,2,AdaBoost (Real),1,0.2,0.4552238805970149,0.3996758515133658,207.32571721076965,0.3996758515133658
62,2,Logistic Regression (Penalty = L2),1,0.2,0.8343283582089552,0.83121926257362,1.7161121368408203,0.83121926257362
63,2,Naive Bayes,1,0.2,0.8552238805970149,0.8533792672897236,0.13940739631652832,0.8533792672897236
64,2,KNeighbors Classifier,2,0.2,0.9045454545454545,0.903150204850956,1.8434524536132812,0.903150204850956
65,2,SVC Classifier,2,0.2,0.8151515151515152,0.8073260372563587,4.457205533981323,0.8073260372563587
66,2,Decision Tree,2,0.2,0.7424242424242424,0.736414598022226,0.26793813705444336,0.736414598022226
67,2,RandomForest,2,0.2,0.6378787878787879,0.5723598085752639,1.1029698848724365,0.5723598085752639
68,2,AdaBoost (Discrete),2,0.2,0.8348484848484848,0.8301529650739593,174.62378120422363,0.8301529650739593
69,2,AdaBoost (Real),2,0.2,0.8121212121212121,0.8099727185061572,172.67861223220825,0.8099727185061572
70,2,Logistic Regression (Penalty = L2),2,0.2,0.8606060606060606,0.8597156110834876,1.6643092632293701,0.8597156110834876
71,2,Naive Bayes,2,0.2,0.8590909090909091,0.8584786351096243,0.13924503326416016,0.8584786351096243
72,3,KNeighbors Classifier,0,0.2,0.9253731343283582,0.9245489506344872,0.8319454193115234,0.9245489506344872
73,3,SVC Classifier,0,0.2,0.7940298507462686,0.7891534769132519,3.8271141052246094,0.7891534769132519
74,3,Decision Tree,0,0.2,0.7522388059701492,0.7441566216792335,0.27552103996276855,0.7441566216792335
75,3,RandomForest,0,0.2,0.6611940298507463,0.5680499463439465,1.251981258392334,0.5680499463439465
76,3,AdaBoost (Discrete),0,0.2,0.8567164179104477,0.8544934859747735,123.61175227165222,0.8544934859747735
77,3,AdaBoost (Real),0,0.2,0.8462686567164179,0.8437828938936565,166.1232795715332,0.8437828938936565
78,3,Logistic Regression (Penalty = L2),0,0.2,0.8522388059701492,0.8508731733971392,1.741391658782959,0.8508731733971392
79,3,Naive Bayes,0,0.2,0.8626865671641791,0.8606272960867851,0.31514430046081543,0.8606272960867851
80,3,KNeighbors Classifier,1,0.2,0.9343283582089552,0.9336830631044556,0.9410867691040039,0.9336830631044556
81,3,SVC Classifier,1,0.2,0.8014925373134328,0.7909733625196328,4.169727325439453,0.7909733625196328
82,3,Decision Tree,1,0.2,0.7776119402985074,0.7744485785722789,0.1334536075592041,0.7744485785722789
83,3,RandomForest,1,0.2,0.682089552238806,0.6159983660688428,1.2831761837005615,0.6159983660688428
84,3,AdaBoost (Discrete),1,0.2,0.8761194029850746,0.8747076398958479,140.97412872314453,0.8747076398958479
85,3,AdaBoost (Real),1,0.2,0.8014925373134328,0.7956965019943297,162.668523311615,0.7956965019943297
86,3,Logistic Regression (Penalty = L2),1,0.2,0.8716417910447761,0.8699486923943027,1.3980231285095215,0.8699486923943027
87,3,Naive Bayes,1,0.2,0.8626865671641791,0.8597149018257593,0.29936861991882324,0.8597149018257593
88,3,KNeighbors Classifier,2,0.2,0.9378787878787879,0.9373736998599498,0.9083504676818848,0.9373736998599498
89,3,SVC Classifier,2,0.2,0.806060606060606,0.7995285395222164,3.883199691772461,0.7995285395222164
90,3,Decision Tree,2,0.2,0.7727272727272727,0.7679933283421863,0.2868466377258301,0.7679933283421863
91,3,RandomForest,2,0.2,0.603030303030303,0.44302453205625086,1.233853816986084,0.44302453205625086
92,3,AdaBoost (Discrete),2,0.2,0.8833333333333333,0.8828024071814442,142.0319118499756,0.8828024071814442
93,3,AdaBoost (Real),2,0.2,0.8318181818181818,0.8259075167619878,169.6922996044159,0.8259075167619878
94,3,Logistic Regression (Penalty = L2),2,0.2,0.8772727272727273,0.876169461878719,1.5159354209899902,0.876169461878719
95,3,Naive Bayes,2,0.2,0.8893939393939394,0.8885223300055862,0.14650940895080566,0.8885223300055862
96,4,KNeighbors Classifier,0,0.2,0.8791044776119403,0.8771485383420451,0.8339419364929199,0.8771485383420451
97,4,SVC Classifier,0,0.2,0.7313432835820896,0.7073796287610502,3.4584145545959473,0.7073796287610502
98,4,Decision Tree,0,0.2,0.6940298507462687,0.6881747041224529,0.15833759307861328,0.6881747041224529
99,4,RandomForest,0,0.2,0.655223880597015,0.6121229150723758,1.0060300827026367,0.6121229150723758
100,4,AdaBoost (Discrete),0,0.2,0.7477611940298508,0.7431843133155167,114.77714228630066,0.7431843133155167
101,4,AdaBoost (Real),0,0.2,0.7268656716417911,0.7208904176815656,152.4415156841278,0.7208904176815656
102,4,Logistic Regression (Penalty = L2),0,0.2,0.7820895522388059,0.7749188573445365,1.3296477794647217,0.7749188573445365
103,4,Naive Bayes,0,0.2,0.8,0.7953104249603314,0.2808198928833008,0.7953104249603314
104,4,KNeighbors Classifier,1,0.2,0.8895522388059701,0.8878274124328646,0.866222620010376,0.8878274124328646
105,4,SVC Classifier,1,0.2,0.7582089552238805,0.7369181172843355,4.041282415390015,0.7369181172843355
106,4,Decision Tree,1,0.2,0.7208955223880597,0.7146422281286935,0.2748260498046875,0.7146422281286935
107,4,RandomForest,1,0.2,0.6223880597014926,0.5327158906811883,1.3786680698394775,0.5327158906811883
108,4,AdaBoost (Discrete),1,0.2,0.7805970149253731,0.77790856478715,131.8830223083496,0.77790856478715
109,4,AdaBoost (Real),1,0.2,0.408955223880597,0.34803680061245124,155.67131900787354,0.34803680061245124
110,4,Logistic Regression (Penalty = L2),1,0.2,0.8074626865671641,0.802314343374642,1.2288811206817627,0.802314343374642
111,4,Naive Bayes,1,0.2,0.8238805970149253,0.8214988401342117,0.33600592613220215,0.8214988401342117
112,4,KNeighbors Classifier,2,0.2,0.8954545454545455,0.8942969661462631,0.8082826137542725,0.8942969661462631
113,4,SVC Classifier,2,0.2,0.759090909090909,0.7408865491035728,4.201083421707153,0.7408865491035728
114,4,Decision Tree,2,0.2,0.75,0.7427403500567594,0.2520747184753418,0.7427403500567594
115,4,RandomForest,2,0.2,0.646969696969697,0.5429827574688737,1.5838162899017334,0.5429827574688737
116,4,AdaBoost (Discrete),2,0.2,0.7833333333333333,0.77743279253883,126.76505970954895,0.77743279253883
117,4,AdaBoost (Real),2,0.2,0.703030303030303,0.6801941703577552,141.45149040222168,0.6801941703577552
118,4,Logistic Regression (Penalty = L2),2,0.2,0.8318181818181818,0.8285267058249621,1.204376459121704,0.8285267058249621
119,4,Naive Bayes,2,0.2,0.8409090909090909,0.8393537063679521,0.2810707092285156,0.8393537063679521
120,5,KNeighbors Classifier,0,0.2,0.8029850746268656,0.7976354560945508,0.6327369213104248,0.7976354560945508
121,5,SVC Classifier,0,0.2,0.6761194029850747,0.6139783759431512,4.024994373321533,0.6139783759431512
122,5,Decision Tree,0,0.2,0.6567164179104478,0.6485364386126969,0.34268832206726074,0.6485364386126969
123,5,RandomForest,0,0.2,0.5507462686567164,0.5334831329479813,1.3845129013061523,0.0
124,5,AdaBoost (Discrete),0,0.2,0.735820895522388,0.7307439716968619,124.27504181861877,0.7307439716968619
125,5,AdaBoost (Real),0,0.2,0.6447761194029851,0.6270780831350167,132.0761058330536,0.6270780831350167
126,5,Logistic Regression (Penalty = L2),0,0.2,0.7417910447761195,0.7275316998167347,1.1339573860168457,0.7275316998167347
127,5,Naive Bayes,0,0.2,0.7417910447761195,0.7264973179274814,0.16324281692504883,0.7264973179274814
128,5,KNeighbors Classifier,1,0.2,0.8343283582089552,0.8304036140105487,0.523972749710083,0.8304036140105487
129,5,SVC Classifier,1,0.2,0.6895522388059702,0.6200789205132441,3.1875810623168945,0.6200789205132441
130,5,Decision Tree,1,0.2,0.6537313432835821,0.6424516477332346,0.24113798141479492,0.6424516477332346
131,5,RandomForest,1,0.2,0.5611940298507463,0.3901997114183472,1.2547204494476318,0.3901997114183472
132,5,AdaBoost (Discrete),1,0.2,0.7223880597014926,0.7108512410184221,102.85662722587585,0.7108512410184221
133,5,AdaBoost (Real),1,0.2,0.4746268656716418,0.4507433068685963,145.04198026657104,0.4507433068685963
134,5,Logistic Regression (Penalty = L2),1,0.2,0.7522388059701492,0.7360615370713612,1.2055718898773193,0.7360615370713612
135,5,Naive Bayes,1,0.2,0.7776119402985074,0.7677084727224813,0.13970255851745605,0.7677084727224813
136,5,KNeighbors Classifier,2,0.2,0.8272727272727273,0.821933367205132,0.5762326717376709,0.821933367205132
137,5,SVC Classifier,2,0.2,0.6863636363636364,0.6381033510582466,3.8155837059020996,0.6381033510582466
138,5,Decision Tree,2,0.2,0.6984848484848485,0.6886089726807892,0.2900371551513672,0.6886089726807892
139,5,RandomForest,2,0.2,0.5787878787878787,0.5483055594860788,1.389547348022461,0.0
140,5,AdaBoost (Discrete),2,0.2,0.7560606060606061,0.7534222011317206,107.71488690376282,0.7534222011317206
141,5,AdaBoost (Real),2,0.2,0.6196969696969697,0.5899843535579307,135.13101720809937,0.5899843535579307
142,5,Logistic Regression (Penalty = L2),2,0.2,0.7560606060606061,0.7465910080913605,0.9544029235839844,0.7465910080913605
143,5,Naive Bayes,2,0.2,0.7757575757575758,0.7670467984870641,0.2558259963989258,0.7670467984870641
144,6,KNeighbors Classifier,0,0.2,0.9373134328358209,0.9361137414839994,1.2214312553405762,0.9361137414839994
145,6,SVC Classifier,0,0.2,0.8373134328358209,0.8359111527582596,4.073613882064819,0.8359111527582596
146,6,Decision Tree,0,0.2,0.7761194029850746,0.7728394651391014,0.2873380184173584,0.7728394651391014
147,6,RandomForest,0,0.2,0.655223880597015,0.6093734568265844,1.5054821968078613,0.6093734568265844
148,6,AdaBoost (Discrete),0,0.2,0.8895522388059701,0.8878976217485788,148.20999383926392,0.8878976217485788
149,6,AdaBoost (Real),0,0.2,0.8582089552238806,0.8538691429721879,162.13893461227417,0.8538691429721879
150,6,Logistic Regression (Penalty = L2),0,0.2,0.8746268656716418,0.8741674097058757,1.2752113342285156,0.8741674097058757
151,6,Naive Bayes,0,0.2,0.8746268656716418,0.8740594184467156,0.36157751083374023,0.8740594184467156
152,6,KNeighbors Classifier,1,0.2,0.9492537313432836,0.9486029124645822,1.008366584777832,0.9486029124645822
153,6,SVC Classifier,1,0.2,0.8522388059701492,0.8510195912020745,3.692007303237915,0.8510195912020745
154,6,Decision Tree,1,0.2,0.7477611940298508,0.7410607419215941,0.26073622703552246,0.7410607419215941
155,6,RandomForest,1,0.2,0.6746268656716418,0.5984878917841534,1.200409173965454,0.5984878917841534
156,6,AdaBoost (Discrete),1,0.2,0.8880597014925373,0.8865545680073705,124.46902632713318,0.8865545680073705
157,6,AdaBoost (Real),1,0.2,0.582089552238806,0.531736496776956,149.9141571521759,0.531736496776956
158,6,Logistic Regression (Penalty = L2),1,0.2,0.8985074626865671,0.8974246596345258,1.2241020202636719,0.8974246596345258
159,6,Naive Bayes,1,0.2,0.8880597014925373,0.8872511851874585,0.2996964454650879,0.8872511851874585
160,6,KNeighbors Classifier,2,0.2,0.9545454545454546,0.9539834140051852,0.9948010444641113,0.9539834140051852
161,6,SVC Classifier,2,0.2,0.8515151515151516,0.8499680917234348,4.1476850509643555,0.8499680917234348
162,6,Decision Tree,2,0.2,0.7833333333333333,0.7797318459612042,0.2960183620452881,0.7797318459612042
163,6,RandomForest,2,0.2,0.6060606060606061,0.6412853902203106,1.1644973754882812,0.0
164,6,AdaBoost (Discrete),2,0.2,0.9,0.8988531804082739,1195.0952475070953,0.8988531804082739
165,6,AdaBoost (Real),2,0.2,0.8454545454545455,0.8413227234970931,127.44426012039185,0.8413227234970931
166,6,Logistic Regression (Penalty = L2),2,0.2,0.9015151515151515,0.900959405656719,1.0930814743041992,0.900959405656719
167,6,Naive Bayes,2,0.2,0.9106060606060606,0.9101603147678093,0.21425700187683105,0.9101603147678093
168,7,KNeighbors Classifier,0,0.2,0.9626865671641791,0.9621695909880155,3.128861904144287,0.9621695909880155
169,7,SVC Classifier,0,0.2,0.9044776119402985,0.9036268752005695,5.511159181594849,0.9036268752005695
170,7,Decision Tree,0,0.2,0.7373134328358208,0.7348364786072142,0.2661564350128174,0.7348364786072142
171,7,RandomForest,0,0.2,0.6850746268656717,0.6698656373023292,1.2005743980407715,0.6698656373023292
172,7,AdaBoost (Discrete),0,0.2,0.9164179104477612,0.915249908624902,186.6301827430725,0.915249908624902
173,7,AdaBoost (Real),0,0.2,0.5417910447761194,0.3976394248891157,189.8955361843109,0.3976394248891157
174,7,Logistic Regression (Penalty = L2),0,0.2,0.9373134328358209,0.9363310004196181,1.6864843368530273,0.9363310004196181
175,7,Naive Bayes,0,0.2,0.9253731343283582,0.9247600919189216,0.21438360214233398,0.9247600919189216
176,7,KNeighbors Classifier,1,0.2,0.9477611940298507,0.9470140261183904,2.8210136890411377,0.9470140261183904
177,7,SVC Classifier,1,0.2,0.908955223880597,0.9075680953993831,4.937119245529175,0.9075680953993831
178,7,Decision Tree,1,0.2,0.6895522388059702,0.684721645173844,0.2371811866760254,0.684721645173844
179,7,RandomForest,1,0.2,0.7164179104477612,0.701148337554402,1.0597667694091797,0.701148337554402
180,7,AdaBoost (Discrete),1,0.2,0.9223880597014925,0.9216652374327667,188.33002185821533,0.9216652374327667
181,7,AdaBoost (Real),1,0.2,0.6074626865671642,0.4496099997599212,180.00829434394836,0.4496099997599212
182,7,Logistic Regression (Penalty = L2),1,0.2,0.9373134328358209,0.9366401683205453,1.5592548847198486,0.9366401683205453
183,7,Naive Bayes,1,0.2,0.9402985074626866,0.9398740298262066,0.31847214698791504,0.9398740298262066
184,7,KNeighbors Classifier,2,0.2,0.9575757575757575,0.9572413567045416,2.794860601425171,0.9572413567045416
185,7,SVC Classifier,2,0.2,0.9121212121212121,0.9116648615303301,4.708164691925049,0.9116648615303301
186,7,Decision Tree,2,0.2,0.7303030303030303,0.7275755653637013,0.21801376342773438,0.7275755653637013
187,7,RandomForest,2,0.2,0.6924242424242424,0.6826833419775183,1.1788678169250488,0.6826833419775183
188,7,AdaBoost (Discrete),2,0.2,0.9318181818181818,0.9313880760649939,166.12190127372742,0.9313880760649939
189,7,AdaBoost (Real),2,0.2,0.8939393939393939,0.893474160882209,169.49084949493408,0.893474160882209
190,7,Logistic Regression (Penalty = L2),2,0.2,0.946969696969697,0.9465041468266419,1.529226541519165,0.9465041468266419
191,7,Naive Bayes,2,0.2,0.9393939393939394,0.9390821623135389,0.27476024627685547,0.9390821623135389
192,8,KNeighbors Classifier,0,0.2,0.8029850746268656,0.7976354560945508,0.3705735206604004,0.7976354560945508
193,8,SVC Classifier,0,0.2,0.6761194029850747,0.6139783759431512,2.453026533126831,0.6139783759431512
194,8,Decision Tree,0,0.2,0.6701492537313433,0.6649192422198446,0.09426426887512207,0.6649192422198446
195,8,RandomForest,0,0.2,0.5507462686567164,0.5334831329479813,0.8635826110839844,0.0
196,8,AdaBoost (Discrete),0,0.2,0.735820895522388,0.7307439716968619,74.17686486244202,0.7307439716968619
197,8,AdaBoost (Real),0,0.2,0.6746268656716418,0.6665380680294002,89.82034230232239,0.6665380680294002
198,8,Logistic Regression (Penalty = L2),0,0.2,0.7417910447761195,0.7275316998167347,0.706188440322876,0.7275316998167347
199,8,Naive Bayes,0,0.2,0.7417910447761195,0.7264973179274814,0.20340633392333984,0.7264973179274814
200,8,KNeighbors Classifier,1,0.2,0.8343283582089552,0.8304036140105487,0.39177513122558594,0.8304036140105487
201,8,SVC Classifier,1,0.2,0.6895522388059702,0.6200789205132441,2.677696466445923,0.6200789205132441
202,8,Decision Tree,1,0.2,0.664179104477612,0.6509983746880088,0.19843053817749023,0.6509983746880088
203,8,RandomForest,1,0.2,0.5611940298507463,0.3901997114183472,0.8656554222106934,0.3901997114183472
204,8,AdaBoost (Discrete),1,0.2,0.7223880597014926,0.7108512410184221,74.57463932037354,0.7108512410184221
205,8,AdaBoost (Real),1,0.2,0.6298507462686567,0.5857881453141195,84.84662175178528,0.5857881453141195
206,8,Logistic Regression (Penalty = L2),1,0.2,0.7522388059701492,0.7360615370713612,0.63706374168396,0.7360615370713612
207,8,Naive Bayes,1,0.2,0.7776119402985074,0.7677084727224813,0.15613579750061035,0.7677084727224813
208,8,KNeighbors Classifier,2,0.2,0.8272727272727273,0.821933367205132,0.4863114356994629,0.821933367205132
209,8,SVC Classifier,2,0.2,0.6863636363636364,0.6381033510582466,2.12917160987854,0.6381033510582466
210,8,Decision Tree,2,0.2,0.7151515151515152,0.7077009035566713,0.08854818344116211,0.7077009035566713
211,8,RandomForest,2,0.2,0.5787878787878787,0.5483055594860788,0.8527534008026123,0.0
212,8,AdaBoost (Discrete),2,0.2,0.7560606060606061,0.7534222011317206,66.6522524356842,0.7534222011317206
213,8,AdaBoost (Real),2,0.2,0.603030303030303,0.5658809148925313,87.32737398147583,0.5658809148925313
214,8,Logistic Regression (Penalty = L2),2,0.2,0.7560606060606061,0.7465910080913605,0.6848299503326416,0.7465910080913605
215,8,Naive Bayes,2,0.2,0.7757575757575758,0.7670467984870641,0.18769168853759766,0.7670467984870641
