,feat_set_id,classifier,fold_id,feat_th,score,geo_score,exec_t,geo_score_woz
0,0,KNeighbors Classifier,0,0.8,0.814748201438849,0.8142812070069015,2.6616361141204834,0.8142812070069015
1,0,SVC Classifier,0,0.8,0.8489208633093526,0.8370680042809691,4.11737060546875,0.8370680042809691
2,0,Decision Tree,0,0.8,0.7470023980815348,0.7468235928318606,0.15561962127685547,0.7468235928318606
3,0,RandomForest,0,0.8,0.7392086330935251,0.7218721587449527,0.40811824798583984,0.7218721587449527
4,0,AdaBoost (Discrete),0,0.8,0.8447242206235012,0.8447238738640466,52.534857988357544,0.8447238738640466
5,0,AdaBoost (Real),0,0.8,0.8411270983213429,0.8402269498203638,75.43206310272217,0.8402269498203638
6,0,Logistic Regression (Penalty = L2),0,0.8,0.8741007194244604,0.8735993608360885,0.5345594882965088,0.8735993608360885
7,0,Naive Bayes,0,0.8,0.8105515587529976,0.7798322818099436,0.09711432456970215,0.7798322818099436
8,0,KNeighbors Classifier,1,0.8,0.7869147659063626,0.7853879041172531,4.138298988342285,0.7853879041172531
9,0,SVC Classifier,1,0.8,0.8451380552220888,0.8335574730456604,5.137425184249878,0.8335574730456604
10,0,Decision Tree,1,0.8,0.7334933973589436,0.7324656610603194,0.20880413055419922,0.7324656610603194
11,0,RandomForest,1,0.8,0.7310924369747899,0.7208596617746772,0.4895796775817871,0.7208596617746772
12,0,AdaBoost (Discrete),1,0.8,0.8337334933973589,0.8335352088024661,74.08270144462585,0.8335352088024661
13,0,AdaBoost (Real),1,0.8,0.8271308523409364,0.8269299122680217,76.17115068435669,0.8269299122680217
14,0,Logistic Regression (Penalty = L2),1,0.8,0.8649459783913566,0.8644700056649184,0.34084343910217285,0.8644700056649184
15,0,Naive Bayes,1,0.8,0.8067226890756303,0.7783525822882925,0.08287811279296875,0.7783525822882925
16,0,KNeighbors Classifier,2,0.8,0.8187274909963985,0.8174700106085069,3.4304234981536865,0.8174700106085069
17,0,SVC Classifier,2,0.8,0.8451380552220888,0.8301460461279765,4.652979612350464,0.8301460461279765
18,0,Decision Tree,2,0.8,0.7478991596638656,0.7469375362443235,0.14791250228881836,0.7469375362443235
19,0,RandomForest,2,0.8,0.748499399759904,0.7359812811322981,0.4298675060272217,0.7359812811322981
20,0,AdaBoost (Discrete),2,0.8,0.8463385354141657,0.8463113277798986,68.42247080802917,0.8463113277798986
21,0,AdaBoost (Real),2,0.8,0.843937575030012,0.8435835477137876,74.48218178749084,0.8435835477137876
22,0,Logistic Regression (Penalty = L2),2,0.8,0.8679471788715486,0.8667736758612635,0.29783129692077637,0.8667736758612635
23,0,Naive Bayes,2,0.8,0.8145258103241296,0.7864645253694804,0.07233023643493652,0.7864645253694804
24,1,KNeighbors Classifier,0,0.8,0.814748201438849,0.8142812070069015,3.653813600540161,0.8142812070069015
25,1,SVC Classifier,0,0.8,0.8489208633093526,0.8370680042809691,4.6305859088897705,0.8370680042809691
26,1,Decision Tree,0,0.8,0.7452038369304557,0.7445344841737325,0.14603090286254883,0.7445344841737325
27,1,RandomForest,0,0.8,0.7392086330935251,0.7218721587449527,0.4599132537841797,0.7218721587449527
28,1,AdaBoost (Discrete),0,0.8,0.8447242206235012,0.8447238738640466,68.85809922218323,0.8447238738640466
29,1,AdaBoost (Real),0,0.8,0.8345323741007195,0.8336992067753086,75.24945282936096,0.8336992067753086
30,1,Logistic Regression (Penalty = L2),0,0.8,0.8741007194244604,0.8735993608360885,0.3214073181152344,0.8735993608360885
31,1,Naive Bayes,0,0.8,0.8105515587529976,0.7798322818099436,0.06883645057678223,0.7798322818099436
32,1,KNeighbors Classifier,1,0.8,0.7869147659063626,0.7853879041172531,3.5919618606567383,0.7853879041172531
33,1,SVC Classifier,1,0.8,0.8451380552220888,0.8335574730456604,4.576345205307007,0.8335574730456604
34,1,Decision Tree,1,0.8,0.7424969987995198,0.7418376145106247,0.1833326816558838,0.7418376145106247
35,1,RandomForest,1,0.8,0.7310924369747899,0.7208596617746772,0.46813488006591797,0.7208596617746772
36,1,AdaBoost (Discrete),1,0.8,0.8337334933973589,0.8335352088024661,67.49546933174133,0.8335352088024661
37,1,AdaBoost (Real),1,0.8,0.8301320528211285,0.8300523830118017,88.70513439178467,0.8300523830118017
38,1,Logistic Regression (Penalty = L2),1,0.8,0.8649459783913566,0.8644700056649184,0.42713284492492676,0.8644700056649184
39,1,Naive Bayes,1,0.8,0.8067226890756303,0.7783525822882925,0.1475663185119629,0.7783525822882925
40,1,KNeighbors Classifier,2,0.8,0.8187274909963985,0.8174700106085069,5.003495931625366,0.8174700106085069
41,1,SVC Classifier,2,0.8,0.8451380552220888,0.8301460461279765,6.645833969116211,0.8301460461279765
42,1,Decision Tree,2,0.8,0.7521008403361344,0.7509292234535128,0.20783233642578125,0.7509292234535128
43,1,RandomForest,2,0.8,0.748499399759904,0.7359812811322981,0.6238682270050049,0.7359812811322981
44,1,AdaBoost (Discrete),2,0.8,0.8457382953181273,0.8457002724571432,97.356112241745,0.8457002724571432
45,1,AdaBoost (Real),2,0.8,0.8445378151260504,0.8441652082075444,102.8922107219696,0.8441652082075444
46,1,Logistic Regression (Penalty = L2),2,0.8,0.8679471788715486,0.8667736758612635,0.4186856746673584,0.8667736758612635
47,1,Naive Bayes,2,0.8,0.8145258103241296,0.7864645253694804,0.09431958198547363,0.7864645253694804
48,2,KNeighbors Classifier,0,0.8,0.8165467625899281,0.8149221651285747,5.295497894287109,0.8149221651285747
49,2,SVC Classifier,0,0.8,0.842326139088729,0.8284677107280296,6.155025005340576,0.8284677107280296
50,2,Decision Tree,0,0.8,0.737410071942446,0.7373106313424148,0.22932052612304688,0.7373106313424148
51,2,RandomForest,0,0.8,0.7392086330935251,0.7218721587449527,0.6345322132110596,0.7218721587449527
52,2,AdaBoost (Discrete),0,0.8,0.8357314148681055,0.8357966929273961,95.22271776199341,0.8357966929273961
53,2,AdaBoost (Real),0,0.8,0.8375299760191847,0.837528400482142,107.42346787452698,0.837528400482142
54,2,Logistic Regression (Penalty = L2),0,0.8,0.8705035971223022,0.869830722979536,0.44383883476257324,0.869830722979536
55,2,Naive Bayes,0,0.8,0.8075539568345323,0.7786582665407756,0.13881444931030273,0.7786582665407756
56,2,KNeighbors Classifier,1,0.8,0.7833133253301321,0.7821665486009328,5.600369930267334,0.7821665486009328
57,2,SVC Classifier,1,0.8,0.82953181272509,0.8205211387342379,6.669219732284546,0.8205211387342379
58,2,Decision Tree,1,0.8,0.726890756302521,0.7258005928426203,0.2208878993988037,0.7258005928426203
59,2,RandomForest,1,0.8,0.7310924369747899,0.7208596617746772,0.6805353164672852,0.7208596617746772
60,2,AdaBoost (Discrete),1,0.8,0.8157262905162065,0.8157685492000605,96.57519602775574,0.8157685492000605
61,2,AdaBoost (Real),1,0.8,0.8211284513805522,0.8209995999842475,107.647216796875,0.8209995999842475
62,2,Logistic Regression (Penalty = L2),1,0.8,0.8433373349339736,0.8429647108062378,0.5720193386077881,0.8429647108062378
63,2,Naive Bayes,1,0.8,0.7965186074429772,0.7684739439684787,0.13222622871398926,0.7684739439684787
64,2,KNeighbors Classifier,2,0.8,0.8079231692677071,0.8052611819089003,6.854919195175171,0.8052611819089003
65,2,SVC Classifier,2,0.8,0.8361344537815126,0.8201999404965455,8.281635761260986,0.8201999404965455
66,2,Decision Tree,2,0.8,0.748499399759904,0.7470975954489416,0.2561628818511963,0.7470975954489416
67,2,RandomForest,2,0.8,0.748499399759904,0.7359812811322981,0.7648217678070068,0.7359812811322981
68,2,AdaBoost (Discrete),2,0.8,0.8427370948379351,0.8427018906708864,118.82548236846924,0.8427018906708864
69,2,AdaBoost (Real),2,0.8,0.8427370948379351,0.84275496613516,134.03360104560852,0.84275496613516
70,2,Logistic Regression (Penalty = L2),2,0.8,0.8631452581032413,0.8619265587652923,0.5674495697021484,0.8619265587652923
71,2,Naive Bayes,2,0.8,0.8163265306122449,0.7875717288895827,0.07494807243347168,0.7875717288895827
72,3,KNeighbors Classifier,0,0.8,0.8009592326139089,0.8000010492554899,7.08038854598999,0.8000010492554899
73,3,SVC Classifier,0,0.8,0.8477218225419664,0.8391112817864105,8.505143642425537,0.8391112817864105
74,3,Decision Tree,0,0.8,0.7571942446043165,0.757012275583869,0.3422541618347168,0.757012275583869
75,3,RandomForest,0,0.8,0.7476019184652278,0.7301292493917321,0.8220617771148682,0.7301292493917321
76,3,AdaBoost (Discrete),0,0.8,0.8435251798561151,0.8433802483824177,122.0817301273346,0.8433802483824177
77,3,AdaBoost (Real),0,0.8,0.8381294964028777,0.8378564644614274,140.63212633132935,0.8378564644614274
78,3,Logistic Regression (Penalty = L2),0,0.8,0.867505995203837,0.8667632900521446,0.5256497859954834,0.8667632900521446
79,3,Naive Bayes,0,0.8,0.8141486810551559,0.7932898032322765,0.18065214157104492,0.7932898032322765
80,3,KNeighbors Classifier,1,0.8,0.7911164465786314,0.7891946891047446,6.920558214187622,0.7891946891047446
81,3,SVC Classifier,1,0.8,0.8361344537815126,0.8273808298974976,8.183282375335693,0.8273808298974976
82,3,Decision Tree,1,0.8,0.7136854741896759,0.7131043274257161,0.2655057907104492,0.7131043274257161
83,3,RandomForest,1,0.8,0.7430972388955582,0.7296617564687935,0.76528000831604,0.7296617564687935
84,3,AdaBoost (Discrete),1,0.8,0.8397358943577431,0.8396648883641862,117.90821743011475,0.8396648883641862
85,3,AdaBoost (Real),1,0.8,0.8235294117647058,0.8235329333927219,131.07393670082092,0.8235329333927219
86,3,Logistic Regression (Penalty = L2),1,0.8,0.8535414165666266,0.8531946041251379,0.5125408172607422,0.8531946041251379
87,3,Naive Bayes,1,0.8,0.8013205282112845,0.7791801064059909,0.13455986976623535,0.7791801064059909
88,3,KNeighbors Classifier,2,0.8,0.7983193277310925,0.796272672822308,6.902951955795288,0.796272672822308
89,3,SVC Classifier,2,0.8,0.8331332533013205,0.8209028037155103,8.343777179718018,0.8209028037155103
90,3,Decision Tree,2,0.8,0.7424969987995198,0.7415578453711196,0.2515888214111328,0.7415578453711196
91,3,RandomForest,2,0.8,0.7280912364945978,0.7131713327370041,0.7695834636688232,0.7131713327370041
92,3,AdaBoost (Discrete),2,0.8,0.8445378151260504,0.8444872740668231,114.29343152046204,0.8444872740668231
93,3,AdaBoost (Real),2,0.8,0.8391356542617047,0.8391841571624086,130.09338688850403,0.8391841571624086
94,3,Logistic Regression (Penalty = L2),2,0.8,0.8613445378151261,0.8600283829127744,0.5229411125183105,0.8600283829127744
95,3,Naive Bayes,2,0.8,0.8157262905162065,0.7939553504315854,0.1314687728881836,0.7939553504315854
96,4,KNeighbors Classifier,0,0.8,0.814748201438849,0.8142812070069015,6.184677839279175,0.8142812070069015
97,4,SVC Classifier,0,0.8,0.8489208633093526,0.8370680042809691,8.100107669830322,0.8370680042809691
98,4,Decision Tree,0,0.8,0.7655875299760192,0.7647300388634586,0.26451683044433594,0.7647300388634586
99,4,RandomForest,0,0.8,0.7392086330935251,0.7218721587449527,0.7735629081726074,0.7218721587449527
100,4,AdaBoost (Discrete),0,0.8,0.8447242206235012,0.8447238738640466,138.14393663406372,0.8447238738640466
101,4,AdaBoost (Real),0,0.8,0.8405275779376499,0.8399259342698238,163.94377160072327,0.8399259342698238
102,4,Logistic Regression (Penalty = L2),0,0.8,0.8741007194244604,0.8735993608360885,0.6524991989135742,0.8735993608360885
103,4,Naive Bayes,0,0.8,0.8105515587529976,0.7798322818099436,0.07877063751220703,0.7798322818099436
104,4,KNeighbors Classifier,1,0.8,0.7869147659063626,0.7853879041172531,7.855914115905762,0.7853879041172531
105,4,SVC Classifier,1,0.8,0.8451380552220888,0.8335574730456604,10.327366590499878,0.8335574730456604
106,4,Decision Tree,1,0.8,0.7148859543817527,0.7148407285067065,0.35663676261901855,0.7148407285067065
107,4,RandomForest,1,0.8,0.7310924369747899,0.7208596617746772,0.8779127597808838,0.7208596617746772
108,4,AdaBoost (Discrete),1,0.8,0.8337334933973589,0.8335352088024661,143.4584403038025,0.8335352088024661
109,4,AdaBoost (Real),1,0.8,0.8367346938775511,0.8365074026345733,156.4520981311798,0.8365074026345733
110,4,Logistic Regression (Penalty = L2),1,0.8,0.8649459783913566,0.8644700056649184,0.5814113616943359,0.8644700056649184
111,4,Naive Bayes,1,0.8,0.8067226890756303,0.7783525822882925,0.07861042022705078,0.7783525822882925
112,4,KNeighbors Classifier,2,0.8,0.8187274909963985,0.8174700106085069,7.309070825576782,0.8174700106085069
113,4,SVC Classifier,2,0.8,0.8451380552220888,0.8301460461279765,9.085830688476562,0.8301460461279765
114,4,Decision Tree,2,0.8,0.7539015606242497,0.7525871924270857,0.37453484535217285,0.7525871924270857
115,4,RandomForest,2,0.8,0.748499399759904,0.7359812811322981,0.9855754375457764,0.7359812811322981
116,4,AdaBoost (Discrete),2,0.8,0.8457382953181273,0.8457002724571432,143.15725898742676,0.8457002724571432
117,4,AdaBoost (Real),2,0.8,0.84093637454982,0.8408027674729005,148.7246377468109,0.8408027674729005
118,4,Logistic Regression (Penalty = L2),2,0.8,0.8679471788715486,0.8667736758612635,0.5517926216125488,0.8667736758612635
119,4,Naive Bayes,2,0.8,0.8145258103241296,0.7864645253694804,0.07478213310241699,0.7864645253694804
120,5,KNeighbors Classifier,0,0.8,0.8129496402877698,0.8123468557722008,4.8668413162231445,0.8123468557722008
121,5,SVC Classifier,0,0.8,0.8441247002398081,0.8300554602717474,7.9980387687683105,0.8300554602717474
122,5,Decision Tree,0,0.8,0.7673860911270983,0.7672462443192614,0.23398590087890625,0.7672462443192614
123,5,RandomForest,0,0.8,0.7673860911270983,0.7427910988334798,0.718101978302002,0.7427910988334798
124,5,AdaBoost (Discrete),0,0.8,0.842925659472422,0.8428367914997088,117.11548399925232,0.8428367914997088
125,5,AdaBoost (Real),0,0.8,0.8255395683453237,0.8253149733569237,134.35923600196838,0.8253149733569237
126,5,Logistic Regression (Penalty = L2),0,0.8,0.8687050359712231,0.8681150760738997,0.5656013488769531,0.8681150760738997
127,5,Naive Bayes,0,0.8,0.8057553956834532,0.777184450111764,0.15203309059143066,0.777184450111764
128,5,KNeighbors Classifier,1,0.8,0.8037214885954381,0.8028329964143595,5.504082441329956,0.8028329964143595
129,5,SVC Classifier,1,0.8,0.8301320528211285,0.820445903777974,8.559518575668335,0.820445903777974
130,5,Decision Tree,1,0.8,0.7274909963985594,0.726332486731923,0.3228633403778076,0.726332486731923
131,5,RandomForest,1,0.8,0.7689075630252101,0.7478814633285703,0.691068172454834,0.7478814633285703
132,5,AdaBoost (Discrete),1,0.8,0.8211284513805522,0.8210638582512096,122.87316942214966,0.8210638582512096
133,5,AdaBoost (Real),1,0.8,0.8277310924369747,0.8272688378151444,138.23106598854065,0.8272688378151444
134,5,Logistic Regression (Penalty = L2),1,0.8,0.8469387755102041,0.8465991753934167,0.5428318977355957,0.8465991753934167
135,5,Naive Bayes,1,0.8,0.7971188475390156,0.7705360588201597,0.15166997909545898,0.7705360588201597
136,5,KNeighbors Classifier,2,0.8,0.8073229291716687,0.8061645597309036,5.386446475982666,0.8061645597309036
137,5,SVC Classifier,2,0.8,0.8391356542617047,0.8236661315632703,8.545819759368896,0.8236661315632703
138,5,Decision Tree,2,0.8,0.7424969987995198,0.7417160270730223,0.22210907936096191,0.7417160270730223
139,5,RandomForest,2,0.8,0.7857142857142857,0.7580085582270358,0.9170899391174316,0.7580085582270358
140,5,AdaBoost (Discrete),2,0.8,0.8421368547418968,0.8420869730525725,124.68382549285889,0.8420869730525725
141,5,AdaBoost (Real),2,0.8,0.8361344537815126,0.8361913209086215,138.61476802825928,0.8361913209086215
142,5,Logistic Regression (Penalty = L2),2,0.8,0.8649459783913566,0.8636920369076319,0.5640199184417725,0.8636920369076319
143,5,Naive Bayes,2,0.8,0.8151260504201681,0.7857675443286437,0.07418417930603027,0.7857675443286437
144,6,KNeighbors Classifier,0,0.8,0.8189448441247003,0.8185574227261234,6.5993733406066895,0.8185574227261234
145,6,SVC Classifier,0,0.8,0.8483213429256595,0.8402128950250022,9.193897247314453,0.8402128950250022
146,6,Decision Tree,0,0.8,0.75,0.7483644840396372,0.22968125343322754,0.7483644840396372
147,6,RandomForest,0,0.8,0.7613908872901679,0.742753885116855,0.8426933288574219,0.742753885116855
148,6,AdaBoost (Discrete),0,0.8,0.8351318944844125,0.8349711961724309,129.27419447898865,0.8349711961724309
149,6,AdaBoost (Real),0,0.8,0.8279376498800959,0.8273428434881267,146.2932994365692,0.8273428434881267
150,6,Logistic Regression (Penalty = L2),0,0.8,0.8669064748201439,0.8662958711994129,0.5233805179595947,0.8662958711994129
151,6,Naive Bayes,0,0.8,0.8129496402877698,0.7922369953552573,0.08267712593078613,0.7922369953552573
152,6,KNeighbors Classifier,1,0.8,0.8013205282112845,0.8008697389158348,6.521895170211792,0.8008697389158348
153,6,SVC Classifier,1,0.8,0.8349339735894358,0.8261793417643251,9.057186126708984,0.8261793417643251
154,6,Decision Tree,1,0.8,0.7298919567827131,0.7287221868969986,0.3119683265686035,0.7287221868969986
155,6,RandomForest,1,0.8,0.7509003601440576,0.7383323288705296,0.9830341339111328,0.7383323288705296
156,6,AdaBoost (Discrete),1,0.8,0.8289315726290516,0.8289110963405051,130.75790739059448,0.8289110963405051
157,6,AdaBoost (Real),1,0.8,0.826530612244898,0.8265308263383274,146.16204023361206,0.8265308263383274
158,6,Logistic Regression (Penalty = L2),1,0.8,0.8529411764705882,0.8526569508970064,0.6152448654174805,0.8526569508970064
159,6,Naive Bayes,1,0.8,0.8055222088835534,0.7843932568785744,0.1549673080444336,0.7843932568785744
160,6,KNeighbors Classifier,2,0.8,0.8103241296518607,0.8089306331842204,6.155746936798096,0.8089306331842204
161,6,SVC Classifier,2,0.8,0.8355342136854742,0.822709782711986,9.129560708999634,0.822709782711986
162,6,Decision Tree,2,0.8,0.7352941176470589,0.7340282193608377,0.28715014457702637,0.7340282193608377
163,6,RandomForest,2,0.8,0.7665066026410564,0.7559310724771192,0.8044984340667725,0.7559310724771192
164,6,AdaBoost (Discrete),2,0.8,0.8385354141656662,0.8384563227928895,123.60551571846008,0.8384563227928895
165,6,AdaBoost (Real),2,0.8,0.8451380552220888,0.8451469089984358,141.88676404953003,0.8451469089984358
166,6,Logistic Regression (Penalty = L2),2,0.8,0.8607442977190877,0.8593822306162477,0.635516881942749,0.8593822306162477
167,6,Naive Bayes,2,0.8,0.8163265306122449,0.7951434178045299,0.16390299797058105,0.7951434178045299
168,7,KNeighbors Classifier,0,0.8,0.8129496402877698,0.8123468557722008,5.339474201202393,0.8123468557722008
169,7,SVC Classifier,0,0.8,0.8441247002398081,0.8300554602717474,8.722347974777222,0.8300554602717474
170,7,Decision Tree,0,0.8,0.7565947242206235,0.7556452496460364,0.31929874420166016,0.7556452496460364
171,7,RandomForest,0,0.8,0.7673860911270983,0.7427910988334798,0.7699370384216309,0.7427910988334798
172,7,AdaBoost (Discrete),0,0.8,0.842326139088729,0.8422424071054594,119.4765408039093,0.8422424071054594
173,7,AdaBoost (Real),0,0.8,0.829736211031175,0.8293075839209534,128.81922507286072,0.8293075839209534
174,7,Logistic Regression (Penalty = L2),0,0.8,0.8687050359712231,0.8681150760738997,0.5280578136444092,0.8681150760738997
175,7,Naive Bayes,0,0.8,0.8057553956834532,0.777184450111764,0.14790582656860352,0.777184450111764
176,7,KNeighbors Classifier,1,0.8,0.8037214885954381,0.8028329964143595,4.885717391967773,0.8028329964143595
177,7,SVC Classifier,1,0.8,0.8301320528211285,0.820445903777974,8.300243616104126,0.820445903777974
178,7,Decision Tree,1,0.8,0.741296518607443,0.7411712230259686,0.27030301094055176,0.7411712230259686
179,7,RandomForest,1,0.8,0.7689075630252101,0.7478814633285703,0.7978742122650146,0.7478814633285703
180,7,AdaBoost (Discrete),1,0.8,0.8211284513805522,0.8210638582512096,118.77289938926697,0.8210638582512096
181,7,AdaBoost (Real),1,0.8,0.8253301320528211,0.8249208888528163,133.03211092948914,0.8249208888528163
182,7,Logistic Regression (Penalty = L2),1,0.8,0.8469387755102041,0.8465991753934167,0.5934791564941406,0.8465991753934167
183,7,Naive Bayes,1,0.8,0.7971188475390156,0.7705360588201597,0.15472769737243652,0.7705360588201597
184,7,KNeighbors Classifier,2,0.8,0.8073229291716687,0.8061645597309036,4.89610481262207,0.8061645597309036
185,7,SVC Classifier,2,0.8,0.8391356542617047,0.8236661315632703,8.064467906951904,0.8236661315632703
186,7,Decision Tree,2,0.8,0.7286914765906363,0.7275181692074094,0.29489970207214355,0.7275181692074094
187,7,RandomForest,2,0.8,0.7857142857142857,0.7580085582270358,0.8493740558624268,0.7580085582270358
188,7,AdaBoost (Discrete),2,0.8,0.8427370948379351,0.8427007392852098,119.76541590690613,0.8427007392852098
189,7,AdaBoost (Real),2,0.8,0.8403361344537815,0.840198507315377,129.2590970993042,0.840198507315377
190,7,Logistic Regression (Penalty = L2),2,0.8,0.8649459783913566,0.8636920369076319,0.538327693939209,0.8636920369076319
191,7,Naive Bayes,2,0.8,0.8151260504201681,0.7857675443286437,0.13997292518615723,0.7857675443286437
192,8,KNeighbors Classifier,0,0.8,0.8189448441247003,0.8185574227261234,5.963724136352539,0.8185574227261234
193,8,SVC Classifier,0,0.8,0.8483213429256595,0.8402128950250022,8.370436906814575,0.8402128950250022
194,8,Decision Tree,0,0.8,0.763189448441247,0.76278488880756,0.2030632495880127,0.76278488880756
195,8,RandomForest,0,0.8,0.7613908872901679,0.742753885116855,0.7991299629211426,0.742753885116855
196,8,AdaBoost (Discrete),0,0.8,0.8357314148681055,0.8356168930399562,115.48750424385071,0.8356168930399562
197,8,AdaBoost (Real),0,0.8,0.8351318944844125,0.8343272189408021,123.26576542854309,0.8343272189408021
198,8,Logistic Regression (Penalty = L2),0,0.8,0.8669064748201439,0.8662958711994129,0.44435548782348633,0.8662958711994129
199,8,Naive Bayes,0,0.8,0.8129496402877698,0.7922369953552573,0.19215178489685059,0.7922369953552573
200,8,KNeighbors Classifier,1,0.8,0.8013205282112845,0.8008697389158348,5.324928283691406,0.8008697389158348
201,8,SVC Classifier,1,0.8,0.8349339735894358,0.8261793417643251,7.808925151824951,0.8261793417643251
202,8,Decision Tree,1,0.8,0.7328931572629052,0.732711361191064,0.2705810070037842,0.732711361191064
203,8,RandomForest,1,0.8,0.7509003601440576,0.7383323288705296,0.763911247253418,0.7383323288705296
204,8,AdaBoost (Discrete),1,0.8,0.8289315726290516,0.8289110963405051,109.78996729850769,0.8289110963405051
205,8,AdaBoost (Real),1,0.8,0.8283313325330132,0.8282865965167672,119.19278764724731,0.8282865965167672
206,8,Logistic Regression (Penalty = L2),1,0.8,0.8529411764705882,0.8526569508970064,0.4330470561981201,0.8526569508970064
207,8,Naive Bayes,1,0.8,0.8055222088835534,0.7843932568785744,0.11502242088317871,0.7843932568785744
208,8,KNeighbors Classifier,2,0.8,0.8103241296518607,0.8089306331842204,5.168798923492432,0.8089306331842204
209,8,SVC Classifier,2,0.8,0.8355342136854742,0.822709782711986,7.075366258621216,0.822709782711986
210,8,Decision Tree,2,0.8,0.7310924369747899,0.7297803056411984,0.22930121421813965,0.7297803056411984
211,8,RandomForest,2,0.8,0.7665066026410564,0.7559310724771192,0.7557587623596191,0.7559310724771192
212,8,AdaBoost (Discrete),2,0.8,0.8385354141656662,0.8384563227928895,102.41334414482117,0.8384563227928895
213,8,AdaBoost (Real),2,0.8,0.8373349339735895,0.8372986630039863,116.9274160861969,0.8372986630039863
214,8,Logistic Regression (Penalty = L2),2,0.8,0.8607442977190877,0.8593822306162477,0.7073714733123779,0.8593822306162477
215,8,Naive Bayes,2,0.8,0.8163265306122449,0.7951434178045299,0.14639019966125488,0.7951434178045299
216,9,KNeighbors Classifier,0,0.8,0.8039568345323741,0.8030180110678257,5.092110633850098,0.8030180110678257
217,9,SVC Classifier,0,0.8,0.8405275779376499,0.8316681390954251,7.309401988983154,0.8316681390954251
218,9,Decision Tree,0,0.8,0.7146282973621103,0.7142732612576683,0.28351664543151855,0.7142732612576683
219,9,RandomForest,0,0.8,0.763189448441247,0.7513756715005133,0.8270344734191895,0.7513756715005133
220,9,AdaBoost (Discrete),0,0.8,0.8327338129496403,0.8326431422896704,109.52757406234741,0.8326431422896704
221,9,AdaBoost (Real),0,0.8,0.8285371702637889,0.8282608552474315,124.23359632492065,0.8282608552474315
222,9,Logistic Regression (Penalty = L2),0,0.8,0.8591127098321343,0.8585814440451071,0.5019700527191162,0.8585814440451071
223,9,Naive Bayes,0,0.8,0.8111510791366906,0.7929266990065577,0.14037704467773438,0.7929266990065577
224,9,KNeighbors Classifier,1,0.8,0.7947178871548619,0.793560509116586,5.039738893508911,0.793560509116586
225,9,SVC Classifier,1,0.8,0.8259303721488596,0.8179303276620036,7.436255693435669,0.8179303276620036
226,9,Decision Tree,1,0.8,0.741296518607443,0.7401877614791568,0.19151830673217773,0.7401877614791568
227,9,RandomForest,1,0.8,0.741296518607443,0.7211997444346253,0.7949001789093018,0.7211997444346253
228,9,AdaBoost (Discrete),1,0.8,0.8205282112845138,0.8205362326471912,99.87182641029358,0.8205362326471912
229,9,AdaBoost (Real),1,0.8,0.8235294117647058,0.8234029483043556,109.94488978385925,0.8234029483043556
230,9,Logistic Regression (Penalty = L2),1,0.8,0.8343337334933973,0.8340276303533939,0.5102651119232178,0.8340276303533939
231,9,Naive Bayes,1,0.8,0.8013205282112845,0.7838539026079037,0.06269288063049316,0.7838539026079037
232,9,KNeighbors Classifier,2,0.8,0.8013205282112845,0.7987234090314144,4.619165658950806,0.7987234090314144
233,9,SVC Classifier,2,0.8,0.8307322929171669,0.817446395259829,7.211407661437988,0.817446395259829
234,9,Decision Tree,2,0.8,0.7328931572629052,0.7326344194274608,0.23976969718933105,0.7326344194274608
235,9,RandomForest,2,0.8,0.7671068427370948,0.7576766391255995,0.6595010757446289,0.7576766391255995
236,9,AdaBoost (Discrete),2,0.8,0.8283313325330132,0.8282619026196241,97.45208168029785,0.8282619026196241
237,9,AdaBoost (Real),2,0.8,0.8271308523409364,0.8269866426088016,109.43523049354553,0.8269866426088016
238,9,Logistic Regression (Penalty = L2),2,0.8,0.8565426170468188,0.8550544808314866,0.43169164657592773,0.8550544808314866
239,9,Naive Bayes,2,0.8,0.8181272509003601,0.7996587726690929,0.16443634033203125,0.7996587726690929
240,10,KNeighbors Classifier,0,0.8,0.8057553956834532,0.8051686935150116,7.085612535476685,0.8051686935150116
241,10,SVC Classifier,0,0.8,0.8477218225419664,0.8353209744390325,8.101526737213135,0.8353209744390325
242,10,Decision Tree,0,0.8,0.7356115107913669,0.7348456825549423,0.2980642318725586,0.7348456825549423
243,10,RandomForest,0,0.8,0.7889688249400479,0.7860625208330677,0.7809808254241943,0.7860625208330677
244,10,AdaBoost (Discrete),0,0.8,0.8441247002398081,0.8440554003836421,122.40312814712524,0.8440554003836421
245,10,AdaBoost (Real),0,0.8,0.8387290167865707,0.838313483435756,138.39071893692017,0.838313483435756
246,10,Logistic Regression (Penalty = L2),0,0.8,0.8752997601918465,0.8746928385109388,0.5292305946350098,0.8746928385109388
247,10,Naive Bayes,0,0.8,0.8087529976019184,0.7779520232332706,0.23212242126464844,0.7779520232332706
248,10,KNeighbors Classifier,1,0.8,0.7935174069627852,0.7918575439008303,7.820204257965088,0.7918575439008303
249,10,SVC Classifier,1,0.8,0.8397358943577431,0.8282842838320553,8.465565919876099,0.8282842838320553
250,10,Decision Tree,1,0.8,0.7172869147659063,0.7172756393923297,0.3610377311706543,0.7172756393923297
251,10,RandomForest,1,0.8,0.787515006002401,0.781209741353475,0.7893781661987305,0.781209741353475
252,10,AdaBoost (Discrete),1,0.8,0.8259303721488596,0.8258204328098518,132.8955376148224,0.8258204328098518
253,10,AdaBoost (Real),1,0.8,0.82953181272509,0.8291568323149563,136.89522004127502,0.8291568323149563
254,10,Logistic Regression (Penalty = L2),1,0.8,0.8631452581032413,0.8626680259218077,0.512056827545166,0.8626680259218077
255,10,Naive Bayes,1,0.8,0.8061224489795918,0.7786019144370956,0.11327528953552246,0.7786019144370956
256,10,KNeighbors Classifier,2,0.8,0.8181272509003601,0.8153945909207705,7.243347406387329,0.8153945909207705
257,10,SVC Classifier,2,0.8,0.8451380552220888,0.8312121888116254,7.820971965789795,0.8312121888116254
258,10,Decision Tree,2,0.8,0.7551020408163265,0.7544551406729163,0.30236124992370605,0.7544551406729163
259,10,RandomForest,2,0.8,0.7815126050420168,0.7741242968777272,0.7616190910339355,0.7741242968777272
260,10,AdaBoost (Discrete),2,0.8,0.8463385354141657,0.8463191394037478,118.9531352519989,0.8463191394037478
261,10,AdaBoost (Real),2,0.8,0.8559423769507803,0.8557208431915779,122.99433612823486,0.8557208431915779
262,10,Logistic Regression (Penalty = L2),2,0.8,0.8691476590636255,0.8680196845450042,0.4614870548248291,0.8680196845450042
263,10,Naive Bayes,2,0.8,0.8163265306122449,0.7883254435415947,0.1498870849609375,0.7883254435415947
264,11,KNeighbors Classifier,0,0.8,0.8051558752997602,0.8044383405942875,7.134803295135498,0.8044383405942875
265,11,SVC Classifier,0,0.8,0.8489208633093526,0.8366021566130785,7.29451322555542,0.8366021566130785
266,11,Decision Tree,0,0.8,0.7541966426858513,0.7538713124585471,0.26471567153930664,0.7538713124585471
267,11,RandomForest,0,0.8,0.7817745803357314,0.7677782907309113,0.6382808685302734,0.7677782907309113
268,11,AdaBoost (Discrete),0,0.8,0.8465227817745803,0.8464968608937052,110.58677816390991,0.8464968608937052
269,11,AdaBoost (Real),0,0.8,0.830335731414868,0.8296701253750687,121.11825895309448,0.8296701253750687
270,11,Logistic Regression (Penalty = L2),0,0.8,0.8752997601918465,0.874718749961572,0.4761340618133545,0.874718749961572
271,11,Naive Bayes,0,0.8,0.8093525179856115,0.778854520589206,0.1396007537841797,0.778854520589206
272,11,KNeighbors Classifier,1,0.8,0.7839135654261705,0.782241003780589,7.109779119491577,0.782241003780589
273,11,SVC Classifier,1,0.8,0.8391356542617047,0.8275229927010589,7.308028221130371,0.8275229927010589
274,11,Decision Tree,1,0.8,0.7250900360144058,0.7238843691950736,0.26389575004577637,0.7238843691950736
275,11,RandomForest,1,0.8,0.7689075630252101,0.7532659296063376,0.614124059677124,0.7532659296063376
276,11,AdaBoost (Discrete),1,0.8,0.8271308523409364,0.8270682514135151,104.91758441925049,0.8270682514135151
277,11,AdaBoost (Real),1,0.8,0.8319327731092437,0.8318356729690405,132.76166558265686,0.8318356729690405
278,11,Logistic Regression (Penalty = L2),1,0.8,0.8631452581032413,0.8626680259218077,0.4531669616699219,0.8626680259218077
279,11,Naive Bayes,1,0.8,0.804921968787515,0.7772368817095535,0.1206510066986084,0.7772368817095535
280,11,KNeighbors Classifier,2,0.8,0.8097238895558223,0.8070599457285577,6.927101135253906,0.8070599457285577
281,11,SVC Classifier,2,0.8,0.8475390156062425,0.8338251672607434,7.0617499351501465,0.8338251672607434
282,11,Decision Tree,2,0.8,0.7460984393757503,0.7452792974948249,0.28757643699645996,0.7452792974948249
283,11,RandomForest,2,0.8,0.7617046818727491,0.7482683921508059,0.6788091659545898,0.7482683921508059
284,11,AdaBoost (Discrete),2,0.8,0.8517406962785115,0.8513723523293824,110.57580399513245,0.8513723523293824
285,11,AdaBoost (Real),2,0.8,0.8559423769507803,0.8559369655092657,111.94049119949341,0.8559369655092657
286,11,Logistic Regression (Penalty = L2),2,0.8,0.868547418967587,0.8673790793790689,0.4772927761077881,0.8673790793790689
287,11,Naive Bayes,2,0.8,0.8163265306122449,0.7879263587061585,0.1007986068725586,0.7879263587061585
288,12,KNeighbors Classifier,0,0.8,0.8171462829736211,0.8158828088231949,2.574782133102417,0.8158828088231949
289,12,SVC Classifier,0,0.8,0.8447242206235012,0.8360844383862095,5.0173561573028564,0.8360844383862095
290,12,Decision Tree,0,0.8,0.7320143884892086,0.7317876055962343,0.2333509922027588,0.7317876055962343
291,12,RandomForest,0,0.8,0.7931654676258992,0.7886855228876124,0.550358772277832,0.7886855228876124
292,12,AdaBoost (Discrete),0,0.8,0.8309352517985612,0.830795414965956,70.70528936386108,0.830795414965956
293,12,AdaBoost (Real),0,0.8,0.8249400479616307,0.8247662332260184,80.58970236778259,0.8247662332260184
294,12,Logistic Regression (Penalty = L2),0,0.8,0.8579136690647482,0.8573874031729762,0.3125944137573242,0.8573874031729762
295,12,Naive Bayes,0,0.8,0.8111510791366906,0.7935579566642336,0.14452409744262695,0.7935579566642336
296,12,KNeighbors Classifier,1,0.8,0.8061224489795918,0.8046002218872375,2.582482099533081,0.8046002218872375
297,12,SVC Classifier,1,0.8,0.8247298919567827,0.8155487428577948,5.355714321136475,0.8155487428577948
298,12,Decision Tree,1,0.8,0.7310924369747899,0.7302373972289221,0.1461787223815918,0.7302373972289221
299,12,RandomForest,1,0.8,0.765906362545018,0.7553748065275019,0.5301549434661865,0.7553748065275019
300,12,AdaBoost (Discrete),1,0.8,0.8115246098439376,0.8114913139642704,71.45473742485046,0.8114913139642704
301,12,AdaBoost (Real),1,0.8,0.819327731092437,0.8193504849942818,80.86694502830505,0.8193504849942818
302,12,Logistic Regression (Penalty = L2),1,0.8,0.8337334933973589,0.8335176565898528,0.3483912944793701,0.8335176565898528
303,12,Naive Bayes,1,0.8,0.7989195678271308,0.7798217164194536,0.050716400146484375,0.7798217164194536
304,12,KNeighbors Classifier,2,0.8,0.7959183673469388,0.7942451512772373,2.5324394702911377,0.7942451512772373
305,12,SVC Classifier,2,0.8,0.8325330132052821,0.8190059044145251,5.158409357070923,0.8190059044145251
306,12,Decision Tree,2,0.8,0.734093637454982,0.7339088375097126,0.19411325454711914,0.7339088375097126
307,12,RandomForest,2,0.8,0.7713085234093637,0.7674307208135225,0.5854544639587402,0.7674307208135225
308,12,AdaBoost (Discrete),2,0.8,0.8277310924369747,0.8271007287858754,70.90941858291626,0.8271007287858754
309,12,AdaBoost (Real),2,0.8,0.8301320528211285,0.8299489312228684,75.01507902145386,0.8299489312228684
310,12,Logistic Regression (Penalty = L2),2,0.8,0.8547418967587035,0.85315994278741,0.3287239074707031,0.85315994278741
311,12,Naive Bayes,2,0.8,0.8163265306122449,0.7975798067589922,0.12409186363220215,0.7975798067589922
