,feat_set_id,classifier,fold_id,feat_th,score,geo_score,exec_t,geo_score_woz
0,0,KNeighbors Classifier,0,0.55,0.8194029850746268,0.7986030715123732,6.9051268100738525,0.7986030715123732
1,0,SVC Classifier,0,0.55,0.7656716417910447,0.7386052600426835,8.713226079940796,0.7386052600426835
2,0,Decision Tree,0,0.55,0.673134328358209,0.6561824971745018,0.4631340503692627,0.6561824971745018
3,0,RandomForest,0,0.55,0.6253731343283582,0.5091830385846299,1.6623163223266602,0.5091830385846299
4,0,AdaBoost (Discrete),0,0.55,0.7716417910447761,0.7593504260807953,399.24739480018616,0.7593504260807953
5,0,AdaBoost (Real),0,0.55,0.5313432835820896,0.34048298349319206,441.36964416503906,0.34048298349319206
6,0,Logistic Regression (Penalty = L2),0,0.55,0.8119402985074626,0.7952417032227862,3.92596697807312,0.7952417032227862
7,0,Naive Bayes,0,0.55,0.7701492537313432,0.7453971557236869,0.4649083614349365,0.7453971557236869
8,0,KNeighbors Classifier,1,0.55,0.8238805970149253,0.7903785210823551,7.142901182174683,0.7903785210823551
9,0,SVC Classifier,1,0.55,0.7701492537313432,0.7386684833595544,8.363435745239258,0.7386684833595544
10,0,Decision Tree,1,0.55,0.6895522388059702,0.6741240400953327,0.45610785484313965,0.6741240400953327
11,0,RandomForest,1,0.55,0.6328358208955224,0.45531178138485456,1.6200165748596191,0.45531178138485456
12,0,AdaBoost (Discrete),1,0.55,0.7776119402985074,0.7650850518372215,424.3273856639862,0.7650850518372215
13,0,AdaBoost (Real),1,0.55,0.5447761194029851,0.4479218461947462,469.0426528453827,0.4479218461947462
14,0,Logistic Regression (Penalty = L2),1,0.55,0.8059701492537313,0.7914173774265606,4.42861270904541,0.7914173774265606
15,0,Naive Bayes,1,0.55,0.764179104477612,0.7362027005101287,0.7584843635559082,0.7362027005101287
16,0,KNeighbors Classifier,2,0.55,0.8121212121212121,0.7751917561699362,9.845149993896484,0.7751917561699362
17,0,SVC Classifier,2,0.55,0.7954545454545454,0.7756429594744797,12.34848403930664,0.7756429594744797
18,0,Decision Tree,2,0.55,0.6848484848484848,0.6399564159097523,0.5633323192596436,0.6399564159097523
19,0,RandomForest,2,0.55,0.6545454545454545,0.5940156565100815,2.6408402919769287,0.5940156565100815
20,0,AdaBoost (Discrete),2,0.55,0.7772727272727272,0.7596038528155715,467.1511116027832,0.7596038528155715
21,0,AdaBoost (Real),2,0.55,0.5454545454545454,0.32913336621676714,407.21234607696533,0.32913336621676714
22,0,Logistic Regression (Penalty = L2),2,0.55,0.8272727272727273,0.8061427300302616,3.8449010848999023,0.8061427300302616
23,0,Naive Bayes,2,0.55,0.7757575757575758,0.7530523187376408,0.40450286865234375,0.7530523187376408
24,1,KNeighbors Classifier,0,0.55,0.8164179104477612,0.7907532747872819,6.637400150299072,0.7907532747872819
25,1,SVC Classifier,0,0.55,0.7626865671641792,0.7354786862991463,8.153165102005005,0.7354786862991463
26,1,Decision Tree,0,0.55,0.6835820895522388,0.6565593641093227,0.5466635227203369,0.6565593641093227
27,1,RandomForest,0,0.55,0.6238805970149254,0.5074446648016308,1.4774320125579834,0.5074446648016308
28,1,AdaBoost (Discrete),0,0.55,0.7865671641791044,0.7761084916831189,434.70481514930725,0.7761084916831189
29,1,AdaBoost (Real),0,0.55,0.5328358208955224,0.34108615761380573,437.71334195137024,0.34108615761380573
30,1,Logistic Regression (Penalty = L2),0,0.55,0.8104477611940298,0.7927832660948115,4.11141300201416,0.7927832660948115
31,1,Naive Bayes,0,0.55,0.7686567164179104,0.7453092676057086,0.4103386402130127,0.7453092676057086
32,1,KNeighbors Classifier,1,0.55,0.8238805970149253,0.7908938346199371,8.3980393409729,0.7908938346199371
33,1,SVC Classifier,1,0.55,0.7791044776119403,0.7533870835283579,9.44617486000061,0.7533870835283579
34,1,Decision Tree,1,0.55,0.6432835820895523,0.6144752848776462,0.4623887538909912,0.6144752848776462
35,1,RandomForest,1,0.55,0.6119402985074627,0.436097828727346,1.7534170150756836,0.436097828727346
36,1,AdaBoost (Discrete),1,0.55,0.7582089552238805,0.7442469449950413,415.11391711235046,0.7442469449950413
37,1,AdaBoost (Real),1,0.55,0.7,0.6880563285019518,419.1948595046997,0.6880563285019518
38,1,Logistic Regression (Penalty = L2),1,0.55,0.808955223880597,0.7909426204656838,4.165427207946777,0.7909426204656838
39,1,Naive Bayes,1,0.55,0.7701492537313432,0.7471889666257868,0.47609758377075195,0.7471889666257868
40,1,KNeighbors Classifier,2,0.55,0.8227272727272728,0.7893105837208514,6.917892932891846,0.7893105837208514
41,1,SVC Classifier,2,0.55,0.7909090909090909,0.7679449216236016,7.823429346084595,0.7679449216236016
42,1,Decision Tree,2,0.55,0.7272727272727273,0.7052679070842428,0.4123072624206543,0.7052679070842428
43,1,RandomForest,2,0.55,0.6530303030303031,0.5931094367222772,1.372220754623413,0.5931094367222772
44,1,AdaBoost (Discrete),2,0.55,0.7893939393939394,0.7735383098143455,367.2222511768341,0.7735383098143455
45,1,AdaBoost (Real),2,0.55,0.6181818181818182,0.5629231193336809,370.32213735580444,0.5629231193336809
46,1,Logistic Regression (Penalty = L2),2,0.55,0.8393939393939394,0.8254427032105554,3.414337396621704,0.8254427032105554
47,1,Naive Bayes,2,0.55,0.7893939393939394,0.7718012064922789,0.4113905429840088,0.7718012064922789
48,2,KNeighbors Classifier,0,0.55,0.8029850746268656,0.7730249818973742,5.7468578815460205,0.7730249818973742
49,2,SVC Classifier,0,0.55,0.7597014925373134,0.7363006646979847,7.643018007278442,0.7363006646979847
50,2,Decision Tree,0,0.55,0.6268656716417911,0.6072946245510017,0.4698805809020996,0.6072946245510017
51,2,RandomForest,0,0.55,0.582089552238806,0.4261600279343033,1.627866268157959,0.4261600279343033
52,2,AdaBoost (Discrete),0,0.55,0.7716417910447761,0.7562199411035349,358.9279797077179,0.7562199411035349
53,2,AdaBoost (Real),0,0.55,0.5328358208955224,0.34108615761380573,1440.552083015442,0.34108615761380573
54,2,Logistic Regression (Penalty = L2),0,0.55,0.8074626865671641,0.7942126690805129,3.2124459743499756,0.7942126690805129
55,2,Naive Bayes,0,0.55,0.7597014925373134,0.7323538882766708,0.43353796005249023,0.7323538882766708
56,2,KNeighbors Classifier,1,0.55,0.8208955223880597,0.7915457446529846,5.026890516281128,0.7915457446529846
57,2,SVC Classifier,1,0.55,0.7671641791044777,0.7202381588920213,7.27463173866272,0.7202381588920213
58,2,Decision Tree,1,0.55,0.7044776119402985,0.685791832760585,0.48108506202697754,0.685791832760585
59,2,RandomForest,1,0.55,0.5955223880597015,0.4032847547025972,0.4427216053009033,0.4032847547025972
60,2,AdaBoost (Discrete),1,0.55,0.7686567164179104,0.7517980286399064,282.67024874687195,0.7517980286399064
61,2,AdaBoost (Real),1,0.55,0.6611940298507463,0.6187853822923504,258.4506850242615,0.6187853822923504
62,2,Logistic Regression (Penalty = L2),1,0.55,0.7940298507462686,0.77012852012047,2.2417657375335693,0.77012852012047
63,2,Naive Bayes,1,0.55,0.7820895522388059,0.7579267049563608,0.2870175838470459,0.7579267049563608
64,2,KNeighbors Classifier,2,0.55,0.8196969696969697,0.7814340124491114,4.16878342628479,0.7814340124491114
65,2,SVC Classifier,2,0.55,0.7863636363636364,0.7560480754150657,5.938277959823608,0.7560480754150657
66,2,Decision Tree,2,0.55,0.6742424242424242,0.6487632895197392,0.31610560417175293,0.6487632895197392
67,2,RandomForest,2,0.55,0.6681818181818182,0.5719310736606557,1.0121324062347412,0.5719310736606557
68,2,AdaBoost (Discrete),2,0.55,0.7757575757575758,0.758906650424443,256.55386090278625,0.758906650424443
69,2,AdaBoost (Real),2,0.55,0.5136363636363637,0.3094525960070033,253.61174130439758,0.3094525960070033
70,2,Logistic Regression (Penalty = L2),2,0.55,0.8166666666666667,0.7928328415170514,2.1007134914398193,0.7928328415170514
71,2,Naive Bayes,2,0.55,0.7863636363636364,0.764395015239862,0.32274675369262695,0.764395015239862
72,3,KNeighbors Classifier,0,0.55,0.8208955223880597,0.7978403797423305,3.2859151363372803,0.7978403797423305
73,3,SVC Classifier,0,0.55,0.7686567164179104,0.7449688653618821,4.082808494567871,0.7449688653618821
74,3,Decision Tree,0,0.55,0.7268656716417911,0.7010962039160736,0.27091097831726074,0.7010962039160736
75,3,RandomForest,0,0.55,0.5805970149253732,0.5829644656690222,0.9193742275238037,0.0
76,3,AdaBoost (Discrete),0,0.55,0.7835820895522388,0.7745406848680079,213.85772895812988,0.7745406848680079
77,3,AdaBoost (Real),0,0.55,0.5328358208955224,0.34108615761380573,214.63600969314575,0.34108615761380573
78,3,Logistic Regression (Penalty = L2),0,0.55,0.8059701492537313,0.7892182087787293,1.812556266784668,0.7892182087787293
79,3,Naive Bayes,0,0.55,0.7731343283582089,0.7511635250270707,0.27085065841674805,0.7511635250270707
80,3,KNeighbors Classifier,1,0.55,0.8208955223880597,0.7854524214223709,3.0599467754364014,0.7854524214223709
81,3,SVC Classifier,1,0.55,0.7701492537313432,0.7295219634070241,4.333167552947998,0.7295219634070241
82,3,Decision Tree,1,0.55,0.6835820895522388,0.6664240518780542,0.2629084587097168,0.6664240518780542
83,3,RandomForest,1,0.55,0.5701492537313433,0.6766406809197422,0.8600482940673828,0.0
84,3,AdaBoost (Discrete),1,0.55,0.7731343283582089,0.7620079883443263,192.62793850898743,0.7620079883443263
85,3,AdaBoost (Real),1,0.55,0.6925373134328359,0.6650097818967003,208.87131190299988,0.6650097818967003
86,3,Logistic Regression (Penalty = L2),1,0.55,0.808955223880597,0.7908104258029308,2.04642391204834,0.7908104258029308
87,3,Naive Bayes,1,0.55,0.7761194029850746,0.7536452271824483,0.23120355606079102,0.7536452271824483
88,3,KNeighbors Classifier,2,0.55,0.8257575757575758,0.7899186713064251,2.7729010581970215,0.7899186713064251
89,3,SVC Classifier,2,0.55,0.7909090909090909,0.768423071723368,4.2170727252960205,0.768423071723368
90,3,Decision Tree,2,0.55,0.6696969696969697,0.6453365404031974,0.1747434139251709,0.6453365404031974
91,3,RandomForest,2,0.55,0.5848484848484848,0.48463352256954045,0.890369176864624,0.0
92,3,AdaBoost (Discrete),2,0.55,0.7560606060606061,0.7317215884023914,186.2118730545044,0.7317215884023914
93,3,AdaBoost (Real),2,0.55,0.5848484848484848,0.44424884105997986,168.37651920318604,0.44424884105997986
94,3,Logistic Regression (Penalty = L2),2,0.55,0.8363636363636363,0.815699399911483,1.5768651962280273,0.815699399911483
95,3,Naive Bayes,2,0.55,0.7878787878787878,0.7712808284326831,0.15317845344543457,0.7712808284326831
96,4,KNeighbors Classifier,0,0.55,0.8208955223880597,0.7928775438308653,1.766920566558838,0.7928775438308653
97,4,SVC Classifier,0,0.55,0.7701492537313432,0.7425450949272284,2.9601521492004395,0.7425450949272284
98,4,Decision Tree,0,0.55,0.6955223880597015,0.6728863171653886,0.15756511688232422,0.6728863171653886
99,4,RandomForest,0,0.55,0.6373134328358209,0.493586327976057,0.756859540939331,0.493586327976057
100,4,AdaBoost (Discrete),0,0.55,0.7686567164179104,0.7553085962405497,136.3339376449585,0.7553085962405497
101,4,AdaBoost (Real),0,0.55,0.5328358208955224,0.34108615761380573,143.88330364227295,0.34108615761380573
102,4,Logistic Regression (Penalty = L2),0,0.55,0.8074626865671641,0.7936881921450288,1.349912166595459,0.7936881921450288
103,4,Naive Bayes,0,0.55,0.7716417910447761,0.7493646624441422,0.23878240585327148,0.7493646624441422
104,4,KNeighbors Classifier,1,0.55,0.8298507462686567,0.8004616749592174,1.7892866134643555,0.8004616749592174
105,4,SVC Classifier,1,0.55,0.7791044776119403,0.7432106572305558,2.737596273422241,0.7432106572305558
106,4,Decision Tree,1,0.55,0.7149253731343284,0.7010885719086314,0.23623871803283691,0.7010885719086314
107,4,RandomForest,1,0.55,0.6537313432835821,0.7037466746773908,0.683516263961792,0.0
108,4,AdaBoost (Discrete),1,0.55,0.7805970149253731,0.7647496663060086,129.02550792694092,0.7647496663060086
109,4,AdaBoost (Real),1,0.55,0.6119402985074627,0.4730323937577529,139.06409859657288,0.4730323937577529
110,4,Logistic Regression (Penalty = L2),1,0.55,0.8238805970149253,0.8072351769493255,1.4295856952667236,0.8072351769493255
111,4,Naive Bayes,1,0.55,0.7820895522388059,0.7560018299633021,0.21396827697753906,0.7560018299633021
112,4,KNeighbors Classifier,2,0.55,0.8363636363636363,0.811598984150424,1.9172556400299072,0.811598984150424
113,4,SVC Classifier,2,0.55,0.7924242424242425,0.769533081988973,2.9704599380493164,0.769533081988973
114,4,Decision Tree,2,0.55,0.7151515151515152,0.6862076020208894,0.22583389282226562,0.6862076020208894
115,4,RandomForest,2,0.55,0.6924242424242424,0.587236114396846,0.6242363452911377,0.587236114396846
116,4,AdaBoost (Discrete),2,0.55,0.7696969696969697,0.7454501559149903,148.32621312141418,0.7454501559149903
117,4,AdaBoost (Real),2,0.55,0.5212121212121212,0.2887197521733292,144.28662252426147,0.2887197521733292
118,4,Logistic Regression (Penalty = L2),2,0.55,0.8333333333333334,0.8162371590458523,1.3274445533752441,0.8162371590458523
119,4,Naive Bayes,2,0.55,0.7909090909090909,0.7716560082170704,0.16071748733520508,0.7716560082170704
120,5,KNeighbors Classifier,0,0.55,0.8149253731343283,0.7868170955626991,2.042302370071411,0.7868170955626991
121,5,SVC Classifier,0,0.55,0.7686567164179104,0.7430699120197158,3.1626393795013428,0.7430699120197158
122,5,Decision Tree,0,0.55,0.6880597014925374,0.6640755617500773,0.238816499710083,0.6640755617500773
123,5,RandomForest,0,0.55,0.6716417910447762,0.5331402700136892,0.722938060760498,0.5331402700136892
124,5,AdaBoost (Discrete),0,0.55,0.7716417910447761,0.7570454003480227,151.69336080551147,0.7570454003480227
125,5,AdaBoost (Real),0,0.55,0.5328358208955224,0.34108615761380573,157.90138459205627,0.34108615761380573
126,5,Logistic Regression (Penalty = L2),0,0.55,0.8119402985074626,0.799522684550583,1.266390085220337,0.799522684550583
127,5,Naive Bayes,0,0.55,0.7746268656716417,0.7526113948522891,0.23456287384033203,0.7526113948522891
128,5,KNeighbors Classifier,1,0.55,0.8253731343283582,0.7974842423779875,1.9928038120269775,0.7974842423779875
129,5,SVC Classifier,1,0.55,0.7835820895522388,0.7517214961171003,3.1227855682373047,0.7517214961171003
130,5,Decision Tree,1,0.55,0.7149253731343284,0.6943355190713449,0.15249896049499512,0.6943355190713449
131,5,RandomForest,1,0.55,0.6582089552238806,0.4716450929262668,0.6119124889373779,0.4716450929262668
132,5,AdaBoost (Discrete),1,0.55,0.7671641791044777,0.7163667565907265,139.94640588760376,0.7163667565907265
133,5,AdaBoost (Real),1,0.55,0.7089552238805971,0.6860501990116762,157.32789874076843,0.6860501990116762
134,5,Logistic Regression (Penalty = L2),1,0.55,0.8134328358208955,0.7946868119317477,1.5093321800231934,0.7946868119317477
135,5,Naive Bayes,1,0.55,0.7731343283582089,0.7460295211882964,0.24229669570922852,0.7460295211882964
136,5,KNeighbors Classifier,2,0.55,0.8242424242424242,0.7924650120784725,2.49029803276062,0.7924650120784725
137,5,SVC Classifier,2,0.55,0.796969696969697,0.7780279184711427,3.8396639823913574,0.7780279184711427
138,5,Decision Tree,2,0.55,0.759090909090909,0.743509116321024,0.17863917350769043,0.743509116321024
139,5,RandomForest,2,0.55,0.6575757575757576,0.5124512097317016,0.7974705696105957,0.0
140,5,AdaBoost (Discrete),2,0.55,0.7772727272727272,0.7566564868800051,175.45453906059265,0.7566564868800051
141,5,AdaBoost (Real),2,0.55,0.546969696969697,0.4456889759808005,169.68536281585693,0.4456889759808005
142,5,Logistic Regression (Penalty = L2),2,0.55,0.8378787878787879,0.8239451015539992,1.4812350273132324,0.8239451015539992
143,5,Naive Bayes,2,0.55,0.7893939393939394,0.7681944027269892,0.16209650039672852,0.7681944027269892
144,6,KNeighbors Classifier,0,0.55,0.8238805970149253,0.8000679131500802,3.837329387664795,0.8000679131500802
145,6,SVC Classifier,0,0.55,0.7656716417910447,0.7412618057297596,4.169096946716309,0.7412618057297596
146,6,Decision Tree,0,0.55,0.655223880597015,0.6083762460865364,0.30679917335510254,0.6083762460865364
147,6,RandomForest,0,0.55,0.6179104477611941,0.5655047946795496,0.943026065826416,0.5655047946795496
148,6,AdaBoost (Discrete),0,0.55,0.7865671641791044,0.7740977166161624,212.44790291786194,0.7740977166161624
149,6,AdaBoost (Real),0,0.55,0.5328358208955224,0.34108615761380573,245.05919909477234,0.34108615761380573
150,6,Logistic Regression (Penalty = L2),0,0.55,0.8029850746268656,0.7848844752986118,2.3391146659851074,0.7848844752986118
151,6,Naive Bayes,0,0.55,0.7656716417910447,0.7433977454947986,0.2698190212249756,0.7433977454947986
152,6,KNeighbors Classifier,1,0.55,0.8223880597014925,0.7877760987461951,4.0041913986206055,0.7877760987461951
153,6,SVC Classifier,1,0.55,0.7716417910447761,0.7263493445767817,4.937041997909546,0.7263493445767817
154,6,Decision Tree,1,0.55,0.6865671641791045,0.6605543749660098,0.26006555557250977,0.6605543749660098
155,6,RandomForest,1,0.55,0.6477611940298508,0.5242332493699723,1.0595219135284424,0.5242332493699723
156,6,AdaBoost (Discrete),1,0.55,0.7761194029850746,0.75791670631665,227.61298394203186,0.75791670631665
157,6,AdaBoost (Real),1,0.55,0.6268656716417911,0.5990035961919434,213.599463224411,0.5990035961919434
158,6,Logistic Regression (Penalty = L2),1,0.55,0.8149253731343283,0.7967731633545047,2.157294511795044,0.7967731633545047
159,6,Naive Bayes,1,0.55,0.7716417910447761,0.7495814725522707,0.2521491050720215,0.7495814725522707
160,6,KNeighbors Classifier,2,0.55,0.8242424242424242,0.7871452397443182,3.7728934288024902,0.7871452397443182
161,6,SVC Classifier,2,0.55,0.7878787878787878,0.7670590632927649,5.103860139846802,0.7670590632927649
162,6,Decision Tree,2,0.55,0.7121212121212122,0.6782625386091591,0.25325751304626465,0.6782625386091591
163,6,RandomForest,2,0.55,0.6257575757575757,0.4653100217191231,1.1427462100982666,0.4653100217191231
164,6,AdaBoost (Discrete),2,0.55,0.7893939393939394,0.7783883103952285,227.66102051734924,0.7783883103952285
165,6,AdaBoost (Real),2,0.55,0.5227272727272727,0.3659573059248257,220.43864607810974,0.0
166,6,Logistic Regression (Penalty = L2),2,0.55,0.8363636363636363,0.815325725878084,2.0279319286346436,0.815325725878084
167,6,Naive Bayes,2,0.55,0.7878787878787878,0.7689529109765239,0.24366354942321777,0.7689529109765239
168,7,KNeighbors Classifier,0,0.55,0.7970149253731343,0.7650245063361895,5.380129337310791,0.7650245063361895
169,7,SVC Classifier,0,0.55,0.7626865671641792,0.7379609038481324,5.888810873031616,0.7379609038481324
170,7,Decision Tree,0,0.55,0.6358208955223881,0.6020023382310947,0.32117319107055664,0.6020023382310947
171,7,RandomForest,0,0.55,0.6492537313432836,0.5205005257756192,0.9523148536682129,0.5205005257756192
172,7,AdaBoost (Discrete),0,0.55,0.7746268656716417,0.7598654945728283,322.0998463630676,0.7598654945728283
173,7,AdaBoost (Real),0,0.55,0.5328358208955224,0.34108615761380573,319.5549359321594,0.34108615761380573
174,7,Logistic Regression (Penalty = L2),0,0.55,0.8014925373134328,0.7867068964161508,3.0696871280670166,0.7867068964161508
175,7,Naive Bayes,0,0.55,0.7477611940298508,0.7208743281093294,0.3509378433227539,0.7208743281093294
176,7,KNeighbors Classifier,1,0.55,0.8149253731343283,0.7777399835176894,5.144861698150635,0.7777399835176894
177,7,SVC Classifier,1,0.55,0.7731343283582089,0.7449960524601908,6.105908393859863,0.7449960524601908
178,7,Decision Tree,1,0.55,0.6880597014925374,0.6746503642811305,0.2569878101348877,0.6746503642811305
179,7,RandomForest,1,0.55,0.6656716417910448,0.4754765705736909,0.9590344429016113,0.4754765705736909
180,7,AdaBoost (Discrete),1,0.55,0.7865671641791044,0.7740773932266964,295.6554205417633,0.7740773932266964
181,7,AdaBoost (Real),1,0.55,0.6776119402985075,0.6518698948932126,287.79342222213745,0.6518698948932126
182,7,Logistic Regression (Penalty = L2),1,0.55,0.7805970149253731,0.75633157752514,2.54803466796875,0.75633157752514
183,7,Naive Bayes,1,0.55,0.7567164179104477,0.7317378898839049,0.30788111686706543,0.7317378898839049
184,7,KNeighbors Classifier,2,0.55,0.8196969696969697,0.7896768303150621,4.628600358963013,0.7896768303150621
185,7,SVC Classifier,2,0.55,0.7909090909090909,0.7544947266322597,5.467062473297119,0.7544947266322597
186,7,Decision Tree,2,0.55,0.6606060606060606,0.6314757801564957,0.24476003646850586,0.6314757801564957
187,7,RandomForest,2,0.55,0.6636363636363637,0.5378146388522775,0.6952285766601562,0.5378146388522775
188,7,AdaBoost (Discrete),2,0.55,0.7772727272727272,0.7593644513190809,261.9541172981262,0.7593644513190809
189,7,AdaBoost (Real),2,0.55,0.5621212121212121,0.47569626081519684,257.31948947906494,0.47569626081519684
190,7,Logistic Regression (Penalty = L2),2,0.55,0.8090909090909091,0.7882977946244978,2.7123873233795166,0.7882977946244978
191,7,Naive Bayes,2,0.55,0.7787878787878788,0.7588612244347754,0.20475125312805176,0.7588612244347754
192,8,KNeighbors Classifier,0,0.55,0.8313432835820895,0.8049017493962545,1.4774904251098633,0.8049017493962545
193,8,SVC Classifier,0,0.55,0.7656716417910447,0.7347869656094724,2.7125816345214844,0.7347869656094724
194,8,Decision Tree,0,0.55,0.7268656716417911,0.7015338398919707,0.19646906852722168,0.7015338398919707
195,8,RandomForest,0,0.55,0.6507462686567164,0.6419930127441456,0.7647440433502197,0.0
196,8,AdaBoost (Discrete),0,0.55,0.7761194029850746,0.7634300765163493,131.2940022945404,0.7634300765163493
197,8,AdaBoost (Real),0,0.55,0.5328358208955224,0.34108615761380573,141.72565960884094,0.34108615761380573
198,8,Logistic Regression (Penalty = L2),0,0.55,0.8134328358208955,0.80080297211605,1.201641321182251,0.80080297211605
199,8,Naive Bayes,0,0.55,0.7791044776119403,0.7591911233711764,0.19613862037658691,0.7591911233711764
200,8,KNeighbors Classifier,1,0.55,0.8343283582089552,0.8103915010343341,1.9295482635498047,0.8103915010343341
201,8,SVC Classifier,1,0.55,0.7850746268656716,0.7509891998358458,2.788238763809204,0.7509891998358458
202,8,Decision Tree,1,0.55,0.6850746268656717,0.6609359656234095,0.2074604034423828,0.6609359656234095
203,8,RandomForest,1,0.55,0.6268656716417911,0.5103898224676324,0.5838921070098877,0.5103898224676324
204,8,AdaBoost (Discrete),1,0.55,0.7731343283582089,0.756452222037469,128.9138514995575,0.756452222037469
205,8,AdaBoost (Real),1,0.55,0.673134328358209,0.630951706903848,120.04477787017822,0.630951706903848
206,8,Logistic Regression (Penalty = L2),1,0.55,0.8223880597014925,0.8057853963970698,1.2003297805786133,0.8057853963970698
207,8,Naive Bayes,1,0.55,0.7850746268656716,0.7609467766514117,0.12939786911010742,0.7609467766514117
208,8,KNeighbors Classifier,2,0.55,0.8378787878787879,0.8135591349078242,1.8424031734466553,0.8135591349078242
209,8,SVC Classifier,2,0.55,0.7924242424242425,0.7711386426921636,2.803985834121704,0.7711386426921636
210,8,Decision Tree,2,0.55,0.7090909090909091,0.6848055415923535,0.1410667896270752,0.6848055415923535
211,8,RandomForest,2,0.55,0.6363636363636364,0.46561771412246483,0.7522599697113037,0.46561771412246483
212,8,AdaBoost (Discrete),2,0.55,0.7833333333333333,0.7651694977182721,123.66586756706238,0.7651694977182721
213,8,AdaBoost (Real),2,0.55,0.5848484848484848,0.44424884105997986,124.57429957389832,0.44424884105997986
214,8,Logistic Regression (Penalty = L2),2,0.55,0.8393939393939394,0.8245296210469759,1.1772611141204834,0.8245296210469759
215,8,Naive Bayes,2,0.55,0.793939393939394,0.7754811636718373,0.18635010719299316,0.7754811636718373
