,feat_set_id,classifier,fold_id,feat_th,score,geo_score,exec_t,geo_score_woz
0,0,KNeighbors Classifier,0,0.1,0.5868263473053892,0.6447024855040453,0.22862625122070312,0.6447024855040453
1,0,SVC Classifier,0,0.1,0.5808383233532934,0.23697978877924394,0.19652271270751953,0.0
2,0,Decision Tree,0,0.1,0.5808383233532934,0.6759715768850432,0.04710984230041504,0.6759715768850432
3,0,RandomForest,0,0.1,0.592814371257485,0.43520189022291983,0.2667350769042969,0.43520189022291983
4,0,AdaBoost (Discrete),0,0.1,0.437125748502994,0.34329817136034474,20.515307188034058,0.34329817136034474
5,0,AdaBoost (Real),0,0.1,0.5988023952095808,0.6663645974514727,23.606367349624634,0.6663645974514727
6,0,Logistic Regression (Penalty = L2),0,0.1,0.5988023952095808,0.6249758444770572,0.2136998176574707,0.6249758444770572
7,0,Naive Bayes,0,0.1,0.6586826347305389,0.691156112287384,0.06435632705688477,0.691156112287384
8,0,KNeighbors Classifier,1,0.1,0.5878787878787879,0.6676736212717342,0.3003089427947998,0.6676736212717342
9,0,SVC Classifier,1,0.1,0.5818181818181818,0.9947780321927768,0.26314258575439453,0.0
10,0,Decision Tree,1,0.1,0.5212121212121212,0.6353188912513095,0.0025434494018554688,0.6353188912513095
11,0,RandomForest,1,0.1,0.5878787878787879,1.0,0.3104264736175537,0.0
12,0,AdaBoost (Discrete),1,0.1,0.4121212121212121,0.3379663528019703,19.962270975112915,0.3379663528019703
13,0,AdaBoost (Real),1,0.1,0.5151515151515151,0.6284127041528227,22.283117055892944,0.6284127041528227
14,0,Logistic Regression (Penalty = L2),1,0.1,0.5454545454545454,0.6205567217966604,0.1380000114440918,0.6205567217966604
15,0,Naive Bayes,1,0.1,0.5878787878787879,0.706289196747388,0.04968523979187012,0.706289196747388
16,0,KNeighbors Classifier,2,0.1,0.6,0.701859966148685,0.22284317016601562,0.701859966148685
17,0,SVC Classifier,2,0.1,0.6060606060606061,0.41601204395990315,0.2150130271911621,0.41601204395990315
18,0,Decision Tree,2,0.1,0.4727272727272727,0.5797431890975098,0.04594135284423828,0.5797431890975098
19,0,RandomForest,2,0.1,0.5818181818181818,0.3054294659717934,0.3111143112182617,0.3054294659717934
20,0,AdaBoost (Discrete),2,0.1,0.3939393939393939,0.49650338210548084,20.313887357711792,0.49650338210548084
21,0,AdaBoost (Real),2,0.1,0.593939393939394,0.6954790678147306,23.55461287498474,0.6954790678147306
22,0,Logistic Regression (Penalty = L2),2,0.1,0.6,0.6826825210342389,0.12342691421508789,0.6826825210342389
23,0,Naive Bayes,2,0.1,0.5757575757575758,0.6360770290723415,0.046384334564208984,0.6360770290723415
24,1,KNeighbors Classifier,0,0.1,0.6047904191616766,0.44130077816790014,0.22412872314453125,0.0
25,1,SVC Classifier,0,0.1,0.5808383233532934,0.1203858530857692,0.23868727684020996,0.0
26,1,Decision Tree,0,0.1,0.5868263473053892,0.5024096525119696,0.04681253433227539,0.0
27,1,RandomForest,0,0.1,0.5988023952095808,0.3516266547743872,0.30125927925109863,0.0
28,1,AdaBoost (Discrete),0,0.1,0.6167664670658682,0.5186730561060935,18.77855372428894,0.0
29,1,AdaBoost (Real),0,0.1,0.6107784431137725,0.497578678263852,20.531295776367188,0.0
30,1,Logistic Regression (Penalty = L2),0,0.1,0.5988023952095808,0.4914731871829905,0.0929872989654541,0.0
31,1,Naive Bayes,0,0.1,0.49700598802395207,0.9185586535436918,0.08974170684814453,0.0
32,1,KNeighbors Classifier,1,0.1,0.5454545454545454,0.650633639755825,0.23847723007202148,0.650633639755825
33,1,SVC Classifier,1,0.1,0.5818181818181818,1.0,0.24024248123168945,0.0
34,1,Decision Tree,1,0.1,0.6484848484848484,0.5679879348345764,0.04654836654663086,0.0
35,1,RandomForest,1,0.1,0.5757575757575758,0.9895833333333334,0.24454498291015625,0.0
36,1,AdaBoost (Discrete),1,0.1,0.6181818181818182,0.5501782242431742,19.623867988586426,0.0
37,1,AdaBoost (Real),1,0.1,0.6,0.6073487869582089,20.35949468612671,0.0
38,1,Logistic Regression (Penalty = L2),1,0.1,0.6666666666666666,0.5930562252219512,0.09888601303100586,0.0
39,1,Naive Bayes,1,0.1,0.509090909090909,0.23245803850459942,0.05246329307556152,0.23245803850459942
40,1,KNeighbors Classifier,2,0.1,0.44242424242424244,0.5363106751674679,0.23534250259399414,0.5363106751674679
41,1,SVC Classifier,2,0.1,0.5818181818181818,1.0,0.20573019981384277,0.0
42,1,Decision Tree,2,0.1,0.5757575757575758,0.4287464628562721,0.04481935501098633,0.0
43,1,RandomForest,2,0.1,0.5757575757575758,0.20561958020749357,0.28664731979370117,0.0
44,1,AdaBoost (Discrete),2,0.1,0.5818181818181818,0.40655625711096666,19.359609127044678,0.0
45,1,AdaBoost (Real),2,0.1,0.5575757575757576,0.40899805838745235,21.119617462158203,0.0
46,1,Logistic Regression (Penalty = L2),2,0.1,0.6,0.5392101158357545,0.07552814483642578,0.0
47,1,Naive Bayes,2,0.1,0.43636363636363634,0.22051558973138222,0.05297732353210449,0.22051558973138222
48,2,KNeighbors Classifier,0,0.1,0.4251497005988024,0.14433756729740643,0.9582464694976807,0.0
49,2,SVC Classifier,0,0.1,0.5748502994011976,1.0,0.9629583358764648,0.0
50,2,Decision Tree,0,0.1,0.4491017964071856,0.25,0.09453153610229492,0.0
51,2,RandomForest,0,0.1,0.5748502994011976,1.0,0.33014607429504395,0.0
52,2,AdaBoost (Discrete),0,0.1,0.47305389221556887,0.3227486121839514,26.230220079421997,0.0
53,2,AdaBoost (Real),0,0.1,0.46107784431137727,0.28867513459481287,25.61082100868225,0.0
54,2,Logistic Regression (Penalty = L2),0,0.1,0.47305389221556887,0.3227486121839514,0.1140594482421875,0.0
55,2,Naive Bayes,0,0.1,0.47305389221556887,0.3227486121839514,0.11283993721008301,0.0
56,2,KNeighbors Classifier,1,0.1,0.012121212121212121,0.10206207261596575,0.855722188949585,0.0
57,2,SVC Classifier,1,0.1,0.5818181818181818,1.0,0.9563875198364258,0.0
58,2,Decision Tree,1,0.1,0.45454545454545453,0.27003086243366087,0.04535484313964844,0.0
59,2,RandomForest,1,0.1,0.5818181818181818,1.0,0.3354825973510742,0.0
60,2,AdaBoost (Discrete),1,0.1,0.4909090909090909,0.3679900360969936,24.866572618484497,0.0
61,2,AdaBoost (Real),1,0.1,0.47878787878787876,0.338501600193165,25.551136016845703,0.0
62,2,Logistic Regression (Penalty = L2),1,0.1,0.49696969696969695,0.3818813079129867,0.10597538948059082,0.0
63,2,Naive Bayes,1,0.1,0.49696969696969695,0.3818813079129867,0.048204898834228516,0.0
64,2,KNeighbors Classifier,2,0.1,0.012121212121212121,0.10206207261596575,0.8959875106811523,0.0
65,2,SVC Classifier,2,0.1,0.5818181818181818,1.0,0.9880673885345459,0.0
66,2,Decision Tree,2,0.1,0.46060606060606063,0.28867513459481287,0.050710201263427734,0.0
67,2,RandomForest,2,0.1,0.5818181818181818,1.0,0.374556303024292,0.0
68,2,AdaBoost (Discrete),2,0.1,0.46060606060606063,0.28867513459481287,25.870139122009277,0.0
69,2,AdaBoost (Real),2,0.1,0.46060606060606063,0.28867513459481287,25.45359778404236,0.0
70,2,Logistic Regression (Penalty = L2),2,0.1,0.46060606060606063,0.28867513459481287,0.1249539852142334,0.0
71,2,Naive Bayes,2,0.1,0.46060606060606063,0.28867513459481287,0.13058710098266602,0.0
72,3,KNeighbors Classifier,0,0.1,0.562874251497006,0.9789450103725609,0.19249439239501953,0.0
73,3,SVC Classifier,0,0.1,0.5748502994011976,1.0,0.19471979141235352,0.0
74,3,Decision Tree,0,0.1,0.5748502994011976,0.30285343213869,0.002366304397583008,0.30285343213869
75,3,RandomForest,0,0.1,0.5748502994011976,1.0,0.3361341953277588,0.0
76,3,AdaBoost (Discrete),0,0.1,0.49101796407185627,0.5827658880984057,19.334920167922974,0.5827658880984057
77,3,AdaBoost (Real),0,0.1,0.6047904191616766,0.4790016600325024,21.222139835357666,0.4790016600325024
78,3,Logistic Regression (Penalty = L2),0,0.1,0.5988023952095808,0.43679023236814946,0.08536696434020996,0.43679023236814946
79,3,Naive Bayes,0,0.1,0.5868263473053892,0.2429598032242956,0.047127485275268555,0.2429598032242956
80,3,KNeighbors Classifier,1,0.1,0.5272727272727272,0.6446686550980117,0.24787688255310059,0.6446686550980117
81,3,SVC Classifier,1,0.1,0.5818181818181818,1.0,0.23494219779968262,0.0
82,3,Decision Tree,1,0.1,0.5333333333333333,0.6460173382238398,0.04671001434326172,0.6460173382238398
83,3,RandomForest,1,0.1,0.5878787878787879,1.0,0.2936854362487793,0.0
84,3,AdaBoost (Discrete),1,0.1,0.41818181818181815,0.3640632172700595,18.92657780647278,0.3640632172700595
85,3,AdaBoost (Real),1,0.1,0.5454545454545454,0.6592049911221002,21.332979917526245,0.6592049911221002
86,3,Logistic Regression (Penalty = L2),1,0.1,0.5515151515151515,0.6656054398608409,0.08236050605773926,0.6656054398608409
87,3,Naive Bayes,1,0.1,0.5878787878787879,0.24414499175196025,0.04721784591674805,0.24414499175196025
88,3,KNeighbors Classifier,2,0.1,0.5272727272727272,0.6537548083052067,0.24638915061950684,0.6537548083052067
89,3,SVC Classifier,2,0.1,0.5818181818181818,1.0,0.28526735305786133,0.0
90,3,Decision Tree,2,0.1,0.593939393939394,0.3508781470347296,0.002537965774536133,0.3508781470347296
91,3,RandomForest,2,0.1,0.5818181818181818,1.0,0.3467519283294678,0.0
92,3,AdaBoost (Discrete),2,0.1,0.4484848484848485,0.5188855352164768,19.029964447021484,0.5188855352164768
93,3,AdaBoost (Real),2,0.1,0.5818181818181818,0.3483717889975155,22.167269945144653,0.3483717889975155
94,3,Logistic Regression (Penalty = L2),2,0.1,0.5636363636363636,0.6864958603041045,0.08324289321899414,0.6864958603041045
95,3,Naive Bayes,2,0.1,0.593939393939394,0.3076034143347049,0.05247807502746582,0.3076034143347049
96,4,KNeighbors Classifier,0,0.1,0.5329341317365269,0.6294529014198351,0.09503746032714844,0.6294529014198351
97,4,SVC Classifier,0,0.1,0.5748502994011976,1.0,0.04800271987915039,0.0
98,4,Decision Tree,0,0.1,0.592814371257485,0.49727518407382065,0.001994609832763672,0.0
99,4,RandomForest,0,0.1,0.6227544910179641,0.4226026445363092,0.3325526714324951,0.0
100,4,AdaBoost (Discrete),0,0.1,0.5748502994011976,0.5241740685175872,19.265350818634033,0.0
101,4,AdaBoost (Real),0,0.1,0.6167664670658682,0.5270462766947299,20.289961576461792,0.0
102,4,Logistic Regression (Penalty = L2),0,0.1,0.6107784431137725,0.5067479435191322,0.0020215511322021484,0.0
103,4,Naive Bayes,0,0.1,0.5449101796407185,0.6560049164973831,0.04751276969909668,0.6560049164973831
104,4,KNeighbors Classifier,1,0.1,0.43636363636363634,0.5779143340774197,0.09380960464477539,0.5779143340774197
105,4,SVC Classifier,1,0.1,0.5818181818181818,1.0,0.09830141067504883,0.0
106,4,Decision Tree,1,0.1,0.6363636363636364,0.5103103630798288,0.04593396186828613,0.0
107,4,RandomForest,1,0.1,0.5818181818181818,0.1697027389520957,0.2887723445892334,0.0
108,4,AdaBoost (Discrete),1,0.1,0.5454545454545454,0.425878561352421,17.785541772842407,0.0
109,4,AdaBoost (Real),1,0.1,0.6787878787878788,0.6262242910851494,18.714020013809204,0.0
110,4,Logistic Regression (Penalty = L2),1,0.1,0.6909090909090909,0.6340037731068526,0.04290294647216797,0.0
111,4,Naive Bayes,1,0.1,0.5454545454545454,0.668474464285595,0.0749056339263916,0.668474464285595
112,4,KNeighbors Classifier,2,0.1,0.3939393939393939,0.52469933727947,0.04895758628845215,0.52469933727947
113,4,SVC Classifier,2,0.1,0.5818181818181818,1.0,0.0857686996459961,0.0
114,4,Decision Tree,2,0.1,0.5878787878787879,0.4219033668749186,0.041979312896728516,0.0
115,4,RandomForest,2,0.1,0.6,0.3850770231077027,0.3502519130706787,0.0
116,4,AdaBoost (Discrete),2,0.1,0.593939393939394,0.46966821831386213,15.251454830169678,0.0
117,4,AdaBoost (Real),2,0.1,0.593939393939394,0.367156535511255,19.580626964569092,0.0
118,4,Logistic Regression (Penalty = L2),2,0.1,0.6121212121212121,0.5394941348788024,0.047678470611572266,0.0
119,4,Naive Bayes,2,0.1,0.45454545454545453,0.57251294952321,0.04751729965209961,0.57251294952321
120,6,KNeighbors Classifier,0,0.1,0.5449101796407185,0.3987582262789535,0.09412193298339844,0.3987582262789535
121,6,SVC Classifier,0,0.1,0.5748502994011976,1.0,0.048162221908569336,0.0
122,6,Decision Tree,0,0.1,0.5808383233532934,0.9947780321927768,0.0010914802551269531,0.0
123,6,RandomForest,0,0.1,0.5868263473053892,1.0,0.23295307159423828,0.0
124,6,AdaBoost (Discrete),0,0.1,0.4491017964071856,0.3466806371753174,15.103551149368286,0.3466806371753174
125,6,AdaBoost (Real),0,0.1,0.5808383233532934,0.9947780321927768,18.412556171417236,0.0
126,6,Logistic Regression (Penalty = L2),0,0.1,0.5868263473053892,1.0,0.04247856140136719,0.0
127,6,Naive Bayes,0,0.1,0.5449101796407185,0.6679474171686484,0.04702425003051758,0.6679474171686484
128,6,KNeighbors Classifier,1,0.1,0.47878787878787876,0.568117283222883,0.04772615432739258,0.568117283222883
129,6,SVC Classifier,1,0.1,0.5818181818181818,1.0,0.04959416389465332,0.0
130,6,Decision Tree,1,0.1,0.5878787878787879,1.0,0.04986929893493652,0.0
131,6,RandomForest,1,0.1,0.5878787878787879,1.0,0.24088406562805176,0.0
132,6,AdaBoost (Discrete),1,0.1,0.41818181818181815,0.3640632172700595,15.691510200500488,0.3640632172700595
133,6,AdaBoost (Real),1,0.1,0.5818181818181818,0.9947780321927768,18.856528520584106,0.0
134,6,Logistic Regression (Penalty = L2),1,0.1,0.5878787878787879,1.0,0.04734086990356445,0.0
135,6,Naive Bayes,1,0.1,0.43636363636363634,0.47688943806699086,0.05022430419921875,0.47688943806699086
136,6,KNeighbors Classifier,2,0.1,0.5696969696969697,0.4308209219278185,0.09406590461730957,0.4308209219278185
137,6,SVC Classifier,2,0.1,0.5818181818181818,1.0,0.04793596267700195,0.0
138,6,Decision Tree,2,0.1,0.5818181818181818,0.9947780321927768,0.001093149185180664,0.0
139,6,RandomForest,2,0.1,0.5878787878787879,1.0,0.2383899688720703,0.0
140,6,AdaBoost (Discrete),2,0.1,0.41818181818181815,0.21731926072523022,16.315845489501953,0.21731926072523022
141,6,AdaBoost (Real),2,0.1,0.5818181818181818,0.9947780321927768,19.085731744766235,0.0
142,6,Logistic Regression (Penalty = L2),2,0.1,0.5878787878787879,1.0,0.050779104232788086,0.0
143,6,Naive Bayes,2,0.1,0.48484848484848486,0.605614064082228,0.0028066635131835938,0.605614064082228
144,7,KNeighbors Classifier,0,0.1,0.5748502994011976,1.0,0.0487055778503418,0.0
145,7,SVC Classifier,0,0.1,0.5748502994011976,1.0,0.04936933517456055,0.0
146,7,Decision Tree,0,0.1,0.5748502994011976,1.0,0.0015735626220703125,0.0
147,7,RandomForest,0,0.1,0.5748502994011976,1.0,0.29099583625793457,0.0
148,7,AdaBoost (Discrete),0,0.1,0.5748502994011976,1.0,16.651212215423584,0.0
149,7,AdaBoost (Real),0,0.1,0.5748502994011976,1.0,17.80259084701538,0.0
150,7,Logistic Regression (Penalty = L2),0,0.1,0.5748502994011976,1.0,0.0019788742065429688,0.0
151,7,Naive Bayes,0,0.1,0.4491017964071856,0.25,0.0018875598907470703,0.0
152,7,KNeighbors Classifier,1,0.1,0.45454545454545453,0.27003086243366087,0.044898271560668945,0.0
153,7,SVC Classifier,1,0.1,0.5818181818181818,1.0,0.04390716552734375,0.0
154,7,Decision Tree,1,0.1,0.5818181818181818,1.0,0.04125356674194336,0.0
155,7,RandomForest,1,0.1,0.5818181818181818,1.0,0.2612285614013672,0.0
156,7,AdaBoost (Discrete),1,0.1,0.5818181818181818,1.0,15.424145460128784,0.0
157,7,AdaBoost (Real),1,0.1,0.5818181818181818,1.0,17.24880623817444,0.0
158,7,Logistic Regression (Penalty = L2),1,0.1,0.5818181818181818,1.0,0.043406009674072266,0.0
159,7,Naive Bayes,1,0.1,0.4666666666666667,0.30618621784789724,0.047362327575683594,0.0
160,7,KNeighbors Classifier,2,0.1,0.4303030303030303,0.1767766952966369,0.08923625946044922,0.0
161,7,SVC Classifier,2,0.1,0.5818181818181818,1.0,0.0816187858581543,0.0
162,7,Decision Tree,2,0.1,0.5818181818181818,1.0,0.04982423782348633,0.0
163,7,RandomForest,2,0.1,0.5818181818181818,1.0,0.25875091552734375,0.0
164,7,AdaBoost (Discrete),2,0.1,0.5818181818181818,1.0,16.04950785636902,0.0
165,7,AdaBoost (Real),2,0.1,0.5818181818181818,1.0,16.91751194000244,0.0
166,7,Logistic Regression (Penalty = L2),2,0.1,0.5818181818181818,1.0,0.002282381057739258,0.0
167,7,Naive Bayes,2,0.1,0.4303030303030303,0.1767766952966369,0.040163516998291016,0.0
168,8,KNeighbors Classifier,0,0.1,0.5748502994011976,1.0,0.08817505836486816,0.0
169,8,SVC Classifier,0,0.1,0.5748502994011976,1.0,0.08773589134216309,0.0
170,8,Decision Tree,0,0.1,0.5748502994011976,1.0,0.041829586029052734,0.0
171,8,RandomForest,0,0.1,0.5748502994011976,1.0,0.2646782398223877,0.0
172,8,AdaBoost (Discrete),0,0.1,0.5748502994011976,1.0,16.3686683177948,0.0
173,8,AdaBoost (Real),0,0.1,0.5748502994011976,1.0,17.332828521728516,0.0
174,8,Logistic Regression (Penalty = L2),0,0.1,0.5748502994011976,1.0,0.04379868507385254,0.0
175,8,Naive Bayes,0,0.1,0.05389221556886228,0.27003086243366087,0.043875932693481445,0.0
176,8,KNeighbors Classifier,1,0.1,0.5696969696969697,0.9791666666666666,0.08776521682739258,0.0
177,8,SVC Classifier,1,0.1,0.5818181818181818,1.0,0.08730030059814453,0.0
178,8,Decision Tree,1,0.1,0.5878787878787879,0.12126781251816648,0.04198336601257324,0.0
179,8,RandomForest,1,0.1,0.5878787878787879,0.12126781251816648,0.3071460723876953,0.0
180,8,AdaBoost (Discrete),1,0.1,0.5878787878787879,0.12126781251816648,15.140466690063477,0.0
181,8,AdaBoost (Real),1,0.1,0.5878787878787879,0.12126781251816648,17.11752676963806,0.0
182,8,Logistic Regression (Penalty = L2),1,0.1,0.5878787878787879,0.12126781251816648,0.0430150032043457,0.0
183,8,Naive Bayes,1,0.1,0.05454545454545454,0.10235426989347206,0.04396390914916992,0.10235426989347206
184,8,KNeighbors Classifier,2,0.1,0.5878787878787879,0.12126781251816648,0.08868074417114258,0.0
185,8,SVC Classifier,2,0.1,0.5818181818181818,1.0,0.04632258415222168,0.0
186,8,Decision Tree,2,0.1,0.5878787878787879,0.12126781251816648,0.001950979232788086,0.0
187,8,RandomForest,2,0.1,0.5818181818181818,1.0,0.24798178672790527,0.0
188,8,AdaBoost (Discrete),2,0.1,0.5878787878787879,0.12126781251816648,14.505088090896606,0.0
189,8,AdaBoost (Real),2,0.1,0.5878787878787879,0.12126781251816648,16.96073055267334,0.0
190,8,Logistic Regression (Penalty = L2),2,0.1,0.5878787878787879,0.12126781251816648,0.04243135452270508,0.0
191,8,Naive Bayes,2,0.1,0.07272727272727272,0.1152762795218757,0.04366636276245117,0.1152762795218757
192,9,KNeighbors Classifier,0,0.1,0.5688622754491018,0.9895833333333334,0.09826827049255371,0.0
193,9,SVC Classifier,0,0.1,0.5748502994011976,1.0,0.08640170097351074,0.0
194,9,Decision Tree,0,0.1,0.5748502994011976,1.0,0.0011572837829589844,0.0
195,9,RandomForest,0,0.1,0.5748502994011976,1.0,0.2592043876647949,0.0
196,9,AdaBoost (Discrete),0,0.1,0.5748502994011976,1.0,14.653517723083496,0.0
197,9,AdaBoost (Real),0,0.1,0.5748502994011976,1.0,16.90487003326416,0.0
198,9,Logistic Regression (Penalty = L2),0,0.1,0.5748502994011976,1.0,0.04327273368835449,0.0
199,9,Naive Bayes,0,0.1,0.4311377245508982,0.1767766952966369,0.04318952560424805,0.0
200,9,KNeighbors Classifier,1,0.1,0.5818181818181818,1.0,0.0817115306854248,0.0
201,9,SVC Classifier,1,0.1,0.5818181818181818,1.0,0.08348393440246582,0.0
202,9,Decision Tree,1,0.1,0.5818181818181818,1.0,0.04209160804748535,0.0
203,9,RandomForest,1,0.1,0.5818181818181818,1.0,0.3039674758911133,0.0
204,9,AdaBoost (Discrete),1,0.1,0.5818181818181818,1.0,15.510003566741943,0.0
205,9,AdaBoost (Real),1,0.1,0.5818181818181818,1.0,17.35994577407837,0.0
206,9,Logistic Regression (Penalty = L2),1,0.1,0.5818181818181818,1.0,0.00196075439453125,0.0
207,9,Naive Bayes,1,0.1,0.44242424242424244,0.22821773229381923,0.0029468536376953125,0.0
208,9,KNeighbors Classifier,2,0.1,0.5818181818181818,1.0,0.08787775039672852,0.0
209,9,SVC Classifier,2,0.1,0.5818181818181818,1.0,0.04581880569458008,0.0
210,9,Decision Tree,2,0.1,0.5818181818181818,1.0,0.0011682510375976562,0.0
211,9,RandomForest,2,0.1,0.5818181818181818,1.0,0.26191091537475586,0.0
212,9,AdaBoost (Discrete),2,0.1,0.5818181818181818,1.0,14.9326331615448,0.0
213,9,AdaBoost (Real),2,0.1,0.5818181818181818,1.0,16.80251955986023,0.0
214,9,Logistic Regression (Penalty = L2),2,0.1,0.5818181818181818,1.0,0.04251885414123535,0.0
215,9,Naive Bayes,2,0.1,0.44242424242424244,0.22821773229381923,0.04217243194580078,0.0
216,10,KNeighbors Classifier,0,0.1,0.562874251497006,0.6648880731370418,0.13376617431640625,0.6648880731370418
217,10,SVC Classifier,0,0.1,0.5688622754491018,0.9895833333333334,0.13196277618408203,0.0
218,10,Decision Tree,0,0.1,0.5808383233532934,0.6299605249474366,0.0014858245849609375,0.6299605249474366
219,10,RandomForest,0,0.1,0.5988023952095808,0.4615336228533677,0.3073554039001465,0.0
220,10,AdaBoost (Discrete),0,0.1,0.4251497005988024,0.5338837915749063,16.35716962814331,0.5338837915749063
221,10,AdaBoost (Real),0,0.1,0.5988023952095808,0.6448235336641382,17.814669370651245,0.6448235336641382
222,10,Logistic Regression (Penalty = L2),0,0.1,0.6467065868263473,0.6672699852463004,0.11356306076049805,0.6672699852463004
223,10,Naive Bayes,0,0.1,0.47904191616766467,0.4542801482080349,0.03643608093261719,0.4542801482080349
224,10,KNeighbors Classifier,1,0.1,0.5636363636363636,0.6780495352143555,0.12853264808654785,0.6780495352143555
225,10,SVC Classifier,1,0.1,0.5818181818181818,1.0,0.1737070083618164,0.0
226,10,Decision Tree,1,0.1,0.6363636363636364,0.7106635608131369,0.0022449493408203125,0.7106635608131369
227,10,RandomForest,1,0.1,0.593939393939394,0.17149858514250885,0.30512022972106934,0.0
228,10,AdaBoost (Discrete),1,0.1,0.41818181818181815,0.3640632172700595,16.619739294052124,0.3640632172700595
229,10,AdaBoost (Real),1,0.1,0.6242424242424243,0.7195502718796151,16.1892306804657,0.7195502718796151
230,10,Logistic Regression (Penalty = L2),1,0.1,0.6727272727272727,0.7683387803534977,0.07761764526367188,0.7683387803534977
231,10,Naive Bayes,1,0.1,0.4909090909090909,0.5474398924859862,0.0367121696472168,0.5474398924859862
232,10,KNeighbors Classifier,2,0.1,0.5393939393939394,0.6658358727820926,0.13200736045837402,0.6658358727820926
233,10,SVC Classifier,2,0.1,0.593939393939394,0.17149858514250885,0.11623716354370117,0.0
234,10,Decision Tree,2,0.1,0.6242424242424243,0.6309881948359818,0.03802490234375,0.6309881948359818
235,10,RandomForest,2,0.1,0.593939393939394,0.3321055820775357,0.24077272415161133,0.0
236,10,AdaBoost (Discrete),2,0.1,0.4,0.4861388984160254,15.016567468643188,0.4861388984160254
237,10,AdaBoost (Real),2,0.1,0.6242424242424243,0.6594399180810908,17.630868196487427,0.6594399180810908
238,10,Logistic Regression (Penalty = L2),2,0.1,0.6363636363636364,0.671319070741095,0.11639094352722168,0.671319070741095
239,10,Naive Bayes,2,0.1,0.46060606060606063,0.4177748279137154,0.0024259090423583984,0.4177748279137154
240,11,KNeighbors Classifier,0,0.1,0.5449101796407185,0.6683982761764001,1.2582502365112305,0.6683982761764001
241,11,SVC Classifier,0,0.1,0.592814371257485,0.2902397809308411,1.5511841773986816,0.0
242,11,Decision Tree,0,0.1,0.5209580838323353,0.6222585238769888,0.04607987403869629,0.6222585238769888
243,11,RandomForest,0,0.1,0.5868263473053892,1.0,0.30829548835754395,0.0
244,11,AdaBoost (Discrete),0,0.1,0.437125748502994,0.34329817136034474,27.718788623809814,0.34329817136034474
245,11,AdaBoost (Real),0,0.1,0.6047904191616766,0.6827317411152338,29.599549531936646,0.6827317411152338
246,11,Logistic Regression (Penalty = L2),0,0.1,0.5688622754491018,0.6853129820787769,0.1865842342376709,0.6853129820787769
247,11,Naive Bayes,0,0.1,0.49101796407185627,0.5366937580243081,0.10882282257080078,0.5366937580243081
248,11,KNeighbors Classifier,1,0.1,0.5454545454545454,0.668474464285595,1.0449044704437256,0.668474464285595
249,11,SVC Classifier,1,0.1,0.5818181818181818,0.9947780321927768,1.005852222442627,0.0
250,11,Decision Tree,1,0.1,0.5333333333333333,0.6486979387971237,0.10819888114929199,0.6486979387971237
251,11,RandomForest,1,0.1,0.593939393939394,0.24499865251482233,0.2754940986633301,0.24499865251482233
252,11,AdaBoost (Discrete),1,0.1,0.4484848484848485,0.4451920967008093,24.741358518600464,0.4451920967008093
253,11,AdaBoost (Real),1,0.1,0.5333333333333333,0.602816730604466,30.36190915107727,0.602816730604466
254,11,Logistic Regression (Penalty = L2),1,0.1,0.5515151515151515,0.6764910510631781,0.21074652671813965,0.6764910510631781
255,11,Naive Bayes,1,0.1,0.4727272727272727,0.5032468442237513,0.16380929946899414,0.5032468442237513
256,11,KNeighbors Classifier,2,0.1,0.5393939393939394,0.6664112583715504,1.498572826385498,0.6664112583715504
257,11,SVC Classifier,2,0.1,0.6060606060606061,0.46206375934610827,1.5151002407073975,0.46206375934610827
258,11,Decision Tree,2,0.1,0.5575757575757576,0.6613133370049737,0.0579833984375,0.6613133370049737
259,11,RandomForest,2,0.1,0.5878787878787879,1.0,0.3382852077484131,0.0
260,11,AdaBoost (Discrete),2,0.1,0.42424242424242425,0.5489690621400171,33.51493501663208,0.5489690621400171
261,11,AdaBoost (Real),2,0.1,0.5515151515151515,0.6656054398608408,35.196858167648315,0.6656054398608408
262,11,Logistic Regression (Penalty = L2),2,0.1,0.4909090909090909,0.6246403159193048,0.15589690208435059,0.6246403159193048
263,11,Naive Bayes,2,0.1,0.4666666666666667,0.5556644666651004,0.15865039825439453,0.5556644666651004
