,feat_set_id,classifier,fold_id,feat_th,score,geo_score,exec_t,geo_score_woz
0,0,KNeighbors Classifier,0,0.1,0.6845753899480069,0.8129520829107402,0.22709989547729492,0.0
1,0,SVC Classifier,0,0.1,0.6845753899480069,0.8129520829107402,0.3239767551422119,0.0
2,0,Decision Tree,0,0.1,0.6845753899480069,0.8129520829107402,0.05473470687866211,0.0
3,0,RandomForest,0,0.1,0.7417677642980935,0.7407118766149331,0.3161284923553467,0.0
4,0,AdaBoost (Discrete),0,0.1,0.6845753899480069,0.8129520829107402,24.290810346603394,0.0
5,0,AdaBoost (Real),0,0.1,0.6845753899480069,0.8129520829107402,78.59844470024109,0.0
6,0,Logistic Regression (Penalty = L2),0,0.1,0.6845753899480069,0.8129520829107402,0.32567405700683594,0.0
7,0,Naive Bayes,0,0.1,0.5805892547660312,0.6192878878744241,0.12381291389465332,0.0
8,0,KNeighbors Classifier,1,0.1,0.8038194444444444,0.7744915485716632,0.4810826778411865,0.0
9,0,SVC Classifier,1,0.1,0.7690972222222222,0.8841027752029671,0.6184878349304199,0.0
10,0,Decision Tree,1,0.1,0.8038194444444444,0.7744915485716632,0.0014872550964355469,0.0
11,0,RandomForest,1,0.1,0.6996527777777778,1.0,0.6629748344421387,0.0
12,0,AdaBoost (Discrete),1,0.1,0.8038194444444444,0.7744915485716632,31.119229078292847,0.0
13,0,AdaBoost (Real),1,0.1,0.8038194444444444,0.7744915485716632,42.144301414489746,0.0
14,0,Logistic Regression (Penalty = L2),1,0.1,0.8038194444444444,0.7744915485716632,0.20277142524719238,0.0
15,0,Naive Bayes,1,0.1,0.6666666666666666,0.6596260502202088,0.07296967506408691,0.0
16,0,KNeighbors Classifier,2,0.1,0.7843478260869565,0.6339634597648305,0.22947478294372559,0.6339634597648305
17,0,SVC Classifier,2,0.1,0.7617391304347826,0.5617326583032773,0.5290546417236328,0.0
18,0,Decision Tree,2,0.1,0.5721739130434783,0.3982612899375519,0.002104043960571289,0.3982612899375519
19,0,RandomForest,2,0.1,0.7513043478260869,0.5052262532742322,0.6799242496490479,0.0
20,0,AdaBoost (Discrete),2,0.1,0.4052173913043478,0.3597128593712998,30.48112201690674,0.3597128593712998
21,0,AdaBoost (Real),2,0.1,0.48869565217391303,0.3804495695891552,36.81996488571167,0.3804495695891552
22,0,Logistic Regression (Penalty = L2),2,0.1,0.7391304347826086,0.42805277352697846,0.16446685791015625,0.42805277352697846
23,0,Naive Bayes,2,0.1,0.4504347826086956,0.5309694241041965,0.0766913890838623,0.5309694241041965
24,1,KNeighbors Classifier,0,0.1,0.4506065857885615,0.5116223467974931,0.3024108409881592,0.0
25,1,SVC Classifier,0,0.1,0.7001733102253033,1.0,0.467501163482666,0.0
26,1,Decision Tree,0,0.1,0.5753899480069324,0.8217821782178217,0.07464790344238281,0.0
27,1,RandomForest,0,0.1,0.7001733102253033,1.0,0.4621090888977051,0.0
28,1,AdaBoost (Discrete),0,0.1,0.5753899480069324,0.8217821782178217,31.885034799575806,0.0
29,1,AdaBoost (Real),0,0.1,0.5753899480069324,0.8217821782178217,45.55063533782959,0.0
30,1,Logistic Regression (Penalty = L2),0,0.1,0.7001733102253033,1.0,0.261350154876709,0.0
31,1,Naive Bayes,0,0.1,0.41767764298093585,0.5598055961226205,0.08844280242919922,0.0
32,1,KNeighbors Classifier,1,0.1,0.6371527777777778,0.9106699751861043,0.17892837524414062,0.0
33,1,SVC Classifier,1,0.1,0.6996527777777778,1.0,0.5227518081665039,0.0
34,1,Decision Tree,1,0.1,0.6371527777777778,0.9106699751861043,0.0024280548095703125,0.0
35,1,RandomForest,1,0.1,0.5746527777777778,0.8213399503722084,0.7114784717559814,0.0
36,1,AdaBoost (Discrete),1,0.1,0.6371527777777778,0.9106699751861043,36.1176118850708,0.0
37,1,AdaBoost (Real),1,0.1,0.6371527777777778,0.9106699751861043,76.62331700325012,0.0
38,1,Logistic Regression (Penalty = L2),1,0.1,0.5225694444444444,0.5010070503656899,0.18809199333190918,0.0
39,1,Naive Bayes,1,0.1,0.5208333333333334,0.6857142164790785,0.09665250778198242,0.0
40,1,KNeighbors Classifier,2,0.1,0.7008695652173913,1.0,0.29221343994140625,0.0
41,1,SVC Classifier,2,0.1,0.7008695652173913,1.0,0.48179197311401367,0.0
42,1,Decision Tree,2,0.1,0.7008695652173913,1.0,0.0939176082611084,0.0
43,1,RandomForest,2,0.1,0.7008695652173913,1.0,0.675213098526001,0.0
44,1,AdaBoost (Discrete),2,0.1,0.7008695652173913,1.0,40.31384348869324,0.0
45,1,AdaBoost (Real),2,0.1,0.7008695652173913,1.0,96.9076075553894,0.0
46,1,Logistic Regression (Penalty = L2),2,0.1,0.7008695652173913,1.0,0.3337879180908203,0.0
47,1,Naive Bayes,2,0.1,0.43130434782608695,0.7472032220800768,0.002750396728515625,0.0
48,2,KNeighbors Classifier,0,0.1,0.7001733102253033,0.6798915172639858,0.4356093406677246,0.0
49,2,SVC Classifier,0,0.1,0.6845753899480069,0.8129520829107402,0.8219842910766602,0.0
50,2,Decision Tree,0,0.1,0.7140381282495667,0.8384332394589941,0.002534151077270508,0.0
51,2,RandomForest,0,0.1,0.6169844020797227,0.6288249295942455,0.7241566181182861,0.0
52,2,AdaBoost (Discrete),0,0.1,0.7140381282495667,0.8384332394589941,43.59817290306091,0.0
53,2,AdaBoost (Real),0,0.1,0.7140381282495667,0.8384332394589941,71.87076950073242,0.0
54,2,Logistic Regression (Penalty = L2),0,0.1,0.6169844020797227,0.6288249295942455,0.21693968772888184,0.0
55,2,Naive Bayes,0,0.1,0.5996533795493935,0.6612555313096259,0.10767388343811035,0.0
56,2,KNeighbors Classifier,1,0.1,0.8229166666666666,0.9265855567861313,0.3290259838104248,0.0
57,2,SVC Classifier,1,0.1,0.7274305555555556,0.7636780043269571,0.6565868854522705,0.0
58,2,Decision Tree,1,0.1,0.8229166666666666,0.9265855567861313,0.0015146732330322266,0.0
59,2,RandomForest,1,0.1,0.78125,0.7990572919580082,0.8578670024871826,0.0
60,2,AdaBoost (Discrete),1,0.1,0.8229166666666666,0.9265855567861313,43.56992268562317,0.0
61,2,AdaBoost (Real),1,0.1,0.8229166666666666,0.9265855567861313,58.01168966293335,0.0
62,2,Logistic Regression (Penalty = L2),1,0.1,0.78125,0.7990572919580082,0.3177509307861328,0.0
63,2,Naive Bayes,1,0.1,0.7395833333333334,0.8130041017960279,0.10902070999145508,0.0
64,2,KNeighbors Classifier,2,0.1,0.76,0.641347040372881,0.21843433380126953,0.0
65,2,SVC Classifier,2,0.1,0.8382608695652174,0.8340051055773173,0.7451798915863037,0.0
66,2,Decision Tree,2,0.1,0.76,0.641347040372881,0.0014660358428955078,0.0
67,2,RandomForest,2,0.1,0.7008695652173913,1.0,0.670773983001709,0.0
68,2,AdaBoost (Discrete),2,0.1,0.76,0.641347040372881,44.92603254318237,0.0
69,2,AdaBoost (Real),2,0.1,0.76,0.641347040372881,102.4289071559906,0.0
70,2,Logistic Regression (Penalty = L2),2,0.1,0.8382608695652174,0.8340051055773173,0.21615290641784668,0.0
71,2,Naive Bayes,2,0.1,0.76,0.641347040372881,0.10869622230529785,0.0
72,3,KNeighbors Classifier,0,0.1,0.6845753899480069,0.8129520829107402,0.2205815315246582,0.0
73,3,SVC Classifier,0,0.1,0.6845753899480069,0.8129520829107402,0.41909098625183105,0.0
74,3,Decision Tree,0,0.1,0.6845753899480069,0.8129520829107402,0.0022535324096679688,0.0
75,3,RandomForest,0,0.1,0.7417677642980935,0.7407118766149331,0.6640338897705078,0.0
76,3,AdaBoost (Discrete),0,0.1,0.6845753899480069,0.8129520829107402,40.25680732727051,0.0
77,3,AdaBoost (Real),0,0.1,0.6845753899480069,0.8129520829107402,108.29482555389404,0.0
78,3,Logistic Regression (Penalty = L2),0,0.1,0.6845753899480069,0.8129520829107402,0.030864477157592773,0.0
79,3,Naive Bayes,0,0.1,0.5805892547660312,0.6192878878744241,0.002637624740600586,0.0
80,3,KNeighbors Classifier,1,0.1,0.6666666666666666,0.6596260502202088,0.03326535224914551,0.0
81,3,SVC Classifier,1,0.1,0.7690972222222222,0.8841027752029671,0.27859926223754883,0.0
82,3,Decision Tree,1,0.1,0.7690972222222222,0.8841027752029671,0.0022516250610351562,0.0
83,3,RandomForest,1,0.1,0.8038194444444444,0.7744915485716632,0.5166454315185547,0.0
84,3,AdaBoost (Discrete),1,0.1,0.7690972222222222,0.8841027752029671,37.91828489303589,0.0
85,3,AdaBoost (Real),1,0.1,0.7690972222222222,0.8841027752029671,133.87647318840027,0.0
86,3,Logistic Regression (Penalty = L2),1,0.1,0.7690972222222222,0.8841027752029671,0.28000497817993164,0.0
87,3,Naive Bayes,1,0.1,0.6666666666666666,0.6596260502202088,0.17981243133544922,0.0
88,3,KNeighbors Classifier,2,0.1,0.7617391304347826,0.5617326583032773,0.47432804107666016,0.0
89,3,SVC Classifier,2,0.1,0.7617391304347826,0.5617326583032773,0.9811313152313232,0.0
90,3,Decision Tree,2,0.1,0.7617391304347826,0.5617326583032773,0.16628289222717285,0.0
91,3,RandomForest,2,0.1,0.7617391304347826,0.5617326583032773,0.9235479831695557,0.0
92,3,AdaBoost (Discrete),2,0.1,0.7617391304347826,0.5617326583032773,78.39929246902466,0.0
93,3,AdaBoost (Real),2,0.1,0.7617391304347826,0.5617326583032773,241.845374584198,0.0
94,3,Logistic Regression (Penalty = L2),2,0.1,0.7617391304347826,0.5617326583032773,0.1867966651916504,0.0
95,3,Naive Bayes,2,0.1,0.8452173913043478,0.8606607789059729,0.18451309204101562,0.0
96,4,KNeighbors Classifier,0,0.1,0.7001733102253033,1.0,0.5901122093200684,0.0
97,4,SVC Classifier,0,0.1,0.7001733102253033,1.0,1.1576142311096191,0.0
98,4,Decision Tree,0,0.1,0.7001733102253033,1.0,0.002194643020629883,0.0
99,4,RandomForest,0,0.1,0.7001733102253033,1.0,1.428295373916626,0.0
100,4,AdaBoost (Discrete),0,0.1,0.7001733102253033,1.0,80.29700207710266,0.0
101,4,AdaBoost (Real),0,0.1,0.7001733102253033,1.0,300.6820502281189,0.0
102,4,Logistic Regression (Penalty = L2),0,0.1,0.7001733102253033,1.0,0.38024139404296875,0.0
103,4,Naive Bayes,0,0.1,0.5025996533795494,0.6332377902572627,0.002336740493774414,0.0
104,4,KNeighbors Classifier,1,0.1,0.6996527777777778,1.0,0.5767300128936768,0.0
105,4,SVC Classifier,1,0.1,0.6996527777777778,1.0,0.7661750316619873,0.0
106,4,Decision Tree,1,0.1,0.6996527777777778,1.0,0.21026992797851562,0.0
107,4,RandomForest,1,0.1,0.6996527777777778,1.0,1.5592679977416992,0.0
108,4,AdaBoost (Discrete),1,0.1,0.6996527777777778,1.0,73.05656671524048,0.0
109,4,AdaBoost (Real),1,0.1,0.6996527777777778,1.0,148.08497714996338,0.0
110,4,Logistic Regression (Penalty = L2),1,0.1,0.6996527777777778,1.0,0.22846221923828125,0.0
111,4,Naive Bayes,1,0.1,0.5503472222222222,0.6848230649393702,0.002207040786743164,0.0
112,4,KNeighbors Classifier,2,0.1,0.7008695652173913,1.0,0.3013296127319336,0.0
113,4,SVC Classifier,2,0.1,0.7008695652173913,1.0,0.5463910102844238,0.0
114,4,Decision Tree,2,0.1,0.7008695652173913,1.0,0.0022187232971191406,0.0
115,4,RandomForest,2,0.1,0.7008695652173913,1.0,0.7609879970550537,0.0
116,4,AdaBoost (Discrete),2,0.1,0.7008695652173913,1.0,42.48930549621582,0.0
117,4,AdaBoost (Real),2,0.1,0.7008695652173913,1.0,65.27449655532837,0.0
118,4,Logistic Regression (Penalty = L2),2,0.1,0.7008695652173913,1.0,0.32985949516296387,0.0
119,4,Naive Bayes,2,0.1,0.6139130434782609,0.7472032220800768,0.0025272369384765625,0.0
120,5,KNeighbors Classifier,0,0.1,0.6845753899480069,0.8129520829107402,0.21529126167297363,0.0
121,5,SVC Classifier,0,0.1,0.6845753899480069,0.8129520829107402,0.6479699611663818,0.0
122,5,Decision Tree,0,0.1,0.6845753899480069,0.8129520829107402,0.10288882255554199,0.0
123,5,RandomForest,0,0.1,0.6845753899480069,0.8129520829107402,0.7698431015014648,0.0
124,5,AdaBoost (Discrete),0,0.1,0.6845753899480069,0.8129520829107402,43.38969922065735,0.0
125,5,AdaBoost (Real),0,0.1,0.6845753899480069,0.8129520829107402,91.37558650970459,0.0
126,5,Logistic Regression (Penalty = L2),0,0.1,0.6845753899480069,0.8129520829107402,0.20446157455444336,0.0
127,5,Naive Bayes,0,0.1,0.6845753899480069,0.8129520829107402,0.1085653305053711,0.0
128,5,KNeighbors Classifier,1,0.1,0.6996527777777778,1.0,0.3218212127685547,0.0
129,5,SVC Classifier,1,0.1,0.7690972222222222,0.8841027752029671,0.5254867076873779,0.0
130,5,Decision Tree,1,0.1,0.7690972222222222,0.8841027752029671,0.0013954639434814453,0.0
131,5,RandomForest,1,0.1,0.7690972222222222,0.8841027752029671,0.8144705295562744,0.0
132,5,AdaBoost (Discrete),1,0.1,0.7690972222222222,0.8841027752029671,43.75165557861328,0.0
133,5,AdaBoost (Real),1,0.1,0.7690972222222222,0.8841027752029671,82.83511900901794,0.0
134,5,Logistic Regression (Penalty = L2),1,0.1,0.7690972222222222,0.8841027752029671,0.23958635330200195,0.0
135,5,Naive Bayes,1,0.1,0.7690972222222222,0.8841027752029671,0.09685492515563965,0.0
136,5,KNeighbors Classifier,2,0.1,0.88,0.9684860662631681,0.3188135623931885,0.0
137,5,SVC Classifier,2,0.1,0.7008695652173913,1.0,0.6863260269165039,0.0
138,5,Decision Tree,2,0.1,0.88,0.9684860662631681,0.13006210327148438,0.0
139,5,RandomForest,2,0.1,0.88,0.9684860662631681,0.7769320011138916,0.0
140,5,AdaBoost (Discrete),2,0.1,0.88,0.9684860662631681,46.414806842803955,0.0
141,5,AdaBoost (Real),2,0.1,0.88,0.9684860662631681,55.60227966308594,0.0
142,5,Logistic Regression (Penalty = L2),2,0.1,0.88,0.9684860662631681,0.22333216667175293,0.0
143,5,Naive Bayes,2,0.1,0.88,0.9684860662631681,0.11268949508666992,0.0
144,6,KNeighbors Classifier,0,0.1,0.6845753899480069,0.8129520829107402,0.46128153800964355,0.0
145,6,SVC Classifier,0,0.1,0.6845753899480069,0.8129520829107402,0.6679964065551758,0.0
146,6,Decision Tree,0,0.1,0.6845753899480069,0.8129520829107402,0.0022897720336914062,0.0
147,6,RandomForest,0,0.1,0.7417677642980935,0.7407118766149331,0.6907863616943359,0.0
148,6,AdaBoost (Discrete),0,0.1,0.6845753899480069,0.8129520829107402,44.40279769897461,0.0
149,6,AdaBoost (Real),0,0.1,0.6845753899480069,0.8129520829107402,115.11719346046448,0.0
150,6,Logistic Regression (Penalty = L2),0,0.1,0.6845753899480069,0.8129520829107402,0.19352126121520996,0.0
151,6,Naive Bayes,0,0.1,0.5805892547660312,0.6192878878744241,0.09649062156677246,0.0
152,6,KNeighbors Classifier,1,0.1,0.6666666666666666,0.6596260502202088,0.39202332496643066,0.0
153,6,SVC Classifier,1,0.1,0.7690972222222222,0.8841027752029671,0.4786648750305176,0.0
154,6,Decision Tree,1,0.1,0.7690972222222222,0.8841027752029671,0.09452605247497559,0.0
155,6,RandomForest,1,0.1,0.8038194444444444,0.7744915485716632,0.6853318214416504,0.0
156,6,AdaBoost (Discrete),1,0.1,0.7690972222222222,0.8841027752029671,40.384154319763184,0.0
157,6,AdaBoost (Real),1,0.1,0.7690972222222222,0.8841027752029671,113.55636239051819,0.0
158,6,Logistic Regression (Penalty = L2),1,0.1,0.7690972222222222,0.8841027752029671,0.20539426803588867,0.0
159,6,Naive Bayes,1,0.1,0.6666666666666666,0.6596260502202088,0.08707380294799805,0.0
160,6,KNeighbors Classifier,2,0.1,0.7617391304347826,0.5617326583032773,0.3224813938140869,0.0
161,6,SVC Classifier,2,0.1,0.7617391304347826,0.5617326583032773,0.6722192764282227,0.0
162,6,Decision Tree,2,0.1,0.7617391304347826,0.5617326583032773,0.0023686885833740234,0.0
163,6,RandomForest,2,0.1,0.7617391304347826,0.5617326583032773,0.626549482345581,0.0
164,6,AdaBoost (Discrete),2,0.1,0.7617391304347826,0.5617326583032773,41.918325662612915,0.0
165,6,AdaBoost (Real),2,0.1,0.7617391304347826,0.5617326583032773,111.39967441558838,0.0
166,6,Logistic Regression (Penalty = L2),2,0.1,0.7617391304347826,0.5617326583032773,0.19289445877075195,0.0
167,6,Naive Bayes,2,0.1,0.8452173913043478,0.8606607789059729,0.002727985382080078,0.0
168,7,KNeighbors Classifier,0,0.1,0.7001733102253033,1.0,0.17656159400939941,0.0
169,7,SVC Classifier,0,0.1,0.7001733102253033,1.0,0.479506254196167,0.0
170,7,Decision Tree,0,0.1,0.7001733102253033,1.0,0.09029960632324219,0.0
171,7,RandomForest,0,0.1,0.7001733102253033,1.0,0.6816074848175049,0.0
172,7,AdaBoost (Discrete),0,0.1,0.7001733102253033,1.0,34.171931982040405,0.0
173,7,AdaBoost (Real),0,0.1,0.7001733102253033,1.0,73.10142731666565,0.0
174,7,Logistic Regression (Penalty = L2),0,0.1,0.7001733102253033,1.0,0.21068143844604492,0.0
175,7,Naive Bayes,0,0.1,0.41767764298093585,0.5598055961226205,0.09225296974182129,0.0
176,7,KNeighbors Classifier,1,0.1,0.6996527777777778,1.0,0.28168582916259766,0.0
177,7,SVC Classifier,1,0.1,0.6996527777777778,1.0,0.37290430068969727,0.0
178,7,Decision Tree,1,0.1,0.5225694444444444,0.5010070503656899,0.002266407012939453,0.0
179,7,RandomForest,1,0.1,0.5225694444444444,0.5010070503656899,0.5719742774963379,0.0
180,7,AdaBoost (Discrete),1,0.1,0.5225694444444444,0.5010070503656899,32.451608180999756,0.0
181,7,AdaBoost (Real),1,0.1,0.5225694444444444,0.5010070503656899,54.156484603881836,0.0
182,7,Logistic Regression (Penalty = L2),1,0.1,0.5225694444444444,0.5010070503656899,0.18363499641418457,0.0
183,7,Naive Bayes,1,0.1,0.4583333333333333,0.5754179127433576,0.09502267837524414,0.0
184,7,KNeighbors Classifier,2,0.1,0.7008695652173913,1.0,0.28485679626464844,0.0
185,7,SVC Classifier,2,0.1,0.7008695652173913,1.0,0.38201022148132324,0.0
186,7,Decision Tree,2,0.1,0.7008695652173913,1.0,0.0020170211791992188,0.0
187,7,RandomForest,2,0.1,0.7008695652173913,1.0,0.4854605197906494,0.0
188,7,AdaBoost (Discrete),2,0.1,0.7008695652173913,1.0,32.66260647773743,0.0
189,7,AdaBoost (Real),2,0.1,0.7008695652173913,1.0,95.194500207901,0.0
190,7,Logistic Regression (Penalty = L2),2,0.1,0.7008695652173913,1.0,0.09400534629821777,0.0
191,7,Naive Bayes,2,0.1,0.43130434782608695,0.7472032220800768,0.09090447425842285,0.0
192,8,KNeighbors Classifier,0,0.1,0.7001733102253033,1.0,0.3592500686645508,0.0
193,8,SVC Classifier,0,0.1,0.7001733102253033,1.0,0.4556617736816406,0.0
194,8,Decision Tree,0,0.1,0.7001733102253033,1.0,0.0013315677642822266,0.0
195,8,RandomForest,0,0.1,0.7001733102253033,1.0,0.5662555694580078,0.0
196,8,AdaBoost (Discrete),0,0.1,0.7001733102253033,1.0,33.586814880371094,0.0
197,8,AdaBoost (Real),0,0.1,0.7001733102253033,1.0,135.28640747070312,0.0
198,8,Logistic Regression (Penalty = L2),0,0.1,0.7001733102253033,1.0,0.4070873260498047,0.0
199,8,Naive Bayes,0,0.1,0.5025996533795494,0.6332377902572627,0.09619760513305664,0.0
200,8,KNeighbors Classifier,1,0.1,0.6996527777777778,1.0,0.3142361640930176,0.0
201,8,SVC Classifier,1,0.1,0.6996527777777778,1.0,0.4417724609375,0.0
202,8,Decision Tree,1,0.1,0.6996527777777778,1.0,0.0013179779052734375,0.0
203,8,RandomForest,1,0.1,0.6996527777777778,1.0,0.6497392654418945,0.0
204,8,AdaBoost (Discrete),1,0.1,0.6996527777777778,1.0,38.27516484260559,0.0
205,8,AdaBoost (Real),1,0.1,0.6996527777777778,1.0,132.15584993362427,0.0
206,8,Logistic Regression (Penalty = L2),1,0.1,0.6996527777777778,1.0,0.29217529296875,0.0
207,8,Naive Bayes,1,0.1,0.5503472222222222,0.6848230649393702,0.11583781242370605,0.0
208,8,KNeighbors Classifier,2,0.1,0.7008695652173913,1.0,0.31124329566955566,0.0
209,8,SVC Classifier,2,0.1,0.7008695652173913,1.0,0.5231606960296631,0.0
210,8,Decision Tree,2,0.1,0.7008695652173913,1.0,0.09801864624023438,0.0
211,8,RandomForest,2,0.1,0.7008695652173913,1.0,0.5168111324310303,0.0
212,8,AdaBoost (Discrete),2,0.1,0.7008695652173913,1.0,39.940629720687866,0.0
213,8,AdaBoost (Real),2,0.1,0.7008695652173913,1.0,66.22457313537598,0.0
214,8,Logistic Regression (Penalty = L2),2,0.1,0.7008695652173913,1.0,0.29007792472839355,0.0
215,8,Naive Bayes,2,0.1,0.6139130434782609,0.7472032220800768,0.08320331573486328,0.0
216,9,KNeighbors Classifier,0,0.1,0.6845753899480069,0.8129520829107402,0.3815279006958008,0.0
217,9,SVC Classifier,0,0.1,0.6845753899480069,0.8129520829107402,0.5759048461914062,0.0
218,9,Decision Tree,0,0.1,0.6845753899480069,0.8129520829107402,0.0014202594757080078,0.0
219,9,RandomForest,0,0.1,0.6845753899480069,0.8129520829107402,0.6868588924407959,0.0
220,9,AdaBoost (Discrete),0,0.1,0.6845753899480069,0.8129520829107402,39.08594107627869,0.0
221,9,AdaBoost (Real),0,0.1,0.6845753899480069,0.8129520829107402,79.83949708938599,0.0
222,9,Logistic Regression (Penalty = L2),0,0.1,0.6845753899480069,0.8129520829107402,0.1958143711090088,0.0
223,9,Naive Bayes,0,0.1,0.6845753899480069,0.8129520829107402,0.09681439399719238,0.0
224,9,KNeighbors Classifier,1,0.1,0.6996527777777778,1.0,0.2886772155761719,0.0
225,9,SVC Classifier,1,0.1,0.7690972222222222,0.8841027752029671,0.39929986000061035,0.0
226,9,Decision Tree,1,0.1,0.7690972222222222,0.8841027752029671,0.09844636917114258,0.0
227,9,RandomForest,1,0.1,0.7690972222222222,0.8841027752029671,0.666466474533081,0.0
228,9,AdaBoost (Discrete),1,0.1,0.7690972222222222,0.8841027752029671,38.12564301490784,0.0
229,9,AdaBoost (Real),1,0.1,0.7690972222222222,0.8841027752029671,69.03835892677307,0.0
230,9,Logistic Regression (Penalty = L2),1,0.1,0.7690972222222222,0.8841027752029671,0.1757030487060547,0.0
231,9,Naive Bayes,1,0.1,0.7690972222222222,0.8841027752029671,0.0886533260345459,0.0
232,9,KNeighbors Classifier,2,0.1,0.88,0.9684860662631681,0.2649199962615967,0.0
233,9,SVC Classifier,2,0.1,0.7008695652173913,1.0,0.5265100002288818,0.0
234,9,Decision Tree,2,0.1,0.88,0.9684860662631681,0.0781564712524414,0.0
235,9,RandomForest,2,0.1,0.88,0.9684860662631681,0.6485991477966309,0.0
236,9,AdaBoost (Discrete),2,0.1,0.88,0.9684860662631681,34.03889751434326,0.0
237,9,AdaBoost (Real),2,0.1,0.88,0.9684860662631681,44.740262269973755,0.0
238,9,Logistic Regression (Penalty = L2),2,0.1,0.88,0.9684860662631681,0.1643831729888916,0.0
239,9,Naive Bayes,2,0.1,0.88,0.9684860662631681,0.08372259140014648,0.0
240,10,KNeighbors Classifier,0,0.1,0.7417677642980935,0.7407118766149331,0.3347318172454834,0.0
241,10,SVC Classifier,0,0.1,0.6845753899480069,0.8129520829107402,0.527869701385498,0.0
242,10,Decision Tree,0,0.1,0.6655112651646448,0.7592254390671672,0.002429962158203125,0.0
243,10,RandomForest,0,0.1,0.6845753899480069,0.8129520829107402,0.5822141170501709,0.0
244,10,AdaBoost (Discrete),0,0.1,0.6655112651646448,0.7592254390671672,35.965240240097046,0.0
245,10,AdaBoost (Real),0,0.1,0.6655112651646448,0.7592254390671672,75.71641087532043,0.0
246,10,Logistic Regression (Penalty = L2),0,0.1,0.6655112651646448,0.7592254390671672,0.15169262886047363,0.0
247,10,Naive Bayes,0,0.1,0.6204506065857885,0.6358151434753927,0.07237100601196289,0.6358151434753927
248,10,KNeighbors Classifier,1,0.1,0.7951388888888888,0.7502067539667118,0.2293529510498047,0.0
249,10,SVC Classifier,1,0.1,0.7690972222222222,0.8841027752029671,0.5325238704681396,0.0
250,10,Decision Tree,1,0.1,0.7690972222222222,0.8841027752029671,0.07396340370178223,0.0
251,10,RandomForest,1,0.1,0.7690972222222222,0.8841027752029671,0.5325109958648682,0.0
252,10,AdaBoost (Discrete),1,0.1,0.7690972222222222,0.8841027752029671,30.4091317653656,0.0
253,10,AdaBoost (Real),1,0.1,0.7690972222222222,0.8841027752029671,54.69497728347778,0.0
254,10,Logistic Regression (Penalty = L2),1,0.1,0.7690972222222222,0.8841027752029671,0.2062227725982666,0.0
255,10,Naive Bayes,1,0.1,0.6979166666666666,0.6508840054173792,0.06840085983276367,0.6508840054173792
256,10,KNeighbors Classifier,2,0.1,0.88,0.9684860662631681,0.2130274772644043,0.0
257,10,SVC Classifier,2,0.1,0.7617391304347826,0.5617326583032773,0.4011671543121338,0.0
258,10,Decision Tree,2,0.1,0.7617391304347826,0.5617326583032773,0.06635618209838867,0.0
259,10,RandomForest,2,0.1,0.7617391304347826,0.5617326583032773,0.4125385284423828,0.0
260,10,AdaBoost (Discrete),2,0.1,0.7617391304347826,0.5617326583032773,27.17740297317505,0.0
261,10,AdaBoost (Real),2,0.1,0.7617391304347826,0.5617326583032773,51.877957820892334,0.0
262,10,Logistic Regression (Penalty = L2),2,0.1,0.7617391304347826,0.5617326583032773,0.10567212104797363,0.0
263,10,Naive Bayes,2,0.1,0.7165217391304348,0.8093457490383623,0.05198812484741211,0.0
264,11,KNeighbors Classifier,0,0.1,0.7209705372616985,0.8020317640187635,0.1853938102722168,0.0
265,11,SVC Classifier,0,0.1,0.6845753899480069,0.8129520829107402,0.5014739036560059,0.0
266,11,Decision Tree,0,0.1,0.6395147313691508,0.6832394989103653,0.0024271011352539062,0.0
267,11,RandomForest,0,0.1,0.7001733102253033,1.0,0.39374208450317383,0.0
268,11,AdaBoost (Discrete),0,0.1,0.634315424610052,0.4793056549750786,24.108582019805908,0.0
269,11,AdaBoost (Real),0,0.1,0.19930675909878684,0.3175579569779725,29.41617774963379,0.0
270,11,Logistic Regression (Penalty = L2),0,0.1,0.6395147313691508,0.6832394989103653,0.16784977912902832,0.0
271,11,Naive Bayes,0,0.1,0.6429809358752167,0.7508927762297288,0.10911035537719727,0.0
272,11,KNeighbors Classifier,1,0.1,0.6597222222222222,0.42855214441831263,0.2274768352508545,0.0
273,11,SVC Classifier,1,0.1,0.7274305555555556,0.7636780043269571,0.5132477283477783,0.0
274,11,Decision Tree,1,0.1,0.6232638888888888,0.5317677766732564,0.05465865135192871,0.0
275,11,RandomForest,1,0.1,0.7274305555555556,0.6082431071696208,0.3913404941558838,0.0
276,11,AdaBoost (Discrete),1,0.1,0.7638888888888888,0.6001589219225056,24.64206075668335,0.0
277,11,AdaBoost (Real),1,0.1,0.7413194444444444,0.6489745986945415,56.99299454689026,0.0
278,11,Logistic Regression (Penalty = L2),1,0.1,0.7378472222222222,0.4118389072852186,0.11649203300476074,0.0
279,11,Naive Bayes,1,0.1,0.8003472222222222,0.6468642383840276,0.05658149719238281,0.6468642383840276
280,11,KNeighbors Classifier,2,0.1,0.6452173913043479,0.7005098326638468,0.276766300201416,0.0
281,11,SVC Classifier,2,0.1,0.8434782608695652,0.837206672457254,0.47078967094421387,0.0
282,11,Decision Tree,2,0.1,0.76,0.641347040372881,0.06251740455627441,0.0
283,11,RandomForest,2,0.1,0.7008695652173913,1.0,0.3961050510406494,0.0
284,11,AdaBoost (Discrete),2,0.1,0.2852173913043478,0.5670455424759689,23.22692561149597,0.0
285,11,AdaBoost (Real),2,0.1,0.19652173913043477,0.4725728113579319,27.678464889526367,0.0
286,11,Logistic Regression (Penalty = L2),2,0.1,0.6678260869565218,0.4161061631504778,0.15533995628356934,0.4161061631504778
287,11,Naive Bayes,2,0.1,0.528695652173913,0.7234770261807716,0.05265974998474121,0.0
288,12,KNeighbors Classifier,0,0.1,0.7001733102253033,1.0,0.1945643424987793,0.0
289,12,SVC Classifier,0,0.1,0.7001733102253033,1.0,0.2607123851776123,0.0
290,12,Decision Tree,0,0.1,0.7001733102253033,1.0,0.001954793930053711,0.0
291,12,RandomForest,0,0.1,0.7001733102253033,1.0,0.40486741065979004,0.0
292,12,AdaBoost (Discrete),0,0.1,0.7001733102253033,1.0,20.813971042633057,0.0
293,12,AdaBoost (Real),0,0.1,0.7001733102253033,1.0,74.17150568962097,0.0
294,12,Logistic Regression (Penalty = L2),0,0.1,0.7001733102253033,1.0,0.14284586906433105,0.0
295,12,Naive Bayes,0,0.1,0.5025996533795494,0.6332377902572627,0.07573914527893066,0.0
296,12,KNeighbors Classifier,1,0.1,0.6996527777777778,1.0,0.20484185218811035,0.0
297,12,SVC Classifier,1,0.1,0.6996527777777778,1.0,0.2419297695159912,0.0
298,12,Decision Tree,1,0.1,0.6996527777777778,1.0,0.04627537727355957,0.0
299,12,RandomForest,1,0.1,0.6996527777777778,1.0,0.4006154537200928,0.0
300,12,AdaBoost (Discrete),1,0.1,0.6996527777777778,1.0,19.876579999923706,0.0
301,12,AdaBoost (Real),1,0.1,0.6996527777777778,1.0,65.89812588691711,0.0
302,12,Logistic Regression (Penalty = L2),1,0.1,0.6996527777777778,1.0,0.13140511512756348,0.0
303,12,Naive Bayes,1,0.1,0.5503472222222222,0.6848230649393702,0.05171060562133789,0.0
304,12,KNeighbors Classifier,2,0.1,0.7008695652173913,1.0,0.19072175025939941,0.0
305,12,SVC Classifier,2,0.1,0.7008695652173913,1.0,0.2710404396057129,0.0
306,12,Decision Tree,2,0.1,0.7008695652173913,1.0,0.04623723030090332,0.0
307,12,RandomForest,2,0.1,0.7008695652173913,1.0,0.3873608112335205,0.0
308,12,AdaBoost (Discrete),2,0.1,0.7008695652173913,1.0,18.96353530883789,0.0
309,12,AdaBoost (Real),2,0.1,0.7008695652173913,1.0,28.490119218826294,0.0
310,12,Logistic Regression (Penalty = L2),2,0.1,0.7008695652173913,1.0,0.22972965240478516,0.0
311,12,Naive Bayes,2,0.1,0.6139130434782609,0.7472032220800768,0.044149160385131836,0.0
