,feat_set_id,classifier,fold_id,feat_th,score,geo_score,exec_t,geo_score_woz
0,0,KNeighbors Classifier,0,0.2,0.13872832369942195,0.3761095585875525,0.04406857490539551,0.0
1,0,SVC Classifier,0,0.2,0.49710982658959535,1.0,0.0491335391998291,0.0
2,0,Decision Tree,0,0.2,0.5260115606936416,0.5055746479561095,0.002684354782104492,0.0
3,0,RandomForest,0,0.2,0.49710982658959535,1.0,0.07316327095031738,0.0
4,0,AdaBoost (Discrete),0,0.2,0.49710982658959535,0.3370284303396468,5.56823205947876,0.0
5,0,AdaBoost (Real),0,0.2,0.5260115606936416,0.5055746479561095,7.911345958709717,0.0
6,0,Logistic Regression (Penalty = L2),0,0.2,0.49710982658959535,1.0,0.06851077079772949,0.0
7,0,Naive Bayes,0,0.2,0.12138728323699421,0.2565612464507602,0.047994375228881836,0.0
8,0,KNeighbors Classifier,1,0.2,0.5119047619047619,0.5480749741372283,0.09975337982177734,0.0
9,0,SVC Classifier,1,0.2,0.5119047619047619,1.0,0.0849311351776123,0.0
10,0,Decision Tree,1,0.2,0.5238095238095238,0.3730570465093572,0.0026710033416748047,0.0
11,0,RandomForest,1,0.2,0.5119047619047619,1.0,0.1085655689239502,0.0
12,0,AdaBoost (Discrete),1,0.2,0.5,0.26855526028143406,6.193522214889526,0.0
13,0,AdaBoost (Real),1,0.2,0.5119047619047619,0.37073259039055545,7.036440134048462,0.0
14,0,Logistic Regression (Penalty = L2),1,0.2,0.5119047619047619,1.0,0.05606675148010254,0.0
15,0,Naive Bayes,1,0.2,0.08928571428571429,0.21385167708929512,0.047968387603759766,0.0
16,0,KNeighbors Classifier,2,0.2,0.5030674846625767,0.41243600031998046,0.06609487533569336,0.0
17,0,SVC Classifier,2,0.2,0.5153374233128835,1.0,0.03793597221374512,0.0
18,0,Decision Tree,2,0.2,0.5398773006134969,0.2857375683405856,0.0015690326690673828,0.0
19,0,RandomForest,2,0.2,0.5153374233128835,1.0,0.094696044921875,0.0
20,0,AdaBoost (Discrete),2,0.2,0.5398773006134969,0.3083651286899972,5.95882511138916,0.0
21,0,AdaBoost (Real),2,0.2,0.5521472392638037,0.3306251487719734,7.130622863769531,0.0
22,0,Logistic Regression (Penalty = L2),2,0.2,0.5153374233128835,1.0,0.06580090522766113,0.0
23,0,Naive Bayes,2,0.2,0.10429447852760736,0.3188194067282532,0.036696672439575195,0.0
24,1,KNeighbors Classifier,0,0.2,0.6127167630057804,0.4673817479527429,0.06924223899841309,0.0
25,1,SVC Classifier,0,0.2,0.49710982658959535,1.0,0.05551767349243164,0.0
26,1,Decision Tree,0,0.2,0.5491329479768786,0.5412689249572322,0.0021669864654541016,0.0
27,1,RandomForest,0,0.2,0.5491329479768786,0.6042750794713536,0.06737756729125977,0.0
28,1,AdaBoost (Discrete),0,0.2,0.6416184971098265,0.6137437613588531,7.931645631790161,0.0
29,1,AdaBoost (Real),0,0.2,0.6416184971098265,0.49858919320379413,9.397209167480469,0.0
30,1,Logistic Regression (Penalty = L2),0,0.2,0.5028901734104047,0.5227579585747102,0.07957744598388672,0.0
31,1,Naive Bayes,0,0.2,0.19653179190751446,0.3577832784583438,0.06157279014587402,0.0
32,1,KNeighbors Classifier,1,0.2,0.6011904761904762,0.4656980682818927,0.08003950119018555,0.0
33,1,SVC Classifier,1,0.2,0.5119047619047619,1.0,0.06429910659790039,0.0
34,1,Decision Tree,1,0.2,0.6130952380952381,0.7336041781662618,0.003473520278930664,0.0
35,1,RandomForest,1,0.2,0.5654761904761905,0.48009694123150753,0.09932637214660645,0.0
36,1,AdaBoost (Discrete),1,0.2,0.6488095238095238,0.5397396625642314,7.54638147354126,0.0
37,1,AdaBoost (Real),1,0.2,0.6071428571428571,0.7052452331286333,9.066556453704834,0.0
38,1,Logistic Regression (Penalty = L2),1,0.2,0.5178571428571429,0.5503212081491045,0.15505194664001465,0.0
39,1,Naive Bayes,1,0.2,0.22023809523809523,0.5594627618341078,0.0492243766784668,0.0
40,1,KNeighbors Classifier,2,0.2,0.6319018404907976,0.6278863909463879,0.07166647911071777,0.0
41,1,SVC Classifier,2,0.2,0.5153374233128835,1.0,0.06561970710754395,0.0
42,1,Decision Tree,2,0.2,0.50920245398773,0.47713889861634656,0.0021195411682128906,0.0
43,1,RandomForest,2,0.2,0.5766871165644172,0.5109716537267232,0.09305238723754883,0.0
44,1,AdaBoost (Discrete),2,0.2,0.6625766871165644,0.6528492438585435,7.936387062072754,0.0
45,1,AdaBoost (Real),2,0.2,0.5705521472392638,0.8231583071399764,9.492191076278687,0.0
46,1,Logistic Regression (Penalty = L2),2,0.2,0.5460122699386503,0.268181277931735,0.10210847854614258,0.0
47,1,Naive Bayes,2,0.2,0.2822085889570552,0.4179341115308785,0.053046226501464844,0.4179341115308785
48,2,KNeighbors Classifier,0,0.2,0.6069364161849711,0.615656797729914,0.07261991500854492,0.0
49,2,SVC Classifier,0,0.2,0.49710982658959535,1.0,0.07269120216369629,0.0
50,2,Decision Tree,0,0.2,0.5895953757225434,0.5545851922280656,0.027974843978881836,0.0
51,2,RandomForest,0,0.2,0.5491329479768786,0.6042750794713536,0.10117793083190918,0.0
52,2,AdaBoost (Discrete),0,0.2,0.6358381502890174,0.5949455837817144,9.610113382339478,0.0
53,2,AdaBoost (Real),0,0.2,0.5838150289017341,0.6319630678090885,10.99109697341919,0.0
54,2,Logistic Regression (Penalty = L2),0,0.2,0.6184971098265896,0.4302982245918818,0.20192790031433105,0.0
55,2,Naive Bayes,0,0.2,0.26011560693641617,0.44995322777257435,0.04871058464050293,0.0
56,2,KNeighbors Classifier,1,0.2,0.6726190476190477,0.7009873471274195,0.07248783111572266,0.0
57,2,SVC Classifier,1,0.2,0.5119047619047619,1.0,0.048990488052368164,0.0
58,2,Decision Tree,1,0.2,0.5654761904761905,0.5873414568766567,0.019325733184814453,0.0
59,2,RandomForest,1,0.2,0.5595238095238095,0.6389431042462725,0.09028339385986328,0.0
60,2,AdaBoost (Discrete),1,0.2,0.6904761904761905,0.7264338758117634,9.360299587249756,0.0
61,2,AdaBoost (Real),1,0.2,0.5773809523809523,0.4238942726241891,10.992461442947388,0.0
62,2,Logistic Regression (Penalty = L2),1,0.2,0.6845238095238095,0.6775895223561039,0.15871644020080566,0.0
63,2,Naive Bayes,1,0.2,0.30357142857142855,0.5134020216201731,0.05392861366271973,0.0
64,2,KNeighbors Classifier,2,0.2,0.6196319018404908,0.5498478108749074,0.1209719181060791,0.0
65,2,SVC Classifier,2,0.2,0.5153374233128835,1.0,0.06748652458190918,0.0
66,2,Decision Tree,2,0.2,0.5460122699386503,0.5789220869071312,0.027806997299194336,0.0
67,2,RandomForest,2,0.2,0.588957055214724,0.7311846378041618,0.09959530830383301,0.0
68,2,AdaBoost (Discrete),2,0.2,0.7055214723926381,0.7002002991326697,9.73054051399231,0.0
69,2,AdaBoost (Real),2,0.2,0.588957055214724,0.8038679774895205,10.457465648651123,0.0
70,2,Logistic Regression (Penalty = L2),2,0.2,0.6687116564417178,0.5828861508526172,0.23783183097839355,0.0
71,2,Naive Bayes,2,0.2,0.25153374233128833,0.46794133873819044,0.07207775115966797,0.0
72,3,KNeighbors Classifier,0,0.2,0.6589595375722543,0.5163996703808528,0.07178258895874023,0.0
73,3,SVC Classifier,0,0.2,0.49710982658959535,1.0,0.10074663162231445,0.0
74,3,Decision Tree,0,0.2,0.653179190751445,0.5403220582386103,0.03264927864074707,0.5403220582386103
75,3,RandomForest,0,0.2,0.5375722543352601,0.422390949677227,0.1603705883026123,0.0
76,3,AdaBoost (Discrete),0,0.2,0.7341040462427746,0.6140064816782489,9.447115898132324,0.0
77,3,AdaBoost (Real),0,0.2,0.6473988439306358,0.7357897351951632,11.030274391174316,0.0
78,3,Logistic Regression (Penalty = L2),0,0.2,0.7167630057803468,0.5344350643302147,0.1491107940673828,0.0
79,3,Naive Bayes,0,0.2,0.23121387283236994,0.3841566096233557,0.03648638725280762,0.0
80,3,KNeighbors Classifier,1,0.2,0.6845238095238095,0.5973939354862952,0.1284489631652832,0.0
81,3,SVC Classifier,1,0.2,0.5119047619047619,1.0,0.11499643325805664,0.0
82,3,Decision Tree,1,0.2,0.6130952380952381,0.5673343470555476,0.002489328384399414,0.0
83,3,RandomForest,1,0.2,0.5476190476190477,0.3301352998405312,0.06748843193054199,0.0
84,3,AdaBoost (Discrete),1,0.2,0.7142857142857143,0.6530289150057973,9.591236352920532,0.0
85,3,AdaBoost (Real),1,0.2,0.6071428571428571,0.5103879315632266,11.095457792282104,0.0
86,3,Logistic Regression (Penalty = L2),1,0.2,0.7916666666666666,0.6670665620332737,0.13747262954711914,0.0
87,3,Naive Bayes,1,0.2,0.2857142857142857,0.4577469512831584,0.037915945053100586,0.0
88,3,KNeighbors Classifier,2,0.2,0.6748466257668712,0.5711624469118788,0.07993960380554199,0.0
89,3,SVC Classifier,2,0.2,0.5153374233128835,1.0,0.09464025497436523,0.0
90,3,Decision Tree,2,0.2,0.6134969325153374,0.6458432552058081,0.0029735565185546875,0.0
91,3,RandomForest,2,0.2,0.5766871165644172,0.6838911999336902,0.10317111015319824,0.0
92,3,AdaBoost (Discrete),2,0.2,0.7484662576687117,0.600171858275512,9.780258178710938,0.0
93,3,AdaBoost (Real),2,0.2,0.5766871165644172,0.585660538907811,11.137196779251099,0.0
94,3,Logistic Regression (Penalty = L2),2,0.2,0.754601226993865,0.6120882042849447,0.16040301322937012,0.0
95,3,Naive Bayes,2,0.2,0.25153374233128833,0.44996777738121824,0.03862595558166504,0.0
96,4,KNeighbors Classifier,0,0.2,0.10404624277456648,0.24456082527864936,0.026533842086791992,0.0
97,4,SVC Classifier,0,0.2,0.49710982658959535,1.0,0.031534433364868164,0.0
98,4,Decision Tree,0,0.2,0.5144508670520231,0.4790904055632943,0.02599620819091797,0.0
99,4,RandomForest,0,0.2,0.49710982658959535,1.0,0.09344267845153809,0.0
100,4,AdaBoost (Discrete),0,0.2,0.5144508670520231,0.4790904055632943,5.336990594863892,0.0
101,4,AdaBoost (Real),0,0.2,0.5086705202312138,0.4028654046206224,6.754101753234863,0.0
102,4,Logistic Regression (Penalty = L2),0,0.2,0.49710982658959535,1.0,0.004908323287963867,0.0
103,4,Naive Bayes,0,0.2,0.09248554913294797,0.3510748715226527,0.029378652572631836,0.0
104,4,KNeighbors Classifier,1,0.2,0.5059523809523809,0.9938837346736189,0.007014274597167969,0.0
105,4,SVC Classifier,1,0.2,0.5119047619047619,1.0,0.030684471130371094,0.0
106,4,Decision Tree,1,0.2,0.5178571428571429,0.48799729377078904,0.02530384063720703,0.0
107,4,RandomForest,1,0.2,0.5119047619047619,1.0,0.12491321563720703,0.0
108,4,AdaBoost (Discrete),1,0.2,0.5178571428571429,0.48799729377078904,5.253682374954224,0.0
109,4,AdaBoost (Real),1,0.2,0.5178571428571429,0.48799729377078904,6.700642347335815,0.0
110,4,Logistic Regression (Penalty = L2),1,0.2,0.5119047619047619,1.0,0.028573036193847656,0.0
111,4,Naive Bayes,1,0.2,0.07738095238095238,0.6299605249474366,0.0058591365814208984,0.0
112,4,KNeighbors Classifier,2,0.2,0.5337423312883436,0.3976353643835253,0.030343294143676758,0.0
113,4,SVC Classifier,2,0.2,0.5153374233128835,1.0,0.03992915153503418,0.0
114,4,Decision Tree,2,0.2,0.5337423312883436,0.3976353643835253,0.0018012523651123047,0.0
115,4,RandomForest,2,0.2,0.5153374233128835,1.0,0.11316180229187012,0.0
116,4,AdaBoost (Discrete),2,0.2,0.5398773006134969,0.28207356966104163,5.5013580322265625,0.0
117,4,AdaBoost (Real),2,0.2,0.5398773006134969,0.28207356966104163,6.970046758651733,0.0
118,4,Logistic Regression (Penalty = L2),2,0.2,0.5153374233128835,1.0,0.030266523361206055,0.0
119,4,Naive Bayes,2,0.2,0.09815950920245399,0.2764555609554996,0.00469970703125,0.0
120,6,KNeighbors Classifier,0,0.2,0.11560693641618497,0.23017706561202741,0.0035359859466552734,0.0
121,6,SVC Classifier,0,0.2,0.47398843930635837,1.0,0.004311084747314453,0.0
122,6,Decision Tree,0,0.2,0.49710982658959535,1.0,0.0016400814056396484,0.0
123,6,RandomForest,0,0.2,0.49710982658959535,1.0,0.06556487083435059,0.0
124,6,AdaBoost (Discrete),0,0.2,0.49710982658959535,0.5824165678214637,4.795916795730591,0.0
125,6,AdaBoost (Real),0,0.2,0.4913294797687861,0.9938837346736189,6.824316740036011,0.0
126,6,Logistic Regression (Penalty = L2),0,0.2,0.49710982658959535,1.0,0.038550376892089844,0.0
127,6,Naive Bayes,0,0.2,0.12716763005780346,0.5848035476425733,0.03098320960998535,0.0
128,6,KNeighbors Classifier,1,0.2,0.5119047619047619,1.0,0.03168082237243652,0.0
129,6,SVC Classifier,1,0.2,0.4880952380952381,1.0,0.010071039199829102,0.0
130,6,Decision Tree,1,0.2,0.5119047619047619,1.0,0.0010666847229003906,0.0
131,6,RandomForest,1,0.2,0.5119047619047619,1.0,0.05975651741027832,0.0
132,6,AdaBoost (Discrete),1,0.2,0.5119047619047619,1.0,5.479928731918335,0.0
133,6,AdaBoost (Real),1,0.2,0.5119047619047619,1.0,7.666728258132935,0.0
134,6,Logistic Regression (Penalty = L2),1,0.2,0.5119047619047619,1.0,0.04592585563659668,0.0
135,6,Naive Bayes,1,0.2,0.125,1.0,0.03471016883850098,0.0
136,6,KNeighbors Classifier,2,0.2,0.5153374233128835,1.0,0.033506155014038086,0.0
137,6,SVC Classifier,2,0.2,0.49693251533742333,1.0,0.043123722076416016,0.0
138,6,Decision Tree,2,0.2,0.5153374233128835,1.0,0.0018887519836425781,0.0
139,6,RandomForest,2,0.2,0.5153374233128835,1.0,0.09579944610595703,0.0
140,6,AdaBoost (Discrete),2,0.2,0.5153374233128835,1.0,5.612936496734619,0.0
141,6,AdaBoost (Real),2,0.2,0.5153374233128835,0.6273573525873524,7.306177139282227,0.0
142,6,Logistic Regression (Penalty = L2),2,0.2,0.5153374233128835,1.0,0.027357816696166992,0.0
143,6,Naive Bayes,2,0.2,0.12269938650306748,0.6299605249474366,0.03371429443359375,0.0
144,7,KNeighbors Classifier,0,0.2,0.6127167630057804,0.5133393530874706,0.030118942260742188,0.0
145,7,SVC Classifier,0,0.2,0.49710982658959535,1.0,0.03194165229797363,0.0
146,7,Decision Tree,0,0.2,0.5375722543352601,0.5611853752004059,0.001764535903930664,0.0
147,7,RandomForest,0,0.2,0.5491329479768786,0.6666920717185073,0.09591269493103027,0.0
148,7,AdaBoost (Discrete),0,0.2,0.5028901734104047,0.3984235792972511,6.403325796127319,0.0
149,7,AdaBoost (Real),0,0.2,0.5491329479768786,0.418939291991082,7.777860641479492,0.0
150,7,Logistic Regression (Penalty = L2),0,0.2,0.5028901734104047,0.5227579585747102,0.033451080322265625,0.0
151,7,Naive Bayes,0,0.2,0.19653179190751446,0.42890231504232523,0.03799867630004883,0.0
152,7,KNeighbors Classifier,1,0.2,0.5833333333333334,0.45999710955652495,0.03195071220397949,0.0
153,7,SVC Classifier,1,0.2,0.5119047619047619,1.0,0.030683279037475586,0.0
154,7,Decision Tree,1,0.2,0.49404761904761907,0.55941943735264,0.0024840831756591797,0.0
155,7,RandomForest,1,0.2,0.5535714285714286,0.6823636839543257,0.07319188117980957,0.0
156,7,AdaBoost (Discrete),1,0.2,0.5714285714285714,0.6170781119859494,6.183793067932129,0.0
157,7,AdaBoost (Real),1,0.2,0.5416666666666666,0.6071266080810012,7.040257930755615,0.0
158,7,Logistic Regression (Penalty = L2),1,0.2,0.5178571428571429,0.5503212081491045,0.03127169609069824,0.0
159,7,Naive Bayes,1,0.2,0.23214285714285715,0.5315026102994314,0.03164267539978027,0.0
160,7,KNeighbors Classifier,2,0.2,0.5705521472392638,0.6840743722643103,0.021199703216552734,0.0
161,7,SVC Classifier,2,0.2,0.5153374233128835,1.0,0.022756099700927734,0.0
162,7,Decision Tree,2,0.2,0.4785276073619632,0.5533073377792391,0.01857781410217285,0.0
163,7,RandomForest,2,0.2,0.5950920245398773,0.8667457680458256,0.05382227897644043,0.0
164,7,AdaBoost (Discrete),2,0.2,0.4539877300613497,0.5634330039870095,5.712498426437378,0.0
165,7,AdaBoost (Real),2,0.2,0.5521472392638037,0.7660722077918758,6.713548898696899,0.0
166,7,Logistic Regression (Penalty = L2),2,0.2,0.5153374233128835,0.5480471276289933,0.06242656707763672,0.0
167,7,Naive Bayes,2,0.2,0.3006134969325153,0.4445195778019555,0.030941247940063477,0.0
168,8,KNeighbors Classifier,0,0.2,0.5317919075144508,0.5182493942858855,0.017876386642456055,0.0
169,8,SVC Classifier,0,0.2,0.47398843930635837,1.0,0.018157482147216797,0.0
170,8,Decision Tree,0,0.2,0.5317919075144508,0.45995836998758627,0.0018732547760009766,0.0
171,8,RandomForest,0,0.2,0.5722543352601156,0.9144602039167664,0.09839224815368652,0.0
172,8,AdaBoost (Discrete),0,0.2,0.5028901734104047,0.5206515802039304,5.241872310638428,0.0
173,8,AdaBoost (Real),0,0.2,0.5838150289017341,0.42067429753480323,6.540022850036621,0.0
174,8,Logistic Regression (Penalty = L2),0,0.2,0.49710982658959535,1.0,0.0312807559967041,0.0
175,8,Naive Bayes,0,0.2,0.19653179190751446,0.4668849752729434,0.030468225479125977,0.0
176,8,KNeighbors Classifier,1,0.2,0.5416666666666666,0.3470747221888375,0.006085395812988281,0.0
177,8,SVC Classifier,1,0.2,0.4880952380952381,1.0,0.032060861587524414,0.0
178,8,Decision Tree,1,0.2,0.5654761904761905,0.560526726795313,0.001753091812133789,0.0
179,8,RandomForest,1,0.2,0.5476190476190477,0.7989794494863394,0.06626391410827637,0.0
180,8,AdaBoost (Discrete),1,0.2,0.3869047619047619,0.40362568688564177,5.082334280014038,0.0
181,8,AdaBoost (Real),1,0.2,0.5416666666666666,0.5670947435683021,6.47440505027771,0.0
182,8,Logistic Regression (Penalty = L2),1,0.2,0.5119047619047619,1.0,0.023036718368530273,0.0
183,8,Naive Bayes,1,0.2,0.13095238095238096,0.7765304014746839,0.0044863224029541016,0.0
184,8,KNeighbors Classifier,2,0.2,0.5828220858895705,0.48322176850242954,0.030144691467285156,0.0
185,8,SVC Classifier,2,0.2,0.49693251533742333,1.0,0.005318403244018555,0.0
186,8,Decision Tree,2,0.2,0.588957055214724,0.5153644266499534,0.0013017654418945312,0.0
187,8,RandomForest,2,0.2,0.558282208588957,0.790420734331125,0.09569072723388672,0.0
188,8,AdaBoost (Discrete),2,0.2,0.38650306748466257,0.4264826672390169,5.405266523361206,0.0
189,8,AdaBoost (Real),2,0.2,0.5766871165644172,0.670171291925624,7.327423334121704,0.0
190,8,Logistic Regression (Penalty = L2),2,0.2,0.5214723926380368,0.3968502629920499,0.023125410079956055,0.0
191,8,Naive Bayes,2,0.2,0.12883435582822086,0.5246207186278116,0.028279542922973633,0.0
192,9,KNeighbors Classifier,0,0.2,0.6011560693641619,0.6220680561548908,0.03194618225097656,0.0
193,9,SVC Classifier,0,0.2,0.49710982658959535,1.0,0.03435969352722168,0.0
194,9,Decision Tree,0,0.2,0.5433526011560693,0.5137629246636685,0.0021314620971679688,0.0
195,9,RandomForest,0,0.2,0.5375722543352601,1.0,0.06570696830749512,0.0
196,9,AdaBoost (Discrete),0,0.2,0.5317919075144508,0.5236403739658835,6.637622594833374,0.0
197,9,AdaBoost (Real),0,0.2,0.5260115606936416,0.5955199457906757,7.4631476402282715,0.0
198,9,Logistic Regression (Penalty = L2),0,0.2,0.5780346820809249,0.5107543132573873,0.028882741928100586,0.0
199,9,Naive Bayes,0,0.2,0.1676300578034682,0.41474303783968264,0.028636455535888672,0.0
200,9,KNeighbors Classifier,1,0.2,0.5595238095238095,0.43932245255196906,0.030263900756835938,0.0
201,9,SVC Classifier,1,0.2,0.5119047619047619,1.0,0.0351102352142334,0.0
202,9,Decision Tree,1,0.2,0.44642857142857145,0.4805565893227915,0.002081632614135742,0.0
203,9,RandomForest,1,0.2,0.5535714285714286,0.43561613976496233,0.06688475608825684,0.0
204,9,AdaBoost (Discrete),1,0.2,0.5892857142857143,0.5166312198395832,5.9254631996154785,0.0
205,9,AdaBoost (Real),1,0.2,0.5654761904761905,0.7164865383219435,7.381871461868286,0.0
206,9,Logistic Regression (Penalty = L2),1,0.2,0.625,0.3894892942607729,0.047171592712402344,0.0
207,9,Naive Bayes,1,0.2,0.22023809523809523,0.39059142413035985,0.022306203842163086,0.0
208,9,KNeighbors Classifier,2,0.2,0.6012269938650306,0.6102619397640692,0.024256229400634766,0.0
209,9,SVC Classifier,2,0.2,0.5153374233128835,1.0,0.04212784767150879,0.0
210,9,Decision Tree,2,0.2,0.48466257668711654,0.6986969200049178,0.019436120986938477,0.0
211,9,RandomForest,2,0.2,0.5521472392638037,1.0,0.09889912605285645,0.0
212,9,AdaBoost (Discrete),2,0.2,0.5644171779141104,0.6197682783633883,7.007095813751221,0.0
213,9,AdaBoost (Real),2,0.2,0.5644171779141104,0.8056509254271054,7.652831315994263,0.0
214,9,Logistic Regression (Penalty = L2),2,0.2,0.6134969325153374,0.6233601689808935,0.08413290977478027,0.0
215,9,Naive Bayes,2,0.2,0.15337423312883436,0.6083102845145252,0.03125619888305664,0.0
216,10,KNeighbors Classifier,0,0.2,0.6184971098265896,0.6246839998913601,0.05497884750366211,0.0
217,10,SVC Classifier,0,0.2,0.49710982658959535,1.0,0.057346343994140625,0.0
218,10,Decision Tree,0,0.2,0.5895953757225434,0.7030774475524617,0.002843141555786133,0.0
219,10,RandomForest,0,0.2,0.5549132947976878,0.668740304976422,0.12049531936645508,0.0
220,10,AdaBoost (Discrete),0,0.2,0.6473988439306358,0.6928209605752739,7.379370927810669,0.0
221,10,AdaBoost (Real),0,0.2,0.630057803468208,0.6943377365756876,8.547934532165527,0.0
222,10,Logistic Regression (Penalty = L2),0,0.2,0.5780346820809249,0.5107543132573873,0.08261632919311523,0.0
223,10,Naive Bayes,0,0.2,0.18497109826589594,0.4314261408130719,0.030544281005859375,0.0
224,10,KNeighbors Classifier,1,0.2,0.5714285714285714,0.471522509473738,0.04137301445007324,0.0
225,10,SVC Classifier,1,0.2,0.5119047619047619,1.0,0.05004119873046875,0.0
226,10,Decision Tree,1,0.2,0.5595238095238095,0.5851658191192495,0.003312826156616211,0.0
227,10,RandomForest,1,0.2,0.5535714285714286,0.46890499791032614,0.07108497619628906,0.0
228,10,AdaBoost (Discrete),1,0.2,0.6666666666666666,0.5895080313041321,6.584519863128662,0.0
229,10,AdaBoost (Real),1,0.2,0.6011904761904762,0.5158947015829571,8.896467447280884,0.0
230,10,Logistic Regression (Penalty = L2),1,0.2,0.6309523809523809,0.38447953876635677,0.18850469589233398,0.0
231,10,Naive Bayes,1,0.2,0.23214285714285715,0.34081143277015613,0.037091732025146484,0.0
232,10,KNeighbors Classifier,2,0.2,0.6073619631901841,0.6112110404990385,0.06305480003356934,0.0
233,10,SVC Classifier,2,0.2,0.5153374233128835,1.0,0.03136467933654785,0.0
234,10,Decision Tree,2,0.2,0.5030674846625767,0.5197422314078608,0.002053499221801758,0.0
235,10,RandomForest,2,0.2,0.5644171779141104,0.5869522980860015,0.0935215950012207,0.0
236,10,AdaBoost (Discrete),2,0.2,0.6257668711656442,0.6349751260482843,7.2785584926605225,0.0
237,10,AdaBoost (Real),2,0.2,0.5705521472392638,0.4188977806202915,8.720532178878784,0.0
238,10,Logistic Regression (Penalty = L2),2,0.2,0.6134969325153374,0.6233601689808935,0.1262683868408203,0.0
239,10,Naive Bayes,2,0.2,0.20245398773006135,0.4234095253480114,0.03575587272644043,0.0
240,11,KNeighbors Classifier,0,0.2,0.6589595375722543,0.6230484829384892,0.2961459159851074,0.0
241,11,SVC Classifier,0,0.2,0.49710982658959535,1.0,0.205841064453125,0.0
242,11,Decision Tree,0,0.2,0.6473988439306358,0.5202923084449481,0.025991439819335938,0.5202923084449481
243,11,RandomForest,0,0.2,0.5375722543352601,1.0,0.12401485443115234,0.0
244,11,AdaBoost (Discrete),0,0.2,0.7109826589595376,0.6413844986897409,13.99698781967163,0.0
245,11,AdaBoost (Real),0,0.2,0.6011560693641619,0.5015586159637464,14.640379905700684,0.0
246,11,Logistic Regression (Penalty = L2),0,0.2,0.7109826589595376,0.6105990002181777,0.26496028900146484,0.0
247,11,Naive Bayes,0,0.2,0.2543352601156069,0.4594759073496625,0.0634307861328125,0.0
248,11,KNeighbors Classifier,1,0.2,0.6488095238095238,0.6187925157066435,0.18873929977416992,0.0
249,11,SVC Classifier,1,0.2,0.5119047619047619,1.0,0.16472196578979492,0.0
250,11,Decision Tree,1,0.2,0.5952380952380952,0.643045540175734,0.003370046615600586,0.0
251,11,RandomForest,1,0.2,0.5476190476190477,0.3301352998405312,0.12524843215942383,0.0
252,11,AdaBoost (Discrete),1,0.2,0.7142857142857143,0.5615299522192428,12.545451879501343,0.5615299522192428
253,11,AdaBoost (Real),1,0.2,0.6190476190476191,0.6865023178167254,13.563239574432373,0.0
254,11,Logistic Regression (Penalty = L2),1,0.2,0.7916666666666666,0.721322103476238,0.2297811508178711,0.0
255,11,Naive Bayes,1,0.2,0.27380952380952384,0.4243954757460054,0.06537675857543945,0.4243954757460054
256,11,KNeighbors Classifier,2,0.2,0.6687116564417178,0.6818649364270022,0.15479087829589844,0.0
257,11,SVC Classifier,2,0.2,0.5153374233128835,1.0,0.16613411903381348,0.0
258,11,Decision Tree,2,0.2,0.5521472392638037,0.6145377560502062,0.021318674087524414,0.0
259,11,RandomForest,2,0.2,0.5521472392638037,1.0,0.08745169639587402,0.0
260,11,AdaBoost (Discrete),2,0.2,0.7484662576687117,0.6964445833825548,13.150123119354248,0.0
261,11,AdaBoost (Real),2,0.2,0.5398773006134969,0.7307212758109627,13.722516298294067,0.0
262,11,Logistic Regression (Penalty = L2),2,0.2,0.7484662576687117,0.6419074964454862,0.20292186737060547,0.0
263,11,Naive Bayes,2,0.2,0.3128834355828221,0.5158518733607884,0.04412531852722168,0.5158518733607884
