,feat_set_id,classifier,fold_id,feat_th,score,geo_score,exec_t,geo_score_woz
0,0,KNeighbors Classifier,0,0.75,0.9,0.9085602964160698,0.033896684646606445,0.9085602964160698
1,0,SVC Classifier,0,0.75,0.4166666666666667,0.22360679774997896,0.0319209098815918,0.0
2,0,Decision Tree,0,0.75,0.9166666666666666,0.9148264275057428,0.029759645462036133,0.9148264275057428
3,0,RandomForest,0,0.75,0.8666666666666667,0.8724415058636109,0.26032328605651855,0.8724415058636109
4,0,AdaBoost (Discrete),0,0.75,0.9166666666666666,0.9210078746600967,14.429566144943237,0.9210078746600967
5,0,AdaBoost (Real),0,0.75,0.9333333333333333,0.9410360288810286,15.01500940322876,0.9410360288810286
6,0,Logistic Regression (Penalty = L2),0,0.75,0.9166666666666666,0.9250831838185912,0.08441996574401855,0.9250831838185912
7,0,Naive Bayes,0,0.75,0.9333333333333333,0.9410360288810286,0.03167366981506348,0.9410360288810286
8,0,KNeighbors Classifier,1,0.75,0.9666666666666667,0.9691999875015047,0.03140878677368164,0.9691999875015047
9,0,SVC Classifier,1,0.75,0.4,1.0,0.0020475387573242188,0.0
10,0,Decision Tree,1,0.75,0.8666666666666667,0.8401250522440117,0.0017857551574707031,0.8401250522440117
11,0,RandomForest,1,0.75,0.9166666666666666,0.9140478514466457,0.19752025604248047,0.9140478514466457
12,0,AdaBoost (Discrete),1,0.75,0.8833333333333333,0.8662391053409028,13.182011365890503,0.8662391053409028
13,0,AdaBoost (Real),1,0.75,0.85,0.8358603846235818,14.459290981292725,0.8358603846235818
14,0,Logistic Regression (Penalty = L2),1,0.75,0.9333333333333333,0.9339246536301676,0.003075838088989258,0.9339246536301676
15,0,Naive Bayes,1,0.75,0.9666666666666667,0.9654893846056297,0.03554272651672363,0.9654893846056297
16,0,KNeighbors Classifier,2,0.75,0.9655172413793104,0.9701312318500641,0.03602337837219238,0.9701312318500641
17,0,SVC Classifier,2,0.75,0.39655172413793105,1.0,0.03467130661010742,0.0
18,0,Decision Tree,2,0.75,0.9827586206896551,0.9852919811325488,0.033782958984375,0.9852919811325488
19,0,RandomForest,2,0.75,1.0,1.0,0.22092509269714355,1.0
20,0,AdaBoost (Discrete),2,0.75,0.9655172413793104,0.967693705920519,13.13102674484253,0.967693705920519
21,0,AdaBoost (Real),2,0.75,0.8793103448275862,0.8858189155864656,14.407545804977417,0.8858189155864656
22,0,Logistic Regression (Penalty = L2),2,0.75,0.9655172413793104,0.9701312318500641,0.035218000411987305,0.9701312318500641
23,0,Naive Bayes,2,0.75,0.9655172413793104,0.967693705920519,0.026770353317260742,0.967693705920519
24,1,KNeighbors Classifier,0,0.75,0.95,0.9564655913861946,0.003540515899658203,0.9564655913861946
25,1,SVC Classifier,0,0.75,0.45,0.3872983346207417,0.026497364044189453,0.0
26,1,Decision Tree,0,0.75,0.9,0.8925046227401946,0.03500223159790039,0.8925046227401946
27,1,RandomForest,0,0.75,0.8666666666666667,0.8724415058636109,0.2082231044769287,0.8724415058636109
28,1,AdaBoost (Discrete),0,0.75,0.9333333333333333,0.9361090484023133,12.56767988204956,0.9361090484023133
29,1,AdaBoost (Real),0,0.75,0.9333333333333333,0.9361090484023133,12.974197626113892,0.9361090484023133
30,1,Logistic Regression (Penalty = L2),0,0.75,1.0,1.0,0.030722618103027344,1.0
31,1,Naive Bayes,0,0.75,0.95,0.9564655913861946,0.031050682067871094,0.9564655913861946
32,1,KNeighbors Classifier,1,0.75,0.9333333333333333,0.9402511777839014,0.00232696533203125,0.9402511777839014
33,1,SVC Classifier,1,0.75,0.4,1.0,0.031197547912597656,0.0
34,1,Decision Tree,1,0.75,0.8,0.7759440455456199,0.029448270797729492,0.7759440455456199
35,1,RandomForest,1,0.75,0.8666666666666667,0.8625212951870681,0.19166159629821777,0.8625212951870681
36,1,AdaBoost (Discrete),1,0.75,0.9,0.8879040017426008,11.906108617782593,0.8879040017426008
37,1,AdaBoost (Real),1,0.75,0.7666666666666667,0.7339168335759311,17.133980751037598,0.7339168335759311
38,1,Logistic Regression (Penalty = L2),1,0.75,0.9833333333333333,0.9830475724915585,0.07638144493103027,0.9830475724915585
39,1,Naive Bayes,1,0.75,0.9666666666666667,0.9654893846056297,0.0018246173858642578,0.9654893846056297
40,1,KNeighbors Classifier,2,0.75,0.9827586206896551,0.9852919811325488,0.03990316390991211,0.9852919811325488
41,1,SVC Classifier,2,0.75,0.39655172413793105,1.0,0.0390019416809082,0.0
42,1,Decision Tree,2,0.75,0.8793103448275862,0.8880007443890127,0.0019371509552001953,0.8880007443890127
43,1,RandomForest,2,0.75,1.0,1.0,0.2014169692993164,1.0
44,1,AdaBoost (Discrete),2,0.75,0.9655172413793104,0.967693705920519,15.39034914970398,0.967693705920519
45,1,AdaBoost (Real),2,0.75,0.9482758620689655,0.9470981939677545,16.55167269706726,0.9470981939677545
46,1,Logistic Regression (Penalty = L2),2,0.75,1.0,1.0,0.062145233154296875,1.0
47,1,Naive Bayes,2,0.75,1.0,1.0,0.05928206443786621,1.0
48,2,KNeighbors Classifier,0,0.75,0.9,0.9085602964160698,0.05460977554321289,0.9085602964160698
49,2,SVC Classifier,0,0.75,0.45,0.3872983346207417,0.05419445037841797,0.0
50,2,Decision Tree,0,0.75,0.9166666666666666,0.9210078746600967,0.001079559326171875,0.9210078746600967
51,2,RandomForest,0,0.75,0.8833333333333333,0.8892233261225158,0.34793543815612793,0.8892233261225158
52,2,AdaBoost (Discrete),0,0.75,0.9333333333333333,0.9361090484023133,16.881202697753906,0.9361090484023133
53,2,AdaBoost (Real),0,0.75,0.9166666666666666,0.9210078746600967,17.65845274925232,0.9210078746600967
54,2,Logistic Regression (Penalty = L2),0,0.75,0.9333333333333333,0.9410360288810286,0.03792285919189453,0.9410360288810286
55,2,Naive Bayes,0,0.75,0.9333333333333333,0.9410360288810286,0.03901839256286621,0.9410360288810286
56,2,KNeighbors Classifier,1,0.75,0.9666666666666667,0.9691999875015047,0.03963017463684082,0.9691999875015047
57,2,SVC Classifier,1,0.75,0.4,1.0,0.0383296012878418,0.0
58,2,Decision Tree,1,0.75,0.8,0.7852043950068067,0.038074493408203125,0.7852043950068067
59,2,RandomForest,1,0.75,0.9,0.8892233261225158,0.3024265766143799,0.8892233261225158
60,2,AdaBoost (Discrete),1,0.75,0.8833333333333333,0.8662391053409028,15.272714138031006,0.8662391053409028
61,2,AdaBoost (Real),1,0.75,0.8,0.7645314458836486,18.75284767150879,0.7645314458836486
62,2,Logistic Regression (Penalty = L2),1,0.75,0.9333333333333333,0.9339246536301676,0.0759117603302002,0.9339246536301676
63,2,Naive Bayes,1,0.75,0.9333333333333333,0.9283177667225558,0.0017833709716796875,0.9283177667225558
64,2,KNeighbors Classifier,2,0.75,0.9827586206896551,0.9852919811325488,0.04763460159301758,0.9852919811325488
65,2,SVC Classifier,2,0.75,0.39655172413793105,1.0,0.04688715934753418,0.0
66,2,Decision Tree,2,0.75,0.9482758620689655,0.9470981939677545,0.0018417835235595703,0.9470981939677545
67,2,RandomForest,2,0.75,1.0,1.0,0.3819310665130615,1.0
68,2,AdaBoost (Discrete),2,0.75,0.9655172413793104,0.967693705920519,16.026720762252808,0.967693705920519
69,2,AdaBoost (Real),2,0.75,0.8793103448275862,0.8858189155864656,19.359469175338745,0.8858189155864656
70,2,Logistic Regression (Penalty = L2),2,0.75,1.0,1.0,0.04298830032348633,1.0
71,2,Naive Bayes,2,0.75,1.0,1.0,0.001882791519165039,1.0
72,3,KNeighbors Classifier,0,0.75,0.9333333333333333,0.9361090484023133,0.03837180137634277,0.9361090484023133
73,3,SVC Classifier,0,0.75,0.45,0.3872983346207417,0.06695866584777832,0.0
74,3,Decision Tree,0,0.75,0.7166666666666667,0.7022743485127901,0.054923057556152344,0.7022743485127901
75,3,RandomForest,0,0.75,0.8833333333333333,0.8892233261225158,0.2754359245300293,0.8892233261225158
76,3,AdaBoost (Discrete),0,0.75,0.9,0.900068581879409,22.015936613082886,0.900068581879409
77,3,AdaBoost (Real),0,0.75,0.9,0.900068581879409,25.911229133605957,0.900068581879409
78,3,Logistic Regression (Penalty = L2),0,0.75,1.0,1.0,0.0029549598693847656,1.0
79,3,Naive Bayes,0,0.75,0.9166666666666666,0.9250831838185912,0.0019004344940185547,0.9250831838185912
80,3,KNeighbors Classifier,1,0.75,0.95,0.9549449757989991,0.06406760215759277,0.9549449757989991
81,3,SVC Classifier,1,0.75,0.4,1.0,0.0017766952514648438,0.0
82,3,Decision Tree,1,0.75,0.7666666666666667,0.7426756176575613,0.0018277168273925781,0.7426756176575613
83,3,RandomForest,1,0.75,0.8666666666666667,0.8401250522440117,0.3812267780303955,0.8401250522440117
84,3,AdaBoost (Discrete),1,0.75,0.8666666666666667,0.8360467110641325,23.81938886642456,0.8360467110641325
85,3,AdaBoost (Real),1,0.75,0.8666666666666667,0.8540369292015386,30.167171478271484,0.8540369292015386
86,3,Logistic Regression (Penalty = L2),1,0.75,0.9666666666666667,0.9691999875015047,0.09818434715270996,0.9691999875015047
87,3,Naive Bayes,1,0.75,0.95,0.9518891309816516,0.0792090892791748,0.9518891309816516
88,3,KNeighbors Classifier,2,0.75,0.9827586206896551,0.9852919811325488,0.08397817611694336,0.9852919811325488
89,3,SVC Classifier,2,0.75,0.39655172413793105,1.0,0.0018112659454345703,0.0
90,3,Decision Tree,2,0.75,1.0,1.0,0.08177924156188965,1.0
91,3,RandomForest,2,0.75,1.0,1.0,0.49755096435546875,1.0
92,3,AdaBoost (Discrete),2,0.75,0.9827586206896551,0.9821390252341226,33.53946328163147,0.9821390252341226
93,3,AdaBoost (Real),2,0.75,0.9827586206896551,0.9821390252341226,30.643973112106323,0.9821390252341226
94,3,Logistic Regression (Penalty = L2),2,0.75,1.0,1.0,0.0028676986694335938,1.0
95,3,Naive Bayes,2,0.75,1.0,1.0,0.07878613471984863,1.0
96,4,KNeighbors Classifier,0,0.75,0.8666666666666667,0.8690066612216124,0.07193303108215332,0.8690066612216124
97,4,SVC Classifier,0,0.75,0.4,1.0,0.08250808715820312,0.0
98,4,Decision Tree,0,0.75,0.8,0.7978130373574884,0.0018382072448730469,0.7978130373574884
99,4,RandomForest,0,0.75,0.8833333333333333,0.8900459198627492,0.4784057140350342,0.8900459198627492
100,4,AdaBoost (Discrete),0,0.75,0.9,0.900068581879409,28.177161931991577,0.900068581879409
101,4,AdaBoost (Real),0,0.75,0.9333333333333333,0.9410360288810286,29.479692459106445,0.9410360288810286
102,4,Logistic Regression (Penalty = L2),0,0.75,0.9666666666666667,0.9714127805419094,0.07149767875671387,0.9714127805419094
103,4,Naive Bayes,0,0.75,0.9333333333333333,0.9410360288810286,0.003163576126098633,0.9410360288810286
104,4,KNeighbors Classifier,1,0.75,0.95,0.9549449757989991,0.07826876640319824,0.9549449757989991
105,4,SVC Classifier,1,0.75,0.4,1.0,0.0026984214782714844,0.0
106,4,Decision Tree,1,0.75,0.85,0.8358603846235818,0.061728715896606445,0.8358603846235818
107,4,RandomForest,1,0.75,0.8666666666666667,0.8360467110641325,0.5743546485900879,0.8360467110641325
108,4,AdaBoost (Discrete),1,0.75,0.9,0.8879040017426008,27.03006649017334,0.8879040017426008
109,4,AdaBoost (Real),1,0.75,0.8666666666666667,0.8478028607535417,33.330374240875244,0.8478028607535417
110,4,Logistic Regression (Penalty = L2),1,0.75,0.9333333333333333,0.9339246536301676,0.0026361942291259766,0.9339246536301676
111,4,Naive Bayes,1,0.75,0.9666666666666667,0.9654893846056297,0.07006287574768066,0.9654893846056297
112,4,KNeighbors Classifier,2,0.75,0.9827586206896551,0.9852919811325488,0.08392453193664551,0.9852919811325488
113,4,SVC Classifier,2,0.75,0.39655172413793105,1.0,0.09435606002807617,0.0
114,4,Decision Tree,2,0.75,0.9137931034482759,0.9197415927589213,0.0016133785247802734,0.9197415927589213
115,4,RandomForest,2,0.75,0.9827586206896551,0.9821390252341226,0.42561888694763184,0.9821390252341226
116,4,AdaBoost (Discrete),2,0.75,0.9827586206896551,0.9852919811325488,31.13154149055481,0.9852919811325488
117,4,AdaBoost (Real),2,0.75,0.9482758620689655,0.9470981939677545,36.713109731674194,0.9470981939677545
118,4,Logistic Regression (Penalty = L2),2,0.75,1.0,1.0,0.08708548545837402,1.0
119,4,Naive Bayes,2,0.75,0.9655172413793104,0.967693705920519,0.08743715286254883,0.967693705920519
120,5,KNeighbors Classifier,0,0.75,0.8833333333333333,0.8914135402065606,0.0023179054260253906,0.8914135402065606
121,5,SVC Classifier,0,0.75,0.4,1.0,0.08702445030212402,0.0
122,5,Decision Tree,0,0.75,0.8666666666666667,0.8428221014099959,0.0016679763793945312,0.8428221014099959
123,5,RandomForest,0,0.75,0.9,0.9053945554302176,0.6027023792266846,0.9053945554302176
124,5,AdaBoost (Discrete),0,0.75,0.9166666666666666,0.9210078746600967,31.525421380996704,0.9210078746600967
125,5,AdaBoost (Real),0,0.75,0.9166666666666666,0.9210078746600967,40.21609330177307,0.9210078746600967
126,5,Logistic Regression (Penalty = L2),0,0.75,0.9333333333333333,0.9410360288810286,0.0948176383972168,0.9410360288810286
127,5,Naive Bayes,0,0.75,0.9333333333333333,0.9410360288810286,0.09103631973266602,0.9410360288810286
128,5,KNeighbors Classifier,1,0.75,0.9833333333333333,0.9859136166167861,0.09597086906433105,0.9859136166167861
129,5,SVC Classifier,1,0.75,0.4,1.0,0.0025339126586914062,0.0
130,5,Decision Tree,1,0.75,0.9166666666666666,0.9133720110188648,0.09390783309936523,0.9133720110188648
131,5,RandomForest,1,0.75,0.9,0.8839223159487537,0.6758902072906494,0.8839223159487537
132,5,AdaBoost (Discrete),1,0.75,0.8833333333333333,0.8662391053409028,36.59743094444275,0.8662391053409028
133,5,AdaBoost (Real),1,0.75,0.85,0.8254818122236567,41.925896406173706,0.8254818122236567
134,5,Logistic Regression (Penalty = L2),1,0.75,0.9333333333333333,0.9339246536301676,0.10293078422546387,0.9339246536301676
135,5,Naive Bayes,1,0.75,0.9333333333333333,0.9283177667225558,0.09912919998168945,0.9283177667225558
136,5,KNeighbors Classifier,2,0.75,0.9827586206896551,0.9852919811325488,0.11493802070617676,0.9852919811325488
137,5,SVC Classifier,2,0.75,0.39655172413793105,1.0,0.0016214847564697266,0.0
138,5,Decision Tree,2,0.75,0.9827586206896551,0.9821390252341226,0.10178494453430176,0.9821390252341226
139,5,RandomForest,2,0.75,0.9827586206896551,0.9821390252341226,0.7244002819061279,0.9821390252341226
140,5,AdaBoost (Discrete),2,0.75,0.9655172413793104,0.967693705920519,39.233696937561035,0.967693705920519
141,5,AdaBoost (Real),2,0.75,0.8793103448275862,0.8858189155864656,44.638049602508545,0.8858189155864656
142,5,Logistic Regression (Penalty = L2),2,0.75,1.0,1.0,0.0023441314697265625,1.0
143,5,Naive Bayes,2,0.75,0.9655172413793104,0.967693705920519,0.10622096061706543,0.967693705920519
144,6,KNeighbors Classifier,0,0.75,0.9333333333333333,0.9410360288810286,0.10798501968383789,0.9410360288810286
145,6,SVC Classifier,0,0.75,0.4,1.0,0.1063389778137207,0.0
146,6,Decision Tree,0,0.75,0.8166666666666667,0.8114878916423982,0.0011410713195800781,0.8114878916423982
147,6,RandomForest,0,0.75,0.8666666666666667,0.8724415058636109,0.7162799835205078,0.8724415058636109
148,6,AdaBoost (Discrete),0,0.75,0.9166666666666666,0.9148264275057428,37.96058511734009,0.9148264275057428
149,6,AdaBoost (Real),0,0.75,0.9333333333333333,0.9410360288810286,44.7102255821228,0.9410360288810286
150,6,Logistic Regression (Penalty = L2),0,0.75,0.95,0.9564655913861946,0.10705733299255371,0.9564655913861946
151,6,Naive Bayes,0,0.75,0.9,0.9085602964160698,0.10733461380004883,0.9085602964160698
152,6,KNeighbors Classifier,1,0.75,0.9833333333333333,0.9859136166167861,0.003221273422241211,0.9859136166167861
153,6,SVC Classifier,1,0.75,0.4,1.0,0.001621246337890625,0.0
154,6,Decision Tree,1,0.75,0.8,0.7759440455456199,0.0010797977447509766,0.7759440455456199
155,6,RandomForest,1,0.75,0.9333333333333333,0.927006439217119,0.8373262882232666,0.927006439217119
156,6,AdaBoost (Discrete),1,0.75,0.85,0.8193212706006459,40.3119010925293,0.8193212706006459
157,6,AdaBoost (Real),1,0.75,0.8666666666666667,0.8478028607535417,43.549001932144165,0.8478028607535417
158,6,Logistic Regression (Penalty = L2),1,0.75,0.95,0.9518891309816516,0.10230660438537598,0.9518891309816516
159,6,Naive Bayes,1,0.75,0.9666666666666667,0.9654893846056297,0.0018837451934814453,0.9654893846056297
160,6,KNeighbors Classifier,2,0.75,0.9827586206896551,0.9852919811325488,0.10738611221313477,0.9852919811325488
161,6,SVC Classifier,2,0.75,0.39655172413793105,1.0,0.10680818557739258,0.0
162,6,Decision Tree,2,0.75,0.9482758620689655,0.9544812172391356,0.0019061565399169922,0.9544812172391356
163,6,RandomForest,2,0.75,0.9827586206896551,0.9821390252341226,0.647904634475708,0.9821390252341226
164,6,AdaBoost (Discrete),2,0.75,1.0,1.0,41.09144401550293,1.0
165,6,AdaBoost (Real),2,0.75,0.9827586206896551,0.9821390252341226,45.29261875152588,0.9821390252341226
166,6,Logistic Regression (Penalty = L2),2,0.75,1.0,1.0,0.0016367435455322266,1.0
167,6,Naive Bayes,2,0.75,0.9827586206896551,0.9852919811325488,0.10658740997314453,0.9852919811325488
168,7,KNeighbors Classifier,0,0.75,0.9166666666666666,0.9250831838185912,0.09128332138061523,0.9250831838185912
169,7,SVC Classifier,0,0.75,0.43333333333333335,0.31622776601683794,0.0016963481903076172,0.0
170,7,Decision Tree,0,0.75,0.8333333333333334,0.831802746039737,0.0018377304077148438,0.831802746039737
171,7,RandomForest,0,0.75,0.8833333333333333,0.8892233261225158,0.7734215259552002,0.8892233261225158
172,7,AdaBoost (Discrete),0,0.75,0.9166666666666666,0.9210078746600967,42.73397779464722,0.9210078746600967
173,7,AdaBoost (Real),0,0.75,0.9,0.900068581879409,44.81630563735962,0.900068581879409
174,7,Logistic Regression (Penalty = L2),0,0.75,0.9833333333333333,0.9859136166167861,0.003023862838745117,0.9859136166167861
175,7,Naive Bayes,0,0.75,0.9666666666666667,0.9714127805419094,0.10743045806884766,0.9714127805419094
176,7,KNeighbors Classifier,1,0.75,0.95,0.9518891309816516,0.0026493072509765625,0.9518891309816516
177,7,SVC Classifier,1,0.75,0.4,1.0,0.10280513763427734,0.0
178,7,Decision Tree,1,0.75,0.8666666666666667,0.8360467110641325,0.001790761947631836,0.8360467110641325
179,7,RandomForest,1,0.75,0.9166666666666666,0.904387441634126,0.6290595531463623,0.904387441634126
180,7,AdaBoost (Discrete),1,0.75,0.9,0.8879040017426008,40.80656838417053,0.8879040017426008
181,7,AdaBoost (Real),1,0.75,0.8666666666666667,0.8478028607535417,45.05508852005005,0.8478028607535417
182,7,Logistic Regression (Penalty = L2),1,0.75,0.95,0.9518891309816516,0.001667022705078125,0.9518891309816516
183,7,Naive Bayes,1,0.75,0.95,0.9472682371859096,0.10736966133117676,0.9472682371859096
184,7,KNeighbors Classifier,2,0.75,0.9827586206896551,0.9852919811325488,0.11187887191772461,0.9852919811325488
185,7,SVC Classifier,2,0.75,0.39655172413793105,1.0,0.10701107978820801,0.0
186,7,Decision Tree,2,0.75,0.9482758620689655,0.9528037423984005,0.001615285873413086,0.9528037423984005
187,7,RandomForest,2,0.75,0.9827586206896551,0.9821390252341226,0.7522656917572021,0.9821390252341226
188,7,AdaBoost (Discrete),2,0.75,0.9655172413793104,0.967693705920519,41.1790337562561,0.967693705920519
189,7,AdaBoost (Real),2,0.75,0.8793103448275862,0.8858189155864656,50.30557823181152,0.8858189155864656
190,7,Logistic Regression (Penalty = L2),2,0.75,1.0,1.0,0.12265944480895996,1.0
191,7,Naive Bayes,2,0.75,0.9827586206896551,0.9821390252341226,0.0030345916748046875,0.9821390252341226
192,8,KNeighbors Classifier,0,0.75,0.9,0.9085602964160698,0.11590147018432617,0.9085602964160698
193,8,SVC Classifier,0,0.75,0.45,0.3872983346207417,0.12327408790588379,0.0
194,8,Decision Tree,0,0.75,0.8166666666666667,0.8099029503193709,0.0011241436004638672,0.8099029503193709
195,8,RandomForest,0,0.75,0.9,0.9085602964160698,0.7070446014404297,0.9085602964160698
196,8,AdaBoost (Discrete),0,0.75,0.9166666666666666,0.9210078746600967,43.51405644416809,0.9210078746600967
197,8,AdaBoost (Real),0,0.75,0.9,0.900068581879409,50.51461148262024,0.900068581879409
198,8,Logistic Regression (Penalty = L2),0,0.75,0.95,0.9564655913861946,0.0025675296783447266,0.9564655913861946
199,8,Naive Bayes,0,0.75,0.8833333333333333,0.8914135402065606,0.1274261474609375,0.8914135402065606
200,8,KNeighbors Classifier,1,0.75,0.9166666666666666,0.9250831838185912,0.13121438026428223,0.9250831838185912
201,8,SVC Classifier,1,0.75,0.4,1.0,0.12626314163208008,0.0
202,8,Decision Tree,1,0.75,0.8,0.7759440455456199,0.1212775707244873,0.7759440455456199
203,8,RandomForest,1,0.75,0.85,0.8372867702993152,0.7149524688720703,0.8372867702993152
204,8,AdaBoost (Discrete),1,0.75,0.85,0.8193212706006459,42.0298855304718,0.8193212706006459
205,8,AdaBoost (Real),1,0.75,0.8333333333333334,0.813853758940804,72.10967516899109,0.813853758940804
206,8,Logistic Regression (Penalty = L2),1,0.75,1.0,1.0,0.002775907516479492,1.0
207,8,Naive Bayes,1,0.75,0.9666666666666667,0.9654893846056297,0.22700905799865723,0.9654893846056297
208,8,KNeighbors Classifier,2,0.75,0.9827586206896551,0.9852919811325488,0.0034227371215820312,0.9852919811325488
209,8,SVC Classifier,2,0.75,0.39655172413793105,1.0,0.2424936294555664,0.0
210,8,Decision Tree,2,0.75,0.9482758620689655,0.9528037423984005,0.2099153995513916,0.9528037423984005
211,8,RandomForest,2,0.75,0.9827586206896551,0.9852919811325488,1.330033779144287,0.9852919811325488
212,8,AdaBoost (Discrete),2,0.75,0.9827586206896551,0.9821390252341226,86.26035761833191,0.9821390252341226
213,8,AdaBoost (Real),2,0.75,0.9827586206896551,0.9821390252341226,90.08984804153442,0.9821390252341226
214,8,Logistic Regression (Penalty = L2),2,0.75,0.9827586206896551,0.9821390252341226,0.2027280330657959,0.9821390252341226
215,8,Naive Bayes,2,0.75,1.0,1.0,0.21542024612426758,1.0
216,9,KNeighbors Classifier,0,0.75,0.9,0.9085602964160698,0.2019202709197998,0.9085602964160698
217,9,SVC Classifier,0,0.75,0.43333333333333335,0.31622776601683794,0.20264959335327148,0.0
218,9,Decision Tree,0,0.75,0.7166666666666667,0.6962383250419169,0.16997718811035156,0.6962383250419169
219,9,RandomForest,0,0.75,0.9166666666666666,0.9250831838185912,1.1870975494384766,0.9250831838185912
220,9,AdaBoost (Discrete),0,0.75,0.8833333333333333,0.8848102344924725,78.25381731987,0.8848102344924725
221,9,AdaBoost (Real),0,0.75,0.9,0.900068581879409,92.9458258152008,0.900068581879409
222,9,Logistic Regression (Penalty = L2),0,0.75,0.9166666666666666,0.9250831838185912,0.21910786628723145,0.9250831838185912
223,9,Naive Bayes,0,0.75,0.9333333333333333,0.9410360288810286,0.0020406246185302734,0.9410360288810286
224,9,KNeighbors Classifier,1,0.75,0.95,0.9518891309816516,0.23059463500976562,0.9518891309816516
225,9,SVC Classifier,1,0.75,0.4,1.0,0.24251484870910645,0.0
226,9,Decision Tree,1,0.75,0.8166666666666667,0.7969255916446714,0.23000645637512207,0.7969255916446714
227,9,RandomForest,1,0.75,0.9,0.8932667961445252,1.3474085330963135,0.8932667961445252
228,9,AdaBoost (Discrete),1,0.75,0.85,0.8193212706006459,79.56448531150818,0.8193212706006459
229,9,AdaBoost (Real),1,0.75,0.8833333333333333,0.8662391053409028,88.03327202796936,0.8662391053409028
230,9,Logistic Regression (Penalty = L2),1,0.75,0.95,0.9518891309816516,0.19478154182434082,0.9518891309816516
231,9,Naive Bayes,1,0.75,0.95,0.9472682371859096,0.17456960678100586,0.9472682371859096
232,9,KNeighbors Classifier,2,0.75,1.0,1.0,0.1957082748413086,1.0
233,9,SVC Classifier,2,0.75,0.39655172413793105,1.0,0.0016031265258789062,0.0
234,9,Decision Tree,2,0.75,1.0,1.0,0.19793176651000977,1.0
235,9,RandomForest,2,0.75,1.0,1.0,1.0039162635803223,1.0
236,9,AdaBoost (Discrete),2,0.75,0.9827586206896551,0.9821390252341226,79.13474488258362,0.9821390252341226
237,9,AdaBoost (Real),2,0.75,0.9827586206896551,0.9821390252341226,87.72307872772217,0.9821390252341226
238,9,Logistic Regression (Penalty = L2),2,0.75,0.9827586206896551,0.9821390252341226,0.18300747871398926,0.9821390252341226
239,9,Naive Bayes,2,0.75,1.0,1.0,0.1950674057006836,1.0
240,10,KNeighbors Classifier,0,0.75,0.95,0.9564655913861946,0.19446468353271484,0.9564655913861946
241,10,SVC Classifier,0,0.75,0.45,0.3872983346207417,0.19427943229675293,0.0
242,10,Decision Tree,0,0.75,0.7833333333333333,0.7796746031126743,0.0018303394317626953,0.7796746031126743
243,10,RandomForest,0,0.75,0.85,0.8549879733383485,1.2413506507873535,0.8549879733383485
244,10,AdaBoost (Discrete),0,0.75,0.9333333333333333,0.9361090484023133,27.513574361801147,0.9361090484023133
245,10,AdaBoost (Real),0,0.75,0.95,0.9564655913861946,39.21270537376404,0.9564655913861946
246,10,Logistic Regression (Penalty = L2),0,0.75,0.95,0.9564655913861946,0.09473848342895508,0.9564655913861946
247,10,Naive Bayes,0,0.75,0.95,0.9564655913861946,0.09861969947814941,0.9564655913861946
248,10,KNeighbors Classifier,1,0.75,0.95,0.9549449757989991,0.0022957324981689453,0.9549449757989991
249,10,SVC Classifier,1,0.75,0.4,1.0,0.09389853477478027,0.0
250,10,Decision Tree,1,0.75,0.9333333333333333,0.9410360288810286,0.09393143653869629,0.9410360288810286
251,10,RandomForest,1,0.75,0.9833333333333333,0.9859136166167861,0.4951913356781006,0.9859136166167861
252,10,AdaBoost (Discrete),1,0.75,0.8833333333333333,0.8662391053409028,35.08947825431824,0.8662391053409028
253,10,AdaBoost (Real),1,0.75,0.85,0.8358603846235818,45.37518000602722,0.8358603846235818
254,10,Logistic Regression (Penalty = L2),1,0.75,0.9666666666666667,0.9691999875015047,0.11022138595581055,0.9691999875015047
255,10,Naive Bayes,1,0.75,0.9666666666666667,0.9654893846056297,0.11142826080322266,0.9654893846056297
256,10,KNeighbors Classifier,2,0.75,0.9655172413793104,0.9701312318500641,0.11182332038879395,0.9701312318500641
257,10,SVC Classifier,2,0.75,0.39655172413793105,1.0,0.11066961288452148,0.0
258,10,Decision Tree,2,0.75,0.8793103448275862,0.886061871966061,0.0011374950408935547,0.886061871966061
259,10,RandomForest,2,0.75,0.9827586206896551,0.9821390252341226,0.6877181529998779,0.9821390252341226
260,10,AdaBoost (Discrete),2,0.75,0.9655172413793104,0.967693705920519,41.652236461639404,0.967693705920519
261,10,AdaBoost (Real),2,0.75,0.9482758620689655,0.9470981939677545,47.542866706848145,0.9470981939677545
262,10,Logistic Regression (Penalty = L2),2,0.75,1.0,1.0,0.11136341094970703,1.0
263,10,Naive Bayes,2,0.75,0.9655172413793104,0.967693705920519,0.11191201210021973,0.967693705920519
264,11,KNeighbors Classifier,0,0.75,0.9166666666666666,0.9210078746600967,0.0024085044860839844,0.9210078746600967
265,11,SVC Classifier,0,0.75,0.45,0.3872983346207417,0.11102604866027832,0.0
266,11,Decision Tree,0,0.75,0.9166666666666666,0.9133720110188648,0.0011775493621826172,0.9133720110188648
267,11,RandomForest,0,0.75,0.85,0.8549879733383485,0.7969925403594971,0.8549879733383485
268,11,AdaBoost (Discrete),0,0.75,0.9166666666666666,0.9210078746600967,41.9129581451416,0.9210078746600967
269,11,AdaBoost (Real),0,0.75,0.9333333333333333,0.9410360288810286,46.235392570495605,0.9410360288810286
270,11,Logistic Regression (Penalty = L2),0,0.75,0.9333333333333333,0.9410360288810286,0.11120963096618652,0.9410360288810286
271,11,Naive Bayes,0,0.75,0.95,0.9564655913861946,0.003383636474609375,0.9564655913861946
272,11,KNeighbors Classifier,1,0.75,0.95,0.9564655913861946,0.11110091209411621,0.9564655913861946
273,11,SVC Classifier,1,0.75,0.4,1.0,0.0017735958099365234,0.0
274,11,Decision Tree,1,0.75,0.8833333333333333,0.8648486709999246,0.11017203330993652,0.8648486709999246
275,11,RandomForest,1,0.75,0.85,0.8414757379333423,0.67903733253479,0.8414757379333423
276,11,AdaBoost (Discrete),1,0.75,0.8833333333333333,0.8662391053409028,42.036009788513184,0.8662391053409028
277,11,AdaBoost (Real),1,0.75,0.85,0.8358603846235818,50.159653186798096,0.8358603846235818
278,11,Logistic Regression (Penalty = L2),1,0.75,0.95,0.9518891309816516,0.11529183387756348,0.9518891309816516
279,11,Naive Bayes,1,0.75,0.9666666666666667,0.9654893846056297,0.11924123764038086,0.9654893846056297
280,11,KNeighbors Classifier,2,0.75,0.9655172413793104,0.9701312318500641,0.0023298263549804688,0.9701312318500641
281,11,SVC Classifier,2,0.75,0.39655172413793105,1.0,0.002702474594116211,0.0
282,11,Decision Tree,2,0.75,0.9655172413793104,0.967693705920519,0.12920880317687988,0.967693705920519
283,11,RandomForest,2,0.75,0.9827586206896551,0.9852919811325488,0.6092097759246826,0.9852919811325488
284,11,AdaBoost (Discrete),2,0.75,0.9655172413793104,0.967693705920519,44.214839458465576,0.967693705920519
285,11,AdaBoost (Real),2,0.75,0.9655172413793104,0.967693705920519,48.31252479553223,0.967693705920519
286,11,Logistic Regression (Penalty = L2),2,0.75,1.0,1.0,0.1109156608581543,1.0
287,11,Naive Bayes,2,0.75,0.9655172413793104,0.967693705920519,0.11535453796386719,0.967693705920519
288,12,KNeighbors Classifier,0,0.75,0.8833333333333333,0.8892233261225158,0.11443424224853516,0.8892233261225158
289,12,SVC Classifier,0,0.75,0.4,1.0,0.002616405487060547,0.0
290,12,Decision Tree,0,0.75,0.9333333333333333,0.9291228996211249,0.0012023448944091797,0.9291228996211249
291,12,RandomForest,0,0.75,0.8833333333333333,0.8892233261225158,0.8124198913574219,0.8892233261225158
292,12,AdaBoost (Discrete),0,0.75,0.9166666666666666,0.9210078746600967,40.27771520614624,0.9210078746600967
293,12,AdaBoost (Real),0,0.75,0.9333333333333333,0.9410360288810286,44.56639909744263,0.9410360288810286
294,12,Logistic Regression (Penalty = L2),0,0.75,0.9333333333333333,0.9410360288810286,0.0015871524810791016,0.9410360288810286
295,12,Naive Bayes,0,0.75,0.8833333333333333,0.8914135402065606,0.0018267631530761719,0.8914135402065606
296,12,KNeighbors Classifier,1,0.75,1.0,1.0,0.11875224113464355,1.0
297,12,SVC Classifier,1,0.75,0.4,1.0,0.10673856735229492,0.0
298,12,Decision Tree,1,0.75,0.8666666666666667,0.8586534347188229,0.0017969608306884766,0.8586534347188229
299,12,RandomForest,1,0.75,0.9333333333333333,0.9339246536301676,0.6458826065063477,0.9339246536301676
300,12,AdaBoost (Discrete),1,0.75,0.8333333333333334,0.8018835824989566,32.09217715263367,0.8018835824989566
301,12,AdaBoost (Real),1,0.75,0.8833333333333333,0.8662391053409028,39.74749302864075,0.8662391053409028
302,12,Logistic Regression (Penalty = L2),1,0.75,0.9666666666666667,0.9654893846056297,0.002614259719848633,0.9654893846056297
303,12,Naive Bayes,1,0.75,0.9333333333333333,0.9283177667225558,0.09558343887329102,0.9283177667225558
304,12,KNeighbors Classifier,2,0.75,1.0,1.0,0.09038591384887695,1.0
305,12,SVC Classifier,2,0.75,0.39655172413793105,1.0,0.002599477767944336,0.0
306,12,Decision Tree,2,0.75,0.9482758620689655,0.9443263914173669,0.0016865730285644531,0.9443263914173669
307,12,RandomForest,2,0.75,0.9827586206896551,0.9852919811325488,0.5867660045623779,0.9852919811325488
308,12,AdaBoost (Discrete),2,0.75,0.9827586206896551,0.9821390252341226,34.05317568778992,0.9821390252341226
309,12,AdaBoost (Real),2,0.75,0.9827586206896551,0.9821390252341226,37.41447591781616,0.9821390252341226
310,12,Logistic Regression (Penalty = L2),2,0.75,0.9827586206896551,0.9821390252341226,0.09104466438293457,0.9821390252341226
311,12,Naive Bayes,2,0.75,1.0,1.0,0.09112119674682617,1.0
