,feat_set_id,classifier,fold_id,feat_th,score,geo_score,exec_t,geo_score_woz
0,0,KNeighbors Classifier,0,0.6,0.8044776119402985,0.7508630548851627,3.8786513805389404,0.7508630548851627
1,0,SVC Classifier,0,0.6,0.6776119402985075,0.6382773666888806,6.98921537399292,0.6382773666888806
2,0,Decision Tree,0,0.6,0.6029850746268657,0.522280907383863,0.46951889991760254,0.522280907383863
3,0,RandomForest,0,0.6,0.5119402985074627,0.34102592218568284,1.7702648639678955,0.34102592218568284
4,0,AdaBoost (Discrete),0,0.6,0.7059701492537314,0.671843802540109,291.7094600200653,0.671843802540109
5,0,AdaBoost (Real),0,0.6,0.6761194029850747,0.6498860326658922,319.5893452167511,0.6498860326658922
6,0,Logistic Regression (Penalty = L2),0,0.6,0.7985074626865671,0.7460438528104506,2.9034228324890137,0.7460438528104506
7,0,Naive Bayes,0,0.6,0.6895522388059702,0.6450157264717294,0.4301176071166992,0.6450157264717294
8,0,KNeighbors Classifier,1,0.6,0.7970149253731343,0.7430338172053779,3.7631938457489014,0.7430338172053779
9,0,SVC Classifier,1,0.6,0.6955223880597015,0.6564316316384946,6.49933123588562,0.6564316316384946
10,0,Decision Tree,1,0.6,0.6029850746268657,0.541936544338142,0.45038437843322754,0.541936544338142
11,0,RandomForest,1,0.6,0.517910447761194,0.3517328139880498,1.7044684886932373,0.3517328139880498
12,0,AdaBoost (Discrete),1,0.6,0.7343283582089553,0.715598243618089,290.4807503223419,0.715598243618089
13,0,AdaBoost (Real),1,0.6,0.6343283582089553,0.6017774617942899,273.1644904613495,0.6017774617942899
14,0,Logistic Regression (Penalty = L2),1,0.6,0.7746268656716417,0.7247176603558275,2.3296430110931396,0.7247176603558275
15,0,Naive Bayes,1,0.6,0.6970149253731344,0.6603153153532785,0.22569942474365234,0.6603153153532785
16,0,KNeighbors Classifier,2,0.6,0.8106060606060606,0.7665461068551661,2.757826089859009,0.7665461068551661
17,0,SVC Classifier,2,0.6,0.7212121212121212,0.6922822819929684,4.51880955696106,0.6922822819929684
18,0,Decision Tree,2,0.6,0.6227272727272727,0.5551183863326689,0.33702921867370605,0.5551183863326689
19,0,RandomForest,2,0.6,0.5212121212121212,0.37077181038701584,1.3490216732025146,0.37077181038701584
20,0,AdaBoost (Discrete),2,0.6,0.7090909090909091,0.6661250162497953,235.70311951637268,0.6661250162497953
21,0,AdaBoost (Real),2,0.6,0.6803030303030303,0.6467603002829779,243.15490460395813,0.6467603002829779
22,0,Logistic Regression (Penalty = L2),2,0.6,0.803030303030303,0.7555969347561876,2.72141432762146,0.7555969347561876
23,0,Naive Bayes,2,0.6,0.7,0.6706805795859136,0.39001965522766113,0.6706805795859136
24,1,KNeighbors Classifier,0,0.6,0.6761194029850747,0.6231289205316524,2.5461719036102295,0.6231289205316524
25,1,SVC Classifier,0,0.6,0.5850746268656717,0.5262759328879668,5.163132190704346,0.5262759328879668
26,1,Decision Tree,0,0.6,0.5447761194029851,0.49673022828802593,0.38312244415283203,0.49673022828802593
27,1,RandomForest,0,0.6,0.44029850746268656,0.2476728763301782,1.3443715572357178,0.0
28,1,AdaBoost (Discrete),0,0.6,0.664179104477612,0.6465417862943919,219.66622114181519,0.6465417862943919
29,1,AdaBoost (Real),0,0.6,0.6492537313432836,0.6040168707874602,247.71546721458435,0.6040168707874602
30,1,Logistic Regression (Penalty = L2),0,0.6,0.7656716417910447,0.7255028697761498,3.2942566871643066,0.7255028697761498
31,1,Naive Bayes,0,0.6,0.5955223880597015,0.5636479634635927,0.3905308246612549,0.5636479634635927
32,1,KNeighbors Classifier,1,0.6,0.6850746268656717,0.6289938272777946,2.733328104019165,0.6289938272777946
33,1,SVC Classifier,1,0.6,0.6373134328358209,0.5774531518711177,5.893484830856323,0.5774531518711177
34,1,Decision Tree,1,0.6,0.5522388059701493,0.5103290000096355,0.3827667236328125,0.5103290000096355
35,1,RandomForest,1,0.6,0.46119402985074626,0.22355607676047798,1.530202865600586,0.22355607676047798
36,1,AdaBoost (Discrete),1,0.6,0.6507462686567164,0.6276405389120296,299.59253787994385,0.6276405389120296
37,1,AdaBoost (Real),1,0.6,0.5626865671641791,0.5080037188018414,292.7107300758362,0.5080037188018414
38,1,Logistic Regression (Penalty = L2),1,0.6,0.7402985074626866,0.6947397244617595,3.4622714519500732,0.6947397244617595
39,1,Naive Bayes,1,0.6,0.6537313432835821,0.6035038648818329,0.2773289680480957,0.6035038648818329
40,1,KNeighbors Classifier,2,0.6,0.6878787878787879,0.6451138984696803,3.095149517059326,0.6451138984696803
41,1,SVC Classifier,2,0.6,0.6242424242424243,0.5697615781305274,7.826313018798828,0.5697615781305274
42,1,Decision Tree,2,0.6,0.5590909090909091,0.5082960174431039,0.49311351776123047,0.5082960174431039
43,1,RandomForest,2,0.6,0.49696969696969695,0.3472258454778094,1.614084005355835,0.3472258454778094
44,1,AdaBoost (Discrete),2,0.6,0.6651515151515152,0.6400041087303858,267.40597701072693,0.6400041087303858
45,1,AdaBoost (Real),2,0.6,0.6333333333333333,0.5966667697034439,261.70698523521423,0.5966667697034439
46,1,Logistic Regression (Penalty = L2),2,0.6,0.7681818181818182,0.7336092093807497,3.2408413887023926,0.7336092093807497
47,1,Naive Bayes,2,0.6,0.6439393939393939,0.6110809424991721,0.30439281463623047,0.6110809424991721
48,2,KNeighbors Classifier,0,0.6,0.7850746268656716,0.7407495467784802,2.986527919769287,0.7407495467784802
49,2,SVC Classifier,0,0.6,0.6895522388059702,0.657133727198708,5.581695318222046,0.657133727198708
50,2,Decision Tree,0,0.6,0.5597014925373134,0.49910280073967,0.4132065773010254,0.49910280073967
51,2,RandomForest,0,0.6,0.508955223880597,0.24321194726590317,1.6167676448822021,0.24321194726590317
52,2,AdaBoost (Discrete),0,0.6,0.7298507462686568,0.6972568225248138,280.1432523727417,0.6972568225248138
53,2,AdaBoost (Real),0,0.6,0.7119402985074627,0.667284382134748,282.717072725296,0.667284382134748
54,2,Logistic Regression (Penalty = L2),0,0.6,0.8104477611940298,0.7642429300066281,4.238535165786743,0.7642429300066281
55,2,Naive Bayes,0,0.6,0.6805970149253732,0.6433099933506662,0.5461926460266113,0.6433099933506662
56,2,KNeighbors Classifier,1,0.6,0.7791044776119403,0.7266583937454651,4.402666807174683,0.7266583937454651
57,2,SVC Classifier,1,0.6,0.7,0.6618281330471673,9.235383987426758,0.6618281330471673
58,2,Decision Tree,1,0.6,0.5746268656716418,0.5137139681088696,0.8407292366027832,0.5137139681088696
59,2,RandomForest,1,0.6,0.5268656716417911,0.3796234905962192,1.991424798965454,0.0
60,2,AdaBoost (Discrete),1,0.6,0.7179104477611941,0.683147547997583,330.6425476074219,0.683147547997583
61,2,AdaBoost (Real),1,0.6,0.6835820895522388,0.6585330471245165,299.17322397232056,0.6585330471245165
62,2,Logistic Regression (Penalty = L2),1,0.6,0.7895522388059701,0.7486168738438186,3.166370391845703,0.7486168738438186
63,2,Naive Bayes,1,0.6,0.7223880597014926,0.678100191316059,0.30576109886169434,0.678100191316059
64,2,KNeighbors Classifier,2,0.6,0.7984848484848485,0.7513405884395361,3.725245714187622,0.7513405884395361
65,2,SVC Classifier,2,0.6,0.7090909090909091,0.6707709090271168,6.769985914230347,0.6707709090271168
66,2,Decision Tree,2,0.6,0.646969696969697,0.5987245821533231,0.31012582778930664,0.5987245821533231
67,2,RandomForest,2,0.6,0.5181818181818182,0.32211609854875195,1.7108657360076904,0.32211609854875195
68,2,AdaBoost (Discrete),2,0.6,0.7393939393939394,0.7142222190535271,248.52056455612183,0.7142222190535271
69,2,AdaBoost (Real),2,0.6,0.6666666666666666,0.6289779826179749,291.9828841686249,0.6289779826179749
70,2,Logistic Regression (Penalty = L2),2,0.6,0.8287878787878787,0.7864120402806105,3.3222482204437256,0.7864120402806105
71,2,Naive Bayes,2,0.6,0.7075757575757575,0.6707846182544493,0.49025678634643555,0.6707846182544493
72,3,KNeighbors Classifier,0,0.6,0.6313432835820896,0.5842863801362338,1.0812015533447266,0.5842863801362338
73,3,SVC Classifier,0,0.6,0.5119402985074627,0.43792411246596674,4.227291822433472,0.43792411246596674
74,3,Decision Tree,0,0.6,0.4761194029850746,0.43942431819564737,0.2989943027496338,0.43942431819564737
75,3,RandomForest,0,0.6,0.41492537313432837,0.24372221030465618,1.393272876739502,0.0
76,3,AdaBoost (Discrete),0,0.6,0.5940298507462687,0.5668501481395491,169.0166654586792,0.5668501481395491
77,3,AdaBoost (Real),0,0.6,0.5522388059701493,0.4769549121045556,193.32935237884521,0.4769549121045556
78,3,Logistic Regression (Penalty = L2),0,0.6,0.6477611940298508,0.6007622062722963,2.216714859008789,0.6007622062722963
79,3,Naive Bayes,0,0.6,0.5432835820895522,0.4855669535322598,0.3162369728088379,0.4855669535322598
80,3,KNeighbors Classifier,1,0.6,0.608955223880597,0.56237037309938,1.2358653545379639,0.56237037309938
81,3,SVC Classifier,1,0.6,0.5507462686567164,0.4494420555849044,5.188311338424683,0.4494420555849044
82,3,Decision Tree,1,0.6,0.4701492537313433,0.43449574456189766,0.3355557918548584,0.43449574456189766
83,3,RandomForest,1,0.6,0.3880597014925373,0.2294782798406257,1.6050894260406494,0.0
84,3,AdaBoost (Discrete),1,0.6,0.5835820895522388,0.5553569065939846,173.21873211860657,0.5553569065939846
85,3,AdaBoost (Real),1,0.6,0.591044776119403,0.5534276854928214,179.92139792442322,0.5534276854928214
86,3,Logistic Regression (Penalty = L2),1,0.6,0.6343283582089553,0.5873656745239164,1.9304859638214111,0.5873656745239164
87,3,Naive Bayes,1,0.6,0.5552238805970149,0.5216709116085725,0.29294919967651367,0.5216709116085725
88,3,KNeighbors Classifier,2,0.6,0.6287878787878788,0.5805583181386278,1.127377986907959,0.5805583181386278
89,3,SVC Classifier,2,0.6,0.5575757575757576,0.5128744222320658,4.185548543930054,0.5128744222320658
90,3,Decision Tree,2,0.6,0.48787878787878786,0.4538758205633296,0.38547611236572266,0.4538758205633296
91,3,RandomForest,2,0.6,0.42272727272727273,0.28061391024608423,1.4206585884094238,0.0
92,3,AdaBoost (Discrete),2,0.6,0.6090909090909091,0.5837943605659627,174.77203941345215,0.5837943605659627
93,3,AdaBoost (Real),2,0.6,0.4984848484848485,0.45419053962427686,204.9198703765869,0.45419053962427686
94,3,Logistic Regression (Penalty = L2),2,0.6,0.6590909090909091,0.6191869160606395,1.9942872524261475,0.6191869160606395
95,3,Naive Bayes,2,0.6,0.5742424242424242,0.5431604691577793,0.18133139610290527,0.5431604691577793
96,4,KNeighbors Classifier,0,0.6,0.7746268656716417,0.7182630419383706,2.493886709213257,0.7182630419383706
97,4,SVC Classifier,0,0.6,0.6507462686567164,0.6014079625223853,6.1916344165802,0.6014079625223853
98,4,Decision Tree,0,0.6,0.5955223880597015,0.5434746809682511,0.47474217414855957,0.5434746809682511
99,4,RandomForest,0,0.6,0.5014925373134328,0.2832867372730781,1.4747729301452637,0.0
100,4,AdaBoost (Discrete),0,0.6,0.7373134328358208,0.7047886579135094,246.39682054519653,0.7047886579135094
101,4,AdaBoost (Real),0,0.6,0.6074626865671642,0.5592791089799317,248.35696959495544,0.5592791089799317
102,4,Logistic Regression (Penalty = L2),0,0.6,0.7850746268656716,0.7386452765604169,2.8136146068573,0.7386452765604169
103,4,Naive Bayes,0,0.6,0.6567164179104478,0.6069756665547089,0.29766035079956055,0.6069756665547089
104,4,KNeighbors Classifier,1,0.6,0.7686567164179104,0.7204614738610244,2.2687153816223145,0.7204614738610244
105,4,SVC Classifier,1,0.6,0.6567164179104478,0.6104750680562787,5.924804925918579,0.6104750680562787
106,4,Decision Tree,1,0.6,0.5985074626865672,0.5556588082179205,0.4400296211242676,0.5556588082179205
107,4,RandomForest,1,0.6,0.44029850746268656,0.2837720714891089,1.4852514266967773,0.0
108,4,AdaBoost (Discrete),1,0.6,0.7104477611940299,0.6861561163036186,231.37761521339417,0.6861561163036186
109,4,AdaBoost (Real),1,0.6,0.49850746268656715,0.36317599329600975,234.4436948299408,0.36317599329600975
110,4,Logistic Regression (Penalty = L2),1,0.6,0.7522388059701492,0.7007888465697445,2.962721109390259,0.7007888465697445
111,4,Naive Bayes,1,0.6,0.6716417910447762,0.6368641928943045,0.29302978515625,0.6368641928943045
112,4,KNeighbors Classifier,2,0.6,0.7757575757575758,0.7213125440446594,2.3533716201782227,0.7213125440446594
113,4,SVC Classifier,2,0.6,0.7015151515151515,0.6632737868758265,5.367674350738525,0.6632737868758265
114,4,Decision Tree,2,0.6,0.593939393939394,0.5463703775236178,0.288419246673584,0.5463703775236178
115,4,RandomForest,2,0.6,0.5378787878787878,0.6046191497798591,1.3350868225097656,0.0
116,4,AdaBoost (Discrete),2,0.6,0.703030303030303,0.6636652696094348,198.58420658111572,0.6636652696094348
117,4,AdaBoost (Real),2,0.6,0.6363636363636364,0.591903175859811,211.23724937438965,0.591903175859811
118,4,Logistic Regression (Penalty = L2),2,0.6,0.7863636363636364,0.7331085113511173,2.239790678024292,0.7331085113511173
119,4,Naive Bayes,2,0.6,0.6742424242424242,0.6421838307613449,0.3028287887573242,0.6421838307613449
120,5,KNeighbors Classifier,0,0.6,0.682089552238806,0.6460432407125482,1.7153372764587402,0.6460432407125482
121,5,SVC Classifier,0,0.6,0.5656716417910448,0.522683491299326,4.970805883407593,0.522683491299326
122,5,Decision Tree,0,0.6,0.5208955223880597,0.46291259160242,0.2571418285369873,0.46291259160242
123,5,RandomForest,0,0.6,0.4208955223880597,0.22499673912470214,1.2886714935302734,0.0
124,5,AdaBoost (Discrete),0,0.6,0.6477611940298508,0.6258765019991928,185.60902214050293,0.6258765019991928
125,5,AdaBoost (Real),0,0.6,0.5805970149253732,0.5519550474862605,1273.2588093280792,0.5519550474862605
126,5,Logistic Regression (Penalty = L2),0,0.6,0.7522388059701492,0.7114663667805233,1.1137244701385498,0.7114663667805233
127,5,Naive Bayes,0,0.6,0.6104477611940299,0.5872432933555177,0.19990992546081543,0.5872432933555177
128,5,KNeighbors Classifier,1,0.6,0.6850746268656717,0.640088394839567,2.493103265762329,0.640088394839567
129,5,SVC Classifier,1,0.6,0.591044776119403,0.5231653116094793,4.085060119628906,0.5231653116094793
130,5,Decision Tree,1,0.6,0.517910447761194,0.4797100999209738,0.26059913635253906,0.4797100999209738
131,5,RandomForest,1,0.6,0.4582089552238806,0.32469361675427455,1.3487844467163086,0.0
132,5,AdaBoost (Discrete),1,0.6,0.6373134328358209,0.6033358004861126,162.43105030059814,0.6033358004861126
133,5,AdaBoost (Real),1,0.6,0.6223880597014926,0.5788963926627503,172.87258124351501,0.5788963926627503
134,5,Logistic Regression (Penalty = L2),1,0.6,0.7268656716417911,0.6850346750049064,1.7607362270355225,0.6850346750049064
135,5,Naive Bayes,1,0.6,0.6298507462686567,0.5976975420157973,0.20480871200561523,0.5976975420157973
136,5,KNeighbors Classifier,2,0.6,0.703030303030303,0.6562346132426823,1.2957377433776855,0.6562346132426823
137,5,SVC Classifier,2,0.6,0.5984848484848485,0.5349632914965428,4.2566399574279785,0.5349632914965428
138,5,Decision Tree,2,0.6,0.5863636363636363,0.5430624729982177,0.3458104133605957,0.5430624729982177
139,5,RandomForest,2,0.6,0.4984848484848485,0.33766629166700307,1.003267765045166,0.33766629166700307
140,5,AdaBoost (Discrete),2,0.6,0.6666666666666666,0.6227626949216725,159.9488787651062,0.6227626949216725
141,5,AdaBoost (Real),2,0.6,0.6348484848484849,0.5944991542807858,163.12629747390747,0.5944991542807858
142,5,Logistic Regression (Penalty = L2),2,0.6,0.7303030303030303,0.6874205654307061,1.724151849746704,0.6874205654307061
143,5,Naive Bayes,2,0.6,0.6287878787878788,0.5941173241131033,0.1927928924560547,0.5941173241131033
144,6,KNeighbors Classifier,0,0.6,0.7805970149253731,0.736321599917892,2.3935108184814453,0.736321599917892
145,6,SVC Classifier,0,0.6,0.682089552238806,0.6478732348668945,4.514178037643433,0.6478732348668945
146,6,Decision Tree,0,0.6,0.5940298507462687,0.5376819226562473,0.44060564041137695,0.5376819226562473
147,6,RandomForest,0,0.6,0.49850746268656715,0.39133012968251085,0.9681487083435059,0.0
148,6,AdaBoost (Discrete),0,0.6,0.7074626865671642,0.6722755340950815,204.30586576461792,0.6722755340950815
149,6,AdaBoost (Real),0,0.6,0.7074626865671642,0.6673530490661373,184.9806399345398,0.6673530490661373
150,6,Logistic Regression (Penalty = L2),0,0.6,0.8104477611940298,0.7652676682778777,2.041997194290161,0.7652676682778777
151,6,Naive Bayes,0,0.6,0.6761194029850747,0.6404764462754635,0.26745080947875977,0.6404764462754635
152,6,KNeighbors Classifier,1,0.6,0.7820895522388059,0.7260059882347452,2.187311887741089,0.7260059882347452
153,6,SVC Classifier,1,0.6,0.6985074626865672,0.6600887422963997,3.899366855621338,0.6600887422963997
154,6,Decision Tree,1,0.6,0.5880597014925373,0.5387646316292685,0.26097750663757324,0.5387646316292685
155,6,RandomForest,1,0.6,0.5283582089552239,0.40129657398460855,0.8823277950286865,0.0
156,6,AdaBoost (Discrete),1,0.6,0.7268656716417911,0.6913601383364281,183.22212076187134,0.6913601383364281
157,6,AdaBoost (Real),1,0.6,0.6985074626865672,0.6763238685933988,183.598313331604,0.6763238685933988
158,6,Logistic Regression (Penalty = L2),1,0.6,0.7865671641791044,0.7426295558953067,2.029237747192383,0.7426295558953067
159,6,Naive Bayes,1,0.6,0.7089552238805971,0.6680962552711551,0.2791266441345215,0.6680962552711551
160,6,KNeighbors Classifier,2,0.6,0.7909090909090909,0.7428377922532534,2.2993674278259277,0.7428377922532534
161,6,SVC Classifier,2,0.6,0.7045454545454546,0.6619804248001139,4.2501060962677,0.6619804248001139
162,6,Decision Tree,2,0.6,0.6424242424242425,0.5793881969644857,0.2703578472137451,0.5793881969644857
163,6,RandomForest,2,0.6,0.5833333333333334,0.3990801288258269,1.016343593597412,0.3990801288258269
164,6,AdaBoost (Discrete),2,0.6,0.7363636363636363,0.7061333695410748,195.54008674621582,0.7061333695410748
165,6,AdaBoost (Real),2,0.6,0.6515151515151515,0.6134698423099482,180.84833097457886,0.6134698423099482
166,6,Logistic Regression (Penalty = L2),2,0.6,0.8272727272727273,0.7864154048332992,2.2115511894226074,0.7864154048332992
167,6,Naive Bayes,2,0.6,0.7,0.6635296103260655,0.2964472770690918,0.6635296103260655
168,7,KNeighbors Classifier,0,0.6,0.7880597014925373,0.7301878787680806,3.657099723815918,0.7301878787680806
169,7,SVC Classifier,0,0.6,0.735820895522388,0.7040762400080554,5.560710430145264,0.7040762400080554
170,7,Decision Tree,0,0.6,0.608955223880597,0.5472143660722176,0.18331313133239746,0.5472143660722176
171,7,RandomForest,0,0.6,0.4701492537313433,0.32240861472955,1.1224181652069092,0.32240861472955
172,7,AdaBoost (Discrete),0,0.6,0.7074626865671642,0.6735901064350998,231.47870254516602,0.6735901064350998
173,7,AdaBoost (Real),0,0.6,0.6522388059701493,0.6203380107835156,199.47084856033325,0.6203380107835156
174,7,Logistic Regression (Penalty = L2),0,0.6,0.8373134328358209,0.7941169430016657,2.1383280754089355,0.7941169430016657
175,7,Naive Bayes,0,0.6,0.7074626865671642,0.6675265243173711,0.20795655250549316,0.6675265243173711
176,7,KNeighbors Classifier,1,0.6,0.7895522388059701,0.7262255990439896,2.6715333461761475,0.7262255990439896
177,7,SVC Classifier,1,0.6,0.7492537313432835,0.7049129171334996,3.8719286918640137,0.7049129171334996
178,7,Decision Tree,1,0.6,0.6059701492537314,0.5413374217798156,0.21629071235656738,0.5413374217798156
179,7,RandomForest,1,0.6,0.5164179104477612,0.3718709512221784,0.7334427833557129,0.3718709512221784
180,7,AdaBoost (Discrete),1,0.6,0.7388059701492538,0.7041841452697127,192.6481773853302,0.7041841452697127
181,7,AdaBoost (Real),1,0.6,0.6746268656716418,0.6328539695167126,183.35348534584045,0.6328539695167126
182,7,Logistic Regression (Penalty = L2),1,0.6,0.8029850746268656,0.7542803387418503,2.274578809738159,0.7542803387418503
183,7,Naive Bayes,1,0.6,0.746268656716418,0.6952237710290633,0.1542377471923828,0.6952237710290633
184,7,KNeighbors Classifier,2,0.6,0.8075757575757576,0.7534137337882884,2.5615105628967285,0.7534137337882884
185,7,SVC Classifier,2,0.6,0.7515151515151515,0.7163649614472037,3.7921907901763916,0.7163649614472037
186,7,Decision Tree,2,0.6,0.6424242424242425,0.5907918594772423,0.21505379676818848,0.5907918594772423
187,7,RandomForest,2,0.6,0.5545454545454546,0.4244886435602499,0.653146505355835,0.0
188,7,AdaBoost (Discrete),2,0.6,0.75,0.7195477440891731,185.85785126686096,0.7195477440891731
189,7,AdaBoost (Real),2,0.6,0.7,0.6631347476387002,203.52240014076233,0.6631347476387002
190,7,Logistic Regression (Penalty = L2),2,0.6,0.8257575757575758,0.7812607525157403,2.523477554321289,0.7812607525157403
191,7,Naive Bayes,2,0.6,0.7378787878787879,0.6954078679851577,0.22341299057006836,0.6954078679851577
192,8,KNeighbors Classifier,0,0.6,0.6373134328358209,0.5902032542272194,0.3881664276123047,0.5902032542272194
193,8,SVC Classifier,0,0.6,0.5119402985074627,0.4339539446989287,2.183290481567383,0.4339539446989287
194,8,Decision Tree,0,0.6,0.508955223880597,0.4618663478043686,0.16034817695617676,0.4618663478043686
195,8,RandomForest,0,0.6,0.3925373134328358,0.4120755541074051,0.6538820266723633,0.0
196,8,AdaBoost (Discrete),0,0.6,0.5761194029850746,0.5378899076587634,78.65322065353394,0.5378899076587634
197,8,AdaBoost (Real),0,0.6,0.5462686567164179,0.4814210962521521,90.22081589698792,0.4814210962521521
198,8,Logistic Regression (Penalty = L2),0,0.6,0.6462686567164179,0.6066577223578372,0.866865873336792,0.6066577223578372
199,8,Naive Bayes,0,0.6,0.5597014925373134,0.5003667806548109,0.1524643898010254,0.5003667806548109
200,8,KNeighbors Classifier,1,0.6,0.6179104477611941,0.5710700375538884,0.4921257495880127,0.5710700375538884
201,8,SVC Classifier,1,0.6,0.5552238805970149,0.4650581080521207,2.188535451889038,0.4650581080521207
202,8,Decision Tree,1,0.6,0.4835820895522388,0.43832732503039545,0.15548038482666016,0.43832732503039545
203,8,RandomForest,1,0.6,0.3925373134328358,0.36296305061391837,0.6424703598022461,0.0
204,8,AdaBoost (Discrete),1,0.6,0.591044776119403,0.5693234131630934,77.78922152519226,0.5693234131630934
205,8,AdaBoost (Real),1,0.6,0.5552238805970149,0.4654442009046119,87.41945672035217,0.4654442009046119
206,8,Logistic Regression (Penalty = L2),1,0.6,0.6358208955223881,0.5848670013080801,0.8638195991516113,0.5848670013080801
207,8,Naive Bayes,1,0.6,0.5597014925373134,0.5253688447108531,0.15902066230773926,0.5253688447108531
208,8,KNeighbors Classifier,2,0.6,0.6272727272727273,0.5741252041960385,0.5620625019073486,0.5741252041960385
209,8,SVC Classifier,2,0.6,0.553030303030303,0.5083035418447828,2.1756646633148193,0.5083035418447828
210,8,Decision Tree,2,0.6,0.5106060606060606,0.4612054192695616,0.1597604751586914,0.4612054192695616
211,8,RandomForest,2,0.6,0.4015151515151515,0.2711030680800442,0.5846095085144043,0.0
212,8,AdaBoost (Discrete),2,0.6,0.6090909090909091,0.5852410885512107,72.83297801017761,0.5852410885512107
213,8,AdaBoost (Real),2,0.6,0.5484848484848485,0.507024196598764,82.92985463142395,0.507024196598764
214,8,Logistic Regression (Penalty = L2),2,0.6,0.6575757575757576,0.612598840777297,0.7903084754943848,0.612598840777297
215,8,Naive Bayes,2,0.6,0.5818181818181818,0.5500643620275418,0.09395051002502441,0.5500643620275418
