,feat_set_id,classifier,fold_id,feat_th,score,geo_score,exec_t,geo_score_woz
0,0,KNeighbors Classifier,0,0.4,0.4186991869918699,0.3903701493207039,0.03672480583190918,0.3903701493207039
1,0,SVC Classifier,0,0.4,0.4268292682926829,1.0,0.09597063064575195,0.0
2,0,Decision Tree,0,0.4,0.43089430894308944,0.42599467564057636,0.01926708221435547,0.42599467564057636
3,0,RandomForest,0,0.4,0.4532520325203252,0.3505424339999727,0.06409740447998047,0.3505424339999727
4,0,AdaBoost (Discrete),0,0.4,0.4268292682926829,0.4242288743331648,4.911865711212158,0.4242288743331648
5,0,AdaBoost (Real),0,0.4,0.3902439024390244,0.392254283399102,5.775969505310059,0.392254283399102
6,0,Logistic Regression (Penalty = L2),0,0.4,0.45528455284552843,0.41382961302778976,0.06411480903625488,0.41382961302778976
7,0,Naive Bayes,0,0.4,0.4349593495934959,0.4465001446204355,0.027084827423095703,0.4465001446204355
8,0,KNeighbors Classifier,1,0.4,0.41140529531568226,0.30861714953379527,0.034293413162231445,0.30861714953379527
9,0,SVC Classifier,1,0.4,0.42769857433808556,1.0,0.17125868797302246,0.0
10,0,Decision Tree,1,0.4,0.4317718940936864,0.39086998360458347,0.001779794692993164,0.39086998360458347
11,0,RandomForest,1,0.4,0.43584521384928715,0.49195203701447265,0.1281125545501709,0.0
12,0,AdaBoost (Discrete),1,0.4,0.4378818737270876,0.3898432040682473,6.217911720275879,0.3898432040682473
13,0,AdaBoost (Real),1,0.4,0.4073319755600815,0.3824993246395032,6.48069953918457,0.3824993246395032
14,0,Logistic Regression (Penalty = L2),1,0.4,0.49287169042769857,0.41954624814667274,0.02203512191772461,0.41954624814667274
15,0,Naive Bayes,1,0.4,0.45621181262729127,0.4715805391651824,0.02789163589477539,0.4715805391651824
16,0,KNeighbors Classifier,2,0.4,0.35918367346938773,0.30617046318588204,0.04268622398376465,0.30617046318588204
17,0,SVC Classifier,2,0.4,0.42653061224489797,1.0,0.09624505043029785,0.0
18,0,Decision Tree,2,0.4,0.38979591836734695,0.35676011875113983,0.0028128623962402344,0.35676011875113983
19,0,RandomForest,2,0.4,0.46122448979591835,0.37692815254331086,0.11673450469970703,0.37692815254331086
20,0,AdaBoost (Discrete),2,0.4,0.3795918367346939,0.3512706285107358,4.940483808517456,0.3512706285107358
21,0,AdaBoost (Real),2,0.4,0.36122448979591837,0.3547620791546693,5.899948835372925,0.3547620791546693
22,0,Logistic Regression (Penalty = L2),2,0.4,0.44081632653061226,0.3993655575373851,0.020891666412353516,0.3993655575373851
23,0,Naive Bayes,2,0.4,0.42244897959183675,0.4356297852627979,0.004168272018432617,0.4356297852627979
24,1,KNeighbors Classifier,0,0.4,0.4796747967479675,0.434614312999845,0.024862051010131836,0.434614312999845
25,1,SVC Classifier,0,0.4,0.4268292682926829,1.0,0.0774691104888916,0.0
26,1,Decision Tree,0,0.4,0.45934959349593496,0.4180398297936144,0.002925395965576172,0.4180398297936144
27,1,RandomForest,0,0.4,0.5447154471544715,0.4421388577027451,0.07173657417297363,0.4421388577027451
28,1,AdaBoost (Discrete),0,0.4,0.5508130081300813,0.5031554008091758,5.462977886199951,0.5031554008091758
29,1,AdaBoost (Real),0,0.4,0.4613821138211382,0.42513489329236487,6.372950315475464,0.42513489329236487
30,1,Logistic Regression (Penalty = L2),0,0.4,0.532520325203252,0.48542607791399145,0.021887540817260742,0.48542607791399145
31,1,Naive Bayes,0,0.4,0.5142276422764228,0.4994778807670072,0.002521991729736328,0.4994778807670072
32,1,KNeighbors Classifier,1,0.4,0.48879837067209775,0.4514075091235593,0.02310776710510254,0.4514075091235593
33,1,SVC Classifier,1,0.4,0.42769857433808556,1.0,0.09694099426269531,0.0
34,1,Decision Tree,1,0.4,0.4908350305498982,0.47066491713961517,0.0034193992614746094,0.47066491713961517
35,1,RandomForest,1,0.4,0.5071283095723014,0.6490242622561955,0.07681655883789062,0.0
36,1,AdaBoost (Discrete),1,0.4,0.5213849287169042,0.4877291771465745,5.893924951553345,0.4877291771465745
37,1,AdaBoost (Real),1,0.4,0.5112016293279023,0.48048037809340777,6.453515529632568,0.48048037809340777
38,1,Logistic Regression (Penalty = L2),1,0.4,0.5213849287169042,0.4517647196600994,0.005632877349853516,0.4517647196600994
39,1,Naive Bayes,1,0.4,0.5071283095723014,0.5076568133155751,0.02009272575378418,0.5076568133155751
40,1,KNeighbors Classifier,2,0.4,0.49387755102040815,0.4507377640611346,0.022550344467163086,0.4507377640611346
41,1,SVC Classifier,2,0.4,0.42653061224489797,1.0,0.0942528247833252,0.0
42,1,Decision Tree,2,0.4,0.4673469387755102,0.42834709112311187,0.00501251220703125,0.42834709112311187
43,1,RandomForest,2,0.4,0.5244897959183673,0.4613744803130961,0.09727191925048828,0.4613744803130961
44,1,AdaBoost (Discrete),2,0.4,0.5285714285714286,0.5016596178671051,5.096637487411499,0.5016596178671051
45,1,AdaBoost (Real),2,0.4,0.4489795918367347,0.43177445222975475,5.6714842319488525,0.43177445222975475
46,1,Logistic Regression (Penalty = L2),2,0.4,0.4959183673469388,0.43942900343722213,0.02041935920715332,0.43942900343722213
47,1,Naive Bayes,2,0.4,0.46530612244897956,0.45379468999613487,0.0034253597259521484,0.45379468999613487
48,2,KNeighbors Classifier,0,0.4,0.4796747967479675,0.4340202522361689,0.04288601875305176,0.4340202522361689
49,2,SVC Classifier,0,0.4,0.4268292682926829,1.0,0.07715559005737305,0.0
50,2,Decision Tree,0,0.4,0.4695121951219512,0.4311386634846257,0.002989530563354492,0.4311386634846257
51,2,RandomForest,0,0.4,0.5121951219512195,0.4355023708696681,0.0686795711517334,0.4355023708696681
52,2,AdaBoost (Discrete),0,0.4,0.5223577235772358,0.4880027213301956,4.818899869918823,0.4880027213301956
53,2,AdaBoost (Real),0,0.4,0.4817073170731707,0.43533034431879913,6.609750986099243,0.43533034431879913
54,2,Logistic Regression (Penalty = L2),0,0.4,0.5264227642276422,0.4833893460448855,0.02225971221923828,0.4833893460448855
55,2,Naive Bayes,0,0.4,0.4898373983739837,0.49139821366297753,0.020355701446533203,0.49139821366297753
56,2,KNeighbors Classifier,1,0.4,0.4908350305498982,0.4266703592716735,0.023897409439086914,0.4266703592716735
57,2,SVC Classifier,1,0.4,0.42769857433808556,1.0,0.12357497215270996,0.0
58,2,Decision Tree,1,0.4,0.48879837067209775,0.4607083569453847,0.02741384506225586,0.4607083569453847
59,2,RandomForest,1,0.4,0.5091649694501018,0.22392878595111146,0.07793188095092773,0.22392878595111146
60,2,AdaBoost (Discrete),1,0.4,0.5295315682281059,0.4859845752371532,5.490529298782349,0.4859845752371532
61,2,AdaBoost (Real),1,0.4,0.4745417515274949,0.45004110489196514,6.571983337402344,0.45004110489196514
62,2,Logistic Regression (Penalty = L2),1,0.4,0.515274949083503,0.4200817568190931,0.0056722164154052734,0.4200817568190931
63,2,Naive Bayes,1,0.4,0.5621181262729125,0.5339919107742928,0.020381450653076172,0.5339919107742928
64,2,KNeighbors Classifier,2,0.4,0.47959183673469385,0.42014825234074427,0.02530217170715332,0.42014825234074427
65,2,SVC Classifier,2,0.4,0.42653061224489797,1.0,0.08933711051940918,0.0
66,2,Decision Tree,2,0.4,0.47346938775510206,0.4416600281875428,0.019564390182495117,0.4416600281875428
67,2,RandomForest,2,0.4,0.5265306122448979,0.459701574374196,0.09212756156921387,0.459701574374196
68,2,AdaBoost (Discrete),2,0.4,0.5183673469387755,0.4827102804313967,5.404241561889648,0.4827102804313967
69,2,AdaBoost (Real),2,0.4,0.4857142857142857,0.4662463676982147,6.543670177459717,0.4662463676982147
70,2,Logistic Regression (Penalty = L2),2,0.4,0.5102040816326531,0.4380198890998969,0.02137446403503418,0.4380198890998969
71,2,Naive Bayes,2,0.4,0.4959183673469388,0.4744405599498111,0.0027036666870117188,0.4744405599498111
72,3,KNeighbors Classifier,0,0.4,0.4796747967479675,0.434614312999845,0.04069662094116211,0.434614312999845
73,3,SVC Classifier,0,0.4,0.4268292682926829,1.0,0.09162020683288574,0.0
74,3,Decision Tree,0,0.4,0.46747967479674796,0.4321754145202407,0.019059181213378906,0.4321754145202407
75,3,RandomForest,0,0.4,0.5447154471544715,0.4421388577027451,0.09488606452941895,0.4421388577027451
76,3,AdaBoost (Discrete),0,0.4,0.5508130081300813,0.5031554008091758,5.573127746582031,0.5031554008091758
77,3,AdaBoost (Real),0,0.4,0.4613821138211382,0.42513489329236487,6.592929363250732,0.42513489329236487
78,3,Logistic Regression (Penalty = L2),0,0.4,0.532520325203252,0.48542607791399145,0.004475593566894531,0.48542607791399145
79,3,Naive Bayes,0,0.4,0.5142276422764228,0.4994778807670072,0.0024878978729248047,0.4994778807670072
80,3,KNeighbors Classifier,1,0.4,0.48879837067209775,0.4514075091235593,0.02372002601623535,0.4514075091235593
81,3,SVC Classifier,1,0.4,0.42769857433808556,1.0,0.12083578109741211,0.0
82,3,Decision Tree,1,0.4,0.4908350305498982,0.45901464867552305,0.0029036998748779297,0.45901464867552305
83,3,RandomForest,1,0.4,0.5071283095723014,0.6490242622561955,0.09933876991271973,0.0
84,3,AdaBoost (Discrete),1,0.4,0.5213849287169042,0.4877291771465745,5.10679030418396,0.4877291771465745
85,3,AdaBoost (Real),1,0.4,0.5112016293279023,0.48048037809340777,6.025294542312622,0.48048037809340777
86,3,Logistic Regression (Penalty = L2),1,0.4,0.5213849287169042,0.4517647196600994,0.02014327049255371,0.4517647196600994
87,3,Naive Bayes,1,0.4,0.5071283095723014,0.5076568133155751,0.003510713577270508,0.5076568133155751
88,3,KNeighbors Classifier,2,0.4,0.49387755102040815,0.4507377640611346,0.02443385124206543,0.4507377640611346
89,3,SVC Classifier,2,0.4,0.42653061224489797,1.0,0.08159017562866211,0.0
90,3,Decision Tree,2,0.4,0.4857142857142857,0.45278771842445664,0.002888202667236328,0.45278771842445664
91,3,RandomForest,2,0.4,0.5244897959183673,0.4613744803130961,0.09525561332702637,0.4613744803130961
92,3,AdaBoost (Discrete),2,0.4,0.5285714285714286,0.5016596178671051,5.003722667694092,0.5016596178671051
93,3,AdaBoost (Real),2,0.4,0.4489795918367347,0.43177445222975475,5.813887596130371,0.43177445222975475
94,3,Logistic Regression (Penalty = L2),2,0.4,0.4959183673469388,0.43942900343722213,0.022234678268432617,0.43942900343722213
95,3,Naive Bayes,2,0.4,0.46530612244897956,0.45379468999613487,0.019872665405273438,0.45379468999613487
96,4,KNeighbors Classifier,0,0.4,0.45528455284552843,0.39108224529756275,0.022977828979492188,0.39108224529756275
97,4,SVC Classifier,0,0.4,0.4268292682926829,1.0,0.0948021411895752,0.0
98,4,Decision Tree,0,0.4,0.4349593495934959,0.3842832062475983,0.0013284683227539062,0.3842832062475983
99,4,RandomForest,0,0.4,0.45528455284552843,0.6109258328392844,0.09326982498168945,0.0
100,4,AdaBoost (Discrete),0,0.4,0.4349593495934959,0.3842832062475983,4.808192253112793,0.3842832062475983
101,4,AdaBoost (Real),0,0.4,0.4349593495934959,0.3842832062475983,5.476146697998047,0.3842832062475983
102,4,Logistic Regression (Penalty = L2),0,0.4,0.4491869918699187,0.330884382889197,0.01846027374267578,0.330884382889197
103,4,Naive Bayes,0,0.4,0.4451219512195122,0.30288761887218785,0.0024034976959228516,0.30288761887218785
104,4,KNeighbors Classifier,1,0.4,0.45010183299389,0.39249241537593565,0.027942657470703125,0.39249241537593565
105,4,SVC Classifier,1,0.4,0.42769857433808556,1.0,0.09832334518432617,0.0
106,4,Decision Tree,1,0.4,0.45417515274949083,0.3816280247549684,0.01815032958984375,0.3816280247549684
107,4,RandomForest,1,0.4,0.4419551934826884,0.44533058252391833,0.08759856224060059,0.0
108,4,AdaBoost (Discrete),1,0.4,0.45417515274949083,0.3816280247549684,4.523400068283081,0.3816280247549684
109,4,AdaBoost (Real),1,0.4,0.45417515274949083,0.3816280247549684,5.468818664550781,0.3816280247549684
110,4,Logistic Regression (Penalty = L2),1,0.4,0.43380855397148677,0.4810702354423639,0.004513978958129883,0.0
111,4,Naive Bayes,1,0.4,0.47657841140529533,0.45602648664572004,0.019971609115600586,0.45602648664572004
112,4,KNeighbors Classifier,2,0.4,0.4204081632653061,0.32357418516789077,0.04089951515197754,0.0
113,4,SVC Classifier,2,0.4,0.42653061224489797,1.0,0.07800960540771484,0.0
114,4,Decision Tree,2,0.4,0.3979591836734694,0.2892977480263379,0.002263784408569336,0.2892977480263379
115,4,RandomForest,2,0.4,0.4326530612244898,0.3745418080680444,0.07170319557189941,0.3745418080680444
116,4,AdaBoost (Discrete),2,0.4,0.3979591836734694,0.2892977480263379,4.62530255317688,0.2892977480263379
117,4,AdaBoost (Real),2,0.4,0.3979591836734694,0.2892977480263379,5.911279678344727,0.2892977480263379
118,4,Logistic Regression (Penalty = L2),2,0.4,0.44081632653061226,0.3390775054052066,0.004509687423706055,0.3390775054052066
119,4,Naive Bayes,2,0.4,0.3795918367346939,0.26596750116818957,0.019689321517944336,0.26596750116818957
120,5,KNeighbors Classifier,0,0.4,0.4349593495934959,0.5019594021800226,0.0065419673919677734,0.0
121,5,SVC Classifier,0,0.4,0.4268292682926829,1.0,0.09233927726745605,0.0
122,5,Decision Tree,0,0.4,0.4451219512195122,0.40035267352558623,0.0016124248504638672,0.40035267352558623
123,5,RandomForest,0,0.4,0.45121951219512196,0.3682166670019936,0.08017086982727051,0.3682166670019936
124,5,AdaBoost (Discrete),0,0.4,0.4349593495934959,0.4003526735255863,5.15286111831665,0.4003526735255863
125,5,AdaBoost (Real),0,0.4,0.44308943089430897,0.4045747878366321,5.617604732513428,0.4045747878366321
126,5,Logistic Regression (Penalty = L2),0,0.4,0.44715447154471544,0.41862949804352684,0.021149396896362305,0.41862949804352684
127,5,Naive Bayes,0,0.4,0.4329268292682927,0.39919891302594995,0.0035986900329589844,0.39919891302594995
128,5,KNeighbors Classifier,1,0.4,0.45213849287169044,0.26641739266567965,0.0228269100189209,0.26641739266567965
129,5,SVC Classifier,1,0.4,0.42769857433808556,1.0,0.07641458511352539,0.0
130,5,Decision Tree,1,0.4,0.4847250509164969,0.3974801851016509,0.0022199153900146484,0.3974801851016509
131,5,RandomForest,1,0.4,0.4419551934826884,0.4272247750345962,0.09092235565185547,0.0
132,5,AdaBoost (Discrete),1,0.4,0.4847250509164969,0.3974801851016509,4.852771282196045,0.3974801851016509
133,5,AdaBoost (Real),1,0.4,0.4847250509164969,0.3974801851016509,5.825348615646362,0.3974801851016509
134,5,Logistic Regression (Penalty = L2),1,0.4,0.4847250509164969,0.40038195025711437,0.005157470703125,0.40038195025711437
135,5,Naive Bayes,1,0.4,0.48676171079429736,0.401230219636591,0.01969456672668457,0.401230219636591
136,5,KNeighbors Classifier,2,0.4,0.4122448979591837,0.31644664434027325,0.021979093551635742,0.31644664434027325
137,5,SVC Classifier,2,0.4,0.42653061224489797,1.0,0.07464218139648438,0.0
138,5,Decision Tree,2,0.4,0.43673469387755104,0.40979238674997437,0.0016252994537353516,0.40979238674997437
139,5,RandomForest,2,0.4,0.45918367346938777,0.37405072618802143,0.09426331520080566,0.37405072618802143
140,5,AdaBoost (Discrete),2,0.4,0.4387755102040816,0.41274063478428147,4.575860261917114,0.41274063478428147
141,5,AdaBoost (Real),2,0.4,0.43673469387755104,0.40979238674997437,5.557574987411499,0.40979238674997437
142,5,Logistic Regression (Penalty = L2),2,0.4,0.4448979591836735,0.40310877134240697,0.020779848098754883,0.40310877134240697
143,5,Naive Bayes,2,0.4,0.45510204081632655,0.3599306406241203,0.0022573471069335938,0.3599306406241203
144,6,KNeighbors Classifier,0,0.4,0.45528455284552843,0.39108224529756275,0.023412466049194336,0.39108224529756275
145,6,SVC Classifier,0,0.4,0.4268292682926829,1.0,0.07728195190429688,0.0
146,6,Decision Tree,0,0.4,0.4349593495934959,0.3842832062475983,0.001432180404663086,0.3842832062475983
147,6,RandomForest,0,0.4,0.45528455284552843,0.6109258328392844,0.09028935432434082,0.0
148,6,AdaBoost (Discrete),0,0.4,0.4349593495934959,0.3842832062475983,4.290423631668091,0.3842832062475983
149,6,AdaBoost (Real),0,0.4,0.4349593495934959,0.3842832062475983,5.137887716293335,0.3842832062475983
150,6,Logistic Regression (Penalty = L2),0,0.4,0.4491869918699187,0.330884382889197,0.0190579891204834,0.330884382889197
151,6,Naive Bayes,0,0.4,0.4451219512195122,0.30288761887218785,0.01903557777404785,0.30288761887218785
152,6,KNeighbors Classifier,1,0.4,0.45010183299389,0.39249241537593565,0.005179882049560547,0.39249241537593565
153,6,SVC Classifier,1,0.4,0.42769857433808556,1.0,0.07109379768371582,0.0
154,6,Decision Tree,1,0.4,0.45417515274949083,0.3816280247549684,0.0014023780822753906,0.3816280247549684
155,6,RandomForest,1,0.4,0.4419551934826884,0.44533058252391833,0.06882333755493164,0.0
156,6,AdaBoost (Discrete),1,0.4,0.45417515274949083,0.3816280247549684,4.333122491836548,0.3816280247549684
157,6,AdaBoost (Real),1,0.4,0.45417515274949083,0.3816280247549684,5.375235319137573,0.3816280247549684
158,6,Logistic Regression (Penalty = L2),1,0.4,0.43380855397148677,0.4810702354423639,0.004171609878540039,0.0
159,6,Naive Bayes,1,0.4,0.47657841140529533,0.45602648664572004,0.003035306930541992,0.45602648664572004
160,6,KNeighbors Classifier,2,0.4,0.4204081632653061,0.32357418516789077,0.022335290908813477,0.0
161,6,SVC Classifier,2,0.4,0.42653061224489797,1.0,0.09563541412353516,0.0
162,6,Decision Tree,2,0.4,0.3979591836734694,0.2892977480263379,0.01835155487060547,0.2892977480263379
163,6,RandomForest,2,0.4,0.4326530612244898,0.3745418080680444,0.09095001220703125,0.3745418080680444
164,6,AdaBoost (Discrete),2,0.4,0.3979591836734694,0.2892977480263379,4.528880596160889,0.2892977480263379
165,6,AdaBoost (Real),2,0.4,0.4020408163265306,0.31682179422983114,5.500562429428101,0.31682179422983114
166,6,Logistic Regression (Penalty = L2),2,0.4,0.44081632653061226,0.3390775054052066,0.021454811096191406,0.3390775054052066
167,6,Naive Bayes,2,0.4,0.3795918367346939,0.26596750116818957,0.003471851348876953,0.26596750116818957
168,7,KNeighbors Classifier,0,0.4,0.5223577235772358,0.4468873955904552,0.023375511169433594,0.4468873955904552
169,7,SVC Classifier,0,0.4,0.4268292682926829,1.0,0.11826443672180176,0.0
170,7,Decision Tree,0,0.4,0.4878048780487805,0.42557399182106087,0.003142118453979492,0.42557399182106087
171,7,RandomForest,0,0.4,0.5487804878048781,0.4259292290409458,0.07393050193786621,0.4259292290409458
172,7,AdaBoost (Discrete),0,0.4,0.5386178861788617,0.4838577243475106,5.465857744216919,0.4838577243475106
173,7,AdaBoost (Real),0,0.4,0.491869918699187,0.4605990374310091,6.228119134902954,0.4605990374310091
174,7,Logistic Regression (Penalty = L2),0,0.4,0.5040650406504065,0.4561725670550536,0.019748926162719727,0.4561725670550536
175,7,Naive Bayes,0,0.4,0.5365853658536586,0.5150874517576501,0.002416372299194336,0.5150874517576501
176,7,KNeighbors Classifier,1,0.4,0.4969450101832994,0.4380059386221818,0.020639896392822266,0.4380059386221818
177,7,SVC Classifier,1,0.4,0.42769857433808556,1.0,0.09523415565490723,0.0
178,7,Decision Tree,1,0.4,0.47046843177189407,0.4362052546045772,0.002959012985229492,0.4362052546045772
179,7,RandomForest,1,0.4,0.5030549898167006,0.638406629986002,0.10832595825195312,0.0
180,7,AdaBoost (Discrete),1,0.4,0.539714867617108,0.4827920629405864,5.068461179733276,0.4827920629405864
181,7,AdaBoost (Real),1,0.4,0.5091649694501018,0.4833410643393186,6.278901815414429,0.4833410643393186
182,7,Logistic Regression (Penalty = L2),1,0.4,0.5193482688391039,0.44017432019360997,0.021306753158569336,0.44017432019360997
183,7,Naive Bayes,1,0.4,0.5621181262729125,0.5315231867089388,0.002582073211669922,0.5315231867089388
184,7,KNeighbors Classifier,2,0.4,0.4959183673469388,0.4459481828097719,0.022290706634521484,0.4459481828097719
185,7,SVC Classifier,2,0.4,0.42653061224489797,1.0,0.09072017669677734,0.0
186,7,Decision Tree,2,0.4,0.48775510204081635,0.45672347320547635,0.0027551651000976562,0.45672347320547635
187,7,RandomForest,2,0.4,0.4897959183673469,0.3686374662573198,0.07853531837463379,0.3686374662573198
188,7,AdaBoost (Discrete),2,0.4,0.5163265306122449,0.47257683189782507,5.087270975112915,0.47257683189782507
189,7,AdaBoost (Real),2,0.4,0.49387755102040815,0.46759240211732456,5.980892896652222,0.46759240211732456
190,7,Logistic Regression (Penalty = L2),2,0.4,0.5163265306122449,0.4568061160922667,0.021610260009765625,0.4568061160922667
191,7,Naive Bayes,2,0.4,0.5142857142857142,0.48685116817354346,0.0029735565185546875,0.48685116817354346
192,8,KNeighbors Classifier,0,0.4,0.4796747967479675,0.434614312999845,0.023542404174804688,0.434614312999845
193,8,SVC Classifier,0,0.4,0.4268292682926829,1.0,0.11349344253540039,0.0
194,8,Decision Tree,0,0.4,0.47764227642276424,0.42349249692044133,0.0034112930297851562,0.42349249692044133
195,8,RandomForest,0,0.4,0.5447154471544715,0.4421388577027451,0.07544875144958496,0.4421388577027451
196,8,AdaBoost (Discrete),0,0.4,0.5508130081300813,0.5031554008091758,5.01530909538269,0.5031554008091758
197,8,AdaBoost (Real),0,0.4,0.4613821138211382,0.42513489329236487,5.915252447128296,0.42513489329236487
198,8,Logistic Regression (Penalty = L2),0,0.4,0.532520325203252,0.48542607791399145,0.02113628387451172,0.48542607791399145
199,8,Naive Bayes,0,0.4,0.5142276422764228,0.4994778807670072,0.002401113510131836,0.4994778807670072
200,8,KNeighbors Classifier,1,0.4,0.48879837067209775,0.4514075091235593,0.02381730079650879,0.4514075091235593
201,8,SVC Classifier,1,0.4,0.42769857433808556,1.0,0.09615612030029297,0.0
202,8,Decision Tree,1,0.4,0.4684317718940937,0.4393949472222502,0.019250154495239258,0.4393949472222502
203,8,RandomForest,1,0.4,0.5071283095723014,0.6490242622561955,0.07407999038696289,0.0
204,8,AdaBoost (Discrete),1,0.4,0.5213849287169042,0.4877291771465745,4.8297953605651855,0.4877291771465745
205,8,AdaBoost (Real),1,0.4,0.5112016293279023,0.48048037809340777,6.549091577529907,0.48048037809340777
206,8,Logistic Regression (Penalty = L2),1,0.4,0.5213849287169042,0.4517647196600994,0.020752906799316406,0.4517647196600994
207,8,Naive Bayes,1,0.4,0.5071283095723014,0.5076568133155751,0.0034835338592529297,0.5076568133155751
208,8,KNeighbors Classifier,2,0.4,0.49387755102040815,0.4507377640611346,0.024489164352416992,0.4507377640611346
209,8,SVC Classifier,2,0.4,0.42653061224489797,1.0,0.09581756591796875,0.0
210,8,Decision Tree,2,0.4,0.4775510204081633,0.43407433446999,0.01927924156188965,0.43407433446999
211,8,RandomForest,2,0.4,0.5244897959183673,0.4613744803130961,0.08958697319030762,0.4613744803130961
212,8,AdaBoost (Discrete),2,0.4,0.5285714285714286,0.5016596178671051,5.300225019454956,0.5016596178671051
213,8,AdaBoost (Real),2,0.4,0.4489795918367347,0.43177445222975475,6.05007791519165,0.43177445222975475
214,8,Logistic Regression (Penalty = L2),2,0.4,0.4959183673469388,0.43942900343722213,0.022178173065185547,0.43942900343722213
215,8,Naive Bayes,2,0.4,0.46530612244897956,0.45379468999613487,0.019343137741088867,0.45379468999613487
216,9,KNeighbors Classifier,0,0.4,0.5223577235772358,0.4468873955904552,0.02306962013244629,0.4468873955904552
217,9,SVC Classifier,0,0.4,0.4268292682926829,1.0,0.0743563175201416,0.0
218,9,Decision Tree,0,0.4,0.49796747967479676,0.4322425642128255,0.018966197967529297,0.4322425642128255
219,9,RandomForest,0,0.4,0.5487804878048781,0.4259292290409458,0.07048177719116211,0.4259292290409458
220,9,AdaBoost (Discrete),0,0.4,0.5386178861788617,0.4838577243475106,4.557721138000488,0.4838577243475106
221,9,AdaBoost (Real),0,0.4,0.491869918699187,0.4605990374310091,5.091094732284546,0.4605990374310091
222,9,Logistic Regression (Penalty = L2),0,0.4,0.5040650406504065,0.4561725670550536,0.0173492431640625,0.4561725670550536
223,9,Naive Bayes,0,0.4,0.5365853658536586,0.5150874517576501,0.011408805847167969,0.5150874517576501
224,9,KNeighbors Classifier,1,0.4,0.4969450101832994,0.4380059386221818,0.032984256744384766,0.4380059386221818
225,9,SVC Classifier,1,0.4,0.42769857433808556,1.0,0.091033935546875,0.0
226,9,Decision Tree,1,0.4,0.46435845213849286,0.4307890536463513,0.002673625946044922,0.4307890536463513
227,9,RandomForest,1,0.4,0.5030549898167006,0.638406629986002,0.08152532577514648,0.0
228,9,AdaBoost (Discrete),1,0.4,0.539714867617108,0.4827920629405864,4.098183631896973,0.4827920629405864
229,9,AdaBoost (Real),1,0.4,0.5091649694501018,0.4833410643393186,5.5377256870269775,0.4833410643393186
230,9,Logistic Regression (Penalty = L2),1,0.4,0.5193482688391039,0.44017432019360997,0.004950046539306641,0.44017432019360997
231,9,Naive Bayes,1,0.4,0.5621181262729125,0.5315231867089388,0.01956796646118164,0.5315231867089388
232,9,KNeighbors Classifier,2,0.4,0.4959183673469388,0.4459481828097719,0.02361607551574707,0.4459481828097719
233,9,SVC Classifier,2,0.4,0.42653061224489797,1.0,0.09395647048950195,0.0
234,9,Decision Tree,2,0.4,0.46938775510204084,0.43371068643509436,0.0025784969329833984,0.43371068643509436
235,9,RandomForest,2,0.4,0.4897959183673469,0.3686374662573198,0.07143712043762207,0.3686374662573198
236,9,AdaBoost (Discrete),2,0.4,0.5163265306122449,0.47257683189782507,5.8467326164245605,0.47257683189782507
237,9,AdaBoost (Real),2,0.4,0.49387755102040815,0.46759240211732456,6.160357713699341,0.46759240211732456
238,9,Logistic Regression (Penalty = L2),2,0.4,0.5163265306122449,0.4568061160922667,0.017367124557495117,0.4568061160922667
239,9,Naive Bayes,2,0.4,0.5142857142857142,0.48685116817354346,0.003850698471069336,0.48685116817354346
240,10,KNeighbors Classifier,0,0.4,0.4817073170731707,0.42336189760830045,0.025264978408813477,0.42336189760830045
241,10,SVC Classifier,0,0.4,0.4268292682926829,1.0,0.09163641929626465,0.0
242,10,Decision Tree,0,0.4,0.48577235772357724,0.4672064321255729,0.01943063735961914,0.4672064321255729
243,10,RandomForest,0,0.4,0.5284552845528455,0.47071987469057375,0.08415555953979492,0.47071987469057375
244,10,AdaBoost (Discrete),0,0.4,0.5264227642276422,0.4893170539372925,4.256430387496948,0.4893170539372925
245,10,AdaBoost (Real),0,0.4,0.4817073170731707,0.43778536803312773,5.38174033164978,0.43778536803312773
246,10,Logistic Regression (Penalty = L2),0,0.4,0.532520325203252,0.48411298387078233,0.021926403045654297,0.48411298387078233
247,10,Naive Bayes,0,0.4,0.491869918699187,0.48167075273728144,0.019290924072265625,0.48167075273728144
248,10,KNeighbors Classifier,1,0.4,0.46435845213849286,0.41872745947671103,0.025408267974853516,0.41872745947671103
249,10,SVC Classifier,1,0.4,0.42769857433808556,1.0,0.1090090274810791,0.0
250,10,Decision Tree,1,0.4,0.4684317718940937,0.4483401774177564,0.01853013038635254,0.4483401774177564
251,10,RandomForest,1,0.4,0.5193482688391039,0.6552096762777204,0.11156129837036133,0.0
252,10,AdaBoost (Discrete),1,0.4,0.5580448065173116,0.525020424459254,4.140448808670044,0.525020424459254
253,10,AdaBoost (Real),1,0.4,0.48065173116089616,0.45564027652836764,8.511720418930054,0.45564027652836764
254,10,Logistic Regression (Penalty = L2),1,0.4,0.5274949083503055,0.4463359297675884,0.055253028869628906,0.4463359297675884
255,10,Naive Bayes,1,0.4,0.5315682281059063,0.5396005801937391,0.028347492218017578,0.5396005801937391
256,10,KNeighbors Classifier,2,0.4,0.46530612244897956,0.4113107667895892,0.07455801963806152,0.4113107667895892
257,10,SVC Classifier,2,0.4,0.42653061224489797,1.0,0.25696659088134766,0.0
258,10,Decision Tree,2,0.4,0.45918367346938777,0.43369316206292147,0.02785801887512207,0.43369316206292147
259,10,RandomForest,2,0.4,0.5,0.39809711764284733,0.19031953811645508,0.39809711764284733
260,10,AdaBoost (Discrete),2,0.4,0.5326530612244897,0.5027801873955925,13.257426261901855,0.5027801873955925
261,10,AdaBoost (Real),2,0.4,0.4673469387755102,0.44734208048969953,14.29969334602356,0.44734208048969953
262,10,Logistic Regression (Penalty = L2),2,0.4,0.49183673469387756,0.4303114834655969,0.05810952186584473,0.4303114834655969
263,10,Naive Bayes,2,0.4,0.4816326530612245,0.47958435860010507,0.026616334915161133,0.47958435860010507
264,11,KNeighbors Classifier,0,0.4,0.483739837398374,0.430468184898612,0.08610081672668457,0.430468184898612
265,11,SVC Classifier,0,0.4,0.4268292682926829,1.0,0.2519657611846924,0.0
266,11,Decision Tree,0,0.4,0.491869918699187,0.44425564169408127,0.027283430099487305,0.44425564169408127
267,11,RandomForest,0,0.4,0.5040650406504065,0.37448087830506893,0.16870570182800293,0.37448087830506893
268,11,AdaBoost (Discrete),0,0.4,0.532520325203252,0.49219207322350367,11.911377429962158,0.49219207322350367
269,11,AdaBoost (Real),0,0.4,0.48577235772357724,0.4296873871418365,13.748834133148193,0.4296873871418365
270,11,Logistic Regression (Penalty = L2),0,0.4,0.532520325203252,0.4852343614335798,0.029268503189086914,0.4852343614335798
271,11,Naive Bayes,0,0.4,0.45121951219512196,0.4622095366792033,0.027866601943969727,0.4622095366792033
272,11,KNeighbors Classifier,1,0.4,0.4663951120162933,0.42370693577229895,0.05660271644592285,0.42370693577229895
273,11,SVC Classifier,1,0.4,0.42769857433808556,1.0,0.22294068336486816,0.0
274,11,Decision Tree,1,0.4,0.4745417515274949,0.45458030414364475,0.003313302993774414,0.45458030414364475
275,11,RandomForest,1,0.4,0.48676171079429736,0.6022367272346084,0.16903400421142578,0.0
276,11,AdaBoost (Discrete),1,0.4,0.5458248472505092,0.5101590277736509,12.13190770149231,0.5101590277736509
277,11,AdaBoost (Real),1,0.4,0.48879837067209775,0.4614703894701948,19.22304368019104,0.4614703894701948
278,11,Logistic Regression (Penalty = L2),1,0.4,0.5234215885947047,0.4448650555076635,0.046072959899902344,0.4448650555076635
279,11,Naive Bayes,1,0.4,0.5193482688391039,0.5344643734663924,0.04392838478088379,0.5344643734663924
280,11,KNeighbors Classifier,2,0.4,0.4714285714285714,0.413443957439434,0.13089561462402344,0.413443957439434
281,11,SVC Classifier,2,0.4,0.42653061224489797,1.0,0.3576507568359375,0.0
282,11,Decision Tree,2,0.4,0.4489795918367347,0.4219532291736332,0.0022344589233398438,0.4219532291736332
283,11,RandomForest,2,0.4,0.48367346938775513,0.34398586390657204,0.30774855613708496,0.34398586390657204
284,11,AdaBoost (Discrete),2,0.4,0.5326530612244897,0.5031834270667288,18.560221195220947,0.5031834270667288
285,11,AdaBoost (Real),2,0.4,0.45510204081632655,0.43277858247909806,22.436991930007935,0.43277858247909806
286,11,Logistic Regression (Penalty = L2),2,0.4,0.4897959183673469,0.4328868583361249,0.04528951644897461,0.4328868583361249
287,11,Naive Bayes,2,0.4,0.45510204081632655,0.464056075881427,0.003038644790649414,0.464056075881427
288,12,KNeighbors Classifier,0,0.4,0.3394308943089431,0.5968676468279506,0.046309471130371094,0.0
289,12,SVC Classifier,0,0.4,0.4268292682926829,1.0,0.2141246795654297,0.0
290,12,Decision Tree,0,0.4,0.4369918699186992,0.6574002070086624,0.0018177032470703125,0.0
291,12,RandomForest,0,0.4,0.4369918699186992,0.6574002070086624,0.30651235580444336,0.0
292,12,AdaBoost (Discrete),0,0.4,0.4369918699186992,0.6574002070086624,5.275873899459839,0.0
293,12,AdaBoost (Real),0,0.4,0.4369918699186992,0.6574002070086624,19.048153400421143,0.0
294,12,Logistic Regression (Penalty = L2),0,0.4,0.4369918699186992,0.6574002070086624,0.04559612274169922,0.0
295,12,Naive Bayes,0,0.4,0.4369918699186992,0.6574002070086624,0.05078244209289551,0.0
296,12,KNeighbors Classifier,1,0.4,0.47657841140529533,0.7177351288210123,0.0545046329498291,0.0
297,12,SVC Classifier,1,0.4,0.42769857433808556,1.0,0.29296112060546875,0.0
298,12,Decision Tree,1,0.4,0.43380855397148677,0.4933734558595332,0.04555082321166992,0.0
299,12,RandomForest,1,0.4,0.43380855397148677,0.4933734558595332,0.3564760684967041,0.0
300,12,AdaBoost (Discrete),1,0.4,0.43380855397148677,0.4933734558595332,6.0829176902771,0.0
301,12,AdaBoost (Real),1,0.4,0.43380855397148677,0.4933734558595332,19.953194618225098,0.0
302,12,Logistic Regression (Penalty = L2),1,0.4,0.43380855397148677,0.4933734558595332,0.13786888122558594,0.0
303,12,Naive Bayes,1,0.4,0.43380855397148677,0.4933734558595332,0.030181407928466797,0.0
304,12,KNeighbors Classifier,2,0.4,0.42653061224489797,1.0,0.06801271438598633,0.0
305,12,SVC Classifier,2,0.4,0.42653061224489797,1.0,0.20604944229125977,0.0
306,12,Decision Tree,2,0.4,0.4326530612244898,0.6331503362138958,0.030540943145751953,0.0
307,12,RandomForest,2,0.4,0.39183673469387753,0.39310044940699157,0.24555444717407227,0.39310044940699157
308,12,AdaBoost (Discrete),2,0.4,0.39183673469387753,0.39310044940699157,7.134364604949951,0.39310044940699157
309,12,AdaBoost (Real),2,0.4,0.4326530612244898,0.6331503362138958,19.45036554336548,0.0
310,12,Logistic Regression (Penalty = L2),2,0.4,0.4326530612244898,0.6331503362138958,0.1056971549987793,0.0
311,12,Naive Bayes,2,0.4,0.4326530612244898,0.6331503362138958,0.027595043182373047,0.0
