,feat_set_id,classifier,fold_id,feat_th,score,geo_score,exec_t,geo_score_woz
0,0,KNeighbors Classifier,0,0.9,0.47560975609756095,0.42945127868922656,0.051500797271728516,0.42945127868922656
1,0,SVC Classifier,0,0.9,0.4268292682926829,1.0,0.12150382995605469,0.0
2,0,Decision Tree,0,0.9,0.4735772357723577,0.4284769105572454,0.0036880970001220703,0.4284769105572454
3,0,RandomForest,0,0.9,0.5121951219512195,0.66321159825515,0.12240219116210938,0.0
4,0,AdaBoost (Discrete),0,0.9,0.5182926829268293,0.47963792264422506,5.26320743560791,0.47963792264422506
5,0,AdaBoost (Real),0,0.9,0.516260162601626,0.47038751783837957,6.266814708709717,0.47038751783837957
6,0,Logistic Regression (Penalty = L2),0,0.9,0.5101626016260162,0.4511812193907575,0.05089068412780762,0.4511812193907575
7,0,Naive Bayes,0,0.9,0.45121951219512196,0.46349379479417907,0.004555940628051758,0.46349379479417907
8,0,KNeighbors Classifier,1,0.9,0.45213849287169044,0.4012678373210076,0.06861138343811035,0.4012678373210076
9,0,SVC Classifier,1,0.9,0.42769857433808556,1.0,0.1212911605834961,0.0
10,0,Decision Tree,1,0.9,0.47046843177189407,0.457516605955827,0.02047252655029297,0.457516605955827
11,0,RandomForest,1,0.9,0.5234215885947047,0.6730090463512272,0.09610390663146973,0.0
12,0,AdaBoost (Discrete),1,0.9,0.5519348268839104,0.5170694703657278,6.32099986076355,0.5170694703657278
13,0,AdaBoost (Real),1,0.9,0.5112016293279023,0.4821926128384856,6.277079343795776,0.4821926128384856
14,0,Logistic Regression (Penalty = L2),1,0.9,0.5173116089613035,0.46573868635357885,0.025098085403442383,0.46573868635357885
15,0,Naive Bayes,1,0.9,0.48879837067209775,0.504984588829033,0.020473957061767578,0.504984588829033
16,0,KNeighbors Classifier,2,0.9,0.41836734693877553,0.385213104069916,0.05327463150024414,0.385213104069916
17,0,SVC Classifier,2,0.9,0.42653061224489797,1.0,0.11758875846862793,0.0
18,0,Decision Tree,2,0.9,0.43673469387755104,0.4143547146556841,0.01961207389831543,0.4143547146556841
19,0,RandomForest,2,0.9,0.5306122448979592,0.6889420500487388,0.0774693489074707,0.0
20,0,AdaBoost (Discrete),2,0.9,0.5040816326530613,0.4813418016877654,4.774658679962158,0.4813418016877654
21,0,AdaBoost (Real),2,0.9,0.4306122448979592,0.4154515716905645,5.768618822097778,0.4154515716905645
22,0,Logistic Regression (Penalty = L2),2,0.9,0.5020408163265306,0.44551809034089823,0.02278447151184082,0.44551809034089823
23,0,Naive Bayes,2,0.9,0.46122448979591835,0.47341325281455837,0.02015542984008789,0.47341325281455837
24,1,KNeighbors Classifier,0,0.9,0.47560975609756095,0.42945127868922656,0.0198361873626709,0.42945127868922656
25,1,SVC Classifier,0,0.9,0.4268292682926829,1.0,0.09301519393920898,0.0
26,1,Decision Tree,0,0.9,0.48577235772357724,0.45688757224878856,0.018261432647705078,0.45688757224878856
27,1,RandomForest,0,0.9,0.5121951219512195,0.66321159825515,0.0922846794128418,0.0
28,1,AdaBoost (Discrete),0,0.9,0.5182926829268293,0.47963792264422506,5.199354410171509,0.47963792264422506
29,1,AdaBoost (Real),0,0.9,0.516260162601626,0.47038751783837957,6.064229965209961,0.47038751783837957
30,1,Logistic Regression (Penalty = L2),0,0.9,0.5101626016260162,0.4511812193907575,0.023324012756347656,0.4511812193907575
31,1,Naive Bayes,0,0.9,0.45121951219512196,0.46349379479417907,0.004349708557128906,0.46349379479417907
32,1,KNeighbors Classifier,1,0.9,0.45213849287169044,0.4012678373210076,0.04340100288391113,0.4012678373210076
33,1,SVC Classifier,1,0.9,0.42769857433808556,1.0,0.11836457252502441,0.0
34,1,Decision Tree,1,0.9,0.48268839103869654,0.4451029513046134,0.003422260284423828,0.4451029513046134
35,1,RandomForest,1,0.9,0.5234215885947047,0.6730090463512272,0.07513284683227539,0.0
36,1,AdaBoost (Discrete),1,0.9,0.5519348268839104,0.5170694703657278,5.851424932479858,0.5170694703657278
37,1,AdaBoost (Real),1,0.9,0.5112016293279023,0.4821926128384856,5.605058670043945,0.4821926128384856
38,1,Logistic Regression (Penalty = L2),1,0.9,0.5173116089613035,0.46573868635357885,0.022669553756713867,0.46573868635357885
39,1,Naive Bayes,1,0.9,0.48879837067209775,0.504984588829033,0.003612041473388672,0.504984588829033
40,1,KNeighbors Classifier,2,0.9,0.41836734693877553,0.385213104069916,0.04692268371582031,0.385213104069916
41,1,SVC Classifier,2,0.9,0.42653061224489797,1.0,0.09579825401306152,0.0
42,1,Decision Tree,2,0.9,0.45510204081632655,0.4353873666149172,0.018978118896484375,0.4353873666149172
43,1,RandomForest,2,0.9,0.5306122448979592,0.6889420500487388,0.06885099411010742,0.0
44,1,AdaBoost (Discrete),2,0.9,0.5040816326530613,0.4813418016877654,5.2522687911987305,0.4813418016877654
45,1,AdaBoost (Real),2,0.9,0.4306122448979592,0.4154515716905645,5.9342687129974365,0.4154515716905645
46,1,Logistic Regression (Penalty = L2),2,0.9,0.5020408163265306,0.44551809034089823,0.02931070327758789,0.44551809034089823
47,1,Naive Bayes,2,0.9,0.46122448979591835,0.47341325281455837,0.019093990325927734,0.47341325281455837
48,2,KNeighbors Classifier,0,0.9,0.48577235772357724,0.4228854602289914,0.05103921890258789,0.4228854602289914
49,2,SVC Classifier,0,0.9,0.4268292682926829,1.0,0.11861610412597656,0.0
50,2,Decision Tree,0,0.9,0.4817073170731707,0.44517363007715455,0.003906965255737305,0.44517363007715455
51,2,RandomForest,0,0.9,0.49390243902439024,0.35924262487992414,0.09601497650146484,0.35924262487992414
52,2,AdaBoost (Discrete),0,0.9,0.5386178861788617,0.4873420114817136,5.068976879119873,0.4873420114817136
53,2,AdaBoost (Real),0,0.9,0.48577235772357724,0.43906834990447113,6.8799285888671875,0.43906834990447113
54,2,Logistic Regression (Penalty = L2),0,0.9,0.5040650406504065,0.4451639245572657,0.02804398536682129,0.4451639245572657
55,2,Naive Bayes,0,0.9,0.4491869918699187,0.4623015062177744,0.020084619522094727,0.4623015062177744
56,2,KNeighbors Classifier,1,0.9,0.45621181262729127,0.42398086068424296,0.056949615478515625,0.42398086068424296
57,2,SVC Classifier,1,0.9,0.42769857433808556,1.0,0.14421534538269043,0.0
58,2,Decision Tree,1,0.9,0.4725050916496945,0.4395517396089599,0.019768953323364258,0.4395517396089599
59,2,RandomForest,1,0.9,0.5030549898167006,0.5988317290991773,0.0956873893737793,0.0
60,2,AdaBoost (Discrete),1,0.9,0.5417515274949084,0.5145172609061862,5.661759376525879,0.5145172609061862
61,2,AdaBoost (Real),1,0.9,0.5091649694501018,0.470965463715331,6.739256858825684,0.470965463715331
62,2,Logistic Regression (Penalty = L2),1,0.9,0.5234215885947047,0.4704947408915208,0.028086185455322266,0.4704947408915208
63,2,Naive Bayes,1,0.9,0.4847250509164969,0.5006527422555169,0.029943227767944336,0.5006527422555169
64,2,KNeighbors Classifier,2,0.9,0.42857142857142855,0.37856415312782427,0.07451844215393066,0.37856415312782427
65,2,SVC Classifier,2,0.9,0.42653061224489797,1.0,0.16637611389160156,0.0
66,2,Decision Tree,2,0.9,0.4775510204081633,0.4522726321114386,0.019539356231689453,0.4522726321114386
67,2,RandomForest,2,0.9,0.5020408163265306,0.3574494095402627,0.0852975845336914,0.3574494095402627
68,2,AdaBoost (Discrete),2,0.9,0.5265306122448979,0.4988211239878325,5.4319679737091064,0.4988211239878325
69,2,AdaBoost (Real),2,0.9,0.4816326530612245,0.46776088495995544,6.827082633972168,0.46776088495995544
70,2,Logistic Regression (Penalty = L2),2,0.9,0.5163265306122449,0.4603473901017494,0.025722026824951172,0.4603473901017494
71,2,Naive Bayes,2,0.9,0.4673469387755102,0.48011697645390805,0.020120620727539062,0.48011697645390805
72,3,KNeighbors Classifier,0,0.9,0.4796747967479675,0.41588494704031925,0.046794891357421875,0.41588494704031925
73,3,SVC Classifier,0,0.9,0.4268292682926829,1.0,0.13867926597595215,0.0
74,3,Decision Tree,0,0.9,0.4532520325203252,0.41150688562081483,0.0037195682525634766,0.41150688562081483
75,3,RandomForest,0,0.9,0.5223577235772358,0.24696425545213874,0.09825825691223145,0.24696425545213874
76,3,AdaBoost (Discrete),0,0.9,0.5223577235772358,0.4746705812992846,5.965959072113037,0.4746705812992846
77,3,AdaBoost (Real),0,0.9,0.4898373983739837,0.43683953816984705,6.691588878631592,0.43683953816984705
78,3,Logistic Regression (Penalty = L2),0,0.9,0.5040650406504065,0.44952658834368375,0.016498804092407227,0.44952658834368375
79,3,Naive Bayes,0,0.9,0.47560975609756095,0.48611500648980643,0.0027837753295898438,0.48611500648980643
80,3,KNeighbors Classifier,1,0.9,0.45417515274949083,0.413372300765397,0.046740055084228516,0.413372300765397
81,3,SVC Classifier,1,0.9,0.42769857433808556,1.0,0.11531686782836914,0.0
82,3,Decision Tree,1,0.9,0.45621181262729127,0.4253317215392122,0.002369403839111328,0.4253317215392122
83,3,RandomForest,1,0.9,0.5112016293279023,0.3364811450187005,0.09569168090820312,0.3364811450187005
84,3,AdaBoost (Discrete),1,0.9,0.5295315682281059,0.5066003516615346,5.264463901519775,0.5066003516615346
85,3,AdaBoost (Real),1,0.9,0.48879837067209775,0.4593178710126768,6.106560707092285,0.4593178710126768
86,3,Logistic Regression (Penalty = L2),1,0.9,0.5234215885947047,0.47312778393133187,0.022635459899902344,0.47312778393133187
87,3,Naive Bayes,1,0.9,0.48268839103869654,0.4962104473818888,0.020096778869628906,0.4962104473818888
88,3,KNeighbors Classifier,2,0.9,0.43673469387755104,0.39616246962916785,0.046239376068115234,0.39616246962916785
89,3,SVC Classifier,2,0.9,0.42653061224489797,1.0,0.11388349533081055,0.0
90,3,Decision Tree,2,0.9,0.42448979591836733,0.39642617618168824,0.0037550926208496094,0.39642617618168824
91,3,RandomForest,2,0.9,0.5142857142857142,0.24905747378818544,0.0953667163848877,0.24905747378818544
92,3,AdaBoost (Discrete),2,0.9,0.5326530612244897,0.5103581734381604,5.110895395278931,0.5103581734381604
93,3,AdaBoost (Real),2,0.9,0.47346938775510206,0.44647414067698993,6.130461931228638,0.44647414067698993
94,3,Logistic Regression (Penalty = L2),2,0.9,0.5061224489795918,0.45278771842445664,0.02456498146057129,0.45278771842445664
95,3,Naive Bayes,2,0.9,0.46530612244897956,0.4726131609070123,0.01961350440979004,0.4726131609070123
96,4,KNeighbors Classifier,0,0.9,0.47560975609756095,0.42945127868922656,0.04566144943237305,0.42945127868922656
97,4,SVC Classifier,0,0.9,0.4268292682926829,1.0,0.12510395050048828,0.0
98,4,Decision Tree,0,0.9,0.4654471544715447,0.42911365962027365,0.0023272037506103516,0.42911365962027365
99,4,RandomForest,0,0.9,0.5121951219512195,0.66321159825515,0.07334280014038086,0.0
100,4,AdaBoost (Discrete),0,0.9,0.5182926829268293,0.47963792264422506,4.9610819816589355,0.47963792264422506
101,4,AdaBoost (Real),0,0.9,0.516260162601626,0.47038751783837957,6.118879079818726,0.47038751783837957
102,4,Logistic Regression (Penalty = L2),0,0.9,0.5101626016260162,0.4511812193907575,0.021672487258911133,0.4511812193907575
103,4,Naive Bayes,0,0.9,0.45121951219512196,0.46349379479417907,0.0039250850677490234,0.46349379479417907
104,4,KNeighbors Classifier,1,0.9,0.45213849287169044,0.4012678373210076,0.045374393463134766,0.4012678373210076
105,4,SVC Classifier,1,0.9,0.42769857433808556,1.0,0.1195077896118164,0.0
106,4,Decision Tree,1,0.9,0.47657841140529533,0.43986585876098816,0.00257110595703125,0.43986585876098816
107,4,RandomForest,1,0.9,0.5234215885947047,0.6730090463512272,0.07378125190734863,0.0
108,4,AdaBoost (Discrete),1,0.9,0.5519348268839104,0.5170694703657278,5.071089267730713,0.5170694703657278
109,4,AdaBoost (Real),1,0.9,0.5112016293279023,0.4821926128384856,6.059891939163208,0.4821926128384856
110,4,Logistic Regression (Penalty = L2),1,0.9,0.5173116089613035,0.46573868635357885,0.02323746681213379,0.46573868635357885
111,4,Naive Bayes,1,0.9,0.48879837067209775,0.504984588829033,0.0030612945556640625,0.504984588829033
112,4,KNeighbors Classifier,2,0.9,0.41836734693877553,0.385213104069916,0.028357744216918945,0.385213104069916
113,4,SVC Classifier,2,0.9,0.42653061224489797,1.0,0.11541533470153809,0.0
114,4,Decision Tree,2,0.9,0.44081632653061226,0.40323044619777154,0.019191741943359375,0.40323044619777154
115,4,RandomForest,2,0.9,0.5306122448979592,0.6889420500487388,0.06599831581115723,0.0
116,4,AdaBoost (Discrete),2,0.9,0.5040816326530613,0.4813418016877654,5.305730581283569,0.4813418016877654
117,4,AdaBoost (Real),2,0.9,0.4306122448979592,0.4154515716905645,6.564934968948364,0.4154515716905645
118,4,Logistic Regression (Penalty = L2),2,0.9,0.5020408163265306,0.44551809034089823,0.02353358268737793,0.44551809034089823
119,4,Naive Bayes,2,0.9,0.46122448979591835,0.47341325281455837,0.0029973983764648438,0.47341325281455837
120,5,KNeighbors Classifier,0,0.9,0.47560975609756095,0.42945127868922656,0.04529523849487305,0.42945127868922656
121,5,SVC Classifier,0,0.9,0.4268292682926829,1.0,0.0994558334350586,0.0
122,5,Decision Tree,0,0.9,0.4715447154471545,0.43925306526067637,0.0024802684783935547,0.43925306526067637
123,5,RandomForest,0,0.9,0.5121951219512195,0.66321159825515,0.09784746170043945,0.0
124,5,AdaBoost (Discrete),0,0.9,0.5182926829268293,0.47963792264422506,5.1985859870910645,0.47963792264422506
125,5,AdaBoost (Real),0,0.9,0.516260162601626,0.47038751783837957,6.362880706787109,0.47038751783837957
126,5,Logistic Regression (Penalty = L2),0,0.9,0.5101626016260162,0.4511812193907575,0.023921966552734375,0.4511812193907575
127,5,Naive Bayes,0,0.9,0.45121951219512196,0.46349379479417907,0.004193544387817383,0.46349379479417907
128,5,KNeighbors Classifier,1,0.9,0.45213849287169044,0.4012678373210076,0.04772210121154785,0.4012678373210076
129,5,SVC Classifier,1,0.9,0.42769857433808556,1.0,0.09919428825378418,0.0
130,5,Decision Tree,1,0.9,0.4684317718940937,0.44776193284177906,0.0196225643157959,0.44776193284177906
131,5,RandomForest,1,0.9,0.5234215885947047,0.6730090463512272,0.09182238578796387,0.0
132,5,AdaBoost (Discrete),1,0.9,0.5519348268839104,0.5170694703657278,5.403520107269287,0.5170694703657278
133,5,AdaBoost (Real),1,0.9,0.5112016293279023,0.4821926128384856,6.39558744430542,0.4821926128384856
134,5,Logistic Regression (Penalty = L2),1,0.9,0.5173116089613035,0.46573868635357885,0.024989604949951172,0.46573868635357885
135,5,Naive Bayes,1,0.9,0.48879837067209775,0.504984588829033,0.003720521926879883,0.504984588829033
136,5,KNeighbors Classifier,2,0.9,0.41836734693877553,0.385213104069916,0.027144193649291992,0.385213104069916
137,5,SVC Classifier,2,0.9,0.42653061224489797,1.0,0.11501765251159668,0.0
138,5,Decision Tree,2,0.9,0.4714285714285714,0.44519849332279215,0.01892232894897461,0.44519849332279215
139,5,RandomForest,2,0.9,0.5306122448979592,0.6889420500487388,0.08823442459106445,0.0
140,5,AdaBoost (Discrete),2,0.9,0.5040816326530613,0.4813418016877654,5.26010274887085,0.4813418016877654
141,5,AdaBoost (Real),2,0.9,0.4306122448979592,0.4154515716905645,6.255769491195679,0.4154515716905645
142,5,Logistic Regression (Penalty = L2),2,0.9,0.5020408163265306,0.44551809034089823,0.02339029312133789,0.44551809034089823
143,5,Naive Bayes,2,0.9,0.46122448979591835,0.47341325281455837,0.004149913787841797,0.47341325281455837
144,6,KNeighbors Classifier,0,0.9,0.47560975609756095,0.42414800721829427,0.0304720401763916,0.42414800721829427
145,6,SVC Classifier,0,0.9,0.4268292682926829,1.0,0.1168208122253418,0.0
146,6,Decision Tree,0,0.9,0.45528455284552843,0.419848476007896,0.0036242008209228516,0.419848476007896
147,6,RandomForest,0,0.9,0.5223577235772358,0.2686990502040067,0.10254931449890137,0.2686990502040067
148,6,AdaBoost (Discrete),0,0.9,0.524390243902439,0.48218923618680803,4.973325252532959,0.48218923618680803
149,6,AdaBoost (Real),0,0.9,0.45934959349593496,0.41421696991736506,6.284678936004639,0.41421696991736506
150,6,Logistic Regression (Penalty = L2),0,0.9,0.5121951219512195,0.4548837595222066,0.023146867752075195,0.4548837595222066
151,6,Naive Bayes,0,0.9,0.4715447154471545,0.48177093579390906,0.004427909851074219,0.48177093579390906
152,6,KNeighbors Classifier,1,0.9,0.45010183299389,0.3956562669955195,0.04593920707702637,0.3956562669955195
153,6,SVC Classifier,1,0.9,0.42769857433808556,1.0,0.12147879600524902,0.0
154,6,Decision Tree,1,0.9,0.4847250509164969,0.464748479274053,0.0035037994384765625,0.464748479274053
155,6,RandomForest,1,0.9,0.4908350305498982,0.6043261404520025,0.07151055335998535,0.0
156,6,AdaBoost (Discrete),1,0.9,0.5315682281059063,0.5074857232579452,5.30245304107666,0.5074857232579452
157,6,AdaBoost (Real),1,0.9,0.49287169042769857,0.4572673174967178,6.599625587463379,0.4572673174967178
158,6,Logistic Regression (Penalty = L2),1,0.9,0.5193482688391039,0.4669030379148885,0.023421049118041992,0.4669030379148885
159,6,Naive Bayes,1,0.9,0.47657841140529533,0.48924148928706035,0.0037136077880859375,0.48924148928706035
160,6,KNeighbors Classifier,2,0.9,0.463265306122449,0.4256048416937185,0.0974283218383789,0.4256048416937185
161,6,SVC Classifier,2,0.9,0.42653061224489797,1.0,0.17313051223754883,0.0
162,6,Decision Tree,2,0.9,0.4489795918367347,0.43027313811844453,0.0037512779235839844,0.43027313811844453
163,6,RandomForest,2,0.9,0.5020408163265306,0.384506091557399,0.1273365020751953,0.384506091557399
164,6,AdaBoost (Discrete),2,0.9,0.5265306122448979,0.5014116397654704,5.872208595275879,0.5014116397654704
165,6,AdaBoost (Real),2,0.9,0.4714285714285714,0.44519849332279215,5.920186758041382,0.44519849332279215
166,6,Logistic Regression (Penalty = L2),2,0.9,0.49795918367346936,0.44617883999147817,0.020560264587402344,0.44617883999147817
167,6,Naive Bayes,2,0.9,0.4714285714285714,0.48024380815317497,0.01896834373474121,0.48024380815317497
168,7,KNeighbors Classifier,0,0.9,0.47560975609756095,0.42945127868922656,0.044504642486572266,0.42945127868922656
169,7,SVC Classifier,0,0.9,0.4268292682926829,1.0,0.10433268547058105,0.0
170,7,Decision Tree,0,0.9,0.49796747967479676,0.4567288756148868,0.018682241439819336,0.4567288756148868
171,7,RandomForest,0,0.9,0.5121951219512195,0.66321159825515,0.06917071342468262,0.0
172,7,AdaBoost (Discrete),0,0.9,0.5182926829268293,0.47963792264422506,5.659576654434204,0.47963792264422506
173,7,AdaBoost (Real),0,0.9,0.516260162601626,0.47038751783837957,6.114246368408203,0.47038751783837957
174,7,Logistic Regression (Penalty = L2),0,0.9,0.5101626016260162,0.4511812193907575,0.004712581634521484,0.4511812193907575
175,7,Naive Bayes,0,0.9,0.45121951219512196,0.46349379479417907,0.02004861831665039,0.46349379479417907
176,7,KNeighbors Classifier,1,0.9,0.45213849287169044,0.4012678373210076,0.04796147346496582,0.4012678373210076
177,7,SVC Classifier,1,0.9,0.42769857433808556,1.0,0.11995816230773926,0.0
178,7,Decision Tree,1,0.9,0.45824847250509165,0.4354062707108549,0.019439697265625,0.4354062707108549
179,7,RandomForest,1,0.9,0.5234215885947047,0.6730090463512272,0.09498929977416992,0.0
180,7,AdaBoost (Discrete),1,0.9,0.5519348268839104,0.5170694703657278,5.170480966567993,0.5170694703657278
181,7,AdaBoost (Real),1,0.9,0.5112016293279023,0.4821926128384856,6.108583927154541,0.4821926128384856
182,7,Logistic Regression (Penalty = L2),1,0.9,0.5173116089613035,0.46573868635357885,0.005396366119384766,0.46573868635357885
183,7,Naive Bayes,1,0.9,0.48879837067209775,0.504984588829033,0.01936483383178711,0.504984588829033
184,7,KNeighbors Classifier,2,0.9,0.41836734693877553,0.385213104069916,0.030184268951416016,0.385213104069916
185,7,SVC Classifier,2,0.9,0.42653061224489797,1.0,0.09612584114074707,0.0
186,7,Decision Tree,2,0.9,0.4346938775510204,0.42072919243712475,0.019285202026367188,0.42072919243712475
187,7,RandomForest,2,0.9,0.5306122448979592,0.6889420500487388,0.07763171195983887,0.0
188,7,AdaBoost (Discrete),2,0.9,0.5040816326530613,0.4813418016877654,4.836447477340698,0.4813418016877654
189,7,AdaBoost (Real),2,0.9,0.4306122448979592,0.4154515716905645,5.637993574142456,0.4154515716905645
190,7,Logistic Regression (Penalty = L2),2,0.9,0.5020408163265306,0.44551809034089823,0.023691654205322266,0.44551809034089823
191,7,Naive Bayes,2,0.9,0.46122448979591835,0.47341325281455837,0.0037817955017089844,0.47341325281455837
192,8,KNeighbors Classifier,0,0.9,0.47560975609756095,0.42414800721829427,0.027941226959228516,0.42414800721829427
193,8,SVC Classifier,0,0.9,0.4268292682926829,1.0,0.11697769165039062,0.0
194,8,Decision Tree,0,0.9,0.45528455284552843,0.4164161152577286,0.01915764808654785,0.4164161152577286
195,8,RandomForest,0,0.9,0.5223577235772358,0.2686990502040067,0.05481743812561035,0.2686990502040067
196,8,AdaBoost (Discrete),0,0.9,0.524390243902439,0.48218923618680803,5.5138561725616455,0.48218923618680803
197,8,AdaBoost (Real),0,0.9,0.45934959349593496,0.41421696991736506,6.359339475631714,0.41421696991736506
198,8,Logistic Regression (Penalty = L2),0,0.9,0.5121951219512195,0.4548837595222066,0.006314754486083984,0.4548837595222066
199,8,Naive Bayes,0,0.9,0.4715447154471545,0.48177093579390906,0.019725799560546875,0.48177093579390906
200,8,KNeighbors Classifier,1,0.9,0.45010183299389,0.3956562669955195,0.029867887496948242,0.3956562669955195
201,8,SVC Classifier,1,0.9,0.42769857433808556,1.0,0.10812568664550781,0.0
202,8,Decision Tree,1,0.9,0.42973523421588594,0.4164506311883267,0.027452468872070312,0.4164506311883267
203,8,RandomForest,1,0.9,0.4908350305498982,0.6043261404520025,0.06906795501708984,0.0
204,8,AdaBoost (Discrete),1,0.9,0.5315682281059063,0.5074857232579452,5.057220697402954,0.5074857232579452
205,8,AdaBoost (Real),1,0.9,0.49287169042769857,0.4572673174967178,5.3516645431518555,0.4572673174967178
206,8,Logistic Regression (Penalty = L2),1,0.9,0.5193482688391039,0.4669030379148885,0.022501707077026367,0.4669030379148885
207,8,Naive Bayes,1,0.9,0.47657841140529533,0.48924148928706035,0.0038690567016601562,0.48924148928706035
208,8,KNeighbors Classifier,2,0.9,0.463265306122449,0.4256048416937185,0.04376053810119629,0.4256048416937185
209,8,SVC Classifier,2,0.9,0.42653061224489797,1.0,0.11764645576477051,0.0
210,8,Decision Tree,2,0.9,0.44081632653061226,0.4077336021728915,0.01874542236328125,0.4077336021728915
211,8,RandomForest,2,0.9,0.5020408163265306,0.384506091557399,0.05617880821228027,0.384506091557399
212,8,AdaBoost (Discrete),2,0.9,0.5265306122448979,0.5014116397654704,4.391340255737305,0.5014116397654704
213,8,AdaBoost (Real),2,0.9,0.4714285714285714,0.44519849332279215,5.189598798751831,0.44519849332279215
214,8,Logistic Regression (Penalty = L2),2,0.9,0.49795918367346936,0.44617883999147817,0.020807266235351562,0.44617883999147817
215,8,Naive Bayes,2,0.9,0.4714285714285714,0.48024380815317497,0.019795894622802734,0.48024380815317497
216,9,KNeighbors Classifier,0,0.9,0.4796747967479675,0.41588494704031925,0.04698777198791504,0.41588494704031925
217,9,SVC Classifier,0,0.9,0.4268292682926829,1.0,0.11678624153137207,0.0
218,9,Decision Tree,0,0.9,0.4491869918699187,0.42563400854848077,0.019257783889770508,0.42563400854848077
219,9,RandomForest,0,0.9,0.5223577235772358,0.24696425545213874,0.08966302871704102,0.24696425545213874
220,9,AdaBoost (Discrete),0,0.9,0.5223577235772358,0.4746705812992846,4.5203351974487305,0.4746705812992846
221,9,AdaBoost (Real),0,0.9,0.4898373983739837,0.43683953816984705,6.508340358734131,0.43683953816984705
222,9,Logistic Regression (Penalty = L2),0,0.9,0.5040650406504065,0.44952658834368375,0.031266212463378906,0.44952658834368375
223,9,Naive Bayes,0,0.9,0.47560975609756095,0.48611500648980643,0.028299808502197266,0.48611500648980643
224,9,KNeighbors Classifier,1,0.9,0.45417515274949083,0.413372300765397,0.0635061264038086,0.413372300765397
225,9,SVC Classifier,1,0.9,0.42769857433808556,1.0,0.11998581886291504,0.0
226,9,Decision Tree,1,0.9,0.439918533604888,0.4100914298949538,0.003175973892211914,0.4100914298949538
227,9,RandomForest,1,0.9,0.5112016293279023,0.3364811450187005,0.09940099716186523,0.3364811450187005
228,9,AdaBoost (Discrete),1,0.9,0.5295315682281059,0.5066003516615346,5.690549850463867,0.5066003516615346
229,9,AdaBoost (Real),1,0.9,0.48879837067209775,0.4593178710126768,5.83393931388855,0.4593178710126768
230,9,Logistic Regression (Penalty = L2),1,0.9,0.5234215885947047,0.47312778393133187,0.005909442901611328,0.47312778393133187
231,9,Naive Bayes,1,0.9,0.48268839103869654,0.4962104473818888,0.0043065547943115234,0.4962104473818888
232,9,KNeighbors Classifier,2,0.9,0.43673469387755104,0.39616246962916785,0.02670741081237793,0.39616246962916785
233,9,SVC Classifier,2,0.9,0.42653061224489797,1.0,0.07070136070251465,0.0
234,9,Decision Tree,2,0.9,0.4530612244897959,0.43149681520305705,0.003158092498779297,0.43149681520305705
235,9,RandomForest,2,0.9,0.5142857142857142,0.24905747378818544,0.045569658279418945,0.24905747378818544
236,9,AdaBoost (Discrete),2,0.9,0.5326530612244897,0.5103581734381604,4.967604398727417,0.5103581734381604
237,9,AdaBoost (Real),2,0.9,0.47346938775510206,0.44647414067698993,5.682871341705322,0.44647414067698993
238,9,Logistic Regression (Penalty = L2),2,0.9,0.5061224489795918,0.45278771842445664,0.02316880226135254,0.45278771842445664
239,9,Naive Bayes,2,0.9,0.46530612244897956,0.4726131609070123,0.003839254379272461,0.4726131609070123
240,10,KNeighbors Classifier,0,0.9,0.48577235772357724,0.4228854602289914,0.047480106353759766,0.4228854602289914
241,10,SVC Classifier,0,0.9,0.4268292682926829,1.0,0.13295221328735352,0.0
242,10,Decision Tree,0,0.9,0.4898373983739837,0.45596269609157736,0.012821197509765625,0.45596269609157736
243,10,RandomForest,0,0.9,0.49390243902439024,0.35924262487992414,0.11307168006896973,0.35924262487992414
244,10,AdaBoost (Discrete),0,0.9,0.5386178861788617,0.4873420114817136,7.246188402175903,0.4873420114817136
245,10,AdaBoost (Real),0,0.9,0.48577235772357724,0.43906834990447113,12.974480390548706,0.43906834990447113
246,10,Logistic Regression (Penalty = L2),0,0.9,0.5040650406504065,0.4451639245572657,0.04772210121154785,0.4451639245572657
247,10,Naive Bayes,0,0.9,0.4491869918699187,0.4623015062177744,0.023711204528808594,0.4623015062177744
248,10,KNeighbors Classifier,1,0.9,0.45621181262729127,0.42398086068424296,0.09445929527282715,0.42398086068424296
249,10,SVC Classifier,1,0.9,0.42769857433808556,1.0,0.2146470546722412,0.0
250,10,Decision Tree,1,0.9,0.439918533604888,0.4154939137555285,0.022875070571899414,0.4154939137555285
251,10,RandomForest,1,0.9,0.5030549898167006,0.5988317290991773,0.17122125625610352,0.0
252,10,AdaBoost (Discrete),1,0.9,0.5417515274949084,0.5145172609061862,9.906086444854736,0.5145172609061862
253,10,AdaBoost (Real),1,0.9,0.5091649694501018,0.470965463715331,12.007330179214478,0.470965463715331
254,10,Logistic Regression (Penalty = L2),1,0.9,0.5234215885947047,0.4704947408915208,0.046334266662597656,0.4704947408915208
255,10,Naive Bayes,1,0.9,0.4847250509164969,0.5006527422555169,0.023290634155273438,0.5006527422555169
256,10,KNeighbors Classifier,2,0.9,0.42857142857142855,0.37856415312782427,0.09681415557861328,0.37856415312782427
257,10,SVC Classifier,2,0.9,0.42653061224489797,1.0,0.1899852752685547,0.0
258,10,Decision Tree,2,0.9,0.44081632653061226,0.4207248950724362,0.02342963218688965,0.4207248950724362
259,10,RandomForest,2,0.9,0.5020408163265306,0.3574494095402627,0.12071537971496582,0.3574494095402627
260,10,AdaBoost (Discrete),2,0.9,0.5265306122448979,0.4988211239878325,9.777864694595337,0.4988211239878325
261,10,AdaBoost (Real),2,0.9,0.4816326530612245,0.46776088495995544,11.86785626411438,0.46776088495995544
262,10,Logistic Regression (Penalty = L2),2,0.9,0.5163265306122449,0.4603473901017494,0.0636286735534668,0.4603473901017494
263,10,Naive Bayes,2,0.9,0.4673469387755102,0.48011697645390805,0.0026443004608154297,0.48011697645390805
264,11,KNeighbors Classifier,0,0.9,0.48577235772357724,0.4228854602289914,0.11241745948791504,0.4228854602289914
265,11,SVC Classifier,0,0.9,0.4268292682926829,1.0,0.23812580108642578,0.0
266,11,Decision Tree,0,0.9,0.4491869918699187,0.4139536070730205,0.003376007080078125,0.4139536070730205
267,11,RandomForest,0,0.9,0.49390243902439024,0.35924262487992414,0.14660120010375977,0.35924262487992414
268,11,AdaBoost (Discrete),0,0.9,0.5386178861788617,0.4873420114817136,10.184403896331787,0.4873420114817136
269,11,AdaBoost (Real),0,0.9,0.48577235772357724,0.43906834990447113,16.88568639755249,0.43906834990447113
270,11,Logistic Regression (Penalty = L2),0,0.9,0.5040650406504065,0.4451639245572657,0.07844376564025879,0.4451639245572657
271,11,Naive Bayes,0,0.9,0.4491869918699187,0.4623015062177744,0.038659095764160156,0.4623015062177744
272,11,KNeighbors Classifier,1,0.9,0.45621181262729127,0.42398086068424296,0.12273097038269043,0.42398086068424296
273,11,SVC Classifier,1,0.9,0.42769857433808556,1.0,0.36156678199768066,0.0
274,11,Decision Tree,1,0.9,0.42362525458248473,0.4107416325713575,0.0386965274810791,0.4107416325713575
275,11,RandomForest,1,0.9,0.5030549898167006,0.5988317290991773,0.2800414562225342,0.0
276,11,AdaBoost (Discrete),1,0.9,0.5417515274949084,0.5145172609061862,14.836291551589966,0.5145172609061862
277,11,AdaBoost (Real),1,0.9,0.5091649694501018,0.470965463715331,19.468427896499634,0.470965463715331
278,11,Logistic Regression (Penalty = L2),1,0.9,0.5234215885947047,0.4704947408915208,0.07945013046264648,0.4704947408915208
279,11,Naive Bayes,1,0.9,0.4847250509164969,0.5006527422555169,0.04013466835021973,0.5006527422555169
280,11,KNeighbors Classifier,2,0.9,0.42857142857142855,0.37856415312782427,0.16073870658874512,0.37856415312782427
281,11,SVC Classifier,2,0.9,0.42653061224489797,1.0,0.3973565101623535,0.0
282,11,Decision Tree,2,0.9,0.45918367346938777,0.43299508005521764,0.03851485252380371,0.43299508005521764
283,11,RandomForest,2,0.9,0.5020408163265306,0.3574494095402627,0.2808876037597656,0.3574494095402627
284,11,AdaBoost (Discrete),2,0.9,0.5265306122448979,0.4988211239878325,16.39022159576416,0.4988211239878325
285,11,AdaBoost (Real),2,0.9,0.48367346938775513,0.4698035348230519,19.217605590820312,0.4698035348230519
286,11,Logistic Regression (Penalty = L2),2,0.9,0.5163265306122449,0.4603473901017494,0.07971310615539551,0.4603473901017494
287,11,Naive Bayes,2,0.9,0.4673469387755102,0.48011697645390805,0.039781808853149414,0.48011697645390805
288,12,KNeighbors Classifier,0,0.9,0.47560975609756095,0.42414800721829427,0.15725469589233398,0.42414800721829427
289,12,SVC Classifier,0,0.9,0.4268292682926829,1.0,0.28501248359680176,0.0
290,12,Decision Tree,0,0.9,0.4532520325203252,0.4016797525114154,0.03914189338684082,0.4016797525114154
291,12,RandomForest,0,0.9,0.5223577235772358,0.2686990502040067,0.24204683303833008,0.2686990502040067
292,12,AdaBoost (Discrete),0,0.9,0.524390243902439,0.48218923618680803,15.606830835342407,0.48218923618680803
293,12,AdaBoost (Real),0,0.9,0.45934959349593496,0.41421696991736506,19.293410778045654,0.41421696991736506
294,12,Logistic Regression (Penalty = L2),0,0.9,0.5121951219512195,0.4548837595222066,0.04143333435058594,0.4548837595222066
295,12,Naive Bayes,0,0.9,0.4715447154471545,0.48177093579390906,0.04413127899169922,0.48177093579390906
296,12,KNeighbors Classifier,1,0.9,0.45010183299389,0.3956562669955195,0.08547377586364746,0.3956562669955195
297,12,SVC Classifier,1,0.9,0.42769857433808556,1.0,0.35297393798828125,0.0
298,12,Decision Tree,1,0.9,0.45417515274949083,0.43402819071132726,0.03866839408874512,0.43402819071132726
299,12,RandomForest,1,0.9,0.4908350305498982,0.6043261404520025,0.2787621021270752,0.0
300,12,AdaBoost (Discrete),1,0.9,0.5315682281059063,0.5074857232579452,16.94267749786377,0.5074857232579452
301,12,AdaBoost (Real),1,0.9,0.49287169042769857,0.4572673174967178,19.1455557346344,0.4572673174967178
302,12,Logistic Regression (Penalty = L2),1,0.9,0.5193482688391039,0.4669030379148885,0.07804131507873535,0.4669030379148885
303,12,Naive Bayes,1,0.9,0.47657841140529533,0.48924148928706035,0.0430908203125,0.48924148928706035
304,12,KNeighbors Classifier,2,0.9,0.463265306122449,0.4256048416937185,0.1316204071044922,0.4256048416937185
305,12,SVC Classifier,2,0.9,0.42653061224489797,1.0,0.4366743564605713,0.0
306,12,Decision Tree,2,0.9,0.4306122448979592,0.40344553738988004,0.04227757453918457,0.40344553738988004
307,12,RandomForest,2,0.9,0.5020408163265306,0.384506091557399,0.263871431350708,0.384506091557399
308,12,AdaBoost (Discrete),2,0.9,0.5265306122448979,0.5014116397654704,17.245898962020874,0.5014116397654704
309,12,AdaBoost (Real),2,0.9,0.4714285714285714,0.44519849332279215,17.62195634841919,0.44519849332279215
310,12,Logistic Regression (Penalty = L2),2,0.9,0.49795918367346936,0.44617883999147817,0.036591529846191406,0.44617883999147817
311,12,Naive Bayes,2,0.9,0.4714285714285714,0.48024380815317497,0.03561735153198242,0.48024380815317497
