,feat_set_id,classifier,fold_id,feat_th,score,geo_score,exec_t,geo_score_woz
0,0,KNeighbors Classifier,0,0.35,0.8146370725854829,0.8146267279909954,10.707118511199951,0.8146267279909954
1,0,SVC Classifier,0,0.35,0.8524295140971806,0.8461328810111874,17.244022130966187,0.8461328810111874
2,0,Decision Tree,0,0.35,0.752249550089982,0.7521707208991633,0.5998656749725342,0.7521707208991633
3,0,RandomForest,0,0.35,0.7798440311937612,0.7716370330522389,1.7243926525115967,0.7716370330522389
4,0,AdaBoost (Discrete),0,0.35,0.8212357528494301,0.8200155025664687,257.03976488113403,0.8200155025664687
5,0,AdaBoost (Real),0,0.35,0.8146370725854829,0.8127707594963473,284.8971679210663,0.8127707594963473
6,0,Logistic Regression (Penalty = L2),0,0.35,0.8704259148170366,0.8703096903952123,1.240670919418335,0.8703096903952123
7,0,Naive Bayes,0,0.35,0.8050389922015597,0.7806519404869253,0.25914907455444336,0.7806519404869253
8,0,KNeighbors Classifier,1,0.35,0.8116376724655069,0.8115625087339956,9.498895406723022,0.8115625087339956
9,0,SVC Classifier,1,0.35,0.8482303539292142,0.8420178208147762,15.648864984512329,0.8420178208147762
10,0,Decision Tree,1,0.35,0.7384523095380924,0.737957724544498,0.5476455688476562,0.737957724544498
11,0,RandomForest,1,0.35,0.7732453509298141,0.7605925568433705,1.5082728862762451,0.7605925568433705
12,0,AdaBoost (Discrete),1,0.35,0.8176364727054589,0.8174688023164315,251.28523921966553,0.8174688023164315
13,0,AdaBoost (Real),1,0.35,0.8056388722255549,0.8034328433189248,187.34337162971497,0.8034328433189248
14,0,Logistic Regression (Penalty = L2),1,0.35,0.8614277144571085,0.861218294803445,1.1625709533691406,0.861218294803445
15,0,Naive Bayes,1,0.35,0.7990401919616077,0.7747050090426175,0.2557659149169922,0.7747050090426175
16,0,KNeighbors Classifier,2,0.35,0.8397358943577431,0.8397133828789942,8.703812837600708,0.8397133828789942
17,0,SVC Classifier,2,0.35,0.851140456182473,0.843867603741886,12.579052448272705,0.843867603741886
18,0,Decision Tree,2,0.35,0.7509003601440576,0.750594910305875,0.8198115825653076,0.750594910305875
19,0,RandomForest,2,0.35,0.7785114045618248,0.7647675798575039,3.3300087451934814,0.7647675798575039
20,0,AdaBoost (Discrete),2,0.35,0.8379351740696278,0.8353180194709181,203.99197101593018,0.8353180194709181
21,0,AdaBoost (Real),2,0.35,0.851140456182473,0.8493882976676393,217.71879625320435,0.8493882976676393
22,0,Logistic Regression (Penalty = L2),2,0.35,0.8715486194477791,0.8715077485139634,0.9638328552246094,0.8715077485139634
23,0,Naive Bayes,2,0.35,0.8127250900360145,0.7865348607474745,0.22664880752563477,0.7865348607474745
24,1,KNeighbors Classifier,0,0.35,0.8098380323935213,0.8096648370500885,9.016990184783936,0.8096648370500885
25,1,SVC Classifier,0,0.35,0.8518296340731853,0.8475580070266769,15.187584161758423,0.8475580070266769
26,1,Decision Tree,0,0.35,0.7336532693461307,0.733249705108963,0.5246660709381104,0.733249705108963
27,1,RandomForest,0,0.35,0.7918416316736653,0.7839740269574258,1.5932557582855225,0.7839740269574258
28,1,AdaBoost (Discrete),0,0.35,0.8218356328734253,0.821516848126677,202.05542302131653,0.821516848126677
29,1,AdaBoost (Real),0,0.35,0.8176364727054589,0.817276841533725,219.5334334373474,0.817276841533725
30,1,Logistic Regression (Penalty = L2),0,0.35,0.8650269946010798,0.8649341209357515,0.9656286239624023,0.8649341209357515
31,1,Naive Bayes,0,0.35,0.8134373125374925,0.7923491434042714,0.21594953536987305,0.7923491434042714
32,1,KNeighbors Classifier,1,0.35,0.8020395920815837,0.8020342871980357,8.158886909484863,0.8020342871980357
33,1,SVC Classifier,1,0.35,0.850629874025195,0.8456532491015164,12.827951908111572,0.8456532491015164
34,1,Decision Tree,1,0.35,0.7354529094181164,0.7354109713788505,0.4463770389556885,0.7354109713788505
35,1,RandomForest,1,0.35,0.770245950809838,0.7561852337741484,1.4623730182647705,0.7561852337741484
36,1,AdaBoost (Discrete),1,0.35,0.8200359928014397,0.8190496874275917,200.08541011810303,0.8190496874275917
37,1,AdaBoost (Real),1,0.35,0.8206358728254349,0.8202534531629436,273.4812502861023,0.8202534531629436
38,1,Logistic Regression (Penalty = L2),1,0.35,0.8578284343131374,0.8577320765578997,1.1524658203125,0.8577320765578997
39,1,Naive Bayes,1,0.35,0.8050389922015597,0.7865094067408122,0.2863426208496094,0.7865094067408122
40,1,KNeighbors Classifier,2,0.35,0.8325330132052821,0.8324336659091077,10.599388837814331,0.8324336659091077
41,1,SVC Classifier,2,0.35,0.8607442977190877,0.8548585503516177,17.121169805526733,0.8548585503516177
42,1,Decision Tree,2,0.35,0.7563025210084033,0.7562951661985787,0.5323629379272461,0.7562951661985787
43,1,RandomForest,2,0.35,0.7929171668667467,0.781243601040671,1.7382919788360596,0.781243601040671
44,1,AdaBoost (Discrete),2,0.35,0.8463385354141657,0.8452898413033363,248.5434844493866,0.8452898413033363
45,1,AdaBoost (Real),2,0.35,0.8391356542617047,0.836770772831224,276.0193181037903,0.836770772831224
46,1,Logistic Regression (Penalty = L2),2,0.35,0.8745498199279712,0.8745233857204482,1.1916460990905762,0.8745233857204482
47,1,Naive Bayes,2,0.35,0.8157262905162065,0.7933507803666258,0.30796337127685547,0.7933507803666258
48,2,KNeighbors Classifier,0,0.35,0.7588482303539292,0.7581325176093723,14.951349258422852,0.7581325176093723
49,2,SVC Classifier,0,0.35,0.7924415116976604,0.7709539405157901,21.036881923675537,0.7709539405157901
50,2,Decision Tree,0,0.35,0.7330533893221356,0.7329846819056152,0.5066721439361572,0.7329846819056152
51,2,RandomForest,0,0.35,0.73125374925015,0.6871197320208305,1.8326818943023682,0.6871197320208305
52,2,AdaBoost (Discrete),0,0.35,0.7780443911217756,0.7730014487355418,221.3703157901764,0.7730014487355418
53,2,AdaBoost (Real),0,0.35,0.7456508698260348,0.7395676487719568,269.43752360343933,0.7395676487719568
54,2,Logistic Regression (Penalty = L2),0,0.35,0.8254349130173965,0.8250445790074089,1.211106538772583,0.8250445790074089
55,2,Naive Bayes,0,0.35,0.7588482303539292,0.7135679410613602,0.3481178283691406,0.7135679410613602
56,2,KNeighbors Classifier,1,0.35,0.7498500299940012,0.7487701392795972,14.605027675628662,0.7487701392795972
57,2,SVC Classifier,1,0.35,0.7954409118176364,0.7754353987318382,20.39559578895569,0.7754353987318382
58,2,Decision Tree,1,0.35,0.7018596280743852,0.7013928818889833,0.6197009086608887,0.7013928818889833
59,2,RandomForest,1,0.35,0.7288542291541692,0.6932679414901619,1.7665276527404785,0.6932679414901619
60,2,AdaBoost (Discrete),1,0.35,0.7408518296340731,0.7330516400194603,281.50832772254944,0.7330516400194603
61,2,AdaBoost (Real),1,0.35,0.7366526694661067,0.7295475364875448,312.1326262950897,0.7295475364875448
62,2,Logistic Regression (Penalty = L2),1,0.35,0.823635272945411,0.8230610420202431,1.1444909572601318,0.8230610420202431
63,2,Naive Bayes,1,0.35,0.74625074985003,0.6970951386177604,0.3197178840637207,0.6970951386177604
64,2,KNeighbors Classifier,2,0.35,0.7551020408163265,0.7538187252834363,14.192198038101196,0.7538187252834363
65,2,SVC Classifier,2,0.35,0.7995198079231692,0.7759122681506826,20.735639810562134,0.7759122681506826
66,2,Decision Tree,2,0.35,0.7058823529411765,0.7056010376993489,0.6331467628479004,0.7056010376993489
67,2,RandomForest,2,0.35,0.7394957983193278,0.7007251382698941,1.725144624710083,0.7007251382698941
68,2,AdaBoost (Discrete),2,0.35,0.7899159663865546,0.7870545785358609,277.99801993370056,0.7870545785358609
69,2,AdaBoost (Real),2,0.35,0.7827130852340937,0.7795025912206213,300.0371437072754,0.7795025912206213
70,2,Logistic Regression (Penalty = L2),2,0.35,0.8151260504201681,0.8143923920669914,1.091719627380371,0.8143923920669914
71,2,Naive Bayes,2,0.35,0.7611044417767107,0.7113877120486947,0.3185386657714844,0.7113877120486947
72,3,KNeighbors Classifier,0,0.35,0.8158368326334733,0.8157194718432353,10.41462779045105,0.8157194718432353
73,3,SVC Classifier,0,0.35,0.8488302339532093,0.8434997554158359,17.997283935546875,0.8434997554158359
74,3,Decision Tree,0,0.35,0.7450509898020395,0.7445965710842873,0.5017569065093994,0.7445965710842873
75,3,RandomForest,0,0.35,0.7558488302339532,0.7547152813706046,2.0574841499328613,0.7547152813706046
76,3,AdaBoost (Discrete),0,0.35,0.8152369526094781,0.8139204548908179,255.1632936000824,0.8139204548908179
77,3,AdaBoost (Real),0,0.35,0.8212357528494301,0.8187989157531987,288.9407479763031,0.8187989157531987
78,3,Logistic Regression (Penalty = L2),0,0.35,0.8644271145770845,0.8642479241937078,1.3407299518585205,0.8642479241937078
79,3,Naive Bayes,0,0.35,0.8128374325134973,0.7930168762061377,0.3119070529937744,0.7930168762061377
80,3,KNeighbors Classifier,1,0.35,0.7978404319136173,0.7977693432137107,9.977962017059326,0.7977693432137107
81,3,SVC Classifier,1,0.35,0.8494301139772046,0.8442430543298899,17.354001998901367,0.8442430543298899
82,3,Decision Tree,1,0.35,0.7384523095380924,0.7384463798667339,0.4774808883666992,0.7384463798667339
83,3,RandomForest,1,0.35,0.7498500299940012,0.74877726503497,1.9610772132873535,0.74877726503497
84,3,AdaBoost (Discrete),1,0.35,0.8092381523695261,0.8069008626780017,230.17667269706726,0.8069008626780017
85,3,AdaBoost (Real),1,0.35,0.8110377924415118,0.8088821529647038,260.58768248558044,0.8088821529647038
86,3,Logistic Regression (Penalty = L2),1,0.35,0.8572285542891421,0.8570779534927002,1.1070849895477295,0.8570779534927002
87,3,Naive Bayes,1,0.35,0.8062387522495501,0.7887413450204029,0.2263343334197998,0.7887413450204029
88,3,KNeighbors Classifier,2,0.35,0.8343337334933973,0.8342382060574144,8.05535101890564,0.8342382060574144
89,3,SVC Classifier,2,0.35,0.8553421368547419,0.849082987677921,15.009666442871094,0.849082987677921
90,3,Decision Tree,2,0.35,0.7436974789915967,0.7435137516991662,0.4084923267364502,0.7435137516991662
91,3,RandomForest,2,0.35,0.7719087635054022,0.7620524025409535,1.6156949996948242,0.7620524025409535
92,3,AdaBoost (Discrete),2,0.35,0.8457382953181273,0.8441744844904676,250.70302939414978,0.8441744844904676
93,3,AdaBoost (Real),2,0.35,0.8343337334933973,0.8288353120472712,276.5533585548401,0.8288353120472712
94,3,Logistic Regression (Penalty = L2),2,0.35,0.8727490996398559,0.8726906472297501,1.2217707633972168,0.8726906472297501
95,3,Naive Bayes,2,0.35,0.8199279711884754,0.7975766328532727,0.38400864601135254,0.7975766328532727
96,4,KNeighbors Classifier,0,0.35,0.7774445110977805,0.7771668026801863,4.76180362701416,0.7771668026801863
97,4,SVC Classifier,0,0.35,0.7918416316736653,0.7690655992442011,16.106120824813843,0.7690655992442011
98,4,Decision Tree,0,0.35,0.7222555488902219,0.7216239913135223,0.7095584869384766,0.7216239913135223
99,4,RandomForest,0,0.35,0.7348530293941212,0.7302846560804024,1.9805371761322021,0.7302846560804024
100,4,AdaBoost (Discrete),0,0.35,0.7504499100179964,0.7441292031746998,191.01573371887207,0.7441292031746998
101,4,AdaBoost (Real),0,0.35,0.7408518296340731,0.7325109062589255,209.52769112586975,0.7325109062589255
102,4,Logistic Regression (Penalty = L2),0,0.35,0.8272345530893821,0.8267584017906177,1.0362625122070312,0.8267584017906177
103,4,Naive Bayes,0,0.35,0.7594481103779244,0.7145786618755212,0.2758340835571289,0.7145786618755212
104,4,KNeighbors Classifier,1,0.35,0.755248950209958,0.7547590105836347,4.999295473098755,0.7547590105836347
105,4,SVC Classifier,1,0.35,0.7966406718656269,0.7751081968224584,14.068591356277466,0.7751081968224584
106,4,Decision Tree,1,0.35,0.7036592681463707,0.7033918413386181,0.4544103145599365,0.7033918413386181
107,4,RandomForest,1,0.35,0.7276544691061788,0.7241038828946968,1.546604871749878,0.7241038828946968
108,4,AdaBoost (Discrete),1,0.35,0.7396520695860828,0.7320675009348026,164.79997444152832,0.7320675009348026
109,4,AdaBoost (Real),1,0.35,0.7438512297540492,0.7378770785721713,189.37173652648926,0.7378770785721713
110,4,Logistic Regression (Penalty = L2),1,0.35,0.8320335932813437,0.8315400348398054,0.7904558181762695,0.8315400348398054
111,4,Naive Bayes,1,0.35,0.7450509898020395,0.6955918378782222,0.26707983016967773,0.6955918378782222
112,4,KNeighbors Classifier,2,0.35,0.7821128451380552,0.7817655180402443,3.8053152561187744,0.7817655180402443
113,4,SVC Classifier,2,0.35,0.7995198079231692,0.776622958415859,12.1129789352417,0.776622958415859
114,4,Decision Tree,2,0.35,0.7310924369747899,0.730923758073279,0.6330723762512207,0.730923758073279
115,4,RandomForest,2,0.35,0.7418967587034814,0.717191918807442,1.581571340560913,0.717191918807442
116,4,AdaBoost (Discrete),2,0.35,0.7665066026410564,0.7586215517435471,182.72962379455566,0.7586215517435471
117,4,AdaBoost (Real),2,0.35,0.7593037214885955,0.7501238791170362,199.5463855266571,0.7501238791170362
118,4,Logistic Regression (Penalty = L2),2,0.35,0.8175270108043218,0.8169070388789305,0.8176264762878418,0.8169070388789305
119,4,Naive Bayes,2,0.35,0.7605042016806722,0.7120736790706856,0.25203490257263184,0.7120736790706856
120,5,KNeighbors Classifier,0,0.35,0.7804439112177565,0.7799398253530816,3.103109359741211,0.7799398253530816
121,5,SVC Classifier,0,0.35,0.7894421115776845,0.7690555262164034,12.645681619644165,0.7690555262164034
122,5,Decision Tree,0,0.35,0.7114577084583084,0.7110999978334094,0.28390073776245117,0.7110999978334094
123,5,RandomForest,0,0.35,0.7426514697060588,0.7343986790016195,1.5398204326629639,0.7343986790016195
124,5,AdaBoost (Discrete),0,0.35,0.7780443911217756,0.7765878513658037,160.57918643951416,0.7765878513658037
125,5,AdaBoost (Real),0,0.35,0.7228554289142172,0.7127793359075586,167.2999243736267,0.7127793359075586
126,5,Logistic Regression (Penalty = L2),0,0.35,0.8206358728254349,0.8202321095189159,0.6969544887542725,0.8202321095189159
127,5,Naive Bayes,0,0.35,0.76124775044991,0.7217464692198658,0.15864086151123047,0.7217464692198658
128,5,KNeighbors Classifier,1,0.35,0.76124775044991,0.7608527200585975,3.0578112602233887,0.7608527200585975
129,5,SVC Classifier,1,0.35,0.7924415116976604,0.7731761838416209,13.78169584274292,0.7731761838416209
130,5,Decision Tree,1,0.35,0.7150569886022795,0.7147157240169825,0.45555591583251953,0.7147157240169825
131,5,RandomForest,1,0.35,0.74625074985003,0.7391649420307925,1.4044461250305176,0.7391649420307925
132,5,AdaBoost (Discrete),1,0.35,0.7180563887222555,0.7104294968670681,1214.429343700409,0.7104294968670681
133,5,AdaBoost (Real),1,0.35,0.7504499100179964,0.7484704366983053,155.93468379974365,0.7484704366983053
134,5,Logistic Regression (Penalty = L2),1,0.35,0.8254349130173965,0.8249217361889559,0.5953114032745361,0.8249217361889559
135,5,Naive Bayes,1,0.35,0.755248950209958,0.7159807723398481,0.20007991790771484,0.7159807723398481
136,5,KNeighbors Classifier,2,0.35,0.7749099639855942,0.7744712801632484,3.075958013534546,0.7744712801632484
137,5,SVC Classifier,2,0.35,0.7965186074429772,0.7757324639751106,11.382083177566528,0.7757324639751106
138,5,Decision Tree,2,0.35,0.726890756302521,0.7264957953899261,0.21677160263061523,0.7264957953899261
139,5,RandomForest,2,0.35,0.7581032412965186,0.7546947812933534,1.3196394443511963,0.7546947812933534
140,5,AdaBoost (Discrete),2,0.35,0.7683073229291717,0.7614807093930617,126.33159255981445,0.7614807093930617
141,5,AdaBoost (Real),2,0.35,0.7647058823529411,0.759742894710492,148.91418528556824,0.759742894710492
142,5,Logistic Regression (Penalty = L2),2,0.35,0.8187274909963985,0.8182665120426683,0.5361905097961426,0.8182665120426683
143,5,Naive Bayes,2,0.35,0.7635054021608644,0.7230371890946025,0.23902058601379395,0.7230371890946025
144,6,KNeighbors Classifier,0,0.35,0.8146370725854829,0.8146267279909954,7.54885721206665,0.8146267279909954
145,6,SVC Classifier,0,0.35,0.8524295140971806,0.8461328810111874,13.181382417678833,0.8461328810111874
146,6,Decision Tree,0,0.35,0.7486502699460108,0.747802807341777,0.4548163414001465,0.747802807341777
147,6,RandomForest,0,0.35,0.7798440311937612,0.7716370330522389,1.3045737743377686,0.7716370330522389
148,6,AdaBoost (Discrete),0,0.35,0.8212357528494301,0.8200155025664687,183.87418675422668,0.8200155025664687
149,6,AdaBoost (Real),0,0.35,0.8140371925614877,0.8125430273952627,188.99626088142395,0.8125430273952627
150,6,Logistic Regression (Penalty = L2),0,0.35,0.8704259148170366,0.8703096903952123,0.8176829814910889,0.8703096903952123
151,6,Naive Bayes,0,0.35,0.8050389922015597,0.7806519404869253,0.18850398063659668,0.7806519404869253
152,6,KNeighbors Classifier,1,0.35,0.8116376724655069,0.8115625087339956,7.5182013511657715,0.8115625087339956
153,6,SVC Classifier,1,0.35,0.8482303539292142,0.8420178208147762,12.612671375274658,0.8420178208147762
154,6,Decision Tree,1,0.35,0.7456508698260348,0.7455370392912646,0.42227840423583984,0.7455370392912646
155,6,RandomForest,1,0.35,0.7732453509298141,0.7605925568433705,1.2494869232177734,0.7605925568433705
156,6,AdaBoost (Discrete),1,0.35,0.8176364727054589,0.8174688023164315,165.642760515213,0.8174688023164315
157,6,AdaBoost (Real),1,0.35,0.8104379124175165,0.8090240317688748,171.91515707969666,0.8090240317688748
158,6,Logistic Regression (Penalty = L2),1,0.35,0.8614277144571085,0.861218294803445,0.6012105941772461,0.861218294803445
159,6,Naive Bayes,1,0.35,0.7990401919616077,0.7747050090426175,0.17483782768249512,0.7747050090426175
160,6,KNeighbors Classifier,2,0.35,0.8397358943577431,0.8397133828789942,5.977860927581787,0.8397133828789942
161,6,SVC Classifier,2,0.35,0.851140456182473,0.843867603741886,10.186909198760986,0.843867603741886
162,6,Decision Tree,2,0.35,0.7527010804321729,0.7525245102640397,0.3895258903503418,0.7525245102640397
163,6,RandomForest,2,0.35,0.7785114045618248,0.7647675798575039,0.9182634353637695,0.7647675798575039
164,6,AdaBoost (Discrete),2,0.35,0.8379351740696278,0.8353180194709181,144.23778700828552,0.8353180194709181
165,6,AdaBoost (Real),2,0.35,0.843937575030012,0.8412126463949978,161.88331198692322,0.8412126463949978
166,6,Logistic Regression (Penalty = L2),2,0.35,0.8715486194477791,0.8715077485139634,0.72379469871521,0.8715077485139634
167,6,Naive Bayes,2,0.35,0.8127250900360145,0.7865348607474745,0.1577918529510498,0.7865348607474745
168,7,KNeighbors Classifier,0,0.35,0.8074385122975405,0.807272921353413,12.173874616622925,0.807272921353413
169,7,SVC Classifier,0,0.35,0.850629874025195,0.8452516711397203,12.730427503585815,0.8452516711397203
170,7,Decision Tree,0,0.35,0.7396520695860828,0.7389387202941079,0.4361999034881592,0.7389387202941079
171,7,RandomForest,0,0.35,0.7624475104979004,0.7572975429263413,1.1505684852600098,0.7572975429263413
172,7,AdaBoost (Discrete),0,0.35,0.8188362327534493,0.8185297654208913,184.83794689178467,0.8185297654208913
173,7,AdaBoost (Real),0,0.35,0.8218356328734253,0.8202942138374345,200.0360357761383,0.8202942138374345
174,7,Logistic Regression (Penalty = L2),0,0.35,0.8698260347930414,0.8697255897564032,0.7982950210571289,0.8697255897564032
175,7,Naive Bayes,0,0.35,0.8002399520095981,0.7749181268719788,0.20097613334655762,0.7749181268719788
176,7,KNeighbors Classifier,1,0.35,0.7990401919616077,0.7989354476201116,11.595437288284302,0.7989354476201116
177,7,SVC Classifier,1,0.35,0.8494301139772046,0.8437806001621206,11.491066217422485,0.8437806001621206
178,7,Decision Tree,1,0.35,0.7348530293941212,0.7342227785637009,0.45749902725219727,0.7342227785637009
179,7,RandomForest,1,0.35,0.7546490701859628,0.7457421976009057,1.0447523593902588,0.7457421976009057
180,7,AdaBoost (Discrete),1,0.35,0.8278344331133773,0.8275692698976845,175.43385291099548,0.8275692698976845
181,7,AdaBoost (Real),1,0.35,0.8218356328734253,0.8211825143605058,196.0642352104187,0.8211825143605058
182,7,Logistic Regression (Penalty = L2),1,0.35,0.8644271145770845,0.8643923589549366,0.7344706058502197,0.8643923589549366
183,7,Naive Bayes,1,0.35,0.788242351529694,0.7639039296312091,0.14879488945007324,0.7639039296312091
184,7,KNeighbors Classifier,2,0.35,0.8229291716686674,0.8226878409747252,10.356100082397461,0.8226878409747252
185,7,SVC Classifier,2,0.35,0.8589435774309724,0.8527320502146931,10.441025495529175,0.8527320502146931
186,7,Decision Tree,2,0.35,0.7509003601440576,0.7507903600354885,0.2883634567260742,0.7507903600354885
187,7,RandomForest,2,0.35,0.7647058823529411,0.7543959765758042,0.936654806137085,0.7543959765758042
188,7,AdaBoost (Discrete),2,0.35,0.8451380552220888,0.8442256733263606,152.63443064689636,0.8442256733263606
189,7,AdaBoost (Real),2,0.35,0.8469387755102041,0.843837422825614,166.6591820716858,0.843837422825614
190,7,Logistic Regression (Penalty = L2),2,0.35,0.8763505402160864,0.8763288801008938,0.6986329555511475,0.8763288801008938
191,7,Naive Bayes,2,0.35,0.8091236494597839,0.782784923598228,0.110137939453125,0.782784923598228
192,8,KNeighbors Classifier,0,0.35,0.7804439112177565,0.7799398253530816,1.9101359844207764,0.7799398253530816
193,8,SVC Classifier,0,0.35,0.7894421115776845,0.7690555262164034,6.968761205673218,0.7690555262164034
194,8,Decision Tree,0,0.35,0.7234553089382123,0.7230644478076587,0.21613645553588867,0.7230644478076587
195,8,RandomForest,0,0.35,0.7426514697060588,0.7343986790016195,0.7204277515411377,0.7343986790016195
196,8,AdaBoost (Discrete),0,0.35,0.7774445110977805,0.7759710219947793,83.18420600891113,0.7759710219947793
197,8,AdaBoost (Real),0,0.35,0.7210557888422315,0.7098488575659138,110.37847971916199,0.7098488575659138
198,8,Logistic Regression (Penalty = L2),0,0.35,0.8206358728254349,0.8202321095189159,0.5559709072113037,0.8202321095189159
199,8,Naive Bayes,0,0.35,0.76124775044991,0.7217464692198658,0.08661699295043945,0.7217464692198658
200,8,KNeighbors Classifier,1,0.35,0.76124775044991,0.7608527200585975,2.3414742946624756,0.7608527200585975
201,8,SVC Classifier,1,0.35,0.7924415116976604,0.7731761838416209,7.6762754917144775,0.7731761838416209
202,8,Decision Tree,1,0.35,0.7246550689862028,0.7244165355727762,0.16237664222717285,0.7244165355727762
203,8,RandomForest,1,0.35,0.74625074985003,0.7391649420307925,0.875892162322998,0.7391649420307925
204,8,AdaBoost (Discrete),1,0.35,0.7180563887222555,0.7104294968670681,93.78255677223206,0.7104294968670681
205,8,AdaBoost (Real),1,0.35,0.7222555488902219,0.7120895319058316,107.68126010894775,0.7120895319058316
206,8,Logistic Regression (Penalty = L2),1,0.35,0.8254349130173965,0.8249217361889559,0.3982243537902832,0.8249217361889559
207,8,Naive Bayes,1,0.35,0.755248950209958,0.7159807723398481,0.1467757225036621,0.7159807723398481
208,8,KNeighbors Classifier,2,0.35,0.7749099639855942,0.7744712801632484,1.8639469146728516,0.7744712801632484
209,8,SVC Classifier,2,0.35,0.7965186074429772,0.7757324639751106,7.5956666469573975,0.7757324639751106
210,8,Decision Tree,2,0.35,0.7304921968787516,0.7300034487075711,0.250746488571167,0.7300034487075711
211,8,RandomForest,2,0.35,0.7581032412965186,0.7546947812933534,0.9508218765258789,0.7546947812933534
212,8,AdaBoost (Discrete),2,0.35,0.7683073229291717,0.7614807093930617,92.98390293121338,0.7614807093930617
213,8,AdaBoost (Real),2,0.35,0.758703481392557,0.7496566617979635,111.80088472366333,0.7496566617979635
214,8,Logistic Regression (Penalty = L2),2,0.35,0.8187274909963985,0.8182665120426683,0.5100512504577637,0.8182665120426683
215,8,Naive Bayes,2,0.35,0.7635054021608644,0.7230371890946025,0.11083173751831055,0.7230371890946025
