,feat_set_id,classifier,fold_id,feat_th,score,geo_score,exec_t,geo_score_woz
0,0,KNeighbors Classifier,0,0.65,0.8111510791366906,0.8111121594388575,1.8328783512115479,0.8111121594388575
1,0,SVC Classifier,0,0.65,0.8375299760191847,0.82381247634458,3.21201229095459,0.82381247634458
2,0,Decision Tree,0,0.65,0.75,0.7482243551717478,0.09683847427368164,0.7482243551717478
3,0,RandomForest,0,0.65,0.7805755395683454,0.770796866928637,0.2899196147918701,0.770796866928637
4,0,AdaBoost (Discrete),0,0.65,0.842925659472422,0.8429762647426156,39.18715476989746,0.8429762647426156
5,0,AdaBoost (Real),0,0.65,0.8363309352517986,0.8360290455160679,58.45785903930664,0.8360290455160679
6,0,Logistic Regression (Penalty = L2),0,0.65,0.8645083932853717,0.8638323043411487,0.375734806060791,0.8638323043411487
7,0,Naive Bayes,0,0.65,0.8075539568345323,0.7785279004090452,0.07605409622192383,0.7785279004090452
8,0,KNeighbors Classifier,1,0.65,0.7899159663865546,0.7887440776136079,2.456618309020996,0.7887440776136079
9,0,SVC Classifier,1,0.65,0.8313325330132053,0.8192875383474273,4.159441947937012,0.8192875383474273
10,0,Decision Tree,1,0.65,0.7346938775510204,0.7344421069323719,0.11725568771362305,0.7344421069323719
11,0,RandomForest,1,0.65,0.7749099639855942,0.762004909676682,0.4373805522918701,0.762004909676682
12,0,AdaBoost (Discrete),1,0.65,0.8175270108043218,0.8175215715799058,61.66773200035095,0.8175215715799058
13,0,AdaBoost (Real),1,0.65,0.8241296518607443,0.8240563369997022,71.40404343605042,0.8240563369997022
14,0,Logistic Regression (Penalty = L2),1,0.65,0.8457382953181273,0.845150948247085,0.37360119819641113,0.845150948247085
15,0,Naive Bayes,1,0.65,0.7995198079231692,0.7722356097391199,0.08731698989868164,0.7722356097391199
16,0,KNeighbors Classifier,2,0.65,0.8103241296518607,0.8085568340954774,2.8250441551208496,0.8085568340954774
17,0,SVC Classifier,2,0.65,0.8421368547418968,0.8273211728225383,4.696492910385132,0.8273211728225383
18,0,Decision Tree,2,0.65,0.7394957983193278,0.7383852503748009,0.15939092636108398,0.7383852503748009
19,0,RandomForest,2,0.65,0.7755102040816326,0.7664644333375279,0.3998875617980957,0.7664644333375279
20,0,AdaBoost (Discrete),2,0.65,0.8499399759903962,0.8495938379533796,56.74708843231201,0.8495938379533796
21,0,AdaBoost (Real),2,0.65,0.843937575030012,0.8438217129858604,64.39623260498047,0.8438217129858604
22,0,Logistic Regression (Penalty = L2),2,0.65,0.8595438175270108,0.8581568456524895,0.28569865226745605,0.8581568456524895
23,0,Naive Bayes,2,0.65,0.8109243697478992,0.7814251565415562,0.06428933143615723,0.7814251565415562
24,1,KNeighbors Classifier,0,0.65,0.8087529976019184,0.8080586864810629,2.2675693035125732,0.8080586864810629
25,1,SVC Classifier,0,0.65,0.8411270983213429,0.8284494978430711,3.928494930267334,0.8284494978430711
26,1,Decision Tree,0,0.65,0.7482014388489209,0.7481746293554805,0.10796570777893066,0.7481746293554805
27,1,RandomForest,0,0.65,0.7739808153477218,0.7501427234794505,0.3961799144744873,0.7501427234794505
28,1,AdaBoost (Discrete),0,0.65,0.8411270983213429,0.8411902927299384,56.20316934585571,0.8411902927299384
29,1,AdaBoost (Real),0,0.65,0.8387290167865707,0.8383283030760368,62.11695337295532,0.8383283030760368
30,1,Logistic Regression (Penalty = L2),0,0.65,0.8669064748201439,0.8663328895837922,0.29326748847961426,0.8663328895837922
31,1,Naive Bayes,0,0.65,0.8057553956834532,0.7783662741163043,0.06403160095214844,0.7783662741163043
32,1,KNeighbors Classifier,1,0.65,0.7965186074429772,0.7950837582756162,2.395392656326294,0.7950837582756162
33,1,SVC Classifier,1,0.65,0.8379351740696278,0.8273528112558247,3.8275437355041504,0.8273528112558247
34,1,Decision Tree,1,0.65,0.7316926770708283,0.7312379574140955,0.14805817604064941,0.7312379574140955
35,1,RandomForest,1,0.65,0.7671068427370948,0.7478956116745393,0.3992781639099121,0.7478956116745393
36,1,AdaBoost (Discrete),1,0.65,0.8163265306122449,0.8163340197994551,56.984023571014404,0.8163340197994551
37,1,AdaBoost (Real),1,0.65,0.8211284513805522,0.8203363291824114,63.353832483291626,0.8203363291824114
38,1,Logistic Regression (Penalty = L2),1,0.65,0.8457382953181273,0.8451779382678695,0.3448452949523926,0.8451779382678695
39,1,Naive Bayes,1,0.65,0.7971188475390156,0.7686081760982816,0.0855717658996582,0.7686081760982816
40,1,KNeighbors Classifier,2,0.65,0.8133253301320528,0.8114395810167826,2.3110451698303223,0.8114395810167826
41,1,SVC Classifier,2,0.65,0.8433373349339736,0.8290438127093458,3.806682586669922,0.8290438127093458
42,1,Decision Tree,2,0.65,0.7250900360144058,0.7249190102799159,0.14733099937438965,0.7249190102799159
43,1,RandomForest,2,0.65,0.7941176470588235,0.768247116761134,0.43052172660827637,0.768247116761134
44,1,AdaBoost (Discrete),2,0.65,0.8433373349339736,0.8433640904160093,57.27116942405701,0.8433640904160093
45,1,AdaBoost (Real),2,0.65,0.843937575030012,0.8437229997267417,78.99051976203918,0.8437229997267417
46,1,Logistic Regression (Penalty = L2),2,0.65,0.868547418967587,0.8672912879736738,0.4823496341705322,0.8672912879736738
47,1,Naive Bayes,2,0.65,0.8133253301320528,0.7839228137859221,0.091888427734375,0.7839228137859221
48,2,KNeighbors Classifier,0,0.65,0.8003597122302158,0.7994323718747443,3.652468681335449,0.7994323718747443
49,2,SVC Classifier,0,0.65,0.8321342925659473,0.8185641972503362,5.480654001235962,0.8185641972503362
50,2,Decision Tree,0,0.65,0.7290167865707434,0.7283730996467183,0.1652369499206543,0.7283730996467183
51,2,RandomForest,0,0.65,0.7931654676258992,0.7851006476544737,0.5925774574279785,0.7851006476544737
52,2,AdaBoost (Discrete),0,0.65,0.8243405275779376,0.8241071904563773,79.85027885437012,0.8241071904563773
53,2,AdaBoost (Real),0,0.65,0.8231414868105515,0.8229147347349299,90.6805408000946,0.8229147347349299
54,2,Logistic Regression (Penalty = L2),0,0.65,0.854916067146283,0.8542863206747142,0.5372235774993896,0.8542863206747142
55,2,Naive Bayes,0,0.65,0.8003597122302158,0.773513420802724,0.04955029487609863,0.773513420802724
56,2,KNeighbors Classifier,1,0.65,0.7917166866746699,0.7903202564590232,3.7442500591278076,0.7903202564590232
57,2,SVC Classifier,1,0.65,0.8253301320528211,0.8158283721274091,5.684465408325195,0.8158283721274091
58,2,Decision Tree,1,0.65,0.7220888355342137,0.7211814973555065,0.1646108627319336,0.7211814973555065
59,2,RandomForest,1,0.65,0.7551020408163265,0.7353256870492311,0.6305158138275146,0.7353256870492311
60,2,AdaBoost (Discrete),1,0.65,0.7971188475390156,0.7970560886363073,80.01244235038757,0.7970560886363073
61,2,AdaBoost (Real),1,0.65,0.8127250900360145,0.8123437416281678,83.87738418579102,0.8123437416281678
62,2,Logistic Regression (Penalty = L2),1,0.65,0.8355342136854742,0.8352043440929967,0.49139881134033203,0.8352043440929967
63,2,Naive Bayes,1,0.65,0.7929171668667467,0.7682426406653105,0.1238393783569336,0.7682426406653105
64,2,KNeighbors Classifier,2,0.65,0.7989195678271308,0.7969682112216022,3.575624704360962,0.7969682112216022
65,2,SVC Classifier,2,0.65,0.8247298919567827,0.8070074338121187,5.4449546337127686,0.8070074338121187
66,2,Decision Tree,2,0.65,0.7376950780312125,0.7372525887445935,0.14612483978271484,0.7372525887445935
67,2,RandomForest,2,0.65,0.7725090036014406,0.762538353608304,0.5715885162353516,0.762538353608304
68,2,AdaBoost (Discrete),2,0.65,0.8349339735894358,0.8348930281927356,81.72051477432251,0.8348930281927356
69,2,AdaBoost (Real),2,0.65,0.8385354141656662,0.8385225130827826,87.9072618484497,0.8385225130827826
70,2,Logistic Regression (Penalty = L2),2,0.65,0.8481392557022809,0.8464610254718501,0.37584924697875977,0.8464610254718501
71,2,Naive Bayes,2,0.65,0.8061224489795918,0.7764122611382105,0.09572315216064453,0.7764122611382105
72,3,KNeighbors Classifier,0,0.65,0.8117505995203836,0.8107746029707986,3.3989365100860596,0.8107746029707986
73,3,SVC Classifier,0,0.65,0.842326139088729,0.8342445791854426,5.385856866836548,0.8342445791854426
74,3,Decision Tree,0,0.65,0.750599520383693,0.7493842956668165,0.1625814437866211,0.7493842956668165
75,3,RandomForest,0,0.65,0.7583932853717026,0.7282991225922897,0.4801623821258545,0.7282991225922897
76,3,AdaBoost (Discrete),0,0.65,0.8333333333333334,0.8332483368368282,74.2206563949585,0.8332483368368282
77,3,AdaBoost (Real),0,0.65,0.829736211031175,0.8291742915840749,104.81146693229675,0.8291742915840749
78,3,Logistic Regression (Penalty = L2),0,0.65,0.8633093525179856,0.8624101530356026,0.46355652809143066,0.8624101530356026
79,3,Naive Bayes,0,0.65,0.8141486810551559,0.7947826820047428,0.13192510604858398,0.7947826820047428
80,3,KNeighbors Classifier,1,0.65,0.7959183673469388,0.7946217543972708,4.726785898208618,0.7946217543972708
81,3,SVC Classifier,1,0.65,0.8217286914765907,0.8115864637221847,6.75577449798584,0.8115864637221847
82,3,Decision Tree,1,0.65,0.7274909963985594,0.727063948642938,0.25097107887268066,0.727063948642938
83,3,RandomForest,1,0.65,0.7527010804321729,0.7340731396681507,0.635714054107666,0.7340731396681507
84,3,AdaBoost (Discrete),1,0.65,0.8109243697478992,0.8106080161450511,102.11254382133484,0.8106080161450511
85,3,AdaBoost (Real),1,0.65,0.8181272509003601,0.8181825371515442,111.29105949401855,0.8181825371515442
86,3,Logistic Regression (Penalty = L2),1,0.65,0.8337334933973589,0.8331514554530156,0.46460604667663574,0.8331514554530156
87,3,Naive Bayes,1,0.65,0.8037214885954381,0.7846051093986327,0.12244510650634766,0.7846051093986327
88,3,KNeighbors Classifier,2,0.65,0.7977190876350541,0.7961061454452042,4.488645076751709,0.7961061454452042
89,3,SVC Classifier,2,0.65,0.8319327731092437,0.8196449311844534,6.987428665161133,0.8196449311844534
90,3,Decision Tree,2,0.65,0.7460984393757503,0.7447998917312932,0.2551259994506836,0.7447998917312932
91,3,RandomForest,2,0.65,0.7665066026410564,0.7501033304062547,0.753840446472168,0.7501033304062547
92,3,AdaBoost (Discrete),2,0.65,0.8307322929171669,0.8305914646348919,98.60615253448486,0.8305914646348919
93,3,AdaBoost (Real),2,0.65,0.8355342136854742,0.8353748457431336,112.89829206466675,0.8353748457431336
94,3,Logistic Regression (Penalty = L2),2,0.65,0.8547418967587035,0.8527825778225041,0.4914121627807617,0.8527825778225041
95,3,Naive Bayes,2,0.65,0.8175270108043218,0.7989924685404952,0.13617563247680664,0.7989924685404952
96,4,KNeighbors Classifier,0,0.65,0.8057553956834532,0.8050521003972478,3.594291925430298,0.8050521003972478
97,4,SVC Classifier,0,0.65,0.8369304556354916,0.8219018124951192,6.627005100250244,0.8219018124951192
98,4,Decision Tree,0,0.65,0.750599520383693,0.749172005486713,0.25386667251586914,0.749172005486713
99,4,RandomForest,0,0.65,0.7799760191846523,0.7674825732276489,0.7084853649139404,0.7674825732276489
100,4,AdaBoost (Discrete),0,0.65,0.8393285371702638,0.8393941441344,95.44066429138184,0.8393941441344
101,4,AdaBoost (Real),0,0.65,0.829136690647482,0.8289822470717886,105.64644646644592,0.8289822470717886
102,4,Logistic Regression (Penalty = L2),0,0.65,0.8651079136690647,0.8644330224098145,0.46430373191833496,0.8644330224098145
103,4,Naive Bayes,0,0.65,0.8069544364508393,0.7789346493701397,0.10996770858764648,0.7789346493701397
104,4,KNeighbors Classifier,1,0.65,0.8109243697478992,0.8102388772689647,3.6749227046966553,0.8102388772689647
105,4,SVC Classifier,1,0.65,0.8313325330132053,0.820482004744897,6.512575626373291,0.820482004744897
106,4,Decision Tree,1,0.65,0.7545018007202882,0.7539529154067033,0.25580716133117676,0.7539529154067033
107,4,RandomForest,1,0.65,0.7551020408163265,0.7388031993643557,0.7065339088439941,0.7388031993643557
108,4,AdaBoost (Discrete),1,0.65,0.8199279711884754,0.8198850473065682,95.50761604309082,0.8198850473065682
109,4,AdaBoost (Real),1,0.65,0.8229291716686674,0.8226923091655427,101.1400556564331,0.8226923091655427
110,4,Logistic Regression (Penalty = L2),1,0.65,0.84093637454982,0.8405879638981489,0.4564187526702881,0.8405879638981489
111,4,Naive Bayes,1,0.65,0.7959183673469388,0.7679542662232233,0.1238102912902832,0.7679542662232233
112,4,KNeighbors Classifier,2,0.65,0.8043217286914766,0.8025892191888992,3.660653829574585,0.8025892191888992
113,4,SVC Classifier,2,0.65,0.8367346938775511,0.820743119423851,6.597728252410889,0.820743119423851
114,4,Decision Tree,2,0.65,0.7575030012004802,0.7564693955991966,0.25496578216552734,0.7564693955991966
115,4,RandomForest,2,0.65,0.7671068427370948,0.7627648741459752,0.70218825340271,0.7627648741459752
116,4,AdaBoost (Discrete),2,0.65,0.8385354141656662,0.838363784519792,95.42653226852417,0.838363784519792
117,4,AdaBoost (Real),2,0.65,0.8361344537815126,0.8358440257905032,111.0161943435669,0.8358440257905032
118,4,Logistic Regression (Penalty = L2),2,0.65,0.8619447779111644,0.8605612786412383,0.5446102619171143,0.8605612786412383
119,4,Naive Bayes,2,0.65,0.8127250900360145,0.7837706677549495,0.15068888664245605,0.7837706677549495
120,5,KNeighbors Classifier,0,0.65,0.815947242206235,0.8155053123302547,3.560072422027588,0.8155053123302547
121,5,SVC Classifier,0,0.65,0.8363309352517986,0.8222320064889341,7.431947231292725,0.8222320064889341
122,5,Decision Tree,0,0.65,0.7565947242206235,0.756090897671703,0.24032258987426758,0.756090897671703
123,5,RandomForest,0,0.65,0.802158273381295,0.797882916542619,0.8792085647583008,0.797882916542619
124,5,AdaBoost (Discrete),0,0.65,0.8249400479616307,0.8249562207185247,112.9476408958435,0.8249562207185247
125,5,AdaBoost (Real),0,0.65,0.8201438848920863,0.8195077653278999,125.33202195167542,0.8195077653278999
126,5,Logistic Regression (Penalty = L2),0,0.65,0.8573141486810552,0.8566461603692539,0.5227832794189453,0.8566461603692539
127,5,Naive Bayes,0,0.65,0.802757793764988,0.7773771604177981,0.15046906471252441,0.7773771604177981
128,5,KNeighbors Classifier,1,0.65,0.7935174069627852,0.7930194128375748,3.55043888092041,0.7930194128375748
129,5,SVC Classifier,1,0.65,0.8241296518607443,0.8143888196259146,7.664504766464233,0.8143888196259146
130,5,Decision Tree,1,0.65,0.7298919567827131,0.7298834829214569,0.23879027366638184,0.7298834829214569
131,5,RandomForest,1,0.65,0.7809123649459784,0.7739882926983681,0.8960995674133301,0.7739882926983681
132,5,AdaBoost (Discrete),1,0.65,0.7989195678271308,0.798674458542965,109.91368675231934,0.798674458542965
133,5,AdaBoost (Real),1,0.65,0.8139255702280912,0.8137903145584368,124.19428873062134,0.8137903145584368
134,5,Logistic Regression (Penalty = L2),1,0.65,0.8385354141656662,0.838222623824358,0.6466398239135742,0.838222623824358
135,5,Naive Bayes,1,0.65,0.7929171668667467,0.7686086835904089,0.147291898727417,0.7686086835904089
136,5,KNeighbors Classifier,2,0.65,0.8043217286914766,0.802651593846293,3.7318480014801025,0.802651593846293
137,5,SVC Classifier,2,0.65,0.8283313325330132,0.8121062999419665,7.760618686676025,0.8121062999419665
138,5,Decision Tree,2,0.65,0.751500600240096,0.7509544596352036,0.30689191818237305,0.7509544596352036
139,5,RandomForest,2,0.65,0.776110444177671,0.7711865750082499,0.7683413028717041,0.7711865750082499
140,5,AdaBoost (Discrete),2,0.65,0.82953181272509,0.8295205900133008,106.56977462768555,0.8295205900133008
141,5,AdaBoost (Real),2,0.65,0.8319327731092437,0.8309251349131885,122.7174756526947,0.8309251349131885
142,5,Logistic Regression (Penalty = L2),2,0.65,0.8469387755102041,0.8450070950373452,0.509545087814331,0.8450070950373452
143,5,Naive Bayes,2,0.65,0.804921968787515,0.775021762862755,0.17941784858703613,0.775021762862755
144,6,KNeighbors Classifier,0,0.65,0.8165467625899281,0.8154528585035423,4.268837213516235,0.8154528585035423
145,6,SVC Classifier,0,0.65,0.8405275779376499,0.8322001042153511,8.185582637786865,0.8322001042153511
146,6,Decision Tree,0,0.65,0.7607913669064749,0.760286900925417,0.241499662399292,0.760286900925417
147,6,RandomForest,0,0.65,0.7679856115107914,0.763302328727009,0.8915884494781494,0.763302328727009
148,6,AdaBoost (Discrete),0,0.65,0.8399280575539568,0.8397426333015334,111.82656645774841,0.8397426333015334
149,6,AdaBoost (Real),0,0.65,0.8255395683453237,0.8255109623030853,122.14629983901978,0.8255109623030853
150,6,Logistic Regression (Penalty = L2),0,0.65,0.8621103117505995,0.8613657063825101,0.5206384658813477,0.8613657063825101
151,6,Naive Bayes,0,0.65,0.8165467625899281,0.799004985901263,0.13955211639404297,0.799004985901263
152,6,KNeighbors Classifier,1,0.65,0.7983193277310925,0.7970602255134405,3.6334309577941895,0.7970602255134405
153,6,SVC Classifier,1,0.65,0.8217286914765907,0.8119795752998662,7.674180030822754,0.8119795752998662
154,6,Decision Tree,1,0.65,0.737094837935174,0.7370912347590333,0.30318355560302734,0.7370912347590333
155,6,RandomForest,1,0.65,0.7593037214885955,0.7534589500440141,0.8397719860076904,0.7534589500440141
156,6,AdaBoost (Discrete),1,0.65,0.8127250900360145,0.8126890888597964,106.20377445220947,0.8126890888597964
157,6,AdaBoost (Real),1,0.65,0.8181272509003601,0.8181245792113161,120.32930397987366,0.8181245792113161
158,6,Logistic Regression (Penalty = L2),1,0.65,0.8373349339735895,0.8367572756281119,0.5306406021118164,0.8367572756281119
159,6,Naive Bayes,1,0.65,0.8031212484993998,0.7851912931287849,0.08143019676208496,0.7851912931287849
160,6,KNeighbors Classifier,2,0.65,0.8043217286914766,0.8017253308546705,3.6934993267059326,0.8017253308546705
161,6,SVC Classifier,2,0.65,0.8307322929171669,0.8178623047201313,7.704602003097534,0.8178623047201313
162,6,Decision Tree,2,0.65,0.7280912364945978,0.7272246215017814,0.3027920722961426,0.7272246215017814
163,6,RandomForest,2,0.65,0.7304921968787516,0.718822845924645,0.8352787494659424,0.718822845924645
164,6,AdaBoost (Discrete),2,0.65,0.8331332533013205,0.8324582969282966,105.65119814872742,0.8324582969282966
165,6,AdaBoost (Real),2,0.65,0.8367346938775511,0.8364376373868645,120.50049614906311,0.8364376373868645
166,6,Logistic Regression (Penalty = L2),2,0.65,0.8517406962785115,0.8498170555745181,0.5215864181518555,0.8498170555745181
167,6,Naive Bayes,2,0.65,0.8199279711884754,0.8011223138334409,0.13449621200561523,0.8011223138334409
168,7,KNeighbors Classifier,0,0.65,0.815947242206235,0.8155053123302547,3.591827154159546,0.8155053123302547
169,7,SVC Classifier,0,0.65,0.8363309352517986,0.8222320064889341,7.185610294342041,0.8222320064889341
170,7,Decision Tree,0,0.65,0.749400479616307,0.7473607442186734,0.3041191101074219,0.7473607442186734
171,7,RandomForest,0,0.65,0.802158273381295,0.797882916542619,0.8395819664001465,0.797882916542619
172,7,AdaBoost (Discrete),0,0.65,0.8249400479616307,0.8249562207185247,106.69274353981018,0.8249562207185247
173,7,AdaBoost (Real),0,0.65,0.8243405275779376,0.8235853988408733,120.06465792655945,0.8235853988408733
174,7,Logistic Regression (Penalty = L2),0,0.65,0.8573141486810552,0.8566461603692539,0.4604830741882324,0.8566461603692539
175,7,Naive Bayes,0,0.65,0.802757793764988,0.7773771604177981,0.06629419326782227,0.7773771604177981
176,7,KNeighbors Classifier,1,0.65,0.7935174069627852,0.7930194128375748,3.465859889984131,0.7930194128375748
177,7,SVC Classifier,1,0.65,0.8241296518607443,0.8143888196259146,7.593189716339111,0.8143888196259146
178,7,Decision Tree,1,0.65,0.7593037214885955,0.7590279704107273,0.30252528190612793,0.7590279704107273
179,7,RandomForest,1,0.65,0.7809123649459784,0.7739882926983681,0.8513751029968262,0.7739882926983681
180,7,AdaBoost (Discrete),1,0.65,0.7989195678271308,0.798674458542965,106.73399066925049,0.798674458542965
181,7,AdaBoost (Real),1,0.65,0.8001200480192077,0.7984795125973541,120.74162578582764,0.7984795125973541
182,7,Logistic Regression (Penalty = L2),1,0.65,0.8385354141656662,0.838222623824358,0.520021915435791,0.838222623824358
183,7,Naive Bayes,1,0.65,0.7929171668667467,0.7686086835904089,0.09035491943359375,0.7686086835904089
184,7,KNeighbors Classifier,2,0.65,0.8043217286914766,0.802651593846293,3.6601474285125732,0.802651593846293
185,7,SVC Classifier,2,0.65,0.8283313325330132,0.8121062999419665,7.870161056518555,0.8121062999419665
186,7,Decision Tree,2,0.65,0.7424969987995198,0.7415025998462375,0.2290489673614502,0.7415025998462375
187,7,RandomForest,2,0.65,0.776110444177671,0.7711865750082499,0.7731709480285645,0.7711865750082499
188,7,AdaBoost (Discrete),2,0.65,0.82953181272509,0.8295205900133008,107.59618926048279,0.8295205900133008
189,7,AdaBoost (Real),2,0.65,0.8385354141656662,0.8367373001780922,120.86933493614197,0.8367373001780922
190,7,Logistic Regression (Penalty = L2),2,0.65,0.8469387755102041,0.8450070950373452,0.5659735202789307,0.8450070950373452
191,7,Naive Bayes,2,0.65,0.804921968787515,0.775021762862755,0.13494253158569336,0.775021762862755
192,8,KNeighbors Classifier,0,0.65,0.8045563549160671,0.8031464128285826,3.08133864402771,0.8031464128285826
193,8,SVC Classifier,0,0.65,0.842925659472422,0.834239205306501,7.417421817779541,0.834239205306501
194,8,Decision Tree,0,0.65,0.75,0.7499315903211917,0.24089741706848145,0.7499315903211917
195,8,RandomForest,0,0.65,0.7643884892086331,0.7517204890249471,0.7101602554321289,0.7517204890249471
196,8,AdaBoost (Discrete),0,0.65,0.8369304556354916,0.8367005083022129,100.59954953193665,0.8367005083022129
197,8,AdaBoost (Real),0,0.65,0.829736211031175,0.8294301468422375,115.94611358642578,0.8294301468422375
198,8,Logistic Regression (Penalty = L2),0,0.65,0.8573141486810552,0.856616844127004,0.5366547107696533,0.856616844127004
199,8,Naive Bayes,0,0.65,0.815947242206235,0.7987517643655068,0.14719772338867188,0.7987517643655068
200,8,KNeighbors Classifier,1,0.65,0.7911164465786314,0.7898775999661231,3.161695718765259,0.7898775999661231
201,8,SVC Classifier,1,0.65,0.8235294117647058,0.8152924407707082,7.567122220993042,0.8152924407707082
202,8,Decision Tree,1,0.65,0.7358943577430972,0.735771292172499,0.22897815704345703,0.735771292172499
203,8,RandomForest,1,0.65,0.7490996398559424,0.7424728085926805,0.9134531021118164,0.7424728085926805
204,8,AdaBoost (Discrete),1,0.65,0.8067226890756303,0.8067477867896716,100.27751016616821,0.8067477867896716
205,8,AdaBoost (Real),1,0.65,0.8187274909963985,0.8187854721797331,115.42719101905823,0.8187854721797331
206,8,Logistic Regression (Penalty = L2),1,0.65,0.8307322929171669,0.8304080278616509,0.5465304851531982,0.8304080278616509
207,8,Naive Bayes,1,0.65,0.7959183673469388,0.7773403018679744,0.07353806495666504,0.7773403018679744
208,8,KNeighbors Classifier,2,0.65,0.7971188475390156,0.7951124343973426,3.094324827194214,0.7951124343973426
209,8,SVC Classifier,2,0.65,0.8361344537815126,0.8228750500635131,7.542611598968506,0.8228750500635131
210,8,Decision Tree,2,0.65,0.7328931572629052,0.7318953385966093,0.23035001754760742,0.7318953385966093
211,8,RandomForest,2,0.65,0.7755102040816326,0.7645867409771286,0.7570295333862305,0.7645867409771286
212,8,AdaBoost (Discrete),2,0.65,0.8229291716686674,0.8228180762574769,101.17177367210388,0.8228180762574769
213,8,AdaBoost (Real),2,0.65,0.8301320528211285,0.8299981848154275,113.04333567619324,0.8299981848154275
214,8,Logistic Regression (Penalty = L2),2,0.65,0.8481392557022809,0.8464993049027126,0.49851083755493164,0.8464993049027126
215,8,Naive Bayes,2,0.65,0.8241296518607443,0.80564000639322,0.0712888240814209,0.80564000639322
216,9,KNeighbors Classifier,0,0.65,0.7973621103117506,0.7966176022275122,3.286390542984009,0.7966176022275122
217,9,SVC Classifier,0,0.65,0.8315347721822542,0.8231252934246814,6.955299377441406,0.8231252934246814
218,9,Decision Tree,0,0.65,0.7470023980815348,0.7464386727331644,0.27877020835876465,0.7464386727331644
219,9,RandomForest,0,0.65,0.7757793764988009,0.7704720244728341,0.7999250888824463,0.7704720244728341
220,9,AdaBoost (Discrete),0,0.65,0.8183453237410072,0.8179614859925195,95.69056391716003,0.8179614859925195
221,9,AdaBoost (Real),0,0.65,0.8093525179856115,0.8073945267411573,109.91280198097229,0.8073945267411573
222,9,Logistic Regression (Penalty = L2),0,0.65,0.8537170263788969,0.85344395649306,0.41952943801879883,0.85344395649306
223,9,Naive Bayes,0,0.65,0.8177458033573142,0.8034518674359763,0.07477688789367676,0.8034518674359763
224,9,KNeighbors Classifier,1,0.65,0.7857142857142857,0.784992384776588,3.2561562061309814,0.784992384776588
225,9,SVC Classifier,1,0.65,0.8157262905162065,0.8084109245905094,7.182843923568726,0.8084109245905094
226,9,Decision Tree,1,0.65,0.7190876350540216,0.7183813934724622,0.28610897064208984,0.7183813934724622
227,9,RandomForest,1,0.65,0.7581032412965186,0.7512924057650889,0.8736557960510254,0.7512924057650889
228,9,AdaBoost (Discrete),1,0.65,0.7995198079231692,0.7988305603607117,97.17467856407166,0.7988305603607117
229,9,AdaBoost (Real),1,0.65,0.8043217286914766,0.8043164580918439,109.92183899879456,0.8043164580918439
230,9,Logistic Regression (Penalty = L2),1,0.65,0.8325330132052821,0.8320099371565975,0.5325238704681396,0.8320099371565975
231,9,Naive Bayes,1,0.65,0.7971188475390156,0.7824326447587024,0.1468966007232666,0.7824326447587024
232,9,KNeighbors Classifier,2,0.65,0.7869147659063626,0.7860213048742832,3.038766622543335,0.7860213048742832
233,9,SVC Classifier,2,0.65,0.8289315726290516,0.8165520546885041,7.343700885772705,0.8165520546885041
234,9,Decision Tree,2,0.65,0.7316926770708283,0.7302128628765309,0.26669788360595703,0.7302128628765309
235,9,RandomForest,2,0.65,0.776110444177671,0.7692551850889431,0.7222537994384766,0.7692551850889431
236,9,AdaBoost (Discrete),2,0.65,0.826530612244898,0.8260270096227373,92.68560028076172,0.8260270096227373
237,9,AdaBoost (Real),2,0.65,0.8145258103241296,0.8140804562521725,96.96825098991394,0.8140804562521725
238,9,Logistic Regression (Penalty = L2),2,0.65,0.8451380552220888,0.8431835244229304,0.40262842178344727,0.8431835244229304
239,9,Naive Bayes,2,0.65,0.8181272509003601,0.8009387546547875,0.10658788681030273,0.8009387546547875
240,10,KNeighbors Classifier,0,0.65,0.814748201438849,0.8144549977892602,4.61304235458374,0.8144549977892602
241,10,SVC Classifier,0,0.65,0.8369304556354916,0.8235703870657464,7.363688707351685,0.8235703870657464
242,10,Decision Tree,0,0.65,0.7206235011990407,0.7200003564232296,0.20502972602844238,0.7200003564232296
243,10,RandomForest,0,0.65,0.7553956834532374,0.7299745650736819,0.6933674812316895,0.7299745650736819
244,10,AdaBoost (Discrete),0,0.65,0.8447242206235012,0.8447839465483659,104.30062818527222,0.8447839465483659
245,10,AdaBoost (Real),0,0.65,0.830335731414868,0.8301408615262417,116.3840217590332,0.8301408615262417
246,10,Logistic Regression (Penalty = L2),0,0.65,0.8657074340527577,0.8649965858805271,0.49579358100891113,0.8649965858805271
247,10,Naive Bayes,0,0.65,0.8057553956834532,0.7762139436063658,0.11436796188354492,0.7762139436063658
248,10,KNeighbors Classifier,1,0.65,0.7929171668667467,0.7919668838341808,4.533506155014038,0.7919668838341808
249,10,SVC Classifier,1,0.65,0.8277310924369747,0.8164984117633962,6.664509296417236,0.8164984117633962
250,10,Decision Tree,1,0.65,0.723889555822329,0.7236566458710333,0.18070530891418457,0.7236566458710333
251,10,RandomForest,1,0.65,0.7503001200480192,0.7419531042372038,0.6568562984466553,0.7419531042372038
252,10,AdaBoost (Discrete),1,0.65,0.8223289315726291,0.8223317224700207,101.08282375335693,0.8223317224700207
253,10,AdaBoost (Real),1,0.65,0.8229291716686674,0.8222464006471975,110.93706583976746,0.8222464006471975
254,10,Logistic Regression (Penalty = L2),1,0.65,0.8457382953181273,0.8453742161246034,0.46927356719970703,0.8453742161246034
255,10,Naive Bayes,1,0.65,0.8013205282112845,0.7728832432667904,0.19383835792541504,0.7728832432667904
256,10,KNeighbors Classifier,2,0.65,0.8103241296518607,0.8091435857507504,4.507033348083496,0.8091435857507504
257,10,SVC Classifier,2,0.65,0.8379351740696278,0.8234326145637876,6.444794654846191,0.8234326145637876
258,10,Decision Tree,2,0.65,0.7286914765906363,0.7273901023907738,0.23946642875671387,0.7273901023907738
259,10,RandomForest,2,0.65,0.7695078031212484,0.756773862195075,0.6494872570037842,0.756773862195075
260,10,AdaBoost (Discrete),2,0.65,0.8445378151260504,0.8442128060593452,98.3527762889862,0.8442128060593452
261,10,AdaBoost (Real),2,0.65,0.8475390156062425,0.8471746421871387,109.64113020896912,0.8471746421871387
262,10,Logistic Regression (Penalty = L2),2,0.65,0.8625450180072028,0.8614073704535088,0.4802713394165039,0.8614073704535088
263,10,Naive Bayes,2,0.65,0.8139255702280912,0.7854717653066186,0.11229562759399414,0.7854717653066186
264,11,KNeighbors Classifier,0,0.65,0.8033573141486811,0.8026953908000857,6.283970594406128,0.8026953908000857
265,11,SVC Classifier,0,0.65,0.842925659472422,0.8298989639419723,7.403115749359131,0.8298989639419723
266,11,Decision Tree,0,0.65,0.7410071942446043,0.7390723802015159,0.24183034896850586,0.7390723802015159
267,11,RandomForest,0,0.65,0.7733812949640287,0.7503533106315763,0.7187957763671875,0.7503533106315763
268,11,AdaBoost (Discrete),0,0.65,0.8405275779376499,0.8405061018073431,111.1622359752655,0.8405061018073431
269,11,AdaBoost (Real),0,0.65,0.8375299760191847,0.8370357390254785,123.19741868972778,0.8370357390254785
270,11,Logistic Regression (Penalty = L2),0,0.65,0.8687050359712231,0.8680884728645939,0.5299544334411621,0.8680884728645939
271,11,Naive Bayes,0,0.65,0.8087529976019184,0.7794878618012043,0.16553807258605957,0.7794878618012043
272,11,KNeighbors Classifier,1,0.65,0.7959183673469388,0.7941171501603053,5.855776786804199,0.7941171501603053
273,11,SVC Classifier,1,0.65,0.8367346938775511,0.8255196294727928,6.847860336303711,0.8255196294727928
274,11,Decision Tree,1,0.65,0.7316926770708283,0.7316465551777472,0.22899818420410156,0.7316465551777472
275,11,RandomForest,1,0.65,0.737094837935174,0.7140936113380211,0.6769218444824219,0.7140936113380211
276,11,AdaBoost (Discrete),1,0.65,0.8307322929171669,0.8307847603404932,104.24559831619263,0.8307847603404932
277,11,AdaBoost (Real),1,0.65,0.8247298919567827,0.8243721629508087,115.82537794113159,0.8243721629508087
278,11,Logistic Regression (Penalty = L2),1,0.65,0.8565426170468188,0.8559151009520511,0.4664433002471924,0.8559151009520511
279,11,Naive Bayes,1,0.65,0.8055222088835534,0.7784330891606969,0.14954209327697754,0.7784330891606969
280,11,KNeighbors Classifier,2,0.65,0.8205282112845138,0.8187690765467162,5.761639356613159,0.8187690765467162
281,11,SVC Classifier,2,0.65,0.84093637454982,0.8272885875987654,6.776014089584351,0.8272885875987654
282,11,Decision Tree,2,0.65,0.741296518607443,0.739729044880818,0.22513222694396973,0.739729044880818
283,11,RandomForest,2,0.65,0.7755102040816326,0.7463219601465727,0.6743044853210449,0.7463219601465727
284,11,AdaBoost (Discrete),2,0.65,0.8541416566626651,0.8539380748151565,104.92459797859192,0.8539380748151565
285,11,AdaBoost (Real),2,0.65,0.8535414165666266,0.8533052073798222,115.3523223400116,0.8533052073798222
286,11,Logistic Regression (Penalty = L2),2,0.65,0.8649459783913566,0.8635637323459228,0.4848215579986572,0.8635637323459228
287,11,Naive Bayes,2,0.65,0.8181272509003601,0.7912698251455264,0.1151726245880127,0.7912698251455264
288,12,KNeighbors Classifier,0,0.65,0.7925659472422062,0.792085071468657,2.0709681510925293,0.792085071468657
289,12,SVC Classifier,0,0.65,0.8363309352517986,0.827707107747931,5.450709819793701,0.827707107747931
290,12,Decision Tree,0,0.65,0.7458033573141487,0.7449482347630668,0.22244739532470703,0.7449482347630668
291,12,RandomForest,0,0.65,0.7697841726618705,0.7633702633068791,0.6094744205474854,0.7633702633068791
292,12,AdaBoost (Discrete),0,0.65,0.8111510791366906,0.8110115437023129,73.33181595802307,0.8110115437023129
293,12,AdaBoost (Real),0,0.65,0.815947242206235,0.8150216483192986,89.15323495864868,0.8150216483192986
294,12,Logistic Regression (Penalty = L2),0,0.65,0.8525179856115108,0.8522124056569563,0.3365285396575928,0.8522124056569563
295,12,Naive Bayes,0,0.65,0.8171462829736211,0.803492027312121,0.05522418022155762,0.803492027312121
296,12,KNeighbors Classifier,1,0.65,0.7959183673469388,0.7951237416808468,2.1338818073272705,0.7951237416808468
297,12,SVC Classifier,1,0.65,0.8205282112845138,0.8134073494129394,5.760537624359131,0.8134073494129394
298,12,Decision Tree,1,0.65,0.748499399759904,0.7483247569489203,0.20871496200561523,0.7483247569489203
299,12,RandomForest,1,0.65,0.7539015606242497,0.7447591377110598,0.6359436511993408,0.7447591377110598
300,12,AdaBoost (Discrete),1,0.65,0.7959183673469388,0.7954415074051794,72.48308253288269,0.7954415074051794
301,12,AdaBoost (Real),1,0.65,0.8031212484993998,0.8019792862588964,81.02434372901917,0.8019792862588964
302,12,Logistic Regression (Penalty = L2),1,0.65,0.8331332533013205,0.8326550231332358,0.33678483963012695,0.8326550231332358
303,12,Naive Bayes,1,0.65,0.8013205282112845,0.7866738923575767,0.10476493835449219,0.7866738923575767
304,12,KNeighbors Classifier,2,0.65,0.7941176470588235,0.7929243031978621,1.8640594482421875,0.7929243031978621
305,12,SVC Classifier,2,0.65,0.8355342136854742,0.823244875979337,5.534307956695557,0.823244875979337
306,12,Decision Tree,2,0.65,0.762905162064826,0.7627607584341414,0.17174792289733887,0.7627607584341414
307,12,RandomForest,2,0.65,0.7418967587034814,0.7323265777651544,0.6133592128753662,0.7323265777651544
308,12,AdaBoost (Discrete),2,0.65,0.8289315726290516,0.8286783321463647,72.27261137962341,0.8286783321463647
309,12,AdaBoost (Real),2,0.65,0.8211284513805522,0.8204021376150079,78.4761815071106,0.8204021376150079
310,12,Logistic Regression (Penalty = L2),2,0.65,0.843937575030012,0.8418650179334566,0.3476541042327881,0.8418650179334566
311,12,Naive Bayes,2,0.65,0.8199279711884754,0.8030579884451345,0.06564903259277344,0.8030579884451345
