,feat_set_id,classifier,fold_id,feat_th,score,geo_score,exec_t,geo_score_woz
0,0,KNeighbors Classifier,0,0.75,0.9830985915492958,0.9815582497756241,2.05411958694458,0.9815582497756241
1,0,SVC Classifier,0,0.75,0.9098591549295775,0.4530153324120529,1.7757353782653809,0.4530153324120529
2,0,Decision Tree,0,0.75,0.8788732394366198,0.6987742176944589,0.1293628215789795,0.6987742176944589
3,0,RandomForest,0,0.75,0.8887323943661972,0.3986314009794656,1.195770025253296,0.3986314009794656
4,0,AdaBoost (Discrete),0,0.75,0.9690140845070423,0.9669320305833838,92.00728058815002,0.9669320305833838
5,0,AdaBoost (Real),0,0.75,0.9591549295774648,0.965579676328274,109.41696500778198,0.965579676328274
6,0,Logistic Regression (Penalty = L2),0,0.75,0.9690140845070423,0.97267806264422,0.8538639545440674,0.97267806264422
7,0,Naive Bayes,0,0.75,0.971830985915493,0.976722909042524,0.14577436447143555,0.976722909042524
8,0,KNeighbors Classifier,1,0.75,0.9760225669957687,0.9527357661655405,1.944528579711914,0.9527357661655405
9,0,SVC Classifier,1,0.75,0.9760225669957687,0.9369604361556937,1.5691049098968506,0.9369604361556937
10,0,Decision Tree,1,0.75,0.9026798307475318,0.7175454293193649,0.10824155807495117,0.7175454293193649
11,0,RandomForest,1,0.75,0.8730606488011283,0.8268454930564446,0.8168995380401611,0.0
12,0,AdaBoost (Discrete),1,0.75,0.9703808180535967,0.9184735248681712,89.29860234260559,0.9184735248681712
13,0,AdaBoost (Real),1,0.75,0.9774330042313117,0.9610608883026263,93.38404273986816,0.9610608883026263
14,0,Logistic Regression (Penalty = L2),1,0.75,0.9732016925246827,0.9576354655560266,0.7611892223358154,0.9576354655560266
15,0,Naive Bayes,1,0.75,0.9393511988716502,0.9547734534479771,0.11025357246398926,0.9547734534479771
16,0,KNeighbors Classifier,2,0.75,0.9745403111739745,0.9570034261537267,1.7014336585998535,0.9570034261537267
17,0,SVC Classifier,2,0.75,0.9886845827439887,0.9720131594219096,1.3580641746520996,0.9720131594219096
18,0,Decision Tree,2,0.75,0.7369165487977369,0.799828905564219,0.10366129875183105,0.799828905564219
19,0,RandomForest,2,0.75,0.8642149929278642,0.6914618066866134,0.9369544982910156,0.6914618066866134
20,0,AdaBoost (Discrete),2,0.75,0.8302687411598303,0.8638078805492949,77.62035703659058,0.8638078805492949
21,0,AdaBoost (Real),2,0.75,0.8486562942008486,0.8960229849594961,106.29539775848389,0.8960229849594961
22,0,Logistic Regression (Penalty = L2),2,0.75,0.9674681753889675,0.9447138869025532,0.6308455467224121,0.9447138869025532
23,0,Naive Bayes,2,0.75,0.9052333804809052,0.9443610021588312,0.1182098388671875,0.9443610021588312
24,1,KNeighbors Classifier,0,0.75,0.9802816901408451,0.9775023353024564,1.6502845287322998,0.9775023353024564
25,1,SVC Classifier,0,0.75,0.9098591549295775,0.4530153324120529,1.434244155883789,0.4530153324120529
26,1,Decision Tree,0,0.75,0.923943661971831,0.942569431991186,0.11303997039794922,0.942569431991186
27,1,RandomForest,0,0.75,0.8859154929577465,0.4178054790383972,0.9998936653137207,0.4178054790383972
28,1,AdaBoost (Discrete),0,0.75,0.9464788732394366,0.9530990782435163,103.54264092445374,0.9530990782435163
29,1,AdaBoost (Real),0,0.75,0.9690140845070423,0.97267806264422,105.37349915504456,0.97267806264422
30,1,Logistic Regression (Penalty = L2),0,0.75,0.9647887323943662,0.9708565638824015,0.5940024852752686,0.9708565638824015
31,1,Naive Bayes,0,0.75,0.9732394366197183,0.9744927647293644,0.11425971984863281,0.9744927647293644
32,1,KNeighbors Classifier,1,0.75,0.9732016925246827,0.9422299202348479,1.7501740455627441,0.9422299202348479
33,1,SVC Classifier,1,0.75,0.9760225669957687,0.9369604361556937,1.5412547588348389,0.9369604361556937
34,1,Decision Tree,1,0.75,0.9280677009873061,0.838744145248999,0.11614370346069336,0.838744145248999
35,1,RandomForest,1,0.75,0.9055007052186178,0.7044163192369371,0.8132984638214111,0.7044163192369371
36,1,AdaBoost (Discrete),1,0.75,0.9703808180535967,0.9184735248681712,92.03653740882874,0.9184735248681712
37,1,AdaBoost (Real),1,0.75,0.9548660084626234,0.9458654772455307,109.19493818283081,0.9458654772455307
38,1,Logistic Regression (Penalty = L2),1,0.75,0.9760225669957687,0.9369604361556937,0.7146782875061035,0.9369604361556937
39,1,Naive Bayes,1,0.75,0.9633286318758815,0.9622958694218442,0.13418054580688477,0.9622958694218442
40,1,KNeighbors Classifier,2,0.75,0.9547383309759547,0.8990498537453402,2.3026785850524902,0.8990498537453402
41,1,SVC Classifier,2,0.75,0.983026874115983,0.9573941993397243,1.4162201881408691,0.9573941993397243
42,1,Decision Tree,2,0.75,0.5728429985855729,0.7029941642457406,0.13721585273742676,0.7029941642457406
43,1,RandomForest,2,0.75,0.9335219236209336,0.8054417300024905,1.1134569644927979,0.8054417300024905
44,1,AdaBoost (Discrete),2,0.75,0.9292786421499293,0.8511303953743646,109.4082612991333,0.8511303953743646
45,1,AdaBoost (Real),2,0.75,0.8528995756718529,0.9064427907503069,131.90181040763855,0.9064427907503069
46,1,Logistic Regression (Penalty = L2),2,0.75,0.9603960396039604,0.9255848435447886,0.6960868835449219,0.9255848435447886
47,1,Naive Bayes,2,0.75,0.9108910891089109,0.9441602245317585,0.15389275550842285,0.9441602245317585
48,2,KNeighbors Classifier,0,0.75,0.9845070422535211,0.9764095103624777,2.4348766803741455,0.9764095103624777
49,2,SVC Classifier,0,0.75,0.9098591549295775,0.4530153324120529,2.0745880603790283,0.4530153324120529
50,2,Decision Tree,0,0.75,0.9014084507042254,0.7828670417631229,0.16809296607971191,0.7828670417631229
51,2,RandomForest,0,0.75,0.8873239436619719,0.41975786944564386,1.5834715366363525,0.41975786944564386
52,2,AdaBoost (Discrete),0,0.75,0.9112676056338028,0.9043773205211264,99.03416728973389,0.9043773205211264
53,2,AdaBoost (Real),0,0.75,0.9394366197183098,0.9569853771494398,106.25716590881348,0.9569853771494398
54,2,Logistic Regression (Penalty = L2),0,0.75,0.9774647887323944,0.9734253551060988,0.7302970886230469,0.9734253551060988
55,2,Naive Bayes,0,0.75,0.9732394366197183,0.980138051895363,0.14156174659729004,0.980138051895363
56,2,KNeighbors Classifier,1,0.75,0.9520451339915373,0.9335532772064421,2.0893192291259766,0.9335532772064421
57,2,SVC Classifier,1,0.75,0.9760225669957687,0.9369604361556937,1.6647753715515137,0.9369604361556937
58,2,Decision Tree,1,0.75,0.9097320169252469,0.8586766598695887,0.13154077529907227,0.8586766598695887
59,2,RandomForest,1,0.75,0.9125528913963329,0.710520950715365,0.9529364109039307,0.710520950715365
60,2,AdaBoost (Discrete),1,0.75,0.9703808180535967,0.9184735248681712,92.08455753326416,0.9184735248681712
61,2,AdaBoost (Real),1,0.75,0.9534555712270804,0.9509437065512405,115.29715967178345,0.9509437065512405
62,2,Logistic Regression (Penalty = L2),1,0.75,0.9675599435825106,0.9552781994916064,0.589423656463623,0.9552781994916064
63,2,Naive Bayes,1,0.75,0.9351198871650211,0.9529159128544739,0.116943359375,0.9529159128544739
64,2,KNeighbors Classifier,2,0.75,0.983026874115983,0.9726399868315707,1.972961187362671,0.9726399868315707
65,2,SVC Classifier,2,0.75,0.9915134370579916,0.9791605716903751,1.274980068206787,0.9791605716903751
66,2,Decision Tree,2,0.75,0.7454031117397454,0.8208733494259144,0.1351618766784668,0.8208733494259144
67,2,RandomForest,2,0.75,0.8571428571428571,0.7491491772643939,1.2097837924957275,0.0
68,2,AdaBoost (Discrete),2,0.75,0.8203677510608204,0.8909737501275482,89.99665307998657,0.8909737501275482
69,2,AdaBoost (Real),2,0.75,0.8387553041018387,0.8997824267757184,101.84670805931091,0.8997824267757184
70,2,Logistic Regression (Penalty = L2),2,0.75,0.9547383309759547,0.9635105745348659,0.714630126953125,0.9635105745348659
71,2,Naive Bayes,2,0.75,0.8797736916548797,0.9352965786088715,0.12424063682556152,0.9352965786088715
72,3,KNeighbors Classifier,0,0.75,0.9816901408450704,0.9752180393676984,1.3926258087158203,0.9752180393676984
73,3,SVC Classifier,0,0.75,0.9098591549295775,0.4530153324120529,1.2435352802276611,0.4530153324120529
74,3,Decision Tree,0,0.75,0.8661971830985915,0.7608009408840077,0.1275486946105957,0.7608009408840077
75,3,RandomForest,0,0.75,0.8760563380281691,0.356209562137551,0.9109823703765869,0.356209562137551
76,3,AdaBoost (Discrete),0,0.75,0.9549295774647887,0.9608923225279017,85.78947854042053,0.9608923225279017
77,3,AdaBoost (Real),0,0.75,0.9605633802816902,0.9690282044444679,112.24453997612,0.9690282044444679
78,3,Logistic Regression (Penalty = L2),0,0.75,0.9845070422535211,0.9764095103624777,0.6730446815490723,0.9764095103624777
79,3,Naive Bayes,0,0.75,0.9732394366197183,0.9744927647293644,0.12929844856262207,0.9744927647293644
80,3,KNeighbors Classifier,1,0.75,0.9647390691114246,0.9356130056289456,1.4809606075286865,0.9356130056289456
81,3,SVC Classifier,1,0.75,0.9760225669957687,0.9369604361556937,1.6283550262451172,0.9369604361556937
82,3,Decision Tree,1,0.75,0.9492242595204513,0.8748748218667174,0.13689541816711426,0.8748748218667174
83,3,RandomForest,1,0.75,0.8829337094499294,0.6184947297952903,1.194551944732666,0.6184947297952903
84,3,AdaBoost (Discrete),1,0.75,0.9703808180535967,0.9184735248681712,94.94979190826416,0.9184735248681712
85,3,AdaBoost (Real),1,0.75,0.9605077574047954,0.9482390517577822,106.39956998825073,0.9482390517577822
86,3,Logistic Regression (Penalty = L2),1,0.75,0.9760225669957687,0.9369604361556937,0.5765962600708008,0.9369604361556937
87,3,Naive Bayes,1,0.75,0.9619181946403385,0.9645604104549219,0.25760626792907715,0.9645604104549219
88,3,KNeighbors Classifier,2,0.75,0.9434229137199435,0.912028117422387,1.7364141941070557,0.912028117422387
89,3,SVC Classifier,2,0.75,0.9886845827439887,0.9720131594219096,1.2842159271240234,0.9720131594219096
90,3,Decision Tree,2,0.75,0.9066478076379066,0.8655911797789055,0.13135981559753418,0.8655911797789055
91,3,RandomForest,2,0.75,0.9193776520509194,0.7782716676945421,1.0700511932373047,0.7782716676945421
92,3,AdaBoost (Discrete),2,0.75,0.8274398868458275,0.8943822521418789,96.49107575416565,0.8943822521418789
93,3,AdaBoost (Real),2,0.75,0.8062234794908062,0.8867153633170355,104.4255645275116,0.8867153633170355
94,3,Logistic Regression (Penalty = L2),2,0.75,0.9165487977369166,0.9075908432929622,0.733574628829956,0.9075908432929622
95,3,Naive Bayes,2,0.75,0.8826025459688827,0.9339467996552621,0.14231562614440918,0.9339467996552621
96,4,KNeighbors Classifier,0,0.75,0.9845070422535211,0.9764095103624777,2.107607126235962,0.9764095103624777
97,4,SVC Classifier,0,0.75,0.9098591549295775,0.4530153324120529,2.075853109359741,0.4530153324120529
98,4,Decision Tree,0,0.75,0.8690140845070422,0.7137439386596879,0.1764693260192871,0.7137439386596879
99,4,RandomForest,0,0.75,0.8746478873239436,0.22664209125586685,1.1672375202178955,0.22664209125586685
100,4,AdaBoost (Discrete),0,0.75,0.9394366197183098,0.9270461106486398,99.97635078430176,0.9270461106486398
101,4,AdaBoost (Real),0,0.75,0.956338028169014,0.9614997135382722,119.60307168960571,0.9614997135382722
102,4,Logistic Regression (Penalty = L2),0,0.75,0.9704225352112676,0.9704227902110237,0.7857141494750977,0.9704227902110237
103,4,Naive Bayes,0,0.75,0.9732394366197183,0.980138051895363,0.2580904960632324,0.980138051895363
104,4,KNeighbors Classifier,1,0.75,0.9520451339915373,0.9304150483439567,1.6855411529541016,0.9304150483439567
105,4,SVC Classifier,1,0.75,0.9760225669957687,0.9369604361556937,1.7010247707366943,0.9369604361556937
106,4,Decision Tree,1,0.75,0.9351198871650211,0.8213273477577075,0.2809939384460449,0.8213273477577075
107,4,RandomForest,1,0.75,0.842031029619182,0.35831736008171244,1.2966713905334473,0.35831736008171244
108,4,AdaBoost (Discrete),1,0.75,0.9703808180535967,0.9184735248681712,96.19998741149902,0.9184735248681712
109,4,AdaBoost (Real),1,0.75,0.8589562764456982,0.8981722157581387,112.74679684638977,0.8981722157581387
110,4,Logistic Regression (Penalty = L2),1,0.75,0.9703808180535967,0.9534492813263334,0.6003243923187256,0.9534492813263334
111,4,Naive Bayes,1,0.75,0.9294781382228491,0.950427870428027,0.28966307640075684,0.950427870428027
112,4,KNeighbors Classifier,2,0.75,0.9759547383309759,0.9666918128851806,1.6690096855163574,0.9666918128851806
113,4,SVC Classifier,2,0.75,0.9915134370579916,0.9791605716903751,1.4282863140106201,0.9791605716903751
114,4,Decision Tree,2,0.75,0.7694483734087695,0.8755926854210249,0.12294936180114746,0.8755926854210249
115,4,RandomForest,2,0.75,0.8741159830268741,0.8048654643962957,1.238152027130127,0.8048654643962957
116,4,AdaBoost (Discrete),2,0.75,0.7298444130127298,0.8520071918209703,93.0537691116333,0.8520071918209703
117,4,AdaBoost (Real),2,0.75,0.809052333804809,0.8881106691013059,100.58127975463867,0.8881106691013059
118,4,Logistic Regression (Penalty = L2),2,0.75,0.8953323903818954,0.9398331743728815,0.8551311492919922,0.9398331743728815
119,4,Naive Bayes,2,0.75,0.8684582743988685,0.929959534730525,0.33420467376708984,0.929959534730525
120,5,KNeighbors Classifier,0,0.75,0.9816901408450704,0.9752180393676984,2.4485135078430176,0.9752180393676984
121,5,SVC Classifier,0,0.75,0.9098591549295775,0.4530153324120529,1.735830307006836,0.4530153324120529
122,5,Decision Tree,0,0.75,0.852112676056338,0.7721893785024144,0.16028666496276855,0.7721893785024144
123,5,RandomForest,0,0.75,0.8830985915492958,0.364986704547735,1.6501765251159668,0.364986704547735
124,5,AdaBoost (Discrete),0,0.75,0.9732394366197183,0.9687293061514642,76.42991423606873,0.9687293061514642
125,5,AdaBoost (Real),0,0.75,0.9450704225352112,0.9594566221488691,104.0451648235321,0.9594566221488691
126,5,Logistic Regression (Penalty = L2),0,0.75,0.9830985915492958,0.9728972155841619,0.8142106533050537,0.9728972155841619
127,5,Naive Bayes,0,0.75,0.9746478873239437,0.9750961659762587,0.09785985946655273,0.9750961659762587
128,5,KNeighbors Classifier,1,0.75,0.9393511988716502,0.9282689001768677,1.7559716701507568,0.9282689001768677
129,5,SVC Classifier,1,0.75,0.9760225669957687,0.9369604361556937,1.5438966751098633,0.9369604361556937
130,5,Decision Tree,1,0.75,0.9139633286318759,0.8530910236723389,0.14433026313781738,0.8530910236723389
131,5,RandomForest,1,0.75,0.8645980253878702,0.5379246847717186,1.0828747749328613,0.5379246847717186
132,5,AdaBoost (Discrete),1,0.75,0.9703808180535967,0.9184735248681712,79.22493362426758,0.9184735248681712
133,5,AdaBoost (Real),1,0.75,0.9464033850493653,0.9365167246800383,81.30568313598633,0.9365167246800383
134,5,Logistic Regression (Penalty = L2),1,0.75,0.9760225669957687,0.9369604361556937,0.836890697479248,0.9369604361556937
135,5,Naive Bayes,1,0.75,0.9605077574047954,0.9610907387064838,0.12098026275634766,0.9610907387064838
136,5,KNeighbors Classifier,2,0.75,0.9434229137199435,0.952819706806064,1.370013952255249,0.952819706806064
137,5,SVC Classifier,2,0.75,0.9915134370579916,0.9791605716903751,1.044999599456787,0.9791605716903751
138,5,Decision Tree,2,0.75,0.8953323903818954,0.8855597406234559,0.11634516716003418,0.8855597406234559
139,5,RandomForest,2,0.75,0.9137199434229137,0.767224023641784,0.8270437717437744,0.767224023641784
140,5,AdaBoost (Discrete),2,0.75,0.7892503536067893,0.8858430291074705,67.1928858757019,0.8858430291074705
141,5,AdaBoost (Real),2,0.75,0.8104667609618105,0.8940116773109178,81.30113530158997,0.8940116773109178
142,5,Logistic Regression (Penalty = L2),2,0.75,0.8896746817538896,0.93175482786383,0.5649960041046143,0.93175482786383
143,5,Naive Bayes,2,0.75,0.8458274398868458,0.9165108254718521,0.22516155242919922,0.9165108254718521
144,6,KNeighbors Classifier,0,0.75,0.9830985915492958,0.9758141385621988,1.7846059799194336,0.9758141385621988
145,6,SVC Classifier,0,0.75,0.9098591549295775,0.4530153324120529,1.3197283744812012,0.4530153324120529
146,6,Decision Tree,0,0.75,0.8943661971830986,0.7520399065078802,0.12348341941833496,0.7520399065078802
147,6,RandomForest,0,0.75,0.8873239436619719,0.37005661190274114,0.8210673332214355,0.37005661190274114
148,6,AdaBoost (Discrete),0,0.75,0.928169014084507,0.9062029191748111,83.19866585731506,0.9062029191748111
149,6,AdaBoost (Real),0,0.75,0.9253521126760563,0.9479556599505218,100.61403679847717,0.9479556599505218
150,6,Logistic Regression (Penalty = L2),0,0.75,0.9732394366197183,0.9716260435082653,0.6470425128936768,0.9716260435082653
151,6,Naive Bayes,0,0.75,0.971830985915493,0.976722909042524,0.23814749717712402,0.976722909042524
152,6,KNeighbors Classifier,1,0.75,0.9703808180535967,0.9410822578076543,2.2716445922851562,0.9410822578076543
153,6,SVC Classifier,1,0.75,0.9760225669957687,0.9369604361556937,1.5884201526641846,0.9369604361556937
154,6,Decision Tree,1,0.75,0.9548660084626234,0.9283954190417542,0.13544392585754395,0.9283954190417542
155,6,RandomForest,1,0.75,0.8716502115655853,0.8206518066482897,0.8629367351531982,0.0
156,6,AdaBoost (Discrete),1,0.75,0.9703808180535967,0.9184735248681712,58.873377323150635,0.9184735248681712
157,6,AdaBoost (Real),1,0.75,0.9675599435825106,0.9393554974920645,92.5780177116394,0.9393554974920645
158,6,Logistic Regression (Penalty = L2),1,0.75,0.9717912552891397,0.9540352982417448,0.6330990791320801,0.9540352982417448
159,6,Naive Bayes,1,0.75,0.9407616361071932,0.9553910302394867,0.20859098434448242,0.9553910302394867
160,6,KNeighbors Classifier,2,0.75,0.9646393210749646,0.920520487912849,1.745002031326294,0.920520487912849
161,6,SVC Classifier,2,0.75,0.9872701555869873,0.9683996942491399,1.1878538131713867,0.9683996942491399
162,6,Decision Tree,2,0.75,0.6973125884016973,0.7762188179854915,0.1047813892364502,0.7762188179854915
163,6,RandomForest,2,0.75,0.8981612446958982,0.6769128331491624,0.8642189502716064,0.6769128331491624
164,6,AdaBoost (Discrete),2,0.75,0.9207920792079208,0.9400427901293131,83.47359299659729,0.9400427901293131
165,6,AdaBoost (Real),2,0.75,0.8189533239038189,0.8875859845227971,98.422536611557,0.8875859845227971
166,6,Logistic Regression (Penalty = L2),2,0.75,0.9533239038189534,0.9160108234781796,0.5951364040374756,0.9160108234781796
167,6,Naive Bayes,2,0.75,0.9151343705799151,0.9488458231718553,0.10988497734069824,0.9488458231718553
168,7,KNeighbors Classifier,0,0.75,0.9802816901408451,0.9775023353024564,2.8963828086853027,0.9775023353024564
169,7,SVC Classifier,0,0.75,0.9098591549295775,0.4530153324120529,1.9183084964752197,0.4530153324120529
170,7,Decision Tree,0,0.75,0.8408450704225352,0.6167714983160596,0.1175074577331543,0.6167714983160596
171,7,RandomForest,0,0.75,0.8873239436619719,0.37005661190274114,1.0150790214538574,0.37005661190274114
172,7,AdaBoost (Discrete),0,0.75,0.8985915492957747,0.9359389158981621,94.51381611824036,0.9359389158981621
173,7,AdaBoost (Real),0,0.75,0.9633802816901409,0.9730647365321554,98.07663869857788,0.9730647365321554
174,7,Logistic Regression (Penalty = L2),0,0.75,0.9704225352112676,0.9704227902110237,0.6294300556182861,0.9704227902110237
175,7,Naive Bayes,0,0.75,0.9732394366197183,0.9773299464325066,0.21786904335021973,0.9773299464325066
176,7,KNeighbors Classifier,1,0.75,0.9788434414668548,0.9538955186996372,2.486935615539551,0.9538955186996372
177,7,SVC Classifier,1,0.75,0.9760225669957687,0.9369604361556937,1.6002392768859863,0.9369604361556937
178,7,Decision Tree,1,0.75,0.9548660084626234,0.9098656094504459,0.10769844055175781,0.9098656094504459
179,7,RandomForest,1,0.75,0.8956276445698167,0.6604890721640843,0.6512539386749268,0.6604890721640843
180,7,AdaBoost (Discrete),1,0.75,0.9703808180535967,0.9184735248681712,91.31200742721558,0.9184735248681712
181,7,AdaBoost (Real),1,0.75,0.9760225669957687,0.951777289955641,130.52409887313843,0.951777289955641
182,7,Logistic Regression (Penalty = L2),1,0.75,0.9732016925246827,0.9576354655560266,0.8354494571685791,0.9576354655560266
183,7,Naive Bayes,1,0.75,0.9435825105782792,0.956623794226582,0.3108656406402588,0.956623794226582
184,7,KNeighbors Classifier,2,0.75,0.9618104667609618,0.908960200834328,2.9365451335906982,0.908960200834328
185,7,SVC Classifier,2,0.75,0.9858557284299858,0.9647590595276887,2.1832144260406494,0.9647590595276887
186,7,Decision Tree,2,0.75,0.6760961810466761,0.7647006300558962,0.1563715934753418,0.7647006300558962
187,7,RandomForest,2,0.75,0.8896746817538896,0.6408541112232324,1.0414516925811768,0.6408541112232324
188,7,AdaBoost (Discrete),2,0.75,0.917963224893918,0.9114042949860117,118.99679136276245,0.9114042949860117
189,7,AdaBoost (Real),2,0.75,0.8628005657708628,0.8906548089578057,160.04093980789185,0.8906548089578057
190,7,Logistic Regression (Penalty = L2),2,0.75,0.9575671852899575,0.9072984782969474,1.1737675666809082,0.9072984782969474
191,7,Naive Bayes,2,0.75,0.9278642149929278,0.9545504441297977,0.32647228240966797,0.9545504441297977
192,8,KNeighbors Classifier,0,0.75,0.9816901408450704,0.9723039854275715,1.6804285049438477,0.9723039854275715
193,8,SVC Classifier,0,0.75,0.9098591549295775,0.4530153324120529,1.6402289867401123,0.4530153324120529
194,8,Decision Tree,0,0.75,0.9112676056338028,0.8108561232390329,0.16428828239440918,0.8108561232390329
195,8,RandomForest,0,0.75,0.8887323943661972,0.3986314009794656,1.2604703903198242,0.3986314009794656
196,8,AdaBoost (Discrete),0,0.75,0.9549295774647887,0.9588818342562253,109.94893479347229,0.9588818342562253
197,8,AdaBoost (Real),0,0.75,0.9535211267605633,0.9602841626676379,119.6119933128357,0.9602841626676379
198,8,Logistic Regression (Penalty = L2),0,0.75,0.9845070422535211,0.9764095103624777,0.6559586524963379,0.9764095103624777
199,8,Naive Bayes,0,0.75,0.9746478873239437,0.9750961659762587,0.1616518497467041,0.9750961659762587
200,8,KNeighbors Classifier,1,0.75,0.9379407616361072,0.9245705784925071,1.6944091320037842,0.9245705784925071
201,8,SVC Classifier,1,0.75,0.9760225669957687,0.9369604361556937,1.6607203483581543,0.9369604361556937
202,8,Decision Tree,1,0.75,0.923836389280677,0.8103085174936072,0.16452813148498535,0.8103085174936072
203,8,RandomForest,1,0.75,0.8857545839210155,0.47070239522204105,1.4438238143920898,0.47070239522204105
204,8,AdaBoost (Discrete),1,0.75,0.9647390691114246,0.896062730767775,107.42382645606995,0.896062730767775
205,8,AdaBoost (Real),1,0.75,0.8702397743300423,0.90523385351782,111.50091457366943,0.90523385351782
206,8,Logistic Regression (Penalty = L2),1,0.75,0.9746121297602257,0.9363942967815083,0.5423035621643066,0.9363942967815083
207,8,Naive Bayes,1,0.75,0.9590973201692524,0.9604870383348809,0.1371309757232666,0.9604870383348809
208,8,KNeighbors Classifier,2,0.75,0.9519094766619519,0.9535263349121464,1.5686347484588623,0.9535263349121464
209,8,SVC Classifier,2,0.75,0.9915134370579916,0.9791605716903751,1.2044408321380615,0.9791605716903751
210,8,Decision Tree,2,0.75,0.8571428571428571,0.8999272738565056,0.002628803253173828,0.8999272738565056
211,8,RandomForest,2,0.75,0.8925035360678925,0.7796020204168211,1.1996889114379883,0.7796020204168211
212,8,AdaBoost (Discrete),2,0.75,0.8203677510608204,0.8936485248675776,84.5273232460022,0.8936485248675776
213,8,AdaBoost (Real),2,0.75,0.8005657708628006,0.8865033318973508,99.51613998413086,0.8865033318973508
214,8,Logistic Regression (Penalty = L2),2,0.75,0.8797736916548797,0.9299309820889741,0.5810961723327637,0.9299309820889741
215,8,Naive Bayes,2,0.75,0.8458274398868458,0.9165108254718521,0.1320514678955078,0.9165108254718521
