,feat_set_id,classifier,fold_id,feat_th,score,geo_score,exec_t,geo_score_woz
0,0,KNeighbors Classifier,0,0.65,0.8119402985074626,0.7485978428580097,4.821195125579834,0.7485978428580097
1,0,SVC Classifier,0,0.65,0.7134328358208956,0.6786349049908055,7.338625431060791,0.6786349049908055
2,0,Decision Tree,0,0.65,0.6029850746268657,0.5457603465901147,0.586801290512085,0.5457603465901147
3,0,RandomForest,0,0.65,0.48656716417910445,0.37700189082424873,1.9950735569000244,0.0
4,0,AdaBoost (Discrete),0,0.65,0.7432835820895523,0.7154259763403458,326.1223666667938,0.7154259763403458
5,0,AdaBoost (Real),0,0.65,0.7029850746268657,0.6623472335520786,329.5898320674896,0.6623472335520786
6,0,Logistic Regression (Penalty = L2),0,0.65,0.8164179104477612,0.7650404783619887,3.1579153537750244,0.7650404783619887
7,0,Naive Bayes,0,0.65,0.7044776119402985,0.661596646168181,0.4261362552642822,0.661596646168181
8,0,KNeighbors Classifier,1,0.65,0.808955223880597,0.7622087414703979,3.1246676445007324,0.7622087414703979
9,0,SVC Classifier,1,0.65,0.7283582089552239,0.6924032618941414,5.47713303565979,0.6924032618941414
10,0,Decision Tree,1,0.65,0.6358208955223881,0.5937577008845376,0.2674586772918701,0.5937577008845376
11,0,RandomForest,1,0.65,0.5477611940298508,0.48498476010070857,1.3300676345825195,0.0
12,0,AdaBoost (Discrete),1,0.65,0.7373134328358208,0.7159986883419648,289.82797288894653,0.7159986883419648
13,0,AdaBoost (Real),1,0.65,0.6746268656716418,0.6363960914115582,221.15581393241882,0.6363960914115582
14,0,Logistic Regression (Penalty = L2),1,0.65,0.8014925373134328,0.7541469259708444,2.1458277702331543,0.7541469259708444
15,0,Naive Bayes,1,0.65,0.7253731343283583,0.689751639814138,0.2876317501068115,0.689751639814138
16,0,KNeighbors Classifier,2,0.65,0.8166666666666667,0.769935237685,2.699582815170288,0.769935237685
17,0,SVC Classifier,2,0.65,0.7333333333333333,0.7015067571602641,4.273364782333374,0.7015067571602641
18,0,Decision Tree,2,0.65,0.6590909090909091,0.5946622808531158,0.28754568099975586,0.5946622808531158
19,0,RandomForest,2,0.65,0.45,0.3739520324925776,1.0605788230895996,0.0
20,0,AdaBoost (Discrete),2,0.65,0.759090909090909,0.7292335302797142,219.5231490135193,0.7292335302797142
21,0,AdaBoost (Real),2,0.65,0.5666666666666667,0.49644407640375926,255.88197469711304,0.49644407640375926
22,0,Logistic Regression (Penalty = L2),2,0.65,0.8136363636363636,0.7696278380538356,2.720897912979126,0.7696278380538356
23,0,Naive Bayes,2,0.65,0.7212121212121212,0.6902416443946807,0.25492405891418457,0.6902416443946807
24,1,KNeighbors Classifier,0,0.65,0.7134328358208956,0.6563121327990953,3.1145317554473877,0.6563121327990953
25,1,SVC Classifier,0,0.65,0.6343283582089553,0.5621838101630594,5.246696472167969,0.5621838101630594
26,1,Decision Tree,0,0.65,0.6014925373134329,0.5436380906781856,0.44987916946411133,0.5436380906781856
27,1,RandomForest,0,0.65,0.5253731343283582,0.531737795130469,1.2879245281219482,0.0
28,1,AdaBoost (Discrete),0,0.65,0.6970149253731344,0.6678585818827005,253.22028946876526,0.6678585818827005
29,1,AdaBoost (Real),0,0.65,0.5955223880597015,0.5638099904655867,272.84452629089355,0.5638099904655867
30,1,Logistic Regression (Penalty = L2),0,0.65,0.8,0.7487414486001703,3.4252676963806152,0.7487414486001703
31,1,Naive Bayes,0,0.65,0.6417910447761194,0.606157201111766,0.26607227325439453,0.606157201111766
32,1,KNeighbors Classifier,1,0.65,0.7328358208955223,0.668998322633304,3.348456382751465,0.668998322633304
33,1,SVC Classifier,1,0.65,0.6776119402985075,0.6175759243035811,6.529106140136719,0.6175759243035811
34,1,Decision Tree,1,0.65,0.5402985074626866,0.4980588163457139,0.40395641326904297,0.4980588163457139
35,1,RandomForest,1,0.65,0.5029850746268657,0.4691327425121686,1.4726173877716064,0.0
36,1,AdaBoost (Discrete),1,0.65,0.7238805970149254,0.6983203401111818,301.29863715171814,0.6983203401111818
37,1,AdaBoost (Real),1,0.65,0.6522388059701493,0.6318101885840763,304.3490970134735,0.6318101885840763
38,1,Logistic Regression (Penalty = L2),1,0.65,0.7776119402985074,0.7253618723077159,3.4230072498321533,0.7253618723077159
39,1,Naive Bayes,1,0.65,0.7104477611940299,0.663345956569731,0.45500850677490234,0.663345956569731
40,1,KNeighbors Classifier,2,0.65,0.7515151515151515,0.7010574490940762,3.6255486011505127,0.7010574490940762
41,1,SVC Classifier,2,0.65,0.6757575757575758,0.6175298373867144,7.0672008991241455,0.6175298373867144
42,1,Decision Tree,2,0.65,0.5651515151515152,0.516879351139285,0.4403190612792969,0.516879351139285
43,1,RandomForest,2,0.65,0.4803030303030303,0.394676896373364,1.6196074485778809,0.0
44,1,AdaBoost (Discrete),2,0.65,0.6893939393939394,0.6514963415875284,312.3892798423767,0.6514963415875284
45,1,AdaBoost (Real),2,0.65,0.6727272727272727,0.6321073375574812,334.9647090435028,0.6321073375574812
46,1,Logistic Regression (Penalty = L2),2,0.65,0.8272727272727273,0.7845467404663997,4.1152427196502686,0.7845467404663997
47,1,Naive Bayes,2,0.65,0.6833333333333333,0.6473762571439863,0.5072543621063232,0.6473762571439863
48,2,KNeighbors Classifier,0,0.65,0.7731343283582089,0.7218983975449763,4.218568563461304,0.7218983975449763
49,2,SVC Classifier,0,0.65,0.6791044776119403,0.6378680564244787,7.63567328453064,0.6378680564244787
50,2,Decision Tree,0,0.65,0.5850746268656717,0.526276049271494,0.5387938022613525,0.526276049271494
51,2,RandomForest,0,0.65,0.49701492537313435,0.4881418396306286,1.9958620071411133,0.0
52,2,AdaBoost (Discrete),0,0.65,0.7179104477611941,0.6953269068111277,353.008296251297,0.6953269068111277
53,2,AdaBoost (Real),0,0.65,0.7029850746268657,0.6633143806308618,362.36038613319397,0.6633143806308618
54,2,Logistic Regression (Penalty = L2),0,0.65,0.8134328358208955,0.7680558333801999,3.8584985733032227,0.7680558333801999
55,2,Naive Bayes,0,0.65,0.6850746268656717,0.6450838323047047,0.31768035888671875,0.6450838323047047
56,2,KNeighbors Classifier,1,0.65,0.7731343283582089,0.7150540934196794,3.64332914352417,0.7150540934196794
57,2,SVC Classifier,1,0.65,0.7029850746268657,0.6607753276690493,5.740962028503418,0.6607753276690493
58,2,Decision Tree,1,0.65,0.6149253731343284,0.5751052814511822,0.3997471332550049,0.5751052814511822
59,2,RandomForest,1,0.65,0.4835820895522388,0.36332948692173433,1.3262746334075928,0.0
60,2,AdaBoost (Discrete),1,0.65,0.7298507462686568,0.704972660682911,325.30359530448914,0.704972660682911
61,2,AdaBoost (Real),1,0.65,0.6835820895522388,0.6572819585646327,339.875746011734,0.6572819585646327
62,2,Logistic Regression (Penalty = L2),1,0.65,0.7895522388059701,0.7460673612161205,3.196124315261841,0.7460673612161205
63,2,Naive Bayes,1,0.65,0.7238805970149254,0.6795288263825199,0.39266347885131836,0.6795288263825199
64,2,KNeighbors Classifier,2,0.65,0.796969696969697,0.7482293440160289,3.3859329223632812,0.7482293440160289
65,2,SVC Classifier,2,0.65,0.7090909090909091,0.666198038915638,6.225547790527344,0.666198038915638
66,2,Decision Tree,2,0.65,0.6287878787878788,0.5846099739170969,0.5258042812347412,0.5846099739170969
67,2,RandomForest,2,0.65,0.5106060606060606,0.29092129151527624,1.504920244216919,0.0
68,2,AdaBoost (Discrete),2,0.65,0.7318181818181818,0.6976857150064687,297.3449635505676,0.6976857150064687
69,2,AdaBoost (Real),2,0.65,0.6954545454545454,0.6667754546847365,321.879510641098,0.6667754546847365
70,2,Logistic Regression (Penalty = L2),2,0.65,0.8348484848484848,0.7965201976090052,1.5011770725250244,0.7965201976090052
71,2,Naive Bayes,2,0.65,0.7045454545454546,0.6664236880307507,0.14770841598510742,0.6664236880307507
72,3,KNeighbors Classifier,0,0.65,0.7014925373134329,0.6440540211764348,0.43944358825683594,0.6440540211764348
73,3,SVC Classifier,0,0.65,0.5850746268656717,0.496893398340231,2.7491445541381836,0.496893398340231
74,3,Decision Tree,0,0.65,0.5238805970149254,0.4669533827417221,0.4049713611602783,0.4669533827417221
75,3,RandomForest,0,0.65,0.5298507462686567,0.2841573678667809,1.9826557636260986,0.2841573678667809
76,3,AdaBoost (Discrete),0,0.65,0.6701492537313433,0.6460473476146167,214.66296243667603,0.6460473476146167
77,3,AdaBoost (Real),0,0.65,0.5597014925373134,0.5105007214148384,207.3470540046692,0.5105007214148384
78,3,Logistic Regression (Penalty = L2),0,0.65,0.753731343283582,0.7040655528162062,1.9991488456726074,0.7040655528162062
79,3,Naive Bayes,0,0.65,0.6268656716417911,0.5693347645555912,0.26494526863098145,0.5693347645555912
80,3,KNeighbors Classifier,1,0.65,0.7104477611940299,0.6581129467560538,1.3245446681976318,0.6581129467560538
81,3,SVC Classifier,1,0.65,0.6029850746268657,0.5110528750343691,4.645143270492554,0.5110528750343691
82,3,Decision Tree,1,0.65,0.5582089552238806,0.49774519773293824,0.30748844146728516,0.49774519773293824
83,3,RandomForest,1,0.65,0.5223880597014925,0.7150940649787986,1.381363868713379,0.0
84,3,AdaBoost (Discrete),1,0.65,0.655223880597015,0.6255159693606998,180.0670371055603,0.6255159693606998
85,3,AdaBoost (Real),1,0.65,0.5925373134328358,0.5555617483148886,195.30702209472656,0.5555617483148886
86,3,Logistic Regression (Penalty = L2),1,0.65,0.7253731343283583,0.6650259994767648,2.417975902557373,0.6650259994767648
87,3,Naive Bayes,1,0.65,0.6238805970149254,0.5745844816212471,0.3838331699371338,0.5745844816212471
88,3,KNeighbors Classifier,2,0.65,0.6954545454545454,0.6290188587157288,1.4619455337524414,0.6290188587157288
89,3,SVC Classifier,2,0.65,0.6136363636363636,0.5624843930555234,4.752554655075073,0.5624843930555234
90,3,Decision Tree,2,0.65,0.5878787878787879,0.5390444227064793,0.3169736862182617,0.5390444227064793
91,3,RandomForest,2,0.65,0.5106060606060606,0.27690211490231326,1.340256690979004,0.0
92,3,AdaBoost (Discrete),2,0.65,0.6893939393939394,0.6663010449505337,187.49911642074585,0.6663010449505337
93,3,AdaBoost (Real),2,0.65,0.6409090909090909,0.6021875664547932,205.41286516189575,0.6021875664547932
94,3,Logistic Regression (Penalty = L2),2,0.65,0.7575757575757576,0.6883671840179327,2.2136740684509277,0.6883671840179327
95,3,Naive Bayes,2,0.65,0.6424242424242425,0.605613338165506,0.3160843849182129,0.605613338165506
96,4,KNeighbors Classifier,0,0.65,0.7761194029850746,0.7219288500443307,3.025336742401123,0.7219288500443307
97,4,SVC Classifier,0,0.65,0.6656716417910448,0.6152750440424336,5.409270524978638,0.6152750440424336
98,4,Decision Tree,0,0.65,0.5701492537313433,0.5040869703755557,0.28510546684265137,0.5040869703755557
99,4,RandomForest,0,0.65,0.4746268656716418,0.3136572504506426,1.5013680458068848,0.0
100,4,AdaBoost (Discrete),0,0.65,0.7328358208955223,0.7003578027925639,248.72919917106628,0.7003578027925639
101,4,AdaBoost (Real),0,0.65,0.6283582089552239,0.58918828568651,247.0622787475586,0.58918828568651
102,4,Logistic Regression (Penalty = L2),0,0.65,0.7880597014925373,0.7351311543803909,2.438338041305542,0.7351311543803909
103,4,Naive Bayes,0,0.65,0.6537313432835821,0.5990939515984797,0.26885294914245605,0.5990939515984797
104,4,KNeighbors Classifier,1,0.65,0.7746268656716417,0.7214435519061684,2.508303165435791,0.7214435519061684
105,4,SVC Classifier,1,0.65,0.6597014925373135,0.6092085062806502,5.793590307235718,0.6092085062806502
106,4,Decision Tree,1,0.65,0.6119402985074627,0.5495197294800402,0.4558558464050293,0.5495197294800402
107,4,RandomForest,1,0.65,0.48955223880597015,0.3665358854509194,1.588660717010498,0.0
108,4,AdaBoost (Discrete),1,0.65,0.691044776119403,0.6598060421897315,228.61562967300415,0.6598060421897315
109,4,AdaBoost (Real),1,0.65,0.6567164179104478,0.6291822900232458,227.96443724632263,0.6291822900232458
110,4,Logistic Regression (Penalty = L2),1,0.65,0.764179104477612,0.7111778058677086,2.4948923587799072,0.7111778058677086
111,4,Naive Bayes,1,0.65,0.6761194029850747,0.6376753725242638,0.17246317863464355,0.6376753725242638
112,4,KNeighbors Classifier,2,0.65,0.7878787878787878,0.7417937400278025,2.178766965866089,0.7417937400278025
113,4,SVC Classifier,2,0.65,0.7045454545454546,0.6687589986693389,4.561346054077148,0.6687589986693389
114,4,Decision Tree,2,0.65,0.6075757575757575,0.5643708572463446,0.2662978172302246,0.5643708572463446
115,4,RandomForest,2,0.65,0.49696969696969695,0.5323518103872399,1.0086712837219238,0.0
116,4,AdaBoost (Discrete),2,0.65,0.7227272727272728,0.6928505521695649,238.4543788433075,0.6928505521695649
117,4,AdaBoost (Real),2,0.65,0.6530303030303031,0.6226920016456321,1249.545863866806,0.6226920016456321
118,4,Logistic Regression (Penalty = L2),2,0.65,0.793939393939394,0.7445776053122872,2.480494976043701,0.7445776053122872
119,4,Naive Bayes,2,0.65,0.6742424242424242,0.6384534024867989,0.2107245922088623,0.6384534024867989
120,5,KNeighbors Classifier,0,0.65,0.7343283582089553,0.6921126543181785,2.4401895999908447,0.6921126543181785
121,5,SVC Classifier,0,0.65,0.6238805970149254,0.5725861244168758,4.546492099761963,0.5725861244168758
122,5,Decision Tree,0,0.65,0.5611940298507463,0.5145984808360294,0.3486135005950928,0.5145984808360294
123,5,RandomForest,0,0.65,0.5014925373134328,0.3403754143311058,1.2555856704711914,0.0
124,5,AdaBoost (Discrete),0,0.65,0.6791044776119403,0.6479455303750385,186.66484093666077,0.6479455303750385
125,5,AdaBoost (Real),0,0.65,0.5149253731343284,0.41986033010473545,192.92080903053284,0.41986033010473545
126,5,Logistic Regression (Penalty = L2),0,0.65,0.8059701492537313,0.7704185264660858,2.1493823528289795,0.7704185264660858
127,5,Naive Bayes,0,0.65,0.6611940298507463,0.6297916114036418,0.22604918479919434,0.6297916114036418
128,5,KNeighbors Classifier,1,0.65,0.7328358208955223,0.677157674562876,2.035254955291748,0.677157674562876
129,5,SVC Classifier,1,0.65,0.6402985074626866,0.5902009752328674,4.412680625915527,0.5902009752328674
130,5,Decision Tree,1,0.65,0.5567164179104478,0.5054724611444782,0.22466683387756348,0.5054724611444782
131,5,RandomForest,1,0.65,0.5044776119402985,0.31597170462005714,1.111487627029419,0.0
132,5,AdaBoost (Discrete),1,0.65,0.682089552238806,0.6530755603875036,172.40071296691895,0.6530755603875036
133,5,AdaBoost (Real),1,0.65,0.6402985074626866,0.6057203910122252,175.24879956245422,0.6057203910122252
134,5,Logistic Regression (Penalty = L2),1,0.65,0.7686567164179104,0.7155380017465431,2.1040420532226562,0.7155380017465431
135,5,Naive Bayes,1,0.65,0.6895522388059702,0.6481097285809747,0.20502138137817383,0.6481097285809747
136,5,KNeighbors Classifier,2,0.65,0.7303030303030303,0.6708772668808884,1.8871023654937744,0.6708772668808884
137,5,SVC Classifier,2,0.65,0.6530303030303031,0.6055447410082855,3.8839755058288574,0.6055447410082855
138,5,Decision Tree,2,0.65,0.5757575757575758,0.5201776856845451,0.14909148216247559,0.5201776856845451
139,5,RandomForest,2,0.65,0.4696969696969697,0.38440668303651787,1.0003421306610107,0.0
140,5,AdaBoost (Discrete),2,0.65,0.6924242424242424,0.6532768429688414,159.9194369316101,0.6532768429688414
141,5,AdaBoost (Real),2,0.65,0.6530303030303031,0.5810943502573694,155.8731997013092,0.5810943502573694
142,5,Logistic Regression (Penalty = L2),2,0.65,0.8166666666666667,0.7704344331301972,1.9979898929595947,0.7704344331301972
143,5,Naive Bayes,2,0.65,0.6651515151515152,0.6198375465921877,0.19381093978881836,0.6198375465921877
144,6,KNeighbors Classifier,0,0.65,0.7731343283582089,0.7218983975449763,2.4855024814605713,0.7218983975449763
145,6,SVC Classifier,0,0.65,0.6791044776119403,0.6378680564244787,4.4350221157073975,0.6378680564244787
146,6,Decision Tree,0,0.65,0.5970149253731343,0.5402698930960955,0.2881662845611572,0.5402698930960955
147,6,RandomForest,0,0.65,0.49701492537313435,0.4881418396306286,1.0670714378356934,0.0
148,6,AdaBoost (Discrete),0,0.65,0.7179104477611941,0.6953269068111277,188.386412858963,0.6953269068111277
149,6,AdaBoost (Real),0,0.65,0.7,0.6635629852089296,197.39584851264954,0.6635629852089296
150,6,Logistic Regression (Penalty = L2),0,0.65,0.8134328358208955,0.7680558333801999,2.422452211380005,0.7680558333801999
151,6,Naive Bayes,0,0.65,0.6850746268656717,0.6450838323047047,0.27425599098205566,0.6450838323047047
152,6,KNeighbors Classifier,1,0.65,0.7731343283582089,0.7150540934196794,2.4730138778686523,0.7150540934196794
153,6,SVC Classifier,1,0.65,0.7029850746268657,0.6607753276690493,4.481175661087036,0.6607753276690493
154,6,Decision Tree,1,0.65,0.5985074626865672,0.5531140584991953,0.3158385753631592,0.5531140584991953
155,6,RandomForest,1,0.65,0.4835820895522388,0.36332948692173433,1.0172984600067139,0.0
156,6,AdaBoost (Discrete),1,0.65,0.7298507462686568,0.704972660682911,185.8263828754425,0.704972660682911
157,6,AdaBoost (Real),1,0.65,0.6582089552238806,0.6247212066091341,176.2933690547943,0.6247212066091341
158,6,Logistic Regression (Penalty = L2),1,0.65,0.7895522388059701,0.7460673612161205,2.0068717002868652,0.7460673612161205
159,6,Naive Bayes,1,0.65,0.7238805970149254,0.6795288263825199,0.31845617294311523,0.6795288263825199
160,6,KNeighbors Classifier,2,0.65,0.796969696969697,0.7482293440160289,2.0972259044647217,0.7482293440160289
161,6,SVC Classifier,2,0.65,0.7090909090909091,0.666198038915638,3.799117088317871,0.666198038915638
162,6,Decision Tree,2,0.65,0.6439393939393939,0.5988089765346205,0.2640111446380615,0.5988089765346205
163,6,RandomForest,2,0.65,0.5106060606060606,0.29092129151527624,0.8444709777832031,0.0
164,6,AdaBoost (Discrete),2,0.65,0.7318181818181818,0.6976857150064687,173.3434293270111,0.6976857150064687
165,6,AdaBoost (Real),2,0.65,0.6954545454545454,0.6583240462309011,157.9751169681549,0.6583240462309011
166,6,Logistic Regression (Penalty = L2),2,0.65,0.8348484848484848,0.7965201976090052,1.7289881706237793,0.7965201976090052
167,6,Naive Bayes,2,0.65,0.7045454545454546,0.6664236880307507,0.13602972030639648,0.6664236880307507
168,7,KNeighbors Classifier,0,0.65,0.8014925373134328,0.7354866912064522,2.8909997940063477,0.7354866912064522
169,7,SVC Classifier,0,0.65,0.7567164179104477,0.7277714802198241,4.148728609085083,0.7277714802198241
170,7,Decision Tree,0,0.65,0.6014925373134329,0.5329566634940378,0.20852136611938477,0.5329566634940378
171,7,RandomForest,0,0.65,0.5373134328358209,0.26889087122730504,0.7017724514007568,0.26889087122730504
172,7,AdaBoost (Discrete),0,0.65,0.7477611940298508,0.7187966126764977,213.75207471847534,0.7187966126764977
173,7,AdaBoost (Real),0,0.65,0.6776119402985075,0.6206496160036613,192.12401866912842,0.6206496160036613
174,7,Logistic Regression (Penalty = L2),0,0.65,0.8238805970149253,0.7787500973181437,2.3189477920532227,0.7787500973181437
175,7,Naive Bayes,0,0.65,0.7119402985074627,0.6746948581883572,0.2680399417877197,0.6746948581883572
176,7,KNeighbors Classifier,1,0.65,0.8029850746268656,0.7460756971258882,3.1267757415771484,0.7460756971258882
177,7,SVC Classifier,1,0.65,0.755223880597015,0.7112584119008337,4.28939962387085,0.7112584119008337
178,7,Decision Tree,1,0.65,0.6179104477611941,0.5695746588428778,0.2702145576477051,0.5695746588428778
179,7,RandomForest,1,0.65,0.5328358208955224,0.4732597749207965,0.6814918518066406,0.0
180,7,AdaBoost (Discrete),1,0.65,0.7373134328358208,0.7146948970613471,230.62543320655823,0.7146948970613471
181,7,AdaBoost (Real),1,0.65,0.6865671641791045,0.6560386445539148,230.37927341461182,0.6560386445539148
182,7,Logistic Regression (Penalty = L2),1,0.65,0.8104477611940298,0.7637676316720023,2.680058002471924,0.7637676316720023
183,7,Naive Bayes,1,0.65,0.753731343283582,0.7045917988454266,0.23305773735046387,0.7045917988454266
184,7,KNeighbors Classifier,2,0.65,0.8151515151515152,0.764347400273268,3.3970136642456055,0.764347400273268
185,7,SVC Classifier,2,0.65,0.7575757575757576,0.72361421061998,4.831350564956665,0.72361421061998
186,7,Decision Tree,2,0.65,0.6424242424242425,0.59591230512539,0.3219778537750244,0.59591230512539
187,7,RandomForest,2,0.65,0.5666666666666667,0.4125786091679344,0.8872373104095459,0.0
188,7,AdaBoost (Discrete),2,0.65,0.7575757575757576,0.7298232091105883,231.44504594802856,0.7298232091105883
189,7,AdaBoost (Real),2,0.65,0.7136363636363636,0.6623164365488224,203.13790082931519,0.6623164365488224
190,7,Logistic Regression (Penalty = L2),2,0.65,0.8318181818181818,0.7861155496018056,2.310746908187866,0.7861155496018056
191,7,Naive Bayes,2,0.65,0.7393939393939394,0.6977713423594243,0.2154395580291748,0.6977713423594243
192,8,KNeighbors Classifier,0,0.65,0.7014925373134329,0.6440540211764348,0.8682928085327148,0.6440540211764348
193,8,SVC Classifier,0,0.65,0.5850746268656717,0.496893398340231,2.4693851470947266,0.496893398340231
194,8,Decision Tree,0,0.65,0.5656716417910448,0.5179678401862922,0.15281963348388672,0.5179678401862922
195,8,RandomForest,0,0.65,0.5298507462686567,0.2841573678667809,0.7315952777862549,0.2841573678667809
196,8,AdaBoost (Discrete),0,0.65,0.6701492537313433,0.6460473476146167,106.36757731437683,0.6460473476146167
197,8,AdaBoost (Real),0,0.65,0.5567164179104478,0.5125871187890234,118.52436232566833,0.5125871187890234
198,8,Logistic Regression (Penalty = L2),0,0.65,0.753731343283582,0.7040655528162062,1.3932902812957764,0.7040655528162062
199,8,Naive Bayes,0,0.65,0.6268656716417911,0.5693347645555912,0.15270638465881348,0.5693347645555912
200,8,KNeighbors Classifier,1,0.65,0.7104477611940299,0.6581129467560538,1.0482423305511475,0.6581129467560538
201,8,SVC Classifier,1,0.65,0.6029850746268657,0.5110528750343691,2.907947063446045,0.5110528750343691
202,8,Decision Tree,1,0.65,0.5552238805970149,0.5019390997133116,0.16681671142578125,0.5019390997133116
203,8,RandomForest,1,0.65,0.5223880597014925,0.7150940649787986,0.836235523223877,0.0
204,8,AdaBoost (Discrete),1,0.65,0.655223880597015,0.6255159693606998,108.22450971603394,0.6255159693606998
205,8,AdaBoost (Real),1,0.65,0.5805970149253732,0.5311446396717212,111.94082951545715,0.5311446396717212
206,8,Logistic Regression (Penalty = L2),1,0.65,0.7253731343283583,0.6650259994767648,1.1761367321014404,0.6650259994767648
207,8,Naive Bayes,1,0.65,0.6238805970149254,0.5745844816212471,0.171661376953125,0.5745844816212471
208,8,KNeighbors Classifier,2,0.65,0.6954545454545454,0.6290188587157288,0.9586873054504395,0.6290188587157288
209,8,SVC Classifier,2,0.65,0.6136363636363636,0.5624843930555234,2.8922901153564453,0.5624843930555234
210,8,Decision Tree,2,0.65,0.55,0.476893998525296,0.2592916488647461,0.476893998525296
211,8,RandomForest,2,0.65,0.5106060606060606,0.27690211490231326,0.8898026943206787,0.0
212,8,AdaBoost (Discrete),2,0.65,0.6893939393939394,0.6663010449505337,107.82117009162903,0.6663010449505337
213,8,AdaBoost (Real),2,0.65,0.6151515151515151,0.5797378251706378,116.89706945419312,0.5797378251706378
214,8,Logistic Regression (Penalty = L2),2,0.65,0.7575757575757576,0.6883671840179327,1.1505353450775146,0.6883671840179327
215,8,Naive Bayes,2,0.65,0.6424242424242425,0.605613338165506,0.16094398498535156,0.605613338165506
