,feat_set_id,classifier,fold_id,feat_th,score,geo_score,exec_t,geo_score_woz
0,0,KNeighbors Classifier,0,0.8,0.8666666666666667,0.8310340479364138,0.47535133361816406,0.8310340479364138
1,0,SVC Classifier,0,0.8,0.8083333333333333,1.0,0.4013490676879883,0.0
2,0,Decision Tree,0,0.8,0.875,0.8160441172552808,0.09486269950866699,0.8160441172552808
3,0,RandomForest,0,0.8,0.8083333333333333,0.9004489606971755,0.6995041370391846,0.0
4,0,AdaBoost (Discrete),0,0.8,0.825,0.7481595356833938,40.008692502975464,0.7481595356833938
5,0,AdaBoost (Real),0,0.8,0.7666666666666667,0.8339947279394198,45.69462442398071,0.0
6,0,Logistic Regression (Penalty = L2),0,0.8,0.975,0.9696654978825953,0.39220285415649414,0.9696654978825953
7,0,Naive Bayes,0,0.8,0.8333333333333334,0.8176986041493832,0.12886667251586914,0.8176986041493832
8,0,KNeighbors Classifier,1,0.8,0.8666666666666667,0.8378193130017028,0.20769810676574707,0.8378193130017028
9,0,SVC Classifier,1,0.8,0.8083333333333333,1.0,0.29054808616638184,0.0
10,0,Decision Tree,1,0.8,0.9083333333333333,0.9101900162636553,0.0023832321166992188,0.9101900162636553
11,0,RandomForest,1,0.8,0.775,0.7759227869576798,0.6757285594940186,0.0
12,0,AdaBoost (Discrete),1,0.8,0.325,1.0,44.46034646034241,0.0
13,0,AdaBoost (Real),1,0.8,0.8333333333333334,0.9748970527428702,51.41495442390442,0.0
14,0,Logistic Regression (Penalty = L2),1,0.8,0.9583333333333334,0.9491706774639023,0.42992138862609863,0.9491706774639023
15,0,Naive Bayes,1,0.8,0.8083333333333333,0.7605089548266607,0.11039137840270996,0.7605089548266607
16,0,KNeighbors Classifier,2,0.8,0.9067796610169492,0.8686779277152785,0.3308861255645752,0.8686779277152785
17,0,SVC Classifier,2,0.8,0.8135593220338984,1.0,0.33145689964294434,0.0
18,0,Decision Tree,2,0.8,0.9491525423728814,0.9297901808581143,0.0025701522827148438,0.9297901808581143
19,0,RandomForest,2,0.8,0.8559322033898306,0.9641925040026272,0.8554086685180664,0.0
20,0,AdaBoost (Discrete),2,0.8,0.923728813559322,0.7922561070581773,44.5371789932251,0.7922561070581773
21,0,AdaBoost (Real),2,0.8,0.9661016949152542,0.9370735665844807,50.01155972480774,0.9370735665844807
22,0,Logistic Regression (Penalty = L2),2,0.8,0.9661016949152542,0.9609668960083467,0.30208873748779297,0.9609668960083467
23,0,Naive Bayes,2,0.8,0.7966101694915254,0.7248326527536443,0.11255812644958496,0.7248326527536443
24,1,KNeighbors Classifier,0,0.8,0.85,0.828889402229203,0.40898919105529785,0.828889402229203
25,1,SVC Classifier,0,0.8,0.8083333333333333,1.0,0.3244030475616455,0.0
26,1,Decision Tree,0,0.8,0.875,0.7857920502638263,0.0020978450775146484,0.7857920502638263
27,1,RandomForest,0,0.8,0.8,0.6754800192603067,0.7394726276397705,0.0
28,1,AdaBoost (Discrete),0,0.8,0.8333333333333334,0.7550752681421514,44.98601055145264,0.7550752681421514
29,1,AdaBoost (Real),0,0.8,0.7666666666666667,0.8339947279394198,49.193352699279785,0.0
30,1,Logistic Regression (Penalty = L2),0,0.8,0.975,0.9696654978825953,0.2678110599517822,0.9696654978825953
31,1,Naive Bayes,0,0.8,0.8083333333333333,0.7827132714950777,0.10810422897338867,0.7827132714950777
32,1,KNeighbors Classifier,1,0.8,0.9083333333333333,0.8858989910127633,0.3217291831970215,0.8858989910127633
33,1,SVC Classifier,1,0.8,0.8083333333333333,1.0,0.32476329803466797,0.0
34,1,Decision Tree,1,0.8,0.8166666666666667,0.8205109357375197,0.11046433448791504,0.8205109357375197
35,1,RandomForest,1,0.8,0.675,1.0,0.7890136241912842,0.0
36,1,AdaBoost (Discrete),1,0.8,0.325,1.0,45.828691482543945,0.0
37,1,AdaBoost (Real),1,0.8,0.8333333333333334,0.9748970527428702,54.474167585372925,0.0
38,1,Logistic Regression (Penalty = L2),1,0.8,0.9583333333333334,0.9533988533647133,0.29090261459350586,0.9533988533647133
39,1,Naive Bayes,1,0.8,0.775,0.6940519131061853,0.12116241455078125,0.6940519131061853
40,1,KNeighbors Classifier,2,0.8,0.8559322033898306,0.7866563052483427,0.40105438232421875,0.7866563052483427
41,1,SVC Classifier,2,0.8,0.8135593220338984,1.0,0.3620274066925049,0.0
42,1,Decision Tree,2,0.8,0.8813559322033898,0.8663141271331594,0.0015375614166259766,0.8663141271331594
43,1,RandomForest,2,0.8,0.6779661016949152,1.0,0.8758392333984375,0.0
44,1,AdaBoost (Discrete),2,0.8,0.923728813559322,0.7922561070581773,45.13326406478882,0.7922561070581773
45,1,AdaBoost (Real),2,0.8,0.8559322033898306,0.9641925040026272,50.80501627922058,0.0
46,1,Logistic Regression (Penalty = L2),2,0.8,0.9491525423728814,0.9422865815358938,0.25788402557373047,0.9422865815358938
47,1,Naive Bayes,2,0.8,0.7711864406779662,0.6859431568581424,0.10791873931884766,0.6859431568581424
48,2,KNeighbors Classifier,0,0.8,0.8916666666666667,0.8878950739119864,0.41342902183532715,0.8878950739119864
49,2,SVC Classifier,0,0.8,0.8083333333333333,1.0,0.3236846923828125,0.0
50,2,Decision Tree,0,0.8,0.7,0.5548814178127351,0.10952591896057129,0.5548814178127351
51,2,RandomForest,0,0.8,0.675,1.0,0.7417428493499756,0.0
52,2,AdaBoost (Discrete),0,0.8,0.8166666666666667,0.6848351801484946,43.73876953125,0.6848351801484946
53,2,AdaBoost (Real),0,0.8,0.8,0.8532982640620798,51.17107844352722,0.0
54,2,Logistic Regression (Penalty = L2),0,0.8,0.975,0.9696654978825953,0.282672643661499,0.9696654978825953
55,2,Naive Bayes,0,0.8,0.7833333333333333,0.743791857938213,0.22181963920593262,0.743791857938213
56,2,KNeighbors Classifier,1,0.8,0.85,0.8112480747237274,0.3433053493499756,0.8112480747237274
57,2,SVC Classifier,1,0.8,0.8083333333333333,1.0,0.33144235610961914,0.0
58,2,Decision Tree,1,0.8,0.8583333333333333,0.869936182624507,0.002237558364868164,0.869936182624507
59,2,RandomForest,1,0.8,0.7833333333333333,0.887431337929649,0.6496684551239014,0.0
60,2,AdaBoost (Discrete),1,0.8,0.325,1.0,40.95729660987854,0.0
61,2,AdaBoost (Real),1,0.8,0.8333333333333334,0.9748970527428702,48.477044105529785,0.0
62,2,Logistic Regression (Penalty = L2),1,0.8,0.9333333333333333,0.923485670457099,0.3888728618621826,0.923485670457099
63,2,Naive Bayes,1,0.8,0.7666666666666667,0.683113982346698,0.19260191917419434,0.683113982346698
64,2,KNeighbors Classifier,2,0.8,0.8728813559322034,0.8237744862210329,0.4127495288848877,0.8237744862210329
65,2,SVC Classifier,2,0.8,0.8135593220338984,1.0,0.3687765598297119,0.0
66,2,Decision Tree,2,0.8,0.8983050847457628,0.8568187439302775,0.11912870407104492,0.8568187439302775
67,2,RandomForest,2,0.8,0.8135593220338984,0.5349565969668315,0.9380123615264893,0.5349565969668315
68,2,AdaBoost (Discrete),2,0.8,0.9322033898305084,0.8476452619160645,46.32334852218628,0.8476452619160645
69,2,AdaBoost (Real),2,0.8,0.8559322033898306,0.9641925040026272,56.49151301383972,0.0
70,2,Logistic Regression (Penalty = L2),2,0.8,0.9491525423728814,0.9401714290217257,0.3557710647583008,0.9401714290217257
71,2,Naive Bayes,2,0.8,0.7711864406779662,0.6873648184993013,0.15427374839782715,0.6873648184993013
72,3,KNeighbors Classifier,0,0.8,0.8833333333333333,0.867822084968233,0.424670934677124,0.867822084968233
73,3,SVC Classifier,0,0.8,0.8083333333333333,1.0,0.5632960796356201,0.0
74,3,Decision Tree,0,0.8,0.8333333333333334,0.72861797995611,0.18589019775390625,0.72861797995611
75,3,RandomForest,0,0.8,0.7833333333333333,0.6165083688432642,0.9824111461639404,0.0
76,3,AdaBoost (Discrete),0,0.8,0.8166666666666667,0.7406381167867305,79.00916337966919,0.7406381167867305
77,3,AdaBoost (Real),0,0.8,0.7666666666666667,0.8374247492892184,98.56971621513367,0.0
78,3,Logistic Regression (Penalty = L2),0,0.8,0.975,0.9696654978825953,0.5375056266784668,0.9696654978825953
79,3,Naive Bayes,0,0.8,0.8583333333333333,0.8449788989796936,0.2041168212890625,0.8449788989796936
80,3,KNeighbors Classifier,1,0.8,0.875,0.8733874486137887,0.44861865043640137,0.8733874486137887
81,3,SVC Classifier,1,0.8,0.8,0.9931736624740629,0.6715145111083984,0.0
82,3,Decision Tree,1,0.8,0.8333333333333334,0.858412917835186,0.2226276397705078,0.858412917835186
83,3,RandomForest,1,0.8,0.7083333333333334,0.7425705128608029,1.1546931266784668,0.0
84,3,AdaBoost (Discrete),1,0.8,0.325,1.0,91.4577124118805,0.0
85,3,AdaBoost (Real),1,0.8,0.8333333333333334,0.9748970527428702,96.49483680725098,0.0
86,3,Logistic Regression (Penalty = L2),1,0.8,0.9583333333333334,0.9491706774639023,0.6243600845336914,0.9491706774639023
87,3,Naive Bayes,1,0.8,0.7666666666666667,0.6897521778273282,0.19729208946228027,0.6897521778273282
88,3,KNeighbors Classifier,2,0.8,0.923728813559322,0.9085602964160698,0.592416524887085,0.9085602964160698
89,3,SVC Classifier,2,0.8,0.8135593220338984,1.0,0.5653200149536133,0.0
90,3,Decision Tree,2,0.8,0.9152542372881356,0.890696860464673,0.19851160049438477,0.890696860464673
91,3,RandomForest,2,0.8,0.7966101694915254,0.6228654698077587,1.3366031646728516,0.0
92,3,AdaBoost (Discrete),2,0.8,0.923728813559322,0.7922561070581773,79.21752142906189,0.7922561070581773
93,3,AdaBoost (Real),2,0.8,0.8559322033898306,0.9641925040026272,89.2351348400116,0.0
94,3,Logistic Regression (Penalty = L2),2,0.8,0.9661016949152542,0.9609668960083467,0.5774643421173096,0.9609668960083467
95,3,Naive Bayes,2,0.8,0.7711864406779662,0.668834366799643,0.36011838912963867,0.668834366799643
96,4,KNeighbors Classifier,0,0.8,0.9083333333333333,0.9031602944121249,0.37586140632629395,0.9031602944121249
97,4,SVC Classifier,0,0.8,0.8083333333333333,1.0,0.5198328495025635,0.0
98,4,Decision Tree,0,0.8,0.8833333333333333,0.8237744862210329,0.00147247314453125,0.8237744862210329
99,4,RandomForest,0,0.8,0.75,0.8869084711105276,1.1311440467834473,0.0
100,4,AdaBoost (Discrete),0,0.8,0.8416666666666667,0.7627433009661261,80.62012577056885,0.7627433009661261
101,4,AdaBoost (Real),0,0.8,0.7666666666666667,0.8339947279394198,83.9919786453247,0.0
102,4,Logistic Regression (Penalty = L2),0,0.8,0.975,0.9696654978825953,0.496687650680542,0.9696654978825953
103,4,Naive Bayes,0,0.8,0.8333333333333334,0.8176986041493832,0.2115635871887207,0.8176986041493832
104,4,KNeighbors Classifier,1,0.8,0.8833333333333333,0.8676969213225094,0.5874278545379639,0.8676969213225094
105,4,SVC Classifier,1,0.8,0.8083333333333333,1.0,0.427839994430542,0.0
106,4,Decision Tree,1,0.8,0.825,0.8138950774570114,0.23031377792358398,0.8138950774570114
107,4,RandomForest,1,0.8,0.7833333333333333,0.852101981070865,1.0019028186798096,0.0
108,4,AdaBoost (Discrete),1,0.8,0.325,1.0,69.99878454208374,0.0
109,4,AdaBoost (Real),1,0.8,0.8333333333333334,0.9748970527428702,41.997631788253784,0.0
110,4,Logistic Regression (Penalty = L2),1,0.8,0.9666666666666667,0.9577625008329119,0.31253790855407715,0.9577625008329119
111,4,Naive Bayes,1,0.8,0.7833333333333333,0.7102079764751443,0.08815813064575195,0.7102079764751443
112,4,KNeighbors Classifier,2,0.8,0.8898305084745762,0.8491906647824764,0.19101953506469727,0.8491906647824764
113,4,SVC Classifier,2,0.8,0.8135593220338984,1.0,0.19903850555419922,0.0
114,4,Decision Tree,2,0.8,0.864406779661017,0.8305004780825115,0.002048492431640625,0.8305004780825115
115,4,RandomForest,2,0.8,0.8898305084745762,0.9138944456197073,0.3788261413574219,0.0
116,4,AdaBoost (Discrete),2,0.8,0.923728813559322,0.7922561070581773,39.2466459274292,0.7922561070581773
117,4,AdaBoost (Real),2,0.8,0.8559322033898306,0.9641925040026272,49.76883602142334,0.0
118,4,Logistic Regression (Penalty = L2),2,0.8,0.9661016949152542,0.9609668960083467,0.4162735939025879,0.9609668960083467
119,4,Naive Bayes,2,0.8,0.7966101694915254,0.7248326527536443,0.10914993286132812,0.7248326527536443
120,5,KNeighbors Classifier,0,0.8,0.9166666666666666,0.8842808949050823,0.33513760566711426,0.8842808949050823
121,5,SVC Classifier,0,0.8,0.8083333333333333,1.0,0.32279300689697266,0.0
122,5,Decision Tree,0,0.8,0.7083333333333334,0.6774008236164486,0.002217531204223633,0.6774008236164486
123,5,RandomForest,0,0.8,0.9083333333333333,0.9513505792446537,0.6817877292633057,0.0
124,5,AdaBoost (Discrete),0,0.8,0.8166666666666667,0.6848351801484946,44.037909746170044,0.6848351801484946
125,5,AdaBoost (Real),0,0.8,0.775,0.8425944306479403,50.11142039299011,0.0
126,5,Logistic Regression (Penalty = L2),0,0.8,0.9916666666666667,0.9893012232339632,0.27069854736328125,0.9893012232339632
127,5,Naive Bayes,0,0.8,0.8166666666666667,0.793224979327062,0.10936403274536133,0.793224979327062
128,5,KNeighbors Classifier,1,0.8,0.8666666666666667,0.8378193130017028,0.11551308631896973,0.8378193130017028
129,5,SVC Classifier,1,0.8,0.8083333333333333,1.0,0.3449091911315918,0.0
130,5,Decision Tree,1,0.8,0.875,0.8703911622296845,0.12636542320251465,0.8703911622296845
131,5,RandomForest,1,0.8,0.8,0.9894164999496223,0.6611323356628418,0.0
132,5,AdaBoost (Discrete),1,0.8,0.325,1.0,44.510146617889404,0.0
133,5,AdaBoost (Real),1,0.8,0.8333333333333334,0.9748970527428702,49.00626564025879,0.0
134,5,Logistic Regression (Penalty = L2),1,0.8,0.95,0.944846175074216,0.29908061027526855,0.944846175074216
135,5,Naive Bayes,1,0.8,0.7916666666666666,0.7190343853617875,0.23835444450378418,0.7190343853617875
136,5,KNeighbors Classifier,2,0.8,0.8389830508474576,0.7437557826838987,0.3791382312774658,0.7437557826838987
137,5,SVC Classifier,2,0.8,0.8135593220338984,1.0,0.359328031539917,0.0
138,5,Decision Tree,2,0.8,0.940677966101695,0.890696860464673,0.0022220611572265625,0.890696860464673
139,5,RandomForest,2,0.8,0.8728813559322034,0.8476091015362177,0.7216811180114746,0.0
140,5,AdaBoost (Discrete),2,0.8,0.9322033898305084,0.8476452619160645,49.31957292556763,0.8476452619160645
141,5,AdaBoost (Real),2,0.8,0.9661016949152542,0.9370735665844807,51.99980688095093,0.9370735665844807
142,5,Logistic Regression (Penalty = L2),2,0.8,0.9576271186440678,0.9491706774639023,0.33759617805480957,0.9491706774639023
143,5,Naive Bayes,2,0.8,0.8050847457627118,0.7376731869184014,0.11697268486022949,0.7376731869184014
144,6,KNeighbors Classifier,0,0.8,0.8916666666666667,0.8817175374435696,0.3420827388763428,0.8817175374435696
145,6,SVC Classifier,0,0.8,0.8083333333333333,1.0,0.3478548526763916,0.0
146,6,Decision Tree,0,0.8,0.925,0.8793887849921136,0.002190828323364258,0.8793887849921136
147,6,RandomForest,0,0.8,0.7916666666666666,0.7887904005583529,0.8013029098510742,0.0
148,6,AdaBoost (Discrete),0,0.8,0.825,0.7481595356833938,47.35328817367554,0.7481595356833938
149,6,AdaBoost (Real),0,0.8,0.7666666666666667,0.8374247492892184,51.69752240180969,0.0
150,6,Logistic Regression (Penalty = L2),0,0.8,0.975,0.9696654978825953,0.2762720584869385,0.9696654978825953
151,6,Naive Bayes,0,0.8,0.875,0.8669691861662548,0.11364340782165527,0.8669691861662548
152,6,KNeighbors Classifier,1,0.8,0.9083333333333333,0.8963939371129591,0.31500911712646484,0.8963939371129591
153,6,SVC Classifier,1,0.8,0.8,0.9931736624740629,0.33596324920654297,0.0
154,6,Decision Tree,1,0.8,0.9083333333333333,0.9254867502050457,0.10219144821166992,0.9254867502050457
155,6,RandomForest,1,0.8,0.8333333333333334,0.956352499790037,0.6613008975982666,0.0
156,6,AdaBoost (Discrete),1,0.8,0.325,1.0,44.818296670913696,0.0
157,6,AdaBoost (Real),1,0.8,0.8333333333333334,0.9748970527428702,54.927013874053955,0.0
158,6,Logistic Regression (Penalty = L2),1,0.8,0.975,0.9696654978825953,0.34520912170410156,0.9696654978825953
159,6,Naive Bayes,1,0.8,0.7916666666666666,0.7190343853617875,0.20946025848388672,0.7190343853617875
160,6,KNeighbors Classifier,2,0.8,0.940677966101695,0.9277124071408973,0.343721866607666,0.9277124071408973
161,6,SVC Classifier,2,0.8,0.8135593220338984,1.0,0.33674049377441406,0.0
162,6,Decision Tree,2,0.8,0.9067796610169492,0.8866387697618953,0.10914444923400879,0.8866387697618953
163,6,RandomForest,2,0.8,0.847457627118644,0.6676127396202685,0.9014370441436768,0.6676127396202685
164,6,AdaBoost (Discrete),2,0.8,0.923728813559322,0.7922561070581773,47.70666432380676,0.7922561070581773
165,6,AdaBoost (Real),2,0.8,0.8559322033898306,0.9641925040026272,50.532472133636475,0.0
166,6,Logistic Regression (Penalty = L2),2,0.8,0.9661016949152542,0.9609668960083467,0.19157981872558594,0.9609668960083467
167,6,Naive Bayes,2,0.8,0.788135593220339,0.6995416035848818,0.1094965934753418,0.6995416035848818
168,7,KNeighbors Classifier,0,0.8,0.8916666666666667,0.882948134154499,0.35466861724853516,0.882948134154499
169,7,SVC Classifier,0,0.8,0.8083333333333333,1.0,0.3237123489379883,0.0
170,7,Decision Tree,0,0.8,0.825,0.7834878538860902,0.1064748764038086,0.7834878538860902
171,7,RandomForest,0,0.8,0.7833333333333333,0.6165083688432642,0.6460659503936768,0.0
172,7,AdaBoost (Discrete),0,0.8,0.8333333333333334,0.698184572956167,45.055243253707886,0.698184572956167
173,7,AdaBoost (Real),0,0.8,0.7666666666666667,0.8339947279394198,50.6113862991333,0.0
174,7,Logistic Regression (Penalty = L2),0,0.8,0.975,0.9696654978825953,0.2941882610321045,0.9696654978825953
175,7,Naive Bayes,0,0.8,0.7833333333333333,0.743791857938213,0.11407184600830078,0.743791857938213
176,7,KNeighbors Classifier,1,0.8,0.8833333333333333,0.8561241758291369,0.22101402282714844,0.8561241758291369
177,7,SVC Classifier,1,0.8,0.8083333333333333,1.0,0.3586890697479248,0.0
178,7,Decision Tree,1,0.8,0.8333333333333334,0.8566742080849569,0.11389613151550293,0.8566742080849569
179,7,RandomForest,1,0.8,0.7833333333333333,0.9584146563694087,0.6963658332824707,0.0
180,7,AdaBoost (Discrete),1,0.8,0.325,1.0,45.02731370925903,0.0
181,7,AdaBoost (Real),1,0.8,0.8333333333333334,0.9748970527428702,45.91477346420288,0.0
182,7,Logistic Regression (Penalty = L2),1,0.8,0.9416666666666667,0.9277124071408973,0.24750542640686035,0.9277124071408973
183,7,Naive Bayes,1,0.8,0.775,0.6940519131061853,0.1019747257232666,0.6940519131061853
184,7,KNeighbors Classifier,2,0.8,0.8728813559322034,0.8056436946512944,0.2918393611907959,0.8056436946512944
185,7,SVC Classifier,2,0.8,0.8135593220338984,1.0,0.28842663764953613,0.0
186,7,Decision Tree,2,0.8,0.940677966101695,0.9109110804099422,0.0014314651489257812,0.9109110804099422
187,7,RandomForest,2,0.8,0.8983050847457628,0.9311499150948377,0.7370719909667969,0.0
188,7,AdaBoost (Discrete),2,0.8,0.9322033898305084,0.8476452619160645,39.94349765777588,0.8476452619160645
189,7,AdaBoost (Real),2,0.8,0.8559322033898306,0.9641925040026272,44.28150200843811,0.0
190,7,Logistic Regression (Penalty = L2),2,0.8,0.9491525423728814,0.9401714290217257,0.1993722915649414,0.9401714290217257
191,7,Naive Bayes,2,0.8,0.7796610169491526,0.6995416035848818,0.09380245208740234,0.6995416035848818
192,8,KNeighbors Classifier,0,0.8,0.8833333333333333,0.8573592747025486,0.28326988220214844,0.8573592747025486
193,8,SVC Classifier,0,0.8,0.8083333333333333,1.0,0.2117595672607422,0.0
194,8,Decision Tree,0,0.8,0.8666666666666667,0.8120188587709438,0.0014536380767822266,0.8120188587709438
195,8,RandomForest,0,0.8,0.8083333333333333,1.0,0.5921623706817627,0.0
196,8,AdaBoost (Discrete),0,0.8,0.8416666666666667,0.7627433009661261,37.63003659248352,0.7627433009661261
197,8,AdaBoost (Real),0,0.8,0.7666666666666667,0.8374247492892184,40.86633062362671,0.0
198,8,Logistic Regression (Penalty = L2),0,0.8,0.975,0.9696654978825953,0.14826154708862305,0.9696654978825953
199,8,Naive Bayes,0,0.8,0.8666666666666667,0.855480230293932,0.10107421875,0.855480230293932
200,8,KNeighbors Classifier,1,0.8,0.9083333333333333,0.9025134959547746,0.28269052505493164,0.9025134959547746
201,8,SVC Classifier,1,0.8,0.8,0.9931736624740629,0.19443392753601074,0.0
202,8,Decision Tree,1,0.8,0.875,0.8550880777591062,0.10634684562683105,0.8550880777591062
203,8,RandomForest,1,0.8,0.8083333333333333,1.0,0.49089646339416504,0.0
204,8,AdaBoost (Discrete),1,0.8,0.325,1.0,37.01419973373413,0.0
205,8,AdaBoost (Real),1,0.8,0.8333333333333334,0.9748970527428702,43.09811615943909,0.0
206,8,Logistic Regression (Penalty = L2),1,0.8,0.9666666666666667,0.9577625008329119,0.2465195655822754,0.9577625008329119
207,8,Naive Bayes,1,0.8,0.7666666666666667,0.6907068574524275,0.09790563583374023,0.6907068574524275
208,8,KNeighbors Classifier,2,0.8,0.923728813559322,0.8932038050509461,0.1931464672088623,0.8932038050509461
209,8,SVC Classifier,2,0.8,0.8135593220338984,1.0,0.2912740707397461,0.0
210,8,Decision Tree,2,0.8,0.9322033898305084,0.9207621086651762,0.002328157424926758,0.9207621086651762
211,8,RandomForest,2,0.8,0.8559322033898306,0.8299350636914464,0.7466747760772705,0.0
212,8,AdaBoost (Discrete),2,0.8,0.923728813559322,0.7922561070581773,37.227697134017944,0.7922561070581773
213,8,AdaBoost (Real),2,0.8,0.8559322033898306,0.9641925040026272,40.41276693344116,0.0
214,8,Logistic Regression (Penalty = L2),2,0.8,0.9661016949152542,0.9609668960083467,0.14497900009155273,0.9609668960083467
215,8,Naive Bayes,2,0.8,0.7711864406779662,0.668834366799643,0.08963918685913086,0.668834366799643
216,9,KNeighbors Classifier,0,0.8,0.8833333333333333,0.8690332880554825,0.19759011268615723,0.8690332880554825
217,9,SVC Classifier,0,0.8,0.8083333333333333,1.0,0.22102952003479004,0.0
218,9,Decision Tree,0,0.8,0.8,0.6984267879840941,0.08957719802856445,0.6984267879840941
219,9,RandomForest,0,0.8,0.7416666666666667,0.5927245795624917,0.6092634201049805,0.0
220,9,AdaBoost (Discrete),0,0.8,0.8166666666666667,0.6848351801484946,35.63637137413025,0.6848351801484946
221,9,AdaBoost (Real),0,0.8,0.7666666666666667,0.8374247492892184,40.25193548202515,0.0
222,9,Logistic Regression (Penalty = L2),0,0.8,0.9916666666666667,0.9893012232339632,0.2496042251586914,0.9893012232339632
223,9,Naive Bayes,0,0.8,0.8,0.7302596816677173,0.1852436065673828,0.7302596816677173
224,9,KNeighbors Classifier,1,0.8,0.9083333333333333,0.9025134959547746,0.28003764152526855,0.9025134959547746
225,9,SVC Classifier,1,0.8,0.8083333333333333,1.0,0.2871246337890625,0.0
226,9,Decision Tree,1,0.8,0.8833333333333333,0.8754854069267433,0.002034425735473633,0.8754854069267433
227,9,RandomForest,1,0.8,0.7166666666666667,0.7476743906106103,0.5500938892364502,0.0
228,9,AdaBoost (Discrete),1,0.8,0.325,1.0,35.69265341758728,0.0
229,9,AdaBoost (Real),1,0.8,0.8333333333333334,0.9748970527428702,42.388121128082275,0.0
230,9,Logistic Regression (Penalty = L2),1,0.8,0.95,0.9401714290217257,0.2196063995361328,0.9401714290217257
231,9,Naive Bayes,1,0.8,0.7666666666666667,0.6897521778273282,0.0798957347869873,0.6897521778273282
232,9,KNeighbors Classifier,2,0.8,0.8983050847457628,0.8712905617352432,0.19916486740112305,0.8712905617352432
233,9,SVC Classifier,2,0.8,0.8135593220338984,1.0,0.19226574897766113,0.0
234,9,Decision Tree,2,0.8,0.923728813559322,0.899780574553937,0.002083301544189453,0.899780574553937
235,9,RandomForest,2,0.8,0.711864406779661,0.7071067811865476,0.6264266967773438,0.0
236,9,AdaBoost (Discrete),2,0.8,0.9322033898305084,0.8476452619160645,37.87858843803406,0.8476452619160645
237,9,AdaBoost (Real),2,0.8,0.864406779661017,1.0,45.357388973236084,0.0
238,9,Logistic Regression (Penalty = L2),2,0.8,0.9661016949152542,0.9577625008329119,0.3046450614929199,0.9577625008329119
239,9,Naive Bayes,2,0.8,0.7796610169491526,0.6795436542431362,0.17199063301086426,0.6795436542431362
240,10,KNeighbors Classifier,0,0.8,0.8666666666666667,0.8496681409970417,0.39837121963500977,0.8496681409970417
241,10,SVC Classifier,0,0.8,0.8083333333333333,1.0,0.41061997413635254,0.0
242,10,Decision Tree,0,0.8,0.8833333333333333,0.7696928889392395,0.0015265941619873047,0.7696928889392395
243,10,RandomForest,0,0.8,0.7666666666666667,0.9247332419808177,0.7004594802856445,0.0
244,10,AdaBoost (Discrete),0,0.8,0.825,0.7481595356833938,40.452637672424316,0.7481595356833938
245,10,AdaBoost (Real),0,0.8,0.8,0.8532982640620798,45.89048767089844,0.0
246,10,Logistic Regression (Penalty = L2),0,0.8,0.975,0.9696654978825953,0.34918212890625,0.9696654978825953
247,10,Naive Bayes,0,0.8,0.8,0.7703780795498101,0.12079453468322754,0.7703780795498101
248,10,KNeighbors Classifier,1,0.8,0.8833333333333333,0.8663141271331594,0.4464378356933594,0.8663141271331594
249,10,SVC Classifier,1,0.8,0.8083333333333333,1.0,0.32053136825561523,0.0
250,10,Decision Tree,1,0.8,0.8666666666666667,0.8566742080849569,0.0015528202056884766,0.8566742080849569
251,10,RandomForest,1,0.8,0.7833333333333333,0.9790825228441276,0.7386994361877441,0.0
252,10,AdaBoost (Discrete),1,0.8,0.325,1.0,45.03079557418823,0.0
253,10,AdaBoost (Real),1,0.8,0.8333333333333334,0.9748970527428702,46.27450776100159,0.0
254,10,Logistic Regression (Penalty = L2),1,0.8,0.9416666666666667,0.9381678405381247,0.25333070755004883,0.9381678405381247
255,10,Naive Bayes,1,0.8,0.7666666666666667,0.683113982346698,0.19016695022583008,0.683113982346698
256,10,KNeighbors Classifier,2,0.8,0.8559322033898306,0.8032279079814331,0.1892383098602295,0.8032279079814331
257,10,SVC Classifier,2,0.8,0.8135593220338984,1.0,0.3243415355682373,0.0
258,10,Decision Tree,2,0.8,0.864406779661017,0.8611603652142475,0.10234808921813965,0.8611603652142475
259,10,RandomForest,2,0.8,0.8050847457627118,0.9839948356327152,0.5771949291229248,0.0
260,10,AdaBoost (Discrete),2,0.8,0.923728813559322,0.7922561070581773,39.85568928718567,0.7922561070581773
261,10,AdaBoost (Real),2,0.8,0.8559322033898306,0.9641925040026272,48.48468470573425,0.0
262,10,Logistic Regression (Penalty = L2),2,0.8,0.9576271186440678,0.9518558056141587,0.38161325454711914,0.9518558056141587
263,10,Naive Bayes,2,0.8,0.7627118644067796,0.6740030772986388,0.11246776580810547,0.6740030772986388
264,11,KNeighbors Classifier,0,0.8,0.875,0.8539061940747412,0.32207751274108887,0.8539061940747412
265,11,SVC Classifier,0,0.8,0.8083333333333333,1.0,0.4180867671966553,0.0
266,11,Decision Tree,0,0.8,0.7833333333333333,0.615623768987206,0.002396106719970703,0.615623768987206
267,11,RandomForest,0,0.8,0.8,0.6358114348177182,0.6274099349975586,0.0
268,11,AdaBoost (Discrete),0,0.8,0.8166666666666667,0.7406381167867305,38.55180835723877,0.7406381167867305
269,11,AdaBoost (Real),0,0.8,0.8,0.8532982640620798,45.27773141860962,0.0
270,11,Logistic Regression (Penalty = L2),0,0.8,0.975,0.9696654978825953,0.23085379600524902,0.9696654978825953
271,11,Naive Bayes,0,0.8,0.7833333333333333,0.743791857938213,0.10874462127685547,0.743791857938213
272,11,KNeighbors Classifier,1,0.8,0.875,0.8526614251383757,0.26317596435546875,0.8526614251383757
273,11,SVC Classifier,1,0.8,0.8083333333333333,1.0,0.2798347473144531,0.0
274,11,Decision Tree,1,0.8,0.875,0.8539061940747412,0.002508878707885742,0.8539061940747412
275,11,RandomForest,1,0.8,0.8416666666666667,0.9665910224658814,0.7105512619018555,0.0
276,11,AdaBoost (Discrete),1,0.8,0.325,1.0,36.6168098449707,0.0
277,11,AdaBoost (Real),1,0.8,0.8333333333333334,0.9748970527428702,40.52795195579529,0.0
278,11,Logistic Regression (Penalty = L2),1,0.8,0.9416666666666667,0.9381678405381247,0.2727091312408447,0.9381678405381247
279,11,Naive Bayes,1,0.8,0.7666666666666667,0.683113982346698,0.10050177574157715,0.683113982346698
280,11,KNeighbors Classifier,2,0.8,0.8559322033898306,0.8032279079814331,0.33501434326171875,0.8032279079814331
281,11,SVC Classifier,2,0.8,0.8135593220338984,1.0,0.26036977767944336,0.0
282,11,Decision Tree,2,0.8,0.9152542372881356,0.9075342504782565,0.001638174057006836,0.9075342504782565
283,11,RandomForest,2,0.8,0.8135593220338984,0.5099122256638764,0.5164289474487305,0.5099122256638764
284,11,AdaBoost (Discrete),2,0.8,0.923728813559322,0.7922561070581773,33.836488008499146,0.7922561070581773
285,11,AdaBoost (Real),2,0.8,0.864406779661017,1.0,38.238858699798584,0.0
286,11,Logistic Regression (Penalty = L2),2,0.8,0.9576271186440678,0.9518558056141587,0.2616267204284668,0.9518558056141587
287,11,Naive Bayes,2,0.8,0.7627118644067796,0.6740030772986388,0.10349035263061523,0.6740030772986388
288,12,KNeighbors Classifier,0,0.8,0.9333333333333333,0.9385354802851082,0.18773293495178223,0.9385354802851082
289,12,SVC Classifier,0,0.8,0.8083333333333333,1.0,0.2799508571624756,0.0
290,12,Decision Tree,0,0.8,0.8583333333333333,0.7615703829810281,0.0013353824615478516,0.7615703829810281
291,12,RandomForest,0,0.8,0.7916666666666666,0.9740037464252967,0.4401702880859375,0.0
292,12,AdaBoost (Discrete),0,0.8,0.825,0.6922413154507298,32.110952854156494,0.6922413154507298
293,12,AdaBoost (Real),0,0.8,0.7666666666666667,0.8374247492892184,35.879196643829346,0.0
294,12,Logistic Regression (Penalty = L2),0,0.8,0.9916666666666667,0.9893012232339632,0.16657018661499023,0.9893012232339632
295,12,Naive Bayes,0,0.8,0.8083333333333333,0.7527906179566443,0.0961148738861084,0.7527906179566443
296,12,KNeighbors Classifier,1,0.8,0.8916666666666667,0.8803718551324602,0.21129083633422852,0.8803718551324602
297,12,SVC Classifier,1,0.8,0.8083333333333333,1.0,0.17232060432434082,0.0
298,12,Decision Tree,1,0.8,0.8666666666666667,0.8164229342379251,0.0014965534210205078,0.8164229342379251
299,12,RandomForest,1,0.8,0.775,0.9687204029142829,0.5246801376342773,0.0
300,12,AdaBoost (Discrete),1,0.8,0.325,1.0,32.188273191452026,0.0
301,12,AdaBoost (Real),1,0.8,0.8333333333333334,0.9748970527428702,35.62083959579468,0.0
302,12,Logistic Regression (Penalty = L2),1,0.8,0.9416666666666667,0.9307196706532547,0.15507912635803223,0.9307196706532547
303,12,Naive Bayes,1,0.8,0.7833333333333333,0.7102079764751443,0.10031723976135254,0.7102079764751443
304,12,KNeighbors Classifier,2,0.8,0.9067796610169492,0.8411393438255611,0.17070865631103516,0.8411393438255611
305,12,SVC Classifier,2,0.8,0.8135593220338984,1.0,0.16835427284240723,0.0
306,12,Decision Tree,2,0.8,0.9322033898305084,0.8705976852585463,0.09405112266540527,0.8705976852585463
307,12,RandomForest,2,0.8,0.8135593220338984,1.0,0.401181697845459,0.0
308,12,AdaBoost (Discrete),2,0.8,0.9322033898305084,0.8476452619160645,31.58340620994568,0.8476452619160645
309,12,AdaBoost (Real),2,0.8,0.8559322033898306,0.9641925040026272,34.862788438797,0.0
310,12,Logistic Regression (Penalty = L2),2,0.8,0.9661016949152542,0.9577625008329119,0.15255498886108398,0.9577625008329119
311,12,Naive Bayes,2,0.8,0.7966101694915254,0.7107425712434663,0.0796663761138916,0.7107425712434663
