,feat_set_id,classifier,fold_id,feat_th,score,geo_score,exec_t,geo_score_woz
0,0,KNeighbors Classifier,0,0.2,0.6203703703703703,0.6024899046367599,0.04313540458679199,0.6024899046367599
1,0,SVC Classifier,0,0.2,0.46296296296296297,1.0,0.10133981704711914,0.0
2,0,Decision Tree,0,0.2,0.6759259259259259,0.6875965181003809,0.002147197723388672,0.6875965181003809
3,0,RandomForest,0,0.2,0.6759259259259259,0.5435126509760763,0.22455596923828125,0.5435126509760763
4,0,AdaBoost (Discrete),0,0.2,0.5740740740740741,0.6458583995678032,17.68362069129944,0.6458583995678032
5,0,AdaBoost (Real),0,0.2,0.4166666666666667,0.5143686723610401,17.807079076766968,0.5143686723610401
6,0,Logistic Regression (Penalty = L2),0,0.2,0.6574074074074074,0.4166882336195794,0.07897591590881348,0.4166882336195794
7,0,Naive Bayes,0,0.2,0.7037037037037037,0.6545252694718898,0.030890464782714844,0.6545252694718898
8,0,KNeighbors Classifier,1,0.2,0.5607476635514018,0.5828351692684963,0.032491445541381836,0.5828351692684963
9,0,SVC Classifier,1,0.2,0.4672897196261682,1.0,0.0022923946380615234,0.0
10,0,Decision Tree,1,0.2,0.5420560747663551,0.5563677927517559,0.0019333362579345703,0.5563677927517559
11,0,RandomForest,1,0.2,0.6915887850467289,0.8685215189890411,0.21075963973999023,0.0
12,0,AdaBoost (Discrete),1,0.2,0.5420560747663551,0.5740682331817707,14.75445818901062,0.5740682331817707
13,0,AdaBoost (Real),1,0.2,0.48598130841121495,0.5491004867761125,16.817148685455322,0.5491004867761125
14,0,Logistic Regression (Penalty = L2),1,0.2,0.6822429906542056,0.8682536221432402,0.03541731834411621,0.0
15,0,Naive Bayes,1,0.2,0.7009345794392523,0.6872123704883358,0.03238701820373535,0.6872123704883358
16,0,KNeighbors Classifier,2,0.2,0.6698113207547169,0.688376549437407,0.0322268009185791,0.688376549437407
17,0,SVC Classifier,2,0.2,0.4716981132075472,1.0,0.035271406173706055,0.0
18,0,Decision Tree,2,0.2,0.7075471698113207,0.6914677587644238,0.002175569534301758,0.6914677587644238
19,0,RandomForest,2,0.2,0.660377358490566,0.8365612181419207,0.3000481128692627,0.0
20,0,AdaBoost (Discrete),2,0.2,0.6320754716981132,0.6425143667646755,17.86347270011902,0.6425143667646755
21,0,AdaBoost (Real),2,0.2,0.4716981132075472,0.5293955231187248,20.8186194896698,0.5293955231187248
22,0,Logistic Regression (Penalty = L2),2,0.2,0.6509433962264151,0.8230659353832263,0.03577709197998047,0.0
23,0,Naive Bayes,2,0.2,0.7641509433962265,0.6828764293194821,0.0031898021697998047,0.6828764293194821
24,1,KNeighbors Classifier,0,0.2,0.6203703703703703,0.6024899046367599,0.04397988319396973,0.6024899046367599
25,1,SVC Classifier,0,0.2,0.46296296296296297,1.0,0.0024242401123046875,0.0
26,1,Decision Tree,0,0.2,0.5833333333333334,0.5631664797575887,0.04207777976989746,0.5631664797575887
27,1,RandomForest,0,0.2,0.6111111111111112,0.5051550219868052,0.3517131805419922,0.5051550219868052
28,1,AdaBoost (Discrete),0,0.2,0.5740740740740741,0.5380733538954946,17.36157536506653,0.5380733538954946
29,1,AdaBoost (Real),0,0.2,0.6481481481481481,0.5699586896347666,18.652985095977783,0.5699586896347666
30,1,Logistic Regression (Penalty = L2),0,0.2,0.6018518518518519,0.4884279554543712,0.035668134689331055,0.4884279554543712
31,1,Naive Bayes,0,0.2,0.5925925925925926,0.6051617657584163,0.03987574577331543,0.6051617657584163
32,1,KNeighbors Classifier,1,0.2,0.6448598130841121,0.6709583795563703,0.03933572769165039,0.6709583795563703
33,1,SVC Classifier,1,0.2,0.4672897196261682,1.0,0.002295970916748047,0.0
34,1,Decision Tree,1,0.2,0.5514018691588785,0.5706745777055999,0.0020723342895507812,0.5706745777055999
35,1,RandomForest,1,0.2,0.6448598130841121,0.841725307059302,0.34615540504455566,0.0
36,1,AdaBoost (Discrete),1,0.2,0.5514018691588785,0.5848526545462039,18.492096662521362,0.5848526545462039
37,1,AdaBoost (Real),1,0.2,0.6542056074766355,0.6702550152565633,20.611316442489624,0.6702550152565633
38,1,Logistic Regression (Penalty = L2),1,0.2,0.7102803738317757,0.6728066984491194,0.043837547302246094,0.6728066984491194
39,1,Naive Bayes,1,0.2,0.6915887850467289,0.7226568811456053,0.04233264923095703,0.7226568811456053
40,1,KNeighbors Classifier,2,0.2,0.6320754716981132,0.6463639642598238,0.04378771781921387,0.6463639642598238
41,1,SVC Classifier,2,0.2,0.4716981132075472,1.0,0.0034177303314208984,0.0
42,1,Decision Tree,2,0.2,0.5849056603773585,0.6160140576482046,0.0020973682403564453,0.6160140576482046
43,1,RandomForest,2,0.2,0.6792452830188679,0.6972606648911136,0.2227165699005127,0.6972606648911136
44,1,AdaBoost (Discrete),2,0.2,0.5943396226415094,0.6421141351518171,17.651963233947754,0.6421141351518171
45,1,AdaBoost (Real),2,0.2,0.5849056603773585,0.6088913108199154,21.214657068252563,0.6088913108199154
46,1,Logistic Regression (Penalty = L2),2,0.2,0.6981132075471698,0.6870489124977599,0.046610116958618164,0.6870489124977599
47,1,Naive Bayes,2,0.2,0.6320754716981132,0.6602195804079635,0.04783892631530762,0.6602195804079635
48,2,KNeighbors Classifier,0,0.2,0.6759259259259259,0.6148785430372105,0.0473020076751709,0.6148785430372105
49,2,SVC Classifier,0,0.2,0.46296296296296297,1.0,0.0551297664642334,0.0
50,2,Decision Tree,0,0.2,0.7037037037037037,0.6097541084551162,0.04616689682006836,0.6097541084551162
51,2,RandomForest,0,0.2,0.7592592592592593,0.5554950696675856,0.3439197540283203,0.0
52,2,AdaBoost (Discrete),0,0.2,0.6574074074074074,0.5825300401051168,19.995543479919434,0.0
53,2,AdaBoost (Real),0,0.2,0.7222222222222222,0.6312897104286137,27.38225030899048,0.6312897104286137
54,2,Logistic Regression (Penalty = L2),0,0.2,0.7407407407407407,0.5432824092254,0.06684613227844238,0.0
55,2,Naive Bayes,0,0.2,0.7962962962962963,0.7214707907386488,0.06653165817260742,0.7214707907386488
56,2,KNeighbors Classifier,1,0.2,0.7383177570093458,0.601230775697673,0.06836104393005371,0.601230775697673
57,2,SVC Classifier,1,0.2,0.4672897196261682,1.0,0.0675959587097168,0.0
58,2,Decision Tree,1,0.2,0.7102803738317757,0.6634080034508691,0.001972198486328125,0.6634080034508691
59,2,RandomForest,1,0.2,0.7570093457943925,0.9692233691951198,0.4822816848754883,0.0
60,2,AdaBoost (Discrete),1,0.2,0.7383177570093458,0.43668354428478123,27.438621520996094,0.43668354428478123
61,2,AdaBoost (Real),1,0.2,0.7570093457943925,0.6428283105800281,30.638089656829834,0.6428283105800281
62,2,Logistic Regression (Penalty = L2),1,0.2,0.7570093457943925,0.5055147099070432,0.06765198707580566,0.0
63,2,Naive Bayes,1,0.2,0.8598130841121495,0.7572319842560101,0.07179117202758789,0.7572319842560101
64,2,KNeighbors Classifier,2,0.2,0.7358490566037735,0.7077487308091999,0.07159233093261719,0.7077487308091999
65,2,SVC Classifier,2,0.2,0.4716981132075472,1.0,0.0023894309997558594,0.0
66,2,Decision Tree,2,0.2,0.7547169811320755,0.7030871244182045,0.0012602806091308594,0.7030871244182045
67,2,RandomForest,2,0.2,0.7735849056603774,0.5588597702164573,0.5574688911437988,0.0
68,2,AdaBoost (Discrete),2,0.2,0.7452830188679245,0.7115642260833605,30.87624478340149,0.7115642260833605
69,2,AdaBoost (Real),2,0.2,0.7830188679245284,0.7102992180127421,35.55165410041809,0.7102992180127421
70,2,Logistic Regression (Penalty = L2),2,0.2,0.7641509433962265,0.507757798482881,0.07935738563537598,0.0
71,2,Naive Bayes,2,0.2,0.7735849056603774,0.6834466815318615,0.08781170845031738,0.6834466815318615
72,3,KNeighbors Classifier,0,0.2,0.5277777777777778,0.5054969206745503,0.07599639892578125,0.5054969206745503
73,3,SVC Classifier,0,0.2,0.46296296296296297,1.0,0.07931900024414062,0.0
74,3,Decision Tree,0,0.2,0.5648148148148148,0.4973316569054668,0.0655982494354248,0.4973316569054668
75,3,RandomForest,0,0.2,0.6481481481481481,0.8288491160501965,0.5657143592834473,0.0
76,3,AdaBoost (Discrete),0,0.2,0.5277777777777778,0.4949232003839766,33.530401945114136,0.4949232003839766
77,3,AdaBoost (Real),0,0.2,0.5740740740740741,0.49346107746612433,40.102187156677246,0.49346107746612433
78,3,Logistic Regression (Penalty = L2),0,0.2,0.6203703703703703,0.7810497525992064,0.1029672622680664,0.0
79,3,Naive Bayes,0,0.2,0.6111111111111112,0.8080678730723118,0.10337424278259277,0.0
80,3,KNeighbors Classifier,1,0.2,0.514018691588785,0.5404800619228137,0.10410404205322266,0.5404800619228137
81,3,SVC Classifier,1,0.2,0.4672897196261682,1.0,0.09540724754333496,0.0
82,3,Decision Tree,1,0.2,0.5420560747663551,0.5794383693420786,0.0745551586151123,0.5794383693420786
83,3,RandomForest,1,0.2,0.6542056074766355,0.8532572237201199,0.8382875919342041,0.0
84,3,AdaBoost (Discrete),1,0.2,0.48598130841121495,0.5209224607559049,41.64704132080078,0.5209224607559049
85,3,AdaBoost (Real),1,0.2,0.5607476635514018,0.5935557301892008,46.86643195152283,0.5935557301892008
86,3,Logistic Regression (Penalty = L2),1,0.2,0.6542056074766355,0.8431485855681351,0.09502267837524414,0.0
87,3,Naive Bayes,1,0.2,0.6448598130841121,0.8501939370835523,0.10249662399291992,0.0
88,3,KNeighbors Classifier,2,0.2,0.5943396226415094,0.5673852500666509,0.1039886474609375,0.5673852500666509
89,3,SVC Classifier,2,0.2,0.4716981132075472,1.0,0.09919214248657227,0.0
90,3,Decision Tree,2,0.2,0.5754716981132075,0.49227746805221545,0.0019655227661132812,0.49227746805221545
91,3,RandomForest,2,0.2,0.6226415094339622,0.8230659353832263,0.6072232723236084,0.0
92,3,AdaBoost (Discrete),2,0.2,0.5377358490566038,0.4848726899487158,39.727633237838745,0.4848726899487158
93,3,AdaBoost (Real),2,0.2,0.330188679245283,0.3653556657482992,40.37796449661255,0.3653556657482992
94,3,Logistic Regression (Penalty = L2),2,0.2,0.6509433962264151,0.8371381570959275,0.09480071067810059,0.0
95,3,Naive Bayes,2,0.2,0.6226415094339622,0.8230659353832263,0.09515190124511719,0.0
96,6,KNeighbors Classifier,0,0.2,0.5277777777777778,0.5054969206745503,0.002184629440307617,0.5054969206745503
97,6,SVC Classifier,0,0.2,0.46296296296296297,1.0,0.07895493507385254,0.0
98,6,Decision Tree,0,0.2,0.5648148148148148,0.4973316569054668,0.001603841781616211,0.4973316569054668
99,6,RandomForest,0,0.2,0.6481481481481481,0.8288491160501965,0.578171968460083,0.0
100,6,AdaBoost (Discrete),0,0.2,0.5277777777777778,0.4949232003839766,42.39157319068909,0.4949232003839766
101,6,AdaBoost (Real),0,0.2,0.5740740740740741,0.49346107746612433,47.98115515708923,0.49346107746612433
102,6,Logistic Regression (Penalty = L2),0,0.2,0.6203703703703703,0.7810497525992064,0.10297918319702148,0.0
103,6,Naive Bayes,0,0.2,0.6111111111111112,0.8080678730723118,0.10319185256958008,0.0
104,6,KNeighbors Classifier,1,0.2,0.514018691588785,0.5404800619228137,0.1135566234588623,0.5404800619228137
105,6,SVC Classifier,1,0.2,0.4672897196261682,1.0,0.11196637153625488,0.0
106,6,Decision Tree,1,0.2,0.5420560747663551,0.5794383693420786,0.10619139671325684,0.5794383693420786
107,6,RandomForest,1,0.2,0.6542056074766355,0.8532572237201199,0.7416164875030518,0.0
108,6,AdaBoost (Discrete),1,0.2,0.48598130841121495,0.5209224607559049,43.246502161026,0.5209224607559049
109,6,AdaBoost (Real),1,0.2,0.5607476635514018,0.5935557301892008,48.517308712005615,0.5935557301892008
110,6,Logistic Regression (Penalty = L2),1,0.2,0.6542056074766355,0.8431485855681351,0.10757231712341309,0.0
111,6,Naive Bayes,1,0.2,0.6448598130841121,0.8501939370835523,0.10770726203918457,0.0
112,6,KNeighbors Classifier,2,0.2,0.5943396226415094,0.5673852500666509,0.0023474693298339844,0.5673852500666509
113,6,SVC Classifier,2,0.2,0.4716981132075472,1.0,0.11144423484802246,0.0
114,6,Decision Tree,2,0.2,0.5754716981132075,0.49227746805221545,0.002030611038208008,0.49227746805221545
115,6,RandomForest,2,0.2,0.6226415094339622,0.8230659353832263,0.7291274070739746,0.0
116,6,AdaBoost (Discrete),2,0.2,0.5377358490566038,0.4848726899487158,45.4998676776886,0.4848726899487158
117,6,AdaBoost (Real),2,0.2,0.330188679245283,0.3653556657482992,48.07640790939331,0.3653556657482992
118,6,Logistic Regression (Penalty = L2),2,0.2,0.6509433962264151,0.8371381570959275,0.11554145812988281,0.0
119,6,Naive Bayes,2,0.2,0.6226415094339622,0.8230659353832263,0.10359907150268555,0.0
120,7,KNeighbors Classifier,0,0.2,0.7222222222222222,0.7055208621149873,0.22067904472351074,0.7055208621149873
121,7,SVC Classifier,0,0.2,0.46296296296296297,1.0,0.08451390266418457,0.0
122,7,Decision Tree,0,0.2,0.7685185185185185,0.7572525101762072,0.001947641372680664,0.7572525101762072
123,7,RandomForest,0,0.2,0.7592592592592593,0.5302584363703448,0.8011703491210938,0.5302584363703448
124,7,AdaBoost (Discrete),0,0.2,0.8240740740740741,0.822335243792148,52.424535274505615,0.822335243792148
125,7,AdaBoost (Real),0,0.2,0.7870370370370371,0.7626139246288385,56.03058409690857,0.7626139246288385
126,7,Logistic Regression (Penalty = L2),0,0.2,0.7870370370370371,0.7176021752411269,0.09601545333862305,0.7176021752411269
127,7,Naive Bayes,0,0.2,0.8148148148148148,0.7498986722776924,0.11115503311157227,0.7498986722776924
128,7,KNeighbors Classifier,1,0.2,0.8411214953271028,0.8169601045778886,0.12042546272277832,0.8169601045778886
129,7,SVC Classifier,1,0.2,0.4672897196261682,1.0,0.13110613822937012,0.0
130,7,Decision Tree,1,0.2,0.7757009345794392,0.7382067873658885,0.0021517276763916016,0.7382067873658885
131,7,RandomForest,1,0.2,0.794392523364486,0.5444663130942435,0.8345208168029785,0.5444663130942435
132,7,AdaBoost (Discrete),1,0.2,0.8691588785046729,0.8459470712356266,49.194947957992554,0.8459470712356266
133,7,AdaBoost (Real),1,0.2,0.8317757009345794,0.8207681077238245,54.04964303970337,0.8207681077238245
134,7,Logistic Regression (Penalty = L2),1,0.2,0.8691588785046729,0.8459470712356266,0.002444744110107422,0.8459470712356266
135,7,Naive Bayes,1,0.2,0.8504672897196262,0.8291873437000402,0.13870000839233398,0.8291873437000402
136,7,KNeighbors Classifier,2,0.2,0.7924528301886793,0.7875683293950962,0.14487457275390625,0.7875683293950962
137,7,SVC Classifier,2,0.2,0.4716981132075472,1.0,0.12393808364868164,0.0
138,7,Decision Tree,2,0.2,0.8113207547169812,0.8138299316858051,0.12211012840270996,0.8138299316858051
139,7,RandomForest,2,0.2,0.839622641509434,0.7789607668021015,0.7465231418609619,0.7789607668021015
140,7,AdaBoost (Discrete),2,0.2,0.8113207547169812,0.8078184661279715,49.498868465423584,0.8078184661279715
141,7,AdaBoost (Real),2,0.2,0.8018867924528302,0.768660625179147,56.10471820831299,0.768660625179147
142,7,Logistic Regression (Penalty = L2),2,0.2,0.8584905660377359,0.8416852375959708,0.0036382675170898438,0.8416852375959708
143,7,Naive Bayes,2,0.2,0.8679245283018868,0.8459470712356266,0.1200721263885498,0.8459470712356266
