,feat_set_id,classifier,fold_id,feat_th,score,geo_score,exec_t,geo_score_woz
0,0,KNeighbors Classifier,0,0.1,0.5126984126984127,0.07275083710161441,0.017095565795898438,0.0
1,0,SVC Classifier,0,0.1,0.5301587301587302,1.0,0.06142067909240723,0.0
2,0,Decision Tree,0,0.1,0.5333333333333333,0.08528941297130764,0.002378702163696289,0.0
3,0,RandomForest,0,0.1,0.5301587301587302,1.0,0.09465503692626953,0.0
4,0,AdaBoost (Discrete),0,0.1,0.49682539682539684,0.13111819984182138,4.556762933731079,0.0
5,0,AdaBoost (Real),0,0.1,0.44285714285714284,0.15542153704766962,7.5058207511901855,0.0
6,0,Logistic Regression (Penalty = L2),0,0.1,0.5126984126984127,0.10777726161567693,0.08154153823852539,0.0
7,0,Naive Bayes,0,0.1,0.4888888888888889,0.4545182354397955,0.0196840763092041,0.0
8,0,KNeighbors Classifier,1,0.1,0.4944356120826709,0.12744550652739406,0.042026519775390625,0.0
9,0,SVC Classifier,1,0.1,0.5294117647058824,1.0,0.10288476943969727,0.0
10,0,Decision Tree,1,0.1,0.5357710651828299,0.23847074719262207,0.0022182464599609375,0.0
11,0,RandomForest,1,0.1,0.5294117647058824,1.0,0.06574392318725586,0.0
12,0,AdaBoost (Discrete),1,0.1,0.5246422893481717,0.13239271599649807,4.340258836746216,0.0
13,0,AdaBoost (Real),1,0.1,0.40222575516693165,0.15897141953954352,5.414507150650024,0.0
14,0,Logistic Regression (Penalty = L2),1,0.1,0.5294117647058824,0.27609794680525285,0.024637460708618164,0.0
15,0,Naive Bayes,1,0.1,0.4562798092209857,0.6548154042120116,0.0033173561096191406,0.0
16,0,KNeighbors Classifier,2,0.1,0.536741214057508,0.2225453006864414,0.00581669807434082,0.0
17,0,SVC Classifier,2,0.1,0.5319488817891374,1.0,0.05649280548095703,0.0
18,0,Decision Tree,2,0.1,0.5447284345047924,0.16571478544816753,0.002394437789916992,0.0
19,0,RandomForest,2,0.1,0.5319488817891374,1.0,0.0516200065612793,0.0
20,0,AdaBoost (Discrete),2,0.1,0.5399361022364217,0.2364896708057678,3.7196359634399414,0.0
21,0,AdaBoost (Real),2,0.1,0.41214057507987223,0.12481668319577416,6.563868761062622,0.0
22,0,Logistic Regression (Penalty = L2),2,0.1,0.5319488817891374,1.0,0.019356250762939453,0.0
23,0,Naive Bayes,2,0.1,0.4728434504792332,0.6074091446017823,0.016131162643432617,0.0
24,1,KNeighbors Classifier,0,0.1,0.5126984126984127,0.07275083710161441,0.020205259323120117,0.0
25,1,SVC Classifier,0,0.1,0.5301587301587302,1.0,0.09061241149902344,0.0
26,1,Decision Tree,0,0.1,0.5317460317460317,0.08223541265771928,0.0025129318237304688,0.0
27,1,RandomForest,0,0.1,0.5301587301587302,1.0,0.08724689483642578,0.0
28,1,AdaBoost (Discrete),0,0.1,0.49682539682539684,0.13111819984182138,3.662747383117676,0.0
29,1,AdaBoost (Real),0,0.1,0.44285714285714284,0.15542153704766962,5.736551523208618,0.0
30,1,Logistic Regression (Penalty = L2),0,0.1,0.5126984126984127,0.10777726161567693,0.0071566104888916016,0.0
31,1,Naive Bayes,0,0.1,0.4888888888888889,0.4545182354397955,0.003349781036376953,0.0
32,1,KNeighbors Classifier,1,0.1,0.4944356120826709,0.12744550652739406,0.005840301513671875,0.0
33,1,SVC Classifier,1,0.1,0.5294117647058824,1.0,0.03247570991516113,0.0
34,1,Decision Tree,1,0.1,0.5357710651828299,0.23847074719262207,0.0015268325805664062,0.0
35,1,RandomForest,1,0.1,0.5294117647058824,1.0,0.018002033233642578,0.0
36,1,AdaBoost (Discrete),1,0.1,0.5246422893481717,0.13239271599649807,3.2208871841430664,0.0
37,1,AdaBoost (Real),1,0.1,0.40222575516693165,0.15739062811707386,5.884973049163818,0.0
38,1,Logistic Regression (Penalty = L2),1,0.1,0.5294117647058824,0.27609794680525285,0.04420661926269531,0.0
39,1,Naive Bayes,1,0.1,0.4562798092209857,0.6548154042120116,0.0058994293212890625,0.0
40,1,KNeighbors Classifier,2,0.1,0.536741214057508,0.2225453006864414,0.02199268341064453,0.0
41,1,SVC Classifier,2,0.1,0.5319488817891374,1.0,0.1141517162322998,0.0
42,1,Decision Tree,2,0.1,0.5447284345047924,0.16571478544816753,0.018629789352416992,0.0
43,1,RandomForest,2,0.1,0.5319488817891374,1.0,0.07875919342041016,0.0
44,1,AdaBoost (Discrete),2,0.1,0.5399361022364217,0.2364896708057678,3.74061918258667,0.0
45,1,AdaBoost (Real),2,0.1,0.36421725239616615,0.13020501186107458,6.6307477951049805,0.0
46,1,Logistic Regression (Penalty = L2),2,0.1,0.5319488817891374,1.0,0.026827096939086914,0.0
47,1,Naive Bayes,2,0.1,0.4728434504792332,0.6074091446017823,0.02261948585510254,0.0
48,2,KNeighbors Classifier,0,0.1,0.4984126984126984,0.07396531954720326,0.022638797760009766,0.0
49,2,SVC Classifier,0,0.1,0.5301587301587302,1.0,0.08705592155456543,0.0
50,2,Decision Tree,0,0.1,0.5206349206349207,0.07787523461048994,0.014780998229980469,0.0
51,2,RandomForest,0,0.1,0.5301587301587302,1.0,0.045790910720825195,0.0
52,2,AdaBoost (Discrete),0,0.1,0.526984126984127,0.15740218899937958,4.425687789916992,0.0
53,2,AdaBoost (Real),0,0.1,0.5142857142857142,0.11064058976976272,6.857736587524414,0.0
54,2,Logistic Regression (Penalty = L2),0,0.1,0.5301587301587302,1.0,0.02287435531616211,0.0
55,2,Naive Bayes,0,0.1,0.5015873015873016,0.10820518862342049,0.0056362152099609375,0.0
56,2,KNeighbors Classifier,1,0.1,0.4864864864864865,0.07347402202722261,0.03280019760131836,0.0
57,2,SVC Classifier,1,0.1,0.5294117647058824,1.0,0.0981593132019043,0.0
58,2,Decision Tree,1,0.1,0.5166931637519873,0.0812528177840068,0.002928495407104492,0.0
59,2,RandomForest,1,0.1,0.5294117647058824,1.0,0.0699758529663086,0.0
60,2,AdaBoost (Discrete),1,0.1,0.5135135135135135,0.12348171552403202,4.02593731880188,0.0
61,2,AdaBoost (Real),1,0.1,0.48012718600953896,0.11727236805027244,5.989495754241943,0.0
62,2,Logistic Regression (Penalty = L2),1,0.1,0.5278219395866455,0.996996996996997,0.03667402267456055,0.0
63,2,Naive Bayes,1,0.1,0.5166931637519873,0.1860014494337896,0.003356456756591797,0.0
64,2,KNeighbors Classifier,2,0.1,0.4952076677316294,0.12285029932373004,0.024677515029907227,0.0
65,2,SVC Classifier,2,0.1,0.5319488817891374,1.0,0.09025096893310547,0.0
66,2,Decision Tree,2,0.1,0.5175718849840255,0.1409234304990961,0.015490293502807617,0.0
67,2,RandomForest,2,0.1,0.5319488817891374,1.0,0.04272127151489258,0.0
68,2,AdaBoost (Discrete),2,0.1,0.5207667731629393,0.19314900286187683,4.411805152893066,0.0
69,2,AdaBoost (Real),2,0.1,0.5063897763578274,0.28904166402974424,6.224936008453369,0.0
70,2,Logistic Regression (Penalty = L2),2,0.1,0.5319488817891374,1.0,0.025699615478515625,0.0
71,2,Naive Bayes,2,0.1,0.5111821086261981,0.1374848926432662,0.004580497741699219,0.0
72,3,KNeighbors Classifier,0,0.1,0.4793650793650794,0.1437982589563431,0.021285533905029297,0.0
73,3,SVC Classifier,0,0.1,0.5301587301587302,1.0,0.09585976600646973,0.0
74,3,Decision Tree,0,0.1,0.5095238095238095,0.0722918017410916,0.018976211547851562,0.0
75,3,RandomForest,0,0.1,0.5333333333333333,0.25,0.07122230529785156,0.0
76,3,AdaBoost (Discrete),0,0.1,0.45555555555555555,0.14136793500001213,3.848259925842285,0.0
77,3,AdaBoost (Real),0,0.1,0.2571428571428571,0.16879151703439468,5.375362396240234,0.0
78,3,Logistic Regression (Penalty = L2),0,0.1,0.5333333333333333,0.25,0.04430556297302246,0.0
79,3,Naive Bayes,0,0.1,0.5333333333333333,0.3524932581000494,0.003416776657104492,0.0
80,3,KNeighbors Classifier,1,0.1,0.4276629570747218,0.15464722819648966,0.0239717960357666,0.0
81,3,SVC Classifier,1,0.1,0.5294117647058824,1.0,0.09609103202819824,0.0
82,3,Decision Tree,1,0.1,0.43402225755166934,0.13724709419017225,0.0027909278869628906,0.0
83,3,RandomForest,1,0.1,0.5294117647058824,1.0,0.0553891658782959,0.0
84,3,AdaBoost (Discrete),1,0.1,0.4117647058823529,0.08135960485423795,4.236860513687134,0.08135960485423795
85,3,AdaBoost (Real),1,0.1,0.24006359300476948,0.153266049390247,5.795867919921875,0.0
86,3,Logistic Regression (Penalty = L2),1,0.1,0.5087440381558028,0.22199649060228704,0.02588200569152832,0.0
87,3,Naive Bayes,1,0.1,0.5087440381558028,0.46116886682367136,0.020772933959960938,0.0
88,3,KNeighbors Classifier,2,0.1,0.48562300319488816,0.12603459764425634,0.028309106826782227,0.0
89,3,SVC Classifier,2,0.1,0.5319488817891374,1.0,0.11498212814331055,0.0
90,3,Decision Tree,2,0.1,0.4840255591054313,0.0979880009056367,0.0018763542175292969,0.0
91,3,RandomForest,2,0.1,0.5319488817891374,1.0,0.09274649620056152,0.0
92,3,AdaBoost (Discrete),2,0.1,0.4233226837060703,0.16372827069995582,4.124104976654053,0.0
93,3,AdaBoost (Real),2,0.1,0.22523961661341854,0.13274988415733552,5.947939395904541,0.13274988415733552
94,3,Logistic Regression (Penalty = L2),2,0.1,0.5399361022364217,0.22487184577932245,0.02375173568725586,0.0
95,3,Naive Bayes,2,0.1,0.4936102236421725,0.4168213793678789,0.019876956939697266,0.0
96,4,KNeighbors Classifier,0,0.1,0.5126984126984127,0.07275083710161441,0.021770000457763672,0.0
97,4,SVC Classifier,0,0.1,0.5301587301587302,1.0,0.0973656177520752,0.0
98,4,Decision Tree,0,0.1,0.5365079365079365,0.08539510030059669,0.018091201782226562,0.0
99,4,RandomForest,0,0.1,0.5301587301587302,1.0,0.043869972229003906,0.0
100,4,AdaBoost (Discrete),0,0.1,0.49682539682539684,0.13111819984182138,3.1867313385009766,0.0
101,4,AdaBoost (Real),0,0.1,0.4492063492063492,0.19005653822179072,5.100407123565674,0.0
102,4,Logistic Regression (Penalty = L2),0,0.1,0.5126984126984127,0.10777726161567693,0.020402193069458008,0.0
103,4,Naive Bayes,0,0.1,0.4888888888888889,0.4545182354397955,0.008361339569091797,0.0
104,4,KNeighbors Classifier,1,0.1,0.4944356120826709,0.12744550652739406,0.022327184677124023,0.0
105,4,SVC Classifier,1,0.1,0.5294117647058824,1.0,0.08773231506347656,0.0
106,4,Decision Tree,1,0.1,0.5357710651828299,0.23847074719262207,0.0025916099548339844,0.0
107,4,RandomForest,1,0.1,0.5294117647058824,1.0,0.10346579551696777,0.0
108,4,AdaBoost (Discrete),1,0.1,0.5246422893481717,0.13239271599649807,4.6336023807525635,0.0
109,4,AdaBoost (Real),1,0.1,0.40222575516693165,0.15897141953954352,5.553806304931641,0.0
110,4,Logistic Regression (Penalty = L2),1,0.1,0.5294117647058824,0.27609794680525285,0.024120569229125977,0.0
111,4,Naive Bayes,1,0.1,0.4562798092209857,0.6548154042120116,0.0034363269805908203,0.0
112,4,KNeighbors Classifier,2,0.1,0.536741214057508,0.2225453006864414,0.022019386291503906,0.0
113,4,SVC Classifier,2,0.1,0.5319488817891374,1.0,0.07057428359985352,0.0
114,4,Decision Tree,2,0.1,0.5447284345047924,0.16571478544816753,0.002440214157104492,0.0
115,4,RandomForest,2,0.1,0.5319488817891374,1.0,0.047434329986572266,0.0
116,4,AdaBoost (Discrete),2,0.1,0.5399361022364217,0.2364896708057678,3.978965997695923,0.0
117,4,AdaBoost (Real),2,0.1,0.3610223642172524,0.17908085948549976,6.541946887969971,0.0
118,4,Logistic Regression (Penalty = L2),2,0.1,0.5319488817891374,1.0,0.023497581481933594,0.0
119,4,Naive Bayes,2,0.1,0.4728434504792332,0.6074091446017823,0.021589994430541992,0.0
120,6,KNeighbors Classifier,0,0.1,0.5555555555555556,0.5229515845049365,0.02702045440673828,0.0
121,6,SVC Classifier,0,0.1,0.5301587301587302,1.0,0.07656502723693848,0.0
122,6,Decision Tree,0,0.1,0.5301587301587302,1.0,0.002268552780151367,0.0
123,6,RandomForest,0,0.1,0.5301587301587302,1.0,0.07844948768615723,0.0
124,6,AdaBoost (Discrete),0,0.1,0.5285714285714286,0.9970059880239521,3.878566265106201,0.0
125,6,AdaBoost (Real),0,0.1,0.5301587301587302,1.0,6.968681573867798,0.0
126,6,Logistic Regression (Penalty = L2),0,0.1,0.5301587301587302,1.0,0.05363178253173828,0.0
127,6,Naive Bayes,0,0.1,0.5301587301587302,1.0,0.01988816261291504,0.0
128,6,KNeighbors Classifier,1,0.1,0.4292527821939587,0.14733336259670013,0.02902698516845703,0.0
129,6,SVC Classifier,1,0.1,0.5294117647058824,1.0,0.09186816215515137,0.0
130,6,Decision Tree,1,0.1,0.5294117647058824,1.0,0.014425277709960938,0.0
131,6,RandomForest,1,0.1,0.5294117647058824,1.0,0.05011320114135742,0.0
132,6,AdaBoost (Discrete),1,0.1,0.5294117647058824,0.17651106525132115,3.9016547203063965,0.0
133,6,AdaBoost (Real),1,0.1,0.5294117647058824,1.0,6.564831733703613,0.0
134,6,Logistic Regression (Penalty = L2),1,0.1,0.5294117647058824,1.0,0.047536373138427734,0.0
135,6,Naive Bayes,1,0.1,0.48012718600953896,0.686471700286347,0.015712499618530273,0.0
136,6,KNeighbors Classifier,2,0.1,0.5319488817891374,1.0,0.047842979431152344,0.0
137,6,SVC Classifier,2,0.1,0.5319488817891374,1.0,0.11424493789672852,0.0
138,6,Decision Tree,2,0.1,0.5319488817891374,1.0,0.002279043197631836,0.0
139,6,RandomForest,2,0.1,0.5319488817891374,1.0,0.06615233421325684,0.0
140,6,AdaBoost (Discrete),2,0.1,0.5319488817891374,1.0,3.5640032291412354,0.0
141,6,AdaBoost (Real),2,0.1,0.5319488817891374,1.0,6.583140850067139,0.0
142,6,Logistic Regression (Penalty = L2),2,0.1,0.5319488817891374,1.0,0.07149410247802734,0.0
143,6,Naive Bayes,2,0.1,0.4792332268370607,0.6706969880910827,0.025477886199951172,0.0
144,8,KNeighbors Classifier,0,0.1,0.5555555555555556,0.5229515845049365,0.04562664031982422,0.0
145,8,SVC Classifier,0,0.1,0.5301587301587302,1.0,0.05622148513793945,0.0
146,8,Decision Tree,0,0.1,0.5301587301587302,1.0,0.0021512508392333984,0.0
147,8,RandomForest,0,0.1,0.5301587301587302,1.0,0.05511879920959473,0.0
148,8,AdaBoost (Discrete),0,0.1,0.5285714285714286,0.9970059880239521,3.6977932453155518,0.0
149,8,AdaBoost (Real),0,0.1,0.5301587301587302,1.0,6.883680105209351,0.0
150,8,Logistic Regression (Penalty = L2),0,0.1,0.5301587301587302,1.0,0.0422360897064209,0.0
151,8,Naive Bayes,0,0.1,0.5301587301587302,1.0,0.012491464614868164,0.0
152,8,KNeighbors Classifier,1,0.1,0.4292527821939587,0.14733336259670013,0.03617382049560547,0.0
153,8,SVC Classifier,1,0.1,0.5294117647058824,1.0,0.06560444831848145,0.0
154,8,Decision Tree,1,0.1,0.5294117647058824,1.0,0.0023174285888671875,0.0
155,8,RandomForest,1,0.1,0.5294117647058824,1.0,0.040899038314819336,0.0
156,8,AdaBoost (Discrete),1,0.1,0.5294117647058824,0.17651106525132115,3.8806755542755127,0.0
157,8,AdaBoost (Real),1,0.1,0.5294117647058824,1.0,6.270308017730713,0.0
158,8,Logistic Regression (Penalty = L2),1,0.1,0.5294117647058824,1.0,0.04502272605895996,0.0
159,8,Naive Bayes,1,0.1,0.48012718600953896,0.686471700286347,0.02230358123779297,0.0
160,8,KNeighbors Classifier,2,0.1,0.5319488817891374,1.0,0.05837297439575195,0.0
161,8,SVC Classifier,2,0.1,0.5319488817891374,1.0,0.09917879104614258,0.0
162,8,Decision Tree,2,0.1,0.5319488817891374,1.0,0.01444244384765625,0.0
163,8,RandomForest,2,0.1,0.5319488817891374,1.0,0.06676602363586426,0.0
164,8,AdaBoost (Discrete),2,0.1,0.5319488817891374,1.0,4.233460426330566,0.0
165,8,AdaBoost (Real),2,0.1,0.5319488817891374,1.0,5.288917064666748,0.0
166,8,Logistic Regression (Penalty = L2),2,0.1,0.5319488817891374,1.0,0.04629874229431152,0.0
167,8,Naive Bayes,2,0.1,0.4792332268370607,0.6706969880910827,0.02059030532836914,0.0
168,10,KNeighbors Classifier,0,0.1,0.5126984126984127,0.07275083710161441,0.033776044845581055,0.0
169,10,SVC Classifier,0,0.1,0.5301587301587302,1.0,0.09054803848266602,0.0
170,10,Decision Tree,0,0.1,0.5317460317460317,0.08223541265771928,0.013221263885498047,0.0
171,10,RandomForest,0,0.1,0.5301587301587302,1.0,0.07300019264221191,0.0
172,10,AdaBoost (Discrete),0,0.1,0.49682539682539684,0.13111819984182138,4.202043294906616,0.0
173,10,AdaBoost (Real),0,0.1,0.44285714285714284,0.15542153704766962,5.885883092880249,0.0
174,10,Logistic Regression (Penalty = L2),0,0.1,0.5126984126984127,0.10777726161567693,0.04424166679382324,0.0
175,10,Naive Bayes,0,0.1,0.4888888888888889,0.4545182354397955,0.004834175109863281,0.0
176,10,KNeighbors Classifier,1,0.1,0.4944356120826709,0.12744550652739406,0.02209639549255371,0.0
177,10,SVC Classifier,1,0.1,0.5294117647058824,1.0,0.08946394920349121,0.0
178,10,Decision Tree,1,0.1,0.5357710651828299,0.23847074719262207,0.018013477325439453,0.0
179,10,RandomForest,1,0.1,0.5294117647058824,1.0,0.051816701889038086,0.0
180,10,AdaBoost (Discrete),1,0.1,0.5246422893481717,0.13239271599649807,4.165177345275879,0.0
181,10,AdaBoost (Real),1,0.1,0.3942766295707472,0.11081809799531901,5.669111251831055,0.11081809799531901
182,10,Logistic Regression (Penalty = L2),1,0.1,0.5294117647058824,0.27609794680525285,0.026975154876708984,0.0
183,10,Naive Bayes,1,0.1,0.4562798092209857,0.6548154042120116,0.005189657211303711,0.0
184,10,KNeighbors Classifier,2,0.1,0.536741214057508,0.2225453006864414,0.021287918090820312,0.0
185,10,SVC Classifier,2,0.1,0.5319488817891374,1.0,0.07876205444335938,0.0
186,10,Decision Tree,2,0.1,0.5447284345047924,0.16571478544816753,0.0025000572204589844,0.0
187,10,RandomForest,2,0.1,0.5319488817891374,1.0,0.09131908416748047,0.0
188,10,AdaBoost (Discrete),2,0.1,0.5399361022364217,0.2364896708057678,3.5736403465270996,0.0
189,10,AdaBoost (Real),2,0.1,0.3562300319488818,0.18887257970788449,5.618874549865723,0.0
190,10,Logistic Regression (Penalty = L2),2,0.1,0.5319488817891374,1.0,0.02367544174194336,0.0
191,10,Naive Bayes,2,0.1,0.4728434504792332,0.6074091446017823,0.01796865463256836,0.0
192,11,KNeighbors Classifier,0,0.1,0.46825396825396826,0.13834186961902917,0.036882877349853516,0.0
193,11,SVC Classifier,0,0.1,0.5301587301587302,1.0,0.12239336967468262,0.0
194,11,Decision Tree,0,0.1,0.40793650793650793,0.13994404769470145,0.024311065673828125,0.13994404769470145
195,11,RandomForest,0,0.1,0.5301587301587302,1.0,0.06877279281616211,0.0
196,11,AdaBoost (Discrete),0,0.1,0.28888888888888886,0.14563999631894253,4.389246225357056,0.14563999631894253
197,11,AdaBoost (Real),0,0.1,0.3396825396825397,0.16197375082357354,5.514746189117432,0.16197375082357354
198,11,Logistic Regression (Penalty = L2),0,0.1,0.5222222222222223,0.1154597122113414,0.0418245792388916,0.0
199,11,Naive Bayes,0,0.1,0.4238095238095238,0.14815885704855639,0.004639148712158203,0.0
200,11,KNeighbors Classifier,1,0.1,0.4578696343402226,0.1168221172910713,0.02158498764038086,0.0
201,11,SVC Classifier,1,0.1,0.5294117647058824,1.0,0.0909271240234375,0.0
202,11,Decision Tree,1,0.1,0.35930047694753575,0.15635463668847455,0.01983785629272461,0.15635463668847455
203,11,RandomForest,1,0.1,0.5294117647058824,1.0,0.0726156234741211,0.0
204,11,AdaBoost (Discrete),1,0.1,0.3195548489666137,0.19789500016752323,3.958698034286499,0.19789500016752323
205,11,AdaBoost (Real),1,0.1,0.21462639109697934,0.2130652696096834,4.962901830673218,0.2130652696096834
206,11,Logistic Regression (Penalty = L2),1,0.1,0.5182829888712241,0.13577672983537445,0.023438453674316406,0.0
207,11,Naive Bayes,1,0.1,0.4276629570747218,0.2542483324770155,0.015857696533203125,0.0
208,11,KNeighbors Classifier,2,0.1,0.4904153354632588,0.09454382963299003,0.019584178924560547,0.09454382963299003
209,11,SVC Classifier,2,0.1,0.5319488817891374,1.0,0.07676172256469727,0.0
210,11,Decision Tree,2,0.1,0.35942492012779553,0.1237115241162592,0.0043027400970458984,0.1237115241162592
211,11,RandomForest,2,0.1,0.5319488817891374,1.0,0.05204057693481445,0.0
212,11,AdaBoost (Discrete),2,0.1,0.28913738019169327,0.15088500658351867,3.7011611461639404,0.15088500658351867
213,11,AdaBoost (Real),2,0.1,0.18370607028753994,0.15658315119960017,4.849118947982788,0.15658315119960017
214,11,Logistic Regression (Penalty = L2),2,0.1,0.5271565495207667,0.1163762440537915,0.02532052993774414,0.0
215,11,Naive Bayes,2,0.1,0.4440894568690096,0.14224291578534,0.006089925765991211,0.14224291578534
