,feat_set_id,classifier,fold_id,feat_th,score,geo_score,exec_t,geo_score_woz
0,0,KNeighbors Classifier,0,0.55,0.5838150289017341,0.7107365288681222,0.13689327239990234,0.0
1,0,SVC Classifier,0,0.55,0.49710982658959535,1.0,0.16291308403015137,0.0
2,0,Decision Tree,0,0.55,0.5664739884393064,0.6098526142438174,0.003991365432739258,0.0
3,0,RandomForest,0,0.55,0.5433526011560693,0.5814307369682193,0.09408879280090332,0.0
4,0,AdaBoost (Discrete),0,0.55,0.6936416184971098,0.5935253697267474,8.991235733032227,0.0
5,0,AdaBoost (Real),0,0.55,0.6763005780346821,0.7778785432291271,11.615513563156128,0.0
6,0,Logistic Regression (Penalty = L2),0,0.55,0.5664739884393064,0.38780572882169384,0.19742536544799805,0.0
7,0,Naive Bayes,0,0.55,0.20809248554913296,0.4182884924830857,0.09064579010009766,0.0
8,0,KNeighbors Classifier,1,0.55,0.6309523809523809,0.5480818989756137,0.16616034507751465,0.0
9,0,SVC Classifier,1,0.55,0.5119047619047619,1.0,0.17337870597839355,0.0
10,0,Decision Tree,1,0.55,0.4880952380952381,0.5839055327059527,0.003849029541015625,0.0
11,0,RandomForest,1,0.55,0.5297619047619048,0.7937005259840998,0.09903883934020996,0.0
12,0,AdaBoost (Discrete),1,0.55,0.7023809523809523,0.6751297874305614,9.962116956710815,0.0
13,0,AdaBoost (Real),1,0.55,0.6130952380952381,0.6660569482123795,10.25274133682251,0.0
14,0,Logistic Regression (Penalty = L2),1,0.55,0.6190476190476191,0.4380512044589638,0.14588260650634766,0.0
15,0,Naive Bayes,1,0.55,0.2261904761904762,0.3694756688209205,0.06441450119018555,0.0
16,0,KNeighbors Classifier,2,0.55,0.6134969325153374,0.6673909797221118,0.14822673797607422,0.0
17,0,SVC Classifier,2,0.55,0.5153374233128835,1.0,0.1338651180267334,0.0
18,0,Decision Tree,2,0.55,0.5950920245398773,0.5926588520951778,0.002751588821411133,0.0
19,0,RandomForest,2,0.55,0.5766871165644172,0.6742311392731192,0.09427094459533691,0.0
20,0,AdaBoost (Discrete),2,0.55,0.7239263803680982,0.8638764308762018,9.52613615989685,0.0
21,0,AdaBoost (Real),2,0.55,0.5705521472392638,0.7078520621370483,10.596291542053223,0.0
22,0,Logistic Regression (Penalty = L2),2,0.55,0.6257668711656442,0.525204135283147,0.14337897300720215,0.0
23,0,Naive Bayes,2,0.55,0.25766871165644173,0.4644599178599582,0.049787282943725586,0.0
24,1,KNeighbors Classifier,0,0.55,0.630057803468208,0.4895159746488711,0.1829512119293213,0.0
25,1,SVC Classifier,0,0.55,0.49710982658959535,1.0,0.15794897079467773,0.0
26,1,Decision Tree,0,0.55,0.5838150289017341,0.6569575541878213,0.0031671524047851562,0.0
27,1,RandomForest,0,0.55,0.5375722543352601,1.0,0.1023871898651123,0.0
28,1,AdaBoost (Discrete),0,0.55,0.6705202312138728,0.5688373450240415,11.594182968139648,0.0
29,1,AdaBoost (Real),0,0.55,0.5953757225433526,0.5412696022022199,13.299954891204834,0.0
30,1,Logistic Regression (Penalty = L2),0,0.55,0.5953757225433526,0.4199892648220079,0.190199613571167,0.0
31,1,Naive Bayes,0,0.55,0.20809248554913296,0.3228214867131199,0.07779121398925781,0.0
32,1,KNeighbors Classifier,1,0.55,0.6071428571428571,0.4547927125582935,0.12508511543273926,0.0
33,1,SVC Classifier,1,0.55,0.5119047619047619,1.0,0.13338541984558105,0.0
34,1,Decision Tree,1,0.55,0.6190476190476191,0.7127152405958692,0.027629852294921875,0.0
35,1,RandomForest,1,0.55,0.5654761904761905,0.48009694123150753,0.09449481964111328,0.0
36,1,AdaBoost (Discrete),1,0.55,0.6845238095238095,0.6233733121097239,11.769336700439453,0.0
37,1,AdaBoost (Real),1,0.55,0.625,0.6500854941749944,13.105653762817383,0.0
38,1,Logistic Regression (Penalty = L2),1,0.55,0.6547619047619048,0.5339769138623359,0.20328378677368164,0.0
39,1,Naive Bayes,1,0.55,0.23214285714285715,0.48617381734197573,0.09077167510986328,0.0
40,1,KNeighbors Classifier,2,0.55,0.6380368098159509,0.5590373124056389,0.14744305610656738,0.0
41,1,SVC Classifier,2,0.55,0.5153374233128835,1.0,0.132493257522583,0.0
42,1,Decision Tree,2,0.55,0.5460122699386503,0.48162938050219417,0.003489971160888672,0.48162938050219417
43,1,RandomForest,2,0.55,0.6073619631901841,0.6101319980314254,0.09697580337524414,0.0
44,1,AdaBoost (Discrete),2,0.55,0.7361963190184049,0.7247275254310838,11.794233083724976,0.0
45,1,AdaBoost (Real),2,0.55,0.5950920245398773,0.7401567750710044,13.341891288757324,0.0
46,1,Logistic Regression (Penalty = L2),2,0.55,0.6319018404907976,0.47678203451866985,0.24394989013671875,0.0
47,1,Naive Bayes,2,0.55,0.26993865030674846,0.4568785633769407,0.07385730743408203,0.0
48,2,KNeighbors Classifier,0,0.55,0.6242774566473989,0.5290848232691936,0.15093660354614258,0.0
49,2,SVC Classifier,0,0.55,0.5028901734104047,0.5227579585747102,0.1903223991394043,0.0
50,2,Decision Tree,0,0.55,0.6127167630057804,0.6831377891235737,0.005200862884521484,0.0
51,2,RandomForest,0,0.55,0.5433526011560693,0.5081327481546147,0.09390974044799805,0.0
52,2,AdaBoost (Discrete),0,0.55,0.7456647398843931,0.6190030126411249,17.302096128463745,0.0
53,2,AdaBoost (Real),0,0.55,0.6242774566473989,0.7244007043050418,19.148034811019897,0.0
54,2,Logistic Regression (Penalty = L2),0,0.55,0.6936416184971098,0.5788139547340041,0.37615370750427246,0.0
55,2,Naive Bayes,0,0.55,0.24855491329479767,0.42469929360274805,0.06229686737060547,0.0
56,2,KNeighbors Classifier,1,0.55,0.6369047619047619,0.560689712799505,0.17660069465637207,0.0
57,2,SVC Classifier,1,0.55,0.5178571428571429,0.5503212081491045,0.28348636627197266,0.0
58,2,Decision Tree,1,0.55,0.6130952380952381,0.6541320877375655,0.04236435890197754,0.0
59,2,RandomForest,1,0.55,0.5476190476190477,0.6389431042462725,0.14326238632202148,0.0
60,2,AdaBoost (Discrete),1,0.55,0.75,0.6999747662801491,18.677268028259277,0.0
61,2,AdaBoost (Real),1,0.55,0.6309523809523809,0.6540229691138933,19.649860620498657,0.0
62,2,Logistic Regression (Penalty = L2),1,0.55,0.7380952380952381,0.7501541963355535,0.4018082618713379,0.0
63,2,Naive Bayes,1,0.55,0.27976190476190477,0.4976363465356531,0.08828043937683105,0.0
64,2,KNeighbors Classifier,2,0.55,0.6809815950920245,0.7688950849002221,0.13444972038269043,0.0
65,2,SVC Classifier,2,0.55,0.5153374233128835,1.0,0.14655256271362305,0.0
66,2,Decision Tree,2,0.55,0.656441717791411,0.6450088128821411,0.021436691284179688,0.0
67,2,RandomForest,2,0.55,0.5828220858895705,0.6759294760097763,0.1021573543548584,0.0
68,2,AdaBoost (Discrete),2,0.55,0.754601226993865,0.7288764869507023,18.841472864151,0.0
69,2,AdaBoost (Real),2,0.55,0.588957055214724,0.677600031855733,20.140088081359863,0.0
70,2,Logistic Regression (Penalty = L2),2,0.55,0.7607361963190185,0.7790778080544442,0.3983004093170166,0.0
71,2,Naive Bayes,2,0.55,0.27607361963190186,0.48628597527240175,0.0602414608001709,0.0
72,3,KNeighbors Classifier,0,0.55,0.6242774566473989,0.4662285880686569,0.1912398338317871,0.0
73,3,SVC Classifier,0,0.55,0.49710982658959535,1.0,0.2106010913848877,0.0
74,3,Decision Tree,0,0.55,0.6647398843930635,0.6825658816333598,0.02868509292602539,0.0
75,3,RandomForest,0,0.55,0.5549132947976878,0.6481388934544839,0.12237048149108887,0.0
76,3,AdaBoost (Discrete),0,0.55,0.7225433526011561,0.5596982259163059,17.111680269241333,0.0
77,3,AdaBoost (Real),0,0.55,0.6242774566473989,0.7096908170027858,18.3956937789917,0.0
78,3,Logistic Regression (Penalty = L2),0,0.55,0.6820809248554913,0.5211838220063206,0.304424524307251,0.0
79,3,Naive Bayes,0,0.55,0.24855491329479767,0.44572384648725094,0.08943724632263184,0.0
80,3,KNeighbors Classifier,1,0.55,0.6607142857142857,0.627557263809442,0.16376638412475586,0.0
81,3,SVC Classifier,1,0.55,0.5119047619047619,1.0,0.19275188446044922,0.0
82,3,Decision Tree,1,0.55,0.6011904761904762,0.5848835239925103,0.004985809326171875,0.0
83,3,RandomForest,1,0.55,0.5357142857142857,0.4450050658086207,0.12880635261535645,0.0
84,3,AdaBoost (Discrete),1,0.55,0.7619047619047619,0.7675431122699686,16.540396690368652,0.0
85,3,AdaBoost (Real),1,0.55,0.5833333333333334,0.6010421136926959,17.353463649749756,0.0
86,3,Logistic Regression (Penalty = L2),1,0.55,0.7619047619047619,0.7389374585362234,0.31833553314208984,0.0
87,3,Naive Bayes,1,0.55,0.2619047619047619,0.44508579130490383,0.09402108192443848,0.0
88,3,KNeighbors Classifier,2,0.55,0.6380368098159509,0.5641174378337577,0.1326737403869629,0.0
89,3,SVC Classifier,2,0.55,0.5153374233128835,1.0,0.1232752799987793,0.0
90,3,Decision Tree,2,0.55,0.588957055214724,0.5511335114489653,0.02191925048828125,0.0
91,3,RandomForest,2,0.55,0.5766871165644172,0.7071067811865476,0.07084131240844727,0.0
92,3,AdaBoost (Discrete),2,0.55,0.754601226993865,0.6968420690859125,14.926989555358887,0.0
93,3,AdaBoost (Real),2,0.55,0.5030674846625767,0.6193381320220203,17.111563444137573,0.0
94,3,Logistic Regression (Penalty = L2),2,0.55,0.7484662576687117,0.6597844051362305,0.3867988586425781,0.0
95,3,Naive Bayes,2,0.55,0.3128834355828221,0.49736895386559743,0.07525181770324707,0.49736895386559743
96,4,KNeighbors Classifier,0,0.55,0.5780346820809249,0.5636842736150581,0.15323781967163086,0.0
97,4,SVC Classifier,0,0.55,0.49710982658959535,1.0,0.12347841262817383,0.0
98,4,Decision Tree,0,0.55,0.5664739884393064,0.5961802117030114,0.002572774887084961,0.0
99,4,RandomForest,0,0.55,0.5433526011560693,0.5081327481546147,0.09340810775756836,0.0
100,4,AdaBoost (Discrete),0,0.55,0.6473988439306358,0.63762823185395,8.899948358535767,0.0
101,4,AdaBoost (Real),0,0.55,0.6705202312138728,0.7609357091275745,9.926828861236572,0.0
102,4,Logistic Regression (Penalty = L2),0,0.55,0.5260115606936416,0.27867409976898827,0.15801715850830078,0.0
103,4,Naive Bayes,0,0.55,0.20809248554913296,0.3228214867131199,0.05284547805786133,0.0
104,4,KNeighbors Classifier,1,0.55,0.5773809523809523,0.4800853876477675,0.1438274383544922,0.0
105,4,SVC Classifier,1,0.55,0.5119047619047619,1.0,0.12728381156921387,0.0
106,4,Decision Tree,1,0.55,0.5773809523809523,0.5237351683954435,0.031438589096069336,0.0
107,4,RandomForest,1,0.55,0.5535714285714286,0.3183139814128999,0.12381243705749512,0.0
108,4,AdaBoost (Discrete),1,0.55,0.6726190476190477,0.5971575825577645,8.482931852340698,0.0
109,4,AdaBoost (Real),1,0.55,0.6130952380952381,0.6660569482123795,9.422781467437744,0.0
110,4,Logistic Regression (Penalty = L2),1,0.55,0.5297619047619048,0.3860973950960897,0.13545727729797363,0.0
111,4,Naive Bayes,1,0.55,0.20833333333333334,0.4357698058499415,0.05065488815307617,0.0
112,4,KNeighbors Classifier,2,0.55,0.6441717791411042,0.6817835998295652,0.14074254035949707,0.0
113,4,SVC Classifier,2,0.55,0.5153374233128835,1.0,0.09218907356262207,0.0
114,4,Decision Tree,2,0.55,0.5521472392638037,0.6087161010074948,0.0039556026458740234,0.0
115,4,RandomForest,2,0.55,0.5766871165644172,0.4526181100513631,0.07586288452148438,0.0
116,4,AdaBoost (Discrete),2,0.55,0.6932515337423313,0.7317997281200439,8.518820524215698,0.0
117,4,AdaBoost (Real),2,0.55,0.5705521472392638,0.7078520621370483,9.81718373298645,0.0
118,4,Logistic Regression (Penalty = L2),2,0.55,0.5460122699386503,0.2949472811781949,0.07790994644165039,0.0
119,4,Naive Bayes,2,0.55,0.25766871165644173,0.42367609052959176,0.04514503479003906,0.0
120,5,KNeighbors Classifier,0,0.55,0.5953757225433526,0.6295238672063208,0.09192228317260742,0.0
121,5,SVC Classifier,0,0.55,0.49710982658959535,1.0,0.05237317085266113,0.0
122,5,Decision Tree,0,0.55,0.5722543352601156,0.6407720787191556,0.010528326034545898,0.0
123,5,RandomForest,0,0.55,0.5317919075144508,0.9959183219207,0.09976696968078613,0.0
124,5,AdaBoost (Discrete),0,0.55,0.6589595375722543,0.6561563745161748,6.446029901504517,0.0
125,5,AdaBoost (Real),0,0.55,0.5953757225433526,0.5448429777405552,8.772857427597046,0.0
126,5,Logistic Regression (Penalty = L2),0,0.55,0.5606936416184971,0.42628267366888817,0.11942863464355469,0.0
127,5,Naive Bayes,0,0.55,0.2023121387283237,0.344090253231452,0.04289436340332031,0.0
128,5,KNeighbors Classifier,1,0.55,0.6428571428571429,0.6634710386318975,0.06201028823852539,0.0
129,5,SVC Classifier,1,0.55,0.5119047619047619,1.0,0.06849527359008789,0.0
130,5,Decision Tree,1,0.55,0.5535714285714286,0.4769838379911999,0.02430415153503418,0.0
131,5,RandomForest,1,0.55,0.5416666666666666,0.9410360288810286,0.12204170227050781,0.0
132,5,AdaBoost (Discrete),1,0.55,0.6547619047619048,0.5992071658930147,6.138615131378174,0.0
133,5,AdaBoost (Real),1,0.55,0.6369047619047619,0.6617965883106954,8.64799427986145,0.0
134,5,Logistic Regression (Penalty = L2),1,0.55,0.6071428571428571,0.47929530836572865,0.10471916198730469,0.0
135,5,Naive Bayes,1,0.55,0.23809523809523808,0.4083866531499614,0.06003212928771973,0.0
136,5,KNeighbors Classifier,2,0.55,0.6625766871165644,0.7083827570473676,0.08536076545715332,0.0
137,5,SVC Classifier,2,0.55,0.5153374233128835,1.0,0.058417558670043945,0.0
138,5,Decision Tree,2,0.55,0.5276073619631901,0.6881372553930184,0.0032389163970947266,0.0
139,5,RandomForest,2,0.55,0.5644171779141104,0.8408964152537145,0.12486958503723145,0.0
140,5,AdaBoost (Discrete),2,0.55,0.6625766871165644,0.621571465897338,7.111936092376709,0.0
141,5,AdaBoost (Real),2,0.55,0.5398773006134969,0.5165246328854857,8.666142463684082,0.0
142,5,Logistic Regression (Penalty = L2),2,0.55,0.6134969325153374,0.7308479218687363,0.15488982200622559,0.0
143,5,Naive Bayes,2,0.55,0.19631901840490798,0.3979904747863221,0.033347368240356445,0.0
144,6,KNeighbors Classifier,0,0.55,0.5780346820809249,0.6156320183209282,0.09996271133422852,0.0
145,6,SVC Classifier,0,0.55,0.49710982658959535,1.0,0.06673049926757812,0.0
146,6,Decision Tree,0,0.55,0.6011560693641619,0.6014433839069987,0.027356386184692383,0.0
147,6,RandomForest,0,0.55,0.5086705202312138,0.6586337560083495,0.10089445114135742,0.0
148,6,AdaBoost (Discrete),0,0.55,0.6589595375722543,0.6384282798639009,6.554607152938843,0.0
149,6,AdaBoost (Real),0,0.55,0.5722543352601156,0.5354796136345695,8.444678544998169,0.0
150,6,Logistic Regression (Penalty = L2),0,0.55,0.5491329479768786,0.42628267366888817,0.08974504470825195,0.0
151,6,Naive Bayes,0,0.55,0.19653179190751446,0.3734017950158335,0.04675126075744629,0.0
152,6,KNeighbors Classifier,1,0.55,0.6130952380952381,0.4843729260524407,0.10065937042236328,0.0
153,6,SVC Classifier,1,0.55,0.5119047619047619,1.0,0.07111787796020508,0.0
154,6,Decision Tree,1,0.55,0.5297619047619048,0.5771625722013741,0.002879619598388672,0.0
155,6,RandomForest,1,0.55,0.5357142857142857,0.41412387656655203,0.0724029541015625,0.0
156,6,AdaBoost (Discrete),1,0.55,0.6666666666666666,0.5854162109806396,6.5433900356292725,0.0
157,6,AdaBoost (Real),1,0.55,0.5654761904761905,0.4591275608067731,7.574643850326538,0.0
158,6,Logistic Regression (Penalty = L2),1,0.55,0.6071428571428571,0.45548525911288373,0.12697172164916992,0.0
159,6,Naive Bayes,1,0.55,0.21428571428571427,0.35523893184824407,0.05617952346801758,0.0
160,6,KNeighbors Classifier,2,0.55,0.6012269938650306,0.6341550534258861,0.09764552116394043,0.0
161,6,SVC Classifier,2,0.55,0.5153374233128835,1.0,0.08978104591369629,0.0
162,6,Decision Tree,2,0.55,0.5460122699386503,0.5836775926580572,0.030280113220214844,0.0
163,6,RandomForest,2,0.55,0.5153374233128835,1.0,0.0919957160949707,0.0
164,6,AdaBoost (Discrete),2,0.55,0.7177914110429447,0.7146373343466932,6.368393182754517,0.0
165,6,AdaBoost (Real),2,0.55,0.4601226993865031,0.34992968210809505,7.94555401802063,0.0
166,6,Logistic Regression (Penalty = L2),2,0.55,0.6012269938650306,0.6286575913528465,0.07999372482299805,0.0
167,6,Naive Bayes,2,0.55,0.2147239263803681,0.4351080399835119,0.03265023231506348,0.0
168,7,KNeighbors Classifier,0,0.55,0.6184971098265896,0.5648393826236641,0.05959677696228027,0.0
169,7,SVC Classifier,0,0.55,0.49710982658959535,1.0,0.08423161506652832,0.0
170,7,Decision Tree,0,0.55,0.6011560693641619,0.5390983997661893,0.004248619079589844,0.0
171,7,RandomForest,0,0.55,0.5433526011560693,0.5081327481546147,0.10067057609558105,0.0
172,7,AdaBoost (Discrete),0,0.55,0.6589595375722543,0.639713802071713,8.890348672866821,0.0
173,7,AdaBoost (Real),0,0.55,0.5606936416184971,0.4294944404731636,9.56828784942627,0.0
174,7,Logistic Regression (Penalty = L2),0,0.55,0.5664739884393064,0.408525062729662,0.1684412956237793,0.0
175,7,Naive Bayes,0,0.55,0.2254335260115607,0.38729964885355406,0.03570890426635742,0.0
176,7,KNeighbors Classifier,1,0.55,0.6428571428571429,0.4459510229843529,0.12113523483276367,0.0
177,7,SVC Classifier,1,0.55,0.5119047619047619,1.0,0.08944964408874512,0.0
178,7,Decision Tree,1,0.55,0.5773809523809523,0.5407689894781859,0.023560523986816406,0.0
179,7,RandomForest,1,0.55,0.5654761904761905,0.43702365259419923,0.09909605979919434,0.0
180,7,AdaBoost (Discrete),1,0.55,0.7083333333333334,0.6849837238703538,8.73288345336914,0.0
181,7,AdaBoost (Real),1,0.55,0.5654761904761905,0.561922902207263,9.988268613815308,0.0
182,7,Logistic Regression (Penalty = L2),1,0.55,0.6011904761904762,0.555588840330063,0.15035271644592285,0.0
183,7,Naive Bayes,1,0.55,0.23809523809523808,0.4464725395449335,0.03183770179748535,0.0
184,7,KNeighbors Classifier,2,0.55,0.6134969325153374,0.6348533641853825,0.07840871810913086,0.0
185,7,SVC Classifier,2,0.55,0.5153374233128835,1.0,0.07450556755065918,0.0
186,7,Decision Tree,2,0.55,0.5644171779141104,0.5596878091306278,0.0030193328857421875,0.0
187,7,RandomForest,2,0.55,0.5828220858895705,0.8356569302044329,0.10474228858947754,0.0
188,7,AdaBoost (Discrete),2,0.55,0.6871165644171779,0.7211598264328949,8.226097106933594,0.0
189,7,AdaBoost (Real),2,0.55,0.5766871165644172,0.828076521952375,9.214719533920288,0.0
190,7,Logistic Regression (Penalty = L2),2,0.55,0.6012269938650306,0.47318282818028173,0.12873268127441406,0.0
191,7,Naive Bayes,2,0.55,0.294478527607362,0.4554663547947498,0.05567002296447754,0.4554663547947498
192,8,KNeighbors Classifier,0,0.55,0.6184971098265896,0.5013019448553069,0.0789022445678711,0.0
193,8,SVC Classifier,0,0.55,0.49710982658959535,1.0,0.06780385971069336,0.0
194,8,Decision Tree,0,0.55,0.5664739884393064,0.5610425711586866,0.0034475326538085938,0.0
195,8,RandomForest,0,0.55,0.5317919075144508,0.4527471870952893,0.04801058769226074,0.0
196,8,AdaBoost (Discrete),0,0.55,0.7052023121387283,0.6475530830725595,6.674414396286011,0.0
197,8,AdaBoost (Real),0,0.55,0.5491329479768786,0.3747306134319215,8.588775396347046,0.0
198,8,Logistic Regression (Penalty = L2),0,0.55,0.5780346820809249,0.3357138691826688,0.09963726997375488,0.0
199,8,Naive Bayes,0,0.55,0.19653179190751446,0.4260844950508116,0.070709228515625,0.0
200,8,KNeighbors Classifier,1,0.55,0.6488095238095238,0.45190573957597485,0.06385040283203125,0.0
201,8,SVC Classifier,1,0.55,0.5119047619047619,1.0,0.07507824897766113,0.0
202,8,Decision Tree,1,0.55,0.5059523809523809,0.6237081421749197,0.003713369369506836,0.0
203,8,RandomForest,1,0.55,0.5416666666666666,0.7682185118040817,0.11160111427307129,0.0
204,8,AdaBoost (Discrete),1,0.55,0.7202380952380952,0.566137544710284,7.888631105422974,0.0
205,8,AdaBoost (Real),1,0.55,0.5654761904761905,0.4585538662958038,8.476804733276367,0.0
206,8,Logistic Regression (Penalty = L2),1,0.55,0.6011904761904762,0.4608037968563122,0.13501715660095215,0.0
207,8,Naive Bayes,1,0.55,0.2261904761904762,0.355238931848244,0.06427788734436035,0.0
208,8,KNeighbors Classifier,2,0.55,0.6257668711656442,0.5618398372064319,0.0764167308807373,0.0
209,8,SVC Classifier,2,0.55,0.5153374233128835,1.0,0.051050662994384766,0.0
210,8,Decision Tree,2,0.55,0.4723926380368098,0.4772180190322492,0.0035834312438964844,0.0
211,8,RandomForest,2,0.55,0.5460122699386503,0.6786044041487267,0.05153512954711914,0.0
212,8,AdaBoost (Discrete),2,0.55,0.6748466257668712,0.5907647048254246,7.566303491592407,0.0
213,8,AdaBoost (Real),2,0.55,0.5337423312883436,0.635184598909605,8.171585321426392,0.0
214,8,Logistic Regression (Penalty = L2),2,0.55,0.6257668711656442,0.579872378304245,0.10350394248962402,0.0
215,8,Naive Bayes,2,0.55,0.22699386503067484,0.3461318241708453,0.062230825424194336,0.3461318241708453
216,9,KNeighbors Classifier,0,0.55,0.630057803468208,0.5487062698115216,0.12452816963195801,0.0
217,9,SVC Classifier,0,0.55,0.49710982658959535,1.0,0.12494230270385742,0.0
218,9,Decision Tree,0,0.55,0.6705202312138728,0.6572386400904963,0.004323482513427734,0.0
219,9,RandomForest,0,0.55,0.5433526011560693,0.48056228282695085,0.09852290153503418,0.0
220,9,AdaBoost (Discrete),0,0.55,0.7109826589595376,0.5992071658930147,11.423007249832153,0.0
221,9,AdaBoost (Real),0,0.55,0.6242774566473989,0.7096908170027858,11.841424226760864,0.0
222,9,Logistic Regression (Penalty = L2),0,0.55,0.6936416184971098,0.5876752898988371,0.20499944686889648,0.0
223,9,Naive Bayes,0,0.55,0.24855491329479767,0.6020213785339694,0.06105518341064453,0.0
224,9,KNeighbors Classifier,1,0.55,0.6785714285714286,0.6367636352935101,0.12053322792053223,0.0
225,9,SVC Classifier,1,0.55,0.5119047619047619,1.0,0.10253763198852539,0.0
226,9,Decision Tree,1,0.55,0.6666666666666666,0.6541762214551806,0.020762920379638672,0.6541762214551806
227,9,RandomForest,1,0.55,0.5833333333333334,0.40936135761380726,0.09650945663452148,0.0
228,9,AdaBoost (Discrete),1,0.55,0.7857142857142857,0.7579145838010831,10.447009801864624,0.0
229,9,AdaBoost (Real),1,0.55,0.5773809523809523,0.6146467650922804,11.068225860595703,0.0
230,9,Logistic Regression (Penalty = L2),1,0.55,0.7559523809523809,0.7227648283986995,0.22467732429504395,0.0
231,9,Naive Bayes,1,0.55,0.30357142857142855,0.5169532521852974,0.038475751876831055,0.0
232,9,KNeighbors Classifier,2,0.55,0.6687116564417178,0.725177389066728,0.10413646697998047,0.0
233,9,SVC Classifier,2,0.55,0.5153374233128835,1.0,0.034913063049316406,0.0
234,9,Decision Tree,2,0.55,0.6319018404907976,0.6076336431788844,0.004489898681640625,0.6076336431788844
235,9,RandomForest,2,0.55,0.5828220858895705,0.5884307860887648,0.026859760284423828,0.0
236,9,AdaBoost (Discrete),2,0.55,0.7300613496932515,0.617670666078499,9.947770833969116,0.0
237,9,AdaBoost (Real),2,0.55,0.588957055214724,0.7209875388009884,10.949682712554932,0.0
238,9,Logistic Regression (Penalty = L2),2,0.55,0.7361963190184049,0.6771478183234813,0.20466256141662598,0.0
239,9,Naive Bayes,2,0.55,0.2822085889570552,0.47135298638367557,0.04799628257751465,0.0
240,10,KNeighbors Classifier,0,0.55,0.630057803468208,0.5487062698115216,0.1352400779724121,0.0
241,10,SVC Classifier,0,0.55,0.49710982658959535,1.0,0.12116241455078125,0.0
242,10,Decision Tree,0,0.55,0.6242774566473989,0.6962927454824863,0.004229307174682617,0.0
243,10,RandomForest,0,0.55,0.5491329479768786,0.7952707287670506,0.08864784240722656,0.0
244,10,AdaBoost (Discrete),0,0.55,0.7341040462427746,0.5868628375932564,12.552643060684204,0.0
245,10,AdaBoost (Real),0,0.55,0.6011560693641619,0.6865023178167254,14.068621158599854,0.0
246,10,Logistic Regression (Penalty = L2),0,0.55,0.6763005780346821,0.6405105968189323,0.3132753372192383,0.0
247,10,Naive Bayes,0,0.55,0.26011560693641617,0.44572384648725094,0.07084798812866211,0.0
248,10,KNeighbors Classifier,1,0.55,0.6785714285714286,0.6144493090306604,0.3007683753967285,0.0
249,10,SVC Classifier,1,0.55,0.5119047619047619,1.0,0.2759842872619629,0.0
250,10,Decision Tree,1,0.55,0.5833333333333334,0.6426370299211736,0.022457599639892578,0.0
251,10,RandomForest,1,0.55,0.5654761904761905,0.5007470073692543,0.07583355903625488,0.0
252,10,AdaBoost (Discrete),1,0.55,0.7380952380952381,0.6589775368197217,13.06685733795166,0.0
253,10,AdaBoost (Real),1,0.55,0.6309523809523809,0.6563300788860192,13.234550952911377,0.0
254,10,Logistic Regression (Penalty = L2),1,0.55,0.7678571428571429,0.7344017014928284,0.20186090469360352,0.0
255,10,Naive Bayes,1,0.55,0.25595238095238093,0.4410714231202338,0.07428336143493652,0.0
256,10,KNeighbors Classifier,2,0.55,0.6625766871165644,0.8066677211281769,0.12338042259216309,0.0
257,10,SVC Classifier,2,0.55,0.5153374233128835,1.0,0.12664008140563965,0.0
258,10,Decision Tree,2,0.55,0.6257668711656442,0.6292205348673803,0.004749298095703125,0.0
259,10,RandomForest,2,0.55,0.5828220858895705,0.7801157731069053,0.04474306106567383,0.0
260,10,AdaBoost (Discrete),2,0.55,0.7791411042944786,0.7510770617155278,12.309325456619263,0.0
261,10,AdaBoost (Real),2,0.55,0.5705521472392638,0.7579202988035992,12.583198070526123,0.0
262,10,Logistic Regression (Penalty = L2),2,0.55,0.7423312883435583,0.706618561711062,0.37311530113220215,0.0
263,10,Naive Bayes,2,0.55,0.3128834355828221,0.5071242027385552,0.06929135322570801,0.5071242027385552
264,11,KNeighbors Classifier,0,0.55,0.6184971098265896,0.4656748645908193,0.1405186653137207,0.0
265,11,SVC Classifier,0,0.55,0.5028901734104047,0.5227579585747102,0.16441941261291504,0.0
266,11,Decision Tree,0,0.55,0.6473988439306358,0.7014030864576232,0.018277883529663086,0.0
267,11,RandomForest,0,0.55,0.5491329479768786,0.5856596027429395,0.05356240272521973,0.0
268,11,AdaBoost (Discrete),0,0.55,0.7398843930635838,0.591487143148534,12.123574256896973,0.0
269,11,AdaBoost (Real),0,0.55,0.6242774566473989,0.7244007043050418,12.745367527008057,0.0
270,11,Logistic Regression (Penalty = L2),0,0.55,0.7052023121387283,0.6295220049884405,0.2623715400695801,0.0
271,11,Naive Bayes,0,0.55,0.26011560693641617,0.44572384648725094,0.054473876953125,0.0
272,11,KNeighbors Classifier,1,0.55,0.6488095238095238,0.5416006572003343,0.15071964263916016,0.0
273,11,SVC Classifier,1,0.55,0.5178571428571429,0.5503212081491045,0.07383537292480469,0.0
274,11,Decision Tree,1,0.55,0.6130952380952381,0.6173248484150367,0.006647586822509766,0.0
275,11,RandomForest,1,0.55,0.5535714285714286,0.5595642461260143,0.025941848754882812,0.0
276,11,AdaBoost (Discrete),1,0.55,0.7380952380952381,0.6948236091838206,12.520745038986206,0.0
277,11,AdaBoost (Real),1,0.55,0.6607142857142857,0.6671125599275987,13.512516260147095,0.0
278,11,Logistic Regression (Penalty = L2),1,0.55,0.7202380952380952,0.6924255472005971,0.39469051361083984,0.0
279,11,Naive Bayes,1,0.55,0.25595238095238093,0.4410714231202338,0.07092928886413574,0.0
280,11,KNeighbors Classifier,2,0.55,0.6625766871165644,0.63891344867495,0.17917823791503906,0.0
281,11,SVC Classifier,2,0.55,0.5337423312883436,0.7937005259840998,0.15851831436157227,0.0
282,11,Decision Tree,2,0.55,0.6441717791411042,0.6922159598055284,0.017835140228271484,0.0
283,11,RandomForest,2,0.55,0.5766871165644172,0.4323454427308926,0.06531882286071777,0.0
284,11,AdaBoost (Discrete),2,0.55,0.7668711656441718,0.7526307793496223,11.924306392669678,0.0
285,11,AdaBoost (Real),2,0.55,0.6257668711656442,0.8513024447199062,11.869454383850098,0.0
286,11,Logistic Regression (Penalty = L2),2,0.55,0.7239263803680982,0.7441986594702524,0.2581164836883545,0.0
287,11,Naive Bayes,2,0.55,0.2883435582822086,0.49453559168067723,0.0932011604309082,0.0
288,12,KNeighbors Classifier,0,0.55,0.5953757225433526,0.4063270215906953,0.020071744918823242,0.0
289,12,SVC Classifier,0,0.55,0.49710982658959535,1.0,0.02173161506652832,0.0
290,12,Decision Tree,0,0.55,0.5144508670520231,0.5065665796606349,0.002588510513305664,0.0
291,12,RandomForest,0,0.55,0.5086705202312138,0.6586337560083495,0.06415700912475586,0.0
292,12,AdaBoost (Discrete),0,0.55,0.5317919075144508,0.4816282045972531,3.25964093208313,0.0
293,12,AdaBoost (Real),0,0.55,0.4508670520231214,0.4144042136437936,4.2918126583099365,0.0
294,12,Logistic Regression (Penalty = L2),0,0.55,0.5028901734104047,0.3889111187328203,0.008756160736083984,0.0
295,12,Naive Bayes,0,0.55,0.15028901734104047,0.43873842370431004,0.006423234939575195,0.0
296,12,KNeighbors Classifier,1,0.55,0.6130952380952381,0.5101396205777112,0.02129077911376953,0.0
297,12,SVC Classifier,1,0.55,0.5119047619047619,1.0,0.019939184188842773,0.0
298,12,Decision Tree,1,0.55,0.4880952380952381,0.5552912230126645,0.0025136470794677734,0.0
299,12,RandomForest,1,0.55,0.5178571428571429,0.5503212081491045,0.04668569564819336,0.0
300,12,AdaBoost (Discrete),1,0.55,0.5059523809523809,0.4251250040341881,3.176579236984253,0.0
301,12,AdaBoost (Real),1,0.55,0.4226190476190476,0.45769803880249105,3.707900047302246,0.0
302,12,Logistic Regression (Penalty = L2),1,0.55,0.5119047619047619,1.0,0.021711111068725586,0.0
303,12,Naive Bayes,1,0.55,0.13095238095238096,0.4769665294361879,0.017832040786743164,0.0
304,12,KNeighbors Classifier,2,0.55,0.6012269938650306,0.7275865484264552,0.019467830657958984,0.0
305,12,SVC Classifier,2,0.55,0.5153374233128835,1.0,0.009134292602539062,0.0
306,12,Decision Tree,2,0.55,0.4294478527607362,0.6076716569373237,0.0019097328186035156,0.0
307,12,RandomForest,2,0.55,0.5153374233128835,1.0,0.054177045822143555,0.0
308,12,AdaBoost (Discrete),2,0.55,0.4723926380368098,0.5668096541752684,3.5183472633361816,0.0
309,12,AdaBoost (Real),2,0.55,0.49693251533742333,0.3190682884084684,4.126765251159668,0.0
310,12,Logistic Regression (Penalty = L2),2,0.55,0.5214723926380368,0.3968502629920499,0.02368021011352539,0.0
311,12,Naive Bayes,2,0.55,0.13496932515337423,0.3805575662784702,0.007196664810180664,0.0
