,feat_set_id,classifier,fold_id,feat_th,score,geo_score,exec_t,geo_score_woz
0,0,KNeighbors Classifier,0,1.0,0.7840431913617276,0.7837489203171676,9.068073987960815,0.7837489203171676
1,0,SVC Classifier,0,1.0,0.8458308338332333,0.8395894872696271,6.143256425857544,0.8395894872696271
2,0,Decision Tree,0,1.0,0.7144571085782844,0.7144957690137713,0.1669597625732422,0.7144957690137713
3,0,RandomForest,0,1.0,0.7828434313137372,0.7794595578970417,0.37102723121643066,0.7794595578970417
4,0,AdaBoost (Discrete),0,1.0,0.8386322735452909,0.8386523361930156,79.17173790931702,0.8386523361930156
5,0,AdaBoost (Real),0,1.0,0.8254349130173965,0.8250196399584612,58.92387557029724,0.8250196399584612
6,0,Logistic Regression (Penalty = L2),0,1.0,0.8674265146970606,0.8672644951320224,0.6199047565460205,0.8672644951320224
7,0,Naive Bayes,0,1.0,0.8002399520095981,0.7748816045955451,0.0710289478302002,0.7748816045955451
8,0,KNeighbors Classifier,1,1.0,0.7756448710257948,0.7753556022946306,3.8835337162017822,0.7753556022946306
9,0,SVC Classifier,1,1.0,0.847630473905219,0.8428739984266588,3.0310001373291016,0.8428739984266588
10,0,Decision Tree,1,1.0,0.6976604679064187,0.6976605557762972,0.07596158981323242,0.6976605557762972
11,0,RandomForest,1,1.0,0.7558488302339532,0.7508261666234098,0.29727768898010254,0.7508261666234098
12,0,AdaBoost (Discrete),1,1.0,0.829634073185363,0.8293449797479536,40.88667821884155,0.8293449797479536
13,0,AdaBoost (Real),1,1.0,0.8188362327534493,0.818259428003751,39.41689991950989,0.818259428003751
14,0,Logistic Regression (Penalty = L2),1,1.0,0.8554289142171566,0.8553940078212201,0.14774584770202637,0.8553940078212201
15,0,Naive Bayes,1,1.0,0.7960407918416317,0.7722216985465098,0.06322407722473145,0.7722216985465098
16,0,KNeighbors Classifier,2,1.0,0.7881152460984394,0.7878673849869081,2.720470428466797,0.7878673849869081
17,0,SVC Classifier,2,1.0,0.8601440576230492,0.8543187689347056,1.9459846019744873,0.8543187689347056
18,0,Decision Tree,2,1.0,0.7112845138055222,0.7111603017938621,0.06576347351074219,0.7111603017938621
19,0,RandomForest,2,1.0,0.7971188475390156,0.7907648114446229,0.13706231117248535,0.7907648114446229
20,0,AdaBoost (Discrete),2,1.0,0.858343337334934,0.8579666129066809,26.35141372680664,0.8579666129066809
21,0,AdaBoost (Real),2,1.0,0.8415366146458584,0.840577492113014,24.958606004714966,0.840577492113014
22,0,Logistic Regression (Penalty = L2),2,1.0,0.8739495798319328,0.873930132505624,0.06938838958740234,0.873930132505624
23,0,Naive Bayes,2,1.0,0.8055222088835534,0.7779008581081963,0.02201390266418457,0.7779008581081963
