,feat_set_id,classifier,fold_id,feat_th,score,geo_score,exec_t,geo_score_woz
0,0,KNeighbors Classifier,0,0.65,0.8119402985074626,0.7485978428580097,1.0995371341705322,0.7485978428580097
1,0,SVC Classifier,0,0.65,0.7134328358208956,0.6786349049908055,1.7781529426574707,0.6786349049908055
2,0,Decision Tree,0,0.65,0.6119402985074627,0.5334053090182134,0.11207199096679688,0.5334053090182134
3,0,RandomForest,0,0.65,0.48656716417910445,0.37700189082424873,0.4256894588470459,0.0
4,0,AdaBoost (Discrete),0,0.65,0.7432835820895523,0.7154259763403458,83.71570897102356,0.7154259763403458
5,0,AdaBoost (Real),0,0.65,0.7223880597014926,0.6762520711611606,87.32504034042358,0.6762520711611606
6,0,Logistic Regression (Penalty = L2),0,0.65,0.8164179104477612,0.7650404783619887,0.8492352962493896,0.7650404783619887
7,0,Naive Bayes,0,0.65,0.7044776119402985,0.661596646168181,0.15072965621948242,0.661596646168181
8,0,KNeighbors Classifier,1,0.65,0.808955223880597,0.7622087414703979,0.9890627861022949,0.7622087414703979
9,0,SVC Classifier,1,0.65,0.7283582089552239,0.6924032618941414,1.6760756969451904,0.6924032618941414
10,0,Decision Tree,1,0.65,0.6208955223880597,0.5653938393022953,0.15774798393249512,0.5653938393022953
11,0,RandomForest,1,0.65,0.5477611940298508,0.48498476010070857,0.3876948356628418,0.0
12,0,AdaBoost (Discrete),1,0.65,0.735820895522388,0.7147963115824926,75.941819190979,0.7147963115824926
13,0,AdaBoost (Real),1,0.65,0.6522388059701493,0.6133035103967933,69.96687626838684,0.6133035103967933
14,0,Logistic Regression (Penalty = L2),1,0.65,0.8014925373134328,0.7541469259708444,0.7817411422729492,0.7541469259708444
15,0,Naive Bayes,1,0.65,0.7253731343283583,0.689751639814138,0.13883209228515625,0.689751639814138
16,0,KNeighbors Classifier,2,0.65,0.8166666666666667,0.769935237685,0.9219532012939453,0.769935237685
17,0,SVC Classifier,2,0.65,0.7333333333333333,0.7015067571602641,1.6055915355682373,0.7015067571602641
18,0,Decision Tree,2,0.65,0.6409090909090909,0.5836170607203611,0.10886740684509277,0.5836170607203611
19,0,RandomForest,2,0.65,0.45,0.3739520324925776,0.3894975185394287,0.0
20,0,AdaBoost (Discrete),2,0.65,0.759090909090909,0.7292335302797142,70.62711024284363,0.7292335302797142
21,0,AdaBoost (Real),2,0.65,0.693939393939394,0.6640059772930768,72.53950262069702,0.6640059772930768
22,0,Logistic Regression (Penalty = L2),2,0.65,0.8136363636363636,0.7696278380538356,0.7703423500061035,0.7696278380538356
23,0,Naive Bayes,2,0.65,0.7212121212121212,0.6902416443946807,0.07512116432189941,0.6902416443946807
24,1,KNeighbors Classifier,0,0.65,0.7134328358208956,0.6563121327990953,0.8669085502624512,0.6563121327990953
25,1,SVC Classifier,0,0.65,0.6343283582089553,0.5621838101630594,1.6157915592193604,0.5621838101630594
26,1,Decision Tree,0,0.65,0.573134328358209,0.4943846215049261,0.1074676513671875,0.4943846215049261
27,1,RandomForest,0,0.65,0.5253731343283582,0.531737795130469,0.35552334785461426,0.0
28,1,AdaBoost (Discrete),0,0.65,0.6970149253731344,0.6678585818827005,70.7058482170105,0.6678585818827005
29,1,AdaBoost (Real),0,0.65,0.4462686567164179,0.40439568441913937,72.8534049987793,0.40439568441913937
30,1,Logistic Regression (Penalty = L2),0,0.65,0.8,0.7487414486001703,0.8478975296020508,0.7487414486001703
31,1,Naive Bayes,0,0.65,0.6417910447761194,0.606157201111766,0.14601349830627441,0.606157201111766
32,1,KNeighbors Classifier,1,0.65,0.7328358208955223,0.668998322633304,0.8124659061431885,0.668998322633304
33,1,SVC Classifier,1,0.65,0.6776119402985075,0.6175759243035811,1.7692759037017822,0.6175759243035811
34,1,Decision Tree,1,0.65,0.5746268656716418,0.5251076465182635,0.10735869407653809,0.5251076465182635
35,1,RandomForest,1,0.65,0.5029850746268657,0.4691327425121686,0.3598291873931885,0.0
36,1,AdaBoost (Discrete),1,0.65,0.7238805970149254,0.6983203401111818,93.21383953094482,0.6983203401111818
37,1,AdaBoost (Real),1,0.65,0.6492537313432836,0.6183123683237991,97.60563683509827,0.6183123683237991
38,1,Logistic Regression (Penalty = L2),1,0.65,0.7776119402985074,0.7253618723077159,1.143148422241211,0.7253618723077159
39,1,Naive Bayes,1,0.65,0.7104477611940299,0.663345956569731,0.14956426620483398,0.663345956569731
40,1,KNeighbors Classifier,2,0.65,0.7515151515151515,0.7010574490940762,1.1601297855377197,0.7010574490940762
41,1,SVC Classifier,2,0.65,0.6757575757575758,0.6175298373867144,2.398663282394409,0.6175298373867144
42,1,Decision Tree,2,0.65,0.6015151515151516,0.5310690923793017,0.1560382843017578,0.5310690923793017
43,1,RandomForest,2,0.65,0.4803030303030303,0.394676896373364,0.4595217704772949,0.0
44,1,AdaBoost (Discrete),2,0.65,0.6893939393939394,0.6514963415875284,99.7608597278595,0.6514963415875284
45,1,AdaBoost (Real),2,0.65,0.6727272727272727,0.6313202972744035,97.10651969909668,0.6313202972744035
46,1,Logistic Regression (Penalty = L2),2,0.65,0.8272727272727273,0.7845467404663997,1.1711907386779785,0.7845467404663997
47,1,Naive Bayes,2,0.65,0.6833333333333333,0.6473762571439863,0.15246176719665527,0.6473762571439863
48,2,KNeighbors Classifier,0,0.65,0.7731343283582089,0.7218983975449763,1.1594982147216797,0.7218983975449763
49,2,SVC Classifier,0,0.65,0.6791044776119403,0.6378680564244787,2.0290541648864746,0.6378680564244787
50,2,Decision Tree,0,0.65,0.5850746268656717,0.5198949860692054,0.1520371437072754,0.5198949860692054
51,2,RandomForest,0,0.65,0.49701492537313435,0.4881418396306286,0.5926940441131592,0.0
52,2,AdaBoost (Discrete),0,0.65,0.7179104477611941,0.6953269068111277,101.69587087631226,0.6953269068111277
53,2,AdaBoost (Real),0,0.65,0.6791044776119403,0.6347550727922089,101.68739414215088,0.6347550727922089
54,2,Logistic Regression (Penalty = L2),0,0.65,0.8134328358208955,0.7680558333801999,1.2942066192626953,0.7680558333801999
55,2,Naive Bayes,0,0.65,0.6850746268656717,0.6450838323047047,0.16155505180358887,0.6450838323047047
56,2,KNeighbors Classifier,1,0.65,0.7731343283582089,0.7150540934196794,1.446547269821167,0.7150540934196794
57,2,SVC Classifier,1,0.65,0.7029850746268657,0.6607753276690493,2.4107718467712402,0.6607753276690493
58,2,Decision Tree,1,0.65,0.6059701492537314,0.5594410482443286,0.11478972434997559,0.5594410482443286
59,2,RandomForest,1,0.65,0.4835820895522388,0.36332948692173433,0.4995083808898926,0.0
60,2,AdaBoost (Discrete),1,0.65,0.7298507462686568,0.704972660682911,109.45816469192505,0.704972660682911
61,2,AdaBoost (Real),1,0.65,0.6925373134328359,0.6533561095528805,125.228684425354,0.6533561095528805
62,2,Logistic Regression (Penalty = L2),1,0.65,0.7895522388059701,0.7460673612161205,1.679227590560913,0.7460673612161205
63,2,Naive Bayes,1,0.65,0.7238805970149254,0.6795288263825199,0.19551706314086914,0.6795288263825199
64,2,KNeighbors Classifier,2,0.65,0.796969696969697,0.7482293440160289,1.4597084522247314,0.7482293440160289
65,2,SVC Classifier,2,0.65,0.7090909090909091,0.666198038915638,2.7799980640411377,0.666198038915638
66,2,Decision Tree,2,0.65,0.5954545454545455,0.554067107626724,0.18916893005371094,0.554067107626724
67,2,RandomForest,2,0.65,0.5106060606060606,0.29092129151527624,0.6366345882415771,0.0
68,2,AdaBoost (Discrete),2,0.65,0.7318181818181818,0.6975348336900776,124.26611423492432,0.6975348336900776
69,2,AdaBoost (Real),2,0.65,0.6439393939393939,0.6131886833598212,124.38430500030518,0.6131886833598212
70,2,Logistic Regression (Penalty = L2),2,0.65,0.8348484848484848,0.7965201976090052,1.3074064254760742,0.7965201976090052
71,2,Naive Bayes,2,0.65,0.7045454545454546,0.6664236880307507,0.19847416877746582,0.6664236880307507
72,3,KNeighbors Classifier,0,0.65,0.8074626865671641,0.7540857385627932,1.7903172969818115,0.7540857385627932
73,3,SVC Classifier,0,0.65,0.7283582089552239,0.6978395319575281,2.7889180183410645,0.6978395319575281
74,3,Decision Tree,0,0.65,0.6238805970149254,0.5582499851138938,0.1910560131072998,0.5582499851138938
75,3,RandomForest,0,0.65,0.5268656716417911,0.39385719892151144,0.55426025390625,0.39385719892151144
76,3,AdaBoost (Discrete),0,0.65,0.7283582089552239,0.6915286278244398,123.88747549057007,0.6915286278244398
77,3,AdaBoost (Real),0,0.65,0.664179104477612,0.6222538302767647,124.26410698890686,0.6222538302767647
78,3,Logistic Regression (Penalty = L2),0,0.65,0.8134328358208955,0.7660823026848886,1.5080018043518066,0.7660823026848886
79,3,Naive Bayes,0,0.65,0.7283582089552239,0.6966493367789662,0.19097614288330078,0.6966493367789662
80,3,KNeighbors Classifier,1,0.65,0.7940298507462686,0.7379556753667105,1.7314190864562988,0.7379556753667105
81,3,SVC Classifier,1,0.65,0.7149253731343284,0.6510711820554986,2.8790299892425537,0.6510711820554986
82,3,Decision Tree,1,0.65,0.591044776119403,0.5324804041816054,0.19150280952453613,0.5324804041816054
83,3,RandomForest,1,0.65,0.5059701492537313,0.44275822348228283,0.6366462707519531,0.0
84,3,AdaBoost (Discrete),1,0.65,0.6985074626865672,0.6628135858652398,125.81643438339233,0.6628135858652398
85,3,AdaBoost (Real),1,0.65,0.6701492537313433,0.6404855564430704,126.8881607055664,0.6404855564430704
86,3,Logistic Regression (Penalty = L2),1,0.65,0.7925373134328358,0.7376700890178292,1.4855237007141113,0.7376700890178292
87,3,Naive Bayes,1,0.65,0.7402985074626866,0.6887194954695205,0.2172071933746338,0.6887194954695205
88,3,KNeighbors Classifier,2,0.65,0.8075757575757576,0.7540766003733241,1.9116754531860352,0.7540766003733241
89,3,SVC Classifier,2,0.65,0.7439393939393939,0.7091119351933114,2.9905121326446533,0.7091119351933114
90,3,Decision Tree,2,0.65,0.6378787878787879,0.5838287602190221,0.13746976852416992,0.5838287602190221
91,3,RandomForest,2,0.65,0.5454545454545454,0.3167438182534145,0.7020349502563477,0.3167438182534145
92,3,AdaBoost (Discrete),2,0.65,0.7378787878787879,0.7144074622414369,128.6440920829773,0.7144074622414369
93,3,AdaBoost (Real),2,0.65,0.6984848484848485,0.6707436619094382,126.01996040344238,0.6707436619094382
94,3,Logistic Regression (Penalty = L2),2,0.65,0.8333333333333334,0.7913904669385184,1.7816729545593262,0.7913904669385184
95,3,Naive Bayes,2,0.65,0.7257575757575757,0.6879386236401386,0.18227815628051758,0.6879386236401386
96,4,KNeighbors Classifier,0,0.65,0.7014925373134329,0.6440540211764348,0.7941913604736328,0.6440540211764348
97,4,SVC Classifier,0,0.65,0.5850746268656717,0.496893398340231,2.779256820678711,0.496893398340231
98,4,Decision Tree,0,0.65,0.5611940298507463,0.49383717582918335,0.28148484230041504,0.49383717582918335
99,4,RandomForest,0,0.65,0.5298507462686567,0.2841573678667809,0.8646531105041504,0.2841573678667809
100,4,AdaBoost (Discrete),0,0.65,0.6701492537313433,0.6460473476146167,103.56342196464539,0.6460473476146167
101,4,AdaBoost (Real),0,0.65,0.5149253731343284,0.44000498203314453,102.66332626342773,0.44000498203314453
102,4,Logistic Regression (Penalty = L2),0,0.65,0.753731343283582,0.7040655528162062,1.0810248851776123,0.7040655528162062
103,4,Naive Bayes,0,0.65,0.6268656716417911,0.5693347645555912,0.16018199920654297,0.5693347645555912
104,4,KNeighbors Classifier,1,0.65,0.7104477611940299,0.6581129467560538,0.7518155574798584,0.6581129467560538
105,4,SVC Classifier,1,0.65,0.6029850746268657,0.5110528750343691,2.326221227645874,0.5110528750343691
106,4,Decision Tree,1,0.65,0.5552238805970149,0.503232635129427,0.1537492275238037,0.503232635129427
107,4,RandomForest,1,0.65,0.5223880597014925,0.7150940649787986,0.6955883502960205,0.0
108,4,AdaBoost (Discrete),1,0.65,0.655223880597015,0.6255159693606998,91.4403624534607,0.6255159693606998
109,4,AdaBoost (Real),1,0.65,0.5343283582089552,0.47152870806970737,100.14533114433289,0.47152870806970737
110,4,Logistic Regression (Penalty = L2),1,0.65,0.7253731343283583,0.6650259994767648,1.0872633457183838,0.6650259994767648
111,4,Naive Bayes,1,0.65,0.6238805970149254,0.5745844816212471,0.15198755264282227,0.5745844816212471
112,4,KNeighbors Classifier,2,0.65,0.6954545454545454,0.6290188587157288,0.8780841827392578,0.6290188587157288
113,4,SVC Classifier,2,0.65,0.6136363636363636,0.5624843930555234,2.778752565383911,0.5624843930555234
114,4,Decision Tree,2,0.65,0.6212121212121212,0.5726299129234882,0.23706531524658203,0.5726299129234882
115,4,RandomForest,2,0.65,0.5106060606060606,0.27690211490231326,0.5622401237487793,0.0
116,4,AdaBoost (Discrete),2,0.65,0.6893939393939394,0.6663010449505337,97.94199013710022,0.6663010449505337
117,4,AdaBoost (Real),2,0.65,0.6015151515151516,0.5672581601870554,103.23374581336975,0.5672581601870554
118,4,Logistic Regression (Penalty = L2),2,0.65,0.7575757575757576,0.6883671840179327,1.0868098735809326,0.6883671840179327
119,4,Naive Bayes,2,0.65,0.6424242424242425,0.605613338165506,0.15549397468566895,0.605613338165506
120,5,KNeighbors Classifier,0,0.65,0.7761194029850746,0.7219288500443307,1.3588497638702393,0.7219288500443307
121,5,SVC Classifier,0,0.65,0.6656716417910448,0.6152750440424336,2.810859203338623,0.6152750440424336
122,5,Decision Tree,0,0.65,0.5791044776119403,0.514130179347362,0.16085338592529297,0.514130179347362
123,5,RandomForest,0,0.65,0.4746268656716418,0.3136572504506426,0.7971494197845459,0.0
124,5,AdaBoost (Discrete),0,0.65,0.7328358208955223,0.7003578027925639,127.44202971458435,0.7003578027925639
125,5,AdaBoost (Real),0,0.65,0.6253731343283582,0.551973621772577,130.25627446174622,0.551973621772577
126,5,Logistic Regression (Penalty = L2),0,0.65,0.7880597014925373,0.7351311543803909,1.3573756217956543,0.7351311543803909
127,5,Naive Bayes,0,0.65,0.6537313432835821,0.5990939515984797,0.164276123046875,0.5990939515984797
128,5,KNeighbors Classifier,1,0.65,0.7746268656716417,0.7214435519061684,1.351943016052246,0.7214435519061684
129,5,SVC Classifier,1,0.65,0.6597014925373135,0.6092085062806502,2.957230567932129,0.6092085062806502
130,5,Decision Tree,1,0.65,0.6,0.5487633931880481,0.15554356575012207,0.5487633931880481
131,5,RandomForest,1,0.65,0.48955223880597015,0.3665358854509194,0.7243020534515381,0.0
132,5,AdaBoost (Discrete),1,0.65,0.691044776119403,0.6598060421897315,125.49649858474731,0.6598060421897315
133,5,AdaBoost (Real),1,0.65,0.6432835820895523,0.6053387814461374,126.37903118133545,0.6053387814461374
134,5,Logistic Regression (Penalty = L2),1,0.65,0.764179104477612,0.7111778058677086,1.370887279510498,0.7111778058677086
135,5,Naive Bayes,1,0.65,0.6761194029850747,0.6376753725242638,0.19736075401306152,0.6376753725242638
136,5,KNeighbors Classifier,2,0.65,0.7878787878787878,0.7417937400278025,1.4985849857330322,0.7417937400278025
137,5,SVC Classifier,2,0.65,0.7045454545454546,0.6687589986693389,2.7344744205474854,0.6687589986693389
138,5,Decision Tree,2,0.65,0.6151515151515151,0.5542302784239889,0.15374326705932617,0.5542302784239889
139,5,RandomForest,2,0.65,0.49696969696969695,0.5323518103872399,0.6564571857452393,0.0
140,5,AdaBoost (Discrete),2,0.65,0.7242424242424242,0.6940160134180594,120.14863729476929,0.6940160134180594
141,5,AdaBoost (Real),2,0.65,0.6212121212121212,0.5730853571619821,120.41610908508301,0.5730853571619821
142,5,Logistic Regression (Penalty = L2),2,0.65,0.793939393939394,0.7445776053122872,1.321028709411621,0.7445776053122872
143,5,Naive Bayes,2,0.65,0.6742424242424242,0.6384534024867989,0.16383838653564453,0.6384534024867989
144,6,KNeighbors Classifier,0,0.65,0.7865671641791044,0.7312040684184775,1.0554628372192383,0.7312040684184775
145,6,SVC Classifier,0,0.65,0.6656716417910448,0.6153832742520174,2.3950142860412598,0.6153832742520174
146,6,Decision Tree,0,0.65,0.6,0.5291799501486938,0.15235257148742676,0.5291799501486938
147,6,RandomForest,0,0.65,0.5104477611940299,0.3185802558674192,0.644566535949707,0.3185802558674192
148,6,AdaBoost (Discrete),0,0.65,0.7014925373134329,0.6610514748207772,96.3394021987915,0.6610514748207772
149,6,AdaBoost (Real),0,0.65,0.6313432835820896,0.5746009546586128,102.55256652832031,0.5746009546586128
150,6,Logistic Regression (Penalty = L2),0,0.65,0.7701492537313432,0.7235212576091079,1.1004412174224854,0.7235212576091079
151,6,Naive Bayes,0,0.65,0.6880597014925374,0.6446004754305091,0.22974395751953125,0.6446004754305091
152,6,KNeighbors Classifier,1,0.65,0.7686567164179104,0.7066894154096306,1.1928870677947998,0.7066894154096306
153,6,SVC Classifier,1,0.65,0.6865671641791045,0.6440930488533072,2.481640338897705,0.6440930488533072
154,6,Decision Tree,1,0.65,0.6104477611940299,0.5613092312070175,0.23034048080444336,0.5613092312070175
155,6,RandomForest,1,0.65,0.5044776119402985,0.4641981735134185,0.6409285068511963,0.0
156,6,AdaBoost (Discrete),1,0.65,0.6985074626865672,0.6620031500775959,97.4118595123291,0.6620031500775959
157,6,AdaBoost (Real),1,0.65,0.6283582089552239,0.5928938272036371,100.53965663909912,0.5928938272036371
158,6,Logistic Regression (Penalty = L2),1,0.65,0.7656716417910447,0.7140408743779255,0.8951075077056885,0.7140408743779255
159,6,Naive Bayes,1,0.65,0.7149253731343284,0.6771700618231811,0.13944077491760254,0.6771700618231811
160,6,KNeighbors Classifier,2,0.65,0.7757575757575758,0.7143295999838714,1.0118319988250732,0.7143295999838714
161,6,SVC Classifier,2,0.65,0.7,0.6720120491620838,2.371614456176758,0.6720120491620838
162,6,Decision Tree,2,0.65,0.6318181818181818,0.578394602347701,0.22921252250671387,0.578394602347701
163,6,RandomForest,2,0.65,0.5651515151515152,0.6803317604893824,0.636993408203125,0.0
164,6,AdaBoost (Discrete),2,0.65,0.7045454545454546,0.6726711298663266,95.34741067886353,0.6726711298663266
165,6,AdaBoost (Real),2,0.65,0.6681818181818182,0.6212978308106799,106.71810412406921,0.6212978308106799
166,6,Logistic Regression (Penalty = L2),2,0.65,0.7878787878787878,0.7439877579406365,1.26784348487854,0.7439877579406365
167,6,Naive Bayes,2,0.65,0.703030303030303,0.6712278464056912,0.14020466804504395,0.6712278464056912
168,7,KNeighbors Classifier,0,0.65,0.7343283582089553,0.6921126543181785,1.2815208435058594,0.6921126543181785
169,7,SVC Classifier,0,0.65,0.6238805970149254,0.5725861244168758,2.919762134552002,0.5725861244168758
170,7,Decision Tree,0,0.65,0.5701492537313433,0.5045717774537439,0.22628498077392578,0.5045717774537439
171,7,RandomForest,0,0.65,0.5014925373134328,0.3403754143311058,0.6073715686798096,0.0
172,7,AdaBoost (Discrete),0,0.65,0.6791044776119403,0.6479455303750385,120.04000663757324,0.6479455303750385
173,7,AdaBoost (Real),0,0.65,0.6283582089552239,0.5959126657356929,120.06352806091309,0.5959126657356929
174,7,Logistic Regression (Penalty = L2),0,0.65,0.8059701492537313,0.7704185264660858,1.2179913520812988,0.7704185264660858
175,7,Naive Bayes,0,0.65,0.6611940298507463,0.6297916114036418,0.19882798194885254,0.6297916114036418
176,7,KNeighbors Classifier,1,0.65,0.7328358208955223,0.677157674562876,1.1367297172546387,0.677157674562876
177,7,SVC Classifier,1,0.65,0.6402985074626866,0.5902009752328674,2.6643974781036377,0.5902009752328674
178,7,Decision Tree,1,0.65,0.5940298507462687,0.5445974808538022,0.2064800262451172,0.5445974808538022
179,7,RandomForest,1,0.65,0.5044776119402985,0.31597170462005714,0.7092478275299072,0.0
180,7,AdaBoost (Discrete),1,0.65,0.682089552238806,0.6530755603875036,114.08813881874084,0.6530755603875036
181,7,AdaBoost (Real),1,0.65,0.6388059701492538,0.6097162473675297,118.84746050834656,0.6097162473675297
182,7,Logistic Regression (Penalty = L2),1,0.65,0.7686567164179104,0.7155380017465431,1.5926783084869385,0.7155380017465431
183,7,Naive Bayes,1,0.65,0.6895522388059702,0.6481097285809747,0.15015697479248047,0.6481097285809747
184,7,KNeighbors Classifier,2,0.65,0.7303030303030303,0.6708772668808884,1.301809549331665,0.6708772668808884
185,7,SVC Classifier,2,0.65,0.6530303030303031,0.6055447410082855,2.8307945728302,0.6055447410082855
186,7,Decision Tree,2,0.65,0.5893939393939394,0.5407695407228276,0.148146390914917,0.5407695407228276
187,7,RandomForest,2,0.65,0.4696969696969697,0.38440668303651787,0.6600141525268555,0.0
188,7,AdaBoost (Discrete),2,0.65,0.693939393939394,0.6546833053953257,116.40275382995605,0.6546833053953257
189,7,AdaBoost (Real),2,0.65,0.6712121212121213,0.6435048294850829,119.01269268989563,0.6435048294850829
190,7,Logistic Regression (Penalty = L2),2,0.65,0.8166666666666667,0.7704344331301972,1.353651523590088,0.7704344331301972
191,7,Naive Bayes,2,0.65,0.6651515151515152,0.6198375465921877,0.21408629417419434,0.6198375465921877
192,8,KNeighbors Classifier,0,0.65,0.7074626865671642,0.6466425054561011,1.1551496982574463,0.6466425054561011
193,8,SVC Classifier,0,0.65,0.6149253731343284,0.522235069879625,2.8402624130249023,0.522235069879625
194,8,Decision Tree,0,0.65,0.5776119402985075,0.5159418799145876,0.21486759185791016,0.5159418799145876
195,8,RandomForest,0,0.65,0.47761194029850745,0.5425738867438883,0.6497893333435059,0.0
196,8,AdaBoost (Discrete),0,0.65,0.6656716417910448,0.6433973455674793,103.1803331375122,0.6433973455674793
197,8,AdaBoost (Real),0,0.65,0.5686567164179105,0.5238914509323732,107.4314215183258,0.5238914509323732
198,8,Logistic Regression (Penalty = L2),0,0.65,0.7835820895522388,0.7391895928244223,1.3143930435180664,0.7391895928244223
199,8,Naive Bayes,0,0.65,0.6477611940298508,0.6054151977698045,0.1868724822998047,0.6054151977698045
200,8,KNeighbors Classifier,1,0.65,0.7104477611940299,0.6570318190816248,1.1347925662994385,0.6570318190816248
201,8,SVC Classifier,1,0.65,0.6373134328358209,0.5507896389403708,2.5395662784576416,0.5507896389403708
202,8,Decision Tree,1,0.65,0.591044776119403,0.535819447598981,0.13658499717712402,0.535819447598981
203,8,RandomForest,1,0.65,0.49701492537313435,0.34297171889983913,0.6022131443023682,0.0
204,8,AdaBoost (Discrete),1,0.65,0.6835820895522388,0.6387133504947365,101.32234477996826,0.6387133504947365
205,8,AdaBoost (Real),1,0.65,0.5835820895522388,0.5334196082748714,108.24275708198547,0.5334196082748714
206,8,Logistic Regression (Penalty = L2),1,0.65,0.7567164179104477,0.7125252171906556,1.3571264743804932,0.7125252171906556
207,8,Naive Bayes,1,0.65,0.6985074626865672,0.6495297759552262,0.16017508506774902,0.6495297759552262
208,8,KNeighbors Classifier,2,0.65,0.7424242424242424,0.6910676380518279,1.108858346939087,0.6910676380518279
209,8,SVC Classifier,2,0.65,0.6515151515151515,0.5830073744886626,2.5205836296081543,0.5830073744886626
210,8,Decision Tree,2,0.65,0.5742424242424242,0.5170593861700999,0.13719916343688965,0.5170593861700999
211,8,RandomForest,2,0.65,0.5227272727272727,0.3755982879529903,0.6162726879119873,0.0
212,8,AdaBoost (Discrete),2,0.65,0.7075757575757575,0.6855934514790754,102.31845760345459,0.6855934514790754
213,8,AdaBoost (Real),2,0.65,0.6363636363636364,0.5873293061275862,105.00473666191101,0.5873293061275862
214,8,Logistic Regression (Penalty = L2),2,0.65,0.8045454545454546,0.7552001799461215,1.2575016021728516,0.7552001799461215
215,8,Naive Bayes,2,0.65,0.6848484848484848,0.6423465359268432,0.12172818183898926,0.6423465359268432
216,9,KNeighbors Classifier,0,0.65,0.7313432835820896,0.6748282307765996,0.904407262802124,0.6748282307765996
217,9,SVC Classifier,0,0.65,0.6238805970149254,0.5585160457385018,2.1108107566833496,0.5585160457385018
218,9,Decision Tree,0,0.65,0.5850746268656717,0.5181783986576586,0.1245272159576416,0.5181783986576586
219,9,RandomForest,0,0.65,0.5149253731343284,0.42127390559013406,0.581362247467041,0.0
220,9,AdaBoost (Discrete),0,0.65,0.6955223880597015,0.6538236363484965,89.77292346954346,0.6538236363484965
221,9,AdaBoost (Real),0,0.65,0.5522388059701493,0.500729989679155,99.85819745063782,0.500729989679155
222,9,Logistic Regression (Penalty = L2),0,0.65,0.7626865671641792,0.7229746138831271,1.0772767066955566,0.7229746138831271
223,9,Naive Bayes,0,0.65,0.6761194029850747,0.6390698491967343,0.2001357078552246,0.6390698491967343
224,9,KNeighbors Classifier,1,0.65,0.7492537313432835,0.6938594515757275,0.942183256149292,0.6938594515757275
225,9,SVC Classifier,1,0.65,0.6462686567164179,0.5950420904991256,2.379706382751465,0.5950420904991256
226,9,Decision Tree,1,0.65,0.5925373134328358,0.5384438109954637,0.2024829387664795,0.5384438109954637
227,9,RandomForest,1,0.65,0.5,0.3267385001365047,0.547785758972168,0.3267385001365047
228,9,AdaBoost (Discrete),1,0.65,0.6985074626865672,0.6746710670982461,90.58488154411316,0.6746710670982461
229,9,AdaBoost (Real),1,0.65,0.6343283582089553,0.5988724269545541,97.16065335273743,0.5988724269545541
230,9,Logistic Regression (Penalty = L2),1,0.65,0.7597014925373134,0.7125700613506789,1.0619688034057617,0.7125700613506789
231,9,Naive Bayes,1,0.65,0.7089552238805971,0.6666267256085247,0.1363518238067627,0.6666267256085247
232,9,KNeighbors Classifier,2,0.65,0.7696969696969697,0.7210904307372051,0.9550454616546631,0.7210904307372051
233,9,SVC Classifier,2,0.65,0.6530303030303031,0.6019682956370037,2.2920374870300293,0.6019682956370037
234,9,Decision Tree,2,0.65,0.5954545454545455,0.5461735709815578,0.13624954223632812,0.5461735709815578
235,9,RandomForest,2,0.65,0.48484848484848486,0.3168203589335197,0.5509011745452881,0.0
236,9,AdaBoost (Discrete),2,0.65,0.7151515151515152,0.6728368953971325,91.2226927280426,0.6728368953971325
237,9,AdaBoost (Real),2,0.65,0.5454545454545454,0.4743824892410382,95.75620007514954,0.4743824892410382
238,9,Logistic Regression (Penalty = L2),2,0.65,0.7893939393939394,0.7397666191180307,1.0542588233947754,0.7397666191180307
239,9,Naive Bayes,2,0.65,0.693939393939394,0.6598403410494762,0.12449812889099121,0.6598403410494762
240,10,KNeighbors Classifier,0,0.65,0.7895522388059701,0.7384199000365139,2.367696762084961,0.7384199000365139
241,10,SVC Classifier,0,0.65,0.7373134328358208,0.7048351040967952,3.605246067047119,0.7048351040967952
242,10,Decision Tree,0,0.65,0.6134328358208955,0.5610755387884743,0.27118897438049316,0.5610755387884743
243,10,RandomForest,0,0.65,0.5,0.31081782188684043,0.7479205131530762,0.31081782188684043
244,10,AdaBoost (Discrete),0,0.65,0.7507462686567165,0.723435031943083,159.81954288482666,0.723435031943083
245,10,AdaBoost (Real),0,0.65,0.7238805970149254,0.6940305193168579,151.35960960388184,0.6940305193168579
246,10,Logistic Regression (Penalty = L2),0,0.65,0.826865671641791,0.7729080878494993,1.905717134475708,0.7729080878494993
247,10,Naive Bayes,0,0.65,0.7104477611940299,0.6739798945901255,0.19582390785217285,0.6739798945901255
248,10,KNeighbors Classifier,1,0.65,0.7940298507462686,0.7366277756714769,2.117802619934082,0.7366277756714769
249,10,SVC Classifier,1,0.65,0.744776119402985,0.6889525389815703,3.1231729984283447,0.6889525389815703
250,10,Decision Tree,1,0.65,0.5940298507462687,0.5364595984300347,0.18053555488586426,0.5364595984300347
251,10,RandomForest,1,0.65,0.5029850746268657,0.4554853870788959,0.5382754802703857,0.0
252,10,AdaBoost (Discrete),1,0.65,0.7626865671641792,0.7406809749163725,146.79068422317505,0.7406809749163725
253,10,AdaBoost (Real),1,0.65,0.6970149253731344,0.6682348190274177,145.86167359352112,0.6682348190274177
254,10,Logistic Regression (Penalty = L2),1,0.65,0.8,0.7465120523630874,1.735677719116211,0.7465120523630874
255,10,Naive Bayes,1,0.65,0.755223880597015,0.7020970911382303,0.167100191116333,0.7020970911382303
256,10,KNeighbors Classifier,2,0.65,0.8181818181818182,0.7778402360567107,2.044851779937744,0.7778402360567107
257,10,SVC Classifier,2,0.65,0.7712121212121212,0.7392214720947765,3.208895206451416,0.7392214720947765
258,10,Decision Tree,2,0.65,0.6318181818181818,0.5859337295833338,0.28917980194091797,0.5859337295833338
259,10,RandomForest,2,0.65,0.5575757575757576,0.6416229402999862,0.6011641025543213,0.0
260,10,AdaBoost (Discrete),2,0.65,0.7363636363636363,0.6999866133032162,147.31598806381226,0.6999866133032162
261,10,AdaBoost (Real),2,0.65,0.6848484848484848,0.6556482527501193,141.83704948425293,0.6556482527501193
262,10,Logistic Regression (Penalty = L2),2,0.65,0.8393939393939394,0.7996209675836133,1.8665101528167725,0.7996209675836133
263,10,Naive Bayes,2,0.65,0.7318181818181818,0.6932967223946562,0.16777706146240234,0.6932967223946562
264,11,KNeighbors Classifier,0,0.65,0.8074626865671641,0.7500144509395629,2.7512359619140625,0.7500144509395629
265,11,SVC Classifier,0,0.65,0.7597014925373134,0.7254318967282575,3.6026384830474854,0.7254318967282575
266,11,Decision Tree,0,0.65,0.5970149253731343,0.512021760216062,0.24469804763793945,0.512021760216062
267,11,RandomForest,0,0.65,0.4552238805970149,0.28147025604272446,0.7278409004211426,0.0
268,11,AdaBoost (Discrete),0,0.65,0.746268656716418,0.7170805766671005,181.78869676589966,0.7170805766671005
269,11,AdaBoost (Real),0,0.65,0.664179104477612,0.6260230488019228,178.92859888076782,0.6260230488019228
270,11,Logistic Regression (Penalty = L2),0,0.65,0.826865671641791,0.7818376212331395,1.8933742046356201,0.7818376212331395
271,11,Naive Bayes,0,0.65,0.7149253731343284,0.6783149276069205,0.22209668159484863,0.6783149276069205
272,11,KNeighbors Classifier,1,0.65,0.7970149253731343,0.7316275011690854,2.5526628494262695,0.7316275011690854
273,11,SVC Classifier,1,0.65,0.7567164179104477,0.7134614538724139,3.4379723072052,0.7134614538724139
274,11,Decision Tree,1,0.65,0.6208955223880597,0.558156161312594,0.22643613815307617,0.558156161312594
275,11,RandomForest,1,0.65,0.48656716417910445,0.33496400347164623,0.6554012298583984,0.33496400347164623
276,11,AdaBoost (Discrete),1,0.65,0.7283582089552239,0.6943090437224501,162.57501363754272,0.6943090437224501
277,11,AdaBoost (Real),1,0.65,0.7044776119402985,0.6448372746322172,156.57150673866272,0.6448372746322172
278,11,Logistic Regression (Penalty = L2),1,0.65,0.8208955223880597,0.7742219691760631,1.9094736576080322,0.7742219691760631
279,11,Naive Bayes,1,0.65,0.7402985074626866,0.6926500352030763,0.26167821884155273,0.6926500352030763
280,11,KNeighbors Classifier,2,0.65,0.8227272727272728,0.7689950572795311,2.4378838539123535,0.7689950572795311
281,11,SVC Classifier,2,0.65,0.7651515151515151,0.7336416229890806,3.2736363410949707,0.7336416229890806
282,11,Decision Tree,2,0.65,0.6439393939393939,0.5998042487361822,0.19903826713562012,0.5998042487361822
283,11,RandomForest,2,0.65,0.5424242424242425,0.3561155710884892,0.6846437454223633,0.3561155710884892
284,11,AdaBoost (Discrete),2,0.65,0.7333333333333333,0.7012166824593254,159.4281885623932,0.7012166824593254
285,11,AdaBoost (Real),2,0.65,0.703030303030303,0.6741278771012187,141.92949724197388,0.6741278771012187
286,11,Logistic Regression (Penalty = L2),2,0.65,0.8348484848484848,0.7886688169070574,1.79616117477417,0.7886688169070574
287,11,Naive Bayes,2,0.65,0.7333333333333333,0.6920698419809663,0.20485734939575195,0.6920698419809663
288,12,KNeighbors Classifier,0,0.65,0.6567164179104478,0.5905402278454908,0.36575913429260254,0.5905402278454908
289,12,SVC Classifier,0,0.65,0.5611940298507463,0.43223047543173065,1.4946508407592773,0.43223047543173065
290,12,Decision Tree,0,0.65,0.5507462686567164,0.4960227461578703,0.10381245613098145,0.4960227461578703
291,12,RandomForest,0,0.65,0.5119402985074627,0.4305007066427181,0.47082972526550293,0.0
292,12,AdaBoost (Discrete),0,0.65,0.6253731343283582,0.5977177471696161,51.05197215080261,0.5977177471696161
293,12,AdaBoost (Real),0,0.65,0.49402985074626865,0.4330330998050915,58.738749504089355,0.4330330998050915
294,12,Logistic Regression (Penalty = L2),0,0.65,0.7179104477611941,0.6536744433495552,0.6586554050445557,0.6536744433495552
295,12,Naive Bayes,0,0.65,0.6268656716417911,0.5669676224568658,0.10436367988586426,0.5669676224568658
296,12,KNeighbors Classifier,1,0.65,0.6567164179104478,0.5924530678965512,0.3144874572753906,0.5924530678965512
297,12,SVC Classifier,1,0.65,0.5850746268656717,0.4815863631046572,1.3446455001831055,0.4815863631046572
298,12,Decision Tree,1,0.65,0.5462686567164179,0.48159352908854197,0.05486440658569336,0.48159352908854197
299,12,RandomForest,1,0.65,0.5194029850746269,0.5618775034060176,0.41258668899536133,0.0
300,12,AdaBoost (Discrete),1,0.65,0.6328358208955224,0.5905970087408405,50.45229172706604,0.5905970087408405
301,12,AdaBoost (Real),1,0.65,0.5388059701492537,0.4098643944989228,57.07103681564331,0.4098643944989228
302,12,Logistic Regression (Penalty = L2),1,0.65,0.6955223880597015,0.6275186545897955,0.6235671043395996,0.6275186545897955
303,12,Naive Bayes,1,0.65,0.6402985074626866,0.5814436274558998,0.11436653137207031,0.5814436274558998
304,12,KNeighbors Classifier,2,0.65,0.6545454545454545,0.5987425679975293,0.4174330234527588,0.5987425679975293
305,12,SVC Classifier,2,0.65,0.5863636363636363,0.5179812784426807,1.4570252895355225,0.5179812784426807
306,12,Decision Tree,2,0.65,0.5787878787878787,0.5309231384031161,0.10437488555908203,0.5309231384031161
307,12,RandomForest,2,0.65,0.546969696969697,0.4575861228364449,0.5105268955230713,0.0
308,12,AdaBoost (Discrete),2,0.65,0.6363636363636364,0.6069580119859969,49.457372426986694,0.6069580119859969
309,12,AdaBoost (Real),2,0.65,0.5863636363636363,0.5441810014858312,53.56103301048279,0.5441810014858312
310,12,Logistic Regression (Penalty = L2),2,0.65,0.7272727272727273,0.6642790953558741,0.512117862701416,0.6642790953558741
311,12,Naive Bayes,2,0.65,0.6454545454545455,0.6047120997997467,0.1001131534576416,0.6047120997997467
