,feat_set_id,classifier,fold_id,feat_th,score,geo_score,exec_t,geo_score_woz
0,0,KNeighbors Classifier,0,0.75,0.9701492537313433,0.9697343635714698,7.7901153564453125,0.9697343635714698
1,0,SVC Classifier,0,0.75,0.917910447761194,0.9166935076329947,10.293966293334961,0.9166935076329947
2,0,Decision Tree,0,0.75,0.7074626865671642,0.7026814324024656,0.5548455715179443,0.7026814324024656
3,0,RandomForest,0,0.75,0.5940298507462687,0.6223996320641965,1.6752047538757324,0.0
4,0,AdaBoost (Discrete),0,0.75,0.9313432835820895,0.9306651091536713,403.82250905036926,0.9306651091536713
5,0,AdaBoost (Real),0,0.75,0.8985074626865671,0.8974542273486283,461.3078281879425,0.8974542273486283
6,0,Logistic Regression (Penalty = L2),0,0.75,0.9567164179104478,0.9559465914900159,3.3706462383270264,0.9559465914900159
7,0,Naive Bayes,0,0.75,0.9477611940298507,0.9472083553473858,0.46552515029907227,0.9472083553473858
8,0,KNeighbors Classifier,1,0.75,0.9582089552238806,0.9577638720062203,6.93836236000061,0.9577638720062203
9,0,SVC Classifier,1,0.75,0.9283582089552239,0.9275226544906003,9.2395658493042,0.9275226544906003
10,0,Decision Tree,1,0.75,0.7761194029850746,0.7714526562831223,0.3905611038208008,0.7714526562831223
11,0,RandomForest,1,0.75,0.6283582089552239,0.540992243444826,1.4566426277160645,0.540992243444826
12,0,AdaBoost (Discrete),1,0.75,0.917910447761194,0.9171631151216283,509.4139950275421,0.9171631151216283
13,0,AdaBoost (Real),1,0.75,0.8880597014925373,0.8877304103833443,488.13542795181274,0.8877304103833443
14,0,Logistic Regression (Penalty = L2),1,0.75,0.9507462686567164,0.950388238296128,3.9756662845611572,0.950388238296128
15,0,Naive Bayes,1,0.75,0.9313432835820895,0.9307957813860126,0.31005096435546875,0.9307957813860126
16,0,KNeighbors Classifier,2,0.75,0.9651515151515152,0.964744759619712,7.9733498096466064,0.964744759619712
17,0,SVC Classifier,2,0.75,0.9227272727272727,0.9218213320161238,11.184337377548218,0.9218213320161238
18,0,Decision Tree,2,0.75,0.703030303030303,0.6994593410354376,0.4854543209075928,0.6994593410354376
19,0,RandomForest,2,0.75,0.6727272727272727,0.5788847690110305,1.845182180404663,0.5788847690110305
20,0,AdaBoost (Discrete),2,0.75,0.9409090909090909,0.940359296382494,536.8370900154114,0.940359296382494
21,0,AdaBoost (Real),2,0.75,0.8803030303030303,0.8772889939129119,467.40292978286743,0.8772889939129119
22,0,Logistic Regression (Penalty = L2),2,0.75,0.9575757575757575,0.9573394900214413,4.2664642333984375,0.9573394900214413
23,0,Naive Bayes,2,0.75,0.9348484848484848,0.9345752999294393,0.4799487590789795,0.9345752999294393
24,1,KNeighbors Classifier,0,0.75,0.9686567164179104,0.9682505140670942,9.552324295043945,0.9682505140670942
25,1,SVC Classifier,0,0.75,0.9208955223880597,0.9198774249367007,10.982403755187988,0.9198774249367007
26,1,Decision Tree,0,0.75,0.6925373134328359,0.6819168743482397,0.46875572204589844,0.6819168743482397
27,1,RandomForest,0,0.75,0.5985074626865672,0.42303154087206807,1.7318987846374512,0.42303154087206807
28,1,AdaBoost (Discrete),0,0.75,0.926865671641791,0.9257915328038321,496.7521514892578,0.9257915328038321
29,1,AdaBoost (Real),0,0.75,0.8597014925373134,0.8575364827396488,480.7618191242218,0.8575364827396488
30,1,Logistic Regression (Penalty = L2),0,0.75,0.9492537313432836,0.9485898032420107,4.150076150894165,0.9485898032420107
31,1,Naive Bayes,0,0.75,0.9432835820895522,0.9427415715317132,0.46584153175354004,0.9427415715317132
32,1,KNeighbors Classifier,1,0.75,0.9626865671641791,0.9623063210760993,8.830684423446655,0.9623063210760993
33,1,SVC Classifier,1,0.75,0.9208955223880597,0.9194953516080383,11.36537480354309,0.9194953516080383
34,1,Decision Tree,1,0.75,0.682089552238806,0.6776535492643346,0.4559750556945801,0.6776535492643346
35,1,RandomForest,1,0.75,0.6343283582089553,0.5325893601411996,1.73728609085083,0.5325893601411996
36,1,AdaBoost (Discrete),1,0.75,0.9388059701492537,0.9382741566242145,501.5492341518402,0.9382741566242145
37,1,AdaBoost (Real),1,0.75,0.8895522388059701,0.8882163357940689,484.8330240249634,0.8882163357940689
38,1,Logistic Regression (Penalty = L2),1,0.75,0.9477611940298507,0.9474272246296374,3.797917366027832,0.9474272246296374
39,1,Naive Bayes,1,0.75,0.9402985074626866,0.9398732595859352,0.40355992317199707,0.9398732595859352
40,1,KNeighbors Classifier,2,0.75,0.9681818181818181,0.9677550145086793,7.9434919357299805,0.9677550145086793
41,1,SVC Classifier,2,0.75,0.9257575757575758,0.9248248664742562,10.739613056182861,0.9248248664742562
42,1,Decision Tree,2,0.75,0.740909090909091,0.7350924021731844,0.47989511489868164,0.7350924021731844
43,1,RandomForest,2,0.75,0.6666666666666666,0.5454768417158767,1.8611690998077393,0.5454768417158767
44,1,AdaBoost (Discrete),2,0.75,0.9363636363636364,0.9358195117126923,470.8355939388275,0.9358195117126923
45,1,AdaBoost (Real),2,0.75,0.8848484848484849,0.8829653200154978,457.841103553772,0.8829653200154978
46,1,Logistic Regression (Penalty = L2),2,0.75,0.9515151515151515,0.951374293387261,4.163782358169556,0.951374293387261
47,1,Naive Bayes,2,0.75,0.9378787878787879,0.9375967638718722,0.4574089050292969,0.9375967638718722
48,2,KNeighbors Classifier,0,0.75,0.9656716417910448,0.9650641772808625,8.590572118759155,0.9650641772808625
49,2,SVC Classifier,0,0.75,0.9164179104477612,0.9157427352538173,10.510837078094482,0.9157427352538173
50,2,Decision Tree,0,0.75,0.7208955223880597,0.7190950776228745,0.3961513042449951,0.7190950776228745
51,2,RandomForest,0,0.75,0.6253731343283582,0.5734121258432517,1.4318430423736572,0.5734121258432517
52,2,AdaBoost (Discrete),0,0.75,0.9253731343283582,0.9248857379503597,419.3125627040863,0.9248857379503597
53,2,AdaBoost (Real),0,0.75,0.8925373134328358,0.8900912569910944,1489.6865293979645,0.8900912569910944
54,2,Logistic Regression (Penalty = L2),0,0.75,0.9477611940298507,0.9472173271681674,3.5411903858184814,0.9472173271681674
55,2,Naive Bayes,0,0.75,0.9208955223880597,0.920515689892477,0.4270141124725342,0.920515689892477
56,2,KNeighbors Classifier,1,0.75,0.9537313432835821,0.9529134838086388,6.5723960399627686,0.9529134838086388
57,2,SVC Classifier,1,0.75,0.9014925373134328,0.8997688291430224,8.495936393737793,0.8997688291430224
58,2,Decision Tree,1,0.75,0.673134328358209,0.6668866912730181,0.22615623474121094,0.6668866912730181
59,2,RandomForest,1,0.75,0.6164179104477612,0.5673165169190403,1.1156139373779297,0.5673165169190403
60,2,AdaBoost (Discrete),1,0.75,0.9134328358208955,0.9127886261114846,311.363783121109,0.9127886261114846
61,2,AdaBoost (Real),1,0.75,0.8701492537313433,0.8692219682565204,321.9642176628113,0.8692219682565204
62,2,Logistic Regression (Penalty = L2),1,0.75,0.9432835820895522,0.942414912166181,2.640450954437256,0.942414912166181
63,2,Naive Bayes,1,0.75,0.9194029850746268,0.9187396136225205,0.3128793239593506,0.9187396136225205
64,2,KNeighbors Classifier,2,0.75,0.9606060606060606,0.9599386278213219,5.311798095703125,0.9599386278213219
65,2,SVC Classifier,2,0.75,0.9212121212121213,0.9199628774306503,7.114124298095703,0.9199628774306503
66,2,Decision Tree,2,0.75,0.7227272727272728,0.7187540650838806,0.29547548294067383,0.7187540650838806
67,2,RandomForest,2,0.75,0.6363636363636364,0.599057022306204,1.0881476402282715,0.599057022306204
68,2,AdaBoost (Discrete),2,0.75,0.9227272727272727,0.9219036044417199,290.62872791290283,0.9219036044417199
69,2,AdaBoost (Real),2,0.75,0.8651515151515151,0.8632169259929237,297.6111435890198,0.8632169259929237
70,2,Logistic Regression (Penalty = L2),2,0.75,0.95,0.9496601524334326,2.7875654697418213,0.9496601524334326
71,2,Naive Bayes,2,0.75,0.9348484848484848,0.9344487416264484,0.3823835849761963,0.9344487416264484
72,3,KNeighbors Classifier,0,0.75,0.9761194029850746,0.9758146793860056,4.6747612953186035,0.9758146793860056
73,3,SVC Classifier,0,0.75,0.9194029850746268,0.9184049762752909,5.805023670196533,0.9184049762752909
74,3,Decision Tree,0,0.75,0.6895522388059702,0.6826056868273355,0.21090483665466309,0.6826056868273355
75,3,RandomForest,0,0.75,0.6358208955223881,0.5662569607158598,0.9524703025817871,0.5662569607158598
76,3,AdaBoost (Discrete),0,0.75,0.9417910447761194,0.9412080012412094,262.2227637767792,0.9412080012412094
77,3,AdaBoost (Real),0,0.75,0.8731343283582089,0.8708757957227846,258.59914112091064,0.8708757957227846
78,3,Logistic Regression (Penalty = L2),0,0.75,0.9477611940298507,0.946826974227537,2.320171356201172,0.946826974227537
79,3,Naive Bayes,0,0.75,0.9402985074626866,0.9396798493637052,0.27672457695007324,0.9396798493637052
80,3,KNeighbors Classifier,1,0.75,0.9626865671641791,0.9622850826987869,4.375259160995483,0.9622850826987869
81,3,SVC Classifier,1,0.75,0.9253731343283582,0.924550181469471,5.834307432174683,0.924550181469471
82,3,Decision Tree,1,0.75,0.7164179104477612,0.7112061730525544,0.2731974124908447,0.7112061730525544
83,3,RandomForest,1,0.75,0.7044776119402985,0.684452913157296,1.0292332172393799,0.684452913157296
84,3,AdaBoost (Discrete),1,0.75,0.9313432835820895,0.9308741169958421,226.3385467529297,0.9308741169958421
85,3,AdaBoost (Real),1,0.75,0.8850746268656716,0.8831825305074162,216.31380248069763,0.8831825305074162
86,3,Logistic Regression (Penalty = L2),1,0.75,0.9507462686567164,0.9504152345574844,1.9648311138153076,0.9504152345574844
87,3,Naive Bayes,1,0.75,0.9402985074626866,0.9398748382642849,0.22336888313293457,0.9398748382642849
88,3,KNeighbors Classifier,2,0.75,0.9712121212121212,0.9709895838496901,3.6333141326904297,0.9709895838496901
89,3,SVC Classifier,2,0.75,0.9257575757575758,0.9250164297173608,4.902980089187622,0.9250164297173608
90,3,Decision Tree,2,0.75,0.7651515151515151,0.7607689712785212,0.23242449760437012,0.7607689712785212
91,3,RandomForest,2,0.75,0.7121212121212122,0.6894060597882962,0.8322305679321289,0.6894060597882962
92,3,AdaBoost (Discrete),2,0.75,0.9409090909090909,0.9404091920750685,218.83359336853027,0.9404091920750685
93,3,AdaBoost (Real),2,0.75,0.8863636363636364,0.8848636668015963,215.70610547065735,0.8848636668015963
94,3,Logistic Regression (Penalty = L2),2,0.75,0.9590909090909091,0.9588974402081307,1.5365779399871826,0.9588974402081307
95,3,Naive Bayes,2,0.75,0.9424242424242424,0.9421089153030845,0.26927900314331055,0.9421089153030845
96,4,KNeighbors Classifier,0,0.75,0.9671641791044776,0.9667999982849831,2.893017530441284,0.9667999982849831
97,4,SVC Classifier,0,0.75,0.9059701492537313,0.9049929465371171,4.219653129577637,0.9049929465371171
98,4,Decision Tree,0,0.75,0.6805970149253732,0.6743291655110788,0.20380496978759766,0.6743291655110788
99,4,RandomForest,0,0.75,0.6701492537313433,0.6081448929336588,0.6606333255767822,0.6081448929336588
100,4,AdaBoost (Discrete),0,0.75,0.9208955223880597,0.9201433680835952,210.6336510181427,0.9201433680835952
101,4,AdaBoost (Real),0,0.75,0.8820895522388059,0.87850324707549,220.8945951461792,0.87850324707549
102,4,Logistic Regression (Penalty = L2),0,0.75,0.9447761194029851,0.9436581732056429,1.815948724746704,0.9436581732056429
103,4,Naive Bayes,0,0.75,0.9223880597014925,0.9216939661645094,0.24007558822631836,0.9216939661645094
104,4,KNeighbors Classifier,1,0.75,0.9567164179104478,0.9561603220314369,3.5382351875305176,0.9561603220314369
105,4,SVC Classifier,1,0.75,0.9044776119402985,0.9033343152830111,4.91530179977417,0.9033343152830111
106,4,Decision Tree,1,0.75,0.7014925373134329,0.693829091929248,0.28896594047546387,0.693829091929248
107,4,RandomForest,1,0.75,0.7,0.6925275245795336,0.8468060493469238,0.6925275245795336
108,4,AdaBoost (Discrete),1,0.75,0.9164179104477612,0.9159021971558112,200.07957816123962,0.9159021971558112
109,4,AdaBoost (Real),1,0.75,0.8746268656716418,0.8727416185720707,210.0191249847412,0.8727416185720707
110,4,Logistic Regression (Penalty = L2),1,0.75,0.9477611940298507,0.9471058840086399,1.8812410831451416,0.9471058840086399
111,4,Naive Bayes,1,0.75,0.9164179104477612,0.9157031761542362,0.2396245002746582,0.9157031761542362
112,4,KNeighbors Classifier,2,0.75,0.9636363636363636,0.9631514210774192,3.4510421752929688,0.9631514210774192
113,4,SVC Classifier,2,0.75,0.9242424242424242,0.9232754135554354,4.525972843170166,0.9232754135554354
114,4,Decision Tree,2,0.75,0.7712121212121212,0.7673101337339551,0.2315070629119873,0.7673101337339551
115,4,RandomForest,2,0.75,0.6651515151515152,0.6054433065919202,0.9604930877685547,0.6054433065919202
116,4,AdaBoost (Discrete),2,0.75,0.9287878787878788,0.9277211857981436,219.77774143218994,0.9277211857981436
117,4,AdaBoost (Real),2,0.75,0.8909090909090909,0.8901371398308351,221.5784559249878,0.8901371398308351
118,4,Logistic Regression (Penalty = L2),2,0.75,0.956060606060606,0.9556423832410544,1.8522975444793701,0.9556423832410544
119,4,Naive Bayes,2,0.75,0.9378787878787879,0.9375674037674016,0.23473215103149414,0.9375674037674016
120,5,KNeighbors Classifier,0,0.75,0.9746268656716418,0.9742292432400985,3.879819393157959,0.9742292432400985
121,5,SVC Classifier,0,0.75,0.9074626865671642,0.9062315726355847,5.176797151565552,0.9062315726355847
122,5,Decision Tree,0,0.75,0.6776119402985075,0.6751667504814683,0.24410223960876465,0.6751667504814683
123,5,RandomForest,0,0.75,0.6417910447761194,0.6037792935821175,0.8808956146240234,0.6037792935821175
124,5,AdaBoost (Discrete),0,0.75,0.9149253731343283,0.9136010175705906,213.56748390197754,0.9136010175705906
125,5,AdaBoost (Real),0,0.75,0.8746268656716418,0.8722555369010793,259.1256585121155,0.8722555369010793
126,5,Logistic Regression (Penalty = L2),0,0.75,0.9417910447761194,0.9405317212828894,2.040454387664795,0.9405317212828894
127,5,Naive Bayes,0,0.75,0.9238805970149254,0.9234164029264008,0.26521730422973633,0.9234164029264008
128,5,KNeighbors Classifier,1,0.75,0.9522388059701492,0.9515424798832347,4.268548488616943,0.9515424798832347
129,5,SVC Classifier,1,0.75,0.8985074626865671,0.8968203859492102,5.666280031204224,0.8968203859492102
130,5,Decision Tree,1,0.75,0.6985074626865672,0.6917224761981722,0.2666926383972168,0.6917224761981722
131,5,RandomForest,1,0.75,0.7164179104477612,0.7037415762898754,0.8832457065582275,0.7037415762898754
132,5,AdaBoost (Discrete),1,0.75,0.908955223880597,0.9079503302428465,231.90059113502502,0.9079503302428465
133,5,AdaBoost (Real),1,0.75,0.8895522388059701,0.8881732809629957,247.15434527397156,0.8881732809629957
134,5,Logistic Regression (Penalty = L2),1,0.75,0.9447761194029851,0.944010738565802,2.151270627975464,0.944010738565802
135,5,Naive Bayes,1,0.75,0.9134328358208955,0.9124389517752728,0.21006512641906738,0.9124389517752728
136,5,KNeighbors Classifier,2,0.75,0.9666666666666667,0.9662400550503256,3.9865689277648926,0.9662400550503256
137,5,SVC Classifier,2,0.75,0.9196969696969697,0.9184008761871486,5.762960910797119,0.9184008761871486
138,5,Decision Tree,2,0.75,0.6681818181818182,0.6645312810122954,0.2675626277923584,0.6645312810122954
139,5,RandomForest,2,0.75,0.6863636363636364,0.6250143716259248,1.1373298168182373,0.6250143716259248
140,5,AdaBoost (Discrete),2,0.75,0.9196969696969697,0.9187814441595704,232.80884504318237,0.9187814441595704
141,5,AdaBoost (Real),2,0.75,0.8848484848484849,0.8827884206600201,241.87189364433289,0.8827884206600201
142,5,Logistic Regression (Penalty = L2),2,0.75,0.95,0.9496623808250061,2.1139369010925293,0.9496623808250061
143,5,Naive Bayes,2,0.75,0.9318181818181818,0.9315124933792366,0.3229544162750244,0.9315124933792366
144,6,KNeighbors Classifier,0,0.75,0.9731343283582089,0.9727927979835512,5.174946069717407,0.9727927979835512
145,6,SVC Classifier,0,0.75,0.9149253731343283,0.9136841130400128,6.330543756484985,0.9136841130400128
146,6,Decision Tree,0,0.75,0.6955223880597015,0.6883854368109861,0.2955803871154785,0.6883854368109861
147,6,RandomForest,0,0.75,0.7208955223880597,0.7050195234875849,0.838869571685791,0.7050195234875849
148,6,AdaBoost (Discrete),0,0.75,0.9283582089552239,0.9276211028518488,272.2656395435333,0.9276211028518488
149,6,AdaBoost (Real),0,0.75,0.8761194029850746,0.8715868904698864,268.5799856185913,0.8715868904698864
150,6,Logistic Regression (Penalty = L2),0,0.75,0.9477611940298507,0.946889521152694,2.263129711151123,0.946889521152694
151,6,Naive Bayes,0,0.75,0.9462686567164179,0.945675321549546,0.3275480270385742,0.945675321549546
152,6,KNeighbors Classifier,1,0.75,0.9567164179104478,0.9561157364382269,4.462698936462402,0.9561157364382269
153,6,SVC Classifier,1,0.75,0.926865671641791,0.9255957766021309,5.776303768157959,0.9255957766021309
154,6,Decision Tree,1,0.75,0.7223880597014926,0.7178979293679629,0.23723506927490234,0.7178979293679629
155,6,RandomForest,1,0.75,0.7149253731343284,0.6773900496236704,0.8824758529663086,0.6773900496236704
156,6,AdaBoost (Discrete),1,0.75,0.935820895522388,0.9350890117215613,243.40306735038757,0.9350890117215613
157,6,AdaBoost (Real),1,0.75,0.8432835820895522,0.8385018403551445,270.4050567150116,0.8385018403551445
158,6,Logistic Regression (Penalty = L2),1,0.75,0.9462686567164179,0.9458863216769411,2.2811758518218994,0.9458863216769411
159,6,Naive Bayes,1,0.75,0.9328358208955224,0.9322102649918246,0.21221637725830078,0.9322102649918246
160,6,KNeighbors Classifier,2,0.75,0.9606060606060606,0.9597831379776655,4.523031711578369,0.9597831379776655
161,6,SVC Classifier,2,0.75,0.9287878787878788,0.9280318603312582,5.51160192489624,0.9280318603312582
162,6,Decision Tree,2,0.75,0.7545454545454545,0.7522957147620374,0.22655200958251953,0.7522957147620374
163,6,RandomForest,2,0.75,0.7363636363636363,0.6697879938484903,0.8336310386657715,0.6697879938484903
164,6,AdaBoost (Discrete),2,0.75,0.9348484848484848,0.9343741212280631,243.89744567871094,0.9343741212280631
165,6,AdaBoost (Real),2,0.75,0.9136363636363637,0.9128994109554939,243.73334574699402,0.9128994109554939
166,6,Logistic Regression (Penalty = L2),2,0.75,0.956060606060606,0.9559286604820091,2.1068661212921143,0.9559286604820091
167,6,Naive Bayes,2,0.75,0.9378787878787879,0.937547170008419,0.23106765747070312,0.937547170008419
168,7,KNeighbors Classifier,0,0.75,0.9701492537313433,0.9697573188524662,5.134098291397095,0.9697573188524662
169,7,SVC Classifier,0,0.75,0.9313432835820895,0.930692763155544,5.900712490081787,0.930692763155544
170,7,Decision Tree,0,0.75,0.682089552238806,0.6782187191456299,0.22905230522155762,0.6782187191456299
171,7,RandomForest,0,0.75,0.6776119402985075,0.6604079876857262,0.9813327789306641,0.6604079876857262
172,7,AdaBoost (Discrete),0,0.75,0.9388059701492537,0.93837789711849,259.5306146144867,0.93837789711849
173,7,AdaBoost (Real),0,0.75,0.8671641791044776,0.8634624290817833,258.81816482543945,0.8634624290817833
174,7,Logistic Regression (Penalty = L2),0,0.75,0.9522388059701492,0.951777300929615,2.0590016841888428,0.951777300929615
175,7,Naive Bayes,0,0.75,0.9477611940298507,0.9471186405883923,0.2510218620300293,0.9471186405883923
176,7,KNeighbors Classifier,1,0.75,0.9492537313432836,0.948460981429942,4.249540328979492,0.948460981429942
177,7,SVC Classifier,1,0.75,0.9283582089552239,0.9270687993098377,5.148179531097412,0.9270687993098377
178,7,Decision Tree,1,0.75,0.7164179104477612,0.71293537037521,0.19073009490966797,0.71293537037521
179,7,RandomForest,1,0.75,0.7149253731343284,0.6992529892093653,0.8245179653167725,0.6992529892093653
180,7,AdaBoost (Discrete),1,0.75,0.9298507462686567,0.9289676383778361,236.81249332427979,0.9289676383778361
181,7,AdaBoost (Real),1,0.75,0.8895522388059701,0.888699782639716,240.59289836883545,0.888699782639716
182,7,Logistic Regression (Penalty = L2),1,0.75,0.9447761194029851,0.9444932528717123,1.7326765060424805,0.9444932528717123
183,7,Naive Bayes,1,0.75,0.9313432835820895,0.9309609186206568,0.16560840606689453,0.9309609186206568
184,7,KNeighbors Classifier,2,0.75,0.9590909090909091,0.9581973549089563,3.637578248977661,0.9581973549089563
185,7,SVC Classifier,2,0.75,0.9303030303030303,0.9294248310228667,4.634426593780518,0.9294248310228667
186,7,Decision Tree,2,0.75,0.7121212121212122,0.7088371537051205,0.20076465606689453,0.7088371537051205
187,7,RandomForest,2,0.75,0.7151515151515152,0.6875833855198541,0.7308859825134277,0.6875833855198541
188,7,AdaBoost (Discrete),2,0.75,0.9393939393939394,0.9389024754213217,211.43037700653076,0.9389024754213217
189,7,AdaBoost (Real),2,0.75,0.8787878787878788,0.8766259464262885,209.45990347862244,0.8766259464262885
190,7,Logistic Regression (Penalty = L2),2,0.75,0.946969696969697,0.9464980811874485,1.7984445095062256,0.9464980811874485
191,7,Naive Bayes,2,0.75,0.9424242424242424,0.9421604121430377,0.21439051628112793,0.9421604121430377
192,8,KNeighbors Classifier,0,0.75,0.9716417910447761,0.9713339224824272,2.4447221755981445,0.9713339224824272
193,8,SVC Classifier,0,0.75,0.9104477611940298,0.9093527802481547,3.3363256454467773,0.9093527802481547
194,8,Decision Tree,0,0.75,0.6492537313432836,0.643683776224716,0.1671147346496582,0.643683776224716
195,8,RandomForest,0,0.75,0.7164179104477612,0.6797406606642455,0.6626434326171875,0.6797406606642455
196,8,AdaBoost (Discrete),0,0.75,0.9283582089552239,0.9278517346091197,138.06920528411865,0.9278517346091197
197,8,AdaBoost (Real),0,0.75,0.8746268656716418,0.8723702003201552,132.15612506866455,0.8723702003201552
198,8,Logistic Regression (Penalty = L2),0,0.75,0.9402985074626866,0.9390810148466927,1.1973614692687988,0.9390810148466927
199,8,Naive Bayes,0,0.75,0.9223880597014925,0.9216688922756369,0.1559154987335205,0.9216688922756369
200,8,KNeighbors Classifier,1,0.75,0.9611940298507463,0.960832223788606,2.0173094272613525,0.960832223788606
201,8,SVC Classifier,1,0.75,0.9104477611940298,0.9091259189594586,3.0909972190856934,0.9091259189594586
202,8,Decision Tree,1,0.75,0.7507462686567165,0.7437893099425796,0.17060208320617676,0.7437893099425796
203,8,RandomForest,1,0.75,0.7,0.6750420815638857,0.6199691295623779,0.6750420815638857
204,8,AdaBoost (Discrete),1,0.75,0.9014925373134328,0.9004858675139135,123.3965711593628,0.9004858675139135
205,8,AdaBoost (Real),1,0.75,0.8940298507462686,0.892607619693905,128.77315258979797,0.892607619693905
206,8,Logistic Regression (Penalty = L2),1,0.75,0.9447761194029851,0.9440099649354383,1.1209397315979004,0.9440099649354383
207,8,Naive Bayes,1,0.75,0.9134328358208955,0.9124905180233056,0.16964244842529297,0.9124905180233056
208,8,KNeighbors Classifier,2,0.75,0.9666666666666667,0.966312493489193,1.888484001159668,0.966312493489193
209,8,SVC Classifier,2,0.75,0.9257575757575758,0.9250274677957822,2.8697943687438965,0.9250274677957822
210,8,Decision Tree,2,0.75,0.7560606060606061,0.7485589155847596,0.10990786552429199,0.7485589155847596
211,8,RandomForest,2,0.75,0.7015151515151515,0.6768756901782004,0.5317192077636719,0.6768756901782004
212,8,AdaBoost (Discrete),2,0.75,0.9151515151515152,0.9148424340218452,118.74732565879822,0.9148424340218452
213,8,AdaBoost (Real),2,0.75,0.8924242424242425,0.8906313569076416,124.36711525917053,0.8906313569076416
214,8,Logistic Regression (Penalty = L2),2,0.75,0.9590909090909091,0.9588006112763803,1.3725793361663818,0.9588006112763803
215,8,Naive Bayes,2,0.75,0.9363636363636364,0.9360684634154961,0.14414620399475098,0.9360684634154961
