,feat_set_id,classifier,fold_id,feat_th,score,geo_score,exec_t,geo_score_woz
0,0,KNeighbors Classifier,0,0.75,0.4451219512195122,0.3840111953931279,0.04931640625,0.3840111953931279
1,0,SVC Classifier,0,0.75,0.4268292682926829,1.0,0.1489090919494629,0.0
2,0,Decision Tree,0,0.75,0.42073170731707316,0.38112000307785393,0.0037207603454589844,0.38112000307785393
3,0,RandomForest,0,0.75,0.45121951219512196,0.26717541570007064,0.07542824745178223,0.26717541570007064
4,0,AdaBoost (Discrete),0,0.75,0.4634146341463415,0.43837667264616426,4.613917589187622,0.43837667264616426
5,0,AdaBoost (Real),0,0.75,0.42073170731707316,0.3984191702097264,6.008468389511108,0.3984191702097264
6,0,Logistic Regression (Penalty = L2),0,0.75,0.4532520325203252,0.4317070248499733,0.07295060157775879,0.4317070248499733
7,0,Naive Bayes,0,0.75,0.44308943089430897,0.4560801189772463,0.015950918197631836,0.4560801189772463
8,0,KNeighbors Classifier,1,0.75,0.4215885947046843,0.3375446721120486,0.06348061561584473,0.3375446721120486
9,0,SVC Classifier,1,0.75,0.42769857433808556,1.0,0.15738201141357422,0.0
10,0,Decision Tree,1,0.75,0.4215885947046843,0.40007947546404254,0.002979755401611328,0.40007947546404254
11,0,RandomForest,1,0.75,0.4419551934826884,0.4537426064865151,0.0850975513458252,0.0
12,0,AdaBoost (Discrete),1,0.75,0.4378818737270876,0.3978153287554546,5.9941511154174805,0.3978153287554546
13,0,AdaBoost (Real),1,0.75,0.4439918533604888,0.4062308252918714,6.382873773574829,0.4062308252918714
14,0,Logistic Regression (Penalty = L2),1,0.75,0.5132382892057027,0.4891128314369702,0.024172544479370117,0.4891128314369702
15,0,Naive Bayes,1,0.75,0.4847250509164969,0.5008942535048684,0.020467758178710938,0.5008942535048684
16,0,KNeighbors Classifier,2,0.75,0.39387755102040817,0.34986491476233417,0.03034830093383789,0.34986491476233417
17,0,SVC Classifier,2,0.75,0.42653061224489797,1.0,0.13883399963378906,0.0
18,0,Decision Tree,2,0.75,0.40408163265306124,0.39175691105335503,0.019483566284179688,0.39175691105335503
19,0,RandomForest,2,0.75,0.47551020408163264,0.34298005154565125,0.07321023941040039,0.34298005154565125
20,0,AdaBoost (Discrete),2,0.75,0.46122448979591835,0.45226106222534584,4.952523469924927,0.45226106222534584
21,0,AdaBoost (Real),2,0.75,0.4326530612244898,0.40467556188270903,5.485728979110718,0.40467556188270903
22,0,Logistic Regression (Penalty = L2),2,0.75,0.44285714285714284,0.404930877762354,0.022480487823486328,0.404930877762354
23,0,Naive Bayes,2,0.75,0.47551020408163264,0.49033501596491597,0.019086599349975586,0.49033501596491597
24,1,KNeighbors Classifier,0,0.75,0.47560975609756095,0.42414800721829427,0.04465484619140625,0.42414800721829427
25,1,SVC Classifier,0,0.75,0.4268292682926829,1.0,0.1163029670715332,0.0
26,1,Decision Tree,0,0.75,0.4796747967479675,0.4405184753926023,0.002671480178833008,0.4405184753926023
27,1,RandomForest,0,0.75,0.5223577235772358,0.2686990502040067,0.07440638542175293,0.2686990502040067
28,1,AdaBoost (Discrete),0,0.75,0.524390243902439,0.48218923618680803,4.917078495025635,0.48218923618680803
29,1,AdaBoost (Real),0,0.75,0.45934959349593496,0.41421696991736506,6.2848944664001465,0.41421696991736506
30,1,Logistic Regression (Penalty = L2),0,0.75,0.5121951219512195,0.4548837595222066,0.022507429122924805,0.4548837595222066
31,1,Naive Bayes,0,0.75,0.4715447154471545,0.48177093579390906,0.018618345260620117,0.48177093579390906
32,1,KNeighbors Classifier,1,0.75,0.45010183299389,0.3956562669955195,0.04384565353393555,0.3956562669955195
33,1,SVC Classifier,1,0.75,0.42769857433808556,1.0,0.09026694297790527,0.0
34,1,Decision Tree,1,0.75,0.45417515274949083,0.4306076687602156,0.0022373199462890625,0.4306076687602156
35,1,RandomForest,1,0.75,0.4908350305498982,0.6043261404520025,0.05355644226074219,0.0
36,1,AdaBoost (Discrete),1,0.75,0.5315682281059063,0.5074857232579452,5.6355626583099365,0.5074857232579452
37,1,AdaBoost (Real),1,0.75,0.49287169042769857,0.4572673174967178,5.781636476516724,0.4572673174967178
38,1,Logistic Regression (Penalty = L2),1,0.75,0.5193482688391039,0.4669030379148885,0.022042274475097656,0.4669030379148885
39,1,Naive Bayes,1,0.75,0.47657841140529533,0.48924148928706035,0.018620729446411133,0.48924148928706035
40,1,KNeighbors Classifier,2,0.75,0.463265306122449,0.4256048416937185,0.025274038314819336,0.4256048416937185
41,1,SVC Classifier,2,0.75,0.42653061224489797,1.0,0.08718609809875488,0.0
42,1,Decision Tree,2,0.75,0.4489795918367347,0.41495737823636536,0.003330230712890625,0.41495737823636536
43,1,RandomForest,2,0.75,0.5020408163265306,0.384506091557399,0.09511566162109375,0.384506091557399
44,1,AdaBoost (Discrete),2,0.75,0.5265306122448979,0.5014116397654704,4.630325078964233,0.5014116397654704
45,1,AdaBoost (Real),2,0.75,0.4714285714285714,0.44519849332279215,5.5103418827056885,0.44519849332279215
46,1,Logistic Regression (Penalty = L2),2,0.75,0.49795918367346936,0.44617883999147817,0.020815610885620117,0.44617883999147817
47,1,Naive Bayes,2,0.75,0.4714285714285714,0.48024380815317497,0.003972768783569336,0.48024380815317497
48,2,KNeighbors Classifier,0,0.75,0.48577235772357724,0.4228854602289914,0.030434608459472656,0.4228854602289914
49,2,SVC Classifier,0,0.75,0.4268292682926829,1.0,0.11517930030822754,0.0
50,2,Decision Tree,0,0.75,0.4817073170731707,0.44517363007715455,0.01843857765197754,0.44517363007715455
51,2,RandomForest,0,0.75,0.49390243902439024,0.35924262487992414,0.09159159660339355,0.35924262487992414
52,2,AdaBoost (Discrete),0,0.75,0.5386178861788617,0.4873420114817136,4.67671537399292,0.4873420114817136
53,2,AdaBoost (Real),0,0.75,0.48577235772357724,0.43906834990447113,6.563676595687866,0.43906834990447113
54,2,Logistic Regression (Penalty = L2),0,0.75,0.5040650406504065,0.4451639245572657,0.02412271499633789,0.4451639245572657
55,2,Naive Bayes,0,0.75,0.4491869918699187,0.4623015062177744,0.019943952560424805,0.4623015062177744
56,2,KNeighbors Classifier,1,0.75,0.45621181262729127,0.42398086068424296,0.05025458335876465,0.42398086068424296
57,2,SVC Classifier,1,0.75,0.42769857433808556,1.0,0.1366138458251953,0.0
58,2,Decision Tree,1,0.75,0.4725050916496945,0.4395517396089599,0.01962757110595703,0.4395517396089599
59,2,RandomForest,1,0.75,0.5030549898167006,0.5988317290991773,0.09682679176330566,0.0
60,2,AdaBoost (Discrete),1,0.75,0.5417515274949084,0.5145172609061862,6.0803539752960205,0.5145172609061862
61,2,AdaBoost (Real),1,0.75,0.5091649694501018,0.470965463715331,6.764861345291138,0.470965463715331
62,2,Logistic Regression (Penalty = L2),1,0.75,0.5234215885947047,0.4704947408915208,0.025076627731323242,0.4704947408915208
63,2,Naive Bayes,1,0.75,0.4847250509164969,0.5006527422555169,0.020455360412597656,0.5006527422555169
64,2,KNeighbors Classifier,2,0.75,0.42857142857142855,0.37856415312782427,0.04905438423156738,0.37856415312782427
65,2,SVC Classifier,2,0.75,0.42653061224489797,1.0,0.1297743320465088,0.0
66,2,Decision Tree,2,0.75,0.4775510204081633,0.4522726321114386,0.002577543258666992,0.4522726321114386
67,2,RandomForest,2,0.75,0.5020408163265306,0.3574494095402627,0.08280730247497559,0.3574494095402627
68,2,AdaBoost (Discrete),2,0.75,0.5265306122448979,0.4988211239878325,5.545435428619385,0.4988211239878325
69,2,AdaBoost (Real),2,0.75,0.4816326530612245,0.46776088495995544,6.70249080657959,0.46776088495995544
70,2,Logistic Regression (Penalty = L2),2,0.75,0.5163265306122449,0.4603473901017494,0.007647514343261719,0.4603473901017494
71,2,Naive Bayes,2,0.75,0.4673469387755102,0.48011697645390805,0.004277229309082031,0.48011697645390805
72,3,KNeighbors Classifier,0,0.75,0.4695121951219512,0.41518996784328277,0.04619741439819336,0.41518996784328277
73,3,SVC Classifier,0,0.75,0.4268292682926829,1.0,0.1325390338897705,0.0
74,3,Decision Tree,0,0.75,0.4817073170731707,0.44952658834368375,0.0036649703979492188,0.44952658834368375
75,3,RandomForest,0,0.75,0.5284552845528455,0.3564607239090874,0.09633040428161621,0.3564607239090874
76,3,AdaBoost (Discrete),0,0.75,0.5284552845528455,0.4808041248258541,5.509204149246216,0.4808041248258541
77,3,AdaBoost (Real),0,0.75,0.491869918699187,0.43820776684779866,7.071725606918335,0.43820776684779866
78,3,Logistic Regression (Penalty = L2),0,0.75,0.5223577235772358,0.47098806154150347,0.022562026977539062,0.47098806154150347
79,3,Naive Bayes,0,0.75,0.45528455284552843,0.46516551779310483,0.0029854774475097656,0.46516551779310483
80,3,KNeighbors Classifier,1,0.75,0.4684317718940937,0.40844120736894446,0.02041149139404297,0.40844120736894446
81,3,SVC Classifier,1,0.75,0.42769857433808556,1.0,0.09668731689453125,0.0
82,3,Decision Tree,1,0.75,0.45010183299389,0.4300480409609006,0.002329587936401367,0.4300480409609006
83,3,RandomForest,1,0.75,0.4969450101832994,0.615281584781658,0.07291436195373535,0.0
84,3,AdaBoost (Discrete),1,0.75,0.539714867617108,0.5114935970591646,5.2382776737213135,0.5114935970591646
85,3,AdaBoost (Real),1,0.75,0.4989816700610998,0.46254859523412956,5.994583606719971,0.46254859523412956
86,3,Logistic Regression (Penalty = L2),1,0.75,0.5234215885947047,0.4524207451888845,0.022734403610229492,0.4524207451888845
87,3,Naive Bayes,1,0.75,0.515274949083503,0.5310642647170711,0.002699136734008789,0.5310642647170711
88,3,KNeighbors Classifier,2,0.75,0.45510204081632655,0.40603354374446926,0.04534339904785156,0.40603354374446926
89,3,SVC Classifier,2,0.75,0.42653061224489797,1.0,0.11880779266357422,0.0
90,3,Decision Tree,2,0.75,0.4775510204081633,0.45708056754422915,0.003319978713989258,0.45708056754422915
91,3,RandomForest,2,0.75,0.49183673469387756,0.3208368858922555,0.07381987571716309,0.3208368858922555
92,3,AdaBoost (Discrete),2,0.75,0.5387755102040817,0.5088702402904263,5.197824001312256,0.5088702402904263
93,3,AdaBoost (Real),2,0.75,0.46938775510204084,0.4478740414926434,5.910595178604126,0.4478740414926434
94,3,Logistic Regression (Penalty = L2),2,0.75,0.5122448979591837,0.45744679872161015,0.02389359474182129,0.45744679872161015
95,3,Naive Bayes,2,0.75,0.46530612244897956,0.47469725535083557,0.024862289428710938,0.47469725535083557
96,4,KNeighbors Classifier,0,0.75,0.4247967479674797,0.3490930054902829,0.023864269256591797,0.3490930054902829
97,4,SVC Classifier,0,0.75,0.4268292682926829,1.0,0.1154634952545166,0.0
98,4,Decision Tree,0,0.75,0.42276422764227645,0.3881892649927928,0.002182483673095703,0.3881892649927928
99,4,RandomForest,0,0.75,0.45121951219512196,0.35010497608130065,0.0746915340423584,0.35010497608130065
100,4,AdaBoost (Discrete),0,0.75,0.4451219512195122,0.41750319270845143,4.9476542472839355,0.41750319270845143
101,4,AdaBoost (Real),0,0.75,0.43089430894308944,0.39010656372447644,5.729936599731445,0.39010656372447644
102,4,Logistic Regression (Penalty = L2),0,0.75,0.4532520325203252,0.43027313811844453,0.004741668701171875,0.43027313811844453
103,4,Naive Bayes,0,0.75,0.4573170731707317,0.4679057088482326,0.019520044326782227,0.4679057088482326
104,4,KNeighbors Classifier,1,0.75,0.39307535641547864,0.3012862453202109,0.03409886360168457,0.3012862453202109
105,4,SVC Classifier,1,0.75,0.42769857433808556,1.0,0.09781360626220703,0.0
106,4,Decision Tree,1,0.75,0.37678207739307534,0.3359535587911579,0.01865839958190918,0.3359535587911579
107,4,RandomForest,1,0.75,0.46435845213849286,0.2399556477402074,0.0729360580444336,0.2399556477402074
108,4,AdaBoost (Discrete),1,0.75,0.45010183299389,0.3830779931838731,4.814898490905762,0.3830779931838731
109,4,AdaBoost (Real),1,0.75,0.4154786150712831,0.3953120682424053,5.749753713607788,0.3953120682424053
110,4,Logistic Regression (Penalty = L2),1,0.75,0.5091649694501018,0.48419506750487656,0.0037779808044433594,0.48419506750487656
111,4,Naive Bayes,1,0.75,0.48065173116089616,0.4961523635176825,0.0039048194885253906,0.4961523635176825
112,4,KNeighbors Classifier,2,0.75,0.4122448979591837,0.36912940086119433,0.025572538375854492,0.36912940086119433
113,4,SVC Classifier,2,0.75,0.42653061224489797,1.0,0.10344529151916504,0.0
114,4,Decision Tree,2,0.75,0.38979591836734695,0.37298024364621385,0.02655029296875,0.37298024364621385
115,4,RandomForest,2,0.75,0.4326530612244898,0.35109792905885334,0.06310319900512695,0.35109792905885334
116,4,AdaBoost (Discrete),2,0.75,0.4530612244897959,0.4269829191737782,4.792508125305176,0.4269829191737782
117,4,AdaBoost (Real),2,0.75,0.4020408163265306,0.3666564743638464,6.362112283706665,0.3666564743638464
118,4,Logistic Regression (Penalty = L2),2,0.75,0.44081632653061226,0.40687769075594826,0.005806922912597656,0.40687769075594826
119,4,Naive Bayes,2,0.75,0.46530612244897956,0.4758295527991858,0.02802419662475586,0.4758295527991858
120,5,KNeighbors Classifier,0,0.75,0.4451219512195122,0.3840111953931279,0.03689455986022949,0.3840111953931279
121,5,SVC Classifier,0,0.75,0.4268292682926829,1.0,0.11463499069213867,0.0
122,5,Decision Tree,0,0.75,0.44308943089430897,0.39598518666173466,0.0030252933502197266,0.39598518666173466
123,5,RandomForest,0,0.75,0.45121951219512196,0.26717541570007064,0.09313201904296875,0.26717541570007064
124,5,AdaBoost (Discrete),0,0.75,0.4634146341463415,0.43837667264616426,5.158452272415161,0.43837667264616426
125,5,AdaBoost (Real),0,0.75,0.42276422764227645,0.3996565047687997,5.991337776184082,0.3996565047687997
126,5,Logistic Regression (Penalty = L2),0,0.75,0.4532520325203252,0.4317070248499733,0.02115607261657715,0.4317070248499733
127,5,Naive Bayes,0,0.75,0.44308943089430897,0.4560801189772463,0.0030291080474853516,0.4560801189772463
128,5,KNeighbors Classifier,1,0.75,0.4215885947046843,0.3375446721120486,0.04535555839538574,0.3375446721120486
129,5,SVC Classifier,1,0.75,0.42769857433808556,1.0,0.1018376350402832,0.0
130,5,Decision Tree,1,0.75,0.40122199592668023,0.35972736428721863,0.019433021545410156,0.35972736428721863
131,5,RandomForest,1,0.75,0.4419551934826884,0.4537426064865151,0.09079861640930176,0.0
132,5,AdaBoost (Discrete),1,0.75,0.4378818737270876,0.3978153287554546,4.937398672103882,0.3978153287554546
133,5,AdaBoost (Real),1,0.75,0.4439918533604888,0.4062308252918714,6.099406480789185,0.4062308252918714
134,5,Logistic Regression (Penalty = L2),1,0.75,0.5132382892057027,0.4891128314369702,0.004499673843383789,0.4891128314369702
135,5,Naive Bayes,1,0.75,0.4847250509164969,0.5008942535048684,0.0034089088439941406,0.5008942535048684
136,5,KNeighbors Classifier,2,0.75,0.39387755102040817,0.34986491476233417,0.03383779525756836,0.34986491476233417
137,5,SVC Classifier,2,0.75,0.42653061224489797,1.0,0.09644889831542969,0.0
138,5,Decision Tree,2,0.75,0.43673469387755104,0.40979238674997437,0.019036293029785156,0.40979238674997437
139,5,RandomForest,2,0.75,0.47551020408163264,0.34298005154565125,0.09418892860412598,0.34298005154565125
140,5,AdaBoost (Discrete),2,0.75,0.46122448979591835,0.45226106222534584,4.883036375045776,0.45226106222534584
141,5,AdaBoost (Real),2,0.75,0.4346938775510204,0.40603354374446926,5.679182291030884,0.40603354374446926
142,5,Logistic Regression (Penalty = L2),2,0.75,0.44285714285714284,0.404930877762354,0.021620988845825195,0.404930877762354
143,5,Naive Bayes,2,0.75,0.47551020408163264,0.49033501596491597,0.019793987274169922,0.49033501596491597
144,6,KNeighbors Classifier,0,0.75,0.42276422764227645,0.35947963082269235,0.023133516311645508,0.35947963082269235
145,6,SVC Classifier,0,0.75,0.4268292682926829,1.0,0.07850003242492676,0.0
146,6,Decision Tree,0,0.75,0.41260162601626016,0.3722637705511588,0.01912403106689453,0.3722637705511588
147,6,RandomForest,0,0.75,0.45528455284552843,0.3777827362315866,0.0712728500366211,0.3777827362315866
148,6,AdaBoost (Discrete),0,0.75,0.4491869918699187,0.42615221806456866,4.541927337646484,0.42615221806456866
149,6,AdaBoost (Real),0,0.75,0.4369918699186992,0.3879271519725215,5.335806846618652,0.3879271519725215
150,6,Logistic Regression (Penalty = L2),0,0.75,0.4573170731707317,0.4398944593656853,0.012931346893310547,0.4398944593656853
151,6,Naive Bayes,0,0.75,0.45528455284552843,0.46829193862190194,0.002386808395385742,0.46829193862190194
152,6,KNeighbors Classifier,1,0.75,0.4195519348268839,0.35907092603246543,0.025498390197753906,0.35907092603246543
153,6,SVC Classifier,1,0.75,0.42769857433808556,1.0,0.10134601593017578,0.0
154,6,Decision Tree,1,0.75,0.3788187372708758,0.3470466418587786,0.011896848678588867,0.3470466418587786
155,6,RandomForest,1,0.75,0.4745417515274949,0.26340404614116725,0.07256531715393066,0.26340404614116725
156,6,AdaBoost (Discrete),1,0.75,0.4460285132382892,0.39386472627413693,4.651133060455322,0.39386472627413693
157,6,AdaBoost (Real),1,0.75,0.40325865580448067,0.38162455928431493,5.573900938034058,0.38162455928431493
158,6,Logistic Regression (Penalty = L2),1,0.75,0.4969450101832994,0.4560734026183825,0.021852970123291016,0.4560734026183825
159,6,Naive Bayes,1,0.75,0.5071283095723014,0.5232930045047104,0.0027332305908203125,0.5232930045047104
160,6,KNeighbors Classifier,2,0.75,0.41020408163265304,0.3456322849768961,0.024583101272583008,0.3456322849768961
161,6,SVC Classifier,2,0.75,0.42653061224489797,1.0,0.11341118812561035,0.0
162,6,Decision Tree,2,0.75,0.37755102040816324,0.360154279460675,0.0020182132720947266,0.360154279460675
163,6,RandomForest,2,0.75,0.44081632653061226,0.3589513154553171,0.09328031539916992,0.3589513154553171
164,6,AdaBoost (Discrete),2,0.75,0.45714285714285713,0.42884401394819116,4.7704596519470215,0.42884401394819116
165,6,AdaBoost (Real),2,0.75,0.42653061224489797,0.41681819854509394,6.232656717300415,0.41681819854509394
166,6,Logistic Regression (Penalty = L2),2,0.75,0.43673469387755104,0.40363549965565004,0.03522920608520508,0.40363549965565004
167,6,Naive Bayes,2,0.75,0.45714285714285713,0.4684051005609241,0.0038673877716064453,0.4684051005609241
168,7,KNeighbors Classifier,0,0.75,0.47560975609756095,0.42414800721829427,0.044445037841796875,0.42414800721829427
169,7,SVC Classifier,0,0.75,0.4268292682926829,1.0,0.1370983123779297,0.0
170,7,Decision Tree,0,0.75,0.44308943089430897,0.4069488140588153,0.0032815933227539062,0.4069488140588153
171,7,RandomForest,0,0.75,0.5223577235772358,0.2686990502040067,0.0998845100402832,0.2686990502040067
172,7,AdaBoost (Discrete),0,0.75,0.524390243902439,0.48218923618680803,5.152221441268921,0.48218923618680803
173,7,AdaBoost (Real),0,0.75,0.45934959349593496,0.41421696991736506,6.152256011962891,0.41421696991736506
174,7,Logistic Regression (Penalty = L2),0,0.75,0.5121951219512195,0.4548837595222066,0.020975589752197266,0.4548837595222066
175,7,Naive Bayes,0,0.75,0.4715447154471545,0.48177093579390906,0.0037124156951904297,0.48177093579390906
176,7,KNeighbors Classifier,1,0.75,0.45010183299389,0.3956562669955195,0.027654647827148438,0.3956562669955195
177,7,SVC Classifier,1,0.75,0.42769857433808556,1.0,0.09500956535339355,0.0
178,7,Decision Tree,1,0.75,0.45213849287169044,0.42962736230640425,0.0032110214233398438,0.42962736230640425
179,7,RandomForest,1,0.75,0.4908350305498982,0.6043261404520025,0.07471823692321777,0.0
180,7,AdaBoost (Discrete),1,0.75,0.5315682281059063,0.5074857232579452,5.690921068191528,0.5074857232579452
181,7,AdaBoost (Real),1,0.75,0.49287169042769857,0.4572673174967178,6.138303279876709,0.4572673174967178
182,7,Logistic Regression (Penalty = L2),1,0.75,0.5193482688391039,0.4669030379148885,0.02330470085144043,0.4669030379148885
183,7,Naive Bayes,1,0.75,0.47657841140529533,0.48924148928706035,0.0029320716857910156,0.48924148928706035
184,7,KNeighbors Classifier,2,0.75,0.463265306122449,0.4256048416937185,0.04577898979187012,0.4256048416937185
185,7,SVC Classifier,2,0.75,0.42653061224489797,1.0,0.1188666820526123,0.0
186,7,Decision Tree,2,0.75,0.46122448979591835,0.4356297852627979,0.0033206939697265625,0.4356297852627979
187,7,RandomForest,2,0.75,0.5020408163265306,0.384506091557399,0.09573554992675781,0.384506091557399
188,7,AdaBoost (Discrete),2,0.75,0.5265306122448979,0.5014116397654704,5.3862669467926025,0.5014116397654704
189,7,AdaBoost (Real),2,0.75,0.4714285714285714,0.44519849332279215,6.22662878036499,0.44519849332279215
190,7,Logistic Regression (Penalty = L2),2,0.75,0.49795918367346936,0.44617883999147817,0.022538423538208008,0.44617883999147817
191,7,Naive Bayes,2,0.75,0.4714285714285714,0.48024380815317497,0.003564596176147461,0.48024380815317497
192,8,KNeighbors Classifier,0,0.75,0.483739837398374,0.430468184898612,0.043172597885131836,0.430468184898612
193,8,SVC Classifier,0,0.75,0.4268292682926829,1.0,0.10202574729919434,0.0
194,8,Decision Tree,0,0.75,0.49390243902439024,0.45606886186932777,0.01947498321533203,0.45606886186932777
195,8,RandomForest,0,0.75,0.5040650406504065,0.37448087830506893,0.08035588264465332,0.37448087830506893
196,8,AdaBoost (Discrete),0,0.75,0.532520325203252,0.49219207322350367,5.023914813995361,0.49219207322350367
197,8,AdaBoost (Real),0,0.75,0.48577235772357724,0.4296873871418365,6.06306004524231,0.4296873871418365
198,8,Logistic Regression (Penalty = L2),0,0.75,0.532520325203252,0.4852343614335798,0.022135019302368164,0.4852343614335798
199,8,Naive Bayes,0,0.75,0.45121951219512196,0.4622095366792033,0.002679109573364258,0.4622095366792033
200,8,KNeighbors Classifier,1,0.75,0.4663951120162933,0.42370693577229895,0.042730093002319336,0.42370693577229895
201,8,SVC Classifier,1,0.75,0.42769857433808556,1.0,0.11788105964660645,0.0
202,8,Decision Tree,1,0.75,0.4786150712830957,0.4697853609961526,0.0034894943237304688,0.4697853609961526
203,8,RandomForest,1,0.75,0.48676171079429736,0.6022367272346084,0.07215738296508789,0.0
204,8,AdaBoost (Discrete),1,0.75,0.5458248472505092,0.5101590277736509,5.647243976593018,0.5101590277736509
205,8,AdaBoost (Real),1,0.75,0.48879837067209775,0.4614703894701948,6.485627889633179,0.4614703894701948
206,8,Logistic Regression (Penalty = L2),1,0.75,0.5234215885947047,0.4448650555076635,0.0068132877349853516,0.4448650555076635
207,8,Naive Bayes,1,0.75,0.5193482688391039,0.5344643734663924,0.020250558853149414,0.5344643734663924
208,8,KNeighbors Classifier,2,0.75,0.4714285714285714,0.413443957439434,0.027552366256713867,0.413443957439434
209,8,SVC Classifier,2,0.75,0.42653061224489797,1.0,0.12470102310180664,0.0
210,8,Decision Tree,2,0.75,0.46530612244897956,0.4429879823267623,0.003329038619995117,0.4429879823267623
211,8,RandomForest,2,0.75,0.48367346938775513,0.34398586390657204,0.09157013893127441,0.34398586390657204
212,8,AdaBoost (Discrete),2,0.75,0.5326530612244897,0.5031834270667288,4.967792749404907,0.5031834270667288
213,8,AdaBoost (Real),2,0.75,0.45510204081632655,0.43277858247909806,5.4252307415008545,0.43277858247909806
214,8,Logistic Regression (Penalty = L2),2,0.75,0.4897959183673469,0.4328868583361249,0.022516727447509766,0.4328868583361249
215,8,Naive Bayes,2,0.75,0.45510204081632655,0.464056075881427,0.0024662017822265625,0.464056075881427
216,9,KNeighbors Classifier,0,0.75,0.4695121951219512,0.41518996784328277,0.026546716690063477,0.41518996784328277
217,9,SVC Classifier,0,0.75,0.4268292682926829,1.0,0.11501932144165039,0.0
218,9,Decision Tree,0,0.75,0.4654471544715447,0.42679178552612423,0.0036711692810058594,0.42679178552612423
219,9,RandomForest,0,0.75,0.5284552845528455,0.3564607239090874,0.07465839385986328,0.3564607239090874
220,9,AdaBoost (Discrete),0,0.75,0.5284552845528455,0.4808041248258541,4.473561525344849,0.4808041248258541
221,9,AdaBoost (Real),0,0.75,0.491869918699187,0.43820776684779866,5.7131712436676025,0.43820776684779866
222,9,Logistic Regression (Penalty = L2),0,0.75,0.5223577235772358,0.47098806154150347,0.0227358341217041,0.47098806154150347
223,9,Naive Bayes,0,0.75,0.45528455284552843,0.46516551779310483,0.02016758918762207,0.46516551779310483
224,9,KNeighbors Classifier,1,0.75,0.4684317718940937,0.40844120736894446,0.027005672454833984,0.40844120736894446
225,9,SVC Classifier,1,0.75,0.42769857433808556,1.0,0.11728262901306152,0.0
226,9,Decision Tree,1,0.75,0.49287169042769857,0.48409314816846566,0.019723176956176758,0.48409314816846566
227,9,RandomForest,1,0.75,0.4969450101832994,0.615281584781658,0.052697181701660156,0.0
228,9,AdaBoost (Discrete),1,0.75,0.539714867617108,0.5114935970591646,4.947689533233643,0.5114935970591646
229,9,AdaBoost (Real),1,0.75,0.4989816700610998,0.46254859523412956,7.535775899887085,0.46254859523412956
230,9,Logistic Regression (Penalty = L2),1,0.75,0.5234215885947047,0.4524207451888845,0.03125619888305664,0.4524207451888845
231,9,Naive Bayes,1,0.75,0.515274949083503,0.5310642647170711,0.028029918670654297,0.5310642647170711
232,9,KNeighbors Classifier,2,0.75,0.45510204081632655,0.40603354374446926,0.0594019889831543,0.40603354374446926
233,9,SVC Classifier,2,0.75,0.42653061224489797,1.0,0.15866661071777344,0.0
234,9,Decision Tree,2,0.75,0.4448979591836735,0.4046187812502979,0.019456863403320312,0.4046187812502979
235,9,RandomForest,2,0.75,0.49183673469387756,0.3208368858922555,0.07700252532958984,0.3208368858922555
236,9,AdaBoost (Discrete),2,0.75,0.5387755102040817,0.5088702402904263,4.4950244426727295,0.5088702402904263
237,9,AdaBoost (Real),2,0.75,0.46938775510204084,0.4478740414926434,6.018316030502319,0.4478740414926434
238,9,Logistic Regression (Penalty = L2),2,0.75,0.5122448979591837,0.45744679872161015,0.004704475402832031,0.45744679872161015
239,9,Naive Bayes,2,0.75,0.46530612244897956,0.47469725535083557,0.015829801559448242,0.47469725535083557
240,10,KNeighbors Classifier,0,0.75,0.48577235772357724,0.4228854602289914,0.04091954231262207,0.4228854602289914
241,10,SVC Classifier,0,0.75,0.4268292682926829,1.0,0.0849905014038086,0.0
242,10,Decision Tree,0,0.75,0.4898373983739837,0.45596269609157736,0.0186002254486084,0.45596269609157736
243,10,RandomForest,0,0.75,0.49390243902439024,0.35924262487992414,0.09100890159606934,0.35924262487992414
244,10,AdaBoost (Discrete),0,0.75,0.5386178861788617,0.4873420114817136,5.071563482284546,0.4873420114817136
245,10,AdaBoost (Real),0,0.75,0.48577235772357724,0.43906834990447113,6.040693044662476,0.43906834990447113
246,10,Logistic Regression (Penalty = L2),0,0.75,0.5040650406504065,0.4451639245572657,0.02341747283935547,0.4451639245572657
247,10,Naive Bayes,0,0.75,0.4491869918699187,0.4623015062177744,0.020288705825805664,0.4623015062177744
248,10,KNeighbors Classifier,1,0.75,0.45621181262729127,0.42398086068424296,0.05294156074523926,0.42398086068424296
249,10,SVC Classifier,1,0.75,0.42769857433808556,1.0,0.2373509407043457,0.0
250,10,Decision Tree,1,0.75,0.439918533604888,0.4154939137555285,0.026000261306762695,0.4154939137555285
251,10,RandomForest,1,0.75,0.5030549898167006,0.5988317290991773,0.14745163917541504,0.0
252,10,AdaBoost (Discrete),1,0.75,0.5417515274949084,0.5145172609061862,13.73216199874878,0.5145172609061862
253,10,AdaBoost (Real),1,0.75,0.5091649694501018,0.470965463715331,14.676299571990967,0.470965463715331
254,10,Logistic Regression (Penalty = L2),1,0.75,0.5234215885947047,0.4704947408915208,0.05680656433105469,0.4704947408915208
255,10,Naive Bayes,1,0.75,0.4847250509164969,0.5006527422555169,0.028402328491210938,0.5006527422555169
256,10,KNeighbors Classifier,2,0.75,0.42857142857142855,0.37856415312782427,0.11047577857971191,0.37856415312782427
257,10,SVC Classifier,2,0.75,0.42653061224489797,1.0,0.27917003631591797,0.0
258,10,Decision Tree,2,0.75,0.44081632653061226,0.4207248950724362,0.027558565139770508,0.4207248950724362
259,10,RandomForest,2,0.75,0.5020408163265306,0.3574494095402627,0.16725802421569824,0.3574494095402627
260,10,AdaBoost (Discrete),2,0.75,0.5265306122448979,0.4988211239878325,12.247152090072632,0.4988211239878325
261,10,AdaBoost (Real),2,0.75,0.4816326530612245,0.46776088495995544,14.089784860610962,0.46776088495995544
262,10,Logistic Regression (Penalty = L2),2,0.75,0.5163265306122449,0.4603473901017494,0.05548691749572754,0.4603473901017494
263,10,Naive Bayes,2,0.75,0.4673469387755102,0.48011697645390805,0.028423070907592773,0.48011697645390805
264,11,KNeighbors Classifier,0,0.75,0.48577235772357724,0.4228854602289914,0.08659672737121582,0.4228854602289914
265,11,SVC Classifier,0,0.75,0.4268292682926829,1.0,0.3061084747314453,0.0
266,11,Decision Tree,0,0.75,0.4491869918699187,0.4139536070730205,0.026929616928100586,0.4139536070730205
267,11,RandomForest,0,0.75,0.49390243902439024,0.35924262487992414,0.16890883445739746,0.35924262487992414
268,11,AdaBoost (Discrete),0,0.75,0.5386178861788617,0.4873420114817136,12.235547065734863,0.4873420114817136
269,11,AdaBoost (Real),0,0.75,0.48577235772357724,0.43906834990447113,18.234495162963867,0.43906834990447113
270,11,Logistic Regression (Penalty = L2),0,0.75,0.5040650406504065,0.4451639245572657,0.04633617401123047,0.4451639245572657
271,11,Naive Bayes,0,0.75,0.4491869918699187,0.4623015062177744,0.04427051544189453,0.4623015062177744
272,11,KNeighbors Classifier,1,0.75,0.45621181262729127,0.42398086068424296,0.17764735221862793,0.42398086068424296
273,11,SVC Classifier,1,0.75,0.42769857433808556,1.0,0.5229887962341309,0.0
274,11,Decision Tree,1,0.75,0.42362525458248473,0.4107416325713575,0.04353022575378418,0.4107416325713575
275,11,RandomForest,1,0.75,0.5030549898167006,0.5988317290991773,0.28391456604003906,0.0
276,11,AdaBoost (Discrete),1,0.75,0.5417515274949084,0.5145172609061862,18.837091207504272,0.5145172609061862
277,11,AdaBoost (Real),1,0.75,0.5091649694501018,0.470965463715331,22.585195064544678,0.470965463715331
278,11,Logistic Regression (Penalty = L2),1,0.75,0.5234215885947047,0.4704947408915208,0.08858180046081543,0.4704947408915208
279,11,Naive Bayes,1,0.75,0.4847250509164969,0.5006527422555169,0.0025403499603271484,0.5006527422555169
280,11,KNeighbors Classifier,2,0.75,0.42857142857142855,0.37856415312782427,0.18253278732299805,0.37856415312782427
281,11,SVC Classifier,2,0.75,0.42653061224489797,1.0,0.46231555938720703,0.0
282,11,Decision Tree,2,0.75,0.45918367346938777,0.43299508005521764,0.03922438621520996,0.43299508005521764
283,11,RandomForest,2,0.75,0.5020408163265306,0.3574494095402627,0.29502201080322266,0.3574494095402627
284,11,AdaBoost (Discrete),2,0.75,0.5265306122448979,0.4988211239878325,18.31593370437622,0.4988211239878325
285,11,AdaBoost (Real),2,0.75,0.48367346938775513,0.4698035348230519,21.356284856796265,0.4698035348230519
286,11,Logistic Regression (Penalty = L2),2,0.75,0.5163265306122449,0.4603473901017494,0.0839684009552002,0.4603473901017494
287,11,Naive Bayes,2,0.75,0.4673469387755102,0.48011697645390805,0.0443270206451416,0.48011697645390805
288,12,KNeighbors Classifier,0,0.75,0.42276422764227645,0.35947963082269235,0.09523487091064453,0.35947963082269235
289,12,SVC Classifier,0,0.75,0.4268292682926829,1.0,0.395216703414917,0.0
290,12,Decision Tree,0,0.75,0.43089430894308944,0.3828873381019331,0.003047466278076172,0.3828873381019331
291,12,RandomForest,0,0.75,0.45528455284552843,0.3777827362315866,0.22168707847595215,0.3777827362315866
292,12,AdaBoost (Discrete),0,0.75,0.4491869918699187,0.42615221806456866,17.112020254135132,0.42615221806456866
293,12,AdaBoost (Real),0,0.75,0.4369918699186992,0.3879271519725215,19.676924467086792,0.3879271519725215
294,12,Logistic Regression (Penalty = L2),0,0.75,0.4573170731707317,0.4398944593656853,0.08208847045898438,0.4398944593656853
295,12,Naive Bayes,0,0.75,0.45528455284552843,0.46829193862190194,0.0429384708404541,0.46829193862190194
296,12,KNeighbors Classifier,1,0.75,0.4195519348268839,0.35907092603246543,0.09304547309875488,0.35907092603246543
297,12,SVC Classifier,1,0.75,0.42769857433808556,1.0,0.3595147132873535,0.0
298,12,Decision Tree,1,0.75,0.3910386965376782,0.3528060222990019,0.04264330863952637,0.3528060222990019
299,12,RandomForest,1,0.75,0.4745417515274949,0.26340404614116725,0.29575657844543457,0.26340404614116725
300,12,AdaBoost (Discrete),1,0.75,0.4460285132382892,0.39386472627413693,18.011295557022095,0.39386472627413693
301,12,AdaBoost (Real),1,0.75,0.40325865580448067,0.38162455928431493,21.315237522125244,0.38162455928431493
302,12,Logistic Regression (Penalty = L2),1,0.75,0.4969450101832994,0.4560734026183825,0.04578518867492676,0.4560734026183825
303,12,Naive Bayes,1,0.75,0.5071283095723014,0.5232930045047104,0.043794870376586914,0.5232930045047104
304,12,KNeighbors Classifier,2,0.75,0.41020408163265304,0.3456322849768961,0.08960461616516113,0.3456322849768961
305,12,SVC Classifier,2,0.75,0.42653061224489797,1.0,0.35445284843444824,0.0
306,12,Decision Tree,2,0.75,0.38571428571428573,0.36857774853940195,0.04340362548828125,0.36857774853940195
307,12,RandomForest,2,0.75,0.44081632653061226,0.3589513154553171,0.3461148738861084,0.3589513154553171
308,12,AdaBoost (Discrete),2,0.75,0.45714285714285713,0.42884401394819116,16.661232471466064,0.42884401394819116
309,12,AdaBoost (Real),2,0.75,0.42653061224489797,0.41681819854509394,19.758458137512207,0.41681819854509394
310,12,Logistic Regression (Penalty = L2),2,0.75,0.43673469387755104,0.40363549965565004,0.07741379737854004,0.40363549965565004
311,12,Naive Bayes,2,0.75,0.45714285714285713,0.4684051005609241,0.03959822654724121,0.4684051005609241
