,feat_set_id,classifier,fold_id,feat_th,score,geo_score,exec_t,geo_score_woz
0,0,KNeighbors Classifier,0,0.2,0.7383015597920277,0.4233706756028292,0.15379595756530762,0.0
1,0,SVC Classifier,0,0.2,0.6845753899480069,0.8129520829107402,0.3663358688354492,0.0
2,0,Decision Tree,0,0.2,0.7452339688041595,0.7844920354680928,0.05481839179992676,0.0
3,0,RandomForest,0,0.2,0.7417677642980935,0.7407118766149331,0.44327211380004883,0.0
4,0,AdaBoost (Discrete),0,0.2,0.7452339688041595,0.7844920354680928,24.352386474609375,0.0
5,0,AdaBoost (Real),0,0.2,0.7452339688041595,0.7844920354680928,40.73154044151306,0.0
6,0,Logistic Regression (Penalty = L2),0,0.2,0.6845753899480069,0.8129520829107402,0.17112350463867188,0.0
7,0,Naive Bayes,0,0.2,0.5805892547660312,0.6192878878744241,0.05703449249267578,0.0
8,0,KNeighbors Classifier,1,0.2,0.7378472222222222,0.42336937219191195,0.221665620803833,0.0
9,0,SVC Classifier,1,0.2,0.7690972222222222,0.8841027752029671,0.27660584449768066,0.0
10,0,Decision Tree,1,0.2,0.8072916666666666,0.822230104601596,0.002197265625,0.0
11,0,RandomForest,1,0.2,0.8038194444444444,0.7744915485716632,0.34064579010009766,0.0
12,0,AdaBoost (Discrete),1,0.2,0.8072916666666666,0.822230104601596,25.004236936569214,0.0
13,0,AdaBoost (Real),1,0.2,0.8072916666666666,0.822230104601596,71.07083058357239,0.0
14,0,Logistic Regression (Penalty = L2),1,0.2,0.8072916666666666,0.822230104601596,0.1472928524017334,0.0
15,0,Naive Bayes,1,0.2,0.6440972222222222,0.5921405712744449,0.071441650390625,0.0
16,0,KNeighbors Classifier,2,0.2,0.7269565217391304,0.8136055419683088,0.3054823875427246,0.0
17,0,SVC Classifier,2,0.2,0.7617391304347826,0.5617326583032773,0.46865320205688477,0.0
18,0,Decision Tree,2,0.2,0.648695652173913,0.39801326011686106,0.07467222213745117,0.39801326011686106
19,0,RandomForest,2,0.2,0.7304347826086957,0.9950248447588356,0.5332369804382324,0.0
20,0,AdaBoost (Discrete),2,0.2,0.3947826086956522,0.392204024694485,32.9261109828949,0.392204024694485
21,0,AdaBoost (Real),2,0.2,0.35304347826086957,0.3782572193157309,53.70055103302002,0.3782572193157309
22,0,Logistic Regression (Penalty = L2),2,0.2,0.6660869565217391,0.4590327398761034,0.15879154205322266,0.4590327398761034
23,0,Naive Bayes,2,0.2,0.4504347826086956,0.5309694241041965,0.07646727561950684,0.5309694241041965
24,1,KNeighbors Classifier,0,0.2,0.6377816291161178,0.480755902328575,0.24458861351013184,0.0
25,1,SVC Classifier,0,0.2,0.7001733102253033,1.0,0.3965442180633545,0.0
26,1,Decision Tree,0,0.2,0.512998266897747,0.4254438567514223,0.0023598670959472656,0.0
27,1,RandomForest,0,0.2,0.7001733102253033,1.0,0.6134216785430908,0.0
28,1,AdaBoost (Discrete),0,0.2,0.7001733102253033,1.0,35.384132385253906,0.0
29,1,AdaBoost (Real),0,0.2,0.512998266897747,0.4254438567514223,70.96141171455383,0.0
30,1,Logistic Regression (Penalty = L2),0,0.2,0.7001733102253033,1.0,0.1813516616821289,0.0
31,1,Naive Bayes,0,0.2,0.41594454072790293,0.5598055961226205,0.09209156036376953,0.0
32,1,KNeighbors Classifier,1,0.2,0.65625,0.6599528878787039,0.2724649906158447,0.0
33,1,SVC Classifier,1,0.2,0.6996527777777778,1.0,0.6421549320220947,0.0
34,1,Decision Tree,1,0.2,0.6371527777777778,0.9106699751861043,0.08675479888916016,0.0
35,1,RandomForest,1,0.2,0.5763888888888888,0.40621719184186533,0.6196188926696777,0.0
36,1,AdaBoost (Discrete),1,0.2,0.6371527777777778,0.9106699751861043,35.93238162994385,0.0
37,1,AdaBoost (Real),1,0.2,0.6371527777777778,0.9106699751861043,90.46972799301147,0.0
38,1,Logistic Regression (Penalty = L2),1,0.2,0.5225694444444444,0.5010070503656899,0.18820738792419434,0.0
39,1,Naive Bayes,1,0.2,0.5104166666666666,0.44218860673568705,0.09685730934143066,0.44218860673568705
40,1,KNeighbors Classifier,2,0.2,0.542608695652174,0.8468303183574204,0.4947044849395752,0.0
41,1,SVC Classifier,2,0.2,0.7008695652173913,1.0,0.583890438079834,0.0
42,1,Decision Tree,2,0.2,0.542608695652174,0.8468303183574204,0.09853267669677734,0.0
43,1,RandomForest,2,0.2,0.542608695652174,0.8468303183574204,0.7286067008972168,0.0
44,1,AdaBoost (Discrete),2,0.2,0.2921739130434783,0.5998345512170393,41.607654333114624,0.0
45,1,AdaBoost (Real),2,0.2,0.5391304347826087,0.8468303183574204,77.48489594459534,0.0
46,1,Logistic Regression (Penalty = L2),2,0.2,0.542608695652174,0.8468303183574204,0.20169353485107422,0.0
47,1,Naive Bayes,2,0.2,0.1808695652173913,0.4483219332480461,0.10490536689758301,0.0
48,2,KNeighbors Classifier,0,0.2,0.7001733102253033,0.6798915172639858,0.4071969985961914,0.0
49,2,SVC Classifier,0,0.2,0.6845753899480069,0.8129520829107402,0.66660475730896,0.0
50,2,Decision Tree,0,0.2,0.7140381282495667,0.8384332394589941,0.0022461414337158203,0.0
51,2,RandomForest,0,0.2,0.6169844020797227,0.6288249295942455,0.5106282234191895,0.0
52,2,AdaBoost (Discrete),0,0.2,0.7140381282495667,0.8384332394589941,41.04505705833435,0.0
53,2,AdaBoost (Real),0,0.2,0.7140381282495667,0.8384332394589941,69.86072444915771,0.0
54,2,Logistic Regression (Penalty = L2),0,0.2,0.6169844020797227,0.6288249295942455,0.20544910430908203,0.0
55,2,Naive Bayes,0,0.2,0.5996533795493935,0.6612555313096259,0.10085082054138184,0.0
56,2,KNeighbors Classifier,1,0.2,0.8229166666666666,0.9265855567861313,0.2980232238769531,0.0
57,2,SVC Classifier,1,0.2,0.7274305555555556,0.7636780043269571,0.6966736316680908,0.0
58,2,Decision Tree,1,0.2,0.8229166666666666,0.9265855567861313,0.09401512145996094,0.0
59,2,RandomForest,1,0.2,0.78125,0.7990572919580082,0.7148733139038086,0.0
60,2,AdaBoost (Discrete),1,0.2,0.8229166666666666,0.9265855567861313,40.1374249458313,0.0
61,2,AdaBoost (Real),1,0.2,0.8229166666666666,0.9265855567861313,52.15883421897888,0.0
62,2,Logistic Regression (Penalty = L2),1,0.2,0.78125,0.7990572919580082,0.19704318046569824,0.0
63,2,Naive Bayes,1,0.2,0.7395833333333334,0.8130041017960279,0.197279691696167,0.0
64,2,KNeighbors Classifier,2,0.2,0.76,0.641347040372881,0.20219159126281738,0.0
65,2,SVC Classifier,2,0.2,0.8382608695652174,0.8340051055773173,0.7077317237854004,0.0
66,2,Decision Tree,2,0.2,0.76,0.641347040372881,0.10187578201293945,0.0
67,2,RandomForest,2,0.2,0.7008695652173913,1.0,0.5141243934631348,0.0
68,2,AdaBoost (Discrete),2,0.2,0.76,0.641347040372881,40.448267459869385,0.0
69,2,AdaBoost (Real),2,0.2,0.76,0.641347040372881,110.86383819580078,0.0
70,2,Logistic Regression (Penalty = L2),2,0.2,0.8382608695652174,0.8340051055773173,0.21555233001708984,0.0
71,2,Naive Bayes,2,0.2,0.76,0.641347040372881,0.10802841186523438,0.0
72,3,KNeighbors Classifier,0,0.2,0.7417677642980935,0.7407118766149331,0.3155369758605957,0.0
73,3,SVC Classifier,0,0.2,0.6845753899480069,0.8129520829107402,0.8579304218292236,0.0
74,3,Decision Tree,0,0.2,0.6845753899480069,0.8129520829107402,0.0016925334930419922,0.0
75,3,RandomForest,0,0.2,0.7192374350086655,0.7958596836997172,0.8632471561431885,0.0
76,3,AdaBoost (Discrete),0,0.2,0.6845753899480069,0.8129520829107402,45.71332120895386,0.0
77,3,AdaBoost (Real),0,0.2,0.6845753899480069,0.8129520829107402,86.401362657547,0.0
78,3,Logistic Regression (Penalty = L2),0,0.2,0.6845753899480069,0.8129520829107402,0.3828704357147217,0.0
79,3,Naive Bayes,0,0.2,0.5805892547660312,0.6192878878744241,0.16501712799072266,0.0
80,3,KNeighbors Classifier,1,0.2,0.6614583333333334,0.5429157320276391,0.47290802001953125,0.0
81,3,SVC Classifier,1,0.2,0.7690972222222222,0.8841027752029671,0.8682861328125,0.0
82,3,Decision Tree,1,0.2,0.7690972222222222,0.8841027752029671,0.13858246803283691,0.0
83,3,RandomForest,1,0.2,0.7309027777777778,0.6655283913569978,0.8901638984680176,0.0
84,3,AdaBoost (Discrete),1,0.2,0.7690972222222222,0.8841027752029671,51.95979428291321,0.0
85,3,AdaBoost (Real),1,0.2,0.7690972222222222,0.8841027752029671,109.68822169303894,0.0
86,3,Logistic Regression (Penalty = L2),1,0.2,0.7690972222222222,0.8841027752029671,0.389087438583374,0.0
87,3,Naive Bayes,1,0.2,0.6666666666666666,0.6596260502202088,0.3324856758117676,0.0
88,3,KNeighbors Classifier,2,0.2,0.88,0.9684860662631681,0.49419283866882324,0.0
89,3,SVC Classifier,2,0.2,0.7617391304347826,0.5617326583032773,1.1318631172180176,0.0
90,3,Decision Tree,2,0.2,0.7617391304347826,0.5617326583032773,0.0015370845794677734,0.0
91,3,RandomForest,2,0.2,0.7234782608695652,0.38239706119026057,1.1155343055725098,0.0
92,3,AdaBoost (Discrete),2,0.2,0.7617391304347826,0.5617326583032773,74.33689737319946,0.0
93,3,AdaBoost (Real),2,0.2,0.7617391304347826,0.5617326583032773,181.12183260917664,0.0
94,3,Logistic Regression (Penalty = L2),2,0.2,0.7617391304347826,0.5617326583032773,0.2103888988494873,0.0
95,3,Naive Bayes,2,0.2,0.8452173913043478,0.8606607789059729,0.18383097648620605,0.0
96,4,KNeighbors Classifier,0,0.2,0.7001733102253033,1.0,0.40447449684143066,0.0
97,4,SVC Classifier,0,0.2,0.7001733102253033,1.0,0.8270468711853027,0.0
98,4,Decision Tree,0,0.2,0.7001733102253033,1.0,0.20588159561157227,0.0
99,4,RandomForest,0,0.2,0.7001733102253033,1.0,1.1140170097351074,0.0
100,4,AdaBoost (Discrete),0,0.2,0.7001733102253033,1.0,75.5023455619812,0.0
101,4,AdaBoost (Real),0,0.2,0.7001733102253033,1.0,97.40931296348572,0.0
102,4,Logistic Regression (Penalty = L2),0,0.2,0.7001733102253033,1.0,0.43944883346557617,0.0
103,4,Naive Bayes,0,0.2,0.5025996533795494,0.6332377902572627,0.2631354331970215,0.0
104,4,KNeighbors Classifier,1,0.2,0.6996527777777778,1.0,0.5461990833282471,0.0
105,4,SVC Classifier,1,0.2,0.6996527777777778,1.0,0.8045437335968018,0.0
106,4,Decision Tree,1,0.2,0.6996527777777778,1.0,0.15778803825378418,0.0
107,4,RandomForest,1,0.2,0.6996527777777778,1.0,1.6019847393035889,0.0
108,4,AdaBoost (Discrete),1,0.2,0.6996527777777778,1.0,76.23334312438965,0.0
109,4,AdaBoost (Real),1,0.2,0.6996527777777778,1.0,216.7125084400177,0.0
110,4,Logistic Regression (Penalty = L2),1,0.2,0.6996527777777778,1.0,0.4706907272338867,0.0
111,4,Naive Bayes,1,0.2,0.5503472222222222,0.6848230649393702,0.23137688636779785,0.0
112,4,KNeighbors Classifier,2,0.2,0.5391304347826087,0.8468303183574204,0.4669783115386963,0.0
113,4,SVC Classifier,2,0.2,0.7008695652173913,1.0,1.3939189910888672,0.0
114,4,Decision Tree,2,0.2,0.542608695652174,0.8468303183574204,0.1988508701324463,0.0
115,4,RandomForest,2,0.2,0.542608695652174,0.8468303183574204,1.333832025527954,0.0
116,4,AdaBoost (Discrete),2,0.2,0.2921739130434783,0.5998345512170393,64.341805934906,0.0
117,4,AdaBoost (Real),2,0.2,0.542608695652174,0.8468303183574204,85.73319578170776,0.0
118,4,Logistic Regression (Penalty = L2),2,0.2,0.542608695652174,0.8468303183574204,0.23093533515930176,0.0
119,4,Naive Bayes,2,0.2,0.4991304347826087,0.5540862458931088,0.0026483535766601562,0.0
120,5,KNeighbors Classifier,0,0.2,0.6845753899480069,0.8129520829107402,0.44515562057495117,0.0
121,5,SVC Classifier,0,0.2,0.6845753899480069,0.8129520829107402,0.6977095603942871,0.0
122,5,Decision Tree,0,0.2,0.6845753899480069,0.8129520829107402,0.11046481132507324,0.0
123,5,RandomForest,0,0.2,0.6845753899480069,0.8129520829107402,0.8951597213745117,0.0
124,5,AdaBoost (Discrete),0,0.2,0.6845753899480069,0.8129520829107402,41.796446084976196,0.0
125,5,AdaBoost (Real),0,0.2,0.6845753899480069,0.8129520829107402,85.82754683494568,0.0
126,5,Logistic Regression (Penalty = L2),0,0.2,0.6845753899480069,0.8129520829107402,0.2703547477722168,0.0
127,5,Naive Bayes,0,0.2,0.6845753899480069,0.8129520829107402,0.10469198226928711,0.0
128,5,KNeighbors Classifier,1,0.2,0.6996527777777778,1.0,0.21078205108642578,0.0
129,5,SVC Classifier,1,0.2,0.7690972222222222,0.8841027752029671,0.6230692863464355,0.0
130,5,Decision Tree,1,0.2,0.7690972222222222,0.8841027752029671,0.0023126602172851562,0.0
131,5,RandomForest,1,0.2,0.7690972222222222,0.8841027752029671,0.830751895904541,0.0
132,5,AdaBoost (Discrete),1,0.2,0.7690972222222222,0.8841027752029671,42.190842151641846,0.0
133,5,AdaBoost (Real),1,0.2,0.7690972222222222,0.8841027752029671,81.82489681243896,0.0
134,5,Logistic Regression (Penalty = L2),1,0.2,0.7690972222222222,0.8841027752029671,0.21643567085266113,0.0
135,5,Naive Bayes,1,0.2,0.7690972222222222,0.8841027752029671,0.21223163604736328,0.0
136,5,KNeighbors Classifier,2,0.2,0.88,0.9684860662631681,0.31911635398864746,0.0
137,5,SVC Classifier,2,0.2,0.7008695652173913,1.0,0.5338449478149414,0.0
138,5,Decision Tree,2,0.2,0.88,0.9684860662631681,0.10614252090454102,0.0
139,5,RandomForest,2,0.2,0.88,0.9684860662631681,0.777815580368042,0.0
140,5,AdaBoost (Discrete),2,0.2,0.88,0.9684860662631681,43.599157094955444,0.0
141,5,AdaBoost (Real),2,0.2,0.88,0.9684860662631681,55.10184955596924,0.0
142,5,Logistic Regression (Penalty = L2),2,0.2,0.88,0.9684860662631681,0.21605992317199707,0.0
143,5,Naive Bayes,2,0.2,0.88,0.9684860662631681,0.002565145492553711,0.0
144,6,KNeighbors Classifier,0,0.2,0.6845753899480069,0.8129520829107402,0.32329559326171875,0.0
145,6,SVC Classifier,0,0.2,0.6845753899480069,0.8129520829107402,0.6403713226318359,0.0
146,6,Decision Tree,0,0.2,0.6845753899480069,0.8129520829107402,0.11002349853515625,0.0
147,6,RandomForest,0,0.2,0.7417677642980935,0.7407118766149331,0.6328306198120117,0.0
148,6,AdaBoost (Discrete),0,0.2,0.6845753899480069,0.8129520829107402,41.946922302246094,0.0
149,6,AdaBoost (Real),0,0.2,0.6845753899480069,0.8129520829107402,113.29140019416809,0.0
150,6,Logistic Regression (Penalty = L2),0,0.2,0.6845753899480069,0.8129520829107402,0.2333064079284668,0.0
151,6,Naive Bayes,0,0.2,0.5805892547660312,0.6192878878744241,0.22105979919433594,0.0
152,6,KNeighbors Classifier,1,0.2,0.6666666666666666,0.6596260502202088,0.34276890754699707,0.0
153,6,SVC Classifier,1,0.2,0.7690972222222222,0.8841027752029671,0.6565170288085938,0.0
154,6,Decision Tree,1,0.2,0.7690972222222222,0.8841027752029671,0.0023691654205322266,0.0
155,6,RandomForest,1,0.2,0.8038194444444444,0.7744915485716632,0.8065438270568848,0.0
156,6,AdaBoost (Discrete),1,0.2,0.7690972222222222,0.8841027752029671,47.0404155254364,0.0
157,6,AdaBoost (Real),1,0.2,0.7690972222222222,0.8841027752029671,124.51830530166626,0.0
158,6,Logistic Regression (Penalty = L2),1,0.2,0.7690972222222222,0.8841027752029671,0.2203996181488037,0.0
159,6,Naive Bayes,1,0.2,0.6666666666666666,0.6596260502202088,0.10456228256225586,0.0
160,6,KNeighbors Classifier,2,0.2,0.7617391304347826,0.5617326583032773,0.23071694374084473,0.0
161,6,SVC Classifier,2,0.2,0.7617391304347826,0.5617326583032773,0.6443560123443604,0.0
162,6,Decision Tree,2,0.2,0.7617391304347826,0.5617326583032773,0.0014286041259765625,0.0
163,6,RandomForest,2,0.2,0.7617391304347826,0.5617326583032773,0.7501144409179688,0.0
164,6,AdaBoost (Discrete),2,0.2,0.7617391304347826,0.5617326583032773,45.718400716781616,0.0
165,6,AdaBoost (Real),2,0.2,0.7617391304347826,0.5617326583032773,129.60119223594666,0.0
166,6,Logistic Regression (Penalty = L2),2,0.2,0.7617391304347826,0.5617326583032773,0.19331598281860352,0.0
167,6,Naive Bayes,2,0.2,0.8452173913043478,0.8606607789059729,0.1849832534790039,0.0
168,7,KNeighbors Classifier,0,0.2,0.7001733102253033,1.0,0.3824925422668457,0.0
169,7,SVC Classifier,0,0.2,0.7001733102253033,1.0,0.4805259704589844,0.0
170,7,Decision Tree,0,0.2,0.7001733102253033,1.0,0.09051108360290527,0.0
171,7,RandomForest,0,0.2,0.7001733102253033,1.0,0.8057999610900879,0.0
172,7,AdaBoost (Discrete),0,0.2,0.7001733102253033,1.0,39.08257031440735,0.0
173,7,AdaBoost (Real),0,0.2,0.7001733102253033,1.0,80.83603692054749,0.0
174,7,Logistic Regression (Penalty = L2),0,0.2,0.7001733102253033,1.0,0.09798288345336914,0.0
175,7,Naive Bayes,0,0.2,0.41767764298093585,0.5598055961226205,0.09604120254516602,0.0
176,7,KNeighbors Classifier,1,0.2,0.6996527777777778,1.0,0.19841957092285156,0.0
177,7,SVC Classifier,1,0.2,0.6996527777777778,1.0,0.379758358001709,0.0
178,7,Decision Tree,1,0.2,0.5225694444444444,0.5010070503656899,0.0022325515747070312,0.0
179,7,RandomForest,1,0.2,0.5225694444444444,0.5010070503656899,0.7017650604248047,0.0
180,7,AdaBoost (Discrete),1,0.2,0.5225694444444444,0.5010070503656899,36.35645151138306,0.0
181,7,AdaBoost (Real),1,0.2,0.5225694444444444,0.5010070503656899,58.570598125457764,0.0
182,7,Logistic Regression (Penalty = L2),1,0.2,0.5225694444444444,0.5010070503656899,0.1881256103515625,0.0
183,7,Naive Bayes,1,0.2,0.4583333333333333,0.5754179127433576,0.10044717788696289,0.0
184,7,KNeighbors Classifier,2,0.2,0.7008695652173913,1.0,0.2718377113342285,0.0
185,7,SVC Classifier,2,0.2,0.7008695652173913,1.0,0.49878978729248047,0.0
186,7,Decision Tree,2,0.2,0.7008695652173913,1.0,0.07472610473632812,0.0
187,7,RandomForest,2,0.2,0.7008695652173913,1.0,0.6659154891967773,0.0
188,7,AdaBoost (Discrete),2,0.2,0.7008695652173913,1.0,35.46980381011963,0.0
189,7,AdaBoost (Real),2,0.2,0.7008695652173913,1.0,106.78893971443176,0.0
190,7,Logistic Regression (Penalty = L2),2,0.2,0.7008695652173913,1.0,0.09428167343139648,0.0
191,7,Naive Bayes,2,0.2,0.43130434782608695,0.7472032220800768,0.09218358993530273,0.0
192,8,KNeighbors Classifier,0,0.2,0.5979202772963604,0.5967307281187957,0.2633390426635742,0.0
193,8,SVC Classifier,0,0.2,0.7001733102253033,1.0,0.5461554527282715,0.0
194,8,Decision Tree,0,0.2,0.7001733102253033,1.0,0.0023474693298339844,0.0
195,8,RandomForest,0,0.2,0.7001733102253033,1.0,0.6486153602600098,0.0
196,8,AdaBoost (Discrete),0,0.2,0.7001733102253033,1.0,35.253700494766235,0.0
197,8,AdaBoost (Real),0,0.2,0.7001733102253033,1.0,70.31541967391968,0.0
198,8,Logistic Regression (Penalty = L2),0,0.2,0.7001733102253033,1.0,0.09844088554382324,0.0
199,8,Naive Bayes,0,0.2,0.5025996533795494,0.6332377902572627,0.09309148788452148,0.0
200,8,KNeighbors Classifier,1,0.2,0.6215277777777778,0.6039571739702033,0.19877028465270996,0.0
201,8,SVC Classifier,1,0.2,0.6996527777777778,1.0,0.47067737579345703,0.0
202,8,Decision Tree,1,0.2,0.6996527777777778,1.0,0.09017395973205566,0.0
203,8,RandomForest,1,0.2,0.6996527777777778,1.0,0.5856695175170898,0.0
204,8,AdaBoost (Discrete),1,0.2,0.6996527777777778,1.0,38.18786883354187,0.0
205,8,AdaBoost (Real),1,0.2,0.6996527777777778,1.0,97.76390743255615,0.0
206,8,Logistic Regression (Penalty = L2),1,0.2,0.6996527777777778,1.0,0.200209379196167,0.0
207,8,Naive Bayes,1,0.2,0.5503472222222222,0.6848230649393702,0.10003161430358887,0.0
208,8,KNeighbors Classifier,2,0.2,0.6139130434782609,0.7472032220800768,0.32381200790405273,0.0
209,8,SVC Classifier,2,0.2,0.7008695652173913,1.0,0.40131568908691406,0.0
210,8,Decision Tree,2,0.2,0.7008695652173913,1.0,0.09441137313842773,0.0
211,8,RandomForest,2,0.2,0.7008695652173913,1.0,0.7021496295928955,0.0
212,8,AdaBoost (Discrete),2,0.2,0.7008695652173913,1.0,41.26646590232849,0.0
213,8,AdaBoost (Real),2,0.2,0.7008695652173913,1.0,87.259108543396,0.0
214,8,Logistic Regression (Penalty = L2),2,0.2,0.7008695652173913,1.0,0.18799495697021484,0.0
215,8,Naive Bayes,2,0.2,0.6139130434782609,0.7472032220800768,0.09610271453857422,0.0
216,9,KNeighbors Classifier,0,0.2,0.6845753899480069,0.8129520829107402,0.2891201972961426,0.0
217,9,SVC Classifier,0,0.2,0.6845753899480069,0.8129520829107402,0.44074153900146484,0.0
218,9,Decision Tree,0,0.2,0.6845753899480069,0.8129520829107402,0.09845972061157227,0.0
219,9,RandomForest,0,0.2,0.6845753899480069,0.8129520829107402,0.6107461452484131,0.0
220,9,AdaBoost (Discrete),0,0.2,0.6845753899480069,0.8129520829107402,33.349730491638184,0.0
221,9,AdaBoost (Real),0,0.2,0.6845753899480069,0.8129520829107402,65.6750135421753,0.0
222,9,Logistic Regression (Penalty = L2),0,0.2,0.6845753899480069,0.8129520829107402,0.18484878540039062,0.0
223,9,Naive Bayes,0,0.2,0.6845753899480069,0.8129520829107402,0.09179544448852539,0.0
224,9,KNeighbors Classifier,1,0.2,0.6996527777777778,1.0,0.29961442947387695,0.0
225,9,SVC Classifier,1,0.2,0.7690972222222222,0.8841027752029671,0.46801233291625977,0.0
226,9,Decision Tree,1,0.2,0.7690972222222222,0.8841027752029671,0.0023660659790039062,0.0
227,9,RandomForest,1,0.2,0.7690972222222222,0.8841027752029671,0.6472105979919434,0.0
228,9,AdaBoost (Discrete),1,0.2,0.7690972222222222,0.8841027752029671,39.188583850860596,0.0
229,9,AdaBoost (Real),1,0.2,0.7690972222222222,0.8841027752029671,74.37313032150269,0.0
230,9,Logistic Regression (Penalty = L2),1,0.2,0.7690972222222222,0.8841027752029671,0.1844470500946045,0.0
231,9,Naive Bayes,1,0.2,0.7690972222222222,0.8841027752029671,0.1622626781463623,0.0
232,9,KNeighbors Classifier,2,0.2,0.88,0.9684860662631681,0.19237518310546875,0.0
233,9,SVC Classifier,2,0.2,0.7008695652173913,1.0,0.5805745124816895,0.0
234,9,Decision Tree,2,0.2,0.88,0.9684860662631681,0.002264261245727539,0.0
235,9,RandomForest,2,0.2,0.88,0.9684860662631681,0.6828889846801758,0.0
236,9,AdaBoost (Discrete),2,0.2,0.88,0.9684860662631681,38.54045033454895,0.0
237,9,AdaBoost (Real),2,0.2,0.88,0.9684860662631681,49.57407999038696,0.0
238,9,Logistic Regression (Penalty = L2),2,0.2,0.88,0.9684860662631681,0.19385123252868652,0.0
239,9,Naive Bayes,2,0.2,0.88,0.9684860662631681,0.09639382362365723,0.0
240,10,KNeighbors Classifier,0,0.2,0.707105719237435,0.7610571074446906,0.35956287384033203,0.0
241,10,SVC Classifier,0,0.2,0.6845753899480069,0.8129520829107402,0.8609404563903809,0.0
242,10,Decision Tree,0,0.2,0.6655112651646448,0.7592254390671672,0.09003067016601562,0.0
243,10,RandomForest,0,0.2,0.7157712305025996,0.5249425357518518,0.700279712677002,0.0
244,10,AdaBoost (Discrete),0,0.2,0.6967071057192374,0.7368903756615188,39.95330882072449,0.0
245,10,AdaBoost (Real),0,0.2,0.6845753899480069,0.6980790474119988,156.82841682434082,0.0
246,10,Logistic Regression (Penalty = L2),0,0.2,0.6655112651646448,0.7592254390671672,0.2102489471435547,0.0
247,10,Naive Bayes,0,0.2,0.6429809358752167,0.7508927762297288,0.07623934745788574,0.0
248,10,KNeighbors Classifier,1,0.2,0.6857638888888888,0.44632841840057674,0.27791690826416016,0.0
249,10,SVC Classifier,1,0.2,0.7638888888888888,0.8487967691591359,0.48575544357299805,0.0
250,10,Decision Tree,1,0.2,0.71875,0.7127864449672372,0.06763339042663574,0.0
251,10,RandomForest,1,0.2,0.7239583333333334,0.4956385459568428,0.4807910919189453,0.0
252,10,AdaBoost (Discrete),1,0.2,0.71875,0.7127864449672372,30.28067660331726,0.0
253,10,AdaBoost (Real),1,0.2,0.6475694444444444,0.6860109636030775,61.49890112876892,0.0
254,10,Logistic Regression (Penalty = L2),1,0.2,0.71875,0.7127864449672372,0.1364433765411377,0.0
255,10,Naive Bayes,1,0.2,0.6979166666666666,0.6508840054173792,0.08458089828491211,0.6508840054173792
256,10,KNeighbors Classifier,2,0.2,0.7286956521739131,0.8143111845960586,0.3548462390899658,0.0
257,10,SVC Classifier,2,0.2,0.7617391304347826,0.5617326583032773,0.43235039710998535,0.0
258,10,Decision Tree,2,0.2,0.5721739130434783,0.3982612899375519,0.0015544891357421875,0.3982612899375519
259,10,RandomForest,2,0.2,0.7478260869565218,0.44595446931306665,0.5389714241027832,0.0
260,10,AdaBoost (Discrete),2,0.2,0.4052173913043478,0.3597128593712998,28.855403661727905,0.3597128593712998
261,10,AdaBoost (Real),2,0.2,0.5721739130434783,0.3982612899375519,52.66907787322998,0.3982612899375519
262,10,Logistic Regression (Penalty = L2),2,0.2,0.7391304347826086,0.42805277352697846,0.16342878341674805,0.42805277352697846
263,10,Naive Bayes,2,0.2,0.4365217391304348,0.501353192345415,0.12903308868408203,0.501353192345415
264,11,KNeighbors Classifier,0,0.2,0.6759098786828422,0.562385381853539,0.2472381591796875,0.0
265,11,SVC Classifier,0,0.2,0.6845753899480069,0.8129520829107402,0.5657651424407959,0.0
266,11,Decision Tree,0,0.2,0.6152512998266898,0.5183775377196999,0.051863908767700195,0.0
267,11,RandomForest,0,0.2,0.7001733102253033,1.0,0.3870375156402588,0.0
268,11,AdaBoost (Discrete),0,0.2,0.42980935875216636,0.4759647425641533,25.563349723815918,0.0
269,11,AdaBoost (Real),0,0.2,0.2218370883882149,0.2649102639566414,32.06914043426514,0.0
270,11,Logistic Regression (Penalty = L2),0,0.2,0.6395147313691508,0.6832394989103653,0.18779230117797852,0.0
271,11,Naive Bayes,0,0.2,0.6429809358752167,0.7508927762297288,0.15726947784423828,0.0
272,11,KNeighbors Classifier,1,0.2,0.7013888888888888,0.4390407365289393,0.4273226261138916,0.0
273,11,SVC Classifier,1,0.2,0.7274305555555556,0.7636780043269571,0.5909996032714844,0.0
274,11,Decision Tree,1,0.2,0.75,0.5106983799129431,0.03930354118347168,0.0
275,11,RandomForest,1,0.2,0.6996527777777778,1.0,0.43572092056274414,0.0
276,11,AdaBoost (Discrete),1,0.2,0.7395833333333334,0.5594679924778646,25.38627862930298,0.0
277,11,AdaBoost (Real),1,0.2,0.3611111111111111,0.39028550471161577,29.90221357345581,0.0
278,11,Logistic Regression (Penalty = L2),1,0.2,0.71875,0.6138900896607005,0.2585904598236084,0.0
279,11,Naive Bayes,1,0.2,0.78125,0.6802396938019404,0.10565638542175293,0.0
280,11,KNeighbors Classifier,2,0.2,0.7391304347826086,0.6688816721433501,0.44181156158447266,0.0
281,11,SVC Classifier,2,0.2,0.8156521739130435,0.7609315011087744,0.5090539455413818,0.0
282,11,Decision Tree,2,0.2,0.7217391304347827,0.6920864792727941,0.05481147766113281,0.0
283,11,RandomForest,2,0.2,0.711304347826087,0.2781178990227415,0.3623661994934082,0.0
284,11,AdaBoost (Discrete),2,0.2,0.24,0.2890326277064515,24.720505714416504,0.2890326277064515
285,11,AdaBoost (Real),2,0.2,0.11478260869565217,0.21586177889709923,31.565852642059326,0.21586177889709923
286,11,Logistic Regression (Penalty = L2),2,0.2,0.6104347826086957,0.4215862361310502,0.20699620246887207,0.4215862361310502
287,11,Naive Bayes,2,0.2,0.528695652173913,0.7234770261807716,0.08940672874450684,0.0
288,12,KNeighbors Classifier,0,0.2,0.7001733102253033,1.0,0.11251974105834961,0.0
289,12,SVC Classifier,0,0.2,0.7001733102253033,1.0,0.27739834785461426,0.0
290,12,Decision Tree,0,0.2,0.7001733102253033,1.0,0.0021867752075195312,0.0
291,12,RandomForest,0,0.2,0.7001733102253033,1.0,0.40187907218933105,0.0
292,12,AdaBoost (Discrete),0,0.2,0.7001733102253033,1.0,23.123422145843506,0.0
293,12,AdaBoost (Real),0,0.2,0.7001733102253033,1.0,73.80229783058167,0.0
294,12,Logistic Regression (Penalty = L2),0,0.2,0.7001733102253033,1.0,0.15268802642822266,0.0
295,12,Naive Bayes,0,0.2,0.5025996533795494,0.6332377902572627,0.003372669219970703,0.0
296,12,KNeighbors Classifier,1,0.2,0.6996527777777778,1.0,0.17633748054504395,0.0
297,12,SVC Classifier,1,0.2,0.6996527777777778,1.0,0.2583801746368408,0.0
298,12,Decision Tree,1,0.2,0.6996527777777778,1.0,0.04613947868347168,0.0
299,12,RandomForest,1,0.2,0.6996527777777778,1.0,0.32427453994750977,0.0
300,12,AdaBoost (Discrete),1,0.2,0.6996527777777778,1.0,19.808187007904053,0.0
301,12,AdaBoost (Real),1,0.2,0.6996527777777778,1.0,67.46710562705994,0.0
302,12,Logistic Regression (Penalty = L2),1,0.2,0.6996527777777778,1.0,0.16380882263183594,0.0
303,12,Naive Bayes,1,0.2,0.5503472222222222,0.6848230649393702,0.06507325172424316,0.0
304,12,KNeighbors Classifier,2,0.2,0.7008695652173913,1.0,0.1454639434814453,0.0
305,12,SVC Classifier,2,0.2,0.7008695652173913,1.0,0.30350255966186523,0.0
306,12,Decision Tree,2,0.2,0.7008695652173913,1.0,0.002025127410888672,0.0
307,12,RandomForest,2,0.2,0.7008695652173913,1.0,0.34050750732421875,0.0
308,12,AdaBoost (Discrete),2,0.2,0.7008695652173913,1.0,19.90057373046875,0.0
309,12,AdaBoost (Real),2,0.2,0.7008695652173913,1.0,31.004013538360596,0.0
310,12,Logistic Regression (Penalty = L2),2,0.2,0.7008695652173913,1.0,0.1446819305419922,0.0
311,12,Naive Bayes,2,0.2,0.6139130434782609,0.7472032220800768,0.03571438789367676,0.0
