{
	"datasets": [
		{
			"name": "abalone",
			"description": "Abalone Sizes",
			"filename": "abalone_cleaned.data",
			"directory": "./datasets/abalone",
			"filetype": "csv",
			"attribute":
				{
					"characteristics": "categorical,integer,real",
					"count": 8
				},
			"characteristic": "multivariate",
			"instances": 4191,
			"missing_values": "no",
			"fieldnames": 0,
			"header_row": 1,
			"data_range": {
				"start": 0,
				"end": 7
			},
			"result_column": 8,
			"num_classes": 28
		},
		{
			"name": "credit_card_default",
			"description": "Credit Card Default",
			"filename": "credit_card_default.csv",
			"directory": "./datasets/default_of_credit_card_clients",
			"filetype": "csv",
			"attribute":
				{
					"characteristics": "integer,real",
					"count": 8
				},
			"characteristic": "multivariate",
			"instances": 30000,
			"missing_values": "no",
			"fieldnames": 0,
			"header_row": 1,
			"data_range": {
				"start": 0,
				"end": 23
			},
			"result_column": 24,
			"num_classes": 2
		},
		{
			"name": "Adult Income",
			"description": "Predict whether income exceeds $50K/yr",
			"filename": "adult_census_income_cleaned.data",
			"directory": "./datasets/adult_Income",
			"filetype": "csv",
			"attribute":
				{
					"characteristics": "categorical,integer",
					"count": 14
				},
			"characteristic": "multivariate",
			"instances": 32561,
			"missing_values": "yes",
			"fieldnames": 0,
			"header_row": 1,
			"data_range": {
				"start": 0,
				"end": 13
			},
			"result_column": 14,
			"num_classes": 2
		},
		{
			"name": "bank_loan",
			"description": "Bank loan",
			"filename": "bank_loan.csv",
			"directory": "./datasets/bank_marketing",
			"filetype": "csv",
			"attribute":
				{
					"characteristics": "real",
					"count": 17
				},
			"characteristic": "multivariate",
			"instances": 4521,
			"missing_values": "no",
			"fieldnames": 0,
			"header_row": 1,
			"data_range": {
				"start": 0,
				"end": 15
			},
			"result_column": 16,
			"num_classes": 2
		},
		{
			"name": "OccupancyDetection",
			"description": "Occupancy Detection",
			"filename": "occupancy.csv",
			"directory": "./datasets/OccupancyDetection",
			"filetype": "csv",
			"attribute":
				{
					"characteristics": "real",
					"count": 7
				},
			"characteristic": "multivariate,time-series",
			"instances": 20560,
			"missing_values": "no",
			"fieldnames": 0,
			"header_row": 1,
			"data_range": {
				"start": 0,
				"end": 4
			},
			"result_column": 5,
			"num_classes": 2
		},
		{
			"name": "SensorlessDrive",
			"description": "Sensorless Drive",
			"filename": "sensorless.csv",
			"directory": "./datasets/sensorless_drive",
			"filetype": "csv",
			"attribute":
				{
					"characteristics": "real",
					"count": 49
				},
			"characteristic": "multivariate",
			"instances": 58509,
			"missing_values": "no",
			"fieldnames": 0,
			"header_row": 1,
			"data_range": {
				"start": 0,
				"end": 47
			},
			"result_column": 48,
			"num_classes": 11
		}
	]
}
