,feat_set_id,classifier,fold_id,feat_th,score,geo_score,exec_t,geo_score_woz
0,0,KNeighbors Classifier,0,0.5,0.42276422764227645,0.35947963082269235,0.046463727951049805,0.35947963082269235
1,0,SVC Classifier,0,0.5,0.4268292682926829,1.0,0.11849784851074219,0.0
2,0,Decision Tree,0,0.5,0.42276422764227645,0.3953120682424052,0.0035200119018554688,0.3953120682424052
3,0,RandomForest,0,0.5,0.45528455284552843,0.3777827362315866,0.09444904327392578,0.3777827362315866
4,0,AdaBoost (Discrete),0,0.5,0.4491869918699187,0.42615221806456866,5.458329916000366,0.42615221806456866
5,0,AdaBoost (Real),0,0.5,0.4369918699186992,0.3879271519725215,5.69344162940979,0.3879271519725215
6,0,Logistic Regression (Penalty = L2),0,0.5,0.4573170731707317,0.4398944593656853,0.09712862968444824,0.4398944593656853
7,0,Naive Bayes,0,0.5,0.45528455284552843,0.46829193862190194,0.029106855392456055,0.46829193862190194
8,0,KNeighbors Classifier,1,0.5,0.4195519348268839,0.35907092603246543,0.026444435119628906,0.35907092603246543
9,0,SVC Classifier,1,0.5,0.42769857433808556,1.0,0.10792851448059082,0.0
10,0,Decision Tree,1,0.5,0.4093686354378819,0.3723818098625218,0.01904463768005371,0.3723818098625218
11,0,RandomForest,1,0.5,0.4745417515274949,0.26340404614116725,0.10681009292602539,0.26340404614116725
12,0,AdaBoost (Discrete),1,0.5,0.4460285132382892,0.39386472627413693,6.222871780395508,0.39386472627413693
13,0,AdaBoost (Real),1,0.5,0.40325865580448067,0.38162455928431493,6.687393665313721,0.38162455928431493
14,0,Logistic Regression (Penalty = L2),1,0.5,0.4969450101832994,0.4560734026183825,0.02215862274169922,0.4560734026183825
15,0,Naive Bayes,1,0.5,0.5071283095723014,0.5232930045047104,0.020360708236694336,0.5232930045047104
16,0,KNeighbors Classifier,2,0.5,0.41020408163265304,0.3456322849768961,0.02656698226928711,0.3456322849768961
17,0,SVC Classifier,2,0.5,0.42653061224489797,1.0,0.09608197212219238,0.0
18,0,Decision Tree,2,0.5,0.38979591836734695,0.36329875126104133,0.0032558441162109375,0.36329875126104133
19,0,RandomForest,2,0.5,0.44081632653061226,0.3589513154553171,0.07035183906555176,0.3589513154553171
20,0,AdaBoost (Discrete),2,0.5,0.45714285714285713,0.42884401394819116,4.986573696136475,0.42884401394819116
21,0,AdaBoost (Real),2,0.5,0.42653061224489797,0.41681819854509394,6.09026026725769,0.41681819854509394
22,0,Logistic Regression (Penalty = L2),2,0.5,0.43673469387755104,0.40363549965565004,0.022458791732788086,0.40363549965565004
23,0,Naive Bayes,2,0.5,0.45714285714285713,0.4684051005609241,0.020275592803955078,0.4684051005609241
24,1,KNeighbors Classifier,0,0.5,0.4695121951219512,0.4252385098194711,0.023503780364990234,0.4252385098194711
25,1,SVC Classifier,0,0.5,0.4268292682926829,1.0,0.09746313095092773,0.0
26,1,Decision Tree,0,0.5,0.45121951219512196,0.41602028220998916,0.0029599666595458984,0.41602028220998916
27,1,RandomForest,0,0.5,0.5121951219512195,0.44480240904489815,0.0738379955291748,0.44480240904489815
28,1,AdaBoost (Discrete),0,0.5,0.5650406504065041,0.5311119190713165,5.414435863494873,0.5311119190713165
29,1,AdaBoost (Real),0,0.5,0.4715447154471545,0.41335540738546167,6.516181230545044,0.41335540738546167
30,1,Logistic Regression (Penalty = L2),0,0.5,0.5365853658536586,0.49253978939230036,0.02324056625366211,0.49253978939230036
31,1,Naive Bayes,0,0.5,0.4695121951219512,0.48190132757036114,0.0048253536224365234,0.48190132757036114
32,1,KNeighbors Classifier,1,0.5,0.4786150712830957,0.42766609300947594,0.02589702606201172,0.42766609300947594
33,1,SVC Classifier,1,0.5,0.42769857433808556,1.0,0.10071897506713867,0.0
34,1,Decision Tree,1,0.5,0.45824847250509165,0.42739687308412694,0.019598722457885742,0.42739687308412694
35,1,RandomForest,1,0.5,0.5091649694501018,0.6538830363376038,0.09847784042358398,0.0
36,1,AdaBoost (Discrete),1,0.5,0.5193482688391039,0.48956529499880946,5.737741947174072,0.48956529499880946
37,1,AdaBoost (Real),1,0.5,0.46435845213849286,0.43604427626951187,6.022416591644287,0.43604427626951187
38,1,Logistic Regression (Penalty = L2),1,0.5,0.5213849287169042,0.45321661219781156,0.02176046371459961,0.45321661219781156
39,1,Naive Bayes,1,0.5,0.4847250509164969,0.497437278930507,0.003545045852661133,0.497437278930507
40,1,KNeighbors Classifier,2,0.5,0.4816326530612245,0.4481671131770543,0.025137662887573242,0.4481671131770543
41,1,SVC Classifier,2,0.5,0.42653061224489797,1.0,0.11340808868408203,0.0
42,1,Decision Tree,2,0.5,0.4775510204081633,0.44408013144642733,0.018942832946777344,0.44408013144642733
43,1,RandomForest,2,0.5,0.5,0.3675595727763225,0.09847855567932129,0.3675595727763225
44,1,AdaBoost (Discrete),2,0.5,0.5081632653061224,0.47209494430621357,5.12630558013916,0.47209494430621357
45,1,AdaBoost (Real),2,0.5,0.4816326530612245,0.4643475068732467,6.089257717132568,0.4643475068732467
46,1,Logistic Regression (Penalty = L2),2,0.5,0.5,0.44230037693624574,0.022455453872680664,0.44230037693624574
47,1,Naive Bayes,2,0.5,0.4448979591836735,0.450107864189053,0.0038466453552246094,0.450107864189053
48,2,KNeighbors Classifier,0,0.5,0.48577235772357724,0.4228854602289914,0.05162358283996582,0.4228854602289914
49,2,SVC Classifier,0,0.5,0.4268292682926829,1.0,0.119659423828125,0.0
50,2,Decision Tree,0,0.5,0.4817073170731707,0.44517363007715455,0.0035309791564941406,0.44517363007715455
51,2,RandomForest,0,0.5,0.49390243902439024,0.35924262487992414,0.07482051849365234,0.35924262487992414
52,2,AdaBoost (Discrete),0,0.5,0.5386178861788617,0.4873420114817136,5.57511830329895,0.4873420114817136
53,2,AdaBoost (Real),0,0.5,0.48577235772357724,0.43906834990447113,7.856573820114136,0.43906834990447113
54,2,Logistic Regression (Penalty = L2),0,0.5,0.5040650406504065,0.4451639245572657,0.025019168853759766,0.4451639245572657
55,2,Naive Bayes,0,0.5,0.4491869918699187,0.4623015062177744,0.004990577697753906,0.4623015062177744
56,2,KNeighbors Classifier,1,0.5,0.45621181262729127,0.42398086068424296,0.07713913917541504,0.42398086068424296
57,2,SVC Classifier,1,0.5,0.42769857433808556,1.0,0.1643505096435547,0.0
58,2,Decision Tree,1,0.5,0.4725050916496945,0.4395517396089599,0.020146608352661133,0.4395517396089599
59,2,RandomForest,1,0.5,0.5030549898167006,0.5988317290991773,0.10291862487792969,0.0
60,2,AdaBoost (Discrete),1,0.5,0.5417515274949084,0.5145172609061862,6.033158779144287,0.5145172609061862
61,2,AdaBoost (Real),1,0.5,0.5091649694501018,0.470965463715331,7.167731046676636,0.470965463715331
62,2,Logistic Regression (Penalty = L2),1,0.5,0.5234215885947047,0.4704947408915208,0.024277448654174805,0.4704947408915208
63,2,Naive Bayes,1,0.5,0.4847250509164969,0.5006527422555169,0.020462751388549805,0.5006527422555169
64,2,KNeighbors Classifier,2,0.5,0.42857142857142855,0.37856415312782427,0.05240321159362793,0.37856415312782427
65,2,SVC Classifier,2,0.5,0.42653061224489797,1.0,0.1395246982574463,0.0
66,2,Decision Tree,2,0.5,0.4775510204081633,0.4522726321114386,0.019765138626098633,0.4522726321114386
67,2,RandomForest,2,0.5,0.5020408163265306,0.3574494095402627,0.07735323905944824,0.3574494095402627
68,2,AdaBoost (Discrete),2,0.5,0.5265306122448979,0.4988211239878325,6.277033090591431,0.4988211239878325
69,2,AdaBoost (Real),2,0.5,0.4816326530612245,0.46776088495995544,7.259005784988403,0.46776088495995544
70,2,Logistic Regression (Penalty = L2),2,0.5,0.5163265306122449,0.4603473901017494,0.05255270004272461,0.4603473901017494
71,2,Naive Bayes,2,0.5,0.4673469387755102,0.48011697645390805,0.019324541091918945,0.48011697645390805
72,3,KNeighbors Classifier,0,0.5,0.4695121951219512,0.4252385098194711,0.0350041389465332,0.4252385098194711
73,3,SVC Classifier,0,0.5,0.4268292682926829,1.0,0.11863183975219727,0.0
74,3,Decision Tree,0,0.5,0.4654471544715447,0.42450470592865064,0.020459651947021484,0.42450470592865064
75,3,RandomForest,0,0.5,0.5121951219512195,0.44480240904489815,0.1202855110168457,0.44480240904489815
76,3,AdaBoost (Discrete),0,0.5,0.5650406504065041,0.5311119190713165,5.624091625213623,0.5311119190713165
77,3,AdaBoost (Real),0,0.5,0.4715447154471545,0.41335540738546167,6.234800577163696,0.41335540738546167
78,3,Logistic Regression (Penalty = L2),0,0.5,0.5365853658536586,0.49253978939230036,0.021956443786621094,0.49253978939230036
79,3,Naive Bayes,0,0.5,0.4695121951219512,0.48190132757036114,0.0028154850006103516,0.48190132757036114
80,3,KNeighbors Classifier,1,0.5,0.4786150712830957,0.42766609300947594,0.024415254592895508,0.42766609300947594
81,3,SVC Classifier,1,0.5,0.42769857433808556,1.0,0.11646294593811035,0.0
82,3,Decision Tree,1,0.5,0.45417515274949083,0.4298077539981632,0.0023221969604492188,0.4298077539981632
83,3,RandomForest,1,0.5,0.5091649694501018,0.6538830363376038,0.09760189056396484,0.0
84,3,AdaBoost (Discrete),1,0.5,0.5193482688391039,0.48956529499880946,5.216490030288696,0.48956529499880946
85,3,AdaBoost (Real),1,0.5,0.46435845213849286,0.43604427626951187,6.422944784164429,0.43604427626951187
86,3,Logistic Regression (Penalty = L2),1,0.5,0.5213849287169042,0.45321661219781156,0.004319190979003906,0.45321661219781156
87,3,Naive Bayes,1,0.5,0.4847250509164969,0.497437278930507,0.01950216293334961,0.497437278930507
88,3,KNeighbors Classifier,2,0.5,0.4816326530612245,0.4481671131770543,0.04274797439575195,0.4481671131770543
89,3,SVC Classifier,2,0.5,0.42653061224489797,1.0,0.09543752670288086,0.0
90,3,Decision Tree,2,0.5,0.47551020408163264,0.4451844205117843,0.019850969314575195,0.4451844205117843
91,3,RandomForest,2,0.5,0.5,0.3675595727763225,0.08566522598266602,0.3675595727763225
92,3,AdaBoost (Discrete),2,0.5,0.5081632653061224,0.47209494430621357,5.00566840171814,0.47209494430621357
93,3,AdaBoost (Real),2,0.5,0.4816326530612245,0.4643475068732467,5.938008785247803,0.4643475068732467
94,3,Logistic Regression (Penalty = L2),2,0.5,0.5,0.44230037693624574,0.020400047302246094,0.44230037693624574
95,3,Naive Bayes,2,0.5,0.4448979591836735,0.450107864189053,0.0038177967071533203,0.450107864189053
96,4,KNeighbors Classifier,0,0.5,0.4268292682926829,0.3681302969093556,0.02361893653869629,0.3681302969093556
97,4,SVC Classifier,0,0.5,0.4268292682926829,1.0,0.09132242202758789,0.0
98,4,Decision Tree,0,0.5,0.4105691056910569,0.3756590783843221,0.01804518699645996,0.3756590783843221
99,4,RandomForest,0,0.5,0.4735772357723577,0.3596568571579554,0.09145188331604004,0.3596568571579554
100,4,AdaBoost (Discrete),0,0.5,0.46747967479674796,0.4337643942958157,4.7597620487213135,0.4337643942958157
101,4,AdaBoost (Real),0,0.5,0.4268292682926829,0.3979782633231662,5.668797969818115,0.3979782633231662
102,4,Logistic Regression (Penalty = L2),0,0.5,0.4634146341463415,0.4469493604754762,0.02847886085510254,0.4469493604754762
103,4,Naive Bayes,0,0.5,0.4573170731707317,0.4721406881676202,0.01999807357788086,0.4721406881676202
104,4,KNeighbors Classifier,1,0.5,0.3869653767820774,0.3051877862449085,0.023997068405151367,0.3051877862449085
105,4,SVC Classifier,1,0.5,0.42769857433808556,1.0,0.07280945777893066,0.0
106,4,Decision Tree,1,0.5,0.395112016293279,0.3602829406954586,0.00197601318359375,0.3602829406954586
107,4,RandomForest,1,0.5,0.4684317718940937,0.6034448261964844,0.09258675575256348,0.0
108,4,AdaBoost (Discrete),1,0.5,0.4663951120162933,0.40606254406909786,4.991152048110962,0.40606254406909786
109,4,AdaBoost (Real),1,0.5,0.4093686354378819,0.3975472590457358,6.1311609745025635,0.3975472590457358
110,4,Logistic Regression (Penalty = L2),1,0.5,0.49490835030549896,0.4635157188970618,0.019822359085083008,0.4635157188970618
111,4,Naive Bayes,1,0.5,0.4745417515274949,0.48961863617323453,0.019698143005371094,0.48961863617323453
112,4,KNeighbors Classifier,2,0.5,0.4142857142857143,0.357237603307696,0.025267362594604492,0.357237603307696
113,4,SVC Classifier,2,0.5,0.42653061224489797,1.0,0.09846353530883789,0.0
114,4,Decision Tree,2,0.5,0.4163265306122449,0.3857165284929231,0.003068685531616211,0.3857165284929231
115,4,RandomForest,2,0.5,0.4714285714285714,0.3231261397768291,0.11371827125549316,0.3231261397768291
116,4,AdaBoost (Discrete),2,0.5,0.4346938775510204,0.4120125027984906,5.147164583206177,0.4120125027984906
117,4,AdaBoost (Real),2,0.5,0.39387755102040817,0.383935851546876,6.372490406036377,0.383935851546876
118,4,Logistic Regression (Penalty = L2),2,0.5,0.42857142857142855,0.3991821171568211,0.005041360855102539,0.3991821171568211
119,4,Naive Bayes,2,0.5,0.4346938775510204,0.4457606777596283,0.002590656280517578,0.4457606777596283
120,5,KNeighbors Classifier,0,0.5,0.42276422764227645,0.35947963082269235,0.02369976043701172,0.35947963082269235
121,5,SVC Classifier,0,0.5,0.4268292682926829,1.0,0.0972280502319336,0.0
122,5,Decision Tree,0,0.5,0.4186991869918699,0.3949778639543849,0.019177913665771484,0.3949778639543849
123,5,RandomForest,0,0.5,0.45528455284552843,0.3777827362315866,0.07483983039855957,0.3777827362315866
124,5,AdaBoost (Discrete),0,0.5,0.4491869918699187,0.42615221806456866,5.031574249267578,0.42615221806456866
125,5,AdaBoost (Real),0,0.5,0.4369918699186992,0.3879271519725215,5.981829881668091,0.3879271519725215
126,5,Logistic Regression (Penalty = L2),0,0.5,0.4573170731707317,0.4398944593656853,0.003975391387939453,0.4398944593656853
127,5,Naive Bayes,0,0.5,0.45528455284552843,0.46829193862190194,0.019214868545532227,0.46829193862190194
128,5,KNeighbors Classifier,1,0.5,0.4195519348268839,0.35907092603246543,0.006957054138183594,0.35907092603246543
129,5,SVC Classifier,1,0.5,0.42769857433808556,1.0,0.1146097183227539,0.0
130,5,Decision Tree,1,0.5,0.39918533604887985,0.3597871580990072,0.018412113189697266,0.3597871580990072
131,5,RandomForest,1,0.5,0.4745417515274949,0.26340404614116725,0.0744776725769043,0.26340404614116725
132,5,AdaBoost (Discrete),1,0.5,0.4460285132382892,0.39386472627413693,5.116260528564453,0.39386472627413693
133,5,AdaBoost (Real),1,0.5,0.40325865580448067,0.38162455928431493,6.065990686416626,0.38162455928431493
134,5,Logistic Regression (Penalty = L2),1,0.5,0.4969450101832994,0.4560734026183825,0.021921873092651367,0.4560734026183825
135,5,Naive Bayes,1,0.5,0.5071283095723014,0.5232930045047104,0.0035257339477539062,0.5232930045047104
136,5,KNeighbors Classifier,2,0.5,0.41020408163265304,0.3456322849768961,0.023321866989135742,0.3456322849768961
137,5,SVC Classifier,2,0.5,0.42653061224489797,1.0,0.10042405128479004,0.0
138,5,Decision Tree,2,0.5,0.3836734693877551,0.3692472206588093,0.0027654170989990234,0.3692472206588093
139,5,RandomForest,2,0.5,0.44081632653061226,0.3589513154553171,0.09782886505126953,0.3589513154553171
140,5,AdaBoost (Discrete),2,0.5,0.45510204081632655,0.4270496665438156,4.661836624145508,0.4270496665438156
141,5,AdaBoost (Real),2,0.5,0.42653061224489797,0.41681819854509394,5.645598649978638,0.41681819854509394
142,5,Logistic Regression (Penalty = L2),2,0.5,0.43673469387755104,0.40363549965565004,0.021868467330932617,0.40363549965565004
143,5,Naive Bayes,2,0.5,0.45714285714285713,0.4684051005609241,0.0031881332397460938,0.4684051005609241
144,6,KNeighbors Classifier,0,0.5,0.4268292682926829,0.3681302969093556,0.0242459774017334,0.3681302969093556
145,6,SVC Classifier,0,0.5,0.4268292682926829,1.0,0.09874606132507324,0.0
146,6,Decision Tree,0,0.5,0.4105691056910569,0.3717307679007682,0.01899266242980957,0.3717307679007682
147,6,RandomForest,0,0.5,0.4735772357723577,0.3596568571579554,0.09392309188842773,0.3596568571579554
148,6,AdaBoost (Discrete),0,0.5,0.46747967479674796,0.4337643942958157,4.810967683792114,0.4337643942958157
149,6,AdaBoost (Real),0,0.5,0.4247967479674797,0.39681116494075425,5.897144794464111,0.39681116494075425
150,6,Logistic Regression (Penalty = L2),0,0.5,0.4634146341463415,0.4469493604754762,0.020832538604736328,0.4469493604754762
151,6,Naive Bayes,0,0.5,0.4573170731707317,0.4721406881676202,0.0034682750701904297,0.4721406881676202
152,6,KNeighbors Classifier,1,0.5,0.3869653767820774,0.3051877862449085,0.022902250289916992,0.3051877862449085
153,6,SVC Classifier,1,0.5,0.42769857433808556,1.0,0.09650015830993652,0.0
154,6,Decision Tree,1,0.5,0.40529531568228105,0.3694026277565595,0.0028374195098876953,0.3694026277565595
155,6,RandomForest,1,0.5,0.4684317718940937,0.6034448261964844,0.0737152099609375,0.0
156,6,AdaBoost (Discrete),1,0.5,0.4663951120162933,0.40606254406909786,5.019458770751953,0.40606254406909786
157,6,AdaBoost (Real),1,0.5,0.4093686354378819,0.3975472590457358,6.163860559463501,0.3975472590457358
158,6,Logistic Regression (Penalty = L2),1,0.5,0.49490835030549896,0.4635157188970618,0.021123647689819336,0.4635157188970618
159,6,Naive Bayes,1,0.5,0.4745417515274949,0.48961863617323453,0.0037360191345214844,0.48961863617323453
160,6,KNeighbors Classifier,2,0.5,0.4142857142857143,0.357237603307696,0.02062821388244629,0.357237603307696
161,6,SVC Classifier,2,0.5,0.42653061224489797,1.0,0.14915060997009277,0.0
162,6,Decision Tree,2,0.5,0.41836734693877553,0.39328414123251426,0.029727935791015625,0.39328414123251426
163,6,RandomForest,2,0.5,0.4714285714285714,0.3231261397768291,0.13491559028625488,0.3231261397768291
164,6,AdaBoost (Discrete),2,0.5,0.4346938775510204,0.4120125027984906,5.308097839355469,0.4120125027984906
165,6,AdaBoost (Real),2,0.5,0.39387755102040817,0.383935851546876,5.566144227981567,0.383935851546876
166,6,Logistic Regression (Penalty = L2),2,0.5,0.42857142857142855,0.3991821171568211,0.020981311798095703,0.3991821171568211
167,6,Naive Bayes,2,0.5,0.4346938775510204,0.4457606777596283,0.0034759044647216797,0.4457606777596283
168,7,KNeighbors Classifier,0,0.5,0.4695121951219512,0.4252385098194711,0.04094743728637695,0.4252385098194711
169,7,SVC Classifier,0,0.5,0.4268292682926829,1.0,0.09720754623413086,0.0
170,7,Decision Tree,0,0.5,0.4796747967479675,0.4314623412814912,0.018982410430908203,0.4314623412814912
171,7,RandomForest,0,0.5,0.5121951219512195,0.44480240904489815,0.0895223617553711,0.44480240904489815
172,7,AdaBoost (Discrete),0,0.5,0.5650406504065041,0.5311119190713165,5.232120752334595,0.5311119190713165
173,7,AdaBoost (Real),0,0.5,0.4715447154471545,0.41335540738546167,6.1008265018463135,0.41335540738546167
174,7,Logistic Regression (Penalty = L2),0,0.5,0.5365853658536586,0.49253978939230036,0.022491931915283203,0.49253978939230036
175,7,Naive Bayes,0,0.5,0.4695121951219512,0.48190132757036114,0.019921064376831055,0.48190132757036114
176,7,KNeighbors Classifier,1,0.5,0.4786150712830957,0.42766609300947594,0.04171180725097656,0.42766609300947594
177,7,SVC Classifier,1,0.5,0.42769857433808556,1.0,0.08980202674865723,0.0
178,7,Decision Tree,1,0.5,0.45824847250509165,0.42986238826263856,0.019433259963989258,0.42986238826263856
179,7,RandomForest,1,0.5,0.5091649694501018,0.6538830363376038,0.0803995132446289,0.0
180,7,AdaBoost (Discrete),1,0.5,0.5193482688391039,0.48956529499880946,5.21468186378479,0.48956529499880946
181,7,AdaBoost (Real),1,0.5,0.46435845213849286,0.43604427626951187,6.59358811378479,0.43604427626951187
182,7,Logistic Regression (Penalty = L2),1,0.5,0.5213849287169042,0.45321661219781156,0.02051067352294922,0.45321661219781156
183,7,Naive Bayes,1,0.5,0.4847250509164969,0.497437278930507,0.018952608108520508,0.497437278930507
184,7,KNeighbors Classifier,2,0.5,0.4816326530612245,0.4481671131770543,0.007703304290771484,0.4481671131770543
185,7,SVC Classifier,2,0.5,0.42653061224489797,1.0,0.11347293853759766,0.0
186,7,Decision Tree,2,0.5,0.4816326530612245,0.4525394017004941,0.0024499893188476562,0.4525394017004941
187,7,RandomForest,2,0.5,0.5,0.3675595727763225,0.07025313377380371,0.3675595727763225
188,7,AdaBoost (Discrete),2,0.5,0.5081632653061224,0.47209494430621357,4.512579441070557,0.47209494430621357
189,7,AdaBoost (Real),2,0.5,0.4816326530612245,0.4643475068732467,5.735589981079102,0.4643475068732467
190,7,Logistic Regression (Penalty = L2),2,0.5,0.5,0.44230037693624574,0.0038962364196777344,0.44230037693624574
191,7,Naive Bayes,2,0.5,0.4448979591836735,0.450107864189053,0.0198056697845459,0.450107864189053
192,8,KNeighbors Classifier,0,0.5,0.4695121951219512,0.4252385098194711,0.02529168128967285,0.4252385098194711
193,8,SVC Classifier,0,0.5,0.4268292682926829,1.0,0.09510684013366699,0.0
194,8,Decision Tree,0,0.5,0.4796747967479675,0.4365150111371919,0.002611398696899414,0.4365150111371919
195,8,RandomForest,0,0.5,0.5121951219512195,0.44480240904489815,0.09734892845153809,0.44480240904489815
196,8,AdaBoost (Discrete),0,0.5,0.5650406504065041,0.5311119190713165,5.048877477645874,0.5311119190713165
197,8,AdaBoost (Real),0,0.5,0.4715447154471545,0.41335540738546167,6.399305582046509,0.41335540738546167
198,8,Logistic Regression (Penalty = L2),0,0.5,0.5365853658536586,0.49253978939230036,0.02159595489501953,0.49253978939230036
199,8,Naive Bayes,0,0.5,0.4695121951219512,0.48190132757036114,0.0034384727478027344,0.48190132757036114
200,8,KNeighbors Classifier,1,0.5,0.4786150712830957,0.42766609300947594,0.025512218475341797,0.42766609300947594
201,8,SVC Classifier,1,0.5,0.42769857433808556,1.0,0.09902691841125488,0.0
202,8,Decision Tree,1,0.5,0.46028513238289204,0.4228181064450235,0.019754409790039062,0.4228181064450235
203,8,RandomForest,1,0.5,0.5091649694501018,0.6538830363376038,0.07711386680603027,0.0
204,8,AdaBoost (Discrete),1,0.5,0.5193482688391039,0.48956529499880946,5.452886343002319,0.48956529499880946
205,8,AdaBoost (Real),1,0.5,0.46435845213849286,0.43604427626951187,5.507772445678711,0.43604427626951187
206,8,Logistic Regression (Penalty = L2),1,0.5,0.5213849287169042,0.45321661219781156,0.0056803226470947266,0.45321661219781156
207,8,Naive Bayes,1,0.5,0.4847250509164969,0.497437278930507,0.002439260482788086,0.497437278930507
208,8,KNeighbors Classifier,2,0.5,0.4816326530612245,0.4481671131770543,0.04242134094238281,0.4481671131770543
209,8,SVC Classifier,2,0.5,0.42653061224489797,1.0,0.09467911720275879,0.0
210,8,Decision Tree,2,0.5,0.4714285714285714,0.4495263935966522,0.003261566162109375,0.4495263935966522
211,8,RandomForest,2,0.5,0.5,0.3675595727763225,0.08347487449645996,0.3675595727763225
212,8,AdaBoost (Discrete),2,0.5,0.5081632653061224,0.47209494430621357,4.585220813751221,0.47209494430621357
213,8,AdaBoost (Real),2,0.5,0.4816326530612245,0.4643475068732467,5.324302911758423,0.4643475068732467
214,8,Logistic Regression (Penalty = L2),2,0.5,0.5,0.44230037693624574,0.02156543731689453,0.44230037693624574
215,8,Naive Bayes,2,0.5,0.4448979591836735,0.450107864189053,0.002353191375732422,0.450107864189053
216,9,KNeighbors Classifier,0,0.5,0.4695121951219512,0.4252385098194711,0.0424041748046875,0.4252385098194711
217,9,SVC Classifier,0,0.5,0.4268292682926829,1.0,0.09567046165466309,0.0
218,9,Decision Tree,0,0.5,0.4735772357723577,0.4249126876366797,0.0030753612518310547,0.4249126876366797
219,9,RandomForest,0,0.5,0.5121951219512195,0.44480240904489815,0.07904362678527832,0.44480240904489815
220,9,AdaBoost (Discrete),0,0.5,0.5650406504065041,0.5311119190713165,4.49420428276062,0.5311119190713165
221,9,AdaBoost (Real),0,0.5,0.4715447154471545,0.41335540738546167,5.399416208267212,0.41335540738546167
222,9,Logistic Regression (Penalty = L2),0,0.5,0.5365853658536586,0.49253978939230036,0.03016042709350586,0.49253978939230036
223,9,Naive Bayes,0,0.5,0.4695121951219512,0.48190132757036114,0.003307819366455078,0.48190132757036114
224,9,KNeighbors Classifier,1,0.5,0.4786150712830957,0.42766609300947594,0.03125476837158203,0.42766609300947594
225,9,SVC Classifier,1,0.5,0.42769857433808556,1.0,0.12382078170776367,0.0
226,9,Decision Tree,1,0.5,0.46435845213849286,0.42879450481764375,0.027173757553100586,0.42879450481764375
227,9,RandomForest,1,0.5,0.5091649694501018,0.6538830363376038,0.11231017112731934,0.0
228,9,AdaBoost (Discrete),1,0.5,0.5193482688391039,0.48956529499880946,6.059045076370239,0.48956529499880946
229,9,AdaBoost (Real),1,0.5,0.46435845213849286,0.43604427626951187,5.187650203704834,0.43604427626951187
230,9,Logistic Regression (Penalty = L2),1,0.5,0.5213849287169042,0.45321661219781156,0.015109062194824219,0.45321661219781156
231,9,Naive Bayes,1,0.5,0.4847250509164969,0.497437278930507,0.01055455207824707,0.497437278930507
232,9,KNeighbors Classifier,2,0.5,0.4816326530612245,0.4481671131770543,0.03632664680480957,0.4481671131770543
233,9,SVC Classifier,2,0.5,0.42653061224489797,1.0,0.09702110290527344,0.0
234,9,Decision Tree,2,0.5,0.47551020408163264,0.44075344715470266,0.018483400344848633,0.44075344715470266
235,9,RandomForest,2,0.5,0.5,0.3675595727763225,0.06996583938598633,0.3675595727763225
236,9,AdaBoost (Discrete),2,0.5,0.5081632653061224,0.47209494430621357,4.341066360473633,0.47209494430621357
237,9,AdaBoost (Real),2,0.5,0.4816326530612245,0.4643475068732467,5.21949028968811,0.4643475068732467
238,9,Logistic Regression (Penalty = L2),2,0.5,0.5,0.44230037693624574,0.012427330017089844,0.44230037693624574
239,9,Naive Bayes,2,0.5,0.4448979591836735,0.450107864189053,0.0023674964904785156,0.450107864189053
240,10,KNeighbors Classifier,0,0.5,0.483739837398374,0.430468184898612,0.025684833526611328,0.430468184898612
241,10,SVC Classifier,0,0.5,0.4268292682926829,1.0,0.0956578254699707,0.0
242,10,Decision Tree,0,0.5,0.4735772357723577,0.42433339819104465,0.0021893978118896484,0.42433339819104465
243,10,RandomForest,0,0.5,0.5040650406504065,0.37448087830506893,0.07059764862060547,0.37448087830506893
244,10,AdaBoost (Discrete),0,0.5,0.532520325203252,0.49219207322350367,4.632261753082275,0.49219207322350367
245,10,AdaBoost (Real),0,0.5,0.48577235772357724,0.4296873871418365,10.27668309211731,0.4296873871418365
246,10,Logistic Regression (Penalty = L2),0,0.5,0.532520325203252,0.4852343614335798,0.04660463333129883,0.4852343614335798
247,10,Naive Bayes,0,0.5,0.45121951219512196,0.4622095366792033,0.04442310333251953,0.4622095366792033
248,10,KNeighbors Classifier,1,0.5,0.4663951120162933,0.42370693577229895,0.07044744491577148,0.42370693577229895
249,10,SVC Classifier,1,0.5,0.42769857433808556,1.0,0.21735644340515137,0.0
250,10,Decision Tree,1,0.5,0.4684317718940937,0.45247745094981656,0.02373528480529785,0.45247745094981656
251,10,RandomForest,1,0.5,0.48676171079429736,0.6022367272346084,0.1868438720703125,0.0
252,10,AdaBoost (Discrete),1,0.5,0.5458248472505092,0.5101590277736509,10.272061109542847,0.5101590277736509
253,10,AdaBoost (Real),1,0.5,0.48879837067209775,0.46068933326500855,11.751866817474365,0.46068933326500855
254,10,Logistic Regression (Penalty = L2),1,0.5,0.5234215885947047,0.4448650555076635,0.028908252716064453,0.4448650555076635
255,10,Naive Bayes,1,0.5,0.5193482688391039,0.5344643734663924,0.024007320404052734,0.5344643734663924
256,10,KNeighbors Classifier,2,0.5,0.4714285714285714,0.413443957439434,0.0713658332824707,0.413443957439434
257,10,SVC Classifier,2,0.5,0.42653061224489797,1.0,0.18722105026245117,0.0
258,10,Decision Tree,2,0.5,0.463265306122449,0.4386726584303751,0.023173809051513672,0.4386726584303751
259,10,RandomForest,2,0.5,0.48367346938775513,0.34398586390657204,0.1447141170501709,0.34398586390657204
260,10,AdaBoost (Discrete),2,0.5,0.5326530612244897,0.5031834270667288,9.693084955215454,0.5031834270667288
261,10,AdaBoost (Real),2,0.5,0.45510204081632655,0.43277858247909806,11.603535652160645,0.43277858247909806
262,10,Logistic Regression (Penalty = L2),2,0.5,0.4897959183673469,0.4328868583361249,0.025023698806762695,0.4328868583361249
263,10,Naive Bayes,2,0.5,0.45510204081632655,0.464056075881427,0.024050235748291016,0.464056075881427
264,11,KNeighbors Classifier,0,0.5,0.48577235772357724,0.4228854602289914,0.07286357879638672,0.4228854602289914
265,11,SVC Classifier,0,0.5,0.4268292682926829,1.0,0.2656080722808838,0.0
266,11,Decision Tree,0,0.5,0.4491869918699187,0.4139536070730205,0.0034897327423095703,0.4139536070730205
267,11,RandomForest,0,0.5,0.49390243902439024,0.35924262487992414,0.17241978645324707,0.35924262487992414
268,11,AdaBoost (Discrete),0,0.5,0.5386178861788617,0.4873420114817136,9.923094987869263,0.4873420114817136
269,11,AdaBoost (Real),0,0.5,0.48577235772357724,0.43906834990447113,12.430142879486084,0.43906834990447113
270,11,Logistic Regression (Penalty = L2),0,0.5,0.5040650406504065,0.4451639245572657,0.03441119194030762,0.4451639245572657
271,11,Naive Bayes,0,0.5,0.4491869918699187,0.4623015062177744,0.01570749282836914,0.4623015062177744
272,11,KNeighbors Classifier,1,0.5,0.45621181262729127,0.42398086068424296,0.13066911697387695,0.42398086068424296
273,11,SVC Classifier,1,0.5,0.42769857433808556,1.0,0.21305131912231445,0.0
274,11,Decision Tree,1,0.5,0.42362525458248473,0.4107416325713575,0.025048255920410156,0.4107416325713575
275,11,RandomForest,1,0.5,0.5030549898167006,0.5988317290991773,0.17902612686157227,0.0
276,11,AdaBoost (Discrete),1,0.5,0.5417515274949084,0.5145172609061862,15.817627668380737,0.5145172609061862
277,11,AdaBoost (Real),1,0.5,0.5091649694501018,0.470965463715331,18.41721224784851,0.470965463715331
278,11,Logistic Regression (Penalty = L2),1,0.5,0.5234215885947047,0.4704947408915208,0.07981681823730469,0.4704947408915208
279,11,Naive Bayes,1,0.5,0.4847250509164969,0.5006527422555169,0.03986978530883789,0.5006527422555169
280,11,KNeighbors Classifier,2,0.5,0.42857142857142855,0.37856415312782427,0.15891313552856445,0.37856415312782427
281,11,SVC Classifier,2,0.5,0.42653061224489797,1.0,0.4366941452026367,0.0
282,11,Decision Tree,2,0.5,0.45918367346938777,0.43299508005521764,0.03841233253479004,0.43299508005521764
283,11,RandomForest,2,0.5,0.5020408163265306,0.3574494095402627,0.24991416931152344,0.3574494095402627
284,11,AdaBoost (Discrete),2,0.5,0.5265306122448979,0.4988211239878325,16.294365167617798,0.4988211239878325
285,11,AdaBoost (Real),2,0.5,0.48367346938775513,0.4698035348230519,19.475260257720947,0.4698035348230519
286,11,Logistic Regression (Penalty = L2),2,0.5,0.5163265306122449,0.4603473901017494,0.0744626522064209,0.4603473901017494
287,11,Naive Bayes,2,0.5,0.4673469387755102,0.48011697645390805,0.03575539588928223,0.48011697645390805
288,12,KNeighbors Classifier,0,0.5,0.4268292682926829,0.3681302969093556,0.06769037246704102,0.3681302969093556
289,12,SVC Classifier,0,0.5,0.4268292682926829,1.0,0.31534552574157715,0.0
290,12,Decision Tree,0,0.5,0.4146341463414634,0.37662252318795897,0.03860282897949219,0.37662252318795897
291,12,RandomForest,0,0.5,0.4735772357723577,0.3596568571579554,0.2819235324859619,0.3596568571579554
292,12,AdaBoost (Discrete),0,0.5,0.46747967479674796,0.4337643942958157,15.230652809143066,0.4337643942958157
293,12,AdaBoost (Real),0,0.5,0.4268292682926829,0.3979782633231662,17.978968143463135,0.3979782633231662
294,12,Logistic Regression (Penalty = L2),0,0.5,0.4634146341463415,0.4469493604754762,0.003232240676879883,0.4469493604754762
295,12,Naive Bayes,0,0.5,0.4573170731707317,0.4721406881676202,0.03960466384887695,0.4721406881676202
296,12,KNeighbors Classifier,1,0.5,0.3869653767820774,0.3051877862449085,0.07776832580566406,0.3051877862449085
297,12,SVC Classifier,1,0.5,0.42769857433808556,1.0,0.2696375846862793,0.0
298,12,Decision Tree,1,0.5,0.4073319755600815,0.3721001291121708,0.0027649402618408203,0.3721001291121708
299,12,RandomForest,1,0.5,0.4684317718940937,0.6034448261964844,0.2806229591369629,0.0
300,12,AdaBoost (Discrete),1,0.5,0.4663951120162933,0.40606254406909786,15.235267639160156,0.40606254406909786
301,12,AdaBoost (Real),1,0.5,0.4093686354378819,0.3975472590457358,19.827626705169678,0.3975472590457358
302,12,Logistic Regression (Penalty = L2),1,0.5,0.49490835030549896,0.4635157188970618,0.04363083839416504,0.4635157188970618
303,12,Naive Bayes,1,0.5,0.4745417515274949,0.48961863617323453,0.039104461669921875,0.48961863617323453
304,12,KNeighbors Classifier,2,0.5,0.4142857142857143,0.357237603307696,0.09313845634460449,0.357237603307696
305,12,SVC Classifier,2,0.5,0.42653061224489797,1.0,0.27953290939331055,0.0
306,12,Decision Tree,2,0.5,0.4204081632653061,0.3988285455660053,0.03511476516723633,0.3988285455660053
307,12,RandomForest,2,0.5,0.4714285714285714,0.3231261397768291,0.3257334232330322,0.3231261397768291
308,12,AdaBoost (Discrete),2,0.5,0.4346938775510204,0.4120125027984906,15.369726657867432,0.4120125027984906
309,12,AdaBoost (Real),2,0.5,0.39387755102040817,0.383935851546876,19.85935640335083,0.383935851546876
310,12,Logistic Regression (Penalty = L2),2,0.5,0.42857142857142855,0.3991821171568211,0.03945755958557129,0.3991821171568211
311,12,Naive Bayes,2,0.5,0.4346938775510204,0.4457606777596283,0.03955674171447754,0.4457606777596283
