,feat_set_id,classifier,fold_id,feat_th,score,geo_score,exec_t,geo_score_woz
0,0,KNeighbors Classifier,0,0.45,0.9522388059701492,0.9519101091165171,6.059387922286987,0.9519101091165171
1,0,SVC Classifier,0,0.45,0.9194029850746268,0.9184152692664478,6.3619935512542725,0.9184152692664478
2,0,Decision Tree,0,0.45,0.8194029850746268,0.81291081218658,0.38177037239074707,0.81291081218658
3,0,RandomForest,0,0.45,0.591044776119403,0.700691469777744,1.0265321731567383,0.0
4,0,AdaBoost (Discrete),0,0.45,0.9283582089552239,0.9269669421802194,232.35557389259338,0.9269669421802194
5,0,AdaBoost (Real),0,0.45,0.5417910447761194,0.46850809277297095,225.10037636756897,0.46850809277297095
6,0,Logistic Regression (Penalty = L2),0,0.45,0.9656716417910448,0.9652949075830556,6.289549350738525,0.9652949075830556
7,0,Naive Bayes,0,0.45,0.8835820895522388,0.8820684531018976,0.48191070556640625,0.8820684531018976
8,0,KNeighbors Classifier,1,0.45,0.9462686567164179,0.945863090629107,6.25713849067688,0.945863090629107
9,0,SVC Classifier,1,0.45,0.9223880597014925,0.9218781485553931,5.609188795089722,0.9218781485553931
10,0,Decision Tree,1,0.45,0.844776119402985,0.8425424849315968,0.2354145050048828,0.8425424849315968
11,0,RandomForest,1,0.45,0.655223880597015,0.5077450277057382,0.8890283107757568,0.5077450277057382
12,0,AdaBoost (Discrete),1,0.45,0.9194029850746268,0.9183239053718155,210.383882522583,0.9183239053718155
13,0,AdaBoost (Real),1,0.45,0.746268656716418,0.6938524720815237,219.87772631645203,0.6938524720815237
14,0,Logistic Regression (Penalty = L2),1,0.45,0.9611940298507463,0.961027555833266,6.501195907592773,0.961027555833266
15,0,Naive Bayes,1,0.45,0.8955223880597015,0.894149920628285,0.5036025047302246,0.894149920628285
16,0,KNeighbors Classifier,2,0.45,0.956060606060606,0.9557155571915212,6.821048021316528,0.9557155571915212
17,0,SVC Classifier,2,0.45,0.9196969696969697,0.9188557041987823,6.939881801605225,0.9188557041987823
18,0,Decision Tree,2,0.45,0.8424242424242424,0.8407397309439837,0.30412817001342773,0.8407397309439837
19,0,RandomForest,2,0.45,0.6303030303030303,0.6468576051088393,1.15464186668396,0.0
20,0,AdaBoost (Discrete),2,0.45,0.9287878787878788,0.9272419507165541,236.9050257205963,0.9272419507165541
21,0,AdaBoost (Real),2,0.45,0.7909090909090909,0.7741620347549841,212.1096374988556,0.7741620347549841
22,0,Logistic Regression (Penalty = L2),2,0.45,0.9727272727272728,0.972542958839484,6.181785583496094,0.972542958839484
23,0,Naive Bayes,2,0.45,0.8878787878787879,0.886764492779074,0.45025134086608887,0.886764492779074
24,1,KNeighbors Classifier,0,0.45,0.9626865671641791,0.9623100162148691,6.980687379837036,0.9623100162148691
25,1,SVC Classifier,0,0.45,0.8970149253731343,0.8919466718306217,6.6679229736328125,0.8919466718306217
26,1,Decision Tree,0,0.45,0.8253731343283582,0.8218543672720993,0.2452993392944336,0.8218543672720993
27,1,RandomForest,0,0.45,0.6134328358208955,0.6191156085346141,1.0032811164855957,0.0
28,1,AdaBoost (Discrete),0,0.45,0.9402985074626866,0.9394227320718901,264.2795958518982,0.9394227320718901
29,1,AdaBoost (Real),0,0.45,0.8328358208955224,0.8178150988504346,238.5588321685791,0.8178150988504346
30,1,Logistic Regression (Penalty = L2),0,0.45,0.982089552238806,0.9818648567275667,5.360090970993042,0.9818648567275667
31,1,Naive Bayes,0,0.45,0.8805970149253731,0.8767785402790587,0.337308406829834,0.8767785402790587
32,1,KNeighbors Classifier,1,0.45,0.9417910447761194,0.941274874525549,6.00071382522583,0.941274874525549
33,1,SVC Classifier,1,0.45,0.9104477611940298,0.9085282967967682,6.586823463439941,0.9085282967967682
34,1,Decision Tree,1,0.45,0.8208955223880597,0.818148202970731,0.17083358764648438,0.818148202970731
35,1,RandomForest,1,0.45,0.6447761194029851,0.6935724075478885,0.9496133327484131,0.0
36,1,AdaBoost (Discrete),1,0.45,0.9298507462686567,0.9293518360925637,272.9466450214386,0.9293518360925637
37,1,AdaBoost (Real),1,0.45,0.44029850746268656,0.27557414223548354,259.4447546005249,0.0
38,1,Logistic Regression (Penalty = L2),1,0.45,0.9746268656716418,0.9745344490092189,5.293043375015259,0.9745344490092189
39,1,Naive Bayes,1,0.45,0.9029850746268657,0.9017612316953243,0.4124271869659424,0.9017612316953243
40,1,KNeighbors Classifier,2,0.45,0.956060606060606,0.9555427386113606,6.4433677196502686,0.9555427386113606
41,1,SVC Classifier,2,0.45,0.9121212121212121,0.9099930220431138,6.377718210220337,0.9099930220431138
42,1,Decision Tree,2,0.45,0.8287878787878787,0.8251135098772424,0.34519338607788086,0.8251135098772424
43,1,RandomForest,2,0.45,0.6348484848484849,0.5073329626124513,0.9520690441131592,0.5073329626124513
44,1,AdaBoost (Discrete),2,0.45,0.9106060606060606,0.9096767276129514,252.2444133758545,0.9096767276129514
45,1,AdaBoost (Real),2,0.45,0.8151515151515152,0.811676828334156,238.91534638404846,0.811676828334156
46,1,Logistic Regression (Penalty = L2),2,0.45,0.9727272727272728,0.972422641403049,4.754767656326294,0.972422641403049
47,1,Naive Bayes,2,0.45,0.8893939393939394,0.8879094594430751,0.29224729537963867,0.8879094594430751
48,2,KNeighbors Classifier,0,0.45,0.9582089552238806,0.9579035169255619,5.73874568939209,0.9579035169255619
49,2,SVC Classifier,0,0.45,0.9283582089552239,0.9270931401629343,5.300073862075806,0.9270931401629343
50,2,Decision Tree,0,0.45,0.8567164179104477,0.8533583937889814,0.21654963493347168,0.8533583937889814
51,2,RandomForest,0,0.45,0.7074626865671642,0.6051938788225479,0.7941305637359619,0.6051938788225479
52,2,AdaBoost (Discrete),0,0.45,0.9462686567164179,0.9455297322174733,217.5103828907013,0.9455297322174733
53,2,AdaBoost (Real),0,0.45,0.8970149253731343,0.8951617186279764,191.3112142086029,0.8951617186279764
54,2,Logistic Regression (Penalty = L2),0,0.45,0.9761194029850746,0.9759086025540082,4.581265211105347,0.9759086025540082
55,2,Naive Bayes,0,0.45,0.9104477611940298,0.9088099840317383,0.39483213424682617,0.9088099840317383
56,2,KNeighbors Classifier,1,0.45,0.9552238805970149,0.9549604194416067,5.777894020080566,0.9549604194416067
57,2,SVC Classifier,1,0.45,0.9447761194029851,0.9442274042755687,5.292854309082031,0.9442274042755687
58,2,Decision Tree,1,0.45,0.8537313432835821,0.850653461404651,0.22809624671936035,0.850653461404651
59,2,RandomForest,1,0.45,0.6313432835820896,0.5312751434632662,0.8619594573974609,0.5312751434632662
60,2,AdaBoost (Discrete),1,0.45,0.9328358208955224,0.9322601713767343,212.47567439079285,0.9322601713767343
61,2,AdaBoost (Real),1,0.45,0.2865671641791045,0.27644813695108467,195.8722472190857,0.0
62,2,Logistic Regression (Penalty = L2),1,0.45,0.9671641791044776,0.9669366654309471,4.060452461242676,0.9669366654309471
63,2,Naive Bayes,1,0.45,0.9298507462686567,0.9290866585984989,0.36153459548950195,0.9290866585984989
64,2,KNeighbors Classifier,2,0.45,0.9621212121212122,0.9615105231472738,5.574848890304565,0.9615105231472738
65,2,SVC Classifier,2,0.45,0.9454545454545454,0.9449298731470553,5.02933406829834,0.9449298731470553
66,2,Decision Tree,2,0.45,0.8575757575757575,0.8564759700721671,0.20435094833374023,0.8564759700721671
67,2,RandomForest,2,0.45,0.7212121212121212,0.6743840787743348,0.7522337436676025,0.6743840787743348
68,2,AdaBoost (Discrete),2,0.45,0.943939393939394,0.9432073374488712,197.74270701408386,0.9432073374488712
69,2,AdaBoost (Real),2,0.45,0.6060606060606061,0.5071592651219132,179.4488866329193,0.5071592651219132
70,2,Logistic Regression (Penalty = L2),2,0.45,0.9742424242424242,0.9740757608466152,3.977264404296875,0.9740757608466152
71,2,Naive Bayes,2,0.45,0.9227272727272727,0.9219281237989052,0.3201315402984619,0.9219281237989052
72,3,KNeighbors Classifier,0,0.45,0.9238805970149254,0.9224895976745768,1.6155753135681152,0.9224895976745768
73,3,SVC Classifier,0,0.45,0.7791044776119403,0.6889851339185491,3.180868148803711,0.6889851339185491
74,3,Decision Tree,0,0.45,0.7835820895522388,0.7787546306299789,0.1201779842376709,0.7787546306299789
75,3,RandomForest,0,0.45,0.5865671641791045,0.47862867188642777,0.576357364654541,0.47862867188642777
76,3,AdaBoost (Discrete),0,0.45,0.8656716417910447,0.8455205175001824,100.65580749511719,0.8455205175001824
77,3,AdaBoost (Real),0,0.45,0.844776119402985,0.8413095176571757,101.68557620048523,0.8413095176571757
78,3,Logistic Regression (Penalty = L2),0,0.45,0.9522388059701492,0.9514422538743283,2.0999362468719482,0.9514422538743283
79,3,Naive Bayes,0,0.45,0.8059701492537313,0.7926982626798832,0.1948075294494629,0.7926982626798832
80,3,KNeighbors Classifier,1,0.45,0.9238805970149254,0.922784403884034,1.6790189743041992,0.922784403884034
81,3,SVC Classifier,1,0.45,0.8253731343283582,0.7854366558285282,2.80915904045105,0.7854366558285282
82,3,Decision Tree,1,0.45,0.8044776119402985,0.7997844833252399,0.12035560607910156,0.7997844833252399
83,3,RandomForest,1,0.45,0.6522388059701493,0.4660524304131688,0.540132999420166,0.4660524304131688
84,3,AdaBoost (Discrete),1,0.45,0.8895522388059701,0.8869912580187083,92.80639982223511,0.8869912580187083
85,3,AdaBoost (Real),1,0.45,0.6164179104477612,0.5495791723685173,93.528737783432,0.5495791723685173
86,3,Logistic Regression (Penalty = L2),1,0.45,0.9597014925373134,0.9594230076003143,1.7946257591247559,0.9594230076003143
87,3,Naive Bayes,1,0.45,0.8402985074626865,0.8364827247523177,0.21493816375732422,0.8364827247523177
88,3,KNeighbors Classifier,2,0.45,0.9166666666666666,0.9158064323000713,1.2485945224761963,0.9158064323000713
89,3,SVC Classifier,2,0.45,0.796969696969697,0.7274387206176081,2.867088794708252,0.7274387206176081
90,3,Decision Tree,2,0.45,0.8015151515151515,0.7995615985825516,0.10728263854980469,0.7995615985825516
91,3,RandomForest,2,0.45,0.6530303030303031,0.47923381560393175,0.5020942687988281,0.47923381560393175
92,3,AdaBoost (Discrete),2,0.45,0.8833333333333333,0.8797325638154072,86.96217894554138,0.8797325638154072
93,3,AdaBoost (Real),2,0.45,0.793939393939394,0.7858277540732836,89.73917579650879,0.7858277540732836
94,3,Logistic Regression (Penalty = L2),2,0.45,0.9712121212121212,0.9709099970298978,1.8818707466125488,0.9709099970298978
95,3,Naive Bayes,2,0.45,0.8287878787878787,0.8177770182365668,0.21037721633911133,0.8177770182365668
96,4,KNeighbors Classifier,0,0.45,0.9537313432835821,0.9531740685311799,2.3512086868286133,0.9531740685311799
97,4,SVC Classifier,0,0.45,0.8880597014925373,0.8843056000167915,3.2291436195373535,0.8843056000167915
98,4,Decision Tree,0,0.45,0.8432835820895522,0.8398505997144486,0.11905026435852051,0.8398505997144486
99,4,RandomForest,0,0.45,0.5835820895522388,0.5332565416367793,0.546147346496582,0.0
100,4,AdaBoost (Discrete),0,0.45,0.9313432835820895,0.9296668124829433,99.5962061882019,0.9296668124829433
101,4,AdaBoost (Real),0,0.45,0.8626865671641791,0.8570194333790153,102.86782956123352,0.8570194333790153
102,4,Logistic Regression (Penalty = L2),0,0.45,0.9597014925373134,0.9589198239946637,2.8425865173339844,0.9589198239946637
103,4,Naive Bayes,0,0.45,0.8850746268656716,0.8825143009237498,0.1932663917541504,0.8825143009237498
104,4,KNeighbors Classifier,1,0.45,0.9522388059701492,0.9518199490313143,2.6222305297851562,0.9518199490313143
105,4,SVC Classifier,1,0.45,0.908955223880597,0.9059768338167615,2.7194154262542725,0.9059768338167615
106,4,Decision Tree,1,0.45,0.8104477611940298,0.8090504098148383,0.030433177947998047,0.8090504098148383
107,4,RandomForest,1,0.45,0.582089552238806,0.3973590774269512,0.08700966835021973,0.3973590774269512
108,4,AdaBoost (Discrete),1,0.45,0.9223880597014925,0.9218624525447898,96.30536437034607,0.9218624525447898
109,4,AdaBoost (Real),1,0.45,0.6597014925373135,0.6101213741466905,98.90695977210999,0.6101213741466905
110,4,Logistic Regression (Penalty = L2),1,0.45,0.9626865671641791,0.9623996292442434,2.1736884117126465,0.9623996292442434
111,4,Naive Bayes,1,0.45,0.8985074626865671,0.8964835318468815,0.20841431617736816,0.8964835318468815
112,4,KNeighbors Classifier,2,0.45,0.953030303030303,0.9526031341349077,2.231853485107422,0.9526031341349077
113,4,SVC Classifier,2,0.45,0.906060606060606,0.9044441674353435,2.9414877891540527,0.9044441674353435
114,4,Decision Tree,2,0.45,0.8318181818181818,0.8300224588932846,0.08164763450622559,0.8300224588932846
115,4,RandomForest,2,0.45,0.7,0.5770994720431414,0.601738691329956,0.5770994720431414
116,4,AdaBoost (Discrete),2,0.45,0.9303030303030303,0.9295170249456688,95.13891553878784,0.9295170249456688
117,4,AdaBoost (Real),2,0.45,0.5121212121212121,0.40029567765238827,93.89850187301636,0.0
118,4,Logistic Regression (Penalty = L2),2,0.45,0.9666666666666667,0.9663619857944711,2.069875955581665,0.9663619857944711
119,4,Naive Bayes,2,0.45,0.9,0.8985537832098394,0.21765947341918945,0.8985537832098394
120,5,KNeighbors Classifier,0,0.45,0.9507462686567164,0.9494836662677567,1.871171236038208,0.9494836662677567
121,5,SVC Classifier,0,0.45,0.8373134328358209,0.8157780837355544,2.5918326377868652,0.8157780837355544
122,5,Decision Tree,0,0.45,0.844776119402985,0.8410369766136064,0.14269065856933594,0.8410369766136064
123,5,RandomForest,0,0.45,0.5582089552238806,0.567376126157167,0.5396604537963867,0.0
124,5,AdaBoost (Discrete),0,0.45,0.9328358208955224,0.9321503034022299,90.98902440071106,0.9321503034022299
125,5,AdaBoost (Real),0,0.45,0.6537313432835821,0.5877491016139029,94.54756712913513,0.5877491016139029
126,5,Logistic Regression (Penalty = L2),0,0.45,0.9761194029850746,0.9757863787151225,1.8220939636230469,0.9757863787151225
127,5,Naive Bayes,0,0.45,0.8776119402985074,0.8745320234217141,0.20315289497375488,0.8745320234217141
128,5,KNeighbors Classifier,1,0.45,0.9507462686567164,0.9503163598886698,1.6114072799682617,0.9503163598886698
129,5,SVC Classifier,1,0.45,0.8761194029850746,0.8679753125592748,2.4835736751556396,0.8679753125592748
130,5,Decision Tree,1,0.45,0.8313432835820895,0.8298698099792505,0.11229252815246582,0.8298698099792505
131,5,RandomForest,1,0.45,0.5298507462686567,0.3752051157255706,0.40140271186828613,0.3752051157255706
132,5,AdaBoost (Discrete),1,0.45,0.9134328358208955,0.9122289783889055,88.16751956939697,0.9122289783889055
133,5,AdaBoost (Real),1,0.45,0.6432835820895523,0.5677605877599856,87.5242190361023,0.5677605877599856
134,5,Logistic Regression (Penalty = L2),1,0.45,0.9597014925373134,0.9594171431733736,1.6977033615112305,0.9594171431733736
135,5,Naive Bayes,1,0.45,0.9059701492537313,0.9046591258910958,0.17333769798278809,0.9046591258910958
136,5,KNeighbors Classifier,2,0.45,0.946969696969697,0.9461327594601739,1.7806732654571533,0.9461327594601739
137,5,SVC Classifier,2,0.45,0.8515151515151516,0.8406474173589735,2.3575403690338135,0.8406474173589735
138,5,Decision Tree,2,0.45,0.8196969696969697,0.8168611970157763,0.10823512077331543,0.8168611970157763
139,5,RandomForest,2,0.45,0.5333333333333333,0.4387031420009153,0.43047523498535156,0.0
140,5,AdaBoost (Discrete),2,0.45,0.9227272727272727,0.9220050852033002,85.6306893825531,0.9220050852033002
141,5,AdaBoost (Real),2,0.45,0.7712121212121212,0.7597205343843983,81.9284029006958,0.7597205343843983
142,5,Logistic Regression (Penalty = L2),2,0.45,0.9636363636363636,0.9632235520989887,1.4463186264038086,0.9632235520989887
143,5,Naive Bayes,2,0.45,0.896969696969697,0.8962133690521731,0.16888928413391113,0.8962133690521731
144,6,KNeighbors Classifier,0,0.45,0.9671641791044776,0.9667651466874515,3.012054443359375,0.9667651466874515
145,6,SVC Classifier,0,0.45,0.9164179104477612,0.9149562924526756,2.769585371017456,0.9149562924526756
146,6,Decision Tree,0,0.45,0.8462686567164179,0.8415810699771555,0.14934611320495605,0.8415810699771555
147,6,RandomForest,0,0.45,0.591044776119403,0.412191155614347,0.4413113594055176,0.412191155614347
148,6,AdaBoost (Discrete),0,0.45,0.9492537313432836,0.9485643072855285,113.40395283699036,0.9485643072855285
149,6,AdaBoost (Real),0,0.45,0.8731343283582089,0.8721323172237017,112.64206409454346,0.8721323172237017
150,6,Logistic Regression (Penalty = L2),0,0.45,0.9731343283582089,0.9727697708492415,3.0873734951019287,0.9727697708492415
151,6,Naive Bayes,0,0.45,0.8985074626865671,0.8963630929067582,0.22601556777954102,0.8963630929067582
152,6,KNeighbors Classifier,1,0.45,0.9567164179104478,0.9564488958784256,3.0434207916259766,0.9564488958784256
153,6,SVC Classifier,1,0.45,0.9313432835820895,0.9304939098526118,2.884697198867798,0.9304939098526118
154,6,Decision Tree,1,0.45,0.808955223880597,0.804985640891273,0.1244347095489502,0.804985640891273
155,6,RandomForest,1,0.45,0.6029850746268657,0.5961009955166339,0.4346597194671631,0.0
156,6,AdaBoost (Discrete),1,0.45,0.9313432835820895,0.9303916397544708,110.7782552242279,0.9303916397544708
157,6,AdaBoost (Real),1,0.45,0.6701492537313433,0.5718631318355467,99.68562817573547,0.5718631318355467
158,6,Logistic Regression (Penalty = L2),1,0.45,0.9656716417910448,0.9654629982006738,2.4447200298309326,0.9654629982006738
159,6,Naive Bayes,1,0.45,0.9223880597014925,0.9215940559726437,0.19930267333984375,0.9215940559726437
160,6,KNeighbors Classifier,2,0.45,0.9484848484848485,0.9478917284546775,2.931915283203125,0.9478917284546775
161,6,SVC Classifier,2,0.45,0.9242424242424242,0.9227171243811086,2.8307578563690186,0.9227171243811086
162,6,Decision Tree,2,0.45,0.853030303030303,0.8514476205662075,0.08255267143249512,0.8514476205662075
163,6,RandomForest,2,0.45,0.553030303030303,0.3895813067530382,0.45258116722106934,0.0
164,6,AdaBoost (Discrete),2,0.45,0.9166666666666666,0.9157069399623785,107.74898886680603,0.9157069399623785
165,6,AdaBoost (Real),2,0.45,0.6257575757575757,0.5444664610589661,94.85156655311584,0.5444664610589661
166,6,Logistic Regression (Penalty = L2),2,0.45,0.9742424242424242,0.9740289201464911,2.425758123397827,0.9740289201464911
167,6,Naive Bayes,2,0.45,0.9166666666666666,0.9157626761369616,0.1818552017211914,0.9157626761369616
168,7,KNeighbors Classifier,0,0.45,0.9671641791044776,0.9668207194279973,5.3318727016448975,0.9668207194279973
169,7,SVC Classifier,0,0.45,0.9522388059701492,0.9515024400375491,3.666468620300293,0.9515024400375491
170,7,Decision Tree,0,0.45,0.835820895522388,0.8313687710239072,0.14034223556518555,0.8313687710239072
171,7,RandomForest,0,0.45,0.7402985074626866,0.6889435584666448,0.4780755043029785,0.6889435584666448
172,7,AdaBoost (Discrete),0,0.45,0.9522388059701492,0.9517053174665533,156.8951964378357,0.9517053174665533
173,7,AdaBoost (Real),0,0.45,0.8716417910447761,0.8699124131789456,133.66505193710327,0.8699124131789456
174,7,Logistic Regression (Penalty = L2),0,0.45,0.9791044776119403,0.9789633360830158,3.2803146839141846,0.9789633360830158
175,7,Naive Bayes,0,0.45,0.917910447761194,0.9166482737265141,0.31875133514404297,0.9166482737265141
176,7,KNeighbors Classifier,1,0.45,0.9492537313432836,0.9487031276460168,4.523109197616577,0.9487031276460168
177,7,SVC Classifier,1,0.45,0.9462686567164179,0.9458407708612027,3.1949963569641113,0.9458407708612027
178,7,Decision Tree,1,0.45,0.8537313432835821,0.8501512913117201,0.12672114372253418,0.8501512913117201
179,7,RandomForest,1,0.45,0.7686567164179104,0.7429506373726146,0.3538186550140381,0.7429506373726146
180,7,AdaBoost (Discrete),1,0.45,0.9417910447761194,0.941638076236213,149.971435546875,0.941638076236213
181,7,AdaBoost (Real),1,0.45,0.282089552238806,0.23537415985096913,131.1965572834015,0.0
182,7,Logistic Regression (Penalty = L2),1,0.45,0.9686567164179104,0.9685086833234903,2.8732550144195557,0.9685086833234903
183,7,Naive Bayes,1,0.45,0.9298507462686567,0.9292373831258615,0.23942947387695312,0.9292373831258615
184,7,KNeighbors Classifier,2,0.45,0.9651515151515152,0.9648170099674166,3.9936037063598633,0.9648170099674166
185,7,SVC Classifier,2,0.45,0.95,0.9497087918440698,2.608609914779663,0.9497087918440698
186,7,Decision Tree,2,0.45,0.8454545454545455,0.8418438138514456,0.11105465888977051,0.8418438138514456
187,7,RandomForest,2,0.45,0.753030303030303,0.7165630966862203,0.2875666618347168,0.7165630966862203
188,7,AdaBoost (Discrete),2,0.45,0.9393939393939394,0.9388314656886961,124.96768140792847,0.9388314656886961
189,7,AdaBoost (Real),2,0.45,0.6515151515151515,0.5896022959351267,120.89913177490234,0.5896022959351267
190,7,Logistic Regression (Penalty = L2),2,0.45,0.9727272727272728,0.972542958839484,2.5137317180633545,0.972542958839484
191,7,Naive Bayes,2,0.45,0.9181818181818182,0.9174684672247806,0.20785951614379883,0.9174684672247806
192,8,KNeighbors Classifier,0,0.45,0.9164179104477612,0.9141445416193869,0.3719503879547119,0.9141445416193869
193,8,SVC Classifier,0,0.45,0.7701492537313432,0.6484735237448656,0.9232816696166992,0.6484735237448656
194,8,Decision Tree,0,0.45,0.8029850746268656,0.798976324618311,0.030102014541625977,0.798976324618311
195,8,RandomForest,0,0.45,0.6298507462686567,0.5411595204750546,0.217329740524292,0.5411595204750546
196,8,AdaBoost (Discrete),0,0.45,0.8641791044776119,0.8494161024085152,30.438029766082764,0.8494161024085152
197,8,AdaBoost (Real),0,0.45,0.6283582089552239,0.5813749231382656,32.74563145637512,0.5813749231382656
198,8,Logistic Regression (Penalty = L2),0,0.45,0.9477611940298507,0.9470863290405908,0.5920279026031494,0.9470863290405908
199,8,Naive Bayes,0,0.45,0.8074626865671641,0.790171324243246,0.09261012077331543,0.790171324243246
200,8,KNeighbors Classifier,1,0.45,0.9298507462686567,0.928904183950647,0.41887927055358887,0.928904183950647
201,8,SVC Classifier,1,0.45,0.8,0.7492761865039969,0.9310076236724854,0.7492761865039969
202,8,Decision Tree,1,0.45,0.7880597014925373,0.7843231546279841,0.05331921577453613,0.7843231546279841
203,8,RandomForest,1,0.45,0.6597014925373135,0.558149331843809,0.21818065643310547,0.558149331843809
204,8,AdaBoost (Discrete),1,0.45,0.8417910447761194,0.8274939684431653,30.340622663497925,0.8274939684431653
205,8,AdaBoost (Real),1,0.45,0.5656716417910448,0.6021126456352968,34.70441913604736,0.0
206,8,Logistic Regression (Penalty = L2),1,0.45,0.9492537313432836,0.9488695420152196,0.7961337566375732,0.9488695420152196
207,8,Naive Bayes,1,0.45,0.844776119402985,0.8423790882596592,0.12396621704101562,0.8423790882596592
208,8,KNeighbors Classifier,2,0.45,0.906060606060606,0.9049802477835241,0.5826108455657959,0.9049802477835241
209,8,SVC Classifier,2,0.45,0.7803030303030303,0.7006526786658508,1.0931689739227295,0.7006526786658508
210,8,Decision Tree,2,0.45,0.7893939393939394,0.7866272195908934,0.06029629707336426,0.7866272195908934
211,8,RandomForest,2,0.45,0.6015151515151516,0.4377586395725201,0.3232111930847168,0.4377586395725201
212,8,AdaBoost (Discrete),2,0.45,0.8515151515151516,0.836208561314282,26.21258783340454,0.836208561314282
213,8,AdaBoost (Real),2,0.45,0.48787878787878786,0.40820763564436074,31.116410732269287,0.0
214,8,Logistic Regression (Penalty = L2),2,0.45,0.9575757575757575,0.9573378820082625,0.573434591293335,0.9573378820082625
215,8,Naive Bayes,2,0.45,0.8348484848484848,0.82837540569142,0.06394529342651367,0.82837540569142
