,feat_set_id,classifier,fold_id,feat_th,score,geo_score,exec_t,geo_score_woz
0,0,KNeighbors Classifier,0,0.25,0.7709832134292566,0.7702535384362924,0.36316967010498047,0.7702535384362924
1,0,SVC Classifier,0,0.25,0.7715827338129496,0.7418439567869055,2.5882856845855713,0.7418439567869055
2,0,Decision Tree,0,0.25,0.7350119904076738,0.7333543683863551,0.10912370681762695,0.7333543683863551
3,0,RandomForest,0,0.25,0.7062350119904077,0.6650309340616196,0.3636515140533447,0.6650309340616196
4,0,AdaBoost (Discrete),0,0.25,0.7428057553956835,0.7426402272902731,29.231537103652954,0.7426402272902731
5,0,AdaBoost (Real),0,0.25,0.7302158273381295,0.7271044141101365,32.873427867889404,0.7271044141101365
6,0,Logistic Regression (Penalty = L2),0,0.25,0.8063549160671463,0.8046463828783527,0.2340083122253418,0.8046463828783527
7,0,Naive Bayes,0,0.25,0.761990407673861,0.7229850946894301,0.06717586517333984,0.7229850946894301
8,0,KNeighbors Classifier,1,0.25,0.7557022809123649,0.7540224796080794,0.43468785285949707,0.7540224796080794
9,0,SVC Classifier,1,0.25,0.758703481392557,0.725556202241413,2.5936052799224854,0.725556202241413
10,0,Decision Tree,1,0.25,0.7112845138055222,0.7111681231732162,0.08435630798339844,0.7111681231732162
11,0,RandomForest,1,0.25,0.7220888355342137,0.6867652874588883,0.32801246643066406,0.6867652874588883
12,0,AdaBoost (Discrete),1,0.25,0.7154861944777912,0.7079077983723415,38.99112796783447,0.7079077983723415
13,0,AdaBoost (Real),1,0.25,0.7418967587034814,0.7411740510494539,51.85248613357544,0.7411740510494539
14,0,Logistic Regression (Penalty = L2),1,0.25,0.7827130852340937,0.7810942736970503,0.3037879467010498,0.7810942736970503
15,0,Naive Bayes,1,0.25,0.7472989195678271,0.7119227305102418,0.08661365509033203,0.7119227305102418
16,0,KNeighbors Classifier,2,0.25,0.7454981992797118,0.7424560265810722,0.38265252113342285,0.7424560265810722
17,0,SVC Classifier,2,0.25,0.7707082833133253,0.7386121055284787,3.2842769622802734,0.7386121055284787
18,0,Decision Tree,2,0.25,0.6890756302521008,0.6881004428914184,0.08214306831359863,0.6881004428914184
19,0,RandomForest,2,0.25,0.7190876350540216,0.6735669175940266,0.43352341651916504,0.6735669175940266
20,0,AdaBoost (Discrete),2,0.25,0.7382953181272509,0.7309674158442601,40.60423707962036,0.7309674158442601
21,0,AdaBoost (Real),2,0.25,0.7394957983193278,0.7387436741973051,51.52118372917175,0.7387436741973051
22,0,Logistic Regression (Penalty = L2),2,0.25,0.8085234093637454,0.8050741980418377,0.4097306728363037,0.8050741980418377
23,0,Naive Bayes,2,0.25,0.7575030012004802,0.7184717141321616,0.040590524673461914,0.7184717141321616
24,1,KNeighbors Classifier,0,0.25,0.7583932853717026,0.7567291496473287,0.5888702869415283,0.7567291496473287
25,1,SVC Classifier,0,0.25,0.7961630695443646,0.7888265573451151,3.744115114212036,0.7888265573451151
26,1,Decision Tree,0,0.25,0.7128297362110312,0.7118638268461461,0.09736895561218262,0.7118638268461461
27,1,RandomForest,0,0.25,0.7511990407673861,0.7452974838694405,0.3957791328430176,0.7452974838694405
28,1,AdaBoost (Discrete),0,0.25,0.737410071942446,0.7351077479213506,38.218568086624146,0.7351077479213506
29,1,AdaBoost (Real),0,0.25,0.7356115107913669,0.7277508218083018,45.93661403656006,0.7277508218083018
30,1,Logistic Regression (Penalty = L2),0,0.25,0.8009592326139089,0.7997745948603093,0.21537041664123535,0.7997745948603093
31,1,Naive Bayes,0,0.25,0.790167865707434,0.7829355017308139,0.07823324203491211,0.7829355017308139
32,1,KNeighbors Classifier,1,0.25,0.7521008403361344,0.7494392521609007,0.4755582809448242,0.7494392521609007
33,1,SVC Classifier,1,0.25,0.7767106842737095,0.7651953829220307,3.4673848152160645,0.7651953829220307
34,1,Decision Tree,1,0.25,0.71968787515006,0.718087892571326,0.1199040412902832,0.718087892571326
35,1,RandomForest,1,0.25,0.7178871548619448,0.7066735769561235,0.41279053688049316,0.7066735769561235
36,1,AdaBoost (Discrete),1,0.25,0.7034813925570228,0.7016253550724921,37.08275055885315,0.7016253550724921
37,1,AdaBoost (Real),1,0.25,0.7292917166866747,0.7285119789722707,42.997530460357666,0.7285119789722707
38,1,Logistic Regression (Penalty = L2),1,0.25,0.7965186074429772,0.7953172459208641,0.21014904975891113,0.7953172459208641
39,1,Naive Bayes,1,0.25,0.7737094837935174,0.7645795211179112,0.07070016860961914,0.7645795211179112
40,1,KNeighbors Classifier,2,0.25,0.7653061224489796,0.7638647897187469,0.5045921802520752,0.7638647897187469
41,1,SVC Classifier,2,0.25,0.7815126050420168,0.7692029319116583,3.299981117248535,0.7692029319116583
42,1,Decision Tree,2,0.25,0.6968787515006002,0.6947314978085722,0.10812735557556152,0.6947314978085722
43,1,RandomForest,2,0.25,0.7250900360144058,0.716403966647493,0.35569238662719727,0.716403966647493
44,1,AdaBoost (Discrete),2,0.25,0.7046818727490997,0.7043346053709154,36.3026864528656,0.7043346053709154
45,1,AdaBoost (Real),2,0.25,0.726890756302521,0.7224772511320733,43.001384973526,0.7224772511320733
46,1,Logistic Regression (Penalty = L2),2,0.25,0.8013205282112845,0.7991278449190422,0.24024295806884766,0.7991278449190422
47,1,Naive Bayes,2,0.25,0.7677070828331333,0.7560787515125234,0.08771324157714844,0.7560787515125234
48,2,KNeighbors Classifier,0,0.25,0.737410071942446,0.7369772065933438,0.5038270950317383,0.7369772065933438
49,2,SVC Classifier,0,0.25,0.7811750599520384,0.7745207806029661,3.4019131660461426,0.7745207806029661
50,2,Decision Tree,0,0.25,0.6930455635491607,0.6928161666508377,0.11040663719177246,0.6928161666508377
51,2,RandomForest,0,0.25,0.7404076738609112,0.7311260889483664,0.36081647872924805,0.7311260889483664
52,2,AdaBoost (Discrete),0,0.25,0.6984412470023981,0.6959787316614706,35.671592235565186,0.6959787316614706
53,2,AdaBoost (Real),0,0.25,0.7080335731414868,0.7053350557753136,42.867215156555176,0.7053350557753136
54,2,Logistic Regression (Penalty = L2),0,0.25,0.7919664268585132,0.7910009112921427,0.24956440925598145,0.7910009112921427
55,2,Naive Bayes,0,0.25,0.7769784172661871,0.7714681109400989,0.03778958320617676,0.7714681109400989
56,2,KNeighbors Classifier,1,0.25,0.7448979591836735,0.7438988198768326,0.5056948661804199,0.7438988198768326
57,2,SVC Classifier,1,0.25,0.7713085234093637,0.7656032064259208,3.5551700592041016,0.7656032064259208
58,2,Decision Tree,1,0.25,0.6818727490996399,0.681794802134036,0.11135697364807129,0.681794802134036
59,2,RandomForest,1,0.25,0.748499399759904,0.7438496531092891,0.35091090202331543,0.7438496531092891
60,2,AdaBoost (Discrete),1,0.25,0.7016806722689075,0.6996185904390957,35.7350709438324,0.6996185904390957
61,2,AdaBoost (Real),1,0.25,0.7172869147659063,0.7163639577934887,43.249199628829956,0.7163639577934887
62,2,Logistic Regression (Penalty = L2),1,0.25,0.7833133253301321,0.7827362853522465,0.21503067016601562,0.7827362853522465
63,2,Naive Bayes,1,0.25,0.7611044417767107,0.7560227127557974,0.06316256523132324,0.7560227127557974
64,2,KNeighbors Classifier,2,0.25,0.7346938775510204,0.73382750479121,0.44137024879455566,0.73382750479121
65,2,SVC Classifier,2,0.25,0.7917166866746699,0.7848073622224205,3.529351234436035,0.7848073622224205
66,2,Decision Tree,2,0.25,0.7148859543817527,0.7141322755139474,0.10798168182373047,0.7141322755139474
67,2,RandomForest,2,0.25,0.737094837935174,0.734710752444132,0.3253488540649414,0.734710752444132
68,2,AdaBoost (Discrete),2,0.25,0.7142857142857143,0.7138985086985898,36.38403391838074,0.7138985086985898
69,2,AdaBoost (Real),2,0.25,0.7298919567827131,0.7286634231816997,56.89920401573181,0.7286634231816997
70,2,Logistic Regression (Penalty = L2),2,0.25,0.7899159663865546,0.7878405540204261,0.25681185722351074,0.7878405540204261
71,2,Naive Bayes,2,0.25,0.7845138055222088,0.7785298450226572,0.08490681648254395,0.7785298450226572
72,3,KNeighbors Classifier,0,0.25,0.7458033573141487,0.7438815511645517,0.6868617534637451,0.7438815511645517
73,3,SVC Classifier,0,0.25,0.761990407673861,0.7440402490106844,4.292697429656982,0.7440402490106844
74,3,Decision Tree,0,0.25,0.7056354916067147,0.7035329307543549,0.14291095733642578,0.7035329307543549
75,3,RandomForest,0,0.25,0.7248201438848921,0.7104034975674548,0.5158097743988037,0.7104034975674548
76,3,AdaBoost (Discrete),0,0.25,0.6900479616306955,0.686798475209116,47.18942093849182,0.686798475209116
77,3,AdaBoost (Real),0,0.25,0.7044364508393285,0.6929727505830967,57.544971227645874,0.6929727505830967
78,3,Logistic Regression (Penalty = L2),0,0.25,0.7985611510791367,0.7956498468443413,0.3509635925292969,0.7956498468443413
79,3,Naive Bayes,0,0.25,0.7637889688249401,0.7472947236801981,0.1469743251800537,0.7472947236801981
80,3,KNeighbors Classifier,1,0.25,0.723889555822329,0.7205382847682303,0.6631388664245605,0.7205382847682303
81,3,SVC Classifier,1,0.25,0.7382953181272509,0.7161451406629544,4.799238204956055,0.7161451406629544
82,3,Decision Tree,1,0.25,0.6998799519807923,0.6972954178054307,0.15422344207763672,0.6972954178054307
83,3,RandomForest,1,0.25,0.7244897959183674,0.7138744046525252,0.43267250061035156,0.7138744046525252
84,3,AdaBoost (Discrete),1,0.25,0.6698679471788715,0.6669862209935125,50.71143841743469,0.6669862209935125
85,3,AdaBoost (Real),1,0.25,0.6956782713085234,0.6919968792953733,58.378395318984985,0.6919968792953733
86,3,Logistic Regression (Penalty = L2),1,0.25,0.7791116446578632,0.7757891734588446,0.2590947151184082,0.7757891734588446
87,3,Naive Bayes,1,0.25,0.7509003601440576,0.7317508684158668,0.0765378475189209,0.7317508684158668
88,3,KNeighbors Classifier,2,0.25,0.7220888355342137,0.7185252711837944,0.6600332260131836,0.7185252711837944
89,3,SVC Classifier,2,0.25,0.7358943577430972,0.7101888736626061,4.494792938232422,0.7101888736626061
90,3,Decision Tree,2,0.25,0.6746698679471789,0.6713323953081594,0.14809441566467285,0.6713323953081594
91,3,RandomForest,2,0.25,0.712484993997599,0.6929760516029685,0.48378896713256836,0.6929760516029685
92,3,AdaBoost (Discrete),2,0.25,0.6788715486194478,0.6746431706141139,49.06304717063904,0.6746431706141139
93,3,AdaBoost (Real),2,0.25,0.6788715486194478,0.6622999904033774,61.62884306907654,0.6622999904033774
94,3,Logistic Regression (Penalty = L2),2,0.25,0.7839135654261705,0.7788964124844735,0.3284022808074951,0.7788964124844735
95,3,Naive Bayes,2,0.25,0.7400960384153662,0.7183560425758795,0.04935407638549805,0.7183560425758795
96,4,KNeighbors Classifier,0,0.25,0.6996402877697842,0.698410851372074,0.24321389198303223,0.698410851372074
97,4,SVC Classifier,0,0.25,0.7338129496402878,0.7191755065420461,4.578924179077148,0.7191755065420461
98,4,Decision Tree,0,0.25,0.6360911270983214,0.6352512670478639,0.10356569290161133,0.6352512670478639
99,4,RandomForest,0,0.25,0.7026378896882494,0.6951012674661393,0.4684422016143799,0.6951012674661393
100,4,AdaBoost (Discrete),0,0.25,0.658273381294964,0.6571562443645221,36.02139449119568,0.6571562443645221
101,4,AdaBoost (Real),0,0.25,0.6151079136690647,0.5975235355152357,45.4874804019928,0.5975235355152357
102,4,Logistic Regression (Penalty = L2),0,0.25,0.7470023980815348,0.7452026222417808,0.22813844680786133,0.7452026222417808
103,4,Naive Bayes,0,0.25,0.7314148681055156,0.7222449577181471,0.10489916801452637,0.7222449577181471
104,4,KNeighbors Classifier,1,0.25,0.6956782713085234,0.6942205624072841,0.2381291389465332,0.6942205624072841
105,4,SVC Classifier,1,0.25,0.712484993997599,0.6920930264630112,4.586533784866333,0.6920930264630112
106,4,Decision Tree,1,0.25,0.6422569027611045,0.6393145752571373,0.09692192077636719,0.6393145752571373
107,4,RandomForest,1,0.25,0.7112845138055222,0.6937901895042279,0.4856436252593994,0.6937901895042279
108,4,AdaBoost (Discrete),1,0.25,0.6092436974789915,0.6055754352237454,35.61469125747681,0.6055754352237454
109,4,AdaBoost (Real),1,0.25,0.6008403361344538,0.5711063043271579,47.896379470825195,0.5711063043271579
110,4,Logistic Regression (Penalty = L2),1,0.25,0.7364945978391356,0.7332425820604728,0.2310636043548584,0.7332425820604728
111,4,Naive Bayes,1,0.25,0.7154861944777912,0.7040326432801488,0.10710835456848145,0.7040326432801488
112,4,KNeighbors Classifier,2,0.25,0.6764705882352942,0.6741221899619985,0.27605509757995605,0.6741221899619985
113,4,SVC Classifier,2,0.25,0.7106842737094838,0.6884059666163577,4.574585676193237,0.6884059666163577
114,4,Decision Tree,2,0.25,0.6392557022809123,0.6372783542612255,0.10838699340820312,0.6372783542612255
115,4,RandomForest,2,0.25,0.7004801920768308,0.6793361613293702,0.4896092414855957,0.6793361613293702
116,4,AdaBoost (Discrete),2,0.25,0.6218487394957983,0.6209682987357358,38.33636522293091,0.6209682987357358
117,4,AdaBoost (Real),2,0.25,0.6224489795918368,0.6140203537009472,49.2802529335022,0.6140203537009472
118,4,Logistic Regression (Penalty = L2),2,0.25,0.7454981992797118,0.7403659960383742,0.26257896423339844,0.7403659960383742
119,4,Naive Bayes,2,0.25,0.7226890756302521,0.708891368367037,0.0568540096282959,0.708891368367037
120,5,KNeighbors Classifier,0,0.25,0.6918465227817746,0.6894958028380924,0.22411060333251953,0.6894958028380924
121,5,SVC Classifier,0,0.25,0.7086330935251799,0.6851770549568924,4.357544183731079,0.6851770549568924
122,5,Decision Tree,0,0.25,0.61810551558753,0.616986714191395,0.10468602180480957,0.616986714191395
123,5,RandomForest,0,0.25,0.7158273381294964,0.6989969973633021,0.5242891311645508,0.6989969973633021
124,5,AdaBoost (Discrete),0,0.25,0.6264988009592326,0.6234200836394871,48.48632073402405,0.6234200836394871
125,5,AdaBoost (Real),0,0.25,0.6360911270983214,0.6354220377384685,63.92460751533508,0.6354220377384685
126,5,Logistic Regression (Penalty = L2),0,0.25,0.7386091127098321,0.7352900399007716,0.3047306537628174,0.7352900399007716
127,5,Naive Bayes,0,0.25,0.7272182254196643,0.7086319637224561,0.06133008003234863,0.7086319637224561
128,5,KNeighbors Classifier,1,0.25,0.6584633853541416,0.6554605283171132,0.2907273769378662,0.6554605283171132
129,5,SVC Classifier,1,0.25,0.6968787515006002,0.6725538283293415,5.711568832397461,0.6725538283293415
130,5,Decision Tree,1,0.25,0.6086434573829532,0.6050649678997326,0.13551568984985352,0.6050649678997326
131,5,RandomForest,1,0.25,0.6986794717887155,0.6813098835815643,0.6207137107849121,0.6813098835815643
132,5,AdaBoost (Discrete),1,0.25,0.6032412965186075,0.5961546294576067,49.9406099319458,0.5961546294576067
133,5,AdaBoost (Real),1,0.25,0.5882352941176471,0.5819215021898878,62.141907691955566,0.5819215021898878
134,5,Logistic Regression (Penalty = L2),1,0.25,0.7280912364945978,0.725506674121286,0.2797703742980957,0.725506674121286
135,5,Naive Bayes,1,0.25,0.7112845138055222,0.69729269513007,0.08117365837097168,0.69729269513007
136,5,KNeighbors Classifier,2,0.25,0.6680672268907563,0.6659546373774905,0.25803184509277344,0.6659546373774905
137,5,SVC Classifier,2,0.25,0.7028811524609844,0.6721215051989711,5.686798572540283,0.6721215051989711
138,5,Decision Tree,2,0.25,0.6110444177671068,0.610123960205494,0.12321043014526367,0.610123960205494
139,5,RandomForest,2,0.25,0.6866746698679472,0.6684042569408752,0.5703632831573486,0.6684042569408752
140,5,AdaBoost (Discrete),2,0.25,0.5918367346938775,0.5880608609996223,47.63805603981018,0.5880608609996223
141,5,AdaBoost (Real),2,0.25,0.602641056422569,0.6005188143831166,60.611581563949585,0.6005188143831166
142,5,Logistic Regression (Penalty = L2),2,0.25,0.7334933973589436,0.7288872890479381,0.26618099212646484,0.7288872890479381
143,5,Naive Bayes,2,0.25,0.7088835534213686,0.69032301565004,0.10729455947875977,0.69032301565004
144,6,KNeighbors Classifier,0,0.25,0.7230215827338129,0.7210624716023518,0.4672873020172119,0.7210624716023518
145,6,SVC Classifier,0,0.25,0.7440047961630696,0.7255544717047341,5.711893558502197,0.7255544717047341
146,6,Decision Tree,0,0.25,0.684052757793765,0.6834015534513168,0.1926889419555664,0.6834015534513168
147,6,RandomForest,0,0.25,0.7356115107913669,0.7189478735747709,0.6495976448059082,0.7189478735747709
148,6,AdaBoost (Discrete),0,0.25,0.6163069544364509,0.6012243656984599,53.67029023170471,0.6012243656984599
149,6,AdaBoost (Real),0,0.25,0.6690647482014388,0.6665497119137664,66.46203708648682,0.6665497119137664
150,6,Logistic Regression (Penalty = L2),0,0.25,0.7685851318944844,0.7658888686424914,0.3152446746826172,0.7658888686424914
151,6,Naive Bayes,0,0.25,0.7547961630695443,0.7425068700010393,0.17557358741760254,0.7425068700010393
152,6,KNeighbors Classifier,1,0.25,0.7022809123649459,0.6996344597927143,0.38332295417785645,0.6996344597927143
153,6,SVC Classifier,1,0.25,0.7220888355342137,0.6981717028413909,5.8401429653167725,0.6981717028413909
154,6,Decision Tree,1,0.25,0.6758703481392557,0.6737319772263747,0.1873154640197754,0.6737319772263747
155,6,RandomForest,1,0.25,0.7172869147659063,0.7066068971321836,0.6413547992706299,0.7066068971321836
156,6,AdaBoost (Discrete),1,0.25,0.6266506602641057,0.6172563993485743,53.07848787307739,0.6172563993485743
157,6,AdaBoost (Real),1,0.25,0.631452581032413,0.6222500016555036,66.39211010932922,0.6222500016555036
158,6,Logistic Regression (Penalty = L2),1,0.25,0.7466986794717887,0.7434522878704497,0.3164184093475342,0.7434522878704497
159,6,Naive Bayes,1,0.25,0.7322929171668667,0.7181466028858726,0.09800910949707031,0.7181466028858726
160,6,KNeighbors Classifier,2,0.25,0.712484993997599,0.7080151649420944,0.40311288833618164,0.7080151649420944
161,6,SVC Classifier,2,0.25,0.7244897959183674,0.7010353588123069,5.821744203567505,0.7010353588123069
162,6,Decision Tree,2,0.25,0.6776710684273709,0.6752630502025535,0.19118356704711914,0.6752630502025535
163,6,RandomForest,2,0.25,0.7016806722689075,0.6853770809323352,0.7298460006713867,0.6853770809323352
164,6,AdaBoost (Discrete),2,0.25,0.6320528211284514,0.6111340490874895,52.50210356712341,0.6111340490874895
165,6,AdaBoost (Real),2,0.25,0.6584633853541416,0.6436381615372432,66.38852977752686,0.6436381615372432
166,6,Logistic Regression (Penalty = L2),2,0.25,0.7611044417767107,0.7545151604810291,0.2325456142425537,0.7545151604810291
167,6,Naive Bayes,2,0.25,0.7328931572629052,0.7160981972688271,0.08128142356872559,0.7160981972688271
168,7,KNeighbors Classifier,0,0.25,0.6624700239808153,0.6623257669410098,0.23964715003967285,0.6623257669410098
169,7,SVC Classifier,0,0.25,0.7356115107913669,0.7336506549141477,5.56595778465271,0.7336506549141477
170,7,Decision Tree,0,0.25,0.6211031175059952,0.6211257898361728,0.19716477394104004,0.6211257898361728
171,7,RandomForest,0,0.25,0.6888489208633094,0.6872521956968436,0.5891096591949463,0.6872521956968436
172,7,AdaBoost (Discrete),0,0.25,0.6151079136690647,0.6139380784252354,47.1842086315155,0.6139380784252354
173,7,AdaBoost (Real),0,0.25,0.6229016786570744,0.6180612398488852,60.82706117630005,0.6180612398488852
174,7,Logistic Regression (Penalty = L2),0,0.25,0.7404076738609112,0.7398281573239271,0.2631711959838867,0.7398281573239271
175,7,Naive Bayes,0,0.25,0.7176258992805755,0.716373314787025,0.06838440895080566,0.716373314787025
176,7,KNeighbors Classifier,1,0.25,0.6764705882352942,0.6759144193860404,0.3184518814086914,0.6759144193860404
177,7,SVC Classifier,1,0.25,0.723889555822329,0.7215561913548976,5.615112066268921,0.7215561913548976
178,7,Decision Tree,1,0.25,0.6356542617046819,0.6349499582862618,0.12474703788757324,0.6349499582862618
179,7,RandomForest,1,0.25,0.6830732292917167,0.6796154026967096,0.6439051628112793,0.6796154026967096
180,7,AdaBoost (Discrete),1,0.25,0.5882352941176471,0.583599063143739,47.107900619506836,0.583599063143739
181,7,AdaBoost (Real),1,0.25,0.5594237695078031,0.5497534278265237,59.71347641944885,0.5497534278265237
182,7,Logistic Regression (Penalty = L2),1,0.25,0.7328931572629052,0.7323524080921824,0.2941017150878906,0.7323524080921824
183,7,Naive Bayes,1,0.25,0.7160864345738295,0.7130093101924226,0.12652182579040527,0.7130093101924226
184,7,KNeighbors Classifier,2,0.25,0.6656662665066027,0.6656004679353986,0.24981307983398438,0.6656004679353986
185,7,SVC Classifier,2,0.25,0.7388955582232893,0.7363914510352924,5.247841119766235,0.7363914510352924
186,7,Decision Tree,2,0.25,0.6464585834333734,0.6462939039652251,0.12048459053039551,0.6462939039652251
187,7,RandomForest,2,0.25,0.695078031212485,0.6900161700358542,0.5498793125152588,0.6900161700358542
188,7,AdaBoost (Discrete),2,0.25,0.5840336134453782,0.5606194263077314,44.779765605926514,0.5606194263077314
189,7,AdaBoost (Real),2,0.25,0.6110444177671068,0.6037126090542162,58.26366448402405,0.6037126090542162
190,7,Logistic Regression (Penalty = L2),2,0.25,0.7418967587034814,0.7409682293961308,0.4108140468597412,0.7409682293961308
191,7,Naive Bayes,2,0.25,0.7346938775510204,0.731975880383977,0.05779385566711426,0.731975880383977
192,8,KNeighbors Classifier,0,0.25,0.737410071942446,0.7362758798817501,0.5696089267730713,0.7362758798817501
193,8,SVC Classifier,0,0.25,0.7583932853717026,0.7417532550258925,5.643216609954834,0.7417532550258925
194,8,Decision Tree,0,0.25,0.7008393285371702,0.6989489385555255,0.13423657417297363,0.6989489385555255
195,8,RandomForest,0,0.25,0.7290167865707434,0.7208355063724441,0.5809197425842285,0.7208355063724441
196,8,AdaBoost (Discrete),0,0.25,0.684652278177458,0.6846829424900963,58.19840121269226,0.6846829424900963
197,8,AdaBoost (Real),0,0.25,0.6834532374100719,0.6753301174852446,82.45159530639648,0.6753301174852446
198,8,Logistic Regression (Penalty = L2),0,0.25,0.7787769784172662,0.77613163867645,0.3684992790222168,0.77613163867645
199,8,Naive Bayes,0,0.25,0.7577937649880095,0.7429008828850039,0.17034339904785156,0.7429008828850039
200,8,KNeighbors Classifier,1,0.25,0.7178871548619448,0.7140028898443358,0.6850225925445557,0.7140028898443358
201,8,SVC Classifier,1,0.25,0.7250900360144058,0.7019332320176839,6.769286870956421,0.7019332320176839
202,8,Decision Tree,1,0.25,0.6848739495798319,0.6830895265113792,0.2280440330505371,0.6830895265113792
203,8,RandomForest,1,0.25,0.7232893157262905,0.7066810305285608,0.8332881927490234,0.7066810305285608
204,8,AdaBoost (Discrete),1,0.25,0.6476590636254502,0.6410141282589134,69.12693285942078,0.6410141282589134
205,8,AdaBoost (Real),1,0.25,0.6698679471788715,0.6583832891853162,83.82914662361145,0.6583832891853162
206,8,Logistic Regression (Penalty = L2),1,0.25,0.7671068427370948,0.762710964840123,0.404219388961792,0.762710964840123
207,8,Naive Bayes,1,0.25,0.7478991596638656,0.7296254813394251,0.21807575225830078,0.7296254813394251
208,8,KNeighbors Classifier,2,0.25,0.7208883553421368,0.718337356461546,0.6533205509185791,0.718337356461546
209,8,SVC Classifier,2,0.25,0.7298919567827131,0.7063207245963947,6.953854322433472,0.7063207245963947
210,8,Decision Tree,2,0.25,0.6842737094837935,0.682485882938327,0.23653864860534668,0.682485882938327
211,8,RandomForest,2,0.25,0.6992797118847539,0.6858917580694706,0.8610470294952393,0.6858917580694706
212,8,AdaBoost (Discrete),2,0.25,0.6632653061224489,0.6518247770710842,73.15027976036072,0.6518247770710842
213,8,AdaBoost (Real),2,0.25,0.6974789915966386,0.6821069785603395,82.61472725868225,0.6821069785603395
214,8,Logistic Regression (Penalty = L2),2,0.25,0.7767106842737095,0.7713718380464574,0.4200918674468994,0.7713718380464574
215,8,Naive Bayes,2,0.25,0.7334933973589436,0.7133567949183574,0.07875871658325195,0.7133567949183574
216,9,KNeighbors Classifier,0,0.25,0.6918465227817746,0.6894958028380924,0.3502528667449951,0.6894958028380924
217,9,SVC Classifier,0,0.25,0.7086330935251799,0.6851770549568924,6.045091867446899,0.6851770549568924
218,9,Decision Tree,0,0.25,0.6396882494004796,0.6383673303186266,0.20908355712890625,0.6383673303186266
219,9,RandomForest,0,0.25,0.7158273381294964,0.6989969973633021,0.7241482734680176,0.6989969973633021
220,9,AdaBoost (Discrete),0,0.25,0.6264988009592326,0.6234200836394871,55.55766463279724,0.6234200836394871
221,9,AdaBoost (Real),0,0.25,0.6360911270983214,0.6354220377384685,71.29410910606384,0.6354220377384685
222,9,Logistic Regression (Penalty = L2),0,0.25,0.7386091127098321,0.7352900399007716,0.3337407112121582,0.7352900399007716
223,9,Naive Bayes,0,0.25,0.7272182254196643,0.7086319637224561,0.1051793098449707,0.7086319637224561
224,9,KNeighbors Classifier,1,0.25,0.6584633853541416,0.6554605283171132,0.37946534156799316,0.6554605283171132
225,9,SVC Classifier,1,0.25,0.6968787515006002,0.6725538283293415,6.376006364822388,0.6725538283293415
226,9,Decision Tree,1,0.25,0.6284513805522209,0.6272155238379765,0.22524452209472656,0.6272155238379765
227,9,RandomForest,1,0.25,0.6986794717887155,0.6813098835815643,0.762608528137207,0.6813098835815643
228,9,AdaBoost (Discrete),1,0.25,0.6032412965186075,0.5961546294576067,55.849668979644775,0.5961546294576067
229,9,AdaBoost (Real),1,0.25,0.5906362545018007,0.5744689926619061,68.83555364608765,0.5744689926619061
230,9,Logistic Regression (Penalty = L2),1,0.25,0.7280912364945978,0.725506674121286,0.3323333263397217,0.725506674121286
231,9,Naive Bayes,1,0.25,0.7112845138055222,0.69729269513007,0.08007597923278809,0.69729269513007
232,9,KNeighbors Classifier,2,0.25,0.6680672268907563,0.6659546373774905,0.30535149574279785,0.6659546373774905
233,9,SVC Classifier,2,0.25,0.7028811524609844,0.6721215051989711,6.889674186706543,0.6721215051989711
234,9,Decision Tree,2,0.25,0.617046818727491,0.6137552790205074,0.22521662712097168,0.6137552790205074
235,9,RandomForest,2,0.25,0.6866746698679472,0.6684042569408752,0.7754738330841064,0.6684042569408752
236,9,AdaBoost (Discrete),2,0.25,0.5918367346938775,0.5880608609996223,56.21525001525879,0.5880608609996223
237,9,AdaBoost (Real),2,0.25,0.5972388955582233,0.5864744654548419,72.1703634262085,0.5864744654548419
238,9,Logistic Regression (Penalty = L2),2,0.25,0.7334933973589436,0.7288872890479381,0.3122870922088623,0.7288872890479381
239,9,Naive Bayes,2,0.25,0.7088835534213686,0.69032301565004,0.15041351318359375,0.69032301565004
240,10,KNeighbors Classifier,0,0.25,0.776378896882494,0.7740707287141292,1.3708174228668213,0.7740707287141292
241,10,SVC Classifier,0,0.25,0.802158273381295,0.7936299699511085,7.473107576370239,0.7936299699511085
242,10,Decision Tree,0,0.25,0.6990407673860911,0.6963733139110038,0.21456170082092285,0.6963733139110038
243,10,RandomForest,0,0.25,0.7535971223021583,0.7408710091252323,0.6756165027618408,0.7408710091252323
244,10,AdaBoost (Discrete),0,0.25,0.7643884892086331,0.7635398971461448,80.44101929664612,0.7635398971461448
245,10,AdaBoost (Real),0,0.25,0.7535971223021583,0.7450623112909804,96.77295088768005,0.7450623112909804
246,10,Logistic Regression (Penalty = L2),0,0.25,0.8123501199040767,0.811054364470367,0.46797704696655273,0.811054364470367
247,10,Naive Bayes,0,0.25,0.7949640287769785,0.7857080890461955,0.07744431495666504,0.7857080890461955
248,10,KNeighbors Classifier,1,0.25,0.7581032412965186,0.7559872542616486,1.5269982814788818,0.7559872542616486
249,10,SVC Classifier,1,0.25,0.7863145258103241,0.7741391622282519,7.517488479614258,0.7741391622282519
250,10,Decision Tree,1,0.25,0.7070828331332533,0.7063910049118933,0.22317218780517578,0.7063910049118933
251,10,RandomForest,1,0.25,0.7376950780312125,0.7253679505173801,0.8406283855438232,0.7253679505173801
252,10,AdaBoost (Discrete),1,0.25,0.71968787515006,0.7191309748950854,81.53946805000305,0.7191309748950854
253,10,AdaBoost (Real),1,0.25,0.7322929171668667,0.729755433469689,97.31026029586792,0.729755433469689
254,10,Logistic Regression (Penalty = L2),1,0.25,0.8061224489795918,0.8044457166910834,0.4432828426361084,0.8044457166910834
255,10,Naive Bayes,1,0.25,0.7779111644657863,0.7667103095420659,0.14693760871887207,0.7667103095420659
256,10,KNeighbors Classifier,2,0.25,0.7671068427370948,0.7657779081143449,1.3654115200042725,0.7657779081143449
257,10,SVC Classifier,2,0.25,0.7899159663865546,0.7762906905140406,7.284143447875977,0.7762906905140406
258,10,Decision Tree,2,0.25,0.7148859543817527,0.713845431803473,0.14873290061950684,0.713845431803473
259,10,RandomForest,2,0.25,0.7286914765906363,0.71164595773851,0.7707760334014893,0.71164595773851
260,10,AdaBoost (Discrete),2,0.25,0.751500600240096,0.7506599503355638,81.62256789207458,0.7506599503355638
261,10,AdaBoost (Real),2,0.25,0.751500600240096,0.7481335786725561,95.90435862541199,0.7481335786725561
262,10,Logistic Regression (Penalty = L2),2,0.25,0.8097238895558223,0.8075220714859946,0.425429105758667,0.8075220714859946
263,10,Naive Bayes,2,0.25,0.7713085234093637,0.7580225851677613,0.16289591789245605,0.7580225851677613
264,11,KNeighbors Classifier,0,0.25,0.7961630695443646,0.7955398565491248,3.647657871246338,0.7955398565491248
265,11,SVC Classifier,0,0.25,0.8243405275779376,0.8112748257495369,8.417088508605957,0.8112748257495369
266,11,Decision Tree,0,0.25,0.7398081534772182,0.739275815344171,0.21233797073364258,0.739275815344171
267,11,RandomForest,0,0.25,0.7529976019184652,0.742282455832662,0.8608462810516357,0.742282455832662
268,11,AdaBoost (Discrete),0,0.25,0.8069544364508393,0.8069135709489854,104.98959064483643,0.8069135709489854
269,11,AdaBoost (Real),0,0.25,0.8189448441247003,0.8186761170054909,121.74843072891235,0.8186761170054909
270,11,Logistic Regression (Penalty = L2),0,0.25,0.85431654676259,0.853363699363355,0.531982421875,0.853363699363355
271,11,Naive Bayes,0,0.25,0.8105515587529976,0.7891258701789338,0.07040905952453613,0.7891258701789338
272,11,KNeighbors Classifier,1,0.25,0.7833133253301321,0.7825130455751552,3.4010839462280273,0.7825130455751552
273,11,SVC Classifier,1,0.25,0.819327731092437,0.8073745871131787,7.944963455200195,0.8073745871131787
274,11,Decision Tree,1,0.25,0.7286914765906363,0.7285684308856021,0.22947096824645996,0.7285684308856021
275,11,RandomForest,1,0.25,0.7527010804321729,0.7406701521778205,0.838331937789917,0.7406701521778205
276,11,AdaBoost (Discrete),1,0.25,0.7941176470588235,0.7928908360206479,106.3162784576416,0.7928908360206479
277,11,AdaBoost (Real),1,0.25,0.7935174069627852,0.7925630440218683,121.86509537696838,0.7925630440218683
278,11,Logistic Regression (Penalty = L2),1,0.25,0.8271308523409364,0.8257627427088368,0.4274868965148926,0.8257627427088368
279,11,Naive Bayes,1,0.25,0.8025210084033614,0.783731704461281,0.13849425315856934,0.783731704461281
280,11,KNeighbors Classifier,2,0.25,0.7935174069627852,0.792864792341319,3.8582940101623535,0.792864792341319
281,11,SVC Classifier,2,0.25,0.8235294117647058,0.8097150927489424,7.9265265464782715,0.8097150927489424
282,11,Decision Tree,2,0.25,0.7316926770708283,0.7309264019231326,0.30266523361206055,0.7309264019231326
283,11,RandomForest,2,0.25,0.7677070828331333,0.7576301228194241,0.9560365676879883,0.7576301228194241
284,11,AdaBoost (Discrete),2,0.25,0.8169267707082833,0.8158047347681693,103.98328042030334,0.8158047347681693
285,11,AdaBoost (Real),2,0.25,0.8169267707082833,0.8154603620476691,110.98719358444214,0.8154603620476691
286,11,Logistic Regression (Penalty = L2),2,0.25,0.8499399759903962,0.8483210612177181,0.4229164123535156,0.8483210612177181
287,11,Naive Bayes,2,0.25,0.8187274909963985,0.8021253965188937,0.07085752487182617,0.8021253965188937
288,12,KNeighbors Classifier,0,0.25,0.632494004796163,0.6302008509466048,0.1387627124786377,0.6302008509466048
289,12,SVC Classifier,0,0.25,0.6912470023980816,0.6737205114411857,5.324280738830566,0.6737205114411857
290,12,Decision Tree,0,0.25,0.6019184652278178,0.6011801424287673,0.13216376304626465,0.6011801424287673
291,12,RandomForest,0,0.25,0.6774580335731415,0.6658340722997673,0.6097629070281982,0.6658340722997673
292,12,AdaBoost (Discrete),0,0.25,0.6336930455635491,0.6168473428866735,44.51005172729492,0.6168473428866735
293,12,AdaBoost (Real),0,0.25,0.5869304556354916,0.5786301723858802,59.533519983291626,0.5786301723858802
294,12,Logistic Regression (Penalty = L2),0,0.25,0.697841726618705,0.695426558470332,0.22450804710388184,0.695426558470332
295,12,Naive Bayes,0,0.25,0.6966426858513189,0.6839798939101975,0.07404923439025879,0.6839798939101975
296,12,KNeighbors Classifier,1,0.25,0.6368547418967587,0.6351949739870126,0.2904059886932373,0.6351949739870126
297,12,SVC Classifier,1,0.25,0.6890756302521008,0.6748902743333239,6.583017587661743,0.6748902743333239
298,12,Decision Tree,1,0.25,0.6182472989195679,0.6177361558905651,0.07815170288085938,0.6177361558905651
299,12,RandomForest,1,0.25,0.6584633853541416,0.6476142143488177,0.602302074432373,0.6476142143488177
300,12,AdaBoost (Discrete),1,0.25,0.631452581032413,0.6287308331174426,50.53137922286987,0.6287308331174426
301,12,AdaBoost (Real),1,0.25,0.5786314525810324,0.5678467647820422,65.25694251060486,0.5678467647820422
302,12,Logistic Regression (Penalty = L2),1,0.25,0.6986794717887155,0.697187062935979,0.2275705337524414,0.697187062935979
303,12,Naive Bayes,1,0.25,0.6938775510204082,0.6851202651495819,0.07607102394104004,0.6851202651495819
304,12,KNeighbors Classifier,2,0.25,0.6242496998799519,0.622211837340214,0.22374701499938965,0.622211837340214
305,12,SVC Classifier,2,0.25,0.6860744297719088,0.6639571041107692,6.431352853775024,0.6639571041107692
306,12,Decision Tree,2,0.25,0.5894357743097239,0.5868996574199158,0.15720152854919434,0.5868996574199158
307,12,RandomForest,2,0.25,0.6812725090036015,0.6627366900903526,0.7538974285125732,0.6627366900903526
308,12,AdaBoost (Discrete),2,0.25,0.6446578631452581,0.6423863098861464,49.99782657623291,0.6423863098861464
309,12,AdaBoost (Real),2,0.25,0.6050420168067226,0.5983812189310515,65.54355263710022,0.5983812189310515
310,12,Logistic Regression (Penalty = L2),2,0.25,0.7064825930372148,0.7030490418849231,0.22920727729797363,0.7030490418849231
311,12,Naive Bayes,2,0.25,0.6908763505402161,0.6783835522348852,0.07814168930053711,0.6783835522348852
