,feat_set_id,classifier,fold_id,feat_th,score,geo_score,exec_t,geo_score_woz
0,0,KNeighbors Classifier,0,0.95,0.8196078431372549,0.6794911240753443,0.4760260581970215,0.0
1,0,SVC Classifier,0,0.95,0.7607843137254902,1.0,0.4643113613128662,0.0
2,0,Decision Tree,0,0.95,0.8156862745098039,0.9302359109919236,0.09529232978820801,0.0
3,0,RandomForest,0,0.95,0.7607843137254902,1.0,0.5876607894897461,0.0
4,0,AdaBoost (Discrete),0,0.95,0.7725490196078432,0.9840343533044587,42.89055871963501,0.0
5,0,AdaBoost (Real),0,0.95,0.6980392156862745,0.3917854950715044,66.31291723251343,0.0
6,0,Logistic Regression (Penalty = L2),0,0.95,0.7647058823529411,0.3920788795851925,0.7537992000579834,0.0
7,0,Naive Bayes,0,0.95,0.10980392156862745,0.31419291226453727,0.1961050033569336,0.0
8,0,KNeighbors Classifier,1,0.95,0.8,0.7370696708058684,0.4004216194152832,0.0
9,0,SVC Classifier,1,0.95,0.776,1.0,0.5062808990478516,0.0
10,0,Decision Tree,1,0.95,0.8,0.9389040604579058,0.09859848022460938,0.0
11,0,RandomForest,1,0.95,0.788,0.7745966692414834,0.7067630290985107,0.0
12,0,AdaBoost (Discrete),1,0.95,0.836,0.7311497119186926,41.35711741447449,0.0
13,0,AdaBoost (Real),1,0.95,0.724,0.5986206805330004,55.5675745010376,0.0
14,0,Logistic Regression (Penalty = L2),1,0.95,0.808,0.39773448577795095,0.7741048336029053,0.0
15,0,Naive Bayes,1,0.95,0.08,0.27041586643733656,0.3500490188598633,0.0
16,0,KNeighbors Classifier,2,0.95,0.8353909465020576,0.7530212497613873,0.48996973037719727,0.0
17,0,SVC Classifier,2,0.95,0.7983539094650206,1.0,0.6109788417816162,0.0
18,0,Decision Tree,2,0.95,0.7860082304526749,0.8335137946861616,0.11492180824279785,0.0
19,0,RandomForest,2,0.95,0.7983539094650206,1.0,0.717921257019043,0.0
20,0,AdaBoost (Discrete),2,0.95,0.7407407407407407,0.6205568408333527,51.548051834106445,0.0
21,0,AdaBoost (Real),2,0.95,0.588477366255144,0.46580794798877345,69.29336071014404,0.0
22,0,Logistic Regression (Penalty = L2),2,0.95,0.7860082304526749,0.5234649692628083,0.7356138229370117,0.0
23,0,Naive Bayes,2,0.95,0.10699588477366255,0.4563925617881304,0.23750662803649902,0.0
24,1,KNeighbors Classifier,0,0.95,0.8196078431372549,0.6794911240753443,0.464998722076416,0.0
25,1,SVC Classifier,0,0.95,0.7607843137254902,1.0,0.4582095146179199,0.0
26,1,Decision Tree,0,0.95,0.8235294117647058,0.7837424764394427,0.10757851600646973,0.0
27,1,RandomForest,0,0.95,0.7607843137254902,1.0,0.9556019306182861,0.0
28,1,AdaBoost (Discrete),0,0.95,0.7725490196078432,0.9840343533044587,47.90320682525635,0.0
29,1,AdaBoost (Real),0,0.95,0.6980392156862745,0.3917854950715044,65.12568283081055,0.0
30,1,Logistic Regression (Penalty = L2),0,0.95,0.7647058823529411,0.3920788795851925,0.9554862976074219,0.0
31,1,Naive Bayes,0,0.95,0.10980392156862745,0.31419291226453727,0.2121431827545166,0.0
32,1,KNeighbors Classifier,1,0.95,0.8,0.7370696708058684,0.34854698181152344,0.0
33,1,SVC Classifier,1,0.95,0.776,1.0,0.4644742012023926,0.0
34,1,Decision Tree,1,0.95,0.82,0.9420235722258096,0.0019714832305908203,0.0
35,1,RandomForest,1,0.95,0.788,0.7745966692414834,1.0365073680877686,0.0
36,1,AdaBoost (Discrete),1,0.95,0.836,0.7311497119186926,53.24174880981445,0.0
37,1,AdaBoost (Real),1,0.95,0.724,0.5986206805330004,66.22986078262329,0.0
38,1,Logistic Regression (Penalty = L2),1,0.95,0.808,0.39773448577795095,0.7026631832122803,0.0
39,1,Naive Bayes,1,0.95,0.08,0.27041586643733656,0.2492656707763672,0.0
40,1,KNeighbors Classifier,2,0.95,0.8353909465020576,0.7530212497613873,0.4500601291656494,0.0
41,1,SVC Classifier,2,0.95,0.7983539094650206,1.0,0.5799813270568848,0.0
42,1,Decision Tree,2,0.95,0.7901234567901234,0.8340431796132256,0.11504936218261719,0.0
43,1,RandomForest,2,0.95,0.7983539094650206,1.0,0.8226480484008789,0.0
44,1,AdaBoost (Discrete),2,0.95,0.7448559670781894,0.6210927291676543,49.518025636672974,0.0
45,1,AdaBoost (Real),2,0.95,0.6090534979423868,0.47000106156057164,63.76721525192261,0.0
46,1,Logistic Regression (Penalty = L2),2,0.95,0.7860082304526749,0.5234649692628083,0.7546446323394775,0.0
47,1,Naive Bayes,2,0.95,0.10699588477366255,0.4563925617881304,0.24822568893432617,0.0
48,2,KNeighbors Classifier,0,0.95,0.8196078431372549,0.6794911240753443,0.3892228603363037,0.0
49,2,SVC Classifier,0,0.95,0.7607843137254902,1.0,0.6135461330413818,0.0
50,2,Decision Tree,0,0.95,0.8196078431372549,0.9308423246461442,0.12709903717041016,0.0
51,2,RandomForest,0,0.95,0.7607843137254902,1.0,0.7507057189941406,0.0
52,2,AdaBoost (Discrete),0,0.95,0.792156862745098,0.8846991476935628,56.326549768447876,0.0
53,2,AdaBoost (Real),0,0.95,0.6980392156862745,0.3917854950715044,70.06532168388367,0.0
54,2,Logistic Regression (Penalty = L2),0,0.95,0.7647058823529411,0.3920788795851925,0.7836575508117676,0.0
55,2,Naive Bayes,0,0.95,0.10980392156862745,0.31419291226453727,0.30940699577331543,0.0
56,2,KNeighbors Classifier,1,0.95,0.8,0.7370696708058684,0.40377378463745117,0.0
57,2,SVC Classifier,1,0.95,0.776,1.0,0.678652286529541,0.0
58,2,Decision Tree,1,0.95,0.796,0.9382700922504694,0.0026559829711914062,0.0
59,2,RandomForest,1,0.95,0.788,0.7745966692414834,0.9501643180847168,0.0
60,2,AdaBoost (Discrete),1,0.95,0.84,0.6871244452026302,63.382447242736816,0.0
61,2,AdaBoost (Real),1,0.95,0.724,0.5986206805330004,72.36164975166321,0.0
62,2,Logistic Regression (Penalty = L2),1,0.95,0.808,0.39773448577795095,0.702258825302124,0.0
63,2,Naive Bayes,1,0.95,0.08,0.27041586643733656,0.2723231315612793,0.0
64,2,KNeighbors Classifier,2,0.95,0.8353909465020576,0.7530212497613873,0.5554230213165283,0.0
65,2,SVC Classifier,2,0.95,0.7983539094650206,1.0,0.6708879470825195,0.0
66,2,Decision Tree,2,0.95,0.7860082304526749,0.8335137946861616,0.11809802055358887,0.0
67,2,RandomForest,2,0.95,0.7983539094650206,1.0,0.9432175159454346,0.0
68,2,AdaBoost (Discrete),2,0.95,0.7407407407407407,0.6205568408333527,56.1827449798584,0.0
69,2,AdaBoost (Real),2,0.95,0.6090534979423868,0.47000106156057164,85.79896903038025,0.0
70,2,Logistic Regression (Penalty = L2),2,0.95,0.7860082304526749,0.5234649692628083,0.837486982345581,0.0
71,2,Naive Bayes,2,0.95,0.10699588477366255,0.4563925617881304,0.26512789726257324,0.0
72,3,KNeighbors Classifier,0,0.95,0.8196078431372549,0.6794911240753443,0.537909746170044,0.0
73,3,SVC Classifier,0,0.95,0.7607843137254902,1.0,0.5155894756317139,0.0
74,3,Decision Tree,0,0.95,0.8117647058823529,0.8147302245016738,0.13012957572937012,0.0
75,3,RandomForest,0,0.95,0.7607843137254902,1.0,0.7884252071380615,0.0
76,3,AdaBoost (Discrete),0,0.95,0.792156862745098,0.8846991476935628,55.786274433135986,0.0
77,3,AdaBoost (Real),0,0.95,0.6980392156862745,0.3917854950715044,73.28326654434204,0.0
78,3,Logistic Regression (Penalty = L2),0,0.95,0.7647058823529411,0.3920788795851925,0.7349882125854492,0.0
79,3,Naive Bayes,0,0.95,0.10980392156862745,0.31419291226453727,0.26773786544799805,0.0
80,3,KNeighbors Classifier,1,0.95,0.8,0.7370696708058684,0.4500131607055664,0.0
81,3,SVC Classifier,1,0.95,0.776,1.0,0.5769479274749756,0.0
82,3,Decision Tree,1,0.95,0.808,0.8230297061545414,0.0019791126251220703,0.0
83,3,RandomForest,1,0.95,0.788,0.7745966692414834,0.8462610244750977,0.0
84,3,AdaBoost (Discrete),1,0.95,0.836,0.7311497119186926,57.64795804023743,0.0
85,3,AdaBoost (Real),1,0.95,0.724,0.5986206805330004,72.19479060173035,0.0
86,3,Logistic Regression (Penalty = L2),1,0.95,0.808,0.39773448577795095,0.6763942241668701,0.0
87,3,Naive Bayes,1,0.95,0.08,0.27041586643733656,0.2836451530456543,0.0
88,3,KNeighbors Classifier,2,0.95,0.8353909465020576,0.7530212497613873,0.5331552028656006,0.0
89,3,SVC Classifier,2,0.95,0.7983539094650206,1.0,0.6577353477478027,0.0
90,3,Decision Tree,2,0.95,0.7942386831275721,0.8345695575996205,0.13099002838134766,0.0
91,3,RandomForest,2,0.95,0.7983539094650206,1.0,0.9305737018585205,0.0
92,3,AdaBoost (Discrete),2,0.95,0.7407407407407407,0.6205568408333527,56.361838817596436,0.0
93,3,AdaBoost (Real),2,0.95,0.7037037037037037,0.6780247257222922,74.8042540550232,0.0
94,3,Logistic Regression (Penalty = L2),2,0.95,0.7860082304526749,0.5234649692628083,0.7924807071685791,0.0
95,3,Naive Bayes,2,0.95,0.10699588477366255,0.4563925617881304,0.34935855865478516,0.0
96,4,KNeighbors Classifier,0,0.95,0.8196078431372549,0.6794911240753443,0.6273894309997559,0.0
97,4,SVC Classifier,0,0.95,0.7607843137254902,1.0,0.46775102615356445,0.0
98,4,Decision Tree,0,0.95,0.792156862745098,0.793859049537189,0.0028946399688720703,0.0
99,4,RandomForest,0,0.95,0.7607843137254902,1.0,0.8470058441162109,0.0
100,4,AdaBoost (Discrete),0,0.95,0.792156862745098,0.8846991476935628,54.282302379608154,0.0
101,4,AdaBoost (Real),0,0.95,0.6980392156862745,0.3917854950715044,77.33104181289673,0.0
102,4,Logistic Regression (Penalty = L2),0,0.95,0.7647058823529411,0.3920788795851925,0.9032487869262695,0.0
103,4,Naive Bayes,0,0.95,0.10980392156862745,0.31419291226453727,0.30173492431640625,0.0
104,4,KNeighbors Classifier,1,0.95,0.8,0.7370696708058684,0.5391020774841309,0.0
105,4,SVC Classifier,1,0.95,0.776,1.0,0.703747034072876,0.0
106,4,Decision Tree,1,0.95,0.776,0.9350477571019341,0.13901066780090332,0.0
107,4,RandomForest,1,0.95,0.788,0.7745966692414834,1.10343599319458,0.0
108,4,AdaBoost (Discrete),1,0.95,0.84,0.6871244452026302,62.7681519985199,0.0
109,4,AdaBoost (Real),1,0.95,0.724,0.5986206805330004,85.497713804245,0.0
110,4,Logistic Regression (Penalty = L2),1,0.95,0.808,0.39773448577795095,0.8663392066955566,0.0
111,4,Naive Bayes,1,0.95,0.08,0.27041586643733656,0.16817259788513184,0.0
112,4,KNeighbors Classifier,2,0.95,0.8353909465020576,0.7530212497613873,0.738980770111084,0.0
113,4,SVC Classifier,2,0.95,0.7983539094650206,1.0,0.7290427684783936,0.0
114,4,Decision Tree,2,0.95,0.7489711934156379,0.8286077636583479,0.13903021812438965,0.0
115,4,RandomForest,2,0.95,0.7983539094650206,1.0,0.8361515998840332,0.0
116,4,AdaBoost (Discrete),2,0.95,0.7407407407407407,0.6205568408333527,67.50439786911011,0.0
117,4,AdaBoost (Real),2,0.95,0.7037037037037037,0.6780247257222922,78.65817975997925,0.0
118,4,Logistic Regression (Penalty = L2),2,0.95,0.7860082304526749,0.5234649692628083,0.812563419342041,0.0
119,4,Naive Bayes,2,0.95,0.10699588477366255,0.4563925617881304,0.38444995880126953,0.0
120,5,KNeighbors Classifier,0,0.95,0.8196078431372549,0.6794911240753443,0.6317551136016846,0.0
121,5,SVC Classifier,0,0.95,0.7607843137254902,1.0,0.511732816696167,0.0
122,5,Decision Tree,0,0.95,0.796078431372549,0.927155434073061,0.002057313919067383,0.0
123,5,RandomForest,0,0.95,0.7607843137254902,1.0,1.011944055557251,0.0
124,5,AdaBoost (Discrete),0,0.95,0.7725490196078432,0.9840343533044587,60.07002377510071,0.0
125,5,AdaBoost (Real),0,0.95,0.6980392156862745,0.3917854950715044,71.74401068687439,0.0
126,5,Logistic Regression (Penalty = L2),0,0.95,0.7647058823529411,0.3920788795851925,0.8975265026092529,0.0
127,5,Naive Bayes,0,0.95,0.10980392156862745,0.31419291226453727,0.23342609405517578,0.0
128,5,KNeighbors Classifier,1,0.95,0.8,0.7370696708058684,0.4638373851776123,0.0
129,5,SVC Classifier,1,0.95,0.776,1.0,0.4643518924713135,0.0
130,5,Decision Tree,1,0.95,0.784,0.9363473537531213,0.0028781890869140625,0.0
131,5,RandomForest,1,0.95,0.788,0.7745966692414834,0.9425649642944336,0.0
132,5,AdaBoost (Discrete),1,0.95,0.836,0.7311497119186926,53.092036485672,0.0
133,5,AdaBoost (Real),1,0.95,0.724,0.5986206805330004,70.43572235107422,0.0
134,5,Logistic Regression (Penalty = L2),1,0.95,0.808,0.39773448577795095,0.9647841453552246,0.0
135,5,Naive Bayes,1,0.95,0.08,0.27041586643733656,0.24756550788879395,0.0
136,5,KNeighbors Classifier,2,0.95,0.8353909465020576,0.7530212497613873,0.5915853977203369,0.0
137,5,SVC Classifier,2,0.95,0.7983539094650206,1.0,0.47644901275634766,0.0
138,5,Decision Tree,2,0.95,0.7530864197530864,0.9718242357120672,0.11477065086364746,0.0
139,5,RandomForest,2,0.95,0.7983539094650206,1.0,0.8270502090454102,0.0
140,5,AdaBoost (Discrete),2,0.95,0.7407407407407407,0.6205568408333527,56.8083553314209,0.0
141,5,AdaBoost (Real),2,0.95,0.6255144032921811,0.594092070096866,71.77160096168518,0.0
142,5,Logistic Regression (Penalty = L2),2,0.95,0.7860082304526749,0.5234649692628083,0.7871208190917969,0.0
143,5,Naive Bayes,2,0.95,0.10699588477366255,0.4563925617881304,0.24248790740966797,0.0
144,6,KNeighbors Classifier,0,0.95,0.8196078431372549,0.6794911240753443,0.5950393676757812,0.0
145,6,SVC Classifier,0,0.95,0.7607843137254902,1.0,0.5174062252044678,0.0
146,6,Decision Tree,0,0.95,0.8509803921568627,0.9355832686912302,0.0028023719787597656,0.0
147,6,RandomForest,0,0.95,0.7607843137254902,1.0,0.8271269798278809,0.0
148,6,AdaBoost (Discrete),0,0.95,0.792156862745098,0.8846991476935628,56.37047863006592,0.0
149,6,AdaBoost (Real),0,0.95,0.6980392156862745,0.3917854950715044,70.14387559890747,0.0
150,6,Logistic Regression (Penalty = L2),0,0.95,0.7647058823529411,0.3920788795851925,0.8451786041259766,0.0
151,6,Naive Bayes,0,0.95,0.10980392156862745,0.31419291226453727,0.23725605010986328,0.0
152,6,KNeighbors Classifier,1,0.95,0.8,0.7370696708058684,0.5524110794067383,0.0
153,6,SVC Classifier,1,0.95,0.776,1.0,0.6288135051727295,0.0
154,6,Decision Tree,1,0.95,0.764,0.7993682056454532,0.11891460418701172,0.0
155,6,RandomForest,1,0.95,0.788,0.7745966692414834,0.96075439453125,0.0
156,6,AdaBoost (Discrete),1,0.95,0.84,0.6871244452026302,58.93871450424194,0.0
157,6,AdaBoost (Real),1,0.95,0.724,0.5986206805330004,91.78152346611023,0.0
158,6,Logistic Regression (Penalty = L2),1,0.95,0.808,0.39773448577795095,1.1859450340270996,0.0
159,6,Naive Bayes,1,0.95,0.08,0.27041586643733656,0.28536295890808105,0.0
160,6,KNeighbors Classifier,2,0.95,0.8353909465020576,0.7530212497613873,0.7810854911804199,0.0
161,6,SVC Classifier,2,0.95,0.7983539094650206,1.0,0.7864737510681152,0.0
162,6,Decision Tree,2,0.95,0.7818930041152263,0.9767617809466458,0.1672508716583252,0.0
163,6,RandomForest,2,0.95,0.7983539094650206,1.0,1.2803874015808105,0.0
164,6,AdaBoost (Discrete),2,0.95,0.7448559670781894,0.6210927291676543,79.09544515609741,0.0
165,6,AdaBoost (Real),2,0.95,0.7037037037037037,0.6780247257222922,84.43712019920349,0.0
166,6,Logistic Regression (Penalty = L2),2,0.95,0.7860082304526749,0.5234649692628083,0.7854163646697998,0.0
167,6,Naive Bayes,2,0.95,0.10699588477366255,0.4563925617881304,0.2892458438873291,0.0
168,7,KNeighbors Classifier,0,0.95,0.8196078431372549,0.6794911240753443,0.4516265392303467,0.0
169,7,SVC Classifier,0,0.95,0.7607843137254902,1.0,0.706956148147583,0.0
170,7,Decision Tree,0,0.95,0.8235294117647058,0.8161735394704847,0.15356826782226562,0.0
171,7,RandomForest,0,0.95,0.7607843137254902,1.0,0.8683838844299316,0.0
172,7,AdaBoost (Discrete),0,0.95,0.792156862745098,0.8846991476935628,66.19626832008362,0.0
173,7,AdaBoost (Real),0,0.95,0.6980392156862745,0.3917854950715044,88.96117401123047,0.0
174,7,Logistic Regression (Penalty = L2),0,0.95,0.7647058823529411,0.3920788795851925,0.9902658462524414,0.0
175,7,Naive Bayes,0,0.95,0.10980392156862745,0.31419291226453727,0.30336451530456543,0.0
176,7,KNeighbors Classifier,1,0.95,0.8,0.7370696708058684,0.5501959323883057,0.0
177,7,SVC Classifier,1,0.95,0.776,1.0,0.6061265468597412,0.0
178,7,Decision Tree,1,0.95,0.84,0.9450625684367311,0.15097594261169434,0.0
179,7,RandomForest,1,0.95,0.788,0.7745966692414834,1.088244915008545,0.0
180,7,AdaBoost (Discrete),1,0.95,0.836,0.7311497119186926,61.357948541641235,0.0
181,7,AdaBoost (Real),1,0.95,0.724,0.5986206805330004,73.94423937797546,0.0
182,7,Logistic Regression (Penalty = L2),1,0.95,0.808,0.39773448577795095,0.7714617252349854,0.0
183,7,Naive Bayes,1,0.95,0.08,0.27041586643733656,0.2462618350982666,0.0
184,7,KNeighbors Classifier,2,0.95,0.8353909465020576,0.7530212497613873,0.6157441139221191,0.0
185,7,SVC Classifier,2,0.95,0.7983539094650206,1.0,0.6820487976074219,0.0
186,7,Decision Tree,2,0.95,0.7736625514403292,0.8319072298945556,0.13907074928283691,0.0
187,7,RandomForest,2,0.95,0.7983539094650206,1.0,0.9913046360015869,0.0
188,7,AdaBoost (Discrete),2,0.95,0.7407407407407407,0.6205568408333527,62.175978660583496,0.0
189,7,AdaBoost (Real),2,0.95,0.5843621399176955,0.6174463023812043,86.22289299964905,0.0
190,7,Logistic Regression (Penalty = L2),2,0.95,0.7860082304526749,0.5234649692628083,1.0856609344482422,0.0
191,7,Naive Bayes,2,0.95,0.10699588477366255,0.4563925617881304,0.32744717597961426,0.0
192,8,KNeighbors Classifier,0,0.95,0.8196078431372549,0.6794911240753443,0.7781524658203125,0.0
193,8,SVC Classifier,0,0.95,0.7607843137254902,1.0,0.6248307228088379,0.0
194,8,Decision Tree,0,0.95,0.8509803921568627,0.9355832686912302,0.0022830963134765625,0.0
195,8,RandomForest,0,0.95,0.7607843137254902,1.0,0.9404375553131104,0.0
196,8,AdaBoost (Discrete),0,0.95,0.792156862745098,0.8846991476935628,70.13245630264282,0.0
197,8,AdaBoost (Real),0,0.95,0.6980392156862745,0.3917854950715044,65.27071905136108,0.0
198,8,Logistic Regression (Penalty = L2),0,0.95,0.7647058823529411,0.3920788795851925,0.5729649066925049,0.0
199,8,Naive Bayes,0,0.95,0.10980392156862745,0.31419291226453727,0.16100454330444336,0.0
200,8,KNeighbors Classifier,1,0.95,0.8,0.7370696708058684,0.35773205757141113,0.0
201,8,SVC Classifier,1,0.95,0.776,1.0,0.5346016883850098,0.0
202,8,Decision Tree,1,0.95,0.8,0.9389040604579058,0.11076140403747559,0.0
203,8,RandomForest,1,0.95,0.788,0.7745966692414834,0.8135485649108887,0.0
204,8,AdaBoost (Discrete),1,0.95,0.836,0.7311497119186926,64.24020600318909,0.0
205,8,AdaBoost (Real),1,0.95,0.724,0.5986206805330004,74.36342930793762,0.0
206,8,Logistic Regression (Penalty = L2),1,0.95,0.808,0.39773448577795095,0.719763994216919,0.0
207,8,Naive Bayes,1,0.95,0.08,0.27041586643733656,0.2908768653869629,0.0
208,8,KNeighbors Classifier,2,0.95,0.8353909465020576,0.7530212497613873,0.6277167797088623,0.0
209,8,SVC Classifier,2,0.95,0.7983539094650206,1.0,0.5503056049346924,0.0
210,8,Decision Tree,2,0.95,0.7530864197530864,0.8291659387103116,0.12686967849731445,0.0
211,8,RandomForest,2,0.95,0.7983539094650206,1.0,0.7781181335449219,0.0
212,8,AdaBoost (Discrete),2,0.95,0.7407407407407407,0.6205568408333527,48.33108401298523,0.0
213,8,AdaBoost (Real),2,0.95,0.6090534979423868,0.47000106156057164,65.66414022445679,0.0
214,8,Logistic Regression (Penalty = L2),2,0.95,0.7860082304526749,0.5234649692628083,0.7620244026184082,0.0
215,8,Naive Bayes,2,0.95,0.10699588477366255,0.4563925617881304,0.3412055969238281,0.0
