,feat_set_id,classifier,fold_id,feat_th,score,geo_score,exec_t,geo_score_woz
0,0,KNeighbors Classifier,0,0.5,0.9552238805970149,0.9547759685382275,2.492640972137451,0.9547759685382275
1,0,SVC Classifier,0,0.5,0.9298507462686567,0.9290418220330434,2.0226285457611084,0.9290418220330434
2,0,Decision Tree,0,0.5,0.8477611940298507,0.8433135412456169,0.08293843269348145,0.8433135412456169
3,0,RandomForest,0,0.5,0.7059701492537314,0.7582797160287991,0.28188109397888184,0.0
4,0,AdaBoost (Discrete),0,0.5,0.9388059701492537,0.9377432229835145,77.98881721496582,0.9377432229835145
5,0,AdaBoost (Real),0,0.5,0.8029850746268656,0.7950070274094017,70.70456194877625,0.7950070274094017
6,0,Logistic Regression (Penalty = L2),0,0.5,0.9716417910447761,0.9713310234785885,2.0709991455078125,0.9713310234785885
7,0,Naive Bayes,0,0.5,0.8940298507462686,0.8926802877042604,0.15683436393737793,0.8926802877042604
8,0,KNeighbors Classifier,1,0.5,0.9507462686567164,0.950394935266509,2.1816470623016357,0.950394935266509
9,0,SVC Classifier,1,0.5,0.9283582089552239,0.9278807904655327,1.967970609664917,0.9278807904655327
10,0,Decision Tree,1,0.5,0.844776119402985,0.8420837275469321,0.08425450325012207,0.8420837275469321
11,0,RandomForest,1,0.5,0.664179104477612,0.5564364381246063,0.30217933654785156,0.5564364381246063
12,0,AdaBoost (Discrete),1,0.5,0.9388059701492537,0.9380767703752427,77.708829164505,0.9380767703752427
13,0,AdaBoost (Real),1,0.5,0.3164179104477612,0.1846814555826401,75.95250153541565,0.0
14,0,Logistic Regression (Penalty = L2),1,0.5,0.9656716417910448,0.9656244611808118,2.047799587249756,0.9656244611808118
15,0,Naive Bayes,1,0.5,0.908955223880597,0.9077848967732793,0.14735865592956543,0.9077848967732793
16,0,KNeighbors Classifier,2,0.5,0.953030303030303,0.952661309699017,2.2770962715148926,0.952661309699017
17,0,SVC Classifier,2,0.5,0.9257575757575758,0.925134504645198,2.030240297317505,0.925134504645198
18,0,Decision Tree,2,0.5,0.8681818181818182,0.8676247534848276,0.05904388427734375,0.8676247534848276
19,0,RandomForest,2,0.5,0.7121212121212122,0.580712336186153,0.24562931060791016,0.580712336186153
20,0,AdaBoost (Discrete),2,0.5,0.9181818181818182,0.9153965696555689,75.10094285011292,0.9153965696555689
21,0,AdaBoost (Real),2,0.5,0.553030303030303,0.34839850199907113,70.448739528656,0.34839850199907113
22,0,Logistic Regression (Penalty = L2),2,0.5,0.9727272727272728,0.9724947068497745,2.2568650245666504,0.9724947068497745
23,0,Naive Bayes,2,0.5,0.8924242424242425,0.8913054164710754,0.1423797607421875,0.8913054164710754
24,1,KNeighbors Classifier,0,0.5,0.9686567164179104,0.9683467380698378,2.1850593090057373,0.9683467380698378
25,1,SVC Classifier,0,0.5,0.9164179104477612,0.9140896250037482,2.0683398246765137,0.9140896250037482
26,1,Decision Tree,0,0.5,0.844776119402985,0.8425283936352848,0.1102147102355957,0.8425283936352848
27,1,RandomForest,0,0.5,0.6537313432835821,0.460371897321887,0.30835533142089844,0.460371897321887
28,1,AdaBoost (Discrete),0,0.5,0.9522388059701492,0.9517757772216863,91.32658123970032,0.9517757772216863
29,1,AdaBoost (Real),0,0.5,0.753731343283582,0.7181093498069119,77.62332081794739,0.7181093498069119
30,1,Logistic Regression (Penalty = L2),0,0.5,0.9776119402985075,0.9773772659446601,1.5951061248779297,0.9773772659446601
31,1,Naive Bayes,0,0.5,0.8970149253731343,0.8949265474205829,0.16576361656188965,0.8949265474205829
32,1,KNeighbors Classifier,1,0.5,0.9447761194029851,0.9441450250125006,1.903700590133667,0.9441450250125006
33,1,SVC Classifier,1,0.5,0.9223880597014925,0.921764239806994,1.909168004989624,0.921764239806994
34,1,Decision Tree,1,0.5,0.8328358208955224,0.830744839572539,0.07247209548950195,0.830744839572539
35,1,RandomForest,1,0.5,0.6611940298507463,0.5562737245245858,0.2949349880218506,0.5562737245245858
36,1,AdaBoost (Discrete),1,0.5,0.9522388059701492,0.9520564555374135,83.18309712409973,0.9520564555374135
37,1,AdaBoost (Real),1,0.5,0.2865671641791045,0.24820426079838953,77.08563876152039,0.0
38,1,Logistic Regression (Penalty = L2),1,0.5,0.9761194029850746,0.9760241480342179,1.5718834400177002,0.9760241480342179
39,1,Naive Bayes,1,0.5,0.9074626865671642,0.9064850278339566,0.15941858291625977,0.9064850278339566
40,1,KNeighbors Classifier,2,0.5,0.9590909090909091,0.9586054384197624,1.9576067924499512,0.9586054384197624
41,1,SVC Classifier,2,0.5,0.9303030303030303,0.9295034025320328,1.9189040660858154,0.9295034025320328
42,1,Decision Tree,2,0.5,0.8181818181818182,0.8165764635620475,0.09439539909362793,0.8165764635620475
43,1,RandomForest,2,0.5,0.706060606060606,0.5509279283258957,0.23813962936401367,0.5509279283258957
44,1,AdaBoost (Discrete),2,0.5,0.9075757575757576,0.90638348891217,81.23467421531677,0.90638348891217
45,1,AdaBoost (Real),2,0.5,0.7196969696969697,0.6613626803785332,66.10864448547363,0.6613626803785332
46,1,Logistic Regression (Penalty = L2),2,0.5,0.9727272727272728,0.9723981381802977,1.646256923675537,0.9723981381802977
47,1,Naive Bayes,2,0.5,0.906060606060606,0.9052976996601964,0.1895592212677002,0.9052976996601964
48,2,KNeighbors Classifier,0,0.5,0.9641791044776119,0.963846557852829,2.175785779953003,0.963846557852829
49,2,SVC Classifier,0,0.5,0.9373134328358209,0.9359473941419338,1.6105542182922363,0.9359473941419338
50,2,Decision Tree,0,0.5,0.8641791044776119,0.8596636216644619,0.077728271484375,0.8596636216644619
51,2,RandomForest,0,0.5,0.7014925373134329,0.5848948561205041,0.2526252269744873,0.5848948561205041
52,2,AdaBoost (Discrete),0,0.5,0.9567164179104478,0.9562128290265934,70.90894603729248,0.9562128290265934
53,2,AdaBoost (Real),0,0.5,0.8134328358208955,0.8037566464756377,61.99836874008179,0.8037566464756377
54,2,Logistic Regression (Penalty = L2),0,0.5,0.9731343283582089,0.9728388866125981,1.625220537185669,0.9728388866125981
55,2,Naive Bayes,0,0.5,0.9134328358208955,0.9119260686959547,0.15935039520263672,0.9119260686959547
56,2,KNeighbors Classifier,1,0.5,0.9537313432835821,0.9533899584465657,1.676764965057373,0.9533899584465657
57,2,SVC Classifier,1,0.5,0.9402985074626866,0.9396040412156014,1.4329001903533936,0.9396040412156014
58,2,Decision Tree,1,0.5,0.8462686567164179,0.842871843271865,0.0582578182220459,0.842871843271865
59,2,RandomForest,1,0.5,0.7492537313432835,0.6765938521988609,0.21702837944030762,0.6765938521988609
60,2,AdaBoost (Discrete),1,0.5,0.9462686567164179,0.9459107964330752,65.4062750339508,0.9459107964330752
61,2,AdaBoost (Real),1,0.5,0.2880597014925373,0.2836426052757786,69.05683541297913,0.0
62,2,Logistic Regression (Penalty = L2),1,0.5,0.9761194029850746,0.9760003495328472,1.5479636192321777,0.9760003495328472
63,2,Naive Bayes,1,0.5,0.9328358208955224,0.9322595765465608,0.14331841468811035,0.9322595765465608
64,2,KNeighbors Classifier,2,0.5,0.9621212121212122,0.9617094424405732,1.7795281410217285,0.9617094424405732
65,2,SVC Classifier,2,0.5,0.9454545454545454,0.9449363909742976,1.5633883476257324,0.9449363909742976
66,2,Decision Tree,2,0.5,0.85,0.8489006305500689,0.06205868721008301,0.8489006305500689
67,2,RandomForest,2,0.5,0.740909090909091,0.665744884569576,0.24079418182373047,0.665744884569576
68,2,AdaBoost (Discrete),2,0.5,0.9318181818181818,0.9306295739067724,63.083701372146606,0.9306295739067724
69,2,AdaBoost (Real),2,0.5,0.6333333333333333,0.5790396654508337,55.25963568687439,0.5790396654508337
70,2,Logistic Regression (Penalty = L2),2,0.5,0.9742424242424242,0.9741003063433695,1.309391975402832,0.9741003063433695
71,2,Naive Bayes,2,0.5,0.9181818181818182,0.9171086346009648,0.14104294776916504,0.9171086346009648
72,3,KNeighbors Classifier,0,0.5,0.9597014925373134,0.9591106628740989,1.8043551445007324,0.9591106628740989
73,3,SVC Classifier,0,0.5,0.9283582089552239,0.9266243093083546,1.5724639892578125,0.9266243093083546
74,3,Decision Tree,0,0.5,0.808955223880597,0.8048643513897522,0.06459760665893555,0.8048643513897522
75,3,RandomForest,0,0.5,0.7507462686567165,0.7212056539571805,0.22115397453308105,0.7212056539571805
76,3,AdaBoost (Discrete),0,0.5,0.9537313432835821,0.9532050660486239,58.9940664768219,0.9532050660486239
77,3,AdaBoost (Real),0,0.5,0.8895522388059701,0.8887480446892421,54.601969957351685,0.8887480446892421
78,3,Logistic Regression (Penalty = L2),0,0.5,0.9701492537313433,0.969709205070196,1.3668787479400635,0.969709205070196
79,3,Naive Bayes,0,0.5,0.9,0.8985792577022925,0.17082667350769043,0.8985792577022925
80,3,KNeighbors Classifier,1,0.5,0.9477611940298507,0.9471564468276928,1.7185351848602295,0.9471564468276928
81,3,SVC Classifier,1,0.5,0.9298507462686567,0.9290064917200798,1.5193657875061035,0.9290064917200798
82,3,Decision Tree,1,0.5,0.8298507462686567,0.8274515556371733,0.07759380340576172,0.8274515556371733
83,3,RandomForest,1,0.5,0.7059701492537314,0.6481538361480128,0.20025062561035156,0.6481538361480128
84,3,AdaBoost (Discrete),1,0.5,0.9328358208955224,0.9322752141954567,58.04077386856079,0.9322752141954567
85,3,AdaBoost (Real),1,0.5,0.4373134328358209,0.28616921592169386,51.81019401550293,0.0
86,3,Logistic Regression (Penalty = L2),1,0.5,0.9701492537313433,0.969940355356154,1.1664998531341553,0.969940355356154
87,3,Naive Bayes,1,0.5,0.9164179104477612,0.9156111725431423,0.17321062088012695,0.9156111725431423
88,3,KNeighbors Classifier,2,0.5,0.9606060606060606,0.9601687549743303,1.5687971115112305,0.9601687549743303
89,3,SVC Classifier,2,0.5,0.9348484848484848,0.9341758770697127,1.3034226894378662,0.9341758770697127
90,3,Decision Tree,2,0.5,0.853030303030303,0.8507232037710635,0.04514575004577637,0.8507232037710635
91,3,RandomForest,2,0.5,0.7515151515151515,0.6969953552342946,0.16348838806152344,0.6969953552342946
92,3,AdaBoost (Discrete),2,0.5,0.9272727272727272,0.9265030965998656,54.63550019264221,0.9265030965998656
93,3,AdaBoost (Real),2,0.5,0.553030303030303,0.6264175347306612,47.417827129364014,0.0
94,3,Logistic Regression (Penalty = L2),2,0.5,0.9727272727272728,0.9725659806047632,1.2851533889770508,0.9725659806047632
95,3,Naive Bayes,2,0.5,0.9151515151515152,0.9148180149223133,0.14001965522766113,0.9148180149223133
96,4,KNeighbors Classifier,0,0.5,0.9477611940298507,0.9469055775401586,0.6120445728302002,0.9469055775401586
97,4,SVC Classifier,0,0.5,0.8537313432835821,0.8469961586324113,0.8200874328613281,0.8469961586324113
98,4,Decision Tree,0,0.5,0.7895522388059701,0.7860033339434048,0.03212141990661621,0.7860033339434048
99,4,RandomForest,0,0.5,0.5388059701492537,0.33804998390112906,0.15448546409606934,0.33804998390112906
100,4,AdaBoost (Discrete),0,0.5,0.9343283582089552,0.9331697220051851,32.67124080657959,0.9331697220051851
101,4,AdaBoost (Real),0,0.5,0.7477611940298508,0.7299867951482079,30.463794946670532,0.7299867951482079
102,4,Logistic Regression (Penalty = L2),0,0.5,0.9656716417910448,0.9654608365688956,0.6618461608886719,0.9654608365688956
103,4,Naive Bayes,0,0.5,0.8611940298507462,0.8595592053586529,0.08575010299682617,0.8595592053586529
104,4,KNeighbors Classifier,1,0.5,0.9417910447761194,0.9411941751850796,0.5496437549591064,0.9411941751850796
105,4,SVC Classifier,1,0.5,0.8776119402985074,0.8742731327787066,0.8293564319610596,0.8742731327787066
106,4,Decision Tree,1,0.5,0.8313432835820895,0.829038226484323,0.033827781677246094,0.829038226484323
107,4,RandomForest,1,0.5,0.5104477611940299,0.33966036259805527,0.15451717376708984,0.0
108,4,AdaBoost (Discrete),1,0.5,0.9164179104477612,0.9156258589976192,32.001187324523926,0.9156258589976192
109,4,AdaBoost (Real),1,0.5,0.4880597014925373,0.33319045126580277,32.34105062484741,0.0
110,4,Logistic Regression (Penalty = L2),1,0.5,0.9686567164179104,0.9683933055158714,0.7973244190216064,0.9683933055158714
111,4,Naive Bayes,1,0.5,0.8701492537313433,0.8685914003580147,0.10238790512084961,0.8685914003580147
112,4,KNeighbors Classifier,2,0.5,0.9454545454545454,0.9448877723401797,0.5562825202941895,0.9448877723401797
113,4,SVC Classifier,2,0.5,0.8666666666666667,0.8611572707649457,0.9884145259857178,0.8611572707649457
114,4,Decision Tree,2,0.5,0.8212121212121212,0.8199680956194767,0.03780102729797363,0.8199680956194767
115,4,RandomForest,2,0.5,0.5863636363636363,0.4335639664944267,0.18746685981750488,0.0
116,4,AdaBoost (Discrete),2,0.5,0.9166666666666666,0.9151924194879962,32.78173542022705,0.9151924194879962
117,4,AdaBoost (Real),2,0.5,0.5196969696969697,0.4032804900933699,32.976288080215454,0.4032804900933699
118,4,Logistic Regression (Penalty = L2),2,0.5,0.9727272727272728,0.972542958839484,0.7298173904418945,0.972542958839484
119,4,Naive Bayes,2,0.5,0.8712121212121212,0.8699793090902651,0.0976102352142334,0.8699793090902651
120,5,KNeighbors Classifier,0,0.5,0.9626865671641791,0.9623305699976207,0.8679337501525879,0.9623305699976207
121,5,SVC Classifier,0,0.5,0.9164179104477612,0.9142925303162656,0.929603099822998,0.9142925303162656
122,5,Decision Tree,0,0.5,0.8462686567164179,0.8445718132144856,0.03599905967712402,0.8445718132144856
123,5,RandomForest,0,0.5,0.6701492537313433,0.6716659461759226,0.16846179962158203,0.0
124,5,AdaBoost (Discrete),0,0.5,0.935820895522388,0.9343371406979757,34.67690634727478,0.9343371406979757
125,5,AdaBoost (Real),0,0.5,0.7776119402985074,0.7632861229508618,30.290305137634277,0.7632861229508618
126,5,Logistic Regression (Penalty = L2),0,0.5,0.9582089552238806,0.9574539845033058,0.7635335922241211,0.9574539845033058
127,5,Naive Bayes,0,0.5,0.8970149253731343,0.8949348581303761,0.09948110580444336,0.8949348581303761
128,5,KNeighbors Classifier,1,0.5,0.9522388059701492,0.9517712014975953,0.7769782543182373,0.9517712014975953
129,5,SVC Classifier,1,0.5,0.9253731343283582,0.9246432764744639,0.9317855834960938,0.9246432764744639
130,5,Decision Tree,1,0.5,0.8119402985074626,0.8081672322731923,0.03235983848571777,0.8081672322731923
131,5,RandomForest,1,0.5,0.5417910447761194,0.5050619114169114,0.13204407691955566,0.0
132,5,AdaBoost (Discrete),1,0.5,0.9328358208955224,0.9324524443432972,31.60542368888855,0.9324524443432972
133,5,AdaBoost (Real),1,0.5,0.3119402985074627,0.24958150986458777,32.13854122161865,0.0
134,5,Logistic Regression (Penalty = L2),1,0.5,0.9611940298507463,0.961051772531495,0.7946920394897461,0.961051772531495
135,5,Naive Bayes,1,0.5,0.9014925373134328,0.900474064788636,0.09080696105957031,0.900474064788636
136,5,KNeighbors Classifier,2,0.5,0.9621212121212122,0.9618034098564884,0.7876582145690918,0.9618034098564884
137,5,SVC Classifier,2,0.5,0.9181818181818182,0.9171197014498645,0.8965656757354736,0.9171197014498645
138,5,Decision Tree,2,0.5,0.8454545454545455,0.8443000797558657,0.03274226188659668,0.8443000797558657
139,5,RandomForest,2,0.5,0.7,0.5793476789418537,0.1638493537902832,0.5793476789418537
140,5,AdaBoost (Discrete),2,0.5,0.9318181818181818,0.9309567717498374,32.006097078323364,0.9309567717498374
141,5,AdaBoost (Real),2,0.5,0.5606060606060606,0.3044944404695136,30.86179494857788,0.3044944404695136
142,5,Logistic Regression (Penalty = L2),2,0.5,0.9727272727272728,0.9723743953827989,0.7575602531433105,0.9723743953827989
143,5,Naive Bayes,2,0.5,0.9045454545454545,0.9026800870522859,0.0773618221282959,0.9026800870522859
144,6,KNeighbors Classifier,0,0.5,0.9417910447761194,0.9405013482371736,0.6190412044525146,0.9405013482371736
145,6,SVC Classifier,0,0.5,0.8805970149253731,0.8778878056595153,0.8484010696411133,0.8778878056595153
146,6,Decision Tree,0,0.5,0.8313432835820895,0.8277767196121252,0.05738258361816406,0.8277767196121252
147,6,RandomForest,0,0.5,0.682089552238806,0.6310357855055154,0.15123629570007324,0.6310357855055154
148,6,AdaBoost (Discrete),0,0.5,0.9343283582089552,0.9331835211739845,27.326189756393433,0.9331835211739845
149,6,AdaBoost (Real),0,0.5,0.8880597014925373,0.8866271079753125,26.66064763069153,0.8866271079753125
150,6,Logistic Regression (Penalty = L2),0,0.5,0.9597014925373134,0.9592757418801393,0.7046053409576416,0.9592757418801393
151,6,Naive Bayes,0,0.5,0.8716417910447761,0.8695053411507758,0.09107184410095215,0.8695053411507758
152,6,KNeighbors Classifier,1,0.5,0.9373134328358209,0.9367361896696178,0.3749358654022217,0.9367361896696178
153,6,SVC Classifier,1,0.5,0.8955223880597015,0.8941077461295591,0.8559110164642334,0.8941077461295591
154,6,Decision Tree,1,0.5,0.817910447761194,0.8154640391908643,0.03198862075805664,0.8154640391908643
155,6,RandomForest,1,0.5,0.6462686567164179,0.6530274302594435,0.16867637634277344,0.0
156,6,AdaBoost (Discrete),1,0.5,0.9328358208955224,0.932232405436204,25.845999240875244,0.932232405436204
157,6,AdaBoost (Real),1,0.5,0.6626865671641791,0.6174210827235677,25.880269050598145,0.6174210827235677
158,6,Logistic Regression (Penalty = L2),1,0.5,0.9626865671641791,0.9624959226030382,0.7303054332733154,0.9624959226030382
159,6,Naive Bayes,1,0.5,0.8805970149253731,0.8793988712382479,0.06744146347045898,0.8793988712382479
160,6,KNeighbors Classifier,2,0.5,0.9484848484848485,0.9480197979935956,0.5192434787750244,0.9480197979935956
161,6,SVC Classifier,2,0.5,0.8909090909090909,0.8887790803193837,0.7143328189849854,0.8887790803193837
162,6,Decision Tree,2,0.5,0.8121212121212121,0.8106365006603716,0.007238626480102539,0.8106365006603716
163,6,RandomForest,2,0.5,0.593939393939394,0.6299141262591477,0.15909528732299805,0.0
164,6,AdaBoost (Discrete),2,0.5,0.9242424242424242,0.9234031304175014,26.36637020111084,0.9234031304175014
165,6,AdaBoost (Real),2,0.5,0.5651515151515152,0.4636086905985238,26.34262180328369,0.4636086905985238
166,6,Logistic Regression (Penalty = L2),2,0.5,0.9712121212121212,0.9710592644887862,0.7220108509063721,0.9710592644887862
167,6,Naive Bayes,2,0.5,0.8787878787878788,0.8772538011399483,0.08415794372558594,0.8772538011399483
168,7,KNeighbors Classifier,0,0.5,0.9567164179104478,0.9559227960573005,0.6568114757537842,0.9559227960573005
169,7,SVC Classifier,0,0.5,0.8805970149253731,0.877536576858976,0.8113012313842773,0.877536576858976
170,7,Decision Tree,0,0.5,0.8641791044776119,0.8625565889840292,0.06747031211853027,0.8625565889840292
171,7,RandomForest,0,0.5,0.6776119402985075,0.6410042265022092,0.16313600540161133,0.6410042265022092
172,7,AdaBoost (Discrete),0,0.5,0.9432835820895522,0.9423824754012455,32.33162236213684,0.9423824754012455
173,7,AdaBoost (Real),0,0.5,0.8537313432835821,0.8498576982352488,27.818857669830322,0.8498576982352488
174,7,Logistic Regression (Penalty = L2),0,0.5,0.9716417910447761,0.9714000370182474,0.5676929950714111,0.9714000370182474
175,7,Naive Bayes,0,0.5,0.8880597014925373,0.8861665045495932,0.06137585639953613,0.8861665045495932
176,7,KNeighbors Classifier,1,0.5,0.9522388059701492,0.9519101091165171,0.6645393371582031,0.9519101091165171
177,7,SVC Classifier,1,0.5,0.8985074626865671,0.8969952101007709,0.9102792739868164,0.8969952101007709
178,7,Decision Tree,1,0.5,0.8313432835820895,0.8284091268099302,0.034742116928100586,0.8284091268099302
179,7,RandomForest,1,0.5,0.6611940298507463,0.6791194814581212,0.15867137908935547,0.0
180,7,AdaBoost (Discrete),1,0.5,0.9194029850746268,0.9181334931063752,28.76928400993347,0.9181334931063752
181,7,AdaBoost (Real),1,0.5,0.5492537313432836,0.3886308821979444,28.874615907669067,0.3886308821979444
182,7,Logistic Regression (Penalty = L2),1,0.5,0.9731343283582089,0.9730009252120951,0.5515913963317871,0.9730009252120951
183,7,Naive Bayes,1,0.5,0.908955223880597,0.9080156354923027,0.06060791015625,0.9080156354923027
184,7,KNeighbors Classifier,2,0.5,0.9484848484848485,0.9477348415389407,0.617110013961792,0.9477348415389407
185,7,SVC Classifier,2,0.5,0.9015151515151515,0.9006956199612384,0.7150511741638184,0.9006956199612384
186,7,Decision Tree,2,0.5,0.8348484848484848,0.8325866219497076,0.0417933464050293,0.8325866219497076
187,7,RandomForest,2,0.5,0.7484848484848485,0.7325579180057763,0.11990118026733398,0.7325579180057763
188,7,AdaBoost (Discrete),2,0.5,0.9151515151515152,0.91369080298675,28.492098331451416,0.91369080298675
189,7,AdaBoost (Real),2,0.5,0.41515151515151516,0.38591843703619466,26.840181589126587,0.0
190,7,Logistic Regression (Penalty = L2),2,0.5,0.9651515151515152,0.964841322155173,0.6253795623779297,0.964841322155173
191,7,Naive Bayes,2,0.5,0.9075757575757576,0.9070022856325506,0.08399510383605957,0.9070022856325506
192,8,KNeighbors Classifier,0,0.5,0.9597014925373134,0.9589942574931827,0.6479055881500244,0.9589942574931827
193,8,SVC Classifier,0,0.5,0.8925373134328358,0.8893642924568144,0.8030996322631836,0.8893642924568144
194,8,Decision Tree,0,0.5,0.8298507462686567,0.8241231427140099,0.05613398551940918,0.8241231427140099
195,8,RandomForest,0,0.5,0.6044776119402985,0.5068910009340849,0.11617422103881836,0.5068910009340849
196,8,AdaBoost (Discrete),0,0.5,0.9388059701492537,0.9381360934813923,28.771152019500732,0.9381360934813923
197,8,AdaBoost (Real),0,0.5,0.5880597014925373,0.4445315915437043,27.128835916519165,0.4445315915437043
198,8,Logistic Regression (Penalty = L2),0,0.5,0.9671641791044776,0.9669159418029492,0.672356128692627,0.9669159418029492
199,8,Naive Bayes,0,0.5,0.8820895522388059,0.8800399441207337,0.08443403244018555,0.8800399441207337
200,8,KNeighbors Classifier,1,0.5,0.9522388059701492,0.9517712014975953,0.7023899555206299,0.9517712014975953
201,8,SVC Classifier,1,0.5,0.9119402985074627,0.9104541369041232,0.9102833271026611,0.9104541369041232
202,8,Decision Tree,1,0.5,0.8432835820895522,0.8416479863529504,0.03403306007385254,0.8416479863529504
203,8,RandomForest,1,0.5,0.7119402985074627,0.676494635665477,0.11933135986328125,0.676494635665477
204,8,AdaBoost (Discrete),1,0.5,0.9343283582089552,0.9339396091519415,29.73460555076599,0.9339396091519415
205,8,AdaBoost (Real),1,0.5,0.7373134328358208,0.7229493662237968,26.717317819595337,0.7229493662237968
206,8,Logistic Regression (Penalty = L2),1,0.5,0.9611940298507463,0.961051772531495,0.5936751365661621,0.961051772531495
207,8,Naive Bayes,1,0.5,0.8985074626865671,0.8972997157411945,0.08650732040405273,0.8972997157411945
208,8,KNeighbors Classifier,2,0.5,0.95,0.9494666952451866,0.6956136226654053,0.9494666952451866
209,8,SVC Classifier,2,0.5,0.906060606060606,0.9043194724822798,0.7346255779266357,0.9043194724822798
210,8,Decision Tree,2,0.5,0.8257575757575758,0.8242199623748551,0.026650428771972656,0.8242199623748551
211,8,RandomForest,2,0.5,0.6242424242424243,0.4218303874710221,0.14649176597595215,0.4218303874710221
212,8,AdaBoost (Discrete),2,0.5,0.906060606060606,0.9032965424021534,29.6389262676239,0.9032965424021534
213,8,AdaBoost (Real),2,0.5,0.5227272727272727,0.5209888877350769,26.85860013961792,0.0
214,8,Logistic Regression (Penalty = L2),2,0.5,0.9681818181818181,0.9679559820306106,0.5494418144226074,0.9679559820306106
215,8,Naive Bayes,2,0.5,0.9,0.8988364817640272,0.05893135070800781,0.8988364817640272
216,9,KNeighbors Classifier,0,0.5,0.9567164179104478,0.95612101377245,0.5471553802490234,0.95612101377245
217,9,SVC Classifier,0,0.5,0.8940298507462686,0.8909236308153216,0.7244002819061279,0.8909236308153216
218,9,Decision Tree,0,0.5,0.8074626865671641,0.7997932393386926,0.02562880516052246,0.7997932393386926
219,9,RandomForest,0,0.5,0.6805970149253732,0.5912523243858313,0.13816261291503906,0.5912523243858313
220,9,AdaBoost (Discrete),0,0.5,0.9402985074626866,0.9394190237818761,22.496134519577026,0.9394190237818761
221,9,AdaBoost (Real),0,0.5,0.9104477611940298,0.9097389942366972,22.651226043701172,0.9097389942366972
222,9,Logistic Regression (Penalty = L2),0,0.5,0.9671641791044776,0.966891577338677,0.49145078659057617,0.966891577338677
223,9,Naive Bayes,0,0.5,0.8925373134328358,0.8905907225858073,0.0940711498260498,0.8905907225858073
224,9,KNeighbors Classifier,1,0.5,0.9447761194029851,0.9443195098322917,0.6669600009918213,0.9443195098322917
225,9,SVC Classifier,1,0.5,0.9104477611940298,0.9094283858551055,0.6881206035614014,0.9094283858551055
226,9,Decision Tree,1,0.5,0.8238805970149253,0.8214663904988558,0.04249453544616699,0.8214663904988558
227,9,RandomForest,1,0.5,0.7313432835820896,0.719631974853761,0.11897158622741699,0.719631974853761
228,9,AdaBoost (Discrete),1,0.5,0.935820895522388,0.9354135763679613,22.458833694458008,0.9354135763679613
229,9,AdaBoost (Real),1,0.5,0.5970149253731343,0.45414660502711185,22.00934600830078,0.45414660502711185
230,9,Logistic Regression (Penalty = L2),1,0.5,0.9656716417910448,0.9656008837744579,0.4622983932495117,0.9656008837744579
231,9,Naive Bayes,1,0.5,0.9059701492537313,0.9043233794172505,0.044832706451416016,0.9043233794172505
232,9,KNeighbors Classifier,2,0.5,0.9575757575757575,0.9570713312241264,0.6147856712341309,0.9570713312241264
233,9,SVC Classifier,2,0.5,0.9075757575757576,0.9063738544197188,0.7061491012573242,0.9063738544197188
234,9,Decision Tree,2,0.5,0.8484848484848485,0.8468135541874522,0.024724245071411133,0.8468135541874522
235,9,RandomForest,2,0.5,0.7893939393939394,0.7834258839259374,0.12233161926269531,0.7834258839259374
236,9,AdaBoost (Discrete),2,0.5,0.9045454545454545,0.902789180302375,23.368943452835083,0.902789180302375
237,9,AdaBoost (Real),2,0.5,0.45454545454545453,0.3238785150518966,22.450623989105225,0.0
238,9,Logistic Regression (Penalty = L2),2,0.5,0.9757575757575757,0.9756355628491509,0.48686790466308594,0.9756355628491509
239,9,Naive Bayes,2,0.5,0.9106060606060606,0.9102598184670029,0.029868602752685547,0.9102598184670029
240,10,KNeighbors Classifier,0,0.5,0.9626865671641791,0.9622379536034589,1.420903205871582,0.9622379536034589
241,10,SVC Classifier,0,0.5,0.9447761194029851,0.9438636524251328,0.9778139591217041,0.9438636524251328
242,10,Decision Tree,0,0.5,0.8731343283582089,0.8691909075645354,0.027741670608520508,0.8691909075645354
243,10,RandomForest,0,0.5,0.5955223880597015,0.5475249311481403,0.11431598663330078,0.0
244,10,AdaBoost (Discrete),0,0.5,0.9507462686567164,0.9500892098444982,48.32025599479675,0.9500892098444982
245,10,AdaBoost (Real),0,0.5,0.8029850746268656,0.7953004681765764,44.55598306655884,0.7953004681765764
246,10,Logistic Regression (Penalty = L2),0,0.5,0.9731343283582089,0.9729101855923863,1.0281336307525635,0.9729101855923863
247,10,Naive Bayes,0,0.5,0.9104477611940298,0.9093173770905265,0.12672185897827148,0.9093173770905265
248,10,KNeighbors Classifier,1,0.5,0.9477611940298507,0.9472304174235369,0.908970832824707,0.9472304174235369
249,10,SVC Classifier,1,0.5,0.9402985074626866,0.9397707411686198,1.0322659015655518,0.9397707411686198
250,10,Decision Tree,1,0.5,0.8417910447761194,0.8407167676500547,0.04571175575256348,0.8407167676500547
251,10,RandomForest,1,0.5,0.6268656716417911,0.4209732209423537,0.09676218032836914,0.4209732209423537
252,10,AdaBoost (Discrete),1,0.5,0.9388059701492537,0.9384200617321753,45.20987939834595,0.9384200617321753
253,10,AdaBoost (Real),1,0.5,0.282089552238806,0.15572385107347458,41.17844915390015,0.0
254,10,Logistic Regression (Penalty = L2),1,0.5,0.9716417910447761,0.9715402540467533,1.150710105895996,0.9715402540467533
255,10,Naive Bayes,1,0.5,0.926865671641791,0.9262164796975818,0.07202482223510742,0.9262164796975818
256,10,KNeighbors Classifier,2,0.5,0.9606060606060606,0.9602413785804383,1.3097898960113525,0.9602413785804383
257,10,SVC Classifier,2,0.5,0.9424242424242424,0.9420179052676838,0.963592529296875,0.9420179052676838
258,10,Decision Tree,2,0.5,0.8560606060606061,0.8544649121385625,0.028757810592651367,0.8544649121385625
259,10,RandomForest,2,0.5,0.7151515151515152,0.66826082695284,0.14583683013916016,0.66826082695284
260,10,AdaBoost (Discrete),2,0.5,0.9287878787878788,0.9276814878499713,43.988627195358276,0.9276814878499713
261,10,AdaBoost (Real),2,0.5,0.5621212121212121,0.43979835386911265,42.40130686759949,0.43979835386911265
262,10,Logistic Regression (Penalty = L2),2,0.5,0.9772727272727273,0.9771023911443244,0.9827542304992676,0.9771023911443244
263,10,Naive Bayes,2,0.5,0.9181818181818182,0.9175169989758665,0.08185505867004395,0.9175169989758665
264,11,KNeighbors Classifier,0,0.5,0.9671641791044776,0.9667268786467057,1.8198201656341553,0.9667268786467057
265,11,SVC Classifier,0,0.5,0.9552238805970149,0.9546337935485449,1.2641105651855469,0.9546337935485449
266,11,Decision Tree,0,0.5,0.8313432835820895,0.8262596729093936,0.05018186569213867,0.8262596729093936
267,11,RandomForest,0,0.5,0.7522388059701492,0.6744895239466794,0.13950109481811523,0.6744895239466794
268,11,AdaBoost (Discrete),0,0.5,0.9522388059701492,0.9514537414241808,56.80453944206238,0.9514537414241808
269,11,AdaBoost (Real),0,0.5,0.7611940298507462,0.7311755559438013,49.0232310295105,0.7311755559438013
270,11,Logistic Regression (Penalty = L2),0,0.5,0.9791044776119403,0.9788706136537167,1.4215495586395264,0.9788706136537167
271,11,Naive Bayes,0,0.5,0.9119402985074627,0.9108665690988434,0.16660523414611816,0.9108665690988434
272,11,KNeighbors Classifier,1,0.5,0.9522388059701492,0.9518424802472935,1.516277551651001,0.9518424802472935
273,11,SVC Classifier,1,0.5,0.9462686567164179,0.9457406341973597,1.0095150470733643,0.9457406341973597
274,11,Decision Tree,1,0.5,0.8477611940298507,0.8449706960746518,0.048586130142211914,0.8449706960746518
275,11,RandomForest,1,0.5,0.7074626865671642,0.6240153865312348,0.09604454040527344,0.6240153865312348
276,11,AdaBoost (Discrete),1,0.5,0.9462686567164179,0.9461241775698619,55.11772346496582,0.9461241775698619
277,11,AdaBoost (Real),1,0.5,0.282089552238806,0.15572385107347458,53.564244747161865,0.0
278,11,Logistic Regression (Penalty = L2),1,0.5,0.9716417910447761,0.9715632520762846,1.245680570602417,0.9715632520762846
279,11,Naive Bayes,1,0.5,0.9298507462686567,0.9292124073188259,0.13557052612304688,0.9292124073188259
280,11,KNeighbors Classifier,2,0.5,0.9681818181818181,0.9679346189636558,1.8301811218261719,0.9679346189636558
281,11,SVC Classifier,2,0.5,0.9545454545454546,0.9543048815485738,1.1830337047576904,0.9543048815485738
282,11,Decision Tree,2,0.5,0.8303030303030303,0.8278623879406878,0.028212547302246094,0.8278623879406878
283,11,RandomForest,2,0.5,0.8166666666666667,0.808755606888125,0.08040642738342285,0.808755606888125
284,11,AdaBoost (Discrete),2,0.5,0.9454545454545454,0.9451118349869415,49.84780144691467,0.9451118349869415
285,11,AdaBoost (Real),2,0.5,0.6454545454545455,0.5841435624644531,45.94513177871704,0.5841435624644531
286,11,Logistic Regression (Penalty = L2),2,0.5,0.9787878787878788,0.9786423791651166,1.1183209419250488,0.9786423791651166
287,11,Naive Bayes,2,0.5,0.9196969696969697,0.918963075866172,0.11774682998657227,0.918963075866172
288,12,KNeighbors Classifier,0,0.5,0.9373134328358209,0.9361350264933895,0.16330409049987793,0.9361350264933895
289,12,SVC Classifier,0,0.5,0.8343283582089552,0.8235652555183962,0.2935006618499756,0.8235652555183962
290,12,Decision Tree,0,0.5,0.8164179104477612,0.8121499891827914,0.0187528133392334,0.8121499891827914
291,12,RandomForest,0,0.5,0.6985074626865672,0.6717042761978405,0.06729006767272949,0.6717042761978405
292,12,AdaBoost (Discrete),0,0.5,0.9194029850746268,0.9175869238623305,13.218117952346802,0.9175869238623305
293,12,AdaBoost (Real),0,0.5,0.5746268656716418,0.44015867694301947,13.087003231048584,0.44015867694301947
294,12,Logistic Regression (Penalty = L2),0,0.5,0.9492537313432836,0.9487095066842284,0.22388768196105957,0.9487095066842284
295,12,Naive Bayes,0,0.5,0.8671641791044776,0.8652507860461673,0.061202049255371094,0.8652507860461673
296,12,KNeighbors Classifier,1,0.5,0.9462686567164179,0.9458785917646655,0.2221665382385254,0.9458785917646655
297,12,SVC Classifier,1,0.5,0.8477611940298507,0.8422727303053038,0.3629112243652344,0.8422727303053038
298,12,Decision Tree,1,0.5,0.8462686567164179,0.8430835888760643,0.020205020904541016,0.8430835888760643
299,12,RandomForest,1,0.5,0.6895522388059702,0.6238900400794816,0.07510781288146973,0.6238900400794816
300,12,AdaBoost (Discrete),1,0.5,0.9104477611940298,0.9096270835320507,12.541705846786499,0.9096270835320507
301,12,AdaBoost (Real),1,0.5,0.6373134328358209,0.47198860067699067,13.088901996612549,0.47198860067699067
302,12,Logistic Regression (Penalty = L2),1,0.5,0.9567164179104478,0.9564460412998338,0.2564263343811035,0.9564460412998338
303,12,Naive Bayes,1,0.5,0.8701492537313433,0.8692118354259935,0.06328845024108887,0.8692118354259935
304,12,KNeighbors Classifier,2,0.5,0.9393939393939394,0.9385837168511709,0.14794111251831055,0.9385837168511709
305,12,SVC Classifier,2,0.5,0.8393939393939394,0.8300379064818747,0.17390036582946777,0.8300379064818747
306,12,Decision Tree,2,0.5,0.8121212121212121,0.8097775773490417,0.007106781005859375,0.8097775773490417
307,12,RandomForest,2,0.5,0.7712121212121212,0.7563485998545015,0.035537004470825195,0.7563485998545015
308,12,AdaBoost (Discrete),2,0.5,0.9,0.8978920480828637,12.426690816879272,0.8978920480828637
309,12,AdaBoost (Real),2,0.5,0.7757575757575758,0.7707838839953127,14.211963891983032,0.7707838839953127
310,12,Logistic Regression (Penalty = L2),2,0.5,0.9651515151515152,0.9649607015582284,0.24754643440246582,0.9649607015582284
311,12,Naive Bayes,2,0.5,0.8803030303030303,0.8791493287947655,0.028089046478271484,0.8791493287947655
