,feat_set_id,classifier,fold_id,feat_th,score,geo_score,exec_t,geo_score_woz
0,0,KNeighbors Classifier,0,0.2,0.7874,0.5935406389028242,8.776893854141235,0.5935406389028242
1,0,SVC Classifier,0,0.2,0.7795,0.09014398837291854,39.59082531929016,0.09014398837291854
2,0,Decision Tree,0,0.2,0.8065,0.5547532179889841,0.07358741760253906,0.5547532179889841
3,0,RandomForest,0,0.2,0.8031,0.45913508545692633,0.32169437408447266,0.45913508545692633
4,0,AdaBoost (Discrete),0,0.2,0.8093,0.5734437466764926,23.667580127716064,0.5734437466764926
5,0,AdaBoost (Real),0,0.2,0.8073,0.5602190497298205,68.39621067047119,0.5602190497298205
6,0,Logistic Regression (Penalty = L2),0,0.2,0.8048,0.46936216865858615,0.24227309226989746,0.46936216865858615
7,0,Naive Bayes,0,0.2,0.7972,0.5780714623506594,0.12743377685546875,0.5780714623506594
8,0,KNeighbors Classifier,1,0.2,0.7728,0.5354208683364595,8.920408487319946,0.5354208683364595
9,0,SVC Classifier,1,0.2,0.7788,1.0,31.211634874343872,0.0
10,0,Decision Tree,1,0.2,0.8213,0.6074172130103931,0.08908581733703613,0.6074172130103931
11,0,RandomForest,1,0.2,0.8122,0.49333270929884543,0.3033475875854492,0.49333270929884543
12,0,AdaBoost (Discrete),1,0.2,0.8265,0.584486606616563,23.81794047355652,0.584486606616563
13,0,AdaBoost (Real),1,0.2,0.8229,0.6148419159928645,66.86478281021118,0.6148419159928645
14,0,Logistic Regression (Penalty = L2),1,0.2,0.8076,0.45734882824095485,0.18856310844421387,0.45734882824095485
15,0,Naive Bayes,1,0.2,0.8035,0.6222065719478789,0.06904745101928711,0.6222065719478789
16,0,KNeighbors Classifier,2,0.2,0.7889,0.5624541690603174,8.994446754455566,0.5624541690603174
17,0,SVC Classifier,2,0.2,0.7788,1.0,33.28167414665222,0.0
18,0,Decision Tree,2,0.2,0.8202,0.5459902174845237,0.09624409675598145,0.5459902174845237
19,0,RandomForest,2,0.2,0.8125,0.4691135785254244,0.35856151580810547,0.4691135785254244
20,0,AdaBoost (Discrete),2,0.2,0.8251,0.5826094208439243,22.898210525512695,0.5826094208439243
21,0,AdaBoost (Real),2,0.2,0.8219,0.5545294569855478,62.5963237285614,0.5545294569855478
22,0,Logistic Regression (Penalty = L2),2,0.2,0.807,0.43138056976610795,0.24809861183166504,0.43138056976610795
23,0,Naive Bayes,2,0.2,0.8114,0.6014641652923668,0.1225898265838623,0.6014641652923668
24,1,KNeighbors Classifier,0,0.2,0.7643,0.5548979133640948,2.0172979831695557,0.5548979133640948
25,1,SVC Classifier,0,0.2,0.7788,1.0,32.158607006073,0.0
26,1,Decision Tree,0,0.2,0.725,0.5475917718461515,0.25801777839660645,0.5475917718461515
27,1,RandomForest,0,0.2,0.8098,0.5374868162767433,0.5368647575378418,0.5374868162767433
28,1,AdaBoost (Discrete),0,0.2,0.8093,0.5491542499196409,55.2451605796814,0.5491542499196409
29,1,AdaBoost (Real),0,0.2,0.791,0.5492087380253662,62.57121968269348,0.5492087380253662
30,1,Logistic Regression (Penalty = L2),0,0.2,0.8056,0.49525960119148993,0.20296883583068848,0.49525960119148993
31,1,Naive Bayes,0,0.2,0.6451,0.6358359084583963,0.10638713836669922,0.6358359084583963
32,1,KNeighbors Classifier,1,0.2,0.7734,0.5806967287614894,1.998105525970459,0.5806967287614894
33,1,SVC Classifier,1,0.2,0.7788,1.0,30.665470361709595,0.0
34,1,Decision Tree,1,0.2,0.7239,0.5790211796702055,0.2770860195159912,0.5790211796702055
35,1,RandomForest,1,0.2,0.8249,0.5865063598458912,0.4880363941192627,0.5865063598458912
36,1,AdaBoost (Discrete),1,0.2,0.8251,0.5995460769400341,52.148088455200195,0.5995460769400341
37,1,AdaBoost (Real),1,0.2,0.7934,0.579077067648234,67.09287858009338,0.579077067648234
38,1,Logistic Regression (Penalty = L2),1,0.2,0.8142,0.5077753574345988,0.2340390682220459,0.5077753574345988
39,1,Naive Bayes,1,0.2,0.6076,0.6398919151665693,0.11246180534362793,0.6398919151665693
40,1,KNeighbors Classifier,2,0.2,0.7761,0.5550998797474834,2.0073821544647217,0.5550998797474834
41,1,SVC Classifier,2,0.2,0.7788,1.0,28.228967666625977,0.0
42,1,Decision Tree,2,0.2,0.7328,0.5444977681694754,0.3075237274169922,0.5444977681694754
43,1,RandomForest,2,0.2,0.8225,0.5497260264694525,0.46178579330444336,0.5497260264694525
44,1,AdaBoost (Discrete),2,0.2,0.8231,0.5669118967145339,52.64250063896179,0.5669118967145339
45,1,AdaBoost (Real),2,0.2,0.7936,0.5373107485078998,66.79489421844482,0.5373107485078998
46,1,Logistic Regression (Penalty = L2),2,0.2,0.8108,0.4694707424842037,0.28741955757141113,0.4694707424842037
47,1,Naive Bayes,2,0.2,0.7942,0.6478677331806726,0.14562034606933594,0.6478677331806726
48,2,KNeighbors Classifier,0,0.2,0.7874,0.5935406389028242,7.86731743812561,0.5935406389028242
49,2,SVC Classifier,0,0.2,0.7795,0.09014398837291854,30.063234090805054,0.09014398837291854
50,2,Decision Tree,0,0.2,0.8067,0.5558667036496858,0.09389114379882812,0.5558667036496858
51,2,RandomForest,0,0.2,0.8031,0.45913508545692633,0.2896747589111328,0.45913508545692633
52,2,AdaBoost (Discrete),0,0.2,0.8093,0.5734437466764926,21.487207889556885,0.5734437466764926
53,2,AdaBoost (Real),0,0.2,0.8073,0.5602190497298205,56.002607107162476,0.5602190497298205
54,2,Logistic Regression (Penalty = L2),0,0.2,0.8048,0.46936216865858615,0.24449610710144043,0.46936216865858615
55,2,Naive Bayes,0,0.2,0.7972,0.5780714623506594,0.08229351043701172,0.5780714623506594
56,2,KNeighbors Classifier,1,0.2,0.7728,0.5354208683364595,8.34138560295105,0.5354208683364595
57,2,SVC Classifier,1,0.2,0.7788,1.0,30.119616508483887,0.0
58,2,Decision Tree,1,0.2,0.8217,0.6091287716440917,0.0945596694946289,0.6091287716440917
59,2,RandomForest,1,0.2,0.8122,0.49333270929884543,0.3119797706604004,0.49333270929884543
60,2,AdaBoost (Discrete),1,0.2,0.8265,0.584486606616563,23.01202654838562,0.584486606616563
61,2,AdaBoost (Real),1,0.2,0.8228,0.6148000430118514,70.44274806976318,0.6148000430118514
62,2,Logistic Regression (Penalty = L2),1,0.2,0.8076,0.45734882824095485,0.24490666389465332,0.45734882824095485
63,2,Naive Bayes,1,0.2,0.8035,0.6222065719478789,0.1172633171081543,0.6222065719478789
64,2,KNeighbors Classifier,2,0.2,0.7889,0.5624541690603174,9.522072792053223,0.5624541690603174
65,2,SVC Classifier,2,0.2,0.7788,1.0,30.87109923362732,0.0
66,2,Decision Tree,2,0.2,0.8196,0.5446811043454618,0.06670808792114258,0.5446811043454618
67,2,RandomForest,2,0.2,0.8125,0.4691135785254244,0.28760695457458496,0.4691135785254244
68,2,AdaBoost (Discrete),2,0.2,0.8251,0.5826094208439243,22.813618183135986,0.5826094208439243
69,2,AdaBoost (Real),2,0.2,0.8219,0.5545294569855478,61.53296136856079,0.5545294569855478
70,2,Logistic Regression (Penalty = L2),2,0.2,0.807,0.43138056976610795,0.2440471649169922,0.43138056976610795
71,2,Naive Bayes,2,0.2,0.8114,0.6014641652923668,0.06298470497131348,0.6014641652923668
72,3,KNeighbors Classifier,0,0.2,0.7695,0.5751137940491311,3.9072251319885254,0.5751137940491311
73,3,SVC Classifier,0,0.2,0.7795,0.09014398837291854,31.641764640808105,0.09014398837291854
74,3,Decision Tree,0,0.2,0.7347,0.5393835022223434,0.3167107105255127,0.5393835022223434
75,3,RandomForest,0,0.2,0.8031,0.45913508545692633,0.41462254524230957,0.45913508545692633
76,3,AdaBoost (Discrete),0,0.2,0.8086,0.5481869922160254,38.48981833457947,0.5481869922160254
77,3,AdaBoost (Real),0,0.2,0.7866,0.5392644080139553,51.156505823135376,0.5392644080139553
78,3,Logistic Regression (Penalty = L2),0,0.2,0.804,0.46163751243612156,0.29525017738342285,0.46163751243612156
79,3,Naive Bayes,0,0.2,0.7903,0.5784460471621689,0.1154015064239502,0.5784460471621689
80,3,KNeighbors Classifier,1,0.2,0.779,0.5961769952783834,4.206959247589111,0.5961769952783834
81,3,SVC Classifier,1,0.2,0.7788,1.0,30.436901092529297,0.0
82,3,Decision Tree,1,0.2,0.745,0.5659463206961273,0.21800851821899414,0.5659463206961273
83,3,RandomForest,1,0.2,0.8128,0.49599699172969386,0.38039278984069824,0.49599699172969386
84,3,AdaBoost (Discrete),1,0.2,0.8235,0.6077046065112224,33.1016731262207,0.6077046065112224
85,3,AdaBoost (Real),1,0.2,0.8043,0.5929512974323848,50.51372265815735,0.5929512974323848
86,3,Logistic Regression (Penalty = L2),1,0.2,0.8094,0.4755658158825185,0.27787017822265625,0.4755658158825185
87,3,Naive Bayes,1,0.2,0.7997,0.6273404526014762,0.12918305397033691,0.6273404526014762
88,3,KNeighbors Classifier,2,0.2,0.7798,0.5469368968424353,4.772465944290161,0.5469368968424353
89,3,SVC Classifier,2,0.2,0.7788,1.0,32.53529167175293,0.0
90,3,Decision Tree,2,0.2,0.7476,0.5499925887750368,0.31620073318481445,0.5499925887750368
91,3,RandomForest,2,0.2,0.8125,0.4691135785254244,0.42226409912109375,0.4691135785254244
92,3,AdaBoost (Discrete),2,0.2,0.8224,0.559320799052911,34.98773908615112,0.559320799052911
93,3,AdaBoost (Real),2,0.2,0.7948,0.533112048957681,49.95787501335144,0.533112048957681
94,3,Logistic Regression (Penalty = L2),2,0.2,0.8081,0.4374856577073626,0.21889543533325195,0.4374856577073626
95,3,Naive Bayes,2,0.2,0.8141,0.5867862873220945,0.11206722259521484,0.5867862873220945
96,4,KNeighbors Classifier,0,0.2,0.3898,0.4465368785977873,5.4503607749938965,0.4465368785977873
97,4,SVC Classifier,0,0.2,0.7788,1.0,20.03756880760193,0.0
98,4,Decision Tree,0,0.2,0.8091,0.5331998579600798,0.05882382392883301,0.5331998579600798
99,4,RandomForest,0,0.2,0.8098,0.5374868162767433,0.3136017322540283,0.5374868162767433
100,4,AdaBoost (Discrete),0,0.2,0.8091,0.5331998579600798,16.94610023498535,0.5331998579600798
101,4,AdaBoost (Real),0,0.2,0.8097,0.5359881800938336,314.8847119808197,0.5359881800938336
102,4,Logistic Regression (Penalty = L2),0,0.2,0.8098,0.5374868162767433,0.15061330795288086,0.5374868162767433
103,4,Naive Bayes,0,0.2,0.8098,0.5374868162767433,0.06841158866882324,0.5374868162767433
104,4,KNeighbors Classifier,1,0.2,0.7373,0.4167498066475552,5.295231103897095,0.4167498066475552
105,4,SVC Classifier,1,0.2,0.7788,1.0,17.911981105804443,0.0
106,4,Decision Tree,1,0.2,0.8245,0.584698307625315,0.036803245544433594,0.584698307625315
107,4,RandomForest,1,0.2,0.8249,0.5865063598458912,0.3307058811187744,0.5865063598458912
108,4,AdaBoost (Discrete),1,0.2,0.8245,0.584698307625315,17.542805671691895,0.584698307625315
109,4,AdaBoost (Real),1,0.2,0.8245,0.584698307625315,319.0560472011566,0.584698307625315
110,4,Logistic Regression (Penalty = L2),1,0.2,0.8249,0.5865063598458912,0.20172119140625,0.5865063598458912
111,4,Naive Bayes,1,0.2,0.8249,0.5865063598458912,0.07267546653747559,0.5865063598458912
112,4,KNeighbors Classifier,2,0.2,0.7875,0.23526314858897693,5.485897541046143,0.23526314858897693
113,4,SVC Classifier,2,0.2,0.7788,1.0,17.510462522506714,0.0
114,4,Decision Tree,2,0.2,0.824,0.5545891737925498,0.057024240493774414,0.5545891737925498
115,4,RandomForest,2,0.2,0.8241,0.5578316001828668,0.31011223793029785,0.5578316001828668
116,4,AdaBoost (Discrete),2,0.2,0.8241,0.5578316001828668,16.822364330291748,0.5578316001828668
117,4,AdaBoost (Real),2,0.2,0.8241,0.5553406581675171,360.18551659584045,0.5553406581675171
118,4,Logistic Regression (Penalty = L2),2,0.2,0.8241,0.5578316001828668,0.17068219184875488,0.5578316001828668
119,4,Naive Bayes,2,0.2,0.8241,0.5578316001828668,0.05684924125671387,0.5578316001828668
120,5,KNeighbors Classifier,0,0.2,0.7874,0.5935406389028242,8.755479097366333,0.5935406389028242
121,5,SVC Classifier,0,0.2,0.7795,0.09014398837291854,29.88554883003235,0.09014398837291854
122,5,Decision Tree,0,0.2,0.8067,0.5562120452437368,0.09486079216003418,0.5562120452437368
123,5,RandomForest,0,0.2,0.8031,0.45913508545692633,0.2725186347961426,0.45913508545692633
124,5,AdaBoost (Discrete),0,0.2,0.8093,0.5734437466764926,22.30797505378723,0.5734437466764926
125,5,AdaBoost (Real),0,0.2,0.8073,0.5602190497298205,52.44694447517395,0.5602190497298205
126,5,Logistic Regression (Penalty = L2),0,0.2,0.8048,0.46936216865858615,0.13683533668518066,0.46936216865858615
127,5,Naive Bayes,0,0.2,0.7972,0.5780714623506594,0.08014917373657227,0.5780714623506594
128,5,KNeighbors Classifier,1,0.2,0.7728,0.5354208683364595,7.467629432678223,0.5354208683364595
129,5,SVC Classifier,1,0.2,0.7788,1.0,30.562891244888306,0.0
130,5,Decision Tree,1,0.2,0.8213,0.6061760761967753,0.07239031791687012,0.6061760761967753
131,5,RandomForest,1,0.2,0.8122,0.49333270929884543,0.3448975086212158,0.49333270929884543
132,5,AdaBoost (Discrete),1,0.2,0.8265,0.584486606616563,22.01810646057129,0.584486606616563
133,5,AdaBoost (Real),1,0.2,0.8229,0.6148419159928645,57.59157991409302,0.6148419159928645
134,5,Logistic Regression (Penalty = L2),1,0.2,0.8076,0.45734882824095485,0.18990874290466309,0.45734882824095485
135,5,Naive Bayes,1,0.2,0.8035,0.6222065719478789,0.09264564514160156,0.6222065719478789
136,5,KNeighbors Classifier,2,0.2,0.7889,0.5624541690603174,9.18787407875061,0.5624541690603174
137,5,SVC Classifier,2,0.2,0.7788,1.0,32.639787912368774,0.0
138,5,Decision Tree,2,0.2,0.8195,0.5450089303850953,0.1085360050201416,0.5450089303850953
139,5,RandomForest,2,0.2,0.8125,0.4691135785254244,0.27315759658813477,0.4691135785254244
140,5,AdaBoost (Discrete),2,0.2,0.8251,0.5826094208439243,22.74582290649414,0.5826094208439243
141,5,AdaBoost (Real),2,0.2,0.8218,0.55413603412156,59.72495651245117,0.55413603412156
142,5,Logistic Regression (Penalty = L2),2,0.2,0.807,0.43138056976610795,0.2733726501464844,0.43138056976610795
143,5,Naive Bayes,2,0.2,0.8114,0.6014641652923668,0.09988188743591309,0.6014641652923668
144,6,KNeighbors Classifier,0,0.2,0.6789,0.5413281263334431,7.278662204742432,0.5413281263334431
145,6,SVC Classifier,0,0.2,0.7795,0.09014398837291854,27.174066305160522,0.09014398837291854
146,6,Decision Tree,0,0.2,0.8073,0.5656496150301269,0.08984231948852539,0.5656496150301269
147,6,RandomForest,0,0.2,0.8098,0.5374868162767433,0.3152930736541748,0.5374868162767433
148,6,AdaBoost (Discrete),0,0.2,0.8072,0.5518850551035501,20.114779472351074,0.5518850551035501
149,6,AdaBoost (Real),0,0.2,0.8073,0.5642993420805843,70.44567608833313,0.5642993420805843
150,6,Logistic Regression (Penalty = L2),0,0.2,0.8052,0.472954528025573,0.19143176078796387,0.472954528025573
151,6,Naive Bayes,0,0.2,0.7896,0.5787894000140409,0.08675765991210938,0.5787894000140409
152,6,KNeighbors Classifier,1,0.2,0.7739,0.6140787853036744,7.124287128448486,0.6140787853036744
153,6,SVC Classifier,1,0.2,0.7788,1.0,30.825517416000366,0.0
154,6,Decision Tree,1,0.2,0.8236,0.6187761595239943,0.07068419456481934,0.6187761595239943
155,6,RandomForest,1,0.2,0.8261,0.5843302640681952,0.2823972702026367,0.5843302640681952
156,6,AdaBoost (Discrete),1,0.2,0.8242,0.6190291170161404,22.054937601089478,0.6190291170161404
157,6,AdaBoost (Real),1,0.2,0.8235,0.6199398738054017,72.75576639175415,0.6199398738054017
158,6,Logistic Regression (Penalty = L2),1,0.2,0.8118,0.4869616983197019,0.20930075645446777,0.4869616983197019
159,6,Naive Bayes,1,0.2,0.7989,0.627264017623129,0.09608054161071777,0.627264017623129
160,6,KNeighbors Classifier,2,0.2,0.8037,0.5920813328202712,8.024813890457153,0.5920813328202712
161,6,SVC Classifier,2,0.2,0.7788,1.0,29.846966981887817,0.0
162,6,Decision Tree,2,0.2,0.8231,0.5567515515020547,0.0768578052520752,0.5567515515020547
163,6,RandomForest,2,0.2,0.8242,0.5528699919506312,0.2869100570678711,0.5528699919506312
164,6,AdaBoost (Discrete),2,0.2,0.8221,0.5426550094175557,20.15259313583374,0.5426550094175557
165,6,AdaBoost (Real),2,0.2,0.8228,0.5548614553597347,62.084566831588745,0.5548614553597347
166,6,Logistic Regression (Penalty = L2),2,0.2,0.8062,0.42724253100183507,0.18369150161743164,0.42724253100183507
167,6,Naive Bayes,2,0.2,0.8142,0.587148836808227,0.11799836158752441,0.587148836808227
168,7,KNeighbors Classifier,0,0.2,0.3898,0.4465368785977873,5.305211544036865,0.4465368785977873
169,7,SVC Classifier,0,0.2,0.7788,1.0,19.726588010787964,0.0
170,7,Decision Tree,0,0.2,0.8091,0.5331998579600798,0.03314542770385742,0.5331998579600798
171,7,RandomForest,0,0.2,0.8098,0.5374868162767433,0.28497767448425293,0.5374868162767433
172,7,AdaBoost (Discrete),0,0.2,0.8091,0.5331998579600798,16.672436714172363,0.5331998579600798
173,7,AdaBoost (Real),0,0.2,0.8097,0.5359881800938336,340.1811168193817,0.5359881800938336
174,7,Logistic Regression (Penalty = L2),0,0.2,0.8098,0.5374868162767433,0.16333603858947754,0.5374868162767433
175,7,Naive Bayes,0,0.2,0.8098,0.5374868162767433,0.05644559860229492,0.5374868162767433
176,7,KNeighbors Classifier,1,0.2,0.7373,0.4167498066475552,6.6126086711883545,0.4167498066475552
177,7,SVC Classifier,1,0.2,0.7788,1.0,19.06339931488037,0.0
178,7,Decision Tree,1,0.2,0.8245,0.584698307625315,0.03868865966796875,0.584698307625315
179,7,RandomForest,1,0.2,0.8249,0.5865063598458912,0.2481527328491211,0.5865063598458912
180,7,AdaBoost (Discrete),1,0.2,0.8245,0.584698307625315,16.540218830108643,0.584698307625315
181,7,AdaBoost (Real),1,0.2,0.8245,0.584698307625315,334.483216047287,0.584698307625315
182,7,Logistic Regression (Penalty = L2),1,0.2,0.8249,0.5865063598458912,0.21363210678100586,0.5865063598458912
183,7,Naive Bayes,1,0.2,0.8249,0.5865063598458912,0.02881026268005371,0.5865063598458912
184,7,KNeighbors Classifier,2,0.2,0.7875,0.23526314858897693,6.503981590270996,0.23526314858897693
185,7,SVC Classifier,2,0.2,0.7788,1.0,19.021576642990112,0.0
186,7,Decision Tree,2,0.2,0.824,0.5545891737925498,0.05970287322998047,0.5545891737925498
187,7,RandomForest,2,0.2,0.8241,0.5578316001828668,0.2850971221923828,0.5578316001828668
188,7,AdaBoost (Discrete),2,0.2,0.8241,0.5578316001828668,16.666934490203857,0.5578316001828668
189,7,AdaBoost (Real),2,0.2,0.8241,0.5553406581675171,361.35354232788086,0.5553406581675171
190,7,Logistic Regression (Penalty = L2),2,0.2,0.8241,0.5578316001828668,0.14220595359802246,0.5578316001828668
191,7,Naive Bayes,2,0.2,0.8241,0.5578316001828668,0.05883598327636719,0.5578316001828668
192,8,KNeighbors Classifier,0,0.2,0.3898,0.4465368785977873,5.612233638763428,0.4465368785977873
193,8,SVC Classifier,0,0.2,0.7788,1.0,18.23350501060486,0.0
194,8,Decision Tree,0,0.2,0.8091,0.5331998579600798,0.033556461334228516,0.5331998579600798
195,8,RandomForest,0,0.2,0.8098,0.5374868162767433,0.23505187034606934,0.5374868162767433
196,8,AdaBoost (Discrete),0,0.2,0.8091,0.5331998579600798,15.242141723632812,0.5331998579600798
197,8,AdaBoost (Real),0,0.2,0.8097,0.5359881800938336,334.2625923156738,0.5359881800938336
198,8,Logistic Regression (Penalty = L2),0,0.2,0.8098,0.5374868162767433,0.12378096580505371,0.5374868162767433
199,8,Naive Bayes,0,0.2,0.8098,0.5374868162767433,0.05240154266357422,0.5374868162767433
200,8,KNeighbors Classifier,1,0.2,0.7373,0.4167498066475552,4.856973886489868,0.4167498066475552
201,8,SVC Classifier,1,0.2,0.7788,1.0,16.686156034469604,0.0
202,8,Decision Tree,1,0.2,0.8245,0.584698307625315,0.03363847732543945,0.584698307625315
203,8,RandomForest,1,0.2,0.8249,0.5865063598458912,0.2526073455810547,0.5865063598458912
204,8,AdaBoost (Discrete),1,0.2,0.8245,0.584698307625315,16.346585988998413,0.584698307625315
205,8,AdaBoost (Real),1,0.2,0.8245,0.584698307625315,339.39327478408813,0.584698307625315
206,8,Logistic Regression (Penalty = L2),1,0.2,0.8249,0.5865063598458912,0.18673110008239746,0.5865063598458912
207,8,Naive Bayes,1,0.2,0.8249,0.5865063598458912,0.04763150215148926,0.5865063598458912
208,8,KNeighbors Classifier,2,0.2,0.7875,0.23526314858897693,5.353446006774902,0.23526314858897693
209,8,SVC Classifier,2,0.2,0.7788,1.0,15.775514602661133,0.0
210,8,Decision Tree,2,0.2,0.824,0.5545891737925498,0.03532576560974121,0.5545891737925498
211,8,RandomForest,2,0.2,0.8241,0.5578316001828668,0.2992124557495117,0.5578316001828668
212,8,AdaBoost (Discrete),2,0.2,0.8241,0.5578316001828668,16.020957946777344,0.5578316001828668
213,8,AdaBoost (Real),2,0.2,0.8241,0.5553406581675171,348.7381021976471,0.5553406581675171
214,8,Logistic Regression (Penalty = L2),2,0.2,0.8241,0.5578316001828668,0.15217828750610352,0.5578316001828668
215,8,Naive Bayes,2,0.2,0.8241,0.5578316001828668,0.056704044342041016,0.5578316001828668
216,9,KNeighbors Classifier,0,0.2,0.6789,0.5413281263334431,7.327437162399292,0.5413281263334431
217,9,SVC Classifier,0,0.2,0.7795,0.09014398837291854,28.171980142593384,0.09014398837291854
218,9,Decision Tree,0,0.2,0.8077,0.5671500145226306,0.0662076473236084,0.5671500145226306
219,9,RandomForest,0,0.2,0.8098,0.5374868162767433,0.32428693771362305,0.5374868162767433
220,9,AdaBoost (Discrete),0,0.2,0.8072,0.5518850551035501,21.057947874069214,0.5518850551035501
221,9,AdaBoost (Real),0,0.2,0.8073,0.5642993420805843,75.15285086631775,0.5642993420805843
222,9,Logistic Regression (Penalty = L2),0,0.2,0.8052,0.472954528025573,0.217864990234375,0.472954528025573
223,9,Naive Bayes,0,0.2,0.7896,0.5787894000140409,0.07869243621826172,0.5787894000140409
224,9,KNeighbors Classifier,1,0.2,0.7739,0.6140787853036744,7.2633562088012695,0.6140787853036744
225,9,SVC Classifier,1,0.2,0.7788,1.0,29.35614252090454,0.0
226,9,Decision Tree,1,0.2,0.8236,0.6181717192449782,0.06683778762817383,0.6181717192449782
227,9,RandomForest,1,0.2,0.8261,0.5843302640681952,0.3349590301513672,0.5843302640681952
228,9,AdaBoost (Discrete),1,0.2,0.8242,0.6190291170161404,19.784674406051636,0.6190291170161404
229,9,AdaBoost (Real),1,0.2,0.8235,0.6199398738054017,74.8028712272644,0.6199398738054017
230,9,Logistic Regression (Penalty = L2),1,0.2,0.8118,0.4869616983197019,0.206190824508667,0.4869616983197019
231,9,Naive Bayes,1,0.2,0.7989,0.627264017623129,0.07094049453735352,0.627264017623129
232,9,KNeighbors Classifier,2,0.2,0.8037,0.5920813328202712,7.7853004932403564,0.5920813328202712
233,9,SVC Classifier,2,0.2,0.7788,1.0,29.2440083026886,0.0
234,9,Decision Tree,2,0.2,0.8234,0.5575722211658029,0.06953310966491699,0.5575722211658029
235,9,RandomForest,2,0.2,0.8242,0.5528699919506312,0.3517904281616211,0.5528699919506312
236,9,AdaBoost (Discrete),2,0.2,0.8221,0.5426550094175557,21.06055235862732,0.5426550094175557
237,9,AdaBoost (Real),2,0.2,0.8228,0.5548614553597347,59.81886696815491,0.5548614553597347
238,9,Logistic Regression (Penalty = L2),2,0.2,0.8062,0.42724253100183507,0.22357487678527832,0.42724253100183507
239,9,Naive Bayes,2,0.2,0.8142,0.587148836808227,0.09516239166259766,0.587148836808227
240,10,KNeighbors Classifier,0,0.2,0.7874,0.5935406389028242,8.455011367797852,0.5935406389028242
241,10,SVC Classifier,0,0.2,0.7795,0.09014398837291854,28.920114040374756,0.09014398837291854
242,10,Decision Tree,0,0.2,0.807,0.5552884443588546,0.09327459335327148,0.5552884443588546
243,10,RandomForest,0,0.2,0.8031,0.45913508545692633,0.37183332443237305,0.45913508545692633
244,10,AdaBoost (Discrete),0,0.2,0.8093,0.5734437466764926,22.345024347305298,0.5734437466764926
245,10,AdaBoost (Real),0,0.2,0.8073,0.5602190497298205,58.5764946937561,0.5602190497298205
246,10,Logistic Regression (Penalty = L2),0,0.2,0.8048,0.46936216865858615,0.24042201042175293,0.46936216865858615
247,10,Naive Bayes,0,0.2,0.7972,0.5780714623506594,0.1187136173248291,0.5780714623506594
248,10,KNeighbors Classifier,1,0.2,0.7728,0.5354208683364595,8.586007118225098,0.5354208683364595
249,10,SVC Classifier,1,0.2,0.7788,1.0,29.899237155914307,0.0
250,10,Decision Tree,1,0.2,0.8214,0.6068384305704811,0.0972442626953125,0.6068384305704811
251,10,RandomForest,1,0.2,0.8122,0.49333270929884543,0.24794673919677734,0.49333270929884543
252,10,AdaBoost (Discrete),1,0.2,0.8265,0.584486606616563,23.825797080993652,0.584486606616563
253,10,AdaBoost (Real),1,0.2,0.8229,0.6148419159928645,64.57135653495789,0.6148419159928645
254,10,Logistic Regression (Penalty = L2),1,0.2,0.8076,0.45734882824095485,0.18636083602905273,0.45734882824095485
255,10,Naive Bayes,1,0.2,0.8035,0.6222065719478789,0.1573338508605957,0.6222065719478789
256,10,KNeighbors Classifier,2,0.2,0.7889,0.5624541690603174,8.289798021316528,0.5624541690603174
257,10,SVC Classifier,2,0.2,0.7788,1.0,31.13258719444275,0.0
258,10,Decision Tree,2,0.2,0.8201,0.546317098590773,0.0631406307220459,0.546317098590773
259,10,RandomForest,2,0.2,0.8125,0.4691135785254244,0.34690427780151367,0.4691135785254244
260,10,AdaBoost (Discrete),2,0.2,0.8251,0.5826094208439243,22.36610722541809,0.5826094208439243
261,10,AdaBoost (Real),2,0.2,0.8219,0.5545294569855478,63.32176399230957,0.5545294569855478
262,10,Logistic Regression (Penalty = L2),2,0.2,0.807,0.43138056976610795,0.23734307289123535,0.43138056976610795
263,10,Naive Bayes,2,0.2,0.8114,0.6014641652923668,0.11545872688293457,0.6014641652923668
264,11,KNeighbors Classifier,0,0.2,0.7693,0.5626352651215897,8.165494680404663,0.5626352651215897
265,11,SVC Classifier,0,0.2,0.7795,0.09014398837291854,44.29947376251221,0.09014398837291854
266,11,Decision Tree,0,0.2,0.7293,0.5506147333244648,0.40456342697143555,0.5506147333244648
267,11,RandomForest,0,0.2,0.8035,0.4754245698808748,0.6410722732543945,0.4754245698808748
268,11,AdaBoost (Discrete),0,0.2,0.8095,0.5748450463931347,78.77289485931396,0.5748450463931347
269,11,AdaBoost (Real),0,0.2,0.7829,0.5524940893931848,89.1821858882904,0.5524940893931848
270,11,Logistic Regression (Penalty = L2),0,0.2,0.8073,0.489258070940711,0.2100834846496582,0.489258070940711
271,11,Naive Bayes,0,0.2,0.7745,0.649403385181403,0.10931038856506348,0.649403385181403
272,11,KNeighbors Classifier,1,0.2,0.7809,0.6048319163742457,8.853513956069946,0.6048319163742457
273,11,SVC Classifier,1,0.2,0.7788,1.0,40.54321813583374,0.0
274,11,Decision Tree,1,0.2,0.7272,0.583240913239975,0.2564539909362793,0.583240913239975
275,11,RandomForest,1,0.2,0.8118,0.49484873509065247,0.5731956958770752,0.49484873509065247
276,11,AdaBoost (Discrete),1,0.2,0.8205,0.6147473082670034,72.2336642742157,0.6147473082670034
277,11,AdaBoost (Real),1,0.2,0.7956,0.5942695342059265,84.54430770874023,0.5942695342059265
278,11,Logistic Regression (Penalty = L2),1,0.2,0.8088,0.4697300803602235,0.27579402923583984,0.4697300803602235
279,11,Naive Bayes,1,0.2,0.7794,0.7000390802903148,0.11335968971252441,0.7000390802903148
280,11,KNeighbors Classifier,2,0.2,0.7814,0.5636988919615741,7.70988655090332,0.5636988919615741
281,11,SVC Classifier,2,0.2,0.7788,1.0,37.98886442184448,0.0
282,11,Decision Tree,2,0.2,0.7366,0.5643944353359278,0.30994367599487305,0.5643944353359278
283,11,RandomForest,2,0.2,0.8071,0.42896707678159773,0.5127637386322021,0.42896707678159773
284,11,AdaBoost (Discrete),2,0.2,0.8204,0.5679536660750757,71.3695297241211,0.5679536660750757
285,11,AdaBoost (Real),2,0.2,0.793,0.5475692450261834,84.74093627929688,0.5475692450261834
286,11,Logistic Regression (Penalty = L2),2,0.2,0.808,0.4374570629390254,0.355039119720459,0.4374570629390254
287,11,Naive Bayes,2,0.2,0.7963,0.6667522822990641,0.1191565990447998,0.6667522822990641
288,12,KNeighbors Classifier,0,0.2,0.3898,0.4465368785977873,4.9459521770477295,0.4465368785977873
289,12,SVC Classifier,0,0.2,0.7788,1.0,20.448909997940063,0.0
290,12,Decision Tree,0,0.2,0.8091,0.5331998579600798,0.06118345260620117,0.5331998579600798
291,12,RandomForest,0,0.2,0.8098,0.5374868162767433,0.3932986259460449,0.5374868162767433
292,12,AdaBoost (Discrete),0,0.2,0.8091,0.5331998579600798,17.46282434463501,0.5331998579600798
293,12,AdaBoost (Real),0,0.2,0.8097,0.5359881800938336,313.9294979572296,0.5359881800938336
294,12,Logistic Regression (Penalty = L2),0,0.2,0.8098,0.5374868162767433,0.10681939125061035,0.5374868162767433
295,12,Naive Bayes,0,0.2,0.8098,0.5374868162767433,0.0443415641784668,0.5374868162767433
296,12,KNeighbors Classifier,1,0.2,0.7373,0.4167498066475552,5.4418957233428955,0.4167498066475552
297,12,SVC Classifier,1,0.2,0.7788,1.0,16.712693214416504,0.0
298,12,Decision Tree,1,0.2,0.8245,0.584698307625315,0.03523874282836914,0.584698307625315
299,12,RandomForest,1,0.2,0.8249,0.5865063598458912,0.26456427574157715,0.5865063598458912
300,12,AdaBoost (Discrete),1,0.2,0.8245,0.584698307625315,16.125547170639038,0.584698307625315
301,12,AdaBoost (Real),1,0.2,0.8245,0.584698307625315,287.4399538040161,0.584698307625315
302,12,Logistic Regression (Penalty = L2),1,0.2,0.8249,0.5865063598458912,0.12290072441101074,0.5865063598458912
303,12,Naive Bayes,1,0.2,0.8249,0.5865063598458912,0.03860831260681152,0.5865063598458912
304,12,KNeighbors Classifier,2,0.2,0.7875,0.23526314858897693,4.0615949630737305,0.23526314858897693
305,12,SVC Classifier,2,0.2,0.7788,1.0,15.119685411453247,0.0
306,12,Decision Tree,2,0.2,0.824,0.5545891737925498,0.025832653045654297,0.5545891737925498
307,12,RandomForest,2,0.2,0.8241,0.5578316001828668,0.2334132194519043,0.5578316001828668
308,12,AdaBoost (Discrete),2,0.2,0.8241,0.5578316001828668,13.825229406356812,0.5578316001828668
309,12,AdaBoost (Real),2,0.2,0.8241,0.5553406581675171,299.6942627429962,0.5553406581675171
310,12,Logistic Regression (Penalty = L2),2,0.2,0.8241,0.5578316001828668,0.0966498851776123,0.5578316001828668
311,12,Naive Bayes,2,0.2,0.8241,0.5578316001828668,0.052368879318237305,0.5578316001828668
