,feat_set_id,classifier,fold_id,feat_th,score,geo_score,exec_t,geo_score_woz
0,0,KNeighbors Classifier,0,0.85,0.9746268656716418,0.9743512720372419,7.360129356384277,0.9743512720372419
1,0,SVC Classifier,0,0.85,0.9298507462686567,0.9290099832248492,9.036116123199463,0.9290099832248492
2,0,Decision Tree,0,0.85,0.7029850746268657,0.697231733825034,0.5177979469299316,0.697231733825034
3,0,RandomForest,0,0.85,0.6776119402985075,0.6035402905614504,1.579033374786377,0.6035402905614504
4,0,AdaBoost (Discrete),0,0.85,0.9343283582089552,0.9336184100879341,408.8228123188019,0.9336184100879341
5,0,AdaBoost (Real),0,0.85,0.8731343283582089,0.8711385092353083,489.1526777744293,0.8711385092353083
6,0,Logistic Regression (Penalty = L2),0,0.85,0.9567164179104478,0.9563313532344304,4.556338310241699,0.9563313532344304
7,0,Naive Bayes,0,0.85,0.9432835820895522,0.942691626336225,0.4350619316101074,0.942691626336225
8,0,KNeighbors Classifier,1,0.85,0.9537313432835821,0.9531767424762487,8.74526071548462,0.9531767424762487
9,0,SVC Classifier,1,0.85,0.9328358208955224,0.9319651339450524,10.312711715698242,0.9319651339450524
10,0,Decision Tree,1,0.85,0.7238805970149254,0.7219693732975615,0.5160722732543945,0.7219693732975615
11,0,RandomForest,1,0.85,0.6761194029850747,0.6474336429471871,1.6969122886657715,0.6474336429471871
12,0,AdaBoost (Discrete),1,0.85,0.935820895522388,0.9352476493046868,577.4469487667084,0.9352476493046868
13,0,AdaBoost (Real),1,0.85,0.8641791044776119,0.8620592691423877,537.3293933868408,0.8620592691423877
14,0,Logistic Regression (Penalty = L2),1,0.85,0.9432835820895522,0.9429341720758735,4.61321759223938,0.9429341720758735
15,0,Naive Bayes,1,0.85,0.926865671641791,0.9263333598289935,0.4808478355407715,0.9263333598289935
16,0,KNeighbors Classifier,2,0.85,0.9712121212121212,0.9707424403899485,9.790053606033325,0.9707424403899485
17,0,SVC Classifier,2,0.85,0.9257575757575758,0.9247789819819213,12.40969181060791,0.9247789819819213
18,0,Decision Tree,2,0.85,0.6909090909090909,0.685783973890373,0.6378846168518066,0.685783973890373
19,0,RandomForest,2,0.85,0.7015151515151515,0.650142566187642,2.083110809326172,0.650142566187642
20,0,AdaBoost (Discrete),2,0.85,0.9378787878787879,0.9372508420547663,581.7457711696625,0.9372508420547663
21,0,AdaBoost (Real),2,0.85,0.8984848484848484,0.8971051794222452,572.8610644340515,0.8971051794222452
22,0,Logistic Regression (Penalty = L2),2,0.85,0.9484848484848485,0.9480407215250224,4.332599878311157,0.9480407215250224
23,0,Naive Bayes,2,0.85,0.943939393939394,0.9437190253214418,0.5105550289154053,0.9437190253214418
24,1,KNeighbors Classifier,0,0.85,0.9716417910447761,0.9713094466933463,8.545320987701416,0.9713094466933463
25,1,SVC Classifier,0,0.85,0.9253731343283582,0.9243933965715573,10.217148303985596,0.9243933965715573
26,1,Decision Tree,0,0.85,0.7179104477611941,0.7093206970685542,0.5620622634887695,0.7093206970685542
27,1,RandomForest,0,0.85,0.682089552238806,0.6055317574286875,1.5650742053985596,0.6055317574286875
28,1,AdaBoost (Discrete),0,0.85,0.9343283582089552,0.9339425994619714,485.8473722934723,0.9339425994619714
29,1,AdaBoost (Real),0,0.85,0.8835820895522388,0.8796713629725755,537.1785092353821,0.8796713629725755
30,1,Logistic Regression (Penalty = L2),0,0.85,0.9477611940298507,0.9470231456579601,4.001656532287598,0.9470231456579601
31,1,Naive Bayes,0,0.85,0.9402985074626866,0.9398495765464242,0.38820338249206543,0.9398495765464242
32,1,KNeighbors Classifier,1,0.85,0.9582089552238806,0.9577464869300907,7.901013374328613,0.9577464869300907
33,1,SVC Classifier,1,0.85,0.9283582089552239,0.9265428567880313,9.487799406051636,0.9265428567880313
34,1,Decision Tree,1,0.85,0.7,0.6941744391260495,0.5493502616882324,0.6941744391260495
35,1,RandomForest,1,0.85,0.6776119402985075,0.6455010219138004,1.5716750621795654,0.6455010219138004
36,1,AdaBoost (Discrete),1,0.85,0.9194029850746268,0.9181814058760067,528.7741780281067,0.9181814058760067
37,1,AdaBoost (Real),1,0.85,0.7223880597014926,0.7159923310346045,532.5464158058167,0.7159923310346045
38,1,Logistic Regression (Penalty = L2),1,0.85,0.9507462686567164,0.9504399627376315,4.476252794265747,0.9504399627376315
39,1,Naive Bayes,1,0.85,0.9328358208955224,0.9323598518682262,0.4391300678253174,0.9323598518682262
40,1,KNeighbors Classifier,2,0.85,0.9636363636363636,0.9632713440844838,9.562078952789307,0.9632713440844838
41,1,SVC Classifier,2,0.85,0.9287878787878788,0.9278672426636295,11.250998735427856,0.9278672426636295
42,1,Decision Tree,2,0.85,0.6863636363636364,0.6813336351708845,0.4687364101409912,0.6813336351708845
43,1,RandomForest,2,0.85,0.7106060606060606,0.6611685661726808,1.7799537181854248,0.6611685661726808
44,1,AdaBoost (Discrete),2,0.85,0.9409090909090909,0.9404296509783283,502.25404477119446,0.9404296509783283
45,1,AdaBoost (Real),2,0.85,0.8757575757575757,0.8751648610205769,487.8129644393921,0.8751648610205769
46,1,Logistic Regression (Penalty = L2),2,0.85,0.9484848484848485,0.9481387682923645,4.207002401351929,0.9481387682923645
47,1,Naive Bayes,2,0.85,0.9409090909090909,0.9405071054777626,0.418424129486084,0.9405071054777626
48,2,KNeighbors Classifier,0,0.85,0.9746268656716418,0.9742791410231056,8.518980979919434,0.9742791410231056
49,2,SVC Classifier,0,0.85,0.908955223880597,0.9078555698072308,10.839391231536865,0.9078555698072308
50,2,Decision Tree,0,0.85,0.7059701492537314,0.7009791327552166,0.5030765533447266,0.7009791327552166
51,2,RandomForest,0,0.85,0.6611940298507463,0.5820425018469951,1.7310540676116943,0.5820425018469951
52,2,AdaBoost (Discrete),0,0.85,0.9313432835820895,0.9305893011069587,1516.2349667549133,0.9305893011069587
53,2,AdaBoost (Real),0,0.85,0.8731343283582089,0.8715202481220258,375.2188210487366,0.8715202481220258
54,2,Logistic Regression (Penalty = L2),0,0.85,0.9477611940298507,0.9470044394752068,3.030261516571045,0.9470044394752068
55,2,Naive Bayes,0,0.85,0.9223880597014925,0.9219604344864735,0.2750513553619385,0.9219604344864735
56,2,KNeighbors Classifier,1,0.85,0.9462686567164179,0.9455238083567309,6.006717681884766,0.9455238083567309
57,2,SVC Classifier,1,0.85,0.917910447761194,0.9166122810144951,7.868985414505005,0.9166122810144951
58,2,Decision Tree,1,0.85,0.6776119402985075,0.671720599411207,0.4238560199737549,0.671720599411207
59,2,RandomForest,1,0.85,0.7149253731343284,0.6355820484143085,1.1976113319396973,0.6355820484143085
60,2,AdaBoost (Discrete),1,0.85,0.917910447761194,0.9168838944121841,325.673043012619,0.9168838944121841
61,2,AdaBoost (Real),1,0.85,0.8820895522388059,0.8794748060193381,336.62415289878845,0.8794748060193381
62,2,Logistic Regression (Penalty = L2),1,0.85,0.9462686567164179,0.94591463870598,2.6765756607055664,0.94591463870598
63,2,Naive Bayes,1,0.85,0.9238805970149254,0.9234318922405971,0.367565393447876,0.9234318922405971
64,2,KNeighbors Classifier,2,0.85,0.9545454545454546,0.9536328149095995,5.3765623569488525,0.9536328149095995
65,2,SVC Classifier,2,0.85,0.9227272727272727,0.9214118898546847,6.981074571609497,0.9214118898546847
66,2,Decision Tree,2,0.85,0.6984848484848485,0.691693984132849,0.38230371475219727,0.691693984132849
67,2,RandomForest,2,0.85,0.706060606060606,0.6097248712250988,1.0691795349121094,0.6097248712250988
68,2,AdaBoost (Discrete),2,0.85,0.9333333333333333,0.9330615732691994,306.62515664100647,0.9330615732691994
69,2,AdaBoost (Real),2,0.85,0.8984848484848484,0.8964096571319076,332.8788287639618,0.8964096571319076
70,2,Logistic Regression (Penalty = L2),2,0.85,0.943939393939394,0.9435715230620709,2.4837217330932617,0.9435715230620709
71,2,Naive Bayes,2,0.85,0.9393939393939394,0.9392228290535691,0.276425838470459,0.9392228290535691
72,3,KNeighbors Classifier,0,0.85,0.9701492537313433,0.9697343635714698,5.346089124679565,0.9697343635714698
73,3,SVC Classifier,0,0.85,0.9253731343283582,0.9243793494892759,6.433072566986084,0.9243793494892759
74,3,Decision Tree,0,0.85,0.6895522388059702,0.6845302808076831,0.18619537353515625,0.6845302808076831
75,3,RandomForest,0,0.85,0.6761194029850747,0.6461064824905858,0.8047151565551758,0.6461064824905858
76,3,AdaBoost (Discrete),0,0.85,0.9373134328358209,0.9367253417286323,247.10333943367004,0.9367253417286323
77,3,AdaBoost (Real),0,0.85,0.8671641791044776,0.8637540879018353,245.04299688339233,0.8637540879018353
78,3,Logistic Regression (Penalty = L2),0,0.85,0.9507462686567164,0.9499108238657042,2.018612861633301,0.9499108238657042
79,3,Naive Bayes,0,0.85,0.9447761194029851,0.9442274042755687,0.23964667320251465,0.9442274042755687
80,3,KNeighbors Classifier,1,0.85,0.9552238805970149,0.9547046821574271,4.425372838973999,0.9547046821574271
81,3,SVC Classifier,1,0.85,0.9283582089552239,0.9267922963924802,5.672628402709961,0.9267922963924802
82,3,Decision Tree,1,0.85,0.7014925373134329,0.6973204874574095,0.2400040626525879,0.6973204874574095
83,3,RandomForest,1,0.85,0.6343283582089553,0.5088857100068587,0.8789663314819336,0.5088857100068587
84,3,AdaBoost (Discrete),1,0.85,0.9343283582089552,0.9336282305748024,235.9755311012268,0.9336282305748024
85,3,AdaBoost (Real),1,0.85,0.8656716417910447,0.8642590430038921,235.74868631362915,0.8642590430038921
86,3,Logistic Regression (Penalty = L2),1,0.85,0.9447761194029851,0.9443949244830465,2.2622175216674805,0.9443949244830465
87,3,Naive Bayes,1,0.85,0.9417910447761194,0.9413331679642333,0.2721443176269531,0.9413331679642333
88,3,KNeighbors Classifier,2,0.85,0.9742424242424242,0.9738221935538086,4.6529951095581055,0.9738221935538086
89,3,SVC Classifier,2,0.85,0.9272727272727272,0.9264991555232794,6.097464084625244,0.9264991555232794
90,3,Decision Tree,2,0.85,0.7303030303030303,0.7246321686897916,0.33363866806030273,0.7246321686897916
91,3,RandomForest,2,0.85,0.6666666666666666,0.6195532821471681,0.9103941917419434,0.6195532821471681
92,3,AdaBoost (Discrete),2,0.85,0.9409090909090909,0.9401035683919677,249.6260724067688,0.9401035683919677
93,3,AdaBoost (Real),2,0.85,0.9136363636363637,0.9128708581338899,247.50135564804077,0.9128708581338899
94,3,Logistic Regression (Penalty = L2),2,0.85,0.9484848484848485,0.9481642528110099,2.22758412361145,0.9481642528110099
95,3,Naive Bayes,2,0.85,0.946969696969697,0.9466920804740581,0.23108243942260742,0.9466920804740581
96,4,KNeighbors Classifier,0,0.85,0.9716417910447761,0.9713310234785885,4.238908529281616,0.9713310234785885
97,4,SVC Classifier,0,0.85,0.9044776119402985,0.9030069683062718,5.638587474822998,0.9030069683062718
98,4,Decision Tree,0,0.85,0.6776119402985075,0.672800214865412,0.23998069763183594,0.672800214865412
99,4,RandomForest,0,0.85,0.6313432835820896,0.5245731788331628,0.8921878337860107,0.5245731788331628
100,4,AdaBoost (Discrete),0,0.85,0.9343283582089552,0.9335382755006574,230.27147889137268,0.9335382755006574
101,4,AdaBoost (Real),0,0.85,0.8985074626865671,0.8972426352380182,268.59393095970154,0.8972426352380182
102,4,Logistic Regression (Penalty = L2),0,0.85,0.9462686567164179,0.9455028048433444,2.2668297290802,0.9455028048433444
103,4,Naive Bayes,0,0.85,0.9313432835820895,0.9308655625888882,0.21704578399658203,0.9308655625888882
104,4,KNeighbors Classifier,1,0.85,0.9477611940298507,0.9471080738966483,4.011640548706055,0.9471080738966483
105,4,SVC Classifier,1,0.85,0.9194029850746268,0.9182165354669911,5.182174444198608,0.9182165354669911
106,4,Decision Tree,1,0.85,0.6940298507462687,0.6873633427593937,0.22688865661621094,0.6873633427593937
107,4,RandomForest,1,0.85,0.6313432835820896,0.4909144399627168,0.7688405513763428,0.4909144399627168
108,4,AdaBoost (Discrete),1,0.85,0.917910447761194,0.9173472698345728,242.68200039863586,0.9173472698345728
109,4,AdaBoost (Real),1,0.85,0.8283582089552238,0.8260492127870737,263.3297998905182,0.8260492127870737
110,4,Logistic Regression (Penalty = L2),1,0.85,0.9462686567164179,0.94591463870598,2.394561290740967,0.94591463870598
111,4,Naive Bayes,1,0.85,0.9223880597014925,0.9218579431821002,0.29408860206604004,0.9218579431821002
112,4,KNeighbors Classifier,2,0.85,0.9712121212121212,0.9706893813063314,5.237080097198486,0.9706893813063314
113,4,SVC Classifier,2,0.85,0.9227272727272727,0.9214598750525835,6.984647274017334,0.9214598750525835
114,4,Decision Tree,2,0.85,0.6984848484848485,0.6925361610094399,0.30225062370300293,0.6925361610094399
115,4,RandomForest,2,0.85,0.6484848484848484,0.47131727035179044,1.0444636344909668,0.47131727035179044
116,4,AdaBoost (Discrete),2,0.85,0.9393939393939394,0.9391478274204623,279.79409193992615,0.9391478274204623
117,4,AdaBoost (Real),2,0.85,0.8848484848484849,0.8831958141359028,283.3581545352936,0.8831958141359028
118,4,Logistic Regression (Penalty = L2),2,0.85,0.9424242424242424,0.9419599188754696,2.2260148525238037,0.9419599188754696
119,4,Naive Bayes,2,0.85,0.9393939393939394,0.939197584860247,0.23871517181396484,0.939197584860247
120,5,KNeighbors Classifier,0,0.85,0.9731343283582089,0.9729793113322783,4.726930141448975,0.9729793113322783
121,5,SVC Classifier,0,0.85,0.908955223880597,0.9081616780599612,5.843922853469849,0.9081616780599612
122,5,Decision Tree,0,0.85,0.6955223880597015,0.6902614972385804,0.18577241897583008,0.6902614972385804
123,5,RandomForest,0,0.85,0.5985074626865672,0.5568163007483012,0.9895727634429932,0.5568163007483012
124,5,AdaBoost (Discrete),0,0.85,0.9134328358208955,0.9121885504544283,270.6842768192291,0.9121885504544283
125,5,AdaBoost (Real),0,0.85,0.8970149253731343,0.8957984010377511,288.329491853714,0.8957984010377511
126,5,Logistic Regression (Penalty = L2),0,0.85,0.9492537313432836,0.9486847148520083,2.3077526092529297,0.9486847148520083
127,5,Naive Bayes,0,0.85,0.9223880597014925,0.922062486136903,0.27628278732299805,0.922062486136903
128,5,KNeighbors Classifier,1,0.85,0.9447761194029851,0.9441529642261113,4.572697401046753,0.9441529642261113
129,5,SVC Classifier,1,0.85,0.908955223880597,0.9073424098150237,6.597431898117065,0.9073424098150237
130,5,Decision Tree,1,0.85,0.7253731343283583,0.7223356850174235,0.30328989028930664,0.7223356850174235
131,5,RandomForest,1,0.85,0.6283582089552239,0.591687590444591,1.0533778667449951,0.591687590444591
132,5,AdaBoost (Discrete),1,0.85,0.926865671641791,0.9261685925114795,268.1635410785675,0.9261685925114795
133,5,AdaBoost (Real),1,0.85,0.8820895522388059,0.8815614591886577,263.6808822154999,0.8815614591886577
134,5,Logistic Regression (Penalty = L2),1,0.85,0.9462686567164179,0.9458407708612027,2.0933849811553955,0.9458407708612027
135,5,Naive Bayes,1,0.85,0.9194029850746268,0.9188385943418438,0.25736355781555176,0.9188385943418438
136,5,KNeighbors Classifier,2,0.85,0.9545454545454546,0.9537584637005935,4.234149217605591,0.9537584637005935
137,5,SVC Classifier,2,0.85,0.9181818181818182,0.9167232329255955,5.623706579208374,0.9167232329255955
138,5,Decision Tree,2,0.85,0.7090909090909091,0.7019557262312469,0.2478947639465332,0.7019557262312469
139,5,RandomForest,2,0.85,0.6530303030303031,0.6008705803087588,0.9611828327178955,0.6008705803087588
140,5,AdaBoost (Discrete),2,0.85,0.9272727272727272,0.9266819938949112,254.16099619865417,0.9266819938949112
141,5,AdaBoost (Real),2,0.85,0.906060606060606,0.9041779725101439,267.0936019420624,0.9041779725101439
142,5,Logistic Regression (Penalty = L2),2,0.85,0.943939393939394,0.9436928869099815,2.0637192726135254,0.9436928869099815
143,5,Naive Bayes,2,0.85,0.9363636363636364,0.9360214903302927,0.2268047332763672,0.9360214903302927
144,6,KNeighbors Classifier,0,0.85,0.9731343283582089,0.9728165509973292,5.1725592613220215,0.9728165509973292
145,6,SVC Classifier,0,0.85,0.9313432835820895,0.9307404311000904,6.286848783493042,0.9307404311000904
146,6,Decision Tree,0,0.85,0.6880597014925374,0.677324628893535,0.28935790061950684,0.677324628893535
147,6,RandomForest,0,0.85,0.6223880597014926,0.5374308094681739,0.9842362403869629,0.5374308094681739
148,6,AdaBoost (Discrete),0,0.85,0.9328358208955224,0.932321774935065,289.7010705471039,0.932321774935065
149,6,AdaBoost (Real),0,0.85,0.8716417910447761,0.8679048330780293,283.6791670322418,0.8679048330780293
150,6,Logistic Regression (Penalty = L2),0,0.85,0.9507462686567164,0.9501335144086935,2.1437110900878906,0.9501335144086935
151,6,Naive Bayes,0,0.85,0.9402985074626866,0.9397707411686198,0.2284717559814453,0.9397707411686198
152,6,KNeighbors Classifier,1,0.85,0.9537313432835821,0.9532225804026553,4.6424620151519775,0.9532225804026553
153,6,SVC Classifier,1,0.85,0.9343283582089552,0.9330821655368036,5.675271272659302,0.9330821655368036
154,6,Decision Tree,1,0.85,0.7522388059701492,0.7475034228715217,0.22756266593933105,0.7475034228715217
155,6,RandomForest,1,0.85,0.6776119402985075,0.6119620244613408,0.8488683700561523,0.6119620244613408
156,6,AdaBoost (Discrete),1,0.85,0.9283582089552239,0.9274747532176147,260.1264383792877,0.9274747532176147
157,6,AdaBoost (Real),1,0.85,0.8552238805970149,0.8549096775421041,253.53941822052002,0.8549096775421041
158,6,Logistic Regression (Penalty = L2),1,0.85,0.9507462686567164,0.9504864117579572,2.2129478454589844,0.9504864117579572
159,6,Naive Bayes,1,0.85,0.9298507462686567,0.9294233762829391,0.25141453742980957,0.9294233762829391
160,6,KNeighbors Classifier,2,0.85,0.9575757575757575,0.9568109026994783,4.346597671508789,0.9568109026994783
161,6,SVC Classifier,2,0.85,0.9318181818181818,0.930866946270311,5.19655966758728,0.930866946270311
162,6,Decision Tree,2,0.85,0.7181818181818181,0.7124022526242247,0.25589895248413086,0.7124022526242247
163,6,RandomForest,2,0.85,0.6803030303030303,0.6510243365159097,0.7592818737030029,0.6510243365159097
164,6,AdaBoost (Discrete),2,0.85,0.9409090909090909,0.9401087223971849,236.23384976387024,0.9401087223971849
165,6,AdaBoost (Real),2,0.85,0.8984848484848484,0.8977175870352743,225.11971831321716,0.8977175870352743
166,6,Logistic Regression (Penalty = L2),2,0.85,0.9454545454545454,0.9449118059839565,1.77890944480896,0.9449118059839565
167,6,Naive Bayes,2,0.85,0.9393939393939394,0.9391991624036851,0.2886993885040283,0.9391991624036851
168,7,KNeighbors Classifier,0,0.85,0.9731343283582089,0.9728165509973292,4.325834512710571,0.9728165509973292
169,7,SVC Classifier,0,0.85,0.926865671641791,0.9260465388671443,5.0667948722839355,0.9260465388671443
170,7,Decision Tree,0,0.85,0.6611940298507463,0.6560045590841416,0.23876357078552246,0.6560045590841416
171,7,RandomForest,0,0.85,0.6402985074626866,0.5661709126132192,0.6919541358947754,0.5661709126132192
172,7,AdaBoost (Discrete),0,0.85,0.9313432835820895,0.9305060629250039,234.6711940765381,0.9305060629250039
173,7,AdaBoost (Real),0,0.85,0.8955223880597015,0.8929515856035113,229.95901370048523,0.8929515856035113
174,7,Logistic Regression (Penalty = L2),0,0.85,0.9492537313432836,0.948803047326579,1.9277899265289307,0.948803047326579
175,7,Naive Bayes,0,0.85,0.9402985074626866,0.9397960007675062,0.17050457000732422,0.9397960007675062
176,7,KNeighbors Classifier,1,0.85,0.9537313432835821,0.9530804250443204,4.0057878494262695,0.9530804250443204
177,7,SVC Classifier,1,0.85,0.9313432835820895,0.9303335418379779,4.595041513442993,0.9303335418379779
178,7,Decision Tree,1,0.85,0.6223880597014926,0.6129866791421841,0.18872928619384766,0.6129866791421841
179,7,RandomForest,1,0.85,0.6283582089552239,0.5087224891912556,0.6673028469085693,0.5087224891912556
180,7,AdaBoost (Discrete),1,0.85,0.9328358208955224,0.932122018004199,214.0444576740265,0.932122018004199
181,7,AdaBoost (Real),1,0.85,0.8641791044776119,0.8625431725428981,206.57032108306885,0.8625431725428981
182,7,Logistic Regression (Penalty = L2),1,0.85,0.9447761194029851,0.9445624744111403,1.588634729385376,0.9445624744111403
183,7,Naive Bayes,1,0.85,0.9283582089552239,0.9279623977720622,0.16890931129455566,0.9279623977720622
184,7,KNeighbors Classifier,2,0.85,0.95,0.9487112820279189,3.540661334991455,0.9487112820279189
185,7,SVC Classifier,2,0.85,0.9318181818181818,0.9309405591486738,4.413672208786011,0.9309405591486738
186,7,Decision Tree,2,0.85,0.6893939393939394,0.6843672170712654,0.15285348892211914,0.6843672170712654
187,7,RandomForest,2,0.85,0.646969696969697,0.5831122518992196,0.5646722316741943,0.5831122518992196
188,7,AdaBoost (Discrete),2,0.85,0.9424242424242424,0.941966416216907,201.91751956939697,0.941966416216907
189,7,AdaBoost (Real),2,0.85,0.8848484848484849,0.8824609107298035,182.865562915802,0.8824609107298035
190,7,Logistic Regression (Penalty = L2),2,0.85,0.946969696969697,0.9462473862784129,1.480945110321045,0.9462473862784129
191,7,Naive Bayes,2,0.85,0.943939393939394,0.9436706926771692,0.15644192695617676,0.9436706926771692
192,8,KNeighbors Classifier,0,0.85,0.9716417910447761,0.971446818744578,2.2784576416015625,0.971446818744578
193,8,SVC Classifier,0,0.85,0.9029850746268657,0.9019182589428413,2.8119633197784424,0.9019182589428413
194,8,Decision Tree,0,0.85,0.664179104477612,0.658278980934283,0.17333769798278809,0.658278980934283
195,8,RandomForest,0,0.85,0.6880597014925374,0.650859437184277,0.5163602828979492,0.650859437184277
196,8,AdaBoost (Discrete),0,0.85,0.926865671641791,0.9259138354847408,121.27038049697876,0.9259138354847408
197,8,AdaBoost (Real),0,0.85,0.8865671641791045,0.8840744864910949,126.03704261779785,0.8840744864910949
198,8,Logistic Regression (Penalty = L2),0,0.85,0.9477611940298507,0.9468556092658454,1.1232945919036865,0.9468556092658454
199,8,Naive Bayes,0,0.85,0.9298507462686567,0.9295383734387394,0.18262028694152832,0.9295383734387394
200,8,KNeighbors Classifier,1,0.85,0.9522388059701492,0.9514799168707163,2.315828561782837,0.9514799168707163
201,8,SVC Classifier,1,0.85,0.9119402985074627,0.910442913426601,2.7789523601531982,0.910442913426601
202,8,Decision Tree,1,0.85,0.735820895522388,0.7271028380071756,0.11461567878723145,0.7271028380071756
203,8,RandomForest,1,0.85,0.6597014925373135,0.6224501180262978,0.4331669807434082,0.6224501180262978
204,8,AdaBoost (Discrete),1,0.85,0.9104477611940298,0.9094715206076864,110.80432367324829,0.9094715206076864
205,8,AdaBoost (Real),1,0.85,0.8865671641791045,0.88615734948985,122.82763075828552,0.88615734948985
206,8,Logistic Regression (Penalty = L2),1,0.85,0.9447761194029851,0.9443508875083234,1.0526022911071777,0.9443508875083234
207,8,Naive Bayes,1,0.85,0.9223880597014925,0.921662835768943,0.1356501579284668,0.921662835768943
208,8,KNeighbors Classifier,2,0.85,0.9712121212121212,0.9709628383586548,2.0573325157165527,0.9709628383586548
209,8,SVC Classifier,2,0.85,0.9227272727272727,0.9218269349969249,2.605994701385498,0.9218269349969249
210,8,Decision Tree,2,0.85,0.7,0.6968843873167413,0.15405941009521484,0.6968843873167413
211,8,RandomForest,2,0.85,0.7136363636363636,0.683666960473778,0.44751906394958496,0.683666960473778
212,8,AdaBoost (Discrete),2,0.85,0.9348484848484848,0.9342009862872169,110.53304839134216,0.9342009862872169
213,8,AdaBoost (Real),2,0.85,0.8696969696969697,0.8668912737704573,109.34720253944397,0.8668912737704573
214,8,Logistic Regression (Penalty = L2),2,0.85,0.9545454545454546,0.9542333432457073,0.900404691696167,0.9542333432457073
215,8,Naive Bayes,2,0.85,0.9393939393939394,0.939045081627545,0.1032414436340332,0.939045081627545
