,feat_set_id,classifier,fold_id,feat_th,score,geo_score,exec_t,geo_score_woz
0,0,KNeighbors Classifier,0,0.1,0.9647887323943662,0.907539441290753,0.5813229084014893,0.907539441290753
1,0,SVC Classifier,0,0.1,0.8901408450704226,0.4236090741960986,0.454944372177124,0.4236090741960986
2,0,Decision Tree,0,0.1,0.9647887323943662,0.907539441290753,0.07914900779724121,0.907539441290753
3,0,RandomForest,0,0.1,0.8901408450704226,0.4236090741960986,0.5530264377593994,0.4236090741960986
4,0,AdaBoost (Discrete),0,0.1,0.9647887323943662,0.907539441290753,37.28446650505066,0.907539441290753
5,0,AdaBoost (Real),0,0.1,0.9647887323943662,0.907539441290753,48.04588317871094,0.907539441290753
6,0,Logistic Regression (Penalty = L2),0,0.1,0.9647887323943662,0.907539441290753,0.32514476776123047,0.907539441290753
7,0,Naive Bayes,0,0.1,0.9647887323943662,0.907539441290753,0.09279179573059082,0.907539441290753
8,0,KNeighbors Classifier,1,0.1,0.9548660084626234,0.8759410972579285,0.5650269985198975,0.8759410972579285
9,0,SVC Classifier,1,0.1,0.9548660084626234,0.8759410972579285,0.5444202423095703,0.8759410972579285
10,0,Decision Tree,1,0.1,0.9548660084626234,0.8759410972579285,0.09053564071655273,0.8759410972579285
11,0,RandomForest,1,0.1,0.8942172073342737,0.5580793993242377,0.5551159381866455,0.5580793993242377
12,0,AdaBoost (Discrete),1,0.1,0.9548660084626234,0.8759410972579285,40.41342520713806,0.8759410972579285
13,0,AdaBoost (Real),1,0.1,0.9576868829337094,0.8845716145882833,67.80996775627136,0.8845716145882833
14,0,Logistic Regression (Penalty = L2),1,0.1,0.9576868829337094,0.8845716145882833,0.23574066162109375,0.8845716145882833
15,0,Naive Bayes,1,0.1,0.9548660084626234,0.8759410972579285,0.11536121368408203,0.8759410972579285
16,0,KNeighbors Classifier,2,0.1,0.9405940594059405,0.8298265333662435,0.9505100250244141,0.8298265333662435
17,0,SVC Classifier,2,0.1,0.9391796322489392,0.8248573930653896,0.5816695690155029,0.8248573930653896
18,0,Decision Tree,2,0.1,0.9405940594059405,0.8298265333662435,0.11051511764526367,0.8298265333662435
19,0,RandomForest,2,0.1,0.8571428571428571,0.7491491772643939,0.8218843936920166,0.0
20,0,AdaBoost (Discrete),2,0.1,0.9391796322489392,0.8248573930653896,48.70387411117554,0.8248573930653896
21,0,AdaBoost (Real),2,0.1,0.9405940594059405,0.8298265333662435,58.8688600063324,0.8298265333662435
22,0,Logistic Regression (Penalty = L2),2,0.1,0.9405940594059405,0.8298265333662435,0.22747802734375,0.8298265333662435
23,0,Naive Bayes,2,0.1,0.9391796322489392,0.8248573930653896,0.12048482894897461,0.8248573930653896
24,1,KNeighbors Classifier,0,0.1,0.7774647887323943,1.0,0.5530004501342773,0.0
25,1,SVC Classifier,0,0.1,0.7774647887323943,1.0,0.6635723114013672,0.0
26,1,Decision Tree,0,0.1,0.7774647887323943,1.0,0.002550363540649414,0.0
27,1,RandomForest,0,0.1,0.7774647887323943,1.0,0.5617632865905762,0.0
28,1,AdaBoost (Discrete),0,0.1,0.7774647887323943,1.0,46.12430000305176,0.0
29,1,AdaBoost (Real),0,0.1,0.7774647887323943,1.0,57.77737259864807,0.0
30,1,Logistic Regression (Penalty = L2),0,0.1,0.7774647887323943,1.0,0.12244176864624023,0.0
31,1,Naive Bayes,0,0.1,0.780281690140845,0.9469631093315001,0.13561773300170898,0.0
32,1,KNeighbors Classifier,1,0.1,0.764456981664316,0.8932711255583521,0.4488649368286133,0.0
33,1,SVC Classifier,1,0.1,0.7785613540197461,1.0,0.6777572631835938,0.0
34,1,Decision Tree,1,0.1,0.764456981664316,0.8932711255583521,0.10650205612182617,0.0
35,1,RandomForest,1,0.1,0.7785613540197461,1.0,0.7872366905212402,0.0
36,1,AdaBoost (Discrete),1,0.1,0.764456981664316,0.8932711255583521,46.126532554626465,0.0
37,1,AdaBoost (Real),1,0.1,0.764456981664316,0.8932711255583521,55.578726291656494,0.0
38,1,Logistic Regression (Penalty = L2),1,0.1,0.764456981664316,0.8932711255583521,0.2210850715637207,0.0
39,1,Naive Bayes,1,0.1,0.7108603667136812,0.8978638094331762,0.11619019508361816,0.0
40,1,KNeighbors Classifier,2,0.1,0.7454031117397454,0.8717959332267562,0.5565173625946045,0.0
41,1,SVC Classifier,2,0.1,0.7793493635077794,1.0,0.8397510051727295,0.0
42,1,Decision Tree,2,0.1,0.7454031117397454,0.8717959332267562,0.002474546432495117,0.0
43,1,RandomForest,2,0.1,0.7793493635077794,1.0,0.7872879505157471,0.0
44,1,AdaBoost (Discrete),2,0.1,0.7454031117397454,0.8717959332267562,46.65206861495972,0.0
45,1,AdaBoost (Real),2,0.1,0.7454031117397454,0.8717959332267562,59.45316457748413,0.0
46,1,Logistic Regression (Penalty = L2),2,0.1,0.7454031117397454,0.8717959332267562,0.11022806167602539,0.0
47,1,Naive Bayes,2,0.1,0.693069306930693,0.8854541422979073,0.002652406692504883,0.0
48,2,KNeighbors Classifier,0,0.1,0.7774647887323943,1.0,0.6468570232391357,0.0
49,2,SVC Classifier,0,0.1,0.7774647887323943,1.0,0.7286534309387207,0.0
50,2,Decision Tree,0,0.1,0.7774647887323943,1.0,0.07880759239196777,0.0
51,2,RandomForest,0,0.1,0.7774647887323943,1.0,0.640202522277832,0.0
52,2,AdaBoost (Discrete),0,0.1,0.7774647887323943,1.0,41.75906014442444,0.0
53,2,AdaBoost (Real),0,0.1,0.7774647887323943,1.0,49.82963037490845,0.0
54,2,Logistic Regression (Penalty = L2),0,0.1,0.7774647887323943,1.0,0.21285557746887207,0.0
55,2,Naive Bayes,0,0.1,0.8112676056338028,0.967777971901898,0.2131650447845459,0.0
56,2,KNeighbors Classifier,1,0.1,0.7884344146685472,0.9101736917030304,0.5521891117095947,0.0
57,2,SVC Classifier,1,0.1,0.7785613540197461,1.0,0.5391159057617188,0.0
58,2,Decision Tree,1,0.1,0.7884344146685472,0.9101736917030304,0.10705971717834473,0.0
59,2,RandomForest,1,0.1,0.7785613540197461,1.0,0.747124195098877,0.0
60,2,AdaBoost (Discrete),1,0.1,0.7884344146685472,0.9101736917030304,42.31358575820923,0.0
61,2,AdaBoost (Real),1,0.1,0.7884344146685472,0.9101736917030304,52.88241767883301,0.0
62,2,Logistic Regression (Penalty = L2),1,0.1,0.7884344146685472,0.9101736917030304,0.21606826782226562,0.0
63,2,Naive Bayes,1,0.1,0.7348377997179125,0.9148532788043832,0.002754688262939453,0.0
64,2,KNeighbors Classifier,2,0.1,0.7652050919377652,0.8858096246161654,0.4491257667541504,0.0
65,2,SVC Classifier,2,0.1,0.7793493635077794,1.0,0.6382625102996826,0.0
66,2,Decision Tree,2,0.1,0.7652050919377652,0.8858096246161654,0.10180377960205078,0.0
67,2,RandomForest,2,0.1,0.7793493635077794,1.0,0.7737588882446289,0.0
68,2,AdaBoost (Discrete),2,0.1,0.7652050919377652,0.8858096246161654,42.092920780181885,0.0
69,2,AdaBoost (Real),2,0.1,0.7652050919377652,0.8858096246161654,59.68901872634888,0.0
70,2,Logistic Regression (Penalty = L2),2,0.1,0.7652050919377652,0.8858096246161654,0.2965047359466553,0.0
71,2,Naive Bayes,2,0.1,0.7128712871287128,0.8996873826890499,0.16690278053283691,0.0
72,3,KNeighbors Classifier,0,0.1,0.9845070422535211,0.9705393645157323,0.967566967010498,0.9705393645157323
73,3,SVC Classifier,0,0.1,0.9098591549295775,0.4530153324120529,0.3650691509246826,0.4530153324120529
74,3,Decision Tree,0,0.1,0.9845070422535211,0.9705393645157323,0.09635710716247559,0.9705393645157323
75,3,RandomForest,0,0.1,0.8901408450704226,0.4236090741960986,0.6541781425476074,0.4236090741960986
76,3,AdaBoost (Discrete),0,0.1,0.8901408450704226,0.4236090741960986,45.450583696365356,0.4236090741960986
77,3,AdaBoost (Real),0,0.1,0.9845070422535211,0.9705393645157323,53.90935397148132,0.9705393645157323
78,3,Logistic Regression (Penalty = L2),0,0.1,0.9845070422535211,0.9705393645157323,0.3907470703125,0.9705393645157323
79,3,Naive Bayes,0,0.1,0.9845070422535211,0.9705393645157323,0.19237828254699707,0.9705393645157323
80,3,KNeighbors Classifier,1,0.1,0.9760225669957687,0.9369604361556937,1.551466703414917,0.9369604361556937
81,3,SVC Classifier,1,0.1,0.9760225669957687,0.9369604361556937,1.1151533126831055,0.9369604361556937
82,3,Decision Tree,1,0.1,0.9760225669957687,0.9369604361556937,0.1616230010986328,0.9369604361556937
83,3,RandomForest,1,0.1,0.8942172073342737,0.5580793993242377,1.6201732158660889,0.5580793993242377
84,3,AdaBoost (Discrete),1,0.1,0.9760225669957687,0.9369604361556937,84.72582650184631,0.9369604361556937
85,3,AdaBoost (Real),1,0.1,0.9760225669957687,0.9369604361556937,99.58011937141418,0.9369604361556937
86,3,Logistic Regression (Penalty = L2),1,0.1,0.9760225669957687,0.9369604361556937,0.4072568416595459,0.9369604361556937
87,3,Naive Bayes,1,0.1,0.9760225669957687,0.9369604361556937,0.4209630489349365,0.9369604361556937
88,3,KNeighbors Classifier,2,0.1,0.9915134370579916,0.9791605716903751,1.4818906784057617,0.9791605716903751
89,3,SVC Classifier,2,0.1,0.9391796322489392,0.8248573930653896,1.0400400161743164,0.8248573930653896
90,3,Decision Tree,2,0.1,0.9915134370579916,0.9791605716903751,0.0025701522827148438,0.9791605716903751
91,3,RandomForest,2,0.1,0.8571428571428571,0.7491491772643939,1.371495008468628,0.0
92,3,AdaBoost (Discrete),2,0.1,0.9391796322489392,0.8248573930653896,77.55996513366699,0.8248573930653896
93,3,AdaBoost (Real),2,0.1,0.9915134370579916,0.9791605716903751,105.23887014389038,0.9791605716903751
94,3,Logistic Regression (Penalty = L2),2,0.1,0.9915134370579916,0.9791605716903751,0.22140955924987793,0.9791605716903751
95,3,Naive Bayes,2,0.1,0.9915134370579916,0.9791605716903751,0.2106761932373047,0.9791605716903751
96,6,KNeighbors Classifier,0,0.1,0.9647887323943662,0.907539441290753,1.2923471927642822,0.907539441290753
97,6,SVC Classifier,0,0.1,0.8901408450704226,0.4236090741960986,0.944403886795044,0.4236090741960986
98,6,Decision Tree,0,0.1,0.9647887323943662,0.907539441290753,0.0016570091247558594,0.907539441290753
99,6,RandomForest,0,0.1,0.9647887323943662,0.907539441290753,1.262148141860962,0.907539441290753
100,6,AdaBoost (Discrete),0,0.1,0.9647887323943662,0.907539441290753,73.57232117652893,0.907539441290753
101,6,AdaBoost (Real),0,0.1,0.9647887323943662,0.907539441290753,105.92136740684509,0.907539441290753
102,6,Logistic Regression (Penalty = L2),0,0.1,0.9647887323943662,0.907539441290753,0.4466674327850342,0.907539441290753
103,6,Naive Bayes,0,0.1,0.9647887323943662,0.907539441290753,0.22696638107299805,0.907539441290753
104,6,KNeighbors Classifier,1,0.1,0.9548660084626234,0.8759410972579285,1.3972744941711426,0.8759410972579285
105,6,SVC Classifier,1,0.1,0.9548660084626234,0.8759410972579285,0.7310025691986084,0.8759410972579285
106,6,Decision Tree,1,0.1,0.9548660084626234,0.8759410972579285,0.20964694023132324,0.8759410972579285
107,6,RandomForest,1,0.1,0.9548660084626234,0.8759410972579285,1.581200361251831,0.8759410972579285
108,6,AdaBoost (Discrete),1,0.1,0.9548660084626234,0.8759410972579285,77.23731994628906,0.8759410972579285
109,6,AdaBoost (Real),1,0.1,0.9548660084626234,0.8759410972579285,105.5916063785553,0.8759410972579285
110,6,Logistic Regression (Penalty = L2),1,0.1,0.9548660084626234,0.8759410972579285,0.27575039863586426,0.8759410972579285
111,6,Naive Bayes,1,0.1,0.9548660084626234,0.8759410972579285,0.27660179138183594,0.8759410972579285
112,6,KNeighbors Classifier,2,0.1,0.9391796322489392,0.8248573930653896,0.997117280960083,0.8248573930653896
113,6,SVC Classifier,2,0.1,0.9391796322489392,0.8248573930653896,0.597111701965332,0.8248573930653896
114,6,Decision Tree,2,0.1,0.9391796322489392,0.8248573930653896,0.1141202449798584,0.8248573930653896
115,6,RandomForest,2,0.1,0.9391796322489392,0.8248573930653896,0.866816520690918,0.8248573930653896
116,6,AdaBoost (Discrete),2,0.1,0.9391796322489392,0.8248573930653896,44.73269701004028,0.8248573930653896
117,6,AdaBoost (Real),2,0.1,0.9391796322489392,0.8248573930653896,55.0713164806366,0.8248573930653896
118,6,Logistic Regression (Penalty = L2),2,0.1,0.9391796322489392,0.8248573930653896,0.2597172260284424,0.8248573930653896
119,6,Naive Bayes,2,0.1,0.9391796322489392,0.8248573930653896,0.12759971618652344,0.8248573930653896
120,7,KNeighbors Classifier,0,0.1,0.7774647887323943,1.0,0.6344714164733887,0.0
121,7,SVC Classifier,0,0.1,0.7774647887323943,1.0,0.7444484233856201,0.0
122,7,Decision Tree,0,0.1,0.7774647887323943,1.0,0.002413034439086914,0.0
123,7,RandomForest,0,0.1,0.7774647887323943,1.0,0.7672939300537109,0.0
124,7,AdaBoost (Discrete),0,0.1,0.7774647887323943,1.0,48.24102759361267,0.0
125,7,AdaBoost (Real),0,0.1,0.7774647887323943,1.0,59.82507944107056,0.0
126,7,Logistic Regression (Penalty = L2),0,0.1,0.7774647887323943,1.0,0.12140798568725586,0.0
127,7,Naive Bayes,0,0.1,0.780281690140845,0.9469631093315001,0.12023472785949707,0.0
128,7,KNeighbors Classifier,1,0.1,0.764456981664316,0.8932711255583521,0.5994710922241211,0.0
129,7,SVC Classifier,1,0.1,0.7785613540197461,1.0,0.720524787902832,0.0
130,7,Decision Tree,1,0.1,0.764456981664316,0.8932711255583521,0.11795186996459961,0.0
131,7,RandomForest,1,0.1,0.7785613540197461,1.0,0.7453689575195312,0.0
132,7,AdaBoost (Discrete),1,0.1,0.764456981664316,0.8932711255583521,48.21448636054993,0.0
133,7,AdaBoost (Real),1,0.1,0.764456981664316,0.8932711255583521,58.81255483627319,0.0
134,7,Logistic Regression (Penalty = L2),1,0.1,0.764456981664316,0.8932711255583521,0.24761652946472168,0.0
135,7,Naive Bayes,1,0.1,0.7108603667136812,0.8978638094331762,0.12457418441772461,0.0
136,7,KNeighbors Classifier,2,0.1,0.7454031117397454,0.8717959332267562,0.6204297542572021,0.0
137,7,SVC Classifier,2,0.1,0.7793493635077794,1.0,0.8657782077789307,0.0
138,7,Decision Tree,2,0.1,0.7454031117397454,0.8717959332267562,0.10665488243103027,0.0
139,7,RandomForest,2,0.1,0.7793493635077794,1.0,0.7467896938323975,0.0
140,7,AdaBoost (Discrete),2,0.1,0.7454031117397454,0.8717959332267562,49.50549817085266,0.0
141,7,AdaBoost (Real),2,0.1,0.7454031117397454,0.8717959332267562,60.1956901550293,0.0
142,7,Logistic Regression (Penalty = L2),2,0.1,0.7454031117397454,0.8717959332267562,0.25260353088378906,0.0
143,7,Naive Bayes,2,0.1,0.693069306930693,0.8854541422979073,0.12447977066040039,0.0
144,10,KNeighbors Classifier,0,0.1,0.9647887323943662,0.907539441290753,0.8742735385894775,0.907539441290753
145,10,SVC Classifier,0,0.1,0.8901408450704226,0.4236090741960986,0.7494146823883057,0.4236090741960986
146,10,Decision Tree,0,0.1,0.9647887323943662,0.907539441290753,0.0025777816772460938,0.907539441290753
147,10,RandomForest,0,0.1,0.8901408450704226,0.4236090741960986,0.9922516345977783,0.4236090741960986
148,10,AdaBoost (Discrete),0,0.1,0.8408450704225352,0.9240628129422016,48.01473927497864,0.9240628129422016
149,10,AdaBoost (Real),0,0.1,0.9647887323943662,0.907539441290753,61.24558067321777,0.907539441290753
150,10,Logistic Regression (Penalty = L2),0,0.1,0.9647887323943662,0.907539441290753,0.23132586479187012,0.907539441290753
151,10,Naive Bayes,0,0.1,0.9183098591549296,0.9610640543424557,0.11175417900085449,0.9610640543424557
152,10,KNeighbors Classifier,1,0.1,0.9548660084626234,0.8759410972579285,0.9183485507965088,0.8759410972579285
153,10,SVC Classifier,1,0.1,0.9548660084626234,0.8759410972579285,0.8100757598876953,0.8759410972579285
154,10,Decision Tree,1,0.1,0.9548660084626234,0.8759410972579285,0.1378469467163086,0.8759410972579285
155,10,RandomForest,1,0.1,0.9337094499294781,0.7927843292491847,0.8142476081848145,0.7927843292491847
156,10,AdaBoost (Discrete),1,0.1,0.846262341325811,0.9222475805967209,48.502761125564575,0.9222475805967209
157,10,AdaBoost (Real),1,0.1,0.9548660084626234,0.8759410972579285,58.946622371673584,0.8759410972579285
158,10,Logistic Regression (Penalty = L2),1,0.1,0.9548660084626234,0.8759410972579285,0.11741256713867188,0.8759410972579285
159,10,Naive Bayes,1,0.1,0.8039492242595204,0.8152332430314051,0.11640453338623047,0.8152332430314051
160,10,KNeighbors Classifier,2,0.1,0.9391796322489392,0.8248573930653896,1.01063871383667,0.8248573930653896
161,10,SVC Classifier,2,0.1,0.9391796322489392,0.8248573930653896,0.6803464889526367,0.8248573930653896
162,10,Decision Tree,2,0.1,0.9391796322489392,0.8248573930653896,0.1109321117401123,0.8248573930653896
163,10,RandomForest,2,0.1,0.9391796322489392,0.8248573930653896,0.7888703346252441,0.8248573930653896
164,10,AdaBoost (Discrete),2,0.1,0.8274398868458275,0.912591793781845,46.790796756744385,0.912591793781845
165,10,AdaBoost (Real),2,0.1,0.9391796322489392,0.8248573930653896,55.60344910621643,0.8248573930653896
166,10,Logistic Regression (Penalty = L2),2,0.1,0.9391796322489392,0.8248573930653896,0.21323728561401367,0.8248573930653896
167,10,Naive Bayes,2,0.1,0.8274398868458275,0.912591793781845,0.09938740730285645,0.912591793781845
168,11,KNeighbors Classifier,0,0.1,0.9901408450704225,0.9845563082523555,0.717155933380127,0.9845563082523555
169,11,SVC Classifier,0,0.1,0.9098591549295775,0.4530153324120529,0.6205523014068604,0.4530153324120529
170,11,Decision Tree,0,0.1,0.9845070422535211,0.9705393645157323,0.10308957099914551,0.9705393645157323
171,11,RandomForest,0,0.1,0.7774647887323943,1.0,0.8340578079223633,0.0
172,11,AdaBoost (Discrete),0,0.1,0.8901408450704226,0.4236090741960986,43.95809769630432,0.4236090741960986
173,11,AdaBoost (Real),0,0.1,0.9845070422535211,0.9705393645157323,55.368786096572876,0.9705393645157323
174,11,Logistic Regression (Penalty = L2),0,0.1,0.9845070422535211,0.9705393645157323,0.26584863662719727,0.9705393645157323
175,11,Naive Bayes,0,0.1,0.9394366197183098,0.9513037769611086,0.10465526580810547,0.9513037769611086
176,11,KNeighbors Classifier,1,0.1,0.9435825105782792,0.8865181789611445,1.0441405773162842,0.8865181789611445
177,11,SVC Classifier,1,0.1,0.9760225669957687,0.9369604361556937,0.8270292282104492,0.9369604361556937
178,11,Decision Tree,1,0.1,0.9760225669957687,0.9369604361556937,0.0018758773803710938,0.9369604361556937
179,11,RandomForest,1,0.1,0.7997179125528914,0.5042194840896107,0.690138578414917,0.0
180,11,AdaBoost (Discrete),1,0.1,0.9633286318758815,0.9355650414077324,44.983789920806885,0.9355650414077324
181,11,AdaBoost (Real),1,0.1,0.9746121297602257,0.927942991644796,56.77698063850403,0.927942991644796
182,11,Logistic Regression (Penalty = L2),1,0.1,0.9788434414668548,0.9445168950318586,0.2674438953399658,0.9445168950318586
183,11,Naive Bayes,1,0.1,0.849083215796897,0.8829895262615345,0.10460638999938965,0.8829895262615345
184,11,KNeighbors Classifier,2,0.1,0.9222065063649222,0.8319011083329612,1.056295394897461,0.8319011083329612
185,11,SVC Classifier,2,0.1,0.9391796322489392,0.8248573930653896,0.7268459796905518,0.8248573930653896
186,11,Decision Tree,2,0.1,0.9929278642149929,0.9826954780586864,0.0030205249786376953,0.9826954780586864
187,11,RandomForest,2,0.1,0.7793493635077794,1.0,0.8831901550292969,0.0
188,11,AdaBoost (Discrete),2,0.1,0.9391796322489392,0.8248573930653896,43.32083010673523,0.8248573930653896
189,11,AdaBoost (Real),2,0.1,0.9915134370579916,0.9791605716903751,56.086995363235474,0.9791605716903751
190,11,Logistic Regression (Penalty = L2),2,0.1,0.9915134370579916,0.9791605716903751,0.2599780559539795,0.9791605716903751
191,11,Naive Bayes,2,0.1,0.842998585572843,0.9125324922160284,0.10846614837646484,0.9125324922160284
