,feat_set_id,classifier,fold_id,feat_th,score,geo_score,exec_t,geo_score_woz
0,0,KNeighbors Classifier,0,0.9,0.8196078431372549,0.6794911240753443,0.38563108444213867,0.0
1,0,SVC Classifier,0,0.9,0.7607843137254902,1.0,0.39258480072021484,0.0
2,0,Decision Tree,0,0.9,0.8156862745098039,0.9302359109919236,0.09440994262695312,0.0
3,0,RandomForest,0,0.9,0.7607843137254902,1.0,0.7650880813598633,0.0
4,0,AdaBoost (Discrete),0,0.9,0.7725490196078432,0.9840343533044587,44.282153367996216,0.0
5,0,AdaBoost (Real),0,0.9,0.6980392156862745,0.3917854950715044,68.00018048286438,0.0
6,0,Logistic Regression (Penalty = L2),0,0.9,0.7647058823529411,0.3920788795851925,0.8909416198730469,0.0
7,0,Naive Bayes,0,0.9,0.10980392156862745,0.31419291226453727,0.28900647163391113,0.0
8,0,KNeighbors Classifier,1,0.9,0.8,0.7370696708058684,0.3781869411468506,0.0
9,0,SVC Classifier,1,0.9,0.776,1.0,0.4906136989593506,0.0
10,0,Decision Tree,1,0.9,0.8,0.9389040604579058,0.002966165542602539,0.0
11,0,RandomForest,1,0.9,0.788,0.7745966692414834,0.6702196598052979,0.0
12,0,AdaBoost (Discrete),1,0.9,0.836,0.7311497119186926,43.83144760131836,0.0
13,0,AdaBoost (Real),1,0.9,0.724,0.5986206805330004,60.28967332839966,0.0
14,0,Logistic Regression (Penalty = L2),1,0.9,0.808,0.39773448577795095,0.786470890045166,0.0
15,0,Naive Bayes,1,0.9,0.08,0.27041586643733656,0.11423134803771973,0.0
16,0,KNeighbors Classifier,2,0.9,0.8353909465020576,0.7530212497613873,0.6481759548187256,0.0
17,0,SVC Classifier,2,0.9,0.7983539094650206,1.0,0.4688253402709961,0.0
18,0,Decision Tree,2,0.9,0.7860082304526749,0.8335137946861616,0.0020787715911865234,0.0
19,0,RandomForest,2,0.9,0.7983539094650206,1.0,0.899383544921875,0.0
20,0,AdaBoost (Discrete),2,0.9,0.7407407407407407,0.6205568408333527,51.40251183509827,0.0
21,0,AdaBoost (Real),2,0.9,0.588477366255144,0.46580794798877345,66.13085269927979,0.0
22,0,Logistic Regression (Penalty = L2),2,0.9,0.7860082304526749,0.5234649692628083,0.6355657577514648,0.0
23,0,Naive Bayes,2,0.9,0.10699588477366255,0.4563925617881304,0.2431640625,0.0
24,1,KNeighbors Classifier,0,0.9,0.8313725490196079,0.702414149735533,0.4479198455810547,0.0
25,1,SVC Classifier,0,0.9,0.7607843137254902,1.0,0.4580686092376709,0.0
26,1,Decision Tree,0,0.9,0.8156862745098039,0.9302359109919236,0.10657405853271484,0.0
27,1,RandomForest,0,0.9,0.7607843137254902,1.0,0.6992223262786865,0.0
28,1,AdaBoost (Discrete),0,0.9,0.7843137254901961,0.5529407810703251,52.41541409492493,0.0
29,1,AdaBoost (Real),0,0.9,0.7019607843137254,0.3306093268059686,78.44545388221741,0.0
30,1,Logistic Regression (Penalty = L2),0,0.9,0.7607843137254902,0.326171012919004,0.6253361701965332,0.0
31,1,Naive Bayes,0,0.9,0.11372549019607843,0.32251836592106387,0.2242908477783203,0.0
32,1,KNeighbors Classifier,1,0.9,0.788,0.759034997674809,0.44701051712036133,0.0
33,1,SVC Classifier,1,0.9,0.776,1.0,0.4441952705383301,0.0
34,1,Decision Tree,1,0.9,0.796,0.9382700922504694,0.11082005500793457,0.0
35,1,RandomForest,1,0.9,0.788,0.7745966692414834,0.7721631526947021,0.0
36,1,AdaBoost (Discrete),1,0.9,0.788,0.643870199961913,56.694870948791504,0.0
37,1,AdaBoost (Real),1,0.9,0.708,0.27807635673617903,71.7646894454956,0.0
38,1,Logistic Regression (Penalty = L2),1,0.9,0.808,0.39773448577795095,0.8415718078613281,0.0
39,1,Naive Bayes,1,0.9,0.092,0.31544796096128963,0.24915695190429688,0.0
40,1,KNeighbors Classifier,2,0.9,0.8436213991769548,0.7539514892995178,0.6389622688293457,0.0
41,1,SVC Classifier,2,0.9,0.7983539094650206,1.0,0.5158629417419434,0.0
42,1,Decision Tree,2,0.9,0.7695473251028807,0.8313654453671874,0.12717676162719727,0.0
43,1,RandomForest,2,0.9,0.7983539094650206,1.0,0.9134666919708252,0.0
44,1,AdaBoost (Discrete),2,0.9,0.7037037037037037,0.6306853072924036,56.952378273010254,0.0
45,1,AdaBoost (Real),2,0.9,0.720164609053498,0.6821217382775556,74.82506346702576,0.0
46,1,Logistic Regression (Penalty = L2),2,0.9,0.7901234567901234,0.5240358157334922,0.826671838760376,0.0
47,1,Naive Bayes,2,0.9,0.11522633744855967,0.4929312311172789,0.2535233497619629,0.0
48,2,KNeighbors Classifier,0,0.9,0.8156862745098039,0.6790752777955172,0.5525987148284912,0.0
49,2,SVC Classifier,0,0.9,0.7607843137254902,1.0,0.49371790885925293,0.0
50,2,Decision Tree,0,0.9,0.8431372549019608,0.7860045147074332,0.12663483619689941,0.0
51,2,RandomForest,0,0.9,0.7607843137254902,1.0,0.8662135601043701,0.0
52,2,AdaBoost (Discrete),0,0.9,0.807843137254902,0.5771764660779555,59.57479906082153,0.0
53,2,AdaBoost (Real),0,0.9,0.6627450980392157,0.40860425488508034,77.0731954574585,0.0
54,2,Logistic Regression (Penalty = L2),0,0.9,0.7647058823529411,0.3920788795851925,0.8968791961669922,0.0
55,2,Naive Bayes,0,0.9,0.10980392156862745,0.31419291226453727,0.38175439834594727,0.0
56,2,KNeighbors Classifier,1,0.9,0.8,0.7370696708058684,0.3980278968811035,0.0
57,2,SVC Classifier,1,0.9,0.776,1.0,0.6394259929656982,0.0
58,2,Decision Tree,1,0.9,0.864,0.9486091017491766,0.12692046165466309,0.0
59,2,RandomForest,1,0.9,0.788,0.7745966692414834,0.899672269821167,0.0
60,2,AdaBoost (Discrete),1,0.9,0.848,0.6580367128962692,58.292519330978394,0.0
61,2,AdaBoost (Real),1,0.9,0.724,0.5986206805330004,77.57802248001099,0.0
62,2,Logistic Regression (Penalty = L2),1,0.9,0.804,0.39738847850165865,0.779843807220459,0.0
63,2,Naive Bayes,1,0.9,0.092,0.31544796096128963,0.2664780616760254,0.0
64,2,KNeighbors Classifier,2,0.9,0.8353909465020576,0.7530212497613873,0.6753876209259033,0.0
65,2,SVC Classifier,2,0.9,0.7983539094650206,1.0,0.6630315780639648,0.0
66,2,Decision Tree,2,0.9,0.7983539094650206,0.8350929644763114,0.13521313667297363,0.0
67,2,RandomForest,2,0.9,0.8065843621399177,0.7071067811865476,0.9555518627166748,0.0
68,2,AdaBoost (Discrete),2,0.9,0.7489711934156379,0.7733469809971688,60.28980779647827,0.0
69,2,AdaBoost (Real),2,0.9,0.6172839506172839,0.5519092765483161,76.4970428943634,0.0
70,2,Logistic Regression (Penalty = L2),2,0.9,0.7736625514403292,0.5217373244050059,0.8234744071960449,0.0
71,2,Naive Bayes,2,0.9,0.10699588477366255,0.4563925617881304,0.2730240821838379,0.0
72,3,KNeighbors Classifier,0,0.9,0.8313725490196079,0.702414149735533,0.5213985443115234,0.0
73,3,SVC Classifier,0,0.9,0.7607843137254902,1.0,0.534893274307251,0.0
74,3,Decision Tree,0,0.9,0.8352941176470589,0.9332368798552484,0.1349630355834961,0.0
75,3,RandomForest,0,0.9,0.7607843137254902,1.0,0.802117109298706,0.0
76,3,AdaBoost (Discrete),0,0.9,0.7568627450980392,0.5282267302322091,58.83964991569519,0.0
77,3,AdaBoost (Real),0,0.9,0.7058823529411765,0.3309307757490357,77.17320394515991,0.0
78,3,Logistic Regression (Penalty = L2),0,0.9,0.7607843137254902,0.326171012919004,0.8162286281585693,0.0
79,3,Naive Bayes,0,0.9,0.11372549019607843,0.32251836592106387,0.2570042610168457,0.0
80,3,KNeighbors Classifier,1,0.9,0.788,0.759034997674809,0.392366886138916,0.0
81,3,SVC Classifier,1,0.9,0.776,1.0,0.5597991943359375,0.0
82,3,Decision Tree,1,0.9,0.812,0.8235241682489829,0.11497139930725098,0.0
83,3,RandomForest,1,0.9,0.788,0.7745966692414834,0.9190084934234619,0.0
84,3,AdaBoost (Discrete),1,0.9,0.78,0.6487858671419339,58.89800143241882,0.0
85,3,AdaBoost (Real),1,0.9,0.708,0.27807635673617903,75.97067022323608,0.0
86,3,Logistic Regression (Penalty = L2),1,0.9,0.808,0.39773448577795095,0.7260227203369141,0.0
87,3,Naive Bayes,1,0.9,0.092,0.31544796096128963,0.27155423164367676,0.0
88,3,KNeighbors Classifier,2,0.9,0.8436213991769548,0.7539514892995178,0.6776597499847412,0.0
89,3,SVC Classifier,2,0.9,0.7983539094650206,1.0,0.542938232421875,0.0
90,3,Decision Tree,2,0.9,0.7407407407407407,0.9696451844902731,0.1351325511932373,0.0
91,3,RandomForest,2,0.9,0.7983539094650206,1.0,0.9462697505950928,0.0
92,3,AdaBoost (Discrete),2,0.9,0.7119341563786008,0.6318489491507706,62.669567346572876,0.0
93,3,AdaBoost (Real),2,0.9,0.6213991769547325,0.5715590078477779,70.16662740707397,0.0
94,3,Logistic Regression (Penalty = L2),2,0.9,0.7901234567901234,0.5240358157334922,0.7970991134643555,0.0
95,3,Naive Bayes,2,0.9,0.11522633744855967,0.4929312311172789,0.2611725330352783,0.0
96,4,KNeighbors Classifier,0,0.9,0.8156862745098039,0.6790752777955172,0.5896961688995361,0.0
97,4,SVC Classifier,0,0.9,0.7607843137254902,1.0,0.5127110481262207,0.0
98,4,Decision Tree,0,0.9,0.792156862745098,0.9265293987907475,0.1261429786682129,0.0
99,4,RandomForest,0,0.9,0.7607843137254902,1.0,1.0276885032653809,0.0
100,4,AdaBoost (Discrete),0,0.9,0.7803921568627451,0.5505118279398777,64.90281701087952,0.0
101,4,AdaBoost (Real),0,0.9,0.6235294117647059,0.4166459811867219,80.91268610954285,0.0
102,4,Logistic Regression (Penalty = L2),0,0.9,0.7647058823529411,0.3920788795851925,1.018317699432373,0.0
103,4,Naive Bayes,0,0.9,0.10980392156862745,0.31419291226453727,0.2592027187347412,0.0
104,4,KNeighbors Classifier,1,0.9,0.8,0.7370696708058684,0.5236585140228271,0.0
105,4,SVC Classifier,1,0.9,0.776,1.0,0.6551332473754883,0.0
106,4,Decision Tree,1,0.9,0.736,0.8136373441166793,0.1351790428161621,0.0
107,4,RandomForest,1,0.9,0.788,0.7745966692414834,1.075650930404663,0.0
108,4,AdaBoost (Discrete),1,0.9,0.848,0.6580367128962692,64.14971494674683,0.0
109,4,AdaBoost (Real),1,0.9,0.724,0.5986206805330004,85.99391341209412,0.0
110,4,Logistic Regression (Penalty = L2),1,0.9,0.804,0.39738847850165865,0.7509143352508545,0.0
111,4,Naive Bayes,1,0.9,0.092,0.31544796096128963,0.2716057300567627,0.0
112,4,KNeighbors Classifier,2,0.9,0.8353909465020576,0.7530212497613873,0.6579203605651855,0.0
113,4,SVC Classifier,2,0.9,0.7983539094650206,1.0,0.535118818283081,0.0
114,4,Decision Tree,2,0.9,0.8065843621399177,0.9808405913509327,0.002962827682495117,0.0
115,4,RandomForest,2,0.9,0.8065843621399177,0.7071067811865476,0.7815122604370117,0.0
116,4,AdaBoost (Discrete),2,0.9,0.7530864197530864,0.7741214920059362,57.05889105796814,0.0
117,4,AdaBoost (Real),2,0.9,0.6502057613168725,0.559419972749031,75.51719212532043,0.0
118,4,Logistic Regression (Penalty = L2),2,0.9,0.7736625514403292,0.5217373244050059,0.9571676254272461,0.0
119,4,Naive Bayes,2,0.9,0.10699588477366255,0.4563925617881304,0.271273136138916,0.0
120,5,KNeighbors Classifier,0,0.9,0.8274509803921568,0.7019889585332795,0.5229625701904297,0.0
121,5,SVC Classifier,0,0.9,0.7607843137254902,1.0,0.6390223503112793,0.0
122,5,Decision Tree,0,0.9,0.8313725490196079,0.951119637697311,0.12706708908081055,0.0
123,5,RandomForest,0,0.9,0.7686274509803922,0.6324555320336759,0.8914351463317871,0.0
124,5,AdaBoost (Discrete),0,0.9,0.8,0.4954845149800281,57.05162811279297,0.0
125,5,AdaBoost (Real),0,0.9,0.6039215686274509,0.31152363011205403,70.26966285705566,0.0
126,5,Logistic Regression (Penalty = L2),0,0.9,0.7607843137254902,0.326171012919004,0.8205139636993408,0.0
127,5,Naive Bayes,0,0.9,0.11372549019607843,0.32251836592106387,0.3648982048034668,0.0
128,5,KNeighbors Classifier,1,0.9,0.788,0.759034997674809,0.5128090381622314,0.0
129,5,SVC Classifier,1,0.9,0.776,1.0,0.3800687789916992,0.0
130,5,Decision Tree,1,0.9,0.804,0.9395346225013701,0.0017828941345214844,0.0
131,5,RandomForest,1,0.9,0.776,1.0,0.851729154586792,0.0
132,5,AdaBoost (Discrete),1,0.9,0.792,0.783620606031794,55.67581009864807,0.0
133,5,AdaBoost (Real),1,0.9,0.624,0.4279049259371297,69.34191465377808,0.0
134,5,Logistic Regression (Penalty = L2),1,0.9,0.804,0.39738847850165865,0.7271244525909424,0.0
135,5,Naive Bayes,1,0.9,0.092,0.31544796096128963,0.23715472221374512,0.0
136,5,KNeighbors Classifier,2,0.9,0.8436213991769548,0.7539514892995178,0.4837048053741455,0.0
137,5,SVC Classifier,2,0.9,0.7983539094650206,1.0,0.4654078483581543,0.0
138,5,Decision Tree,2,0.9,0.7695473251028807,0.8904513259264516,0.12273263931274414,0.0
139,5,RandomForest,2,0.9,0.8065843621399177,0.7071067811865476,0.7206439971923828,0.0
140,5,AdaBoost (Discrete),2,0.9,0.7530864197530864,0.6728519027002112,54.95459580421448,0.0
141,5,AdaBoost (Real),2,0.9,0.6502057613168725,0.559419972749031,71.85436940193176,0.0
142,5,Logistic Regression (Penalty = L2),2,0.9,0.7818930041152263,0.5228916218083534,0.6472301483154297,0.0
143,5,Naive Bayes,2,0.9,0.10699588477366255,0.5176363709141284,0.24049735069274902,0.0
144,6,KNeighbors Classifier,0,0.9,0.8196078431372549,0.6794911240753443,0.5129709243774414,0.0
145,6,SVC Classifier,0,0.9,0.7607843137254902,1.0,0.4864847660064697,0.0
146,6,Decision Tree,0,0.9,0.8509803921568627,0.9355832686912302,0.0030193328857421875,0.0
147,6,RandomForest,0,0.9,0.7607843137254902,1.0,1.0244593620300293,0.0
148,6,AdaBoost (Discrete),0,0.9,0.792156862745098,0.8846991476935628,54.81838893890381,0.0
149,6,AdaBoost (Real),0,0.9,0.6980392156862745,0.3917854950715044,72.29759335517883,0.0
150,6,Logistic Regression (Penalty = L2),0,0.9,0.7647058823529411,0.3920788795851925,0.8152847290039062,0.0
151,6,Naive Bayes,0,0.9,0.10980392156862745,0.31419291226453727,0.25920534133911133,0.0
152,6,KNeighbors Classifier,1,0.9,0.8,0.7370696708058684,0.49330735206604004,0.0
153,6,SVC Classifier,1,0.9,0.776,1.0,0.5610251426696777,0.0
154,6,Decision Tree,1,0.9,0.764,0.7993682056454532,0.002088308334350586,0.0
155,6,RandomForest,1,0.9,0.788,0.7745966692414834,0.7787675857543945,0.0
156,6,AdaBoost (Discrete),1,0.9,0.84,0.6871244452026302,62.75434851646423,0.0
157,6,AdaBoost (Real),1,0.9,0.724,0.5986206805330004,98.24612498283386,0.0
158,6,Logistic Regression (Penalty = L2),1,0.9,0.808,0.39773448577795095,0.9328005313873291,0.0
159,6,Naive Bayes,1,0.9,0.08,0.27041586643733656,0.31914186477661133,0.0
160,6,KNeighbors Classifier,2,0.9,0.8353909465020576,0.7530212497613873,0.6827704906463623,0.0
161,6,SVC Classifier,2,0.9,0.7983539094650206,1.0,0.5106029510498047,0.0
162,6,Decision Tree,2,0.9,0.7818930041152263,0.9767617809466458,0.0019998550415039062,0.0
163,6,RandomForest,2,0.9,0.7983539094650206,1.0,1.0909147262573242,0.0
164,6,AdaBoost (Discrete),2,0.9,0.7448559670781894,0.6210927291676543,65.60476183891296,0.0
165,6,AdaBoost (Real),2,0.9,0.7037037037037037,0.6780247257222922,83.23947811126709,0.0
166,6,Logistic Regression (Penalty = L2),2,0.9,0.7860082304526749,0.5234649692628083,1.1235237121582031,0.0
167,6,Naive Bayes,2,0.9,0.10699588477366255,0.4563925617881304,0.3055438995361328,0.0
168,7,KNeighbors Classifier,0,0.9,0.8196078431372549,0.6794911240753443,0.5998151302337646,0.0
169,7,SVC Classifier,0,0.9,0.7607843137254902,1.0,0.6071574687957764,0.0
170,7,Decision Tree,0,0.9,0.8235294117647058,0.8161735394704847,0.15128135681152344,0.0
171,7,RandomForest,0,0.9,0.7607843137254902,1.0,1.3561079502105713,0.0
172,7,AdaBoost (Discrete),0,0.9,0.792156862745098,0.8846991476935628,68.10735654830933,0.0
173,7,AdaBoost (Real),0,0.9,0.6980392156862745,0.3917854950715044,81.95270419120789,0.0
174,7,Logistic Regression (Penalty = L2),0,0.9,0.7647058823529411,0.3920788795851925,0.8128759860992432,0.0
175,7,Naive Bayes,0,0.9,0.10980392156862745,0.31419291226453727,0.37506580352783203,0.0
176,7,KNeighbors Classifier,1,0.9,0.8,0.7370696708058684,0.7367002964019775,0.0
177,7,SVC Classifier,1,0.9,0.776,1.0,0.6613385677337646,0.0
178,7,Decision Tree,1,0.9,0.84,0.9450625684367311,0.12317037582397461,0.0
179,7,RandomForest,1,0.9,0.788,0.7745966692414834,1.0199322700500488,0.0
180,7,AdaBoost (Discrete),1,0.9,0.836,0.7311497119186926,56.82712388038635,0.0
181,7,AdaBoost (Real),1,0.9,0.724,0.5986206805330004,79.23197865486145,0.0
182,7,Logistic Regression (Penalty = L2),1,0.9,0.808,0.39773448577795095,0.8948774337768555,0.0
183,7,Naive Bayes,1,0.9,0.08,0.27041586643733656,0.29300808906555176,0.0
184,7,KNeighbors Classifier,2,0.9,0.8353909465020576,0.7530212497613873,0.7065322399139404,0.0
185,7,SVC Classifier,2,0.9,0.7983539094650206,1.0,0.5811946392059326,0.0
186,7,Decision Tree,2,0.9,0.7736625514403292,0.8319072298945556,0.13170385360717773,0.0
187,7,RandomForest,2,0.9,0.7983539094650206,1.0,1.1524658203125,0.0
188,7,AdaBoost (Discrete),2,0.9,0.7407407407407407,0.6205568408333527,66.02052402496338,0.0
189,7,AdaBoost (Real),2,0.9,0.5843621399176955,0.6174463023812043,90.83327865600586,0.0
190,7,Logistic Regression (Penalty = L2),2,0.9,0.7860082304526749,0.5234649692628083,1.0882794857025146,0.0
191,7,Naive Bayes,2,0.9,0.10699588477366255,0.4563925617881304,0.06497001647949219,0.0
192,8,KNeighbors Classifier,0,0.9,0.8274509803921568,0.7019889585332795,0.17869138717651367,0.0
193,8,SVC Classifier,0,0.9,0.7607843137254902,1.0,0.5360515117645264,0.0
194,8,Decision Tree,0,0.9,0.8235294117647058,0.8161735394704847,0.11086249351501465,0.0
195,8,RandomForest,0,0.9,0.7686274509803922,0.6324555320336759,1.1763348579406738,0.0
196,8,AdaBoost (Discrete),0,0.9,0.7764705882352941,0.6608607087755473,61.30663752555847,0.0
197,8,AdaBoost (Real),0,0.9,0.615686274509804,0.3124363282871896,78.01696062088013,0.0
198,8,Logistic Regression (Penalty = L2),0,0.9,0.7607843137254902,0.326171012919004,0.9161007404327393,0.0
199,8,Naive Bayes,0,0.9,0.11372549019607843,0.32251836592106387,0.28393077850341797,0.0
200,8,KNeighbors Classifier,1,0.9,0.788,0.759034997674809,0.5930581092834473,0.0
201,8,SVC Classifier,1,0.9,0.776,1.0,0.6030194759368896,0.0
202,8,Decision Tree,1,0.9,0.812,0.8235241682489829,0.15079498291015625,0.0
203,8,RandomForest,1,0.9,0.776,1.0,0.8830454349517822,0.0
204,8,AdaBoost (Discrete),1,0.9,0.776,0.6476746235278752,61.61951756477356,0.0
205,8,AdaBoost (Real),1,0.9,0.608,0.267499712663035,74.18041920661926,0.0
206,8,Logistic Regression (Penalty = L2),1,0.9,0.804,0.39738847850165865,0.8676221370697021,0.0
207,8,Naive Bayes,1,0.9,0.092,0.31544796096128963,0.32047271728515625,0.0
208,8,KNeighbors Classifier,2,0.9,0.8436213991769548,0.7539514892995178,0.45998239517211914,0.0
209,8,SVC Classifier,2,0.9,0.7983539094650206,1.0,0.6155025959014893,0.0
210,8,Decision Tree,2,0.9,0.7901234567901234,0.8340431796132256,0.14685678482055664,0.0
211,8,RandomForest,2,0.9,0.8065843621399177,0.7071067811865476,1.0332372188568115,0.0
212,8,AdaBoost (Discrete),2,0.9,0.7530864197530864,0.6728519027002112,47.30637836456299,0.0
213,8,AdaBoost (Real),2,0.9,0.6502057613168725,0.559419972749031,60.494410276412964,0.0
214,8,Logistic Regression (Penalty = L2),2,0.9,0.7818930041152263,0.5228916218083534,0.6073417663574219,0.0
215,8,Naive Bayes,2,0.9,0.10699588477366255,0.5176363709141284,0.2327568531036377,0.0
