,feat_set_id,classifier,fold_id,feat_th,score,geo_score,exec_t,geo_score_woz
0,0,KNeighbors Classifier,0,0.3,0.817910447761194,0.7886526470120601,1.3914804458618164,0.7886526470120601
1,0,SVC Classifier,0,0.3,0.7582089552238805,0.7289966340791171,2.5963830947875977,0.7289966340791171
2,0,Decision Tree,0,0.3,0.7059701492537314,0.6818710363007342,0.14617204666137695,0.6818710363007342
3,0,RandomForest,0,0.3,0.6462686567164179,0.6091808120228447,0.8095898628234863,0.6091808120228447
4,0,AdaBoost (Discrete),0,0.3,0.7835820895522388,0.7665807285215677,121.18050408363342,0.7665807285215677
5,0,AdaBoost (Real),0,0.3,0.5402985074626866,0.36272815554032845,132.42051100730896,0.36272815554032845
6,0,Logistic Regression (Penalty = L2),0,0.3,0.8074626865671641,0.7937663394400118,1.154628038406372,0.7937663394400118
7,0,Naive Bayes,0,0.3,0.7791044776119403,0.7569676437060718,0.2111513614654541,0.7569676437060718
8,0,KNeighbors Classifier,1,0.3,0.8283582089552238,0.7920986761657025,1.634580373764038,0.7920986761657025
9,0,SVC Classifier,1,0.3,0.7626865671641792,0.6915423677399931,2.6861250400543213,0.6915423677399931
10,0,Decision Tree,1,0.3,0.7298507462686568,0.7100577026463449,0.15428876876831055,0.7100577026463449
11,0,RandomForest,1,0.3,0.664179104477612,0.47266213865712137,0.7195024490356445,0.47266213865712137
12,0,AdaBoost (Discrete),1,0.3,0.7731343283582089,0.7563673468063101,125.35669946670532,0.7563673468063101
13,0,AdaBoost (Real),1,0.3,0.7328358208955223,0.7117314617836696,122.38226103782654,0.7117314617836696
14,0,Logistic Regression (Penalty = L2),1,0.3,0.8074626865671641,0.7884634261978879,1.2026913166046143,0.7884634261978879
15,0,Naive Bayes,1,0.3,0.7791044776119403,0.7453971557236869,0.1405172348022461,0.7453971557236869
16,0,KNeighbors Classifier,2,0.3,0.8378787878787879,0.807464524811385,1.4643101692199707,0.807464524811385
17,0,SVC Classifier,2,0.3,0.796969696969697,0.7762284875343162,2.7618966102600098,0.7762284875343162
18,0,Decision Tree,2,0.3,0.7333333333333333,0.7121291821381222,0.14374613761901855,0.7121291821381222
19,0,RandomForest,2,0.3,0.6181818181818182,0.6269401130381405,0.6494958400726318,0.0
20,0,AdaBoost (Discrete),2,0.3,0.7696969696969697,0.7516784210919172,122.52751851081848,0.7516784210919172
21,0,AdaBoost (Real),2,0.3,0.5878787878787879,0.4502207407707242,126.91610169410706,0.4502207407707242
22,0,Logistic Regression (Penalty = L2),2,0.3,0.8348484848484848,0.8199413304501759,1.1509230136871338,0.8199413304501759
23,0,Naive Bayes,2,0.3,0.796969696969697,0.7789758065976333,0.14971613883972168,0.7789758065976333
24,1,KNeighbors Classifier,0,0.3,0.8328358208955224,0.8061877344871855,1.5359039306640625,0.8061877344871855
25,1,SVC Classifier,0,0.3,0.7776119402985074,0.7552006110277085,2.726755142211914,0.7552006110277085
26,1,Decision Tree,0,0.3,0.7313432835820896,0.7199295825929841,0.14501690864562988,0.7199295825929841
27,1,RandomForest,0,0.3,0.6955223880597015,0.6145641211612238,0.7224702835083008,0.6145641211612238
28,1,AdaBoost (Discrete),0,0.3,0.7820895522388059,0.7637923543065993,120.578209400177,0.7637923543065993
29,1,AdaBoost (Real),0,0.3,0.5,0.389169941505824,121.58424806594849,0.389169941505824
30,1,Logistic Regression (Penalty = L2),0,0.3,0.8208955223880597,0.8073093807481551,1.1715281009674072,0.8073093807481551
31,1,Naive Bayes,0,0.3,0.7850746268656716,0.765436069764771,0.14829659461975098,0.765436069764771
32,1,KNeighbors Classifier,1,0.3,0.826865671641791,0.8011893457588981,1.515148639678955,0.8011893457588981
33,1,SVC Classifier,1,0.3,0.7761194029850746,0.7183280610423401,2.6006438732147217,0.7183280610423401
34,1,Decision Tree,1,0.3,0.7343283582089553,0.7193702575588661,0.13535666465759277,0.7193702575588661
35,1,RandomForest,1,0.3,0.6985074626865672,0.7497924037368288,0.6795871257781982,0.0
36,1,AdaBoost (Discrete),1,0.3,0.7671641791044777,0.7480561437204145,114.28325033187866,0.7480561437204145
37,1,AdaBoost (Real),1,0.3,0.5522388059701493,0.45180812050261115,128.25422620773315,0.45180812050261115
38,1,Logistic Regression (Penalty = L2),1,0.3,0.8164179104477612,0.7977105072097767,1.2338135242462158,0.7977105072097767
39,1,Naive Bayes,1,0.3,0.7805970149253731,0.7514015588293645,0.14091777801513672,0.7514015588293645
40,1,KNeighbors Classifier,2,0.3,0.8424242424242424,0.8197388242174387,1.7469923496246338,0.8197388242174387
41,1,SVC Classifier,2,0.3,0.8045454545454546,0.7860428337195903,2.9556632041931152,0.7860428337195903
42,1,Decision Tree,2,0.3,0.7045454545454546,0.6929716418949164,0.2178349494934082,0.6929716418949164
43,1,RandomForest,2,0.3,0.6727272727272727,0.5999577593969586,0.8395631313323975,0.5999577593969586
44,1,AdaBoost (Discrete),2,0.3,0.7681818181818182,0.7450646612127557,141.27347803115845,0.7450646612127557
45,1,AdaBoost (Real),2,0.3,0.5924242424242424,0.45488443411582485,156.1949484348297,0.45488443411582485
46,1,Logistic Regression (Penalty = L2),2,0.3,0.843939393939394,0.830584143209612,1.3554162979125977,0.830584143209612
47,1,Naive Bayes,2,0.3,0.796969696969697,0.7785397477365437,0.161024808883667,0.7785397477365437
48,2,KNeighbors Classifier,0,0.3,0.817910447761194,0.7900753665665609,1.5373551845550537,0.7900753665665609
49,2,SVC Classifier,0,0.3,0.755223880597015,0.7272038437411587,3.0982375144958496,0.7272038437411587
50,2,Decision Tree,0,0.3,0.7044776119402985,0.6934754735127244,0.16114401817321777,0.6934754735127244
51,2,RandomForest,0,0.3,0.5985074626865672,0.5860722067051587,0.8022961616516113,0.0
52,2,AdaBoost (Discrete),0,0.3,0.764179104477612,0.7473377682784532,141.57450604438782,0.7473377682784532
53,2,AdaBoost (Real),0,0.3,0.5865671641791045,0.436881405944014,150.9253487586975,0.436881405944014
54,2,Logistic Regression (Penalty = L2),0,0.3,0.8059701492537313,0.7924195022653772,1.1762404441833496,0.7924195022653772
55,2,Naive Bayes,0,0.3,0.7746268656716417,0.7541899012490941,0.18988871574401855,0.7541899012490941
56,2,KNeighbors Classifier,1,0.3,0.835820895522388,0.8172488214521529,2.096132755279541,0.8172488214521529
57,2,SVC Classifier,1,0.3,0.7850746268656716,0.7469036079056239,3.3525807857513428,0.7469036079056239
58,2,Decision Tree,1,0.3,0.7104477611940299,0.6925668550767486,0.24982404708862305,0.6925668550767486
59,2,RandomForest,1,0.3,0.5761194029850746,0.4183968334027382,0.7656583786010742,0.4183968334027382
60,2,AdaBoost (Discrete),1,0.3,0.7671641791044777,0.7573465757168444,135.4833424091339,0.7573465757168444
61,2,AdaBoost (Real),1,0.3,0.573134328358209,0.46944306365874616,132.80050230026245,0.46944306365874616
62,2,Logistic Regression (Penalty = L2),1,0.3,0.8104477611940298,0.7936465117638897,1.265259027481079,0.7936465117638897
63,2,Naive Bayes,1,0.3,0.7940298507462686,0.7751263516800913,0.24637961387634277,0.7751263516800913
64,2,KNeighbors Classifier,2,0.3,0.793939393939394,0.7469992291841514,1.8269462585449219,0.7469992291841514
65,2,SVC Classifier,2,0.3,0.7863636363636364,0.7534195876777244,3.1266655921936035,0.7534195876777244
66,2,Decision Tree,2,0.3,0.6727272727272727,0.646402553437965,0.15988802909851074,0.646402553437965
67,2,RandomForest,2,0.3,0.6196969696969697,0.42204815327348955,0.8087003231048584,0.42204815327348955
68,2,AdaBoost (Discrete),2,0.3,0.793939393939394,0.7770223477811472,135.66036415100098,0.7770223477811472
69,2,AdaBoost (Real),2,0.3,0.5196969696969697,0.437727247603643,142.38759183883667,0.0
70,2,Logistic Regression (Penalty = L2),2,0.3,0.8,0.7734119201541293,1.1954193115234375,0.7734119201541293
71,2,Naive Bayes,2,0.3,0.793939393939394,0.7712535450945307,0.1611623764038086,0.7712535450945307
72,3,KNeighbors Classifier,0,0.3,0.826865671641791,0.8012504141982049,1.752319574356079,0.8012504141982049
73,3,SVC Classifier,0,0.3,0.7611940298507462,0.7405886399910485,3.0484368801116943,0.7405886399910485
74,3,Decision Tree,0,0.3,0.6805970149253732,0.6626827461631005,0.16553020477294922,0.6626827461631005
75,3,RandomForest,0,0.3,0.6283582089552239,0.5251870327795833,0.8054049015045166,0.5251870327795833
76,3,AdaBoost (Discrete),0,0.3,0.7656716417910447,0.7538755955271726,132.9546024799347,0.7538755955271726
77,3,AdaBoost (Real),0,0.3,0.5,0.38539597827729327,140.1518154144287,0.38539597827729327
78,3,Logistic Regression (Penalty = L2),0,0.3,0.8134328358208955,0.8008002833161064,1.2646186351776123,0.8008002833161064
79,3,Naive Bayes,0,0.3,0.7791044776119403,0.7588510422802814,0.16469216346740723,0.7588510422802814
80,3,KNeighbors Classifier,1,0.3,0.8208955223880597,0.7929233529047085,1.6154541969299316,0.7929233529047085
81,3,SVC Classifier,1,0.3,0.7567164179104477,0.7136828696569194,3.1982836723327637,0.7136828696569194
82,3,Decision Tree,1,0.3,0.6701492537313433,0.6555482936174036,0.16019868850708008,0.6555482936174036
83,3,RandomForest,1,0.3,0.6492537313432836,0.48730843641616733,0.7860715389251709,0.48730843641616733
84,3,AdaBoost (Discrete),1,0.3,0.7343283582089553,0.7152320044723238,127.07061982154846,0.7152320044723238
85,3,AdaBoost (Real),1,0.3,0.591044776119403,0.5021676203210333,126.77485156059265,0.5021676203210333
86,3,Logistic Regression (Penalty = L2),1,0.3,0.7940298507462686,0.771438782999775,1.2193739414215088,0.771438782999775
87,3,Naive Bayes,1,0.3,0.7731343283582089,0.7513903114445606,0.12848424911499023,0.7513903114445606
88,3,KNeighbors Classifier,2,0.3,0.8318181818181818,0.8065610044835209,1.7885456085205078,0.8065610044835209
89,3,SVC Classifier,2,0.3,0.7636363636363637,0.7388793377906244,2.9912450313568115,0.7388793377906244
90,3,Decision Tree,2,0.3,0.7045454545454546,0.6824775187487132,0.20248723030090332,0.6824775187487132
91,3,RandomForest,2,0.3,0.6681818181818182,0.545687282328562,0.7686748504638672,0.545687282328562
92,3,AdaBoost (Discrete),2,0.3,0.7575757575757576,0.7415697654291983,124.70341658592224,0.7415697654291983
93,3,AdaBoost (Real),2,0.3,0.4287878787878788,0.2359887995541662,143.9742512702942,0.2359887995541662
94,3,Logistic Regression (Penalty = L2),2,0.3,0.8136363636363636,0.7973455687764012,1.3140056133270264,0.7973455687764012
95,3,Naive Bayes,2,0.3,0.7757575757575758,0.7575268189387898,0.15439438819885254,0.7575268189387898
96,4,KNeighbors Classifier,0,0.3,0.8388059701492537,0.8191216255378551,1.1389718055725098,0.8191216255378551
97,4,SVC Classifier,0,0.3,0.7776119402985074,0.7471600923626602,2.6594743728637695,0.7471600923626602
98,4,Decision Tree,0,0.3,0.7134328358208956,0.6945774604989406,0.2308979034423828,0.6945774604989406
99,4,RandomForest,0,0.3,0.5835820895522388,0.5642327256627822,0.6850743293762207,0.0
100,4,AdaBoost (Discrete),0,0.3,0.7776119402985074,0.7628870749614454,112.98525261878967,0.7628870749614454
101,4,AdaBoost (Real),0,0.3,0.6716417910447762,0.6399169781113832,111.7765040397644,0.6399169781113832
102,4,Logistic Regression (Penalty = L2),0,0.3,0.817910447761194,0.8056225142555636,1.0751569271087646,0.8056225142555636
103,4,Naive Bayes,0,0.3,0.7746268656716417,0.7520279277149404,0.15047168731689453,0.7520279277149404
104,4,KNeighbors Classifier,1,0.3,0.826865671641791,0.7991009752403359,1.1508488655090332,0.7991009752403359
105,4,SVC Classifier,1,0.3,0.7701492537313432,0.707774460488938,2.602989912033081,0.707774460488938
106,4,Decision Tree,1,0.3,0.7253731343283583,0.7060912635119231,0.14319491386413574,0.7060912635119231
107,4,RandomForest,1,0.3,0.5865671641791045,0.41080078041329127,0.6641221046447754,0.41080078041329127
108,4,AdaBoost (Discrete),1,0.3,0.7761194029850746,0.7563986815297499,105.2805666923523,0.7563986815297499
109,4,AdaBoost (Real),1,0.3,0.7149253731343284,0.6994555859435595,104.62498927116394,0.6994555859435595
110,4,Logistic Regression (Penalty = L2),1,0.3,0.8194029850746268,0.8026188288844005,1.0031166076660156,0.8026188288844005
111,4,Naive Bayes,1,0.3,0.7805970149253731,0.7411004967624812,0.12125420570373535,0.7411004967624812
112,4,KNeighbors Classifier,2,0.3,0.8454545454545455,0.8214879290278941,1.0530531406402588,0.8214879290278941
113,4,SVC Classifier,2,0.3,0.796969696969697,0.7705155437434594,2.148484945297241,0.7705155437434594
114,4,Decision Tree,2,0.3,0.7257575757575757,0.7002975787906929,0.12897372245788574,0.7002975787906929
115,4,RandomForest,2,0.3,0.6075757575757575,0.47988744834656766,0.6453266143798828,0.0
116,4,AdaBoost (Discrete),2,0.3,0.7621212121212121,0.7410939730179499,97.55200600624084,0.7410939730179499
117,4,AdaBoost (Real),2,0.3,0.5833333333333334,0.43680937404438314,108.11012244224548,0.43680937404438314
118,4,Logistic Regression (Penalty = L2),2,0.3,0.8378787878787879,0.8228451306666825,0.9502968788146973,0.8228451306666825
119,4,Naive Bayes,2,0.3,0.796969696969697,0.776663811923713,0.13697242736816406,0.776663811923713
120,5,KNeighbors Classifier,0,0.3,0.8402985074626865,0.8223997161885611,0.6758956909179688,0.8223997161885611
121,5,SVC Classifier,0,0.3,0.7507462686567165,0.7122713732939414,2.2621493339538574,0.7122713732939414
122,5,Decision Tree,0,0.3,0.7029850746268657,0.682649930652099,0.13516831398010254,0.682649930652099
123,5,RandomForest,0,0.3,0.5671641791044776,0.3695231816474664,0.6779749393463135,0.3695231816474664
124,5,AdaBoost (Discrete),0,0.3,0.7686567164179104,0.7491378673094023,89.97281622886658,0.7491378673094023
125,5,AdaBoost (Real),0,0.3,0.5865671641791045,0.436881405944014,97.42685174942017,0.436881405944014
126,5,Logistic Regression (Penalty = L2),0,0.3,0.8,0.7863282823271242,0.9514603614807129,0.7863282823271242
127,5,Naive Bayes,0,0.3,0.7776119402985074,0.7560718256994008,0.16045355796813965,0.7560718256994008
128,5,KNeighbors Classifier,1,0.3,0.8373134328358209,0.819340616956248,0.815636157989502,0.819340616956248
129,5,SVC Classifier,1,0.3,0.753731343283582,0.6830705618655224,2.1021392345428467,0.6830705618655224
130,5,Decision Tree,1,0.3,0.7149253731343284,0.6959015030802014,0.13655543327331543,0.6959015030802014
131,5,RandomForest,1,0.3,0.5970149253731343,0.5443424305630123,0.7071287631988525,0.0
132,5,AdaBoost (Discrete),1,0.3,0.7626865671641792,0.7492256480523174,88.5858461856842,0.7492256480523174
133,5,AdaBoost (Real),1,0.3,0.7223880597014926,0.7022910962132654,96.97249674797058,0.7022910962132654
134,5,Logistic Regression (Penalty = L2),1,0.3,0.8,0.7792294146338045,0.7632925510406494,0.7792294146338045
135,5,Naive Bayes,1,0.3,0.7970149253731343,0.7725729825280865,0.1362769603729248,0.7725729825280865
136,5,KNeighbors Classifier,2,0.3,0.8242424242424242,0.791349298585968,0.7703063488006592,0.791349298585968
137,5,SVC Classifier,2,0.3,0.7757575757575758,0.7304257049223963,2.1064162254333496,0.7304257049223963
138,5,Decision Tree,2,0.3,0.7242424242424242,0.701753335968767,0.12885236740112305,0.701753335968767
139,5,RandomForest,2,0.3,0.6530303030303031,0.5322165030802658,0.5942270755767822,0.5322165030802658
140,5,AdaBoost (Discrete),2,0.3,0.7818181818181819,0.7584954282851661,84.13419127464294,0.7584954282851661
141,5,AdaBoost (Real),2,0.3,0.6515151515151515,0.572335263306447,90.34867119789124,0.572335263306447
142,5,Logistic Regression (Penalty = L2),2,0.3,0.8196969696969697,0.8037018446709996,0.8422608375549316,0.8037018446709996
143,5,Naive Bayes,2,0.3,0.8,0.7777025058145229,0.0674428939819336,0.7777025058145229
144,6,KNeighbors Classifier,0,0.3,0.8223880597014925,0.8001204242546831,0.8904500007629395,0.8001204242546831
145,6,SVC Classifier,0,0.3,0.744776119402985,0.7126958781961539,2.2019479274749756,0.7126958781961539
146,6,Decision Tree,0,0.3,0.7164179104477612,0.7005647941055105,0.1285562515258789,0.7005647941055105
147,6,RandomForest,0,0.3,0.564179104477612,0.32225160998367436,0.6479780673980713,0.32225160998367436
148,6,AdaBoost (Discrete),0,0.3,0.7656716417910447,0.7566635704757343,85.76801896095276,0.7566635704757343
149,6,AdaBoost (Real),0,0.3,0.5,0.38539597827729327,98.57521390914917,0.38539597827729327
150,6,Logistic Regression (Penalty = L2),0,0.3,0.7895522388059701,0.7741071134729696,0.879539966583252,0.7741071134729696
151,6,Naive Bayes,0,0.3,0.7820895522388059,0.7630546345711853,0.1354529857635498,0.7630546345711853
152,6,KNeighbors Classifier,1,0.3,0.8402985074626865,0.8200826913429626,0.9717690944671631,0.8200826913429626
153,6,SVC Classifier,1,0.3,0.764179104477612,0.7148250540615189,2.384760856628418,0.7148250540615189
154,6,Decision Tree,1,0.3,0.7283582089552239,0.7074900372317042,0.20117592811584473,0.7074900372317042
155,6,RandomForest,1,0.3,0.655223880597015,0.696690704951468,0.6312663555145264,0.0
156,6,AdaBoost (Discrete),1,0.3,0.7388059701492538,0.7222393474622649,91.29403042793274,0.7222393474622649
157,6,AdaBoost (Real),1,0.3,0.7029850746268657,0.6711118179024217,99.48620510101318,0.6711118179024217
158,6,Logistic Regression (Penalty = L2),1,0.3,0.7910447761194029,0.7676787836509404,0.8062691688537598,0.7676787836509404
159,6,Naive Bayes,1,0.3,0.7761194029850746,0.7486544942318785,0.1930994987487793,0.7486544942318785
160,6,KNeighbors Classifier,2,0.3,0.8272727272727273,0.7990811748162472,1.0511667728424072,0.7990811748162472
161,6,SVC Classifier,2,0.3,0.7681818181818182,0.7443049225958777,2.3884265422821045,0.7443049225958777
162,6,Decision Tree,2,0.3,0.7166666666666667,0.6886277714611048,0.2021191120147705,0.6886277714611048
163,6,RandomForest,2,0.3,0.6606060606060606,0.4319580172508765,0.6475276947021484,0.4319580172508765
164,6,AdaBoost (Discrete),2,0.3,0.7424242424242424,0.7201387337901393,92.16842675209045,0.7201387337901393
165,6,AdaBoost (Real),2,0.3,0.4287878787878788,0.2362682448210595,96.5916121006012,0.2362682448210595
166,6,Logistic Regression (Penalty = L2),2,0.3,0.8045454545454546,0.7895113853249106,0.7702360153198242,0.7895113853249106
167,6,Naive Bayes,2,0.3,0.7757575757575758,0.7542241311698078,0.16986489295959473,0.7542241311698078
168,7,KNeighbors Classifier,0,0.3,0.8373134328358209,0.8188111875211335,0.6384701728820801,0.8188111875211335
169,7,SVC Classifier,0,0.3,0.7626865671641792,0.70213050664526,1.8461308479309082,0.70213050664526
170,7,Decision Tree,0,0.3,0.7014925373134329,0.6782829452230799,0.1280970573425293,0.6782829452230799
171,7,RandomForest,0,0.3,0.6119402985074627,0.5024434452503374,0.5760695934295654,0.5024434452503374
172,7,AdaBoost (Discrete),0,0.3,0.746268656716418,0.7283391976928103,74.97588205337524,0.7283391976928103
173,7,AdaBoost (Real),0,0.3,0.591044776119403,0.5609551868978369,83.15646743774414,0.5609551868978369
174,7,Logistic Regression (Penalty = L2),0,0.3,0.8029850746268656,0.7890672555423631,0.7914025783538818,0.7890672555423631
175,7,Naive Bayes,0,0.3,0.7686567164179104,0.7451774194647587,0.1403653621673584,0.7451774194647587
176,7,KNeighbors Classifier,1,0.3,0.8373134328358209,0.8129273198659079,0.6352853775024414,0.8129273198659079
177,7,SVC Classifier,1,0.3,0.7522388059701492,0.6902271627497477,1.9030871391296387,0.6902271627497477
178,7,Decision Tree,1,0.3,0.7104477611940299,0.6840792870498892,0.1284027099609375,0.6840792870498892
179,7,RandomForest,1,0.3,0.608955223880597,0.49915726998489,0.6426196098327637,0.49915726998489
180,7,AdaBoost (Discrete),1,0.3,0.7746268656716417,0.7572018780398133,75.1853199005127,0.7572018780398133
181,7,AdaBoost (Real),1,0.3,0.6850746268656717,0.6559529975668917,74.73930859565735,0.6559529975668917
182,7,Logistic Regression (Penalty = L2),1,0.3,0.8029850746268656,0.7800680117288006,0.6574079990386963,0.7800680117288006
183,7,Naive Bayes,1,0.3,0.7985074626865671,0.7737609198806875,0.12441682815551758,0.7737609198806875
184,7,KNeighbors Classifier,2,0.3,0.8363636363636363,0.8154386985005805,0.7456867694854736,0.8154386985005805
185,7,SVC Classifier,2,0.3,0.7772727272727272,0.7219628416543397,1.878734827041626,0.7219628416543397
186,7,Decision Tree,2,0.3,0.7181818181818181,0.6863016276549532,0.061865806579589844,0.6863016276549532
187,7,RandomForest,2,0.3,0.6136363636363636,0.4603997321723196,0.5447680950164795,0.4603997321723196
188,7,AdaBoost (Discrete),2,0.3,0.7575757575757576,0.7387579073879735,71.76176881790161,0.7387579073879735
189,7,AdaBoost (Real),2,0.3,0.5909090909090909,0.4266146467775772,78.7612898349762,0.4266146467775772
190,7,Logistic Regression (Penalty = L2),2,0.3,0.8196969696969697,0.8019963028530486,0.6110255718231201,0.8019963028530486
191,7,Naive Bayes,2,0.3,0.7924242424242425,0.7687695246349414,0.19020557403564453,0.7687695246349414
192,8,KNeighbors Classifier,0,0.3,0.8298507462686567,0.8058478910792842,0.8980097770690918,0.8058478910792842
193,8,SVC Classifier,0,0.3,0.7716417910447761,0.749404017904219,1.977189302444458,0.749404017904219
194,8,Decision Tree,0,0.3,0.7074626865671642,0.6916771959903727,0.12065792083740234,0.6916771959903727
195,8,RandomForest,0,0.3,0.5746268656716418,0.5434533015069432,0.5422592163085938,0.0
196,8,AdaBoost (Discrete),0,0.3,0.753731343283582,0.7367759461587639,83.24124240875244,0.7367759461587639
197,8,AdaBoost (Real),0,0.3,0.591044776119403,0.5412216346760935,93.6261854171753,0.0
198,8,Logistic Regression (Penalty = L2),0,0.3,0.8029850746268656,0.7880889901818399,0.8317275047302246,0.7880889901818399
199,8,Naive Bayes,0,0.3,0.7701492537313432,0.7520222199613509,0.13618206977844238,0.7520222199613509
200,8,KNeighbors Classifier,1,0.3,0.8238805970149253,0.8008541975418844,1.007000207901001,0.8008541975418844
201,8,SVC Classifier,1,0.3,0.764179104477612,0.7271354174106699,2.3297736644744873,0.7271354174106699
202,8,Decision Tree,1,0.3,0.6895522388059702,0.670108120056337,0.12875914573669434,0.670108120056337
203,8,RandomForest,1,0.3,0.6179104477611941,0.41734787549598473,0.6142556667327881,0.41734787549598473
204,8,AdaBoost (Discrete),1,0.3,0.7432835820895523,0.7147782020444458,86.61766505241394,0.7147782020444458
205,8,AdaBoost (Real),1,0.3,0.7089552238805971,0.6810349754471098,89.53466606140137,0.6810349754471098
206,8,Logistic Regression (Penalty = L2),1,0.3,0.8044776119402985,0.7794952225680383,0.7998805046081543,0.7794952225680383
207,8,Naive Bayes,1,0.3,0.7850746268656716,0.7628198611824134,0.12558770179748535,0.7628198611824134
208,8,KNeighbors Classifier,2,0.3,0.8333333333333334,0.8066318718367008,0.9513733386993408,0.8066318718367008
209,8,SVC Classifier,2,0.3,0.7742424242424243,0.7475540452600159,2.2464168071746826,0.7475540452600159
210,8,Decision Tree,2,0.3,0.7045454545454546,0.6787654872186406,0.1327054500579834,0.6787654872186406
211,8,RandomForest,2,0.3,0.5575757575757576,0.5024712389689309,0.6385540962219238,0.0
212,8,AdaBoost (Discrete),2,0.3,0.753030303030303,0.724834712707091,86.01808571815491,0.724834712707091
213,8,AdaBoost (Real),2,0.3,0.6833333333333333,0.6490847772689122,88.5177071094513,0.6490847772689122
214,8,Logistic Regression (Penalty = L2),2,0.3,0.8212121212121212,0.8068724181205521,0.7242143154144287,0.8068724181205521
215,8,Naive Bayes,2,0.3,0.7833333333333333,0.7656130773321432,0.17597436904907227,0.7656130773321432
216,9,KNeighbors Classifier,0,0.3,0.8417910447761194,0.8256817795368215,0.6672980785369873,0.8256817795368215
217,9,SVC Classifier,0,0.3,0.7402985074626866,0.693504410497989,1.9719297885894775,0.693504410497989
218,9,Decision Tree,0,0.3,0.6865671641791045,0.6706882232876018,0.12387728691101074,0.6706882232876018
219,9,RandomForest,0,0.3,0.5492537313432836,0.32909426311120404,0.5935044288635254,0.32909426311120404
220,9,AdaBoost (Discrete),0,0.3,0.755223880597015,0.7444935252536496,70.15520930290222,0.7444935252536496
221,9,AdaBoost (Real),0,0.3,0.591044776119403,0.3768831385420456,79.69019985198975,0.3768831385420456
222,9,Logistic Regression (Penalty = L2),0,0.3,0.8,0.7864297280475342,0.6698296070098877,0.7864297280475342
223,9,Naive Bayes,0,0.3,0.7731343283582089,0.7541978138141536,0.10139226913452148,0.7541978138141536
224,9,KNeighbors Classifier,1,0.3,0.8388059701492537,0.8186232602841383,0.667682409286499,0.8186232602841383
225,9,SVC Classifier,1,0.3,0.744776119402985,0.6832949863781441,1.7968316078186035,0.6832949863781441
226,9,Decision Tree,1,0.3,0.7134328358208956,0.6941998011177184,0.10778331756591797,0.6941998011177184
227,9,RandomForest,1,0.3,0.6014925373134329,0.5962716808107847,0.5098938941955566,0.0
228,9,AdaBoost (Discrete),1,0.3,0.755223880597015,0.746021892316209,71.41641759872437,0.746021892316209
229,9,AdaBoost (Real),1,0.3,0.6537313432835821,0.6243090265398864,78.62856006622314,0.6243090265398864
230,9,Logistic Regression (Penalty = L2),1,0.3,0.7850746268656716,0.7571419681578319,0.5949223041534424,0.7571419681578319
231,9,Naive Bayes,1,0.3,0.7865671641791044,0.7617448566786529,0.1319868564605713,0.7617448566786529
232,9,KNeighbors Classifier,2,0.3,0.8393939393939394,0.8179147328453921,0.5610172748565674,0.8179147328453921
233,9,SVC Classifier,2,0.3,0.7545454545454545,0.7010747515711903,1.743488073348999,0.7010747515711903
234,9,Decision Tree,2,0.3,0.7424242424242424,0.7271722141820584,0.1111593246459961,0.7271722141820584
235,9,RandomForest,2,0.3,0.6303030303030303,0.6060726034478047,0.50730299949646,0.0
236,9,AdaBoost (Discrete),2,0.3,0.7515151515151515,0.7355622637788514,65.36947584152222,0.7355622637788514
237,9,AdaBoost (Real),2,0.3,0.4287878787878788,0.23654940825247966,75.86772680282593,0.23654940825247966
238,9,Logistic Regression (Penalty = L2),2,0.3,0.8,0.7806971297804526,0.7259352207183838,0.7806971297804526
239,9,Naive Bayes,2,0.3,0.7848484848484848,0.76634833570861,0.11297893524169922,0.76634833570861
240,10,KNeighbors Classifier,0,0.3,0.8313432835820895,0.8102400771078642,1.4570815563201904,0.8102400771078642
241,10,SVC Classifier,0,0.3,0.7716417910447761,0.7495577696164915,2.269885540008545,0.7495577696164915
242,10,Decision Tree,0,0.3,0.7238805970149254,0.7106785437398953,0.12963223457336426,0.7106785437398953
243,10,RandomForest,0,0.3,0.6358208955223881,0.518634394943003,0.5881643295288086,0.518634394943003
244,10,AdaBoost (Discrete),0,0.3,0.7716417910447761,0.7462220084185227,97.42098832130432,0.7462220084185227
245,10,AdaBoost (Real),0,0.3,0.5402985074626866,0.36272815554032845,94.1421205997467,0.36272815554032845
246,10,Logistic Regression (Penalty = L2),0,0.3,0.8194029850746268,0.8078849404591459,0.79085373878479,0.8078849404591459
247,10,Naive Bayes,0,0.3,0.7925373134328358,0.7766612429999145,0.11667799949645996,0.7766612429999145
248,10,KNeighbors Classifier,1,0.3,0.8283582089552238,0.7992667536222379,1.1739096641540527,0.7992667536222379
249,10,SVC Classifier,1,0.3,0.7686567164179104,0.7073527467428325,1.881056785583496,0.7073527467428325
250,10,Decision Tree,1,0.3,0.7149253731343284,0.6922546527737189,0.14196538925170898,0.6922546527737189
251,10,RandomForest,1,0.3,0.5865671641791045,0.416016644832201,0.49245572090148926,0.416016644832201
252,10,AdaBoost (Discrete),1,0.3,0.7820895522388059,0.765214209284324,93.95928573608398,0.765214209284324
253,10,AdaBoost (Real),1,0.3,0.5940298507462687,0.5057745281610249,95.10285234451294,0.5057745281610249
254,10,Logistic Regression (Penalty = L2),1,0.3,0.8119402985074626,0.7936897935513338,0.987821102142334,0.7936897935513338
255,10,Naive Bayes,1,0.3,0.7746268656716417,0.7437132828430483,0.11028385162353516,0.7437132828430483
256,10,KNeighbors Classifier,2,0.3,0.8348484848484848,0.8086706472000917,1.2390241622924805,0.8086706472000917
257,10,SVC Classifier,2,0.3,0.8,0.7805797362936594,2.053640842437744,0.7805797362936594
258,10,Decision Tree,2,0.3,0.7242424242424242,0.7019779576273119,0.10503053665161133,0.7019779576273119
259,10,RandomForest,2,0.3,0.6257575757575757,0.4348505021135802,0.5254783630371094,0.4348505021135802
260,10,AdaBoost (Discrete),2,0.3,0.7666666666666667,0.7438245629873834,97.1512668132782,0.7438245629873834
261,10,AdaBoost (Real),2,0.3,0.6378787878787879,0.5698838265239432,105.57224893569946,0.5698838265239432
262,10,Logistic Regression (Penalty = L2),2,0.3,0.8424242424242424,0.8266492430646323,0.9081010818481445,0.8266492430646323
263,10,Naive Bayes,2,0.3,0.8015151515151515,0.7855853703579357,0.12067985534667969,0.7855853703579357
264,11,KNeighbors Classifier,0,0.3,0.8164179104477612,0.788812229811556,2.1196181774139404,0.788812229811556
265,11,SVC Classifier,0,0.3,0.755223880597015,0.7310535431221846,2.923560380935669,0.7310535431221846
266,11,Decision Tree,0,0.3,0.6850746268656717,0.6659969826733858,0.2218337059020996,0.6659969826733858
267,11,RandomForest,0,0.3,0.6432835820895523,0.5039304977696987,0.6193099021911621,0.5039304977696987
268,11,AdaBoost (Discrete),0,0.3,0.7731343283582089,0.7619009327837133,132.76523232460022,0.7619009327837133
269,11,AdaBoost (Real),0,0.3,0.5402985074626866,0.36272815554032845,125.708092212677,0.36272815554032845
270,11,Logistic Regression (Penalty = L2),0,0.3,0.8208955223880597,0.8068236881926081,1.1855034828186035,0.8068236881926081
271,11,Naive Bayes,0,0.3,0.7701492537313432,0.7475652702322303,0.1025698184967041,0.7475652702322303
272,11,KNeighbors Classifier,1,0.3,0.8238805970149253,0.7934439734928014,2.0275731086730957,0.7934439734928014
273,11,SVC Classifier,1,0.3,0.7746268656716417,0.7356627224599224,2.522932291030884,0.7356627224599224
274,11,Decision Tree,1,0.3,0.6686567164179105,0.6463325848922908,0.14991021156311035,0.6463325848922908
275,11,RandomForest,1,0.3,0.6223880597014926,0.4441295757726447,0.588226318359375,0.4441295757726447
276,11,AdaBoost (Discrete),1,0.3,0.7567164179104477,0.7420656697481767,112.25135040283203,0.7420656697481767
277,11,AdaBoost (Real),1,0.3,0.6716417910447762,0.6534763391075832,106.05609679222107,0.6534763391075832
278,11,Logistic Regression (Penalty = L2),1,0.3,0.8044776119402985,0.7858809165881793,1.1188714504241943,0.7858809165881793
279,11,Naive Bayes,1,0.3,0.7791044776119403,0.7535691019508062,0.17890024185180664,0.7535691019508062
280,11,KNeighbors Classifier,2,0.3,0.8257575757575758,0.7870565141823492,1.9146716594696045,0.7870565141823492
281,11,SVC Classifier,2,0.3,0.8,0.7791463285705746,2.4023303985595703,0.7791463285705746
282,11,Decision Tree,2,0.3,0.6727272727272727,0.6465471641614181,0.13123369216918945,0.6465471641614181
283,11,RandomForest,2,0.3,0.6742424242424242,0.6240854194022011,0.4845757484436035,0.6240854194022011
284,11,AdaBoost (Discrete),2,0.3,0.7848484848484848,0.7685431275239225,110.19299387931824,0.7685431275239225
285,11,AdaBoost (Real),2,0.3,0.5166666666666667,0.41079648799095575,106.67156839370728,0.0
286,11,Logistic Regression (Penalty = L2),2,0.3,0.8378787878787879,0.8200555453173418,1.1201446056365967,0.8200555453173418
287,11,Naive Bayes,2,0.3,0.7909090909090909,0.7735093480480201,0.10243463516235352,0.7735093480480201
288,12,KNeighbors Classifier,0,0.3,0.8373134328358209,0.8203505755248419,0.3940284252166748,0.8203505755248419
289,12,SVC Classifier,0,0.3,0.7507462686567165,0.6900873939352526,1.2558069229125977,0.6900873939352526
290,12,Decision Tree,0,0.3,0.7089552238805971,0.6939899496203594,0.04696488380432129,0.6939899496203594
291,12,RandomForest,0,0.3,0.6134328358208955,0.5598231239809683,0.39623546600341797,0.0
292,12,AdaBoost (Discrete),0,0.3,0.7686567164179104,0.7613723437707394,47.56789946556091,0.7613723437707394
293,12,AdaBoost (Real),0,0.3,0.591044776119403,0.5412216346760935,55.04795289039612,0.0
294,12,Logistic Regression (Penalty = L2),0,0.3,0.8014925373134328,0.7891661151033236,0.496260404586792,0.7891661151033236
295,12,Naive Bayes,0,0.3,0.7716417910447761,0.755783820412926,0.11574459075927734,0.755783820412926
296,12,KNeighbors Classifier,1,0.3,0.8194029850746268,0.7960835453754526,0.42678141593933105,0.7960835453754526
297,12,SVC Classifier,1,0.3,0.7417910447761195,0.6713898654131691,1.3853774070739746,0.6713898654131691
298,12,Decision Tree,1,0.3,0.7029850746268657,0.6757269439610222,0.09462165832519531,0.6757269439610222
299,12,RandomForest,1,0.3,0.6447761194029851,0.512693561886591,0.4787864685058594,0.512693561886591
300,12,AdaBoost (Discrete),1,0.3,0.7208955223880597,0.7062751685935943,52.26215744018555,0.7062751685935943
301,12,AdaBoost (Real),1,0.3,0.6671641791044776,0.6366646220844561,54.99833869934082,0.6366646220844561
302,12,Logistic Regression (Penalty = L2),1,0.3,0.7731343283582089,0.7375265377141621,0.5106253623962402,0.7375265377141621
303,12,Naive Bayes,1,0.3,0.7835820895522388,0.7552466857319247,0.16103339195251465,0.7552466857319247
304,12,KNeighbors Classifier,2,0.3,0.8393939393939394,0.8220633759446765,0.44634175300598145,0.8220633759446765
305,12,SVC Classifier,2,0.3,0.759090909090909,0.6955247180420941,1.366772174835205,0.6955247180420941
306,12,Decision Tree,2,0.3,0.7303030303030303,0.7068049884941436,0.047182321548461914,0.7068049884941436
307,12,RandomForest,2,0.3,0.6606060606060606,0.6877208407885972,0.40324950218200684,0.0
308,12,AdaBoost (Discrete),2,0.3,0.746969696969697,0.7225002350338778,47.347835540771484,0.7225002350338778
309,12,AdaBoost (Real),2,0.3,0.6045454545454545,0.5635003200128271,54.88411021232605,0.5635003200128271
310,12,Logistic Regression (Penalty = L2),2,0.3,0.793939393939394,0.7742137230061077,0.4200248718261719,0.7742137230061077
311,12,Naive Bayes,2,0.3,0.7848484848484848,0.7649341594437983,0.12528395652770996,0.7649341594437983
