,feat_set_id,classifier,fold_id,feat_th,score,geo_score,exec_t,geo_score_woz
0,0,KNeighbors Classifier,0,1.0,0.1466652996360281,0.11503342054326833,180.79692363739014,0.11503342054326833
1,0,SVC Classifier,0,1.0,0.12349413031219562,0.05414939848036662,432.5334987640381,0.05414939848036662
2,0,Decision Tree,0,1.0,0.553954990516225,0.5090259686095993,0.3138430118560791,0.5090259686095993
3,0,RandomForest,0,1.0,0.42102834879786744,0.2733056641162204,0.5303859710693359,0.0
4,0,AdaBoost (Discrete),0,1.0,0.7607012867175885,0.7382789534030136,259.8342363834381,0.7382789534030136
5,0,AdaBoost (Real),0,1.0,0.38186292100271696,0.2893245969385051,293.845707654953,0.0
6,0,Logistic Regression (Penalty = L2),0,1.0,0.47198441585072026,0.28331450334121927,8.886481046676636,0.28331450334121927
7,0,Naive Bayes,0,1.0,0.7215358589224381,0.6261751846357803,0.2657947540283203,0.6261751846357803
8,0,KNeighbors Classifier,1,1.0,0.3926282872814887,0.3757731376100296,83.5319254398346,0.3757731376100296
9,0,SVC Classifier,1,1.0,0.12293023017378377,0.03777651928875564,305.3142292499542,0.0
10,0,Decision Tree,1,1.0,0.7057979186958527,0.6853132573943267,0.33265185356140137,0.6853132573943267
11,0,RandomForest,1,1.0,0.4668067873071205,0.5392508683185273,0.49780774116516113,0.0
12,0,AdaBoost (Discrete),1,1.0,0.796688368278054,0.8048603273671107,247.55315113067627,0.8048603273671107
13,0,AdaBoost (Real),1,1.0,0.5998359563233711,0.3782079989581476,267.8504045009613,0.3782079989581476
14,0,Logistic Regression (Penalty = L2),1,1.0,0.5370892500128159,0.4689729739426778,5.082590818405151,0.0
15,0,Naive Bayes,1,1.0,0.7306607884349208,0.6140096312573023,0.27657246589660645,0.6140096312573023
16,0,KNeighbors Classifier,2,1.0,0.3415359376602071,0.3317800888648651,77.38227009773254,0.3317800888648651
17,0,SVC Classifier,2,1.0,0.1302163436891213,0.04951013739764851,313.26047801971436,0.0
18,0,Decision Tree,2,1.0,0.5278375884343279,0.519708320117377,0.29868412017822266,0.519708320117377
19,0,RandomForest,2,1.0,0.4645237362862709,0.39029560134512176,0.4680771827697754,0.0
20,0,AdaBoost (Discrete),2,1.0,0.5879216651286784,0.520767337130053,239.23234176635742,0.520767337130053
21,0,AdaBoost (Real),2,1.0,0.4283297446939403,0.21236506316800588,250.38127493858337,0.0
22,0,Logistic Regression (Penalty = L2),2,1.0,0.47723777299292525,0.4128606986562287,4.371614217758179,0.0
23,0,Naive Bayes,2,1.0,0.6034040807956527,0.557530478622885,0.26281094551086426,0.557530478622885
