,feat_set_id,classifier,fold_id,feat_th,score,geo_score,exec_t,geo_score_woz
0,0,KNeighbors Classifier,0,0.3,0.3253493013972056,0.22891499741597696,0.1645805835723877,0.0
1,0,SVC Classifier,0,0.3,0.3093812375249501,1.0,0.5716457366943359,0.0
2,0,Decision Tree,0,0.3,0.3313373253493014,0.22323854552611008,0.05113410949707031,0.0
3,0,RandomForest,0,0.3,0.3273453093812375,0.8919770128851846,0.3597676753997803,0.0
4,0,AdaBoost (Discrete),0,0.3,0.3073852295409182,0.25858085471567743,22.404942512512207,0.0
5,0,AdaBoost (Real),0,0.3,0.19161676646706588,0.21542840424027193,39.98922944068909,0.21542840424027193
6,0,Logistic Regression (Penalty = L2),0,0.3,0.35528942115768464,0.6064744727468859,0.19657564163208008,0.0
7,0,Naive Bayes,0,0.3,0.05788423153692615,0.49775775714949005,0.11013507843017578,0.0
8,0,KNeighbors Classifier,1,0.3,0.3232931726907631,0.30127175053790667,0.1794426441192627,0.0
9,0,SVC Classifier,1,0.3,0.3092369477911647,1.0,0.5797324180603027,0.0
10,0,Decision Tree,1,0.3,0.3493975903614458,0.21341712455685677,0.05089092254638672,0.0
11,0,RandomForest,1,0.3,0.321285140562249,0.23282834490740756,0.44686460494995117,0.0
12,0,AdaBoost (Discrete),1,0.3,0.26305220883534136,0.2877187027481065,20.208475828170776,0.0
13,0,AdaBoost (Real),1,0.3,0.26506024096385544,0.3041667038418905,38.888614654541016,0.0
14,0,Logistic Regression (Penalty = L2),1,0.3,0.357429718875502,0.5642905240500535,0.23088884353637695,0.0
15,0,Naive Bayes,1,0.3,0.1465863453815261,0.4987592899129482,0.15132689476013184,0.0
16,0,KNeighbors Classifier,2,0.3,0.28484848484848485,0.24603297244745,0.14812040328979492,0.0
17,0,SVC Classifier,2,0.3,0.3111111111111111,1.0,0.8908922672271729,0.0
18,0,Decision Tree,2,0.3,0.32525252525252524,0.24860584309511527,0.07468318939208984,0.0
19,0,RandomForest,2,0.3,0.3292929292929293,0.41412387656655203,0.5755603313446045,0.0
20,0,AdaBoost (Discrete),2,0.3,0.27070707070707073,0.29924704832018495,33.51327967643738,0.0
21,0,AdaBoost (Real),2,0.3,0.29494949494949496,0.2738534160364876,46.91560769081116,0.0
22,0,Logistic Regression (Penalty = L2),2,0.3,0.35555555555555557,0.29108952138580996,0.2567019462585449,0.0
23,0,Naive Bayes,2,0.3,0.06262626262626263,0.6081597120648925,0.16589665412902832,0.0
24,1,KNeighbors Classifier,0,0.3,0.4231536926147705,0.39179029618639066,0.25023531913757324,0.0
25,1,SVC Classifier,0,0.3,0.3093812375249501,1.0,0.8314032554626465,0.0
26,1,Decision Tree,0,0.3,0.4231536926147705,0.37778273068572726,0.08733940124511719,0.0
27,1,RandomForest,0,0.3,0.4311377245508982,0.4261365045267212,0.5883841514587402,0.0
28,1,AdaBoost (Discrete),0,0.3,0.2774451097804391,0.22951177693520058,37.09484624862671,0.0
29,1,AdaBoost (Real),0,0.3,0.23353293413173654,0.2539112919322353,54.80739092826843,0.0
30,1,Logistic Regression (Penalty = L2),0,0.3,0.437125748502994,0.48339945073660573,0.43358540534973145,0.0
31,1,Naive Bayes,0,0.3,0.4491017964071856,0.540053078997709,0.16677546501159668,0.0
32,1,KNeighbors Classifier,1,0.3,0.39959839357429716,0.33155498440910985,0.1552729606628418,0.0
33,1,SVC Classifier,1,0.3,0.3092369477911647,1.0,0.7667152881622314,0.0
34,1,Decision Tree,1,0.3,0.3634538152610442,0.3144960334215866,0.0840907096862793,0.3144960334215866
35,1,RandomForest,1,0.3,0.40562248995983935,0.6334760024430101,0.5884659290313721,0.0
36,1,AdaBoost (Discrete),1,0.3,0.3192771084337349,0.2533091468452707,41.40945363044739,0.2533091468452707
37,1,AdaBoost (Real),1,0.3,0.3393574297188755,0.2619099484282986,62.853267669677734,0.0
38,1,Logistic Regression (Penalty = L2),1,0.3,0.4497991967871486,0.2510853298402596,0.37398529052734375,0.0
39,1,Naive Bayes,1,0.3,0.40963855421686746,0.6062647042030416,0.19144868850708008,0.0
40,1,KNeighbors Classifier,2,0.3,0.4484848484848485,0.38507699801597545,0.19678521156311035,0.0
41,1,SVC Classifier,2,0.3,0.3111111111111111,1.0,0.9605083465576172,0.0
42,1,Decision Tree,2,0.3,0.4262626262626263,0.3776492090753897,0.09438800811767578,0.0
43,1,RandomForest,2,0.3,0.39191919191919194,0.6997227423014013,0.585172176361084,0.0
44,1,AdaBoost (Discrete),2,0.3,0.34545454545454546,0.3451243541498162,43.902597188949585,0.0
45,1,AdaBoost (Real),2,0.3,0.24646464646464647,0.24101105213446403,60.58078408241272,0.0
46,1,Logistic Regression (Penalty = L2),2,0.3,0.45252525252525255,0.29811919389273317,0.28997182846069336,0.0
47,1,Naive Bayes,2,0.3,0.4101010101010101,0.5435989065232175,0.19809961318969727,0.0
48,2,KNeighbors Classifier,0,0.3,0.25149700598802394,0.233525109116285,0.39583301544189453,0.0
49,2,SVC Classifier,0,0.3,0.3093812375249501,1.0,0.8759090900421143,0.0
50,2,Decision Tree,0,0.3,0.35129740518962077,0.17051404086654826,0.09468197822570801,0.0
51,2,RandomForest,0,0.3,0.35728542914171657,0.5186375274740253,0.6677572727203369,0.0
52,2,AdaBoost (Discrete),0,0.3,0.3532934131736527,0.2960905784537356,53.835899114608765,0.0
53,2,AdaBoost (Real),0,0.3,0.34530938123752497,0.1454441756096577,74.45352172851562,0.0
54,2,Logistic Regression (Penalty = L2),0,0.3,0.37524950099800397,0.6866194690705104,0.48482584953308105,0.0
55,2,Naive Bayes,0,0.3,0.07784431137724551,0.4572136457533364,0.11671066284179688,0.0
56,2,KNeighbors Classifier,1,0.3,0.24497991967871485,0.44606048814864874,0.4853239059448242,0.0
57,2,SVC Classifier,1,0.3,0.3092369477911647,1.0,1.2986118793487549,0.0
58,2,Decision Tree,1,0.3,0.37349397590361444,0.34502050131191964,0.11436176300048828,0.0
59,2,RandomForest,1,0.3,0.43373493975903615,0.6757713731120658,0.9500987529754639,0.0
60,2,AdaBoost (Discrete),1,0.3,0.3815261044176707,0.6202494940736877,48.8672878742218,0.0
61,2,AdaBoost (Real),1,0.3,0.36947791164658633,0.25329010327830614,71.25450730323792,0.0
62,2,Logistic Regression (Penalty = L2),1,0.3,0.38755020080321284,0.37221407970749365,0.33780813217163086,0.0
63,2,Naive Bayes,1,0.3,0.09437751004016064,0.26451727530187313,0.12328672409057617,0.0
64,2,KNeighbors Classifier,2,0.3,0.2404040404040404,0.22340765825826883,0.5945379734039307,0.0
65,2,SVC Classifier,2,0.3,0.3111111111111111,1.0,1.2362663745880127,0.0
66,2,Decision Tree,2,0.3,0.3696969696969697,0.5781808641107486,0.0024917125701904297,0.0
67,2,RandomForest,2,0.3,0.38181818181818183,0.5806850761490638,0.7323260307312012,0.0
68,2,AdaBoost (Discrete),2,0.3,0.3656565656565657,0.24062000439657433,52.63795232772827,0.0
69,2,AdaBoost (Real),2,0.3,0.35555555555555557,0.3185391506889158,74.13519072532654,0.0
70,2,Logistic Regression (Penalty = L2),2,0.3,0.4080808080808081,0.6751793903329911,0.24305367469787598,0.0
71,2,Naive Bayes,2,0.3,0.044444444444444446,0.19068994972077505,0.1211385726928711,0.0
72,3,KNeighbors Classifier,0,0.3,0.2994011976047904,0.2240821698910423,0.3531837463378906,0.0
73,3,SVC Classifier,0,0.3,0.3093812375249501,1.0,1.0676124095916748,0.0
74,3,Decision Tree,0,0.3,0.3213572854291417,0.18855338003204572,0.001711130142211914,0.0
75,3,RandomForest,0,0.3,0.3313373253493014,0.469992537681907,0.8183205127716064,0.0
76,3,AdaBoost (Discrete),0,0.3,0.3213572854291417,0.20384667962062747,51.70707821846008,0.0
77,3,AdaBoost (Real),0,0.3,0.18163672654690619,0.16144868159033435,71.94600176811218,0.0
78,3,Logistic Regression (Penalty = L2),0,0.3,0.34530938123752497,0.535199448207674,0.3776118755340576,0.0
79,3,Naive Bayes,0,0.3,0.34530938123752497,0.4253413401531345,0.24326539039611816,0.0
80,3,KNeighbors Classifier,1,0.3,0.28112449799196787,0.19412684414881373,0.3872852325439453,0.0
81,3,SVC Classifier,1,0.3,0.3092369477911647,1.0,1.3286190032958984,0.0
82,3,Decision Tree,1,0.3,0.3373493975903614,0.15845910140892536,0.0017163753509521484,0.0
83,3,RandomForest,1,0.3,0.3674698795180723,0.46404125671301116,0.9038116931915283,0.0
84,3,AdaBoost (Discrete),1,0.3,0.2469879518072289,0.24878112982630066,58.08900427818298,0.0
85,3,AdaBoost (Real),1,0.3,0.3132530120481928,0.2614139228651366,87.72523403167725,0.0
86,3,Logistic Regression (Penalty = L2),1,0.3,0.3534136546184739,0.4752258806114754,0.7552804946899414,0.0
87,3,Naive Bayes,1,0.3,0.3152610441767068,0.5469762671293027,0.31040382385253906,0.0
88,3,KNeighbors Classifier,2,0.3,0.30303030303030304,0.24507406378477473,0.28551435470581055,0.0
89,3,SVC Classifier,2,0.3,0.3111111111111111,1.0,1.5918879508972168,0.0
90,3,Decision Tree,2,0.3,0.3151515151515151,0.1924864756108704,0.138502836227417,0.0
91,3,RandomForest,2,0.3,0.3595959595959596,0.5269759346176005,1.3042333126068115,0.0
92,3,AdaBoost (Discrete),2,0.3,0.2787878787878788,0.157316126554135,63.221561670303345,0.0
93,3,AdaBoost (Real),2,0.3,0.24444444444444444,0.2262247438062594,81.55788826942444,0.0
94,3,Logistic Regression (Penalty = L2),2,0.3,0.3393939393939394,0.4146664754389491,0.5542840957641602,0.0
95,3,Naive Bayes,2,0.3,0.3191919191919192,0.4628518551463132,0.13322997093200684,0.0
96,4,KNeighbors Classifier,0,0.3,0.16966067864271456,0.1397829583772157,0.5620057582855225,0.0
97,4,SVC Classifier,0,0.3,0.3093812375249501,1.0,1.251746416091919,0.0
98,4,Decision Tree,0,0.3,0.3213572854291417,0.7506906081250011,0.0022118091583251953,0.0
99,4,RandomForest,0,0.3,0.3253493013972056,0.8900421325944633,1.0856380462646484,0.0
100,4,AdaBoost (Discrete),0,0.3,0.3213572854291417,0.7506906081250011,54.538634300231934,0.0
101,4,AdaBoost (Real),0,0.3,0.31736526946107785,0.22918276783583022,77.90094542503357,0.0
102,4,Logistic Regression (Penalty = L2),0,0.3,0.3253493013972056,0.8900421325944633,0.3126258850097656,0.0
103,4,Naive Bayes,0,0.3,0.0499001996007984,0.8939035350965676,0.15854716300964355,0.0
104,4,KNeighbors Classifier,1,0.3,0.3192771084337349,0.7490195392702655,0.6077218055725098,0.0
105,4,SVC Classifier,1,0.3,0.3092369477911647,1.0,1.4673352241516113,0.0
106,4,Decision Tree,1,0.3,0.3192771084337349,0.7490195392702655,0.15407872200012207,0.0
107,4,RandomForest,1,0.3,0.3192771084337349,0.7490195392702655,1.0690319538116455,0.0
108,4,AdaBoost (Discrete),1,0.3,0.3192771084337349,0.7490195392702655,59.09865999221802,0.0
109,4,AdaBoost (Real),1,0.3,0.3152610441767068,0.6546536707079771,83.68734192848206,0.0
110,4,Logistic Regression (Penalty = L2),1,0.3,0.3192771084337349,0.7490195392702655,0.42673158645629883,0.0
111,4,Naive Bayes,1,0.3,0.12248995983935743,0.7492644169466476,0.2826364040374756,0.0
112,4,KNeighbors Classifier,2,0.3,0.31717171717171716,0.7071067811865476,0.44257497787475586,0.0
113,4,SVC Classifier,2,0.3,0.3111111111111111,1.0,1.3020565509796143,0.0
114,4,Decision Tree,2,0.3,0.32727272727272727,0.7937005259840998,0.165787935256958,0.0
115,4,RandomForest,2,0.3,0.32727272727272727,0.7937005259840998,1.0073893070220947,0.0
116,4,AdaBoost (Discrete),2,0.3,0.32727272727272727,0.7937005259840998,57.612165689468384,0.0
117,4,AdaBoost (Real),2,0.3,0.31717171717171716,0.7071067811865476,81.02278256416321,0.0
118,4,Logistic Regression (Penalty = L2),2,0.3,0.32727272727272727,0.7937005259840998,0.2729191780090332,0.0
119,4,Naive Bayes,2,0.3,0.048484848484848485,0.7778222374656406,0.2704188823699951,0.0
120,5,KNeighbors Classifier,0,0.3,0.16766467065868262,0.6506496351610378,0.38481736183166504,0.0
121,5,SVC Classifier,0,0.3,0.3093812375249501,1.0,1.1138598918914795,0.0
122,5,Decision Tree,0,0.3,0.313373253493014,0.6525384675349823,0.13380026817321777,0.0
123,5,RandomForest,0,0.3,0.313373253493014,0.6525384675349823,0.8189921379089355,0.0
124,5,AdaBoost (Discrete),0,0.3,0.313373253493014,0.6525384675349823,61.44998574256897,0.0
125,5,AdaBoost (Real),0,0.3,0.313373253493014,0.6525384675349823,104.46213483810425,0.0
126,5,Logistic Regression (Penalty = L2),0,0.3,0.31736526946107785,0.842423539174232,0.4673140048980713,0.0
127,5,Naive Bayes,0,0.3,0.31736526946107785,0.842423539174232,0.2964761257171631,0.0
128,5,KNeighbors Classifier,1,0.3,0.3152610441767068,0.6546536707079771,0.4162747859954834,0.0
129,5,SVC Classifier,1,0.3,0.3092369477911647,1.0,1.1746478080749512,0.0
130,5,Decision Tree,1,0.3,0.3152610441767068,0.6546536707079771,0.0012614727020263672,0.0
131,5,RandomForest,1,0.3,0.3152610441767068,0.6546536707079771,1.0468487739562988,0.0
132,5,AdaBoost (Discrete),1,0.3,0.3152610441767068,0.6546536707079771,44.0707151889801,0.0
133,5,AdaBoost (Real),1,0.3,0.3152610441767068,0.6546536707079771,72.78198432922363,0.0
134,5,Logistic Regression (Penalty = L2),1,0.3,0.3152610441767068,0.6546536707079771,0.33109593391418457,0.0
135,5,Naive Bayes,1,0.3,0.2931726907630522,0.6546536707079771,0.12049984931945801,0.0
136,5,KNeighbors Classifier,2,0.3,0.31717171717171716,0.7071067811865476,0.4513988494873047,0.0
137,5,SVC Classifier,2,0.3,0.3111111111111111,1.0,0.9604840278625488,0.0
138,5,Decision Tree,2,0.3,0.31717171717171716,0.7071067811865476,0.0018317699432373047,0.0
139,5,RandomForest,2,0.3,0.31717171717171716,0.7071067811865476,0.7204279899597168,0.0
140,5,AdaBoost (Discrete),2,0.3,0.31717171717171716,0.7071067811865476,47.60217761993408,0.0
141,5,AdaBoost (Real),2,0.3,0.31717171717171716,0.7071067811865476,92.42568397521973,0.0
142,5,Logistic Regression (Penalty = L2),2,0.3,0.31717171717171716,0.7071067811865476,0.5618891716003418,0.0
143,5,Naive Bayes,2,0.3,0.29494949494949496,0.7071067811865476,0.1620805263519287,0.0
144,6,KNeighbors Classifier,0,0.3,0.3253493013972056,0.22891499741597696,0.3592660427093506,0.0
145,6,SVC Classifier,0,0.3,0.3093812375249501,1.0,2.025343894958496,0.0
146,6,Decision Tree,0,0.3,0.3333333333333333,0.2235547516583179,0.0017690658569335938,0.0
147,6,RandomForest,0,0.3,0.3273453093812375,0.8919770128851846,0.9674458503723145,0.0
148,6,AdaBoost (Discrete),0,0.3,0.3073852295409182,0.25858085471567743,54.17759704589844,0.0
149,6,AdaBoost (Real),0,0.3,0.25748502994011974,0.27279684144659966,82.00375628471375,0.0
150,6,Logistic Regression (Penalty = L2),0,0.3,0.35528942115768464,0.6064744727468859,0.5043809413909912,0.0
151,6,Naive Bayes,0,0.3,0.05788423153692615,0.49775775714949005,0.23622870445251465,0.0
152,6,KNeighbors Classifier,1,0.3,0.3232931726907631,0.30127175053790667,0.5429902076721191,0.0
153,6,SVC Classifier,1,0.3,0.3092369477911647,1.0,1.439673662185669,0.0
154,6,Decision Tree,1,0.3,0.3514056224899598,0.21366820584236124,0.1230933666229248,0.0
155,6,RandomForest,1,0.3,0.321285140562249,0.23282834490740756,1.1665992736816406,0.0
156,6,AdaBoost (Discrete),1,0.3,0.26305220883534136,0.2877187027481065,54.77089500427246,0.0
157,6,AdaBoost (Real),1,0.3,0.25100401606425704,0.31240992769003423,74.02419638633728,0.0
158,6,Logistic Regression (Penalty = L2),1,0.3,0.357429718875502,0.5642905240500535,0.4796464443206787,0.0
159,6,Naive Bayes,1,0.3,0.1465863453815261,0.4987592899129482,0.13787126541137695,0.0
160,6,KNeighbors Classifier,2,0.3,0.28484848484848485,0.24603297244745,0.22861886024475098,0.0
161,6,SVC Classifier,2,0.3,0.3111111111111111,1.0,1.1701772212982178,0.0
162,6,Decision Tree,2,0.3,0.32525252525252524,0.24860584309511527,0.11894679069519043,0.0
163,6,RandomForest,2,0.3,0.3292929292929293,0.41412387656655203,0.8175690174102783,0.0
164,6,AdaBoost (Discrete),2,0.3,0.27070707070707073,0.29924704832018495,51.32835578918457,0.0
165,6,AdaBoost (Real),2,0.3,0.29494949494949496,0.2738534160364876,78.71954870223999,0.0
166,6,Logistic Regression (Penalty = L2),2,0.3,0.35555555555555557,0.29108952138580996,0.3570742607116699,0.0
167,6,Naive Bayes,2,0.3,0.06262626262626263,0.6081597120648925,0.24977636337280273,0.0
168,7,KNeighbors Classifier,0,0.3,0.46706586826347307,0.4473741701758341,0.48252248764038086,0.0
169,7,SVC Classifier,0,0.3,0.3093812375249501,1.0,1.5738146305084229,0.0
170,7,Decision Tree,0,0.3,0.4251497005988024,0.41230961026700114,0.1229705810546875,0.0
171,7,RandomForest,0,0.3,0.46107784431137727,0.44529877410884805,1.0082736015319824,0.0
172,7,AdaBoost (Discrete),0,0.3,0.35528942115768464,0.2929302105563625,58.315417766571045,0.2929302105563625
173,7,AdaBoost (Real),0,0.3,0.2554890219560878,0.2300128396753847,79.22212934494019,0.0
174,7,Logistic Regression (Penalty = L2),0,0.3,0.499001996007984,0.6965753042524222,0.6159670352935791,0.0
175,7,Naive Bayes,0,0.3,0.10978043912175649,0.37691701467129085,0.21174263954162598,0.0
176,7,KNeighbors Classifier,1,0.3,0.43775100401606426,0.42211141789013823,0.3611760139465332,0.0
177,7,SVC Classifier,1,0.3,0.3092369477911647,1.0,1.4244074821472168,0.0
178,7,Decision Tree,1,0.3,0.42369477911646586,0.33435435152292975,0.11994695663452148,0.33435435152292975
179,7,RandomForest,1,0.3,0.5281124497991968,0.7286104972426779,0.856590747833252,0.0
180,7,AdaBoost (Discrete),1,0.3,0.37349397590361444,0.404582912015886,56.926596879959106,0.0
181,7,AdaBoost (Real),1,0.3,0.4036144578313253,0.31329678728562527,88.85212421417236,0.31329678728562527
182,7,Logistic Regression (Penalty = L2),1,0.3,0.5160642570281124,0.269767101308266,0.6722207069396973,0.0
183,7,Naive Bayes,1,0.3,0.1706827309236948,0.398113930507233,0.3308243751525879,0.0
184,7,KNeighbors Classifier,2,0.3,0.43232323232323233,0.43468743484282163,0.6678974628448486,0.0
185,7,SVC Classifier,2,0.3,0.3111111111111111,1.0,2.002033233642578,0.0
186,7,Decision Tree,2,0.3,0.4101010101010101,0.3856659597373443,0.16788578033447266,0.0
187,7,RandomForest,2,0.3,0.45454545454545453,0.6739919854125151,1.367729902267456,0.0
188,7,AdaBoost (Discrete),2,0.3,0.3191919191919192,0.2736703296937874,78.54069256782532,0.0
189,7,AdaBoost (Real),2,0.3,0.3414141414141414,0.2947621180597804,71.55466341972351,0.0
190,7,Logistic Regression (Penalty = L2),2,0.3,0.501010101010101,0.32380375683531387,0.5896468162536621,0.0
191,7,Naive Bayes,2,0.3,0.11515151515151516,0.44241602067995933,0.2988314628601074,0.0
192,8,KNeighbors Classifier,0,0.3,0.16766467065868262,0.6506496351610378,0.6095905303955078,0.0
193,8,SVC Classifier,0,0.3,0.3093812375249501,1.0,1.3245673179626465,0.0
194,8,Decision Tree,0,0.3,0.313373253493014,0.6525384675349823,0.001377105712890625,0.0
195,8,RandomForest,0,0.3,0.313373253493014,0.6525384675349823,1.0360634326934814,0.0
196,8,AdaBoost (Discrete),0,0.3,0.313373253493014,0.6525384675349823,59.54069256782532,0.0
197,8,AdaBoost (Real),0,0.3,0.313373253493014,0.6525384675349823,104.10660576820374,0.0
198,8,Logistic Regression (Penalty = L2),0,0.3,0.31736526946107785,0.842423539174232,0.4909195899963379,0.0
199,8,Naive Bayes,0,0.3,0.31736526946107785,0.842423539174232,0.17735981941223145,0.0
200,8,KNeighbors Classifier,1,0.3,0.3152610441767068,0.6546536707079771,0.5964634418487549,0.0
201,8,SVC Classifier,1,0.3,0.3092369477911647,1.0,1.2357594966888428,0.0
202,8,Decision Tree,1,0.3,0.3152610441767068,0.6546536707079771,0.0013499259948730469,0.0
203,8,RandomForest,1,0.3,0.3152610441767068,0.6546536707079771,1.0082004070281982,0.0
204,8,AdaBoost (Discrete),1,0.3,0.3152610441767068,0.6546536707079771,58.51780676841736,0.0
205,8,AdaBoost (Real),1,0.3,0.3152610441767068,0.6546536707079771,94.36594462394714,0.0
206,8,Logistic Regression (Penalty = L2),1,0.3,0.3152610441767068,0.6546536707079771,0.5647602081298828,0.0
207,8,Naive Bayes,1,0.3,0.2931726907630522,0.6546536707079771,0.14374995231628418,0.0
208,8,KNeighbors Classifier,2,0.3,0.31717171717171716,0.7071067811865476,0.43645238876342773,0.0
209,8,SVC Classifier,2,0.3,0.3111111111111111,1.0,1.3462142944335938,0.0
210,8,Decision Tree,2,0.3,0.31717171717171716,0.7071067811865476,0.15753769874572754,0.0
211,8,RandomForest,2,0.3,0.31717171717171716,0.7071067811865476,1.0535166263580322,0.0
212,8,AdaBoost (Discrete),2,0.3,0.31717171717171716,0.7071067811865476,56.68498492240906,0.0
213,8,AdaBoost (Real),2,0.3,0.31717171717171716,0.7071067811865476,88.11690664291382,0.0
214,8,Logistic Regression (Penalty = L2),2,0.3,0.31717171717171716,0.7071067811865476,0.4066474437713623,0.0
215,8,Naive Bayes,2,0.3,0.29494949494949496,0.7071067811865476,0.12607026100158691,0.0
