,feat_set_id,classifier,fold_id,feat_th,score,geo_score,exec_t,geo_score_woz
0,0,KNeighbors Classifier,0,0.4,0.5162194633560272,0.5057425168046336,6.87911057472229,0.5057425168046336
1,0,SVC Classifier,0,0.4,0.55126151381658,1.0,176.0525951385498,0.0
2,0,Decision Tree,0,0.4,0.5186223468161795,0.517765783563436,1.037759780883789,0.517765783563436
3,0,RandomForest,0,0.4,0.5244293151782139,0.5011624030005372,2.299050807952881,0.5011624030005372
4,0,AdaBoost (Discrete),0,0.4,0.5282338806567881,0.4997530378562299,255.64565086364746,0.4997530378562299
5,0,AdaBoost (Real),0,0.4,0.5238285943131759,0.5013751714176635,358.3135452270508,0.5013751714176635
6,0,Logistic Regression (Penalty = L2),0,0.4,0.5462555066079295,0.4348487790680944,1.199517011642456,0.4348487790680944
7,0,Naive Bayes,0,0.4,0.45214257108530237,0.0785816882551074,0.4179348945617676,0.0785816882551074
8,0,KNeighbors Classifier,1,0.4,0.4726617264169838,0.4729729778561734,9.057708501815796,0.4729729778561734
9,0,SVC Classifier,1,0.4,0.5509713599038654,0.9996366279069767,176.56181168556213,0.0
10,0,Decision Tree,1,0.4,0.4628479871820549,0.46481066072461896,0.7263171672821045,0.46481066072461896
11,0,RandomForest,1,0.4,0.45243340676947724,0.35614883587649443,2.4926540851593018,0.35614883587649443
12,0,AdaBoost (Discrete),1,0.4,0.46645303424794715,0.46743355844977563,257.01993060112,0.46743355844977563
13,0,AdaBoost (Real),1,0.4,0.4782695774083717,0.48042152409136446,262.187504529953,0.48042152409136446
14,0,Logistic Regression (Penalty = L2),1,0.4,0.5369517324253955,0.48940359628602903,0.7177290916442871,0.48940359628602903
15,0,Naive Bayes,1,0.4,0.45784097736831564,0.12787393865071378,0.34790706634521484,0.12787393865071378
16,0,KNeighbors Classifier,2,0.4,0.47666733426797514,0.44864881946559304,3.6949574947357178,0.44864881946559304
17,0,SVC Classifier,2,0.4,0.551171640296415,1.0,158.00828766822815,0.0
18,0,Decision Tree,2,0.4,0.5285399559383136,0.48542788893927885,0.7096307277679443,0.48542788893927885
19,0,RandomForest,2,0.4,0.5701982775886241,0.27754866644961246,1.9339854717254639,0.27754866644961246
20,0,AdaBoost (Discrete),2,0.4,0.5313438814340076,0.48279830001712315,186.57974314689636,0.48279830001712315
21,0,AdaBoost (Real),2,0.4,0.5635890246344882,0.4910070244956217,263.2840213775635,0.4910070244956217
22,0,Logistic Regression (Penalty = L2),2,0.4,0.5269377127979171,0.31561823100019526,0.9714710712432861,0.31561823100019526
23,0,Naive Bayes,2,0.4,0.41718405768075306,0.10628336467516805,0.3342900276184082,0.10628336467516805
24,1,KNeighbors Classifier,0,0.4,0.5562675210252302,0.5448310869583883,4.127181529998779,0.5448310869583883
25,1,SVC Classifier,0,0.4,0.55126151381658,1.0,200.82407879829407,0.0
26,1,Decision Tree,0,0.4,0.5180216259511413,0.5183478924052723,0.8869740962982178,0.5183478924052723
27,1,RandomForest,0,0.4,0.566079295154185,0.556503498843413,2.0077435970306396,0.556503498843413
28,1,AdaBoost (Discrete),0,0.4,0.49579495394473366,0.4977958859643212,224.36369276046753,0.4977958859643212
29,1,AdaBoost (Real),0,0.4,0.49659591509811774,0.4948945294956842,306.2764296531677,0.4948945294956842
30,1,Logistic Regression (Penalty = L2),0,0.4,0.55126151381658,1.0,0.6204476356506348,0.0
31,1,Naive Bayes,0,0.4,0.55126151381658,1.0,0.4190375804901123,0.0
32,1,KNeighbors Classifier,1,0.4,0.52092930102143,0.5093154947332634,6.592199325561523,0.5093154947332634
33,1,SVC Classifier,1,0.4,0.5509713599038654,0.9996366279069767,206.85325360298157,0.0
34,1,Decision Tree,1,0.4,0.5133186461045464,0.5090859031370126,0.9751529693603516,0.5090859031370126
35,1,RandomForest,1,0.4,0.5197276186661326,0.4040820811166048,2.1023738384246826,0.4040820811166048
36,1,AdaBoost (Discrete),1,0.4,0.5319447226116564,0.5228180096576218,243.9206144809723,0.5228180096576218
37,1,AdaBoost (Real),1,0.4,0.5283396755457641,0.5220372670319124,280.6056704521179,0.5220372670319124
38,1,Logistic Regression (Penalty = L2),1,0.4,0.551171640296415,1.0,0.3741919994354248,0.0
39,1,Naive Bayes,1,0.4,0.5509713599038654,0.9996366279069767,0.4065403938293457,0.0
40,1,KNeighbors Classifier,2,0.4,0.5495693971560184,0.5077066523095324,7.9114367961883545,0.5077066523095324
41,1,SVC Classifier,2,0.4,0.551171640296415,1.0,147.89829754829407,0.0
42,1,Decision Tree,2,0.4,0.48728219507310233,0.4433206806894572,0.9191815853118896,0.4433206806894572
43,1,RandomForest,2,0.4,0.5215301421990787,0.4986673189457973,2.2972805500030518,0.4986673189457973
44,1,AdaBoost (Discrete),2,0.4,0.4796715401562187,0.40920278525541454,247.28104209899902,0.40920278525541454
45,1,AdaBoost (Real),2,0.4,0.4600440616863609,0.38734254285989356,310.65310168266296,0.38734254285989356
46,1,Logistic Regression (Penalty = L2),2,0.4,0.5738033246545163,0.3403889264882171,1.3518218994140625,0.3403889264882171
47,1,Naive Bayes,2,0.4,0.4123773282595634,0.12762325808273683,0.4383838176727295,0.12762325808273683
48,2,KNeighbors Classifier,0,0.4,0.5348418101722067,0.5366973558130055,12.285755395889282,0.5366973558130055
49,2,SVC Classifier,0,0.4,0.55126151381658,1.0,181.6195785999298,0.0
50,2,Decision Tree,0,0.4,0.5326391670004005,0.5347185572620318,0.930649995803833,0.5347185572620318
51,2,RandomForest,0,0.4,0.48217861433720466,0.4812047669421138,2.8016836643218994,0.4812047669421138
52,2,AdaBoost (Discrete),0,0.4,0.5206247496996396,0.5221821343257654,261.06138253211975,0.5221821343257654
53,2,AdaBoost (Real),0,0.4,0.539247096515819,0.5335320086009697,319.9362404346466,0.5335320086009697
54,2,Logistic Regression (Penalty = L2),0,0.4,0.5214257108530236,0.5032860394541656,1.1202547550201416,0.5032860394541656
55,2,Naive Bayes,0,0.4,0.473568281938326,0.24989362711895874,0.4946916103363037,0.24989362711895874
56,2,KNeighbors Classifier,1,0.4,0.4742639695573803,0.46913558982855313,8.528122663497925,0.46913558982855313
57,2,SVC Classifier,1,0.4,0.551171640296415,1.0,175.64730858802795,0.0
58,2,Decision Tree,1,0.4,0.5005007009813739,0.5023637091855598,1.1181809902191162,0.5023637091855598
59,2,RandomForest,1,0.4,0.5171239735629882,0.3384103355589194,2.5173535346984863,0.3384103355589194
60,2,AdaBoost (Discrete),1,0.4,0.4932906068495894,0.49378387202429713,256.844868183136,0.49378387202429713
61,2,AdaBoost (Real),1,0.4,0.5017023833366714,0.5005487296440939,330.4361035823822,0.5005487296440939
62,2,Logistic Regression (Penalty = L2),1,0.4,0.506509112757861,0.47934551700668715,1.0975935459136963,0.47934551700668715
63,2,Naive Bayes,1,0.4,0.46785499699579414,0.1857965253636604,0.41423654556274414,0.1857965253636604
64,2,KNeighbors Classifier,2,0.4,0.4151812537552574,0.41011157000202675,6.0316784381866455,0.41011157000202675
65,2,SVC Classifier,2,0.4,0.551171640296415,1.0,207.9771444797516,0.0
66,2,Decision Tree,2,0.4,0.45343480873222514,0.44061644371454645,1.135227918624878,0.44061644371454645
67,2,RandomForest,2,0.4,0.5485679951932706,0.4612837035583173,2.3869473934173584,0.4612837035583173
68,2,AdaBoost (Discrete),2,0.4,0.3893450831163629,0.37480904996621034,261.21377301216125,0.37480904996621034
69,2,AdaBoost (Real),2,0.4,0.4005607850991388,0.3888266193414117,335.1740152835846,0.3888266193414117
70,2,Logistic Regression (Penalty = L2),2,0.4,0.5549769677548568,0.36516089390965095,1.0401654243469238,0.36516089390965095
71,2,Naive Bayes,2,0.4,0.4089725615862207,0.14327089951219185,0.4544548988342285,0.14327089951219185
72,3,KNeighbors Classifier,0,0.4,0.5360432519022827,0.5339055550027826,1.5998098850250244,0.5339055550027826
73,3,SVC Classifier,0,0.4,0.55126151381658,1.0,158.00257301330566,0.0
74,3,Decision Tree,0,0.4,0.5434521425710853,0.532445263304664,0.7578108310699463,0.532445263304664
75,3,RandomForest,0,0.4,0.5222266720064077,0.5249928996117872,2.3982717990875244,0.5249928996117872
76,3,AdaBoost (Discrete),0,0.4,0.5642771325590709,0.5552897966872468,165.43132901191711,0.5552897966872468
77,3,AdaBoost (Real),0,0.4,0.5328394072887465,0.5225572802643805,237.86366367340088,0.5225572802643805
78,3,Logistic Regression (Penalty = L2),0,0.4,0.55126151381658,1.0,0.3680872917175293,0.0
79,3,Naive Bayes,0,0.4,0.45694833800560675,0.134495595860616,0.31659913063049316,0.134495595860616
80,3,KNeighbors Classifier,1,0.4,0.5057079911876627,0.4976068158657395,1.390855073928833,0.4976068158657395
81,3,SVC Classifier,1,0.4,0.5509713599038654,0.9996366279069767,195.36302733421326,0.0
82,3,Decision Tree,1,0.4,0.5221309833767274,0.5028782617937854,0.7652814388275146,0.5028782617937854
83,3,RandomForest,1,0.4,0.5323452833967555,0.5017786729713821,2.176137685775757,0.5017786729713821
84,3,AdaBoost (Discrete),1,0.4,0.49128780292409374,0.46030581192360015,160.25925278663635,0.46030581192360015
85,3,AdaBoost (Real),1,0.4,0.49829761666332867,0.4755413113234812,214.10115098953247,0.4755413113234812
86,3,Logistic Regression (Penalty = L2),1,0.4,0.551171640296415,1.0,0.4749908447265625,0.0
87,3,Naive Bayes,1,0.4,0.45703985579811734,0.12351039519204195,0.3616147041320801,0.12351039519204195
88,3,KNeighbors Classifier,2,0.4,0.4878830362507511,0.4685457471934178,1.0322191715240479,0.4685457471934178
89,3,SVC Classifier,2,0.4,0.551171640296415,1.0,134.77115559577942,0.0
90,3,Decision Tree,2,0.4,0.4848788303625075,0.4578241438264288,0.7166073322296143,0.4578241438264288
91,3,RandomForest,2,0.4,0.5467654716603244,0.09374637864041992,2.110109329223633,0.09374637864041992
92,3,AdaBoost (Discrete),2,0.4,0.4404165832165031,0.3643932239715354,138.76324033737183,0.3643932239715354
93,3,AdaBoost (Real),2,0.4,0.4634488283597036,0.41246303465621714,218.349116563797,0.41246303465621714
94,3,Logistic Regression (Penalty = L2),2,0.4,0.551171640296415,1.0,0.38835597038269043,0.0
95,3,Naive Bayes,2,0.4,0.43440817144001603,0.12716760019304552,0.41826963424682617,0.12716760019304552
96,4,KNeighbors Classifier,0,0.4,0.5110132158590308,0.5049327766924543,1.9927949905395508,0.5049327766924543
97,4,SVC Classifier,0,0.4,0.55126151381658,1.0,1216.9849033355713,0.0
98,4,Decision Tree,0,0.4,0.49979975971165397,0.49742585300819814,0.9467911720275879,0.49742585300819814
99,4,RandomForest,0,0.4,0.5196235482579095,0.49940928458477474,1.8939189910888672,0.49940928458477474
100,4,AdaBoost (Discrete),0,0.4,0.5038045654785743,0.49528150813402483,137.40217185020447,0.49528150813402483
101,4,AdaBoost (Real),0,0.4,0.4801762114537445,0.4751142422674699,167.79229378700256,0.4751142422674699
102,4,Logistic Regression (Penalty = L2),0,0.4,0.5522627152583099,0.4448736094074753,0.5817360877990723,0.4448736094074753
103,4,Naive Bayes,0,0.4,0.47196635963155786,0.26681673450712495,0.2686307430267334,0.26681673450712495
104,4,KNeighbors Classifier,1,0.4,0.47406368916483077,0.46357025381116573,1.9640486240386963,0.46357025381116573
105,4,SVC Classifier,1,0.4,0.551171640296415,1.0,105.15808820724487,0.0
106,4,Decision Tree,1,0.4,0.4764670538754256,0.4699824827975466,0.5675477981567383,0.4699824827975466
107,4,RandomForest,1,0.4,0.5037051872621671,0.31704782819547805,1.5135748386383057,0.31704782819547805
108,4,AdaBoost (Discrete),1,0.4,0.454436210694973,0.43916228013884906,125.16621160507202,0.43916228013884906
109,4,AdaBoost (Real),1,0.4,0.47406368916483077,0.46298750492737434,171.25684332847595,0.46298750492737434
110,4,Logistic Regression (Penalty = L2),1,0.4,0.52092930102143,0.48367943527124857,0.6231358051300049,0.48367943527124857
111,4,Naive Bayes,1,0.4,0.4528339675545764,0.08524929243380919,0.3209519386291504,0.08524929243380919
112,4,KNeighbors Classifier,2,0.4,0.4876827558582015,0.4801036528184758,1.3531603813171387,0.4801036528184758
113,4,SVC Classifier,2,0.4,0.551171640296415,1.0,96.39211511611938,0.0
114,4,Decision Tree,2,0.4,0.42639695573803327,0.42702634464320016,0.49195170402526855,0.42702634464320016
115,4,RandomForest,2,0.4,0.5605848187462448,0.2040891905626389,1.1985695362091064,0.2040891905626389
116,4,AdaBoost (Discrete),2,0.4,0.3560985379531344,0.33444639977352414,123.05864977836609,0.33444639977352414
117,4,AdaBoost (Real),2,0.4,0.38293611055477667,0.37365045188137025,161.307302236557,0.37365045188137025
118,4,Logistic Regression (Penalty = L2),2,0.4,0.5679951932705788,0.3563299910823571,0.4844074249267578,0.3563299910823571
119,4,Naive Bayes,2,0.4,0.4334067694772682,0.2055647898558299,0.2828853130340576,0.2055647898558299
120,5,KNeighbors Classifier,0,0.4,0.5776932318782539,0.5668722437546326,0.8479950428009033,0.5668722437546326
121,5,SVC Classifier,0,0.4,0.55126151381658,1.0,123.5880036354065,0.0
122,5,Decision Tree,0,0.4,0.5454545454545454,0.5388764700590449,0.46158623695373535,0.5388764700590449
123,5,RandomForest,0,0.4,0.5726872246696035,0.5753253517711837,1.4651482105255127,0.5753253517711837
124,5,AdaBoost (Discrete),0,0.4,0.5828994793752503,0.5852994547617653,94.93395614624023,0.5852994547617653
125,5,AdaBoost (Real),0,0.4,0.5642771325590709,0.5624085291184514,137.3970923423767,0.5624085291184514
126,5,Logistic Regression (Penalty = L2),0,0.4,0.55126151381658,1.0,0.2485182285308838,0.0
127,5,Naive Bayes,0,0.4,0.46796155386463756,0.2284318677968793,0.2644484043121338,0.2284318677968793
128,5,KNeighbors Classifier,1,0.4,0.5321450030042059,0.5327120161898562,0.8817455768585205,0.5327120161898562
129,5,SVC Classifier,1,0.4,0.551171640296415,1.0,85.00431537628174,0.0
130,5,Decision Tree,1,0.4,0.5213298618065292,0.5134766941471363,0.4426426887512207,0.5134766941471363
131,5,RandomForest,1,0.4,0.5433607049869817,0.4999387045645283,1.2483372688293457,0.4999387045645283
132,5,AdaBoost (Discrete),1,0.4,0.5762066893651111,0.5790718244297026,97.81631708145142,0.5790718244297026
133,5,AdaBoost (Real),1,0.4,0.5611856599238935,0.5616763011935968,148.47035026550293,0.5616763011935968
134,5,Logistic Regression (Penalty = L2),1,0.4,0.551171640296415,1.0,0.2279222011566162,0.0
135,5,Naive Bayes,1,0.4,0.46685359503304624,0.18084105831390454,0.2661421298980713,0.18084105831390454
136,5,KNeighbors Classifier,2,0.4,0.5101141598237533,0.4765251973518037,0.8754236698150635,0.4765251973518037
137,5,SVC Classifier,2,0.4,0.551171640296415,1.0,87.24068927764893,0.0
138,5,Decision Tree,2,0.4,0.5047065892249148,0.4591740183603823,0.4384300708770752,0.4591740183603823
139,5,RandomForest,2,0.4,0.5467654716603244,0.47066510114247345,1.1766996383666992,0.47066510114247345
140,5,AdaBoost (Discrete),2,0.4,0.5527738834368116,0.4918963652876941,85.77801084518433,0.4918963652876941
141,5,AdaBoost (Real),2,0.4,0.5369517324253955,0.49216889968059946,130.49156308174133,0.49216889968059946
142,5,Logistic Regression (Penalty = L2),2,0.4,0.551171640296415,1.0,0.22815918922424316,0.0
143,5,Naive Bayes,2,0.4,0.4077708792309233,0.07460148578792397,0.22041797637939453,0.07460148578792397
144,6,KNeighbors Classifier,0,0.4,0.5582699239086905,0.5476291979334174,2.204294443130493,0.5476291979334174
145,6,SVC Classifier,0,0.4,0.55126151381658,1.0,79.52625441551208,0.0
146,6,Decision Tree,0,0.4,0.5452543051661994,0.5442244399168018,0.5474798679351807,0.5442244399168018
147,6,RandomForest,0,0.4,0.5168201842210652,0.5046914801291557,1.3247365951538086,0.5046914801291557
148,6,AdaBoost (Discrete),0,0.4,0.5704845814977973,0.5627578679967665,116.84922480583191,0.5627578679967665
149,6,AdaBoost (Real),0,0.4,0.5570684821786144,0.5471930427247207,149.24701309204102,0.5471930427247207
150,6,Logistic Regression (Penalty = L2),0,0.4,0.5234281137364838,0.4754539129040779,0.5137908458709717,0.4754539129040779
151,6,Naive Bayes,0,0.4,0.46135362434921906,0.1603058982405068,0.24248409271240234,0.1603058982405068
152,6,KNeighbors Classifier,1,0.4,0.4848788303625075,0.4730941512228365,3.4155795574188232,0.4730941512228365
153,6,SVC Classifier,1,0.4,0.5509713599038654,0.9996366279069767,79.5191342830658,0.0
154,6,Decision Tree,1,0.4,0.5189264970959343,0.5184104708334218,0.4598429203033447,0.5184104708334218
155,6,RandomForest,1,0.4,0.542359303024234,0.44763771284803994,1.0511319637298584,0.44763771284803994
156,6,AdaBoost (Discrete),1,0.4,0.5297416382936111,0.5274989473171791,115.50123405456543,0.5274989473171791
157,6,AdaBoost (Real),1,0.4,0.5425595834167835,0.5401725014955867,146.84158849716187,0.5401725014955867
158,6,Logistic Regression (Penalty = L2),1,0.4,0.5129180853194473,0.4834131837221257,0.5795526504516602,0.4834131837221257
159,6,Naive Bayes,1,0.4,0.4600440616863609,0.14264935053936392,0.2034130096435547,0.14264935053936392
160,6,KNeighbors Classifier,2,0.4,0.4928900460644903,0.48648894352310956,3.3616297245025635,0.48648894352310956
161,6,SVC Classifier,2,0.4,0.551171640296415,1.0,104.91975235939026,0.0
162,6,Decision Tree,2,0.4,0.43540957340276387,0.43179942663211635,0.5059022903442383,0.43179942663211635
163,6,RandomForest,2,0.4,0.5461646304826757,0.45997633096158586,1.404439926147461,0.45997633096158586
164,6,AdaBoost (Discrete),2,0.4,0.42619667534548367,0.4103455644324806,123.41097116470337,0.4103455644324806
165,6,AdaBoost (Real),2,0.4,0.43540957340276387,0.4282283419900832,153.5357542037964,0.4282283419900832
166,6,Logistic Regression (Penalty = L2),2,0.4,0.5695974364109754,0.36773394119569824,0.5245749950408936,0.36773394119569824
167,6,Naive Bayes,2,0.4,0.41257760865211296,0.11016754214673331,0.14995384216308594,0.11016754214673331
168,7,KNeighbors Classifier,0,0.4,0.5214257108530236,0.5236309614231948,12.102264404296875,0.5236309614231948
169,7,SVC Classifier,0,0.4,0.55126151381658,1.0,116.11349320411682,0.0
170,7,Decision Tree,0,0.4,0.5192230676812175,0.5218095143363098,0.7058713436126709,0.5218095143363098
171,7,RandomForest,0,0.4,0.4969963956748098,0.4941670617539058,1.4400231838226318,0.4941670617539058
172,7,AdaBoost (Discrete),0,0.4,0.4643572286744093,0.4377885719668739,208.74582409858704,0.4377885719668739
173,7,AdaBoost (Real),0,0.4,0.4819783740488586,0.4662465319751723,254.7904245853424,0.4662465319751723
174,7,Logistic Regression (Penalty = L2),0,0.4,0.5186223468161795,0.5052013904948605,0.6620569229125977,0.5052013904948605
175,7,Naive Bayes,0,0.4,0.47196635963155786,0.24414817802906397,0.26227712631225586,0.24414817802906397
176,7,KNeighbors Classifier,1,0.4,0.42439415181253753,0.42651076335156507,20.160584211349487,0.42651076335156507
177,7,SVC Classifier,1,0.4,0.5509713599038654,0.9996366279069767,121.25715970993042,0.0
178,7,Decision Tree,1,0.4,0.48067294211896655,0.48319947282641973,0.6871922016143799,0.48319947282641973
179,7,RandomForest,1,0.4,0.5025035049068696,0.48299439597427285,1.4966683387756348,0.48299439597427285
180,7,AdaBoost (Discrete),1,0.4,0.4854796715401562,0.4880183911760762,228.1100537776947,0.4880183911760762
181,7,AdaBoost (Real),1,0.4,0.4780692970158221,0.48057051186448835,323.0765197277069,0.48057051186448835
182,7,Logistic Regression (Penalty = L2),1,0.4,0.5021029441217705,0.4900346779102695,1.0275092124938965,0.4900346779102695
183,7,Naive Bayes,1,0.4,0.5173242539555377,0.41403742224325424,0.2895951271057129,0.41403742224325424
184,7,KNeighbors Classifier,2,0.4,0.43100340476667337,0.39111493861618474,15.415376901626587,0.39111493861618474
185,7,SVC Classifier,2,0.4,0.5513719206889646,0.021124141684149264,138.60810661315918,0.021124141684149264
186,7,Decision Tree,2,0.4,0.5261365912277188,0.5044946276653623,0.8385534286499023,0.5044946276653623
187,7,RandomForest,2,0.4,0.5535750050070098,0.4458607132610479,1.6063206195831299,0.4458607132610479
188,7,AdaBoost (Discrete),2,0.4,0.49829761666332867,0.45242845294945894,242.32649636268616,0.45242845294945894
189,7,AdaBoost (Real),2,0.4,0.4974964950931304,0.44308690082323937,276.7764220237732,0.44308690082323937
190,7,Logistic Regression (Penalty = L2),2,0.4,0.5443621069497296,0.3075934957897839,0.6931807994842529,0.3075934957897839
191,7,Naive Bayes,2,0.4,0.40817144001602246,0.12317977768287787,0.2647073268890381,0.12317977768287787
192,8,KNeighbors Classifier,0,0.4,0.5302362835402483,0.5059166763345314,0.6223511695861816,0.5059166763345314
193,8,SVC Classifier,0,0.4,0.55126151381658,1.0,75.23792600631714,0.0
194,8,Decision Tree,0,0.4,0.5386463756507809,0.5280415395301711,0.27216625213623047,0.5280415395301711
195,8,RandomForest,0,0.4,0.525830997196636,0.5284784718691681,1.2896389961242676,0.5284784718691681
196,8,AdaBoost (Discrete),0,0.4,0.564477372847417,0.5544211563399342,82.78176593780518,0.5544211563399342
197,8,AdaBoost (Real),0,0.4,0.5408490188225871,0.533344225562507,154.49511003494263,0.533344225562507
198,8,Logistic Regression (Penalty = L2),0,0.4,0.55126151381658,1.0,0.2727832794189453,0.0
199,8,Naive Bayes,0,0.4,0.4703644373247898,0.25410536111096343,0.1707754135131836,0.25410536111096343
200,8,KNeighbors Classifier,1,0.4,0.4992990186260765,0.4945870857982388,0.6442821025848389,0.4945870857982388
201,8,SVC Classifier,1,0.4,0.551171640296415,1.0,74.61987328529358,0.0
202,8,Decision Tree,1,0.4,0.5289405167234128,0.48276672918455205,0.24643230438232422,0.48276672918455205
203,8,RandomForest,1,0.4,0.5447626677348287,0.5008573484504124,1.0869653224945068,0.5008573484504124
204,8,AdaBoost (Discrete),1,0.4,0.5347486481073503,0.49145247344904525,81.7796561717987,0.49145247344904525
205,8,AdaBoost (Real),1,0.4,0.5283396755457641,0.4860102542950844,155.38667511940002,0.4860102542950844
206,8,Logistic Regression (Penalty = L2),1,0.4,0.551171640296415,1.0,0.23236846923828125,0.0
207,8,Naive Bayes,1,0.4,0.45703985579811734,0.12351039519204195,0.17138171195983887,0.12351039519204195
208,8,KNeighbors Classifier,2,0.4,0.5393550971359904,0.5238347486888161,0.5918738842010498,0.5238347486888161
209,8,SVC Classifier,2,0.4,0.551171640296415,1.0,79.72074341773987,0.0
210,8,Decision Tree,2,0.4,0.505107150010014,0.43266899554929933,0.32222723960876465,0.43266899554929933
211,8,RandomForest,2,0.4,0.551171640296415,1.0,1.4758191108703613,0.0
212,8,AdaBoost (Discrete),2,0.4,0.5049068696174644,0.47990198330157774,80.80074834823608,0.47990198330157774
213,8,AdaBoost (Real),2,0.4,0.49809733627077907,0.437578796490568,161.08620834350586,0.437578796490568
214,8,Logistic Regression (Penalty = L2),2,0.4,0.551171640296415,1.0,0.3070816993713379,0.0
215,8,Naive Bayes,2,0.4,0.4590426597236131,0.15880929005052905,0.08504247665405273,0.15880929005052905
