,feat_set_id,classifier,fold_id,feat_th,score,geo_score,exec_t,geo_score_woz
0,0,KNeighbors Classifier,0,0.85,0.9333333333333333,0.9410360288810286,0.11368584632873535,0.9410360288810286
1,0,SVC Classifier,0,0.85,0.45,0.3872983346207417,0.03205227851867676,0.0
2,0,Decision Tree,0,0.85,0.7333333333333333,0.7057770216607714,0.03052234649658203,0.7057770216607714
3,0,RandomForest,0,0.85,0.8833333333333333,0.8690066612216124,0.22078824043273926,0.8690066612216124
4,0,AdaBoost (Discrete),0,0.85,0.9166666666666666,0.9210078746600967,13.633289575576782,0.9210078746600967
5,0,AdaBoost (Real),0,0.85,0.9333333333333333,0.9410360288810286,15.533343315124512,0.9410360288810286
6,0,Logistic Regression (Penalty = L2),0,0.85,0.9333333333333333,0.9410360288810286,0.08998274803161621,0.9410360288810286
7,0,Naive Bayes,0,0.85,0.95,0.9564655913861946,0.0030231475830078125,0.9564655913861946
8,0,KNeighbors Classifier,1,0.85,0.9666666666666667,0.9691999875015047,0.04786562919616699,0.9691999875015047
9,0,SVC Classifier,1,0.85,0.4,1.0,0.027185678482055664,0.0
10,0,Decision Tree,1,0.85,0.8666666666666667,0.8434326653017493,0.001997232437133789,0.8434326653017493
11,0,RandomForest,1,0.85,0.9166666666666666,0.915241126759053,0.24272489547729492,0.915241126759053
12,0,AdaBoost (Discrete),1,0.85,0.9,0.8879040017426008,13.816892862319946,0.8879040017426008
13,0,AdaBoost (Real),1,0.85,0.85,0.8358603846235818,14.9375638961792,0.8358603846235818
14,0,Logistic Regression (Penalty = L2),1,0.85,0.95,0.9518891309816516,0.0349574089050293,0.9518891309816516
15,0,Naive Bayes,1,0.85,0.9666666666666667,0.9654893846056297,0.0018873214721679688,0.9654893846056297
16,0,KNeighbors Classifier,2,0.85,0.9655172413793104,0.9701312318500641,0.039072513580322266,0.9701312318500641
17,0,SVC Classifier,2,0.85,0.39655172413793105,1.0,0.038655996322631836,0.0
18,0,Decision Tree,2,0.85,1.0,1.0,0.03008890151977539,1.0
19,0,RandomForest,2,0.85,0.9482758620689655,0.9528037423984005,0.25165748596191406,0.9528037423984005
20,0,AdaBoost (Discrete),2,0.85,0.9827586206896551,0.9852919811325488,13.257006406784058,0.9852919811325488
21,0,AdaBoost (Real),2,0.85,0.8793103448275862,0.8858189155864656,14.828469038009644,0.8858189155864656
22,0,Logistic Regression (Penalty = L2),2,0.85,0.9655172413793104,0.9701312318500641,0.0017940998077392578,0.9701312318500641
23,0,Naive Bayes,2,0.85,0.9655172413793104,0.967693705920519,0.003287792205810547,0.967693705920519
24,1,KNeighbors Classifier,0,0.85,0.9166666666666666,0.9250831838185912,0.03511667251586914,0.9250831838185912
25,1,SVC Classifier,0,0.85,0.45,0.3872983346207417,0.0016913414001464844,0.0
26,1,Decision Tree,0,0.85,0.85,0.8478028607535417,0.03325343132019043,0.8478028607535417
27,1,RandomForest,0,0.85,0.9333333333333333,0.9361090484023133,0.21594929695129395,0.9361090484023133
28,1,AdaBoost (Discrete),0,0.85,0.9166666666666666,0.9210078746600967,12.833974123001099,0.9210078746600967
29,1,AdaBoost (Real),0,0.85,0.9333333333333333,0.9410360288810286,13.910783767700195,0.9410360288810286
30,1,Logistic Regression (Penalty = L2),0,0.85,0.9833333333333333,0.9859136166167861,0.030962467193603516,0.9859136166167861
31,1,Naive Bayes,0,0.85,0.95,0.9564655913861946,0.03183460235595703,0.9564655913861946
32,1,KNeighbors Classifier,1,0.85,0.9333333333333333,0.9402511777839014,0.0022106170654296875,0.9402511777839014
33,1,SVC Classifier,1,0.85,0.4,1.0,0.0017077922821044922,0.0
34,1,Decision Tree,1,0.85,0.8333333333333334,0.8077799970689432,0.030046701431274414,0.8077799970689432
35,1,RandomForest,1,0.85,0.9166666666666666,0.9085602964160698,0.22287774085998535,0.9085602964160698
36,1,AdaBoost (Discrete),1,0.85,0.9166666666666666,0.9085602964160698,13.26020860671997,0.9085602964160698
37,1,AdaBoost (Real),1,0.85,0.85,0.8254818122236567,17.296045303344727,0.8254818122236567
38,1,Logistic Regression (Penalty = L2),1,0.85,0.9833333333333333,0.9830475724915585,0.07476806640625,0.9830475724915585
39,1,Naive Bayes,1,0.85,0.9666666666666667,0.9654893846056297,0.038512468338012695,0.9654893846056297
40,1,KNeighbors Classifier,2,0.85,0.9827586206896551,0.9852919811325488,0.03931546211242676,0.9852919811325488
41,1,SVC Classifier,2,0.85,0.39655172413793105,1.0,0.03486299514770508,0.0
42,1,Decision Tree,2,0.85,0.9655172413793104,0.967693705920519,0.0018146038055419922,0.967693705920519
43,1,RandomForest,2,0.85,0.9482758620689655,0.9470981939677545,0.2747499942779541,0.9470981939677545
44,1,AdaBoost (Discrete),2,0.85,0.9655172413793104,0.967693705920519,14.614303588867188,0.967693705920519
45,1,AdaBoost (Real),2,0.85,0.9482758620689655,0.9470981939677545,17.59320640563965,0.9470981939677545
46,1,Logistic Regression (Penalty = L2),2,0.85,1.0,1.0,0.05129694938659668,1.0
47,1,Naive Bayes,2,0.85,1.0,1.0,0.04701495170593262,1.0
48,2,KNeighbors Classifier,0,0.85,0.9,0.9085602964160698,0.04771232604980469,0.9085602964160698
49,2,SVC Classifier,0,0.85,0.45,0.3872983346207417,0.0018401145935058594,0.0
50,2,Decision Tree,0,0.85,0.8,0.7978130373574884,0.0016062259674072266,0.7978130373574884
51,2,RandomForest,0,0.85,0.8833333333333333,0.8690066612216124,0.36147379875183105,0.8690066612216124
52,2,AdaBoost (Discrete),0,0.85,0.9166666666666666,0.9210078746600967,17.30245065689087,0.9210078746600967
53,2,AdaBoost (Real),0,0.85,0.9333333333333333,0.9410360288810286,19.39125919342041,0.9410360288810286
54,2,Logistic Regression (Penalty = L2),0,0.85,0.9333333333333333,0.9410360288810286,0.044904470443725586,0.9410360288810286
55,2,Naive Bayes,0,0.85,0.9333333333333333,0.9410360288810286,0.0018143653869628906,0.9410360288810286
56,2,KNeighbors Classifier,1,0.85,0.9333333333333333,0.9402511777839014,0.01949310302734375,0.9402511777839014
57,2,SVC Classifier,1,0.85,0.4,1.0,0.043692588806152344,0.0
58,2,Decision Tree,1,0.85,0.85,0.8193212706006459,0.0010921955108642578,0.8193212706006459
59,2,RandomForest,1,0.85,0.9166666666666666,0.915241126759053,0.35939764976501465,0.915241126759053
60,2,AdaBoost (Discrete),1,0.85,0.9,0.8879040017426008,17.723925828933716,0.8879040017426008
61,2,AdaBoost (Real),1,0.85,0.8333333333333334,0.8067143230122719,20.844961166381836,0.8067143230122719
62,2,Logistic Regression (Penalty = L2),1,0.85,0.9166666666666666,0.915241126759053,0.08660173416137695,0.915241126759053
63,2,Naive Bayes,1,0.85,0.9666666666666667,0.9654893846056297,0.06381607055664062,0.9654893846056297
64,2,KNeighbors Classifier,2,0.85,0.9827586206896551,0.9852919811325488,0.0022759437561035156,0.9852919811325488
65,2,SVC Classifier,2,0.85,0.39655172413793105,1.0,0.0026743412017822266,0.0
66,2,Decision Tree,2,0.85,0.9655172413793104,0.967693705920519,0.0016210079193115234,0.967693705920519
67,2,RandomForest,2,0.85,0.9482758620689655,0.9528037423984005,0.33611369132995605,0.9528037423984005
68,2,AdaBoost (Discrete),2,0.85,0.9655172413793104,0.967693705920519,18.444697618484497,0.967693705920519
69,2,AdaBoost (Real),2,0.85,0.9482758620689655,0.9470981939677545,25.214191436767578,0.9470981939677545
70,2,Logistic Regression (Penalty = L2),2,0.85,1.0,1.0,0.06968832015991211,1.0
71,2,Naive Bayes,2,0.85,1.0,1.0,0.0025658607482910156,1.0
72,3,KNeighbors Classifier,0,0.85,0.9333333333333333,0.9361090484023133,0.059082984924316406,0.9361090484023133
73,3,SVC Classifier,0,0.85,0.45,0.3872983346207417,0.063079833984375,0.0
74,3,Decision Tree,0,0.85,0.7666666666666667,0.7546013420997107,0.0012373924255371094,0.7546013420997107
75,3,RandomForest,0,0.85,0.85,0.8549879733383485,0.34876465797424316,0.8549879733383485
76,3,AdaBoost (Discrete),0,0.85,0.9333333333333333,0.9361090484023133,23.25252079963684,0.9361090484023133
77,3,AdaBoost (Real),0,0.85,0.9166666666666666,0.9210078746600967,26.066531658172607,0.9210078746600967
78,3,Logistic Regression (Penalty = L2),0,0.85,0.9333333333333333,0.9410360288810286,0.002919435501098633,0.9410360288810286
79,3,Naive Bayes,0,0.85,0.9166666666666666,0.9250831838185912,0.06294035911560059,0.9250831838185912
80,3,KNeighbors Classifier,1,0.85,0.9666666666666667,0.9691999875015047,0.06398510932922363,0.9691999875015047
81,3,SVC Classifier,1,0.85,0.4,1.0,0.0028638839721679688,0.0
82,3,Decision Tree,1,0.85,0.7833333333333333,0.7555149039386845,0.06271934509277344,0.7555149039386845
83,3,RandomForest,1,0.85,0.8833333333333333,0.8825870838315157,0.4438614845275879,0.8825870838315157
84,3,AdaBoost (Discrete),1,0.85,0.8833333333333333,0.8662391053409028,29.04864192008972,0.8662391053409028
85,3,AdaBoost (Real),1,0.85,0.8333333333333334,0.8168569365543992,33.24230718612671,0.8168569365543992
86,3,Logistic Regression (Penalty = L2),1,0.85,0.9666666666666667,0.9691999875015047,0.1387026309967041,0.9691999875015047
87,3,Naive Bayes,1,0.85,0.9666666666666667,0.9654893846056297,0.0019268989562988281,0.9654893846056297
88,3,KNeighbors Classifier,2,0.85,0.9827586206896551,0.9852919811325488,0.003945589065551758,0.9852919811325488
89,3,SVC Classifier,2,0.85,0.39655172413793105,1.0,0.0017845630645751953,0.0
90,3,Decision Tree,2,0.85,0.9137931034482759,0.9183305110818188,0.0011234283447265625,0.9183305110818188
91,3,RandomForest,2,0.85,0.9827586206896551,0.9821390252341226,0.5711605548858643,0.9821390252341226
92,3,AdaBoost (Discrete),2,0.85,0.9827586206896551,0.9821390252341226,23.66161322593689,0.9821390252341226
93,3,AdaBoost (Real),2,0.85,0.9827586206896551,0.9821390252341226,24.715062856674194,0.9821390252341226
94,3,Logistic Regression (Penalty = L2),2,0.85,1.0,1.0,0.0017659664154052734,1.0
95,3,Naive Bayes,2,0.85,1.0,1.0,0.027492523193359375,1.0
96,4,KNeighbors Classifier,0,0.85,0.9,0.9053945554302176,0.02659773826599121,0.9053945554302176
97,4,SVC Classifier,0,0.85,0.45,0.3872983346207417,0.02608966827392578,0.0
98,4,Decision Tree,0,0.85,0.95,0.9564655913861946,0.0012018680572509766,0.9564655913861946
99,4,RandomForest,0,0.85,0.85,0.8549879733383485,0.19562220573425293,0.8549879733383485
100,4,AdaBoost (Discrete),0,0.85,0.9166666666666666,0.9210078746600967,19.561999559402466,0.9210078746600967
101,4,AdaBoost (Real),0,0.85,0.9166666666666666,0.9210078746600967,26.18110156059265,0.9210078746600967
102,4,Logistic Regression (Penalty = L2),0,0.85,0.9666666666666667,0.9714127805419094,0.001676321029663086,0.9714127805419094
103,4,Naive Bayes,0,0.85,0.95,0.9564655913861946,0.0018572807312011719,0.9564655913861946
104,4,KNeighbors Classifier,1,0.85,0.9333333333333333,0.9378887276834518,0.07187938690185547,0.9378887276834518
105,4,SVC Classifier,1,0.85,0.4,1.0,0.06676077842712402,0.0
106,4,Decision Tree,1,0.85,0.8,0.7645314458836486,0.0016050338745117188,0.7645314458836486
107,4,RandomForest,1,0.85,0.9166666666666666,0.9009249749572831,0.5066478252410889,0.9009249749572831
108,4,AdaBoost (Discrete),1,0.85,0.8666666666666667,0.8434326653017493,25.614753484725952,0.8434326653017493
109,4,AdaBoost (Real),1,0.85,0.8333333333333334,0.8067143230122719,31.303544998168945,0.8067143230122719
110,4,Logistic Regression (Penalty = L2),1,0.85,0.95,0.9518891309816516,0.08202624320983887,0.9518891309816516
111,4,Naive Bayes,1,0.85,0.9666666666666667,0.9654893846056297,0.0018286705017089844,0.9654893846056297
112,4,KNeighbors Classifier,2,0.85,0.9827586206896551,0.9852919811325488,0.0834505558013916,0.9852919811325488
113,4,SVC Classifier,2,0.85,0.39655172413793105,1.0,0.08280730247497559,0.0
114,4,Decision Tree,2,0.85,1.0,1.0,0.0011005401611328125,1.0
115,4,RandomForest,2,0.85,1.0,1.0,0.39579057693481445,1.0
116,4,AdaBoost (Discrete),2,0.85,0.9655172413793104,0.967693705920519,28.17701268196106,0.967693705920519
117,4,AdaBoost (Real),2,0.85,0.9655172413793104,0.967693705920519,32.42407178878784,0.967693705920519
118,4,Logistic Regression (Penalty = L2),2,0.85,1.0,1.0,0.0017342567443847656,1.0
119,4,Naive Bayes,2,0.85,1.0,1.0,0.003025054931640625,1.0
120,5,KNeighbors Classifier,0,0.85,0.9,0.9085602964160698,0.08374214172363281,0.9085602964160698
121,5,SVC Classifier,0,0.85,0.45,0.3872983346207417,0.0017120838165283203,0.0
122,5,Decision Tree,0,0.85,0.85,0.8526063789033294,0.0016591548919677734,0.8526063789033294
123,5,RandomForest,0,0.85,0.8666666666666667,0.8724415058636109,0.5090765953063965,0.8724415058636109
124,5,AdaBoost (Discrete),0,0.85,0.9166666666666666,0.9210078746600967,29.470700979232788,0.9210078746600967
125,5,AdaBoost (Real),0,0.85,0.9333333333333333,0.9410360288810286,35.606478452682495,0.9410360288810286
126,5,Logistic Regression (Penalty = L2),0,0.85,0.9333333333333333,0.9410360288810286,0.09455180168151855,0.9410360288810286
127,5,Naive Bayes,0,0.85,0.95,0.9564655913861946,0.0028324127197265625,0.9564655913861946
128,5,KNeighbors Classifier,1,0.85,0.95,0.9549449757989991,0.10347557067871094,0.9549449757989991
129,5,SVC Classifier,1,0.85,0.4,1.0,0.0017545223236083984,0.0
130,5,Decision Tree,1,0.85,0.8333333333333334,0.8083117812890779,0.0017826557159423828,0.8083117812890779
131,5,RandomForest,1,0.85,0.9,0.8957619677539866,0.857342004776001,0.8957619677539866
132,5,AdaBoost (Discrete),1,0.85,0.8833333333333333,0.8662391053409028,36.70203924179077,0.8662391053409028
133,5,AdaBoost (Real),1,0.85,0.85,0.8358603846235818,38.838290214538574,0.8358603846235818
134,5,Logistic Regression (Penalty = L2),1,0.85,0.95,0.9518891309816516,0.10198330879211426,0.9518891309816516
135,5,Naive Bayes,1,0.85,0.9666666666666667,0.9654893846056297,0.09150052070617676,0.9654893846056297
136,5,KNeighbors Classifier,2,0.85,0.9827586206896551,0.9852919811325488,0.08863282203674316,0.9852919811325488
137,5,SVC Classifier,2,0.85,0.39655172413793105,1.0,0.11375021934509277,0.0
138,5,Decision Tree,2,0.85,0.9482758620689655,0.9528037423984005,0.10211038589477539,0.9528037423984005
139,5,RandomForest,2,0.85,1.0,1.0,0.5038959980010986,1.0
140,5,AdaBoost (Discrete),2,0.85,0.9655172413793104,0.967693705920519,37.20954942703247,0.967693705920519
141,5,AdaBoost (Real),2,0.85,0.8793103448275862,0.8858189155864656,39.22320199012756,0.8858189155864656
142,5,Logistic Regression (Penalty = L2),2,0.85,1.0,1.0,0.10990452766418457,1.0
143,5,Naive Bayes,2,0.85,0.9827586206896551,0.9852919811325488,0.002481222152709961,0.9852919811325488
144,6,KNeighbors Classifier,0,0.85,0.8833333333333333,0.8848102344924725,0.09926390647888184,0.8848102344924725
145,6,SVC Classifier,0,0.85,0.45,0.3872983346207417,0.08703088760375977,0.0
146,6,Decision Tree,0,0.85,0.9,0.9085602964160698,0.0018126964569091797,0.9085602964160698
147,6,RandomForest,0,0.85,0.8666666666666667,0.8724415058636109,0.6243486404418945,0.8724415058636109
148,6,AdaBoost (Discrete),0,0.85,0.9,0.9053945554302176,35.46155023574829,0.9053945554302176
149,6,AdaBoost (Real),0,0.85,0.9333333333333333,0.9410360288810286,40.05657458305359,0.9410360288810286
150,6,Logistic Regression (Penalty = L2),0,0.85,0.9333333333333333,0.9410360288810286,0.0017044544219970703,0.9410360288810286
151,6,Naive Bayes,0,0.85,0.9166666666666666,0.9250831838185912,0.0018622875213623047,0.9250831838185912
152,6,KNeighbors Classifier,1,0.85,0.9666666666666667,0.9691999875015047,0.10356855392456055,0.9691999875015047
153,6,SVC Classifier,1,0.85,0.4,1.0,0.0028259754180908203,0.0
154,6,Decision Tree,1,0.85,0.85,0.8358603846235818,0.09818553924560547,0.8358603846235818
155,6,RandomForest,1,0.85,0.9166666666666666,0.9060294746813791,0.7313385009765625,0.9060294746813791
156,6,AdaBoost (Discrete),1,0.85,0.8833333333333333,0.8662391053409028,31.041001081466675,0.8662391053409028
157,6,AdaBoost (Real),1,0.85,0.8333333333333334,0.8168569365543992,41.52155900001526,0.8168569365543992
158,6,Logistic Regression (Penalty = L2),1,0.85,0.95,0.9518891309816516,0.11121582984924316,0.9518891309816516
159,6,Naive Bayes,1,0.85,0.9666666666666667,0.9654893846056297,0.10640406608581543,0.9654893846056297
160,6,KNeighbors Classifier,2,0.85,1.0,1.0,0.14301824569702148,1.0
161,6,SVC Classifier,2,0.85,0.39655172413793105,1.0,0.0017559528350830078,0.0
162,6,Decision Tree,2,0.85,0.9310344827586207,0.919403328074952,0.0011382102966308594,0.919403328074952
163,6,RandomForest,2,0.85,0.9827586206896551,0.9787169102922159,0.6345789432525635,0.9787169102922159
164,6,AdaBoost (Discrete),2,0.85,1.0,1.0,36.78566288948059,1.0
165,6,AdaBoost (Real),2,0.85,0.9827586206896551,0.9821390252341226,43.10178732872009,0.9821390252341226
166,6,Logistic Regression (Penalty = L2),2,0.85,1.0,1.0,0.10676932334899902,1.0
167,6,Naive Bayes,2,0.85,1.0,1.0,0.0033521652221679688,1.0
168,7,KNeighbors Classifier,0,0.85,0.8833333333333333,0.8892233261225158,0.1109476089477539,0.8892233261225158
169,7,SVC Classifier,0,0.85,0.45,0.3872983346207417,0.0016987323760986328,0.0
170,7,Decision Tree,0,0.85,0.8333333333333334,0.8039034489224531,0.0019690990447998047,0.8039034489224531
171,7,RandomForest,0,0.85,0.8666666666666667,0.8724415058636109,0.6381847858428955,0.8724415058636109
172,7,AdaBoost (Discrete),0,0.85,0.9166666666666666,0.9210078746600967,36.066036224365234,0.9210078746600967
173,7,AdaBoost (Real),0,0.85,0.9166666666666666,0.9210078746600967,48.01041030883789,0.9210078746600967
174,7,Logistic Regression (Penalty = L2),0,0.85,0.9666666666666667,0.9714127805419094,0.11888575553894043,0.9714127805419094
175,7,Naive Bayes,0,0.85,0.95,0.9564655913861946,0.11937689781188965,0.9564655913861946
176,7,KNeighbors Classifier,1,0.85,0.95,0.9549449757989991,0.11613130569458008,0.9549449757989991
177,7,SVC Classifier,1,0.85,0.4,1.0,0.0026421546936035156,0.0
178,7,Decision Tree,1,0.85,0.85,0.8358603846235818,0.11802220344543457,0.8358603846235818
179,7,RandomForest,1,0.85,0.9,0.8957619677539866,0.5588624477386475,0.8957619677539866
180,7,AdaBoost (Discrete),1,0.85,0.9,0.8892233261225158,41.52365779876709,0.8892233261225158
181,7,AdaBoost (Real),1,0.85,0.85,0.8358603846235818,46.927926778793335,0.8358603846235818
182,7,Logistic Regression (Penalty = L2),1,0.85,0.9166666666666666,0.915241126759053,0.10678529739379883,0.915241126759053
183,7,Naive Bayes,1,0.85,0.9666666666666667,0.9654893846056297,0.0024285316467285156,0.9654893846056297
184,7,KNeighbors Classifier,2,0.85,0.9827586206896551,0.9852919811325488,0.10785818099975586,0.9852919811325488
185,7,SVC Classifier,2,0.85,0.39655172413793105,1.0,0.11081504821777344,0.0
186,7,Decision Tree,2,0.85,0.9827586206896551,0.9852919811325488,0.10581564903259277,0.9852919811325488
187,7,RandomForest,2,0.85,1.0,1.0,0.6195235252380371,1.0
188,7,AdaBoost (Discrete),2,0.85,0.9655172413793104,0.967693705920519,41.325496196746826,0.967693705920519
189,7,AdaBoost (Real),2,0.85,0.8793103448275862,0.8858189155864656,46.50303316116333,0.8858189155864656
190,7,Logistic Regression (Penalty = L2),2,0.85,1.0,1.0,0.10596489906311035,1.0
191,7,Naive Bayes,2,0.85,1.0,1.0,0.0018148422241210938,1.0
192,8,KNeighbors Classifier,0,0.85,0.9,0.9085602964160698,0.1075887680053711,0.9085602964160698
193,8,SVC Classifier,0,0.85,0.45,0.3872983346207417,0.11009454727172852,0.0
194,8,Decision Tree,0,0.85,0.8166666666666667,0.8099029503193709,0.0016188621520996094,0.8099029503193709
195,8,RandomForest,0,0.85,0.9,0.9085602964160698,0.7573966979980469,0.9085602964160698
196,8,AdaBoost (Discrete),0,0.85,0.9166666666666666,0.9210078746600967,44.46917796134949,0.9210078746600967
197,8,AdaBoost (Real),0,0.85,0.9,0.900068581879409,47.73058485984802,0.900068581879409
198,8,Logistic Regression (Penalty = L2),0,0.85,0.95,0.9564655913861946,0.0028121471405029297,0.9564655913861946
199,8,Naive Bayes,0,0.85,0.8833333333333333,0.8914135402065606,0.12340331077575684,0.8914135402065606
200,8,KNeighbors Classifier,1,0.85,0.9166666666666666,0.9250831838185912,0.12286543846130371,0.9250831838185912
201,8,SVC Classifier,1,0.85,0.4,1.0,0.0028154850006103516,0.0
202,8,Decision Tree,1,0.85,0.8,0.7759440455456199,0.12259531021118164,0.7759440455456199
203,8,RandomForest,1,0.85,0.85,0.8372867702993152,0.755927324295044,0.8372867702993152
204,8,AdaBoost (Discrete),1,0.85,0.85,0.8193212706006459,48.65369272232056,0.8193212706006459
205,8,AdaBoost (Real),1,0.85,0.8333333333333334,0.813853758940804,30.4395592212677,0.813853758940804
206,8,Logistic Regression (Penalty = L2),1,0.85,1.0,1.0,0.1111135482788086,1.0
207,8,Naive Bayes,1,0.85,0.9666666666666667,0.9654893846056297,0.0903160572052002,0.9654893846056297
208,8,KNeighbors Classifier,2,0.85,0.9827586206896551,0.9852919811325488,0.11175346374511719,0.9852919811325488
209,8,SVC Classifier,2,0.85,0.39655172413793105,1.0,0.11039400100708008,0.0
210,8,Decision Tree,2,0.85,0.9482758620689655,0.9528037423984005,0.11005616188049316,0.9528037423984005
211,8,RandomForest,2,0.85,0.9827586206896551,0.9852919811325488,0.660369873046875,0.9852919811325488
212,8,AdaBoost (Discrete),2,0.85,0.9827586206896551,0.9821390252341226,41.73177671432495,0.9821390252341226
213,8,AdaBoost (Real),2,0.85,0.9827586206896551,0.9821390252341226,77.81692719459534,0.9821390252341226
214,8,Logistic Regression (Penalty = L2),2,0.85,0.9827586206896551,0.9821390252341226,0.17494606971740723,0.9821390252341226
215,8,Naive Bayes,2,0.85,1.0,1.0,0.0019559860229492188,1.0
216,9,KNeighbors Classifier,0,0.85,0.85,0.8549879733383485,0.22751784324645996,0.8549879733383485
217,9,SVC Classifier,0,0.85,0.45,0.3872983346207417,0.22198867797851562,0.0
218,9,Decision Tree,0,0.85,0.8166666666666667,0.7909349965024441,0.22514677047729492,0.7909349965024441
219,9,RandomForest,0,0.85,0.8833333333333333,0.8914135402065606,1.300462245941162,0.8914135402065606
220,9,AdaBoost (Discrete),0,0.85,0.9333333333333333,0.9361090484023133,77.06598448753357,0.9361090484023133
221,9,AdaBoost (Real),0,0.85,0.9333333333333333,0.9410360288810286,89.05926752090454,0.9410360288810286
222,9,Logistic Regression (Penalty = L2),0,0.85,0.9333333333333333,0.9410360288810286,0.21902942657470703,0.9410360288810286
223,9,Naive Bayes,0,0.85,0.8833333333333333,0.8914135402065606,0.0019338130950927734,0.8914135402065606
224,9,KNeighbors Classifier,1,0.85,0.9666666666666667,0.9691999875015047,0.2386796474456787,0.9691999875015047
225,9,SVC Classifier,1,0.85,0.4,1.0,0.0016417503356933594,0.0
226,9,Decision Tree,1,0.85,0.8333333333333334,0.7984943468579762,0.0019450187683105469,0.7984943468579762
227,9,RandomForest,1,0.85,0.8833333333333333,0.8662391053409028,1.761868953704834,0.8662391053409028
228,9,AdaBoost (Discrete),1,0.85,0.8333333333333334,0.8018835824989566,76.94697093963623,0.8018835824989566
229,9,AdaBoost (Real),1,0.85,0.8166666666666667,0.7836526036203351,80.95335030555725,0.7836526036203351
230,9,Logistic Regression (Penalty = L2),1,0.85,0.95,0.9518891309816516,0.19508886337280273,0.9518891309816516
231,9,Naive Bayes,1,0.85,0.95,0.9472682371859096,0.22347378730773926,0.9472682371859096
232,9,KNeighbors Classifier,2,0.85,1.0,1.0,0.003611326217651367,1.0
233,9,SVC Classifier,2,0.85,0.39655172413793105,1.0,0.20250439643859863,0.0
234,9,Decision Tree,2,0.85,0.9655172413793104,0.967693705920519,0.0011336803436279297,0.967693705920519
235,9,RandomForest,2,0.85,1.0,1.0,1.3971517086029053,1.0
236,9,AdaBoost (Discrete),2,0.85,0.9827586206896551,0.9821390252341226,71.43865489959717,0.9821390252341226
237,9,AdaBoost (Real),2,0.85,0.9827586206896551,0.9821390252341226,83.2091314792633,0.9821390252341226
238,9,Logistic Regression (Penalty = L2),2,0.85,0.9827586206896551,0.9821390252341226,0.0027375221252441406,0.9821390252341226
239,9,Naive Bayes,2,0.85,1.0,1.0,0.18613409996032715,1.0
240,10,KNeighbors Classifier,0,0.85,0.9166666666666666,0.9210078746600967,0.16399574279785156,0.9210078746600967
241,10,SVC Classifier,0,0.85,0.45,0.3872983346207417,0.2184581756591797,0.0
242,10,Decision Tree,0,0.85,0.8,0.7937005259840998,0.0011012554168701172,0.7937005259840998
243,10,RandomForest,0,0.85,0.85,0.8549879733383485,1.2028326988220215,0.8549879733383485
244,10,AdaBoost (Discrete),0,0.85,0.9333333333333333,0.9410360288810286,75.17745614051819,0.9410360288810286
245,10,AdaBoost (Real),0,0.85,0.9333333333333333,0.9410360288810286,78.9749972820282,0.9410360288810286
246,10,Logistic Regression (Penalty = L2),0,0.85,0.9333333333333333,0.9410360288810286,0.2222297191619873,0.9410360288810286
247,10,Naive Bayes,0,0.85,0.95,0.9564655913861946,0.0018672943115234375,0.9564655913861946
248,10,KNeighbors Classifier,1,0.85,0.95,0.9564655913861946,0.0023088455200195312,0.9564655913861946
249,10,SVC Classifier,1,0.85,0.4,1.0,0.0017552375793457031,0.0
250,10,Decision Tree,1,0.85,0.8,0.7645314458836486,0.0011472702026367188,0.7645314458836486
251,10,RandomForest,1,0.85,0.85,0.8414757379333423,1.392965316772461,0.8414757379333423
252,10,AdaBoost (Discrete),1,0.85,0.8833333333333333,0.8662391053409028,55.812867879867554,0.8662391053409028
253,10,AdaBoost (Real),1,0.85,0.85,0.8358603846235818,39.97185039520264,0.8358603846235818
254,10,Logistic Regression (Penalty = L2),1,0.85,0.95,0.9518891309816516,0.10622906684875488,0.9518891309816516
255,10,Naive Bayes,1,0.85,0.9666666666666667,0.9654893846056297,0.001871347427368164,0.9654893846056297
256,10,KNeighbors Classifier,2,0.85,0.9655172413793104,0.9701312318500641,0.10772418975830078,0.9701312318500641
257,10,SVC Classifier,2,0.85,0.39655172413793105,1.0,0.10697770118713379,0.0
258,10,Decision Tree,2,0.85,0.9310344827586207,0.932525134875023,0.0012257099151611328,0.932525134875023
259,10,RandomForest,2,0.85,0.9827586206896551,0.9852919811325488,0.6460514068603516,0.9852919811325488
260,10,AdaBoost (Discrete),2,0.85,0.9655172413793104,0.967693705920519,36.242148876190186,0.967693705920519
261,10,AdaBoost (Real),2,0.85,0.9482758620689655,0.9470981939677545,43.68084478378296,0.9470981939677545
262,10,Logistic Regression (Penalty = L2),2,0.85,1.0,1.0,0.0030596256256103516,1.0
263,10,Naive Bayes,2,0.85,0.9655172413793104,0.967693705920519,0.12304806709289551,0.967693705920519
264,11,KNeighbors Classifier,0,0.85,0.9166666666666666,0.9210078746600967,0.12029600143432617,0.9210078746600967
265,11,SVC Classifier,0,0.85,0.45,0.3872983346207417,0.0018033981323242188,0.0
266,11,Decision Tree,0,0.85,0.9166666666666666,0.9133720110188648,0.11728715896606445,0.9133720110188648
267,11,RandomForest,0,0.85,0.85,0.8549879733383485,0.6070141792297363,0.8549879733383485
268,11,AdaBoost (Discrete),0,0.85,0.9166666666666666,0.9210078746600967,38.94396710395813,0.9210078746600967
269,11,AdaBoost (Real),0,0.85,0.9333333333333333,0.9410360288810286,42.56005573272705,0.9410360288810286
270,11,Logistic Regression (Penalty = L2),0,0.85,0.9333333333333333,0.9410360288810286,0.11407327651977539,0.9410360288810286
271,11,Naive Bayes,0,0.85,0.95,0.9564655913861946,0.11433029174804688,0.9564655913861946
272,11,KNeighbors Classifier,1,0.85,0.95,0.9564655913861946,0.11466217041015625,0.9564655913861946
273,11,SVC Classifier,1,0.85,0.4,1.0,0.0018589496612548828,0.0
274,11,Decision Tree,1,0.85,0.8833333333333333,0.8648486709999246,0.10984468460083008,0.8648486709999246
275,11,RandomForest,1,0.85,0.85,0.8414757379333423,0.6922872066497803,0.8414757379333423
276,11,AdaBoost (Discrete),1,0.85,0.8833333333333333,0.8662391053409028,39.441888093948364,0.8662391053409028
277,11,AdaBoost (Real),1,0.85,0.85,0.8358603846235818,43.26536822319031,0.8358603846235818
278,11,Logistic Regression (Penalty = L2),1,0.85,0.95,0.9518891309816516,0.11188983917236328,0.9518891309816516
279,11,Naive Bayes,1,0.85,0.9666666666666667,0.9654893846056297,0.11009764671325684,0.9654893846056297
280,11,KNeighbors Classifier,2,0.85,0.9655172413793104,0.9701312318500641,0.002544879913330078,0.9701312318500641
281,11,SVC Classifier,2,0.85,0.39655172413793105,1.0,0.0018033981323242188,0.0
282,11,Decision Tree,2,0.85,0.9655172413793104,0.967693705920519,0.10933566093444824,0.967693705920519
283,11,RandomForest,2,0.85,0.9827586206896551,0.9852919811325488,0.5610616207122803,0.9852919811325488
284,11,AdaBoost (Discrete),2,0.85,0.9655172413793104,0.967693705920519,37.38699221611023,0.967693705920519
285,11,AdaBoost (Real),2,0.85,0.9655172413793104,0.967693705920519,40.64222717285156,0.967693705920519
286,11,Logistic Regression (Penalty = L2),2,0.85,1.0,1.0,0.10330390930175781,1.0
287,11,Naive Bayes,2,0.85,0.9655172413793104,0.967693705920519,0.10314249992370605,0.967693705920519
288,12,KNeighbors Classifier,0,0.85,0.8833333333333333,0.8892233261225158,0.10276365280151367,0.8892233261225158
289,12,SVC Classifier,0,0.85,0.45,0.3872983346207417,0.10634493827819824,0.0
290,12,Decision Tree,0,0.85,0.8,0.8039034489224531,0.0011258125305175781,0.8039034489224531
291,12,RandomForest,0,0.85,0.8666666666666667,0.8724415058636109,0.6193299293518066,0.8724415058636109
292,12,AdaBoost (Discrete),0,0.85,0.9333333333333333,0.9361090484023133,34.9574921131134,0.9361090484023133
293,12,AdaBoost (Real),0,0.85,0.9,0.900068581879409,39.901097536087036,0.900068581879409
294,12,Logistic Regression (Penalty = L2),0,0.85,0.9166666666666666,0.9250831838185912,0.09413409233093262,0.9250831838185912
295,12,Naive Bayes,0,0.85,0.9,0.9085602964160698,0.1072385311126709,0.9085602964160698
296,12,KNeighbors Classifier,1,0.85,0.9166666666666666,0.9234573752239167,0.10702991485595703,0.9234573752239167
297,12,SVC Classifier,1,0.85,0.4,1.0,0.10686349868774414,0.0
298,12,Decision Tree,1,0.85,0.8,0.7759440455456199,0.0010821819305419922,0.7759440455456199
299,12,RandomForest,1,0.85,0.9333333333333333,0.927006439217119,0.5812854766845703,0.927006439217119
300,12,AdaBoost (Discrete),1,0.85,0.8333333333333334,0.8018835824989566,35.93231821060181,0.8018835824989566
301,12,AdaBoost (Real),1,0.85,0.8833333333333333,0.8662391053409028,40.77437138557434,0.8662391053409028
302,12,Logistic Regression (Penalty = L2),1,0.85,0.95,0.9518891309816516,0.0017902851104736328,0.9518891309816516
303,12,Naive Bayes,1,0.85,0.95,0.9472682371859096,0.0026128292083740234,0.9472682371859096
304,12,KNeighbors Classifier,2,0.85,1.0,1.0,0.10811018943786621,1.0
305,12,SVC Classifier,2,0.85,0.39655172413793105,1.0,0.0028333663940429688,0.0
306,12,Decision Tree,2,0.85,0.9137931034482759,0.910634642192611,0.0019741058349609375,0.910634642192611
307,12,RandomForest,2,0.85,0.9827586206896551,0.9821390252341226,0.41825079917907715,0.9821390252341226
308,12,AdaBoost (Discrete),2,0.85,0.9827586206896551,0.9821390252341226,34.96169447898865,0.9821390252341226
309,12,AdaBoost (Real),2,0.85,0.9827586206896551,0.9821390252341226,39.71169328689575,0.9821390252341226
310,12,Logistic Regression (Penalty = L2),2,0.85,0.9827586206896551,0.9821390252341226,0.002804994583129883,0.9821390252341226
311,12,Naive Bayes,2,0.85,1.0,1.0,0.11531662940979004,1.0
