,feat_set_id,classifier,fold_id,feat_th,score,geo_score,exec_t,geo_score_woz
0,0,KNeighbors Classifier,0,0.85,0.6481802426343154,0.2557546102929198,0.8877902030944824,0.0
1,0,SVC Classifier,0,0.85,0.6845753899480069,0.8129520829107402,0.9539706707000732,0.0
2,0,Decision Tree,0,0.85,0.6759098786828422,0.6654020293774563,0.06815433502197266,0.0
3,0,RandomForest,0,0.85,0.7001733102253033,1.0,0.4763360023498535,0.0
4,0,AdaBoost (Discrete),0,0.85,0.7435008665511266,0.6435796172152621,33.28459334373474,0.0
5,0,AdaBoost (Real),0,0.85,0.729636048526863,0.6243978599139907,44.7594678401947,0.0
6,0,Logistic Regression (Penalty = L2),0,0.85,0.682842287694974,0.7126774791982946,0.48162174224853516,0.0
7,0,Naive Bayes,0,0.85,0.6672443674176777,0.7914018355435688,0.07407999038696289,0.0
8,0,KNeighbors Classifier,1,0.85,0.7065972222222222,0.49696089627599066,0.7698013782501221,0.0
9,0,SVC Classifier,1,0.85,0.7274305555555556,0.7636780043269571,0.8762123584747314,0.0
10,0,Decision Tree,1,0.85,0.4913194444444444,0.3005866416905618,0.0792851448059082,0.0
11,0,RandomForest,1,0.85,0.6996527777777778,1.0,0.7149691581726074,0.0
12,0,AdaBoost (Discrete),1,0.85,0.7760416666666666,0.4346339788425723,39.31494212150574,0.0
13,0,AdaBoost (Real),1,0.85,0.8055555555555556,0.6307647710088047,47.519455671310425,0.0
14,0,Logistic Regression (Penalty = L2),1,0.85,0.7482638888888888,0.6405670164591764,0.36808013916015625,0.0
15,0,Naive Bayes,1,0.85,0.7829861111111112,0.6820345298093242,0.1664261817932129,0.0
16,0,KNeighbors Classifier,2,0.85,0.8243478260869566,0.744967930540508,1.1032161712646484,0.744967930540508
17,0,SVC Classifier,2,0.85,0.7391304347826086,0.6028970073643041,1.216583251953125,0.0
18,0,Decision Tree,2,0.85,0.7565217391304347,0.44109832781197045,0.08287549018859863,0.44109832781197045
19,0,RandomForest,2,0.85,0.7008695652173913,0.08827861657230812,0.6498003005981445,0.0
20,0,AdaBoost (Discrete),2,0.85,0.3269565217391304,0.4816288643904625,44.90510296821594,0.4816288643904625
21,0,AdaBoost (Real),2,0.85,0.42086956521739133,0.511101213296294,61.77874517440796,0.511101213296294
22,0,Logistic Regression (Penalty = L2),2,0.85,0.5843478260869566,0.5204195017249367,0.566758394241333,0.5204195017249367
23,0,Naive Bayes,2,0.85,0.5478260869565217,0.8392974277582299,0.10446596145629883,0.0
24,1,KNeighbors Classifier,0,0.85,0.6204506065857885,0.30910670138582563,1.347719669342041,0.0
25,1,SVC Classifier,0,0.85,0.6845753899480069,0.8129520829107402,1.1645305156707764,0.0
26,1,Decision Tree,0,0.85,0.6481802426343154,0.5008237247182071,0.10327792167663574,0.0
27,1,RandomForest,0,0.85,0.7001733102253033,1.0,0.7247817516326904,0.0
28,1,AdaBoost (Discrete),0,0.85,0.75736568457539,0.6392919072514045,48.626468896865845,0.0
29,1,AdaBoost (Real),0,0.85,0.7209705372616985,0.587723421417095,54.51971673965454,0.0
30,1,Logistic Regression (Penalty = L2),0,0.85,0.6776429809358753,0.7209461175812277,0.5064094066619873,0.0
31,1,Naive Bayes,0,0.85,0.6672443674176777,0.7914018355435688,0.19034838676452637,0.0
32,1,KNeighbors Classifier,1,0.85,0.6163194444444444,0.4686567518017323,1.064436674118042,0.0
33,1,SVC Classifier,1,0.85,0.7274305555555556,0.7636780043269571,1.1564741134643555,0.0
34,1,Decision Tree,1,0.85,0.7430555555555556,0.6331037368487075,0.0874931812286377,0.0
35,1,RandomForest,1,0.85,0.6996527777777778,1.0,0.8027935028076172,0.0
36,1,AdaBoost (Discrete),1,0.85,0.765625,0.5590077953316137,51.16315269470215,0.0
37,1,AdaBoost (Real),1,0.85,0.7760416666666666,0.6233190412195173,63.53368663787842,0.0
38,1,Logistic Regression (Penalty = L2),1,0.85,0.7586805555555556,0.5355979162087265,0.3919801712036133,0.0
39,1,Naive Bayes,1,0.85,0.7829861111111112,0.6820345298093242,0.10988211631774902,0.0
40,1,KNeighbors Classifier,2,0.85,0.7947826086956522,0.43747347319525226,1.3146827220916748,0.43747347319525226
41,1,SVC Classifier,2,0.85,0.7460869565217392,0.5954229891263427,1.3336024284362793,0.0
42,1,Decision Tree,2,0.85,0.29391304347826086,0.2814066255441347,0.10671353340148926,0.0
43,1,RandomForest,2,0.85,0.6991304347826087,0.9975186104218362,0.8968210220336914,0.0
44,1,AdaBoost (Discrete),2,0.85,0.3408695652173913,0.4506757103738038,53.890631914138794,0.4506757103738038
45,1,AdaBoost (Real),2,0.85,0.3408695652173913,0.4810133629869482,65.47406530380249,0.4810133629869482
46,1,Logistic Regression (Penalty = L2),2,0.85,0.5843478260869566,0.4930780719363449,0.5832457542419434,0.4930780719363449
47,1,Naive Bayes,2,0.85,0.5478260869565217,0.8392974277582299,0.3139348030090332,0.0
48,2,KNeighbors Classifier,0,0.85,0.6568457538994801,0.635797814864237,1.640401840209961,0.0
49,2,SVC Classifier,0,0.85,0.6845753899480069,0.8129520829107402,1.3920674324035645,0.0
50,2,Decision Tree,0,0.85,0.6325823223570191,0.4524081805497754,0.1030585765838623,0.4524081805497754
51,2,RandomForest,0,0.85,0.7001733102253033,1.0,0.6518111228942871,0.0
52,2,AdaBoost (Discrete),0,0.85,0.7521663778162911,0.6944144468157013,55.35271215438843,0.0
53,2,AdaBoost (Real),0,0.85,0.7383015597920277,0.6306125149226676,65.06636595726013,0.0
54,2,Logistic Regression (Penalty = L2),0,0.85,0.6863084922010398,0.7210131717325844,0.36696958541870117,0.0
55,2,Naive Bayes,0,0.85,0.6672443674176777,0.7914018355435688,0.22588515281677246,0.0
56,2,KNeighbors Classifier,1,0.85,0.6961805555555556,0.3630128918050201,1.5457127094268799,0.0
57,2,SVC Classifier,1,0.85,0.7274305555555556,0.7636780043269571,1.4502220153808594,0.0
58,2,Decision Tree,1,0.85,0.4965277777777778,0.566234312864157,0.12302827835083008,0.0
59,2,RandomForest,1,0.85,0.6996527777777778,1.0,0.7244381904602051,0.0
60,2,AdaBoost (Discrete),1,0.85,0.7517361111111112,0.43129654708987847,54.10538721084595,0.0
61,2,AdaBoost (Real),1,0.85,0.7569444444444444,0.5746095133749713,59.936161041259766,0.0
62,2,Logistic Regression (Penalty = L2),1,0.85,0.7482638888888888,0.6268843050507011,0.4194321632385254,0.0
63,2,Naive Bayes,1,0.85,0.7829861111111112,0.6820345298093242,0.21825838088989258,0.0
64,2,KNeighbors Classifier,2,0.85,0.8330434782608696,0.7552608308349611,1.5219612121582031,0.7552608308349611
65,2,SVC Classifier,2,0.85,0.7356521739130435,0.6012871326420459,1.419919729232788,0.0
66,2,Decision Tree,2,0.85,0.5930434782608696,0.48551328267446486,0.0021216869354248047,0.48551328267446486
67,2,RandomForest,2,0.85,0.7008695652173913,1.0,0.6537837982177734,0.0
68,2,AdaBoost (Discrete),2,0.85,0.36,0.49713216183188524,59.64248824119568,0.49713216183188524
69,2,AdaBoost (Real),2,0.85,0.5095652173913043,0.5866533413844934,72.50470352172852,0.5866533413844934
70,2,Logistic Regression (Penalty = L2),2,0.85,0.6052173913043478,0.52602626583304,0.568488597869873,0.52602626583304
71,2,Naive Bayes,2,0.85,0.5478260869565217,0.8392974277582299,0.12199234962463379,0.0
72,3,KNeighbors Classifier,0,0.85,0.6412478336221837,0.5317673138783903,1.1430842876434326,0.0
73,3,SVC Classifier,0,0.85,0.6845753899480069,0.8129520829107402,1.2564826011657715,0.0
74,3,Decision Tree,0,0.85,0.6481802426343154,0.654376206944733,0.002888917922973633,0.0
75,3,RandomForest,0,0.85,0.7001733102253033,1.0,1.049241304397583,0.0
76,3,AdaBoost (Discrete),0,0.85,0.7435008665511266,0.6235309029471434,63.85004234313965,0.0
77,3,AdaBoost (Real),0,0.85,0.7209705372616985,0.587723421417095,69.81457042694092,0.0
78,3,Logistic Regression (Penalty = L2),0,0.85,0.6741767764298093,0.7213751564454057,0.9668674468994141,0.0
79,3,Naive Bayes,0,0.85,0.6672443674176777,0.7914018355435688,0.05712175369262695,0.0
80,3,KNeighbors Classifier,1,0.85,0.5798611111111112,0.4289100916671341,0.5593147277832031,0.0
81,3,SVC Classifier,1,0.85,0.7274305555555556,0.7636780043269571,0.8281440734863281,0.0
82,3,Decision Tree,1,0.85,0.7864583333333334,0.6367554760767903,0.0031719207763671875,0.0
83,3,RandomForest,1,0.85,0.6996527777777778,0.2148885971408009,0.8441987037658691,0.0
84,3,AdaBoost (Discrete),1,0.85,0.7864583333333334,0.3832603266531163,52.4925434589386,0.0
85,3,AdaBoost (Real),1,0.85,0.7465277777777778,0.5900726018390628,62.84540104866028,0.0
86,3,Logistic Regression (Penalty = L2),1,0.85,0.7604166666666666,0.5555347616516378,0.4677560329437256,0.0
87,3,Naive Bayes,1,0.85,0.7829861111111112,0.6820345298093242,0.12828540802001953,0.0
88,3,KNeighbors Classifier,2,0.85,0.7930434782608695,0.49624985883569067,1.1707584857940674,0.0
89,3,SVC Classifier,2,0.85,0.76,0.6431303330664584,1.3026838302612305,0.0
90,3,Decision Tree,2,0.85,0.7878260869565218,0.5796643446996921,0.0027985572814941406,0.5796643446996921
91,3,RandomForest,2,0.85,0.7060869565217391,0.15309310892394862,0.9615304470062256,0.0
92,3,AdaBoost (Discrete),2,0.85,0.3582608695652174,0.4782634801856082,57.699782609939575,0.4782634801856082
93,3,AdaBoost (Real),2,0.85,0.24521739130434783,0.3651269580627894,69.35415410995483,0.0
94,3,Logistic Regression (Penalty = L2),2,0.85,0.5878260869565217,0.4939689121928252,0.5287473201751709,0.4939689121928252
95,3,Naive Bayes,2,0.85,0.5478260869565217,0.8392974277582299,0.13583898544311523,0.0
96,4,KNeighbors Classifier,0,0.85,0.6481802426343154,0.2557546102929198,1.6840388774871826,0.0
97,4,SVC Classifier,0,0.85,0.6845753899480069,0.8129520829107402,1.5707123279571533,0.0
98,4,Decision Tree,0,0.85,0.7140381282495667,0.4305377027005733,0.002136707305908203,0.0
99,4,RandomForest,0,0.85,0.7001733102253033,1.0,0.9134879112243652,0.0
100,4,AdaBoost (Discrete),0,0.85,0.7435008665511266,0.6435796172152621,64.590660572052,0.0
101,4,AdaBoost (Real),0,0.85,0.7313691507798961,0.6220896794104745,81.29835796356201,0.0
102,4,Logistic Regression (Penalty = L2),0,0.85,0.682842287694974,0.7126774791982946,0.637772798538208,0.0
103,4,Naive Bayes,0,0.85,0.6672443674176777,0.7914018355435688,0.28627896308898926,0.0
104,4,KNeighbors Classifier,1,0.85,0.7065972222222222,0.49696089627599066,1.9968235492706299,0.0
105,4,SVC Classifier,1,0.85,0.7274305555555556,0.7636780043269571,1.8952305316925049,0.0
106,4,Decision Tree,1,0.85,0.5972222222222222,0.3458739065062645,0.14335322380065918,0.0
107,4,RandomForest,1,0.85,0.6996527777777778,1.0,0.9984555244445801,0.0
108,4,AdaBoost (Discrete),1,0.85,0.7760416666666666,0.4346339788425723,72.6689305305481,0.0
109,4,AdaBoost (Real),1,0.85,0.765625,0.6109670768887138,86.20722436904907,0.0
110,4,Logistic Regression (Penalty = L2),1,0.85,0.7482638888888888,0.6405670164591764,0.5844767093658447,0.0
111,4,Naive Bayes,1,0.85,0.7829861111111112,0.6820345298093242,0.12444543838500977,0.0
112,4,KNeighbors Classifier,2,0.85,0.8243478260869566,0.744967930540508,1.5058164596557617,0.744967930540508
113,4,SVC Classifier,2,0.85,0.7391304347826086,0.6028970073643041,1.6186611652374268,0.0
114,4,Decision Tree,2,0.85,0.27304347826086955,0.3358595335804309,0.13487720489501953,0.0
115,4,RandomForest,2,0.85,0.7008695652173913,0.08827861657230812,0.9783694744110107,0.0
116,4,AdaBoost (Discrete),2,0.85,0.33217391304347826,0.4892806033902662,60.041566610336304,0.4892806033902662
117,4,AdaBoost (Real),2,0.85,0.5391304347826087,0.6222471678445516,62.93708300590515,0.6222471678445516
118,4,Logistic Regression (Penalty = L2),2,0.85,0.5843478260869566,0.5204195017249367,0.6536397933959961,0.5204195017249367
119,4,Naive Bayes,2,0.85,0.5478260869565217,0.8392974277582299,0.15775299072265625,0.0
120,5,KNeighbors Classifier,0,0.85,0.6204506065857885,0.30910670138582563,1.599369764328003,0.0
121,5,SVC Classifier,0,0.85,0.6845753899480069,0.8129520829107402,1.687650442123413,0.0
122,5,Decision Tree,0,0.85,0.7469670710571924,0.6060411237498415,0.18790245056152344,0.0
123,5,RandomForest,0,0.85,0.7001733102253033,1.0,0.9910237789154053,0.0
124,5,AdaBoost (Discrete),0,0.85,0.75736568457539,0.6392919072514045,63.36935043334961,0.0
125,5,AdaBoost (Real),0,0.85,0.7001733102253033,0.5804891672351155,71.60761952400208,0.0
126,5,Logistic Regression (Penalty = L2),0,0.85,0.6776429809358753,0.7209461175812277,0.4846172332763672,0.0
127,5,Naive Bayes,0,0.85,0.6672443674176777,0.7914018355435688,0.26656007766723633,0.0
128,5,KNeighbors Classifier,1,0.85,0.6163194444444444,0.4686567518017323,1.61147141456604,0.0
129,5,SVC Classifier,1,0.85,0.7274305555555556,0.7636780043269571,2.0123257637023926,0.0
130,5,Decision Tree,1,0.85,0.7586805555555556,0.39312331338797796,0.1549069881439209,0.39312331338797796
131,5,RandomForest,1,0.85,0.6996527777777778,1.0,1.2736060619354248,0.0
132,5,AdaBoost (Discrete),1,0.85,0.765625,0.5590077953316137,67.9004864692688,0.0
133,5,AdaBoost (Real),1,0.85,0.765625,0.5981608974074037,70.66400694847107,0.0
134,5,Logistic Regression (Penalty = L2),1,0.85,0.7586805555555556,0.5355979162087265,0.5381350517272949,0.0
135,5,Naive Bayes,1,0.85,0.7829861111111112,0.6820345298093242,0.12582969665527344,0.0
136,5,KNeighbors Classifier,2,0.85,0.7947826086956522,0.43747347319525226,1.7071690559387207,0.43747347319525226
137,5,SVC Classifier,2,0.85,0.7460869565217392,0.5954229891263427,1.6346580982208252,0.0
138,5,Decision Tree,2,0.85,0.6017391304347826,0.5305235824789732,0.12696170806884766,0.5305235824789732
139,5,RandomForest,2,0.85,0.6991304347826087,0.9975186104218362,1.0110540390014648,0.0
140,5,AdaBoost (Discrete),2,0.85,0.3617391304347826,0.46051442906577744,63.67868614196777,0.46051442906577744
141,5,AdaBoost (Real),2,0.85,0.3060869565217391,0.4507125378070324,73.67494988441467,0.4507125378070324
142,5,Logistic Regression (Penalty = L2),2,0.85,0.5843478260869566,0.4930780719363449,0.5576038360595703,0.4930780719363449
143,5,Naive Bayes,2,0.85,0.5478260869565217,0.8392974277582299,0.11761593818664551,0.0
144,6,KNeighbors Classifier,0,0.85,0.6568457538994801,0.635797814864237,1.9106559753417969,0.0
145,6,SVC Classifier,0,0.85,0.6845753899480069,0.8129520829107402,1.4975543022155762,0.0
146,6,Decision Tree,0,0.85,0.6793760831889082,0.39963875261330783,0.11872673034667969,0.39963875261330783
147,6,RandomForest,0,0.85,0.7001733102253033,1.0,0.7431409358978271,0.0
148,6,AdaBoost (Discrete),0,0.85,0.7521663778162911,0.6944144468157013,57.45557260513306,0.0
149,6,AdaBoost (Real),0,0.85,0.733102253032929,0.6257207406902986,67.17960405349731,0.0
150,6,Logistic Regression (Penalty = L2),0,0.85,0.6863084922010398,0.7210131717325844,0.5734612941741943,0.0
151,6,Naive Bayes,0,0.85,0.6672443674176777,0.7914018355435688,0.12620949745178223,0.0
152,6,KNeighbors Classifier,1,0.85,0.6961805555555556,0.3630128918050201,1.7886264324188232,0.0
153,6,SVC Classifier,1,0.85,0.7274305555555556,0.7636780043269571,1.5598094463348389,0.0
154,6,Decision Tree,1,0.85,0.6909722222222222,0.315826276118125,0.12012410163879395,0.315826276118125
155,6,RandomForest,1,0.85,0.6996527777777778,1.0,1.0767550468444824,0.0
156,6,AdaBoost (Discrete),1,0.85,0.7465277777777778,0.4300280205073117,60.79508423805237,0.0
157,6,AdaBoost (Real),1,0.85,0.7795138888888888,0.641392025085126,70.88873553276062,0.0
158,6,Logistic Regression (Penalty = L2),1,0.85,0.7482638888888888,0.6268843050507011,0.45984625816345215,0.0
159,6,Naive Bayes,1,0.85,0.7829861111111112,0.6820345298093242,0.13817977905273438,0.0
160,6,KNeighbors Classifier,2,0.85,0.8330434782608696,0.7552608308349611,2.0394914150238037,0.7552608308349611
161,6,SVC Classifier,2,0.85,0.7356521739130435,0.6012871326420459,1.5549068450927734,0.0
162,6,Decision Tree,2,0.85,0.8121739130434783,0.6086013031155034,0.1194148063659668,0.6086013031155034
163,6,RandomForest,2,0.85,0.7008695652173913,1.0,0.8559482097625732,0.0
164,6,AdaBoost (Discrete),2,0.85,0.36695652173913046,0.5069862051798951,60.84398293495178,0.5069862051798951
165,6,AdaBoost (Real),2,0.85,0.5460869565217391,0.6060710726831237,70.50667309761047,0.6060710726831237
166,6,Logistic Regression (Penalty = L2),2,0.85,0.6052173913043478,0.52602626583304,0.5421907901763916,0.52602626583304
167,6,Naive Bayes,2,0.85,0.5478260869565217,0.8392974277582299,0.23839473724365234,0.0
168,7,KNeighbors Classifier,0,0.85,0.6568457538994801,0.635797814864237,1.8096740245819092,0.0
169,7,SVC Classifier,0,0.85,0.6845753899480069,0.8129520829107402,1.6113758087158203,0.0
170,7,Decision Tree,0,0.85,0.6880415944540728,0.42779935882138503,0.1313304901123047,0.42779935882138503
171,7,RandomForest,0,0.85,0.7001733102253033,1.0,0.6027243137359619,0.0
172,7,AdaBoost (Discrete),0,0.85,0.7521663778162911,0.6944144468157013,64.47791051864624,0.0
173,7,AdaBoost (Real),0,0.85,0.733102253032929,0.6227431354364964,93.84802412986755,0.0
174,7,Logistic Regression (Penalty = L2),0,0.85,0.6863084922010398,0.7210131717325844,0.7065849304199219,0.0
175,7,Naive Bayes,0,0.85,0.6672443674176777,0.7914018355435688,0.3225569725036621,0.0
176,7,KNeighbors Classifier,1,0.85,0.6961805555555556,0.3630128918050201,2.7362000942230225,0.0
177,7,SVC Classifier,1,0.85,0.7274305555555556,0.7636780043269571,2.1212260723114014,0.0
178,7,Decision Tree,1,0.85,0.8107638888888888,0.5283713398002663,0.179534912109375,0.0
179,7,RandomForest,1,0.85,0.6996527777777778,1.0,1.2213633060455322,0.0
180,7,AdaBoost (Discrete),1,0.85,0.7482638888888888,0.43045169370794734,70.81295204162598,0.0
181,7,AdaBoost (Real),1,0.85,0.7708333333333334,0.5895609442641179,72.97188019752502,0.0
182,7,Logistic Regression (Penalty = L2),1,0.85,0.7482638888888888,0.6268843050507011,0.48472046852111816,0.0
183,7,Naive Bayes,1,0.85,0.7829861111111112,0.6820345298093242,0.1334676742553711,0.0
184,7,KNeighbors Classifier,2,0.85,0.8330434782608696,0.7552608308349611,2.0431675910949707,0.7552608308349611
185,7,SVC Classifier,2,0.85,0.7356521739130435,0.6012871326420459,1.7082884311676025,0.0
186,7,Decision Tree,2,0.85,0.5165217391304348,0.49007057220672723,0.1274247169494629,0.0
187,7,RandomForest,2,0.85,0.7008695652173913,1.0,1.0422449111938477,0.0
188,7,AdaBoost (Discrete),2,0.85,0.3652173913043478,0.49979308913426346,64.09217739105225,0.49979308913426346
189,7,AdaBoost (Real),2,0.85,0.5704347826086956,0.5929134378210238,76.85429000854492,0.5929134378210238
190,7,Logistic Regression (Penalty = L2),2,0.85,0.6052173913043478,0.52602626583304,0.569852352142334,0.52602626583304
191,7,Naive Bayes,2,0.85,0.5478260869565217,0.8392974277582299,0.2378089427947998,0.0
192,8,KNeighbors Classifier,0,0.85,0.6412478336221837,0.5317673138783903,1.360954761505127,0.0
193,8,SVC Classifier,0,0.85,0.6845753899480069,0.8129520829107402,1.4551160335540771,0.0
194,8,Decision Tree,0,0.85,0.7105719237435009,0.6017533285035538,0.0019278526306152344,0.0
195,8,RandomForest,0,0.85,0.7001733102253033,1.0,0.8984336853027344,0.0
196,8,AdaBoost (Discrete),0,0.85,0.7504332755632582,0.626070771729737,64.80195379257202,0.0
197,8,AdaBoost (Real),0,0.85,0.7209705372616985,0.587723421417095,79.2317943572998,0.0
198,8,Logistic Regression (Penalty = L2),0,0.85,0.6741767764298093,0.7213751564454057,0.7876710891723633,0.0
199,8,Naive Bayes,0,0.85,0.6672443674176777,0.7914018355435688,0.14061832427978516,0.0
200,8,KNeighbors Classifier,1,0.85,0.5798611111111112,0.4289100916671341,1.5776422023773193,0.0
201,8,SVC Classifier,1,0.85,0.7274305555555556,0.7636780043269571,1.5938944816589355,0.0
202,8,Decision Tree,1,0.85,0.7430555555555556,0.5263943958820321,0.13473773002624512,0.0
203,8,RandomForest,1,0.85,0.6996527777777778,0.2148885971408009,1.1388227939605713,0.0
204,8,AdaBoost (Discrete),1,0.85,0.7864583333333334,0.3832603266531163,67.06112241744995,0.0
205,8,AdaBoost (Real),1,0.85,0.7465277777777778,0.5900726018390628,75.05120944976807,0.0
206,8,Logistic Regression (Penalty = L2),1,0.85,0.7604166666666666,0.5555347616516378,0.5768237113952637,0.0
207,8,Naive Bayes,1,0.85,0.7829861111111112,0.6820345298093242,0.24534010887145996,0.0
208,8,KNeighbors Classifier,2,0.85,0.7930434782608695,0.49624985883569067,1.3115198612213135,0.0
209,8,SVC Classifier,2,0.85,0.76,0.6431303330664584,1.4505553245544434,0.0
210,8,Decision Tree,2,0.85,0.76,0.5343613467184225,0.13057422637939453,0.5343613467184225
211,8,RandomForest,2,0.85,0.7060869565217391,0.15309310892394862,1.0537917613983154,0.0
212,8,AdaBoost (Discrete),2,0.85,0.3582608695652174,0.4782634801856082,65.89784216880798,0.4782634801856082
213,8,AdaBoost (Real),2,0.85,0.3373913043478261,0.46782235598037986,79.51882576942444,0.46782235598037986
214,8,Logistic Regression (Penalty = L2),2,0.85,0.5878260869565217,0.4939689121928252,0.44377756118774414,0.4939689121928252
215,8,Naive Bayes,2,0.85,0.5478260869565217,0.8392974277582299,0.16129398345947266,0.0
