,feat_set_id,classifier,fold_id,feat_th,score,geo_score,exec_t,geo_score_woz
0,0,KNeighbors Classifier,0,0.65,0.7388535031847133,0.8506249596566804,15.272096157073975,0.0
1,0,SVC Classifier,0,0.65,0.692144373673036,0.6735857567000605,30.01095199584961,0.0
2,0,Decision Tree,0,0.65,0.7346072186836518,0.8409215286662929,0.2679293155670166,0.0
3,0,RandomForest,0,0.65,0.5429936305732485,0.5514511030090963,0.9330179691314697,0.0
4,0,AdaBoost (Discrete),0,0.65,0.7802547770700637,0.7935637354330883,110.36422610282898,0.0
5,0,AdaBoost (Real),0,0.65,0.31475583864118895,0.36003689309827996,164.09191012382507,0.0
6,0,Logistic Regression (Penalty = L2),0,0.65,0.7367303609341825,0.8741540685835897,2.3102364540100098,0.0
7,0,Naive Bayes,0,0.65,0.7032908704883227,0.7676217005470146,0.5322589874267578,0.7676217005470146
8,0,KNeighbors Classifier,1,0.65,0.8128654970760234,0.4841123056819556,16.20357322692871,0.4841123056819556
9,0,SVC Classifier,1,0.65,0.7682083997873471,0.6177320829257733,30.430272579193115,0.0
10,0,Decision Tree,1,0.65,0.7607655502392344,0.27637848725848546,0.2218151092529297,0.0
11,0,RandomForest,1,0.65,0.7698032961190856,0.9975777114203086,0.8987994194030762,0.0
12,0,AdaBoost (Discrete),1,0.65,0.7963849016480595,0.8209152583812477,104.24984836578369,0.0
13,0,AdaBoost (Real),1,0.65,0.7804359383306751,0.9822786963053242,155.10810923576355,0.0
14,0,Logistic Regression (Penalty = L2),1,0.65,0.7676767676767676,0.6396859802836975,2.326430559158325,0.0
15,0,Naive Bayes,1,0.65,0.8793195108984583,0.9450934259848028,0.47682976722717285,0.9450934259848028
16,0,KNeighbors Classifier,2,0.65,0.41245343267695583,0.33106200411743414,14.668210744857788,0.33106200411743414
17,0,SVC Classifier,2,0.65,0.3469930814262906,0.3267273117482309,13.052603483200073,0.0
18,0,Decision Tree,2,0.65,0.3927621075039915,0.37413412726404527,0.23732924461364746,0.0
19,0,RandomForest,2,0.65,0.292176689728579,0.2570933814605736,0.921459436416626,0.0
20,0,AdaBoost (Discrete),2,0.65,0.4635444385311336,0.40081868520958497,91.89179587364197,0.40081868520958497
21,0,AdaBoost (Real),2,0.65,0.3677488025545503,0.784611766697512,117.4956591129303,0.0
22,0,Logistic Regression (Penalty = L2),2,0.65,0.3746673762639702,0.36809366911334873,2.0472970008850098,0.0
23,0,Naive Bayes,2,0.65,0.37360298030867484,0.40828021205743065,0.45979738235473633,0.40828021205743065
24,1,KNeighbors Classifier,0,0.65,0.7383227176220807,0.36989155087962566,16.50009036064148,0.36989155087962566
25,1,SVC Classifier,0,0.65,0.7011677282377919,0.7493364174536107,27.474007606506348,0.0
26,1,Decision Tree,0,0.65,0.7011677282377919,0.8447036716395123,0.17160606384277344,0.0
27,1,RandomForest,0,0.65,0.5981953290870489,0.6909553927994988,0.9257056713104248,0.0
28,1,AdaBoost (Discrete),0,0.65,0.8126326963906582,0.972691953891529,100.88992047309875,0.0
29,1,AdaBoost (Real),0,0.65,0.3211252653927813,0.31169803187753203,134.80610418319702,0.0
30,1,Logistic Regression (Penalty = L2),0,0.65,0.7367303609341825,0.3727721645770899,2.5627782344818115,0.3727721645770899
31,1,Naive Bayes,0,0.65,0.6693205944798302,0.7548839886255256,0.4763455390930176,0.7548839886255256
32,1,KNeighbors Classifier,1,0.65,0.7878787878787878,0.2734868075799518,15.827538251876831,0.2734868075799518
33,1,SVC Classifier,1,0.65,0.7682083997873471,0.6177320829257733,29.805073261260986,0.0
34,1,Decision Tree,1,0.65,0.7650186071238703,0.6162174035687353,0.24042963981628418,0.0
35,1,RandomForest,1,0.65,0.748006379585327,0.9726571217443227,0.8732571601867676,0.0
36,1,AdaBoost (Discrete),1,0.65,0.7713981924508241,0.6192357015520555,101.39596223831177,0.0
37,1,AdaBoost (Real),1,0.65,0.7804359383306751,0.9822786963053242,131.13449883460999,0.0
38,1,Logistic Regression (Penalty = L2),1,0.65,0.7666135034556087,0.6169761377004175,2.5311410427093506,0.0
39,1,Naive Bayes,1,0.65,0.8543328017012227,0.9341766402374898,0.5086789131164551,0.9341766402374898
40,1,KNeighbors Classifier,2,0.65,0.3815859499733901,0.28377168586112905,16.177348375320435,0.28377168586112905
41,1,SVC Classifier,2,0.65,0.3602980308674827,0.34887734178065816,13.69114375114441,0.0
42,1,Decision Tree,2,0.65,0.37307078233102714,0.3343892167941951,0.2305154800415039,0.0
43,1,RandomForest,2,0.65,0.30175625332623734,0.18999722543518244,0.794461727142334,0.0
44,1,AdaBoost (Discrete),2,0.65,0.38690792974986693,0.33352914735572436,104.54583668708801,0.0
45,1,AdaBoost (Real),2,0.65,0.3677488025545503,0.784611766697512,145.77597880363464,0.0
46,1,Logistic Regression (Penalty = L2),2,0.65,0.3778605641298563,0.3715923199515945,2.3110127449035645,0.0
47,1,Naive Bayes,2,0.65,0.39648749334752525,0.3716162081238925,0.5665977001190186,0.3716162081238925
48,2,KNeighbors Classifier,0,0.65,0.7356687898089171,0.849652410283033,21.70063018798828,0.0
49,2,SVC Classifier,0,0.65,0.692144373673036,0.6735857567000605,33.680389642715454,0.0
50,2,Decision Tree,0,0.65,0.6719745222929936,0.8023360577528452,0.3047068119049072,0.0
51,2,RandomForest,0,0.65,0.5886411889596603,0.6696171270018364,1.240715503692627,0.0
52,2,AdaBoost (Discrete),0,0.65,0.7399150743099787,0.8487488988097288,120.14730024337769,0.0
53,2,AdaBoost (Real),0,0.65,0.31475583864118895,0.36003689309827996,140.96584057807922,0.0
54,2,Logistic Regression (Penalty = L2),0,0.65,0.7367303609341825,0.3727721645770899,2.5921108722686768,0.3727721645770899
55,2,Naive Bayes,0,0.65,0.6932059447983014,0.7639500107085624,0.5231425762176514,0.7639500107085624
56,2,KNeighbors Classifier,1,0.65,0.7809675704412546,0.5618808838496128,21.621241569519043,0.0
57,2,SVC Classifier,1,0.65,0.7682083997873471,0.6177320829257733,34.87190914154053,0.0
58,2,Decision Tree,1,0.65,0.7586390217969166,0.673005630821672,0.35265612602233887,0.0
59,2,RandomForest,1,0.65,0.7549175970228602,0.9806273417094291,0.8701632022857666,0.0
60,2,AdaBoost (Discrete),1,0.65,0.8718766613503456,0.7576228151020329,107.04179191589355,0.0
61,2,AdaBoost (Real),1,0.65,0.7804359383306751,0.9822786963053242,139.09095549583435,0.0
62,2,Logistic Regression (Penalty = L2),1,0.65,0.7676767676767676,0.617423414240383,2.594877243041992,0.0
63,2,Naive Bayes,1,0.65,0.873471557682084,0.9425946301834182,0.514794111251831,0.9425946301834182
64,2,KNeighbors Classifier,2,0.65,0.38105375199574243,0.2638105016523069,18.812257051467896,0.2638105016523069
65,2,SVC Classifier,2,0.65,0.3602980308674827,0.3472039434372915,15.6823890209198,0.0
66,2,Decision Tree,2,0.65,0.3879723257051623,0.36450926100192615,0.16928505897521973,0.0
67,2,RandomForest,2,0.65,0.31293241085683876,0.1932103462688725,0.9121372699737549,0.0
68,2,AdaBoost (Discrete),2,0.65,0.4912187333688132,0.35594662831055107,104.4276955127716,0.35594662831055107
69,2,AdaBoost (Real),2,0.65,0.3677488025545503,0.784611766697512,127.08444714546204,0.0
70,2,Logistic Regression (Penalty = L2),2,0.65,0.3751995742416179,0.3691947498960924,2.426661252975464,0.0
71,2,Naive Bayes,2,0.65,0.36934539648749337,0.3878285976996639,0.5013689994812012,0.3878285976996639
72,3,KNeighbors Classifier,0,0.65,0.7404458598726115,0.4428841986266727,9.274736881256104,0.4428841986266727
73,3,SVC Classifier,0,0.65,0.692144373673036,0.6735857567000605,22.920600175857544,0.0
74,3,Decision Tree,0,0.65,0.7361995753715499,0.873942562614331,0.17294573783874512,0.0
75,3,RandomForest,0,0.65,0.5981953290870489,0.6909553927994988,0.8701682090759277,0.0
76,3,AdaBoost (Discrete),0,0.65,0.7409766454352441,0.8484120656552605,87.96109986305237,0.0
77,3,AdaBoost (Real),0,0.65,0.31475583864118895,0.36003689309827996,118.1695830821991,0.0
78,3,Logistic Regression (Penalty = L2),0,0.65,0.7367303609341825,0.8741540685835897,2.036334991455078,0.0
79,3,Naive Bayes,0,0.65,0.7032908704883227,0.7676217005470146,0.43320751190185547,0.7676217005470146
80,3,KNeighbors Classifier,1,0.65,0.8288144603934078,0.6284328996881465,10.12856125831604,0.6284328996881465
81,3,SVC Classifier,1,0.65,0.7682083997873471,0.6177320829257733,26.165666103363037,0.0
82,3,Decision Tree,1,0.65,0.7660818713450293,0.6166653730147104,0.26207637786865234,0.0
83,3,RandomForest,1,0.65,0.7644869750132908,0.991557271937277,0.867424726486206,0.0
84,3,AdaBoost (Discrete),1,0.65,0.9043062200956937,0.8479099529974525,94.17815613746643,0.8479099529974525
85,3,AdaBoost (Real),1,0.65,0.7804359383306751,0.9822786963053242,125.53047275543213,0.0
86,3,Logistic Regression (Penalty = L2),1,0.65,0.7682083997873471,0.6253918159827379,2.074235677719116,0.0
87,3,Naive Bayes,1,0.65,0.8793195108984583,0.9450934259848028,0.379852294921875,0.9450934259848028
88,3,KNeighbors Classifier,2,0.65,0.41564662054284196,0.3600197076662039,9.054458379745483,0.3600197076662039
89,3,SVC Classifier,2,0.65,0.34379989356040447,0.3181720219996804,9.378864288330078,0.0
90,3,Decision Tree,2,0.65,0.37360298030867484,0.33542325328309514,0.0820167064666748,0.0
91,3,RandomForest,2,0.65,0.30175625332623734,0.18999722543518244,0.949460506439209,0.0
92,3,AdaBoost (Discrete),2,0.65,0.38850452368281,0.3730717732955613,83.63617777824402,0.0
93,3,AdaBoost (Real),2,0.65,0.3677488025545503,0.784611766697512,119.56989979743958,0.0
94,3,Logistic Regression (Penalty = L2),2,0.65,0.3778605641298563,0.36918866219451113,1.921351671218872,0.0
95,3,Naive Bayes,2,0.65,0.368281000532198,0.3624539126363047,0.4104480743408203,0.3624539126363047
96,4,KNeighbors Classifier,0,0.65,0.7388535031847133,0.8545780977930196,10.656225442886353,0.0
97,4,SVC Classifier,0,0.65,0.692144373673036,0.6735857567000605,22.94901442527771,0.0
98,4,Decision Tree,0,0.65,0.7356687898089171,0.8669959013817438,0.1605396270751953,0.0
99,4,RandomForest,0,0.65,0.5881104033970276,0.5184310488443483,0.8811366558074951,0.0
100,4,AdaBoost (Discrete),0,0.65,0.7685774946921444,0.8052236235441584,83.84977650642395,0.0
101,4,AdaBoost (Real),0,0.65,0.31475583864118895,0.36003689309827996,114.80175924301147,0.0
102,4,Logistic Regression (Penalty = L2),0,0.65,0.7367303609341825,0.8741540685835897,2.273500442504883,0.0
103,4,Naive Bayes,0,0.65,0.6926751592356688,0.7637543016892311,0.4021141529083252,0.7637543016892311
104,4,KNeighbors Classifier,1,0.65,0.8282828282828283,0.6008951521942902,11.431748628616333,0.6008951521942902
105,4,SVC Classifier,1,0.65,0.7682083997873471,0.6177320829257733,24.6968777179718,0.0
106,4,Decision Tree,1,0.65,0.7644869750132908,0.2927466828571932,0.2374403476715088,0.0
107,4,RandomForest,1,0.65,0.7501329080276449,0.9756358042955093,0.8801059722900391,0.0
108,4,AdaBoost (Discrete),1,0.65,0.8335991493886231,0.8574110648738131,87.6528902053833,0.0
109,4,AdaBoost (Real),1,0.65,0.7804359383306751,0.9822786963053242,116.58948111534119,0.0
110,4,Logistic Regression (Penalty = L2),1,0.65,0.7682083997873471,0.6253918159827379,2.369422197341919,0.0
111,4,Naive Bayes,1,0.65,0.8649654439128124,0.9388998258529409,0.4390747547149658,0.9388998258529409
112,4,KNeighbors Classifier,2,0.65,0.42203299627461416,0.3930390291091837,10.716546058654785,0.3930390291091837
113,4,SVC Classifier,2,0.65,0.3602980308674827,0.3466206166444903,9.570398092269897,0.0
114,4,Decision Tree,2,0.65,0.37360298030867484,0.3677257586636381,0.1454942226409912,0.0
115,4,RandomForest,2,0.65,0.30175625332623734,0.18999722543518244,0.7822830677032471,0.0
116,4,AdaBoost (Discrete),2,0.65,0.4635444385311336,0.40081868520958497,78.38248062133789,0.40081868520958497
117,4,AdaBoost (Real),2,0.65,0.3677488025545503,0.784611766697512,105.17849564552307,0.0
118,4,Logistic Regression (Penalty = L2),2,0.65,0.3778605641298563,0.36918866219451113,1.8198423385620117,0.0
119,4,Naive Bayes,2,0.65,0.3645556146886642,0.4047081410813267,0.38051319122314453,0.4047081410813267
120,5,KNeighbors Classifier,0,0.65,0.7404458598726115,0.41135050952675,12.644383430480957,0.41135050952675
121,5,SVC Classifier,0,0.65,0.692144373673036,0.6735857567000605,22.699828386306763,0.0
122,5,Decision Tree,0,0.65,0.7361995753715499,0.8560953927464221,0.16010308265686035,0.0
123,5,RandomForest,0,0.65,0.5981953290870489,0.6909553927994988,0.8824748992919922,0.0
124,5,AdaBoost (Discrete),0,0.65,0.7462845010615711,0.8449824999990125,81.77757239341736,0.0
125,5,AdaBoost (Real),0,0.65,0.31475583864118895,0.36003689309827996,104.08554911613464,0.0
126,5,Logistic Regression (Penalty = L2),0,0.65,0.7367303609341825,0.3727721645770899,2.0326759815216064,0.3727721645770899
127,5,Naive Bayes,0,0.65,0.6926751592356688,0.7637543016892311,0.38526058197021484,0.7637543016892311
128,5,KNeighbors Classifier,1,0.65,0.7894736842105263,0.27250594222454116,11.457263946533203,0.27250594222454116
129,5,SVC Classifier,1,0.65,0.7682083997873471,0.6177320829257733,23.256211042404175,0.0
130,5,Decision Tree,1,0.65,0.7650186071238703,0.6162174035687353,0.1491837501525879,0.0
131,5,RandomForest,1,0.65,0.7432216905901117,0.9671007994868753,0.777799129486084,0.0
132,5,AdaBoost (Discrete),1,0.65,0.7713981924508241,0.6192357015520555,85.98295044898987,0.0
133,5,AdaBoost (Real),1,0.65,0.7804359383306751,0.9822786963053242,109.38860201835632,0.0
134,5,Logistic Regression (Penalty = L2),1,0.65,0.7671451355661882,0.6172284281386226,1.9448015689849854,0.0
135,5,Naive Bayes,1,0.65,0.8649654439128124,0.9388998258529409,0.4141089916229248,0.9388998258529409
136,5,KNeighbors Classifier,2,0.65,0.3879723257051623,0.3227247432956896,10.66356086730957,0.3227247432956896
137,5,SVC Classifier,2,0.65,0.3602980308674827,0.3466206166444903,9.628946781158447,0.0
138,5,Decision Tree,2,0.65,0.37307078233102714,0.33349066522477633,0.20197725296020508,0.0
139,5,RandomForest,2,0.65,0.290580095795636,0.25380499579058524,0.6685042381286621,0.0
140,5,AdaBoost (Discrete),2,0.65,0.38903672166045766,0.39180547254128234,74.88633894920349,0.0
141,5,AdaBoost (Real),2,0.65,0.3677488025545503,0.784611766697512,102.31756448745728,0.0
142,5,Logistic Regression (Penalty = L2),2,0.65,0.3778605641298563,0.3715923199515945,1.7475199699401855,0.0
143,5,Naive Bayes,2,0.65,0.35923363491218735,0.35925312105676244,0.3753986358642578,0.35925312105676244
144,6,KNeighbors Classifier,0,0.65,0.7399150743099787,0.4391798972450249,15.580061197280884,0.4391798972450249
145,6,SVC Classifier,0,0.65,0.692144373673036,0.6735857567000605,24.723344564437866,0.0
146,6,Decision Tree,0,0.65,0.7351380042462845,0.8501703571197441,0.1901094913482666,0.0
147,6,RandomForest,0,0.65,0.5610403397027601,0.6085547505032551,0.8109784126281738,0.0
148,6,AdaBoost (Discrete),0,0.65,0.7818471337579618,0.7552863270911314,86.8278706073761,0.0
149,6,AdaBoost (Real),0,0.65,0.31475583864118895,0.36003689309827996,103.03960418701172,0.0
150,6,Logistic Regression (Penalty = L2),0,0.65,0.7372611464968153,0.3728473429997568,1.9236235618591309,0.3728473429997568
151,6,Naive Bayes,0,0.65,0.7032908704883227,0.7676217005470146,0.38378381729125977,0.7676217005470146
152,6,KNeighbors Classifier,1,0.65,0.783625730994152,0.3210187006739316,14.538378953933716,0.3210187006739316
153,6,SVC Classifier,1,0.65,0.7682083997873471,0.6177320829257733,24.525299549102783,0.0
154,6,Decision Tree,1,0.65,0.7623604465709729,0.6569741015296567,0.24829673767089844,0.0
155,6,RandomForest,1,0.65,0.7416267942583732,0.9652415844392986,0.6961233615875244,0.0
156,6,AdaBoost (Discrete),1,0.65,0.8128654970760234,0.6773004222301293,82.89792370796204,0.0
157,6,AdaBoost (Real),1,0.65,0.7804359383306751,0.9822786963053242,104.69205594062805,0.0
158,6,Logistic Regression (Penalty = L2),1,0.65,0.7666135034556087,0.6169761377004175,1.900745153427124,0.0
159,6,Naive Bayes,1,0.65,0.8708133971291866,0.9414477769135561,0.4344596862792969,0.9414477769135561
160,6,KNeighbors Classifier,2,0.65,0.38318254390633316,0.3073402036534955,12.972408294677734,0.3073402036534955
161,6,SVC Classifier,2,0.65,0.35923363491218735,0.3474284795242624,10.73454737663269,0.0
162,6,Decision Tree,2,0.65,0.3922299095263438,0.5072097937577913,0.12627696990966797,0.0
163,6,RandomForest,2,0.65,0.30175625332623734,0.18999722543518244,0.6974349021911621,0.0
164,6,AdaBoost (Discrete),2,0.65,0.39648749334752525,0.35382705705325684,76.16646218299866,0.0
165,6,AdaBoost (Real),2,0.65,0.3677488025545503,0.784611766697512,95.46673083305359,0.0
166,6,Logistic Regression (Penalty = L2),2,0.65,0.37573177221926557,0.3696792591096666,1.5055806636810303,0.0
167,6,Naive Bayes,2,0.65,0.37360298030867484,0.40828021205743065,0.352283239364624,0.40828021205743065
168,7,KNeighbors Classifier,0,0.65,0.7367303609341825,0.8564711322638023,17.78652000427246,0.0
169,7,SVC Classifier,0,0.65,0.7160297239915074,0.7937149983329698,29.233014345169067,0.0
170,7,Decision Tree,0,0.65,0.7287685774946921,0.8082545878048956,0.30019402503967285,0.0
171,7,RandomForest,0,0.65,0.6305732484076433,0.7588191165310104,0.77817702293396,0.0
172,7,AdaBoost (Discrete),0,0.65,0.8004246284501062,0.6723477940906949,87.31210494041443,0.0
173,7,AdaBoost (Real),0,0.65,0.3619957537154989,0.35011387244385067,102.35393786430359,0.35011387244385067
174,7,Logistic Regression (Penalty = L2),0,0.65,0.7367303609341825,0.37214369183441376,1.8264892101287842,0.37214369183441376
175,7,Naive Bayes,0,0.65,0.7107218683651805,0.7702720277511412,0.5088245868682861,0.7702720277511412
176,7,KNeighbors Classifier,1,0.65,0.7745879851143009,0.5133190853264129,18.793546199798584,0.0
177,7,SVC Classifier,1,0.65,0.7676767676767676,0.6174804095865509,26.47399616241455,0.0
178,7,Decision Tree,1,0.65,0.7533227006911217,0.658389115679958,0.2558786869049072,0.0
179,7,RandomForest,1,0.65,0.68367889420521,0.8717550754716453,0.6449711322784424,0.0
180,7,AdaBoost (Discrete),1,0.65,0.8341307814992025,0.6040359458433461,91.72338342666626,0.6040359458433461
181,7,AdaBoost (Real),1,0.65,0.7804359383306751,0.9822786963053242,111.13337707519531,0.0
182,7,Logistic Regression (Penalty = L2),1,0.65,0.7666135034556087,0.6169183639901882,1.7947912216186523,0.0
183,7,Naive Bayes,1,0.65,0.8543328017012227,0.9341766402374898,0.4269082546234131,0.9341766402374898
184,7,KNeighbors Classifier,2,0.65,0.3815859499733901,0.24113833184322783,15.78794240951538,0.24113833184322783
185,7,SVC Classifier,2,0.65,0.3571048430015966,0.34616903994382964,13.428696632385254,0.0
186,7,Decision Tree,2,0.65,0.3858435337945716,0.3328702406595147,0.2284700870513916,0.0
187,7,RandomForest,2,0.65,0.30175625332623734,0.18999722543518244,0.7715983390808105,0.0
188,7,AdaBoost (Discrete),2,0.65,0.4624800425758382,0.3183169504735452,75.699214220047,0.0
189,7,AdaBoost (Real),2,0.65,0.3677488025545503,0.784611766697512,98.65294194221497,0.0
190,7,Logistic Regression (Penalty = L2),2,0.65,0.37573177221926557,0.3696792591096666,1.40791654586792,0.0
191,7,Naive Bayes,2,0.65,0.39861628525811604,0.39795049660148546,0.4306938648223877,0.39795049660148546
192,8,KNeighbors Classifier,0,0.65,0.7484076433121019,0.5856410048694083,4.534735679626465,0.5856410048694083
193,8,SVC Classifier,0,0.65,0.692144373673036,0.6735857567000605,13.226436138153076,0.0
194,8,Decision Tree,0,0.65,0.7361995753715499,0.873942562614331,0.0585484504699707,0.0
195,8,RandomForest,0,0.65,0.5981953290870489,0.6909553927994988,0.5072536468505859,0.0
196,8,AdaBoost (Discrete),0,0.65,0.7722929936305732,0.800065590585149,54.71680927276611,0.0
197,8,AdaBoost (Real),0,0.65,0.31475583864118895,0.36003689309827996,71.70145297050476,0.0
198,8,Logistic Regression (Penalty = L2),0,0.65,0.7367303609341825,0.8741540685835897,1.2545044422149658,0.0
199,8,Naive Bayes,0,0.65,0.6926751592356688,0.7637543016892311,0.25552845001220703,0.7637543016892311
200,8,KNeighbors Classifier,1,0.65,0.8256246677299309,0.5871340232588519,4.605959415435791,0.5871340232588519
201,8,SVC Classifier,1,0.65,0.7682083997873471,0.6177320829257733,14.216401815414429,0.0
202,8,Decision Tree,1,0.65,0.7660818713450293,0.6166653730147104,0.10364913940429688,0.0
203,8,RandomForest,1,0.65,0.7698032961190856,0.9975777114203086,0.5173771381378174,0.0
204,8,AdaBoost (Discrete),1,0.65,0.7761828814460393,0.6822712874343291,51.811662912368774,0.0
205,8,AdaBoost (Real),1,0.65,0.7804359383306751,0.9822786963053242,70.54905557632446,0.0
206,8,Logistic Regression (Penalty = L2),1,0.65,0.7682083997873471,0.6253918159827379,1.259531021118164,0.0
207,8,Naive Bayes,1,0.65,0.8649654439128124,0.9388998258529409,0.24283480644226074,0.9388998258529409
208,8,KNeighbors Classifier,2,0.65,0.42309739222990955,0.3830905257897914,5.023513078689575,0.3830905257897914
209,8,SVC Classifier,2,0.65,0.3602980308674827,0.3466206166444903,5.5164947509765625,0.0
210,8,Decision Tree,2,0.65,0.3927621075039915,0.4513906672020001,0.14069223403930664,0.0
211,8,RandomForest,2,0.65,0.30175625332623734,0.18999722543518244,0.5712826251983643,0.0
212,8,AdaBoost (Discrete),2,0.65,0.3847791378392762,0.37246729797436506,47.91948485374451,0.0
213,8,AdaBoost (Real),2,0.65,0.3677488025545503,0.784611766697512,66.81620001792908,0.0
214,8,Logistic Regression (Penalty = L2),2,0.65,0.3778605641298563,0.36918866219451113,1.0582094192504883,0.0
215,8,Naive Bayes,2,0.65,0.35923363491218735,0.35925312105676244,0.26453137397766113,0.35925312105676244
