,feat_set_id,classifier,fold_id,feat_th,score,geo_score,exec_t,geo_score_woz
0,0,KNeighbors Classifier,0,0.6,0.7681,0.5655941963123018,11.065792322158813,0.5655941963123018
1,0,SVC Classifier,0,0.6,0.7795,0.09014398837291854,58.05327248573303,0.09014398837291854
2,0,Decision Tree,0,0.6,0.7228,0.5643927383008922,0.3130190372467041,0.5643927383008922
3,0,RandomForest,0,0.6,0.8034,0.4957458329397273,0.42209625244140625,0.4957458329397273
4,0,AdaBoost (Discrete),0,0.6,0.8077,0.5741375445294792,80.49906396865845,0.5741375445294792
5,0,AdaBoost (Real),0,0.6,0.7876,0.5599688105671979,109.08048748970032,0.5599688105671979
6,0,Logistic Regression (Penalty = L2),0,0.6,0.8084,0.4986174696578976,0.34474682807922363,0.4986174696578976
7,0,Naive Bayes,0,0.6,0.7139,0.6725814030631153,0.1571049690246582,0.6725814030631153
8,0,KNeighbors Classifier,1,0.6,0.7756,0.602217159416228,11.376946210861206,0.602217159416228
9,0,SVC Classifier,1,0.6,0.7788,1.0,54.69425106048584,0.0
10,0,Decision Tree,1,0.6,0.7266,0.5901702734908264,0.29539012908935547,0.5901702734908264
11,0,RandomForest,1,0.6,0.8101,0.5223218834063507,0.4200165271759033,0.5223218834063507
12,0,AdaBoost (Discrete),1,0.6,0.8248,0.6128800279569282,93.08252382278442,0.6128800279569282
13,0,AdaBoost (Real),1,0.6,0.7981,0.5974476007477095,110.39137244224548,0.5974476007477095
14,0,Logistic Regression (Penalty = L2),1,0.6,0.813,0.4915230487500622,0.2741668224334717,0.4915230487500622
15,0,Naive Bayes,1,0.6,0.6061,0.6543532760705293,0.15773725509643555,0.6543532760705293
16,0,KNeighbors Classifier,2,0.6,0.7834,0.572796234287925,11.309713125228882,0.572796234287925
17,0,SVC Classifier,2,0.6,0.7788,1.0,48.606966495513916,0.0
18,0,Decision Tree,2,0.6,0.7334,0.5565364688654947,0.27610111236572266,0.5565364688654947
19,0,RandomForest,2,0.6,0.8094,0.44964183924328,0.42719602584838867,0.44964183924328
20,0,AdaBoost (Discrete),2,0.6,0.8236,0.5725952888450485,83.87892651557922,0.5725952888450485
21,0,AdaBoost (Real),2,0.6,0.7924,0.5571916253398871,96.8414216041565,0.5571916253398871
22,0,Logistic Regression (Penalty = L2),2,0.6,0.8056,0.4260903184586543,0.4434356689453125,0.4260903184586543
23,0,Naive Bayes,2,0.6,0.7685,0.6917913915423202,0.11760830879211426,0.6917913915423202
24,1,KNeighbors Classifier,0,0.6,0.7654,0.5495468028355095,9.058603048324585,0.5495468028355095
25,1,SVC Classifier,0,0.6,0.7788,1.0,48.11190724372864,0.0
26,1,Decision Tree,0,0.6,0.7228,0.5697268281179794,0.4427611827850342,0.5697268281179794
27,1,RandomForest,0,0.6,0.8096,0.5232856457502021,0.5406594276428223,0.5232856457502021
28,1,AdaBoost (Discrete),0,0.6,0.808,0.5632129898224584,138.91899418830872,0.5632129898224584
29,1,AdaBoost (Real),0,0.6,0.7816,0.5516540276733735,153.42013883590698,0.5516540276733735
30,1,Logistic Regression (Penalty = L2),0,0.6,0.8072,0.490052350446266,0.577136754989624,0.490052350446266
31,1,Naive Bayes,0,0.6,0.4149,0.4987143203200049,0.134873628616333,0.4987143203200049
32,1,KNeighbors Classifier,1,0.6,0.7742,0.5876273935169928,9.4327871799469,0.5876273935169928
33,1,SVC Classifier,1,0.6,0.7788,1.0,43.80674338340759,0.0
34,1,Decision Tree,1,0.6,0.7247,0.5823606790670991,0.44057655334472656,0.5823606790670991
35,1,RandomForest,1,0.6,0.8155,0.5199815837409667,0.6513516902923584,0.5199815837409667
36,1,AdaBoost (Discrete),1,0.6,0.8225,0.6088421457384837,143.26711249351501,0.6088421457384837
37,1,AdaBoost (Real),1,0.6,0.7979,0.6012908538798974,152.4271056652069,0.6012908538798974
38,1,Logistic Regression (Penalty = L2),1,0.6,0.8149,0.5040051910913855,0.3550536632537842,0.5040051910913855
39,1,Naive Bayes,1,0.6,0.3781,0.45468903156539225,0.12252140045166016,0.45468903156539225
40,1,KNeighbors Classifier,2,0.6,0.7831,0.5770627466665501,10.201001167297363,0.5770627466665501
41,1,SVC Classifier,2,0.6,0.7788,1.0,40.45940136909485,0.0
42,1,Decision Tree,2,0.6,0.7308,0.5633303184722683,0.4581940174102783,0.5633303184722683
43,1,RandomForest,2,0.6,0.8051,0.44184443960816017,0.6155951023101807,0.44184443960816017
44,1,AdaBoost (Discrete),2,0.6,0.8204,0.5645070453484309,140.7882809638977,0.5645070453484309
45,1,AdaBoost (Real),2,0.6,0.794,0.5506961149411989,145.9316849708557,0.5506961149411989
46,1,Logistic Regression (Penalty = L2),2,0.6,0.8103,0.4567979031308537,0.35947203636169434,0.4567979031308537
47,1,Naive Bayes,2,0.6,0.4708,0.5536833098978092,0.13895034790039062,0.5536833098978092
48,2,KNeighbors Classifier,0,0.6,0.775,0.5674803065350239,11.56865119934082,0.5674803065350239
49,2,SVC Classifier,0,0.6,0.7795,0.09014398837291854,45.602434158325195,0.09014398837291854
50,2,Decision Tree,0,0.6,0.7283,0.5673943754473654,0.36006879806518555,0.5673943754473654
51,2,RandomForest,0,0.6,0.8001,0.43232357164299606,0.4170510768890381,0.43232357164299606
52,2,AdaBoost (Discrete),0,0.6,0.8075,0.5707483057165966,91.78940844535828,0.5707483057165966
53,2,AdaBoost (Real),0,0.6,0.7857,0.5525806568158405,107.33020496368408,0.5525806568158405
54,2,Logistic Regression (Penalty = L2),0,0.6,0.8062,0.48180139332225486,0.42681455612182617,0.48180139332225486
55,2,Naive Bayes,0,0.6,0.7921,0.5943191047176272,0.14843487739562988,0.5943191047176272
56,2,KNeighbors Classifier,1,0.6,0.7774,0.5989777145014037,12.97416639328003,0.5989777145014037
57,2,SVC Classifier,1,0.6,0.7788,1.0,47.17470049858093,0.0
58,2,Decision Tree,1,0.6,0.7262,0.6006198689587773,0.31651782989501953,0.6006198689587773
59,2,RandomForest,1,0.6,0.8029,0.46263082862461746,0.5400769710540771,0.46263082862461746
60,2,AdaBoost (Discrete),1,0.6,0.8197,0.6125878608206662,91.96720886230469,0.6125878608206662
61,2,AdaBoost (Real),1,0.6,0.8019,0.6068813311298048,103.77643299102783,0.6068813311298048
62,2,Logistic Regression (Penalty = L2),1,0.6,0.8137,0.5068103908537027,0.34444499015808105,0.5068103908537027
63,2,Naive Bayes,1,0.6,0.8009,0.6334541427727568,0.16147756576538086,0.6334541427727568
64,2,KNeighbors Classifier,2,0.6,0.7836,0.5574064551757331,15.086937189102173,0.5574064551757331
65,2,SVC Classifier,2,0.6,0.7788,1.0,48.603556394577026,0.0
66,2,Decision Tree,2,0.6,0.7415,0.5774906094248131,0.3195827007293701,0.5774906094248131
67,2,RandomForest,2,0.6,0.8036,0.3983823382045431,0.5006129741668701,0.3983823382045431
68,2,AdaBoost (Discrete),2,0.6,0.8226,0.570847409091356,94.46551871299744,0.570847409091356
69,2,AdaBoost (Real),2,0.6,0.7939,0.5544022560209773,106.41912269592285,0.5544022560209773
70,2,Logistic Regression (Penalty = L2),2,0.6,0.8097,0.44459231704407787,0.3390774726867676,0.44459231704407787
71,2,Naive Bayes,2,0.6,0.8103,0.6086380796746944,0.1319589614868164,0.6086380796746944
72,3,KNeighbors Classifier,0,0.6,0.7685,0.567626052734163,11.696712970733643,0.567626052734163
73,3,SVC Classifier,0,0.6,0.7795,0.09014398837291854,45.123046875,0.09014398837291854
74,3,Decision Tree,0,0.6,0.7187,0.5667727265531696,0.2901604175567627,0.5667727265531696
75,3,RandomForest,0,0.6,0.8028,0.4665590593898779,0.39406657218933105,0.4665590593898779
76,3,AdaBoost (Discrete),0,0.6,0.8088,0.5645381505472775,103.36151671409607,0.5645381505472775
77,3,AdaBoost (Real),0,0.6,0.7844,0.5590369831827908,124.75693964958191,0.5590369831827908
78,3,Logistic Regression (Penalty = L2),0,0.6,0.8056,0.47736981825438757,0.37827062606811523,0.47736981825438757
79,3,Naive Bayes,0,0.6,0.7705,0.6444649256674061,0.13284993171691895,0.6444649256674061
80,3,KNeighbors Classifier,1,0.6,0.7794,0.6118284177199873,15.516500234603882,0.6118284177199873
81,3,SVC Classifier,1,0.6,0.7788,1.0,50.851359844207764,0.0
82,3,Decision Tree,1,0.6,0.7295,0.5933713231011419,0.35628533363342285,0.5933713231011419
83,3,RandomForest,1,0.6,0.8081,0.486607471308793,0.5163002014160156,0.486607471308793
84,3,AdaBoost (Discrete),1,0.6,0.8212,0.6073758794583728,115.03450345993042,0.6073758794583728
85,3,AdaBoost (Real),1,0.6,0.7963,0.5985067785550086,117.83022999763489,0.5985067785550086
86,3,Logistic Regression (Penalty = L2),1,0.6,0.8112,0.4812755051482221,0.4582953453063965,0.4812755051482221
87,3,Naive Bayes,1,0.6,0.78,0.6882805403539226,0.1478877067565918,0.6882805403539226
88,3,KNeighbors Classifier,2,0.6,0.7849,0.5695962439132539,15.40930724143982,0.5695962439132539
89,3,SVC Classifier,2,0.6,0.7788,1.0,51.493571281433105,0.0
90,3,Decision Tree,2,0.6,0.7347,0.5693568042319755,0.4021744728088379,0.5693568042319755
91,3,RandomForest,2,0.6,0.8081,0.4455342600939076,0.5432314872741699,0.4455342600939076
92,3,AdaBoost (Discrete),2,0.6,0.8207,0.5741956770087784,112.49648022651672,0.5741956770087784
93,3,AdaBoost (Real),2,0.6,0.7924,0.5469970711194746,123.83421111106873,0.5469970711194746
94,3,Logistic Regression (Penalty = L2),2,0.6,0.808,0.43793562991097446,0.33594822883605957,0.43793562991097446
95,3,Naive Bayes,2,0.6,0.7945,0.6668684988123453,0.13822317123413086,0.6668684988123453
96,4,KNeighbors Classifier,0,0.6,0.7636,0.5555703092831684,3.6623175144195557,0.5555703092831684
97,4,SVC Classifier,0,0.6,0.7788,1.0,32.99038553237915,0.0
98,4,Decision Tree,0,0.6,0.7184,0.5503848601648992,0.23317933082580566,0.5503848601648992
99,4,RandomForest,0,0.6,0.783,0.1908797278594414,0.4356229305267334,0.1908797278594414
100,4,AdaBoost (Discrete),0,0.6,0.808,0.5504321079907595,63.630208253860474,0.5504321079907595
101,4,AdaBoost (Real),0,0.6,0.7812,0.5403343440441376,79.06009602546692,0.5403343440441376
102,4,Logistic Regression (Penalty = L2),0,0.6,0.806,0.49417136306280635,0.2771427631378174,0.49417136306280635
103,4,Naive Bayes,0,0.6,0.4096,0.4926228523234123,0.10419988632202148,0.4926228523234123
104,4,KNeighbors Classifier,1,0.6,0.7787,0.5963401120977074,3.435929775238037,0.5963401120977074
105,4,SVC Classifier,1,0.6,0.7788,1.0,29.433005332946777,0.0
106,4,Decision Tree,1,0.6,0.7254,0.5805215170605682,0.2811565399169922,0.5805215170605682
107,4,RandomForest,1,0.6,0.7814,0.1343528028545926,0.4873087406158447,0.1343528028545926
108,4,AdaBoost (Discrete),1,0.6,0.8232,0.5949413878997087,61.84088492393494,0.5949413878997087
109,4,AdaBoost (Real),1,0.6,0.7964,0.5850227604344242,81.00482106208801,0.5850227604344242
110,4,Logistic Regression (Penalty = L2),1,0.6,0.8169,0.5231609452562166,0.23096823692321777,0.5231609452562166
111,4,Naive Bayes,1,0.6,0.3777,0.4542205121490806,0.13696765899658203,0.4542205121490806
112,4,KNeighbors Classifier,2,0.6,0.7809,0.5622079706535549,4.9814324378967285,0.5622079706535549
113,4,SVC Classifier,2,0.6,0.7788,1.0,31.187443256378174,0.0
114,4,Decision Tree,2,0.6,0.7306,0.538948489907987,0.21796655654907227,0.538948489907987
115,4,RandomForest,2,0.6,0.7792,0.06376600915822664,0.46576714515686035,0.06376600915822664
116,4,AdaBoost (Discrete),2,0.6,0.8227,0.5583741158327326,60.09833097457886,0.5583741158327326
117,4,AdaBoost (Real),2,0.6,0.7949,0.5517236301339475,73.45268106460571,0.5517236301339475
118,4,Logistic Regression (Penalty = L2),2,0.6,0.8113,0.4705033500377951,0.23438334465026855,0.4705033500377951
119,4,Naive Bayes,2,0.6,0.4644,0.5483563391649615,0.10711145401000977,0.5483563391649615
120,5,KNeighbors Classifier,0,0.6,0.7348,0.571687037994404,5.033742904663086,0.571687037994404
121,5,SVC Classifier,0,0.6,0.7795,0.09014398837291854,34.07053899765015,0.09014398837291854
122,5,Decision Tree,0,0.6,0.7891,0.5433304304015758,0.12533330917358398,0.5433304304015758
123,5,RandomForest,0,0.6,0.8015,0.45730681469807516,0.24740195274353027,0.45730681469807516
124,5,AdaBoost (Discrete),0,0.6,0.8088,0.5758875341186446,29.165270566940308,0.5758875341186446
125,5,AdaBoost (Real),0,0.6,0.8062,0.5645505407359442,51.16136312484741,0.5645505407359442
126,5,Logistic Regression (Penalty = L2),0,0.6,0.8065,0.48400016608889235,0.25862574577331543,0.48400016608889235
127,5,Naive Bayes,0,0.6,0.7925,0.5896110375509549,0.13364791870117188,0.5896110375509549
128,5,KNeighbors Classifier,1,0.6,0.7853,0.5994800418671907,5.64923882484436,0.5994800418671907
129,5,SVC Classifier,1,0.6,0.7788,1.0,33.26324915885925,0.0
130,5,Decision Tree,1,0.6,0.7968,0.588616476247928,0.13260126113891602,0.588616476247928
131,5,RandomForest,1,0.6,0.8052,0.4725228550231333,0.34818172454833984,0.4725228550231333
132,5,AdaBoost (Discrete),1,0.6,0.8228,0.6132735323684662,27.65601110458374,0.6132735323684662
133,5,AdaBoost (Real),1,0.6,0.8209,0.6044545242864733,51.60566592216492,0.6044545242864733
134,5,Logistic Regression (Penalty = L2),1,0.6,0.8131,0.4907239931165043,0.2193770408630371,0.4907239931165043
135,5,Naive Bayes,1,0.6,0.8024,0.6332975605634849,0.1238245964050293,0.6332975605634849
136,5,KNeighbors Classifier,2,0.6,0.7757,0.5724592749038283,5.412137985229492,0.5724592749038283
137,5,SVC Classifier,2,0.6,0.7788,1.0,33.81297707557678,0.0
138,5,Decision Tree,2,0.6,0.7996,0.5538587320463978,0.12508225440979004,0.5538587320463978
139,5,RandomForest,2,0.6,0.8077,0.44070682628694996,0.35520291328430176,0.44070682628694996
140,5,AdaBoost (Discrete),2,0.6,0.8224,0.5575555114389655,27.127582550048828,0.5575555114389655
141,5,AdaBoost (Real),2,0.6,0.8187,0.5621315601310294,45.0767867565155,0.5621315601310294
142,5,Logistic Regression (Penalty = L2),2,0.6,0.8082,0.4375142506068217,0.20252346992492676,0.4375142506068217
143,5,Naive Bayes,2,0.6,0.8109,0.6103991870363227,0.097442626953125,0.6103991870363227
144,6,KNeighbors Classifier,0,0.6,0.7714,0.554856119841088,7.468706369400024,0.554856119841088
145,6,SVC Classifier,0,0.6,0.7795,0.09014398837291854,38.93051290512085,0.09014398837291854
146,6,Decision Tree,0,0.6,0.7292,0.5541475046167366,0.31238532066345215,0.5541475046167366
147,6,RandomForest,0,0.6,0.8036,0.46942356912920685,0.3766951560974121,0.46942356912920685
148,6,AdaBoost (Discrete),0,0.6,0.8094,0.5741449251530458,53.73806023597717,0.5741449251530458
149,6,AdaBoost (Real),0,0.6,0.7874,0.550545834173345,66.17708230018616,0.550545834173345
150,6,Logistic Regression (Penalty = L2),0,0.6,0.8055,0.4704501725241235,0.24479961395263672,0.4704501725241235
151,6,Naive Bayes,0,0.6,0.7694,0.6441790188602944,0.09380340576171875,0.6441790188602944
152,6,KNeighbors Classifier,1,0.6,0.7762,0.6050454211547338,8.352025508880615,0.6050454211547338
153,6,SVC Classifier,1,0.6,0.7788,1.0,40.19111657142639,0.0
154,6,Decision Tree,1,0.6,0.7384,0.5921654950048033,0.3010680675506592,0.5921654950048033
155,6,RandomForest,1,0.6,0.8112,0.5051736575306132,0.4379546642303467,0.5051736575306132
156,6,AdaBoost (Discrete),1,0.6,0.8234,0.6147462695784377,55.93850779533386,0.6147462695784377
157,6,AdaBoost (Real),1,0.6,0.8027,0.5984590583525284,69.38005590438843,0.5984590583525284
158,6,Logistic Regression (Penalty = L2),1,0.6,0.809,0.46671356064119623,0.23659181594848633,0.46671356064119623
159,6,Naive Bayes,1,0.6,0.7789,0.6874790732968719,0.13445353507995605,0.6874790732968719
160,6,KNeighbors Classifier,2,0.6,0.7877,0.568155844490939,8.018268823623657,0.568155844490939
161,6,SVC Classifier,2,0.6,0.7788,1.0,41.59563231468201,0.0
162,6,Decision Tree,2,0.6,0.7417,0.5665958215517746,0.2513082027435303,0.5665958215517746
163,6,RandomForest,2,0.6,0.8071,0.42896707678159773,0.48604536056518555,0.42896707678159773
164,6,AdaBoost (Discrete),2,0.6,0.8212,0.5592252582577041,54.9193480014801,0.5592252582577041
165,6,AdaBoost (Real),2,0.6,0.7926,0.5463830250458233,65.10557317733765,0.5463830250458233
166,6,Logistic Regression (Penalty = L2),2,0.6,0.8063,0.42331277506030435,0.20955204963684082,0.42331277506030435
167,6,Naive Bayes,2,0.6,0.7955,0.6661133826231507,0.11332225799560547,0.6661133826231507
168,7,KNeighbors Classifier,0,0.6,0.7668,0.5523718318288017,4.01987099647522,0.5523718318288017
169,7,SVC Classifier,0,0.6,0.7788,1.0,30.52201199531555,0.0
170,7,Decision Tree,0,0.6,0.7272,0.5588633422457918,0.27994847297668457,0.5588633422457918
171,7,RandomForest,0,0.6,0.8097,0.5367201221062681,0.3821995258331299,0.5367201221062681
172,7,AdaBoost (Discrete),0,0.6,0.8078,0.5485966384203605,77.276846408844,0.5485966384203605
173,7,AdaBoost (Real),0,0.6,0.7871,0.5384061844024279,87.3099377155304,0.5384061844024279
174,7,Logistic Regression (Penalty = L2),0,0.6,0.8047,0.4817422934514242,0.25841307640075684,0.4817422934514242
175,7,Naive Bayes,0,0.6,0.8088,0.5275220082855483,0.1019291877746582,0.5275220082855483
176,7,KNeighbors Classifier,1,0.6,0.7726,0.5827678685854364,3.34913969039917,0.5827678685854364
177,7,SVC Classifier,1,0.6,0.7788,1.0,30.962132215499878,0.0
178,7,Decision Tree,1,0.6,0.7227,0.5811703105859226,0.267836332321167,0.5811703105859226
179,7,RandomForest,1,0.6,0.8245,0.5840360399199576,0.4799964427947998,0.5840360399199576
180,7,AdaBoost (Discrete),1,0.6,0.8243,0.5963464392161526,77.57137322425842,0.5963464392161526
181,7,AdaBoost (Real),1,0.6,0.7974,0.5879313228841548,93.69109582901001,0.5879313228841548
182,7,Logistic Regression (Penalty = L2),1,0.6,0.8153,0.5128966173251522,0.2757751941680908,0.5128966173251522
183,7,Naive Bayes,1,0.6,0.8241,0.5795478663872198,0.1304793357849121,0.5795478663872198
184,7,KNeighbors Classifier,2,0.6,0.7836,0.5750797279983045,3.908989667892456,0.5750797279983045
185,7,SVC Classifier,2,0.6,0.7788,1.0,28.890682697296143,0.0
186,7,Decision Tree,2,0.6,0.7349,0.5601386371578334,0.3083655834197998,0.5601386371578334
187,7,RandomForest,2,0.6,0.8211,0.5408225011991348,0.47969961166381836,0.5408225011991348
188,7,AdaBoost (Discrete),2,0.6,0.8209,0.5587616458599997,79.35549235343933,0.5587616458599997
189,7,AdaBoost (Real),2,0.6,0.7922,0.5360827188026503,91.69787240028381,0.5360827188026503
190,7,Logistic Regression (Penalty = L2),2,0.6,0.8111,0.4691233539020101,0.33733177185058594,0.4691233539020101
191,7,Naive Bayes,2,0.6,0.8194,0.5301310287415699,0.11224174499511719,0.5301310287415699
192,8,KNeighbors Classifier,0,0.6,0.7722,0.5580787931121332,2.556189775466919,0.5580787931121332
193,8,SVC Classifier,0,0.6,0.7788,1.0,32.330912351608276,0.0
194,8,Decision Tree,0,0.6,0.7267,0.5589367723583927,0.2949104309082031,0.5589367723583927
195,8,RandomForest,0,0.6,0.782,0.15312663804695456,0.4828782081604004,0.15312663804695456
196,8,AdaBoost (Discrete),0,0.6,0.8091,0.5557344816762905,77.41693353652954,0.5557344816762905
197,8,AdaBoost (Real),0,0.6,0.784,0.5448258110685479,88.99682712554932,0.5448258110685479
198,8,Logistic Regression (Penalty = L2),0,0.6,0.8055,0.49441369427886067,0.21736359596252441,0.49441369427886067
199,8,Naive Bayes,0,0.6,0.7828,0.6265978709780361,0.10780835151672363,0.6265978709780361
200,8,KNeighbors Classifier,1,0.6,0.778,0.5904386817996383,3.4697611331939697,0.5904386817996383
201,8,SVC Classifier,1,0.6,0.7788,1.0,27.632471084594727,0.0
202,8,Decision Tree,1,0.6,0.7226,0.5795079507648773,0.3228156566619873,0.5795079507648773
203,8,RandomForest,1,0.6,0.7864,0.23225643866083584,0.4460737705230713,0.23225643866083584
204,8,AdaBoost (Discrete),1,0.6,0.8219,0.5928110921821006,77.81832218170166,0.5928110921821006
205,8,AdaBoost (Real),1,0.6,0.7963,0.5874782600439705,91.541748046875,0.5874782600439705
206,8,Logistic Regression (Penalty = L2),1,0.6,0.816,0.5247618205487798,0.21714353561401367,0.5247618205487798
207,8,Naive Bayes,1,0.6,0.7991,0.665102696417064,0.12150979042053223,0.665102696417064
208,8,KNeighbors Classifier,2,0.6,0.7835,0.5715727450284138,3.8235998153686523,0.5715727450284138
209,8,SVC Classifier,2,0.6,0.7788,1.0,28.41023874282837,0.0
210,8,Decision Tree,2,0.6,0.7383,0.5660064226028131,0.2900819778442383,0.5660064226028131
211,8,RandomForest,2,0.6,0.7824,0.16307643286104356,0.49687862396240234,0.16307643286104356
212,8,AdaBoost (Discrete),2,0.6,0.822,0.5616286953475941,79.73670721054077,0.5616286953475941
213,8,AdaBoost (Real),2,0.6,0.7946,0.549209372190697,90.1715977191925,0.549209372190697
214,8,Logistic Regression (Penalty = L2),2,0.6,0.8099,0.4607486514109221,0.25040507316589355,0.4607486514109221
215,8,Naive Bayes,2,0.6,0.7987,0.6373992281726029,0.06818270683288574,0.6373992281726029
216,9,KNeighbors Classifier,0,0.6,0.7753,0.5701125976258846,7.426979303359985,0.5701125976258846
217,9,SVC Classifier,0,0.6,0.7795,0.09014398837291854,40.49499177932739,0.09014398837291854
218,9,Decision Tree,0,0.6,0.729,0.5622562381650623,0.34014296531677246,0.5622562381650623
219,9,RandomForest,0,0.6,0.8037,0.4729145759926185,0.4674248695373535,0.4729145759926185
220,9,AdaBoost (Discrete),0,0.6,0.8078,0.5691987025491387,69.47813868522644,0.5691987025491387
221,9,AdaBoost (Real),0,0.6,0.7848,0.5578786335367063,79.63256597518921,0.5578786335367063
222,9,Logistic Regression (Penalty = L2),0,0.6,0.8056,0.4782217181068695,0.22103190422058105,0.4782217181068695
223,9,Naive Bayes,0,0.6,0.7927,0.5896943218281626,0.11829733848571777,0.5896943218281626
224,9,KNeighbors Classifier,1,0.6,0.7858,0.606977260538302,8.577887058258057,0.606977260538302
225,9,SVC Classifier,1,0.6,0.7788,1.0,43.61272144317627,0.0
226,9,Decision Tree,1,0.6,0.7422,0.5944499217121616,0.38440918922424316,0.5944499217121616
227,9,RandomForest,1,0.6,0.8106,0.5021702986965556,0.5282993316650391,0.5021702986965556
228,9,AdaBoost (Discrete),1,0.6,0.8238,0.611541443463106,71.8872058391571,0.611541443463106
229,9,AdaBoost (Real),1,0.6,0.7953,0.5953610333241337,81.73918437957764,0.5953610333241337
230,9,Logistic Regression (Penalty = L2),1,0.6,0.813,0.4948300245917435,0.29764866828918457,0.4948300245917435
231,9,Naive Bayes,1,0.6,0.8017,0.6324270605232118,0.1334066390991211,0.6324270605232118
232,9,KNeighbors Classifier,2,0.6,0.7888,0.5727661856445321,8.87873101234436,0.5727661856445321
233,9,SVC Classifier,2,0.6,0.7788,1.0,41.60609030723572,0.0
234,9,Decision Tree,2,0.6,0.7394,0.5611785505115792,0.31496119499206543,0.5611785505115792
235,9,RandomForest,2,0.6,0.8079,0.43886209996725706,0.4430255889892578,0.43886209996725706
236,9,AdaBoost (Discrete),2,0.6,0.8223,0.5717568414268187,73.63129568099976,0.5717568414268187
237,9,AdaBoost (Real),2,0.6,0.7922,0.5403162954700261,82.59309339523315,0.5403162954700261
238,9,Logistic Regression (Penalty = L2),2,0.6,0.8086,0.4414405990370033,0.2826695442199707,0.4414405990370033
239,9,Naive Bayes,2,0.6,0.8101,0.6076465272960648,0.145463228225708,0.6076465272960648
240,10,KNeighbors Classifier,0,0.6,0.7721,0.5644069315277006,22.8641459941864,0.5644069315277006
241,10,SVC Classifier,0,0.6,0.7795,0.09014398837291854,61.42334699630737,0.09014398837291854
242,10,Decision Tree,0,0.6,0.7212,0.559988713570135,0.49695444107055664,0.559988713570135
243,10,RandomForest,0,0.6,0.8009,0.4081652439164938,0.7341985702514648,0.4081652439164938
244,10,AdaBoost (Discrete),0,0.6,0.8087,0.5722140335693545,142.38756823539734,0.5722140335693545
245,10,AdaBoost (Real),0,0.6,0.7807,0.5492995747494419,151.8237407207489,0.5492995747494419
246,10,Logistic Regression (Penalty = L2),0,0.6,0.8057,0.4786786907081324,0.5215482711791992,0.4786786907081324
247,10,Naive Bayes,0,0.6,0.7146,0.6716388785771372,0.16505646705627441,0.6716388785771372
248,10,KNeighbors Classifier,1,0.6,0.7789,0.5981778974684352,19.8202121257782,0.5981778974684352
249,10,SVC Classifier,1,0.6,0.7788,1.0,60.06467342376709,0.0
250,10,Decision Tree,1,0.6,0.7282,0.5906528685480863,0.5591192245483398,0.5906528685480863
251,10,RandomForest,1,0.6,0.8021,0.4011758553851389,0.7480728626251221,0.4011758553851389
252,10,AdaBoost (Discrete),1,0.6,0.8219,0.6119795849688163,142.49747943878174,0.6119795849688163
253,10,AdaBoost (Real),1,0.6,0.795,0.6030466098101634,146.77594542503357,0.6030466098101634
254,10,Logistic Regression (Penalty = L2),1,0.6,0.8126,0.4967505825982159,0.3483436107635498,0.4967505825982159
255,10,Naive Bayes,1,0.6,0.6144,0.6593075614965712,0.16622114181518555,0.6593075614965712
256,10,KNeighbors Classifier,2,0.6,0.782,0.5744244596151519,20.108178853988647,0.5744244596151519
257,10,SVC Classifier,2,0.6,0.7788,1.0,57.702107429504395,0.0
258,10,Decision Tree,2,0.6,0.7414,0.5788648651846549,0.5062732696533203,0.5788648651846549
259,10,RandomForest,2,0.6,0.7992,0.3515969651690279,0.6664834022521973,0.3515969651690279
260,10,AdaBoost (Discrete),2,0.6,0.8199,0.571517291251157,128.75293111801147,0.571517291251157
261,10,AdaBoost (Real),2,0.6,0.7939,0.5574376962547324,131.38225436210632,0.5574376962547324
262,10,Logistic Regression (Penalty = L2),2,0.6,0.8076,0.438775983846475,0.3705716133117676,0.438775983846475
263,10,Naive Bayes,2,0.6,0.7567,0.688532538419798,0.14858269691467285,0.688532538419798
264,11,KNeighbors Classifier,0,0.6,0.7727,0.5527727586352638,19.88773775100708,0.5527727586352638
265,11,SVC Classifier,0,0.6,0.7795,0.09014398837291854,63.96837139129639,0.09014398837291854
266,11,Decision Tree,0,0.6,0.7223,0.5604725432051625,0.38504838943481445,0.5604725432051625
267,11,RandomForest,0,0.6,0.8043,0.46877106425961906,0.5094468593597412,0.46877106425961906
268,11,AdaBoost (Discrete),0,0.6,0.8084,0.571432322782713,152.68389463424683,0.571432322782713
269,11,AdaBoost (Real),0,0.6,0.7832,0.561177722992189,148.3147988319397,0.561177722992189
270,11,Logistic Regression (Penalty = L2),0,0.6,0.8053,0.47855158537113107,0.42383885383605957,0.47855158537113107
271,11,Naive Bayes,0,0.6,0.6999,0.669068178875443,0.1643984317779541,0.669068178875443
272,11,KNeighbors Classifier,1,0.6,0.7742,0.5905844630505642,17.750455856323242,0.5905844630505642
273,11,SVC Classifier,1,0.6,0.7788,1.0,52.689087867736816,0.0
274,11,Decision Tree,1,0.6,0.7252,0.5924013010845113,0.3850548267364502,0.5924013010845113
275,11,RandomForest,1,0.6,0.8139,0.5000328542152023,0.5295491218566895,0.5000328542152023
276,11,AdaBoost (Discrete),1,0.6,0.8216,0.6118545082393085,130.56806445121765,0.6118545082393085
277,11,AdaBoost (Real),1,0.6,0.791,0.6001499797999742,119.24797940254211,0.6001499797999742
278,11,Logistic Regression (Penalty = L2),1,0.6,0.8112,0.4930066682155156,0.3761763572692871,0.4930066682155156
279,11,Naive Bayes,1,0.6,0.6219,0.6654425538269252,0.1517200469970703,0.6654425538269252
280,11,KNeighbors Classifier,2,0.6,0.7812,0.5584271325966685,14.724923372268677,0.5584271325966685
281,11,SVC Classifier,2,0.6,0.7788,1.0,48.129212856292725,0.0
282,11,Decision Tree,2,0.6,0.727,0.560805681146536,0.32882022857666016,0.560805681146536
283,11,RandomForest,2,0.6,0.8103,0.45083326282351316,0.4210236072540283,0.45083326282351316
284,11,AdaBoost (Discrete),2,0.6,0.8222,0.571036262961712,116.080641746521,0.571036262961712
285,11,AdaBoost (Real),2,0.6,0.7951,0.5595796787673223,118.14289903640747,0.5595796787673223
286,11,Logistic Regression (Penalty = L2),2,0.6,0.8092,0.45418817824310664,0.28726911544799805,0.45418817824310664
287,11,Naive Bayes,2,0.6,0.7555,0.6903668109526303,0.14068126678466797,0.6903668109526303
288,12,KNeighbors Classifier,0,0.6,0.7754,0.5544959059842633,0.7459602355957031,0.5544959059842633
289,12,SVC Classifier,0,0.6,0.7788,1.0,15.555799722671509,0.0
290,12,Decision Tree,0,0.6,0.8067,0.5278962297076222,0.046195268630981445,0.5278962297076222
291,12,RandomForest,0,0.6,0.8098,0.5374868162767433,0.20016241073608398,0.5374868162767433
292,12,AdaBoost (Discrete),0,0.6,0.808,0.5401004716124015,12.85248589515686,0.5401004716124015
293,12,AdaBoost (Real),0,0.6,0.8083,0.5329128055258378,30.99290156364441,0.5329128055258378
294,12,Logistic Regression (Penalty = L2),0,0.6,0.8033,0.4808728501494443,0.11932539939880371,0.4808728501494443
295,12,Naive Bayes,0,0.6,0.8091,0.5265039313839054,0.03365182876586914,0.5265039313839054
296,12,KNeighbors Classifier,1,0.6,0.7715,0.5765606719283625,0.7936546802520752,0.5765606719283625
297,12,SVC Classifier,1,0.6,0.7788,1.0,15.349618434906006,0.0
298,12,Decision Tree,1,0.6,0.8231,0.5867836163230608,0.07341408729553223,0.5867836163230608
299,12,RandomForest,1,0.6,0.8249,0.5865063598458912,0.2120800018310547,0.5865063598458912
300,12,AdaBoost (Discrete),1,0.6,0.8243,0.5839577141581999,13.727158784866333,0.5839577141581999
301,12,AdaBoost (Real),1,0.6,0.8241,0.5832161802537993,29.504838705062866,0.5832161802537993
302,12,Logistic Regression (Penalty = L2),1,0.6,0.8162,0.5186741436441986,0.07583069801330566,0.5186741436441986
303,12,Naive Bayes,1,0.6,0.8235,0.577636643671305,0.039032936096191406,0.577636643671305
304,12,KNeighbors Classifier,2,0.6,0.7881,0.5614818576181884,0.6806466579437256,0.5614818576181884
305,12,SVC Classifier,2,0.6,0.7788,1.0,11.73327350616455,0.0
306,12,Decision Tree,2,0.6,0.8212,0.5415956065145182,0.044846534729003906,0.5415956065145182
307,12,RandomForest,2,0.6,0.8241,0.5578316001828668,0.1877915859222412,0.5578316001828668
308,12,AdaBoost (Discrete),2,0.6,0.8234,0.5625030862220924,12.256415128707886,0.5625030862220924
309,12,AdaBoost (Real),2,0.6,0.8229,0.5513148333272477,31.021575927734375,0.5513148333272477
310,12,Logistic Regression (Penalty = L2),2,0.6,0.8106,0.4640961168663208,0.07590436935424805,0.4640961168663208
311,12,Naive Bayes,2,0.6,0.8219,0.5444174858660226,0.04435586929321289,0.5444174858660226
