,feat_set_id,classifier,fold_id,feat_th,score,geo_score,exec_t,geo_score_woz
0,0,KNeighbors Classifier,0,0.85,0.7340764331210191,0.8455857904980735,15.796860456466675,0.0
1,0,SVC Classifier,0,0.85,0.7361995753715499,0.873942562614331,21.409459829330444,0.0
2,0,Decision Tree,0,0.85,0.690552016985138,0.7873139423810663,0.2261502742767334,0.0
3,0,RandomForest,0,0.85,0.6884288747346072,0.6995442479477096,0.47176694869995117,0.0
4,0,AdaBoost (Discrete),0,0.85,0.7234607218683652,0.8171667502714705,70.53826785087585,0.0
5,0,AdaBoost (Real),0,0.85,0.3211252653927813,0.31169803187753203,115.02471923828125,0.0
6,0,Logistic Regression (Penalty = L2),0,0.85,0.7367303609341825,0.37182262850934894,1.7214138507843018,0.37182262850934894
7,0,Naive Bayes,0,0.85,0.7107218683651805,0.7702720277511412,0.5110390186309814,0.7702720277511412
8,0,KNeighbors Classifier,1,0.85,0.7777777777777778,0.26077324862933543,21.275606393814087,0.26077324862933543
9,0,SVC Classifier,1,0.85,0.7676767676767676,0.6174804095865509,27.992583751678467,0.0
10,0,Decision Tree,1,0.85,0.7533227006911217,0.6459018199025707,0.3250923156738281,0.0
11,0,RandomForest,1,0.85,0.7698032961190856,0.9975777114203086,0.6542136669158936,0.0
12,0,AdaBoost (Discrete),1,0.85,0.9170653907496013,0.864794995427021,81.21308159828186,0.864794995427021
13,0,AdaBoost (Real),1,0.85,0.7804359383306751,0.9822786963053242,112.33266949653625,0.0
14,0,Logistic Regression (Penalty = L2),1,0.85,0.7666135034556087,0.6169183639901882,1.6468238830566406,0.0
15,0,Naive Bayes,1,0.85,0.8543328017012227,0.9341766402374898,0.4224214553833008,0.9341766402374898
16,0,KNeighbors Classifier,2,0.85,0.3853113358169239,0.2834212963845766,15.083120584487915,0.2834212963845766
17,0,SVC Classifier,2,0.85,0.3571048430015966,0.3455925591338455,10.977240085601807,0.0
18,0,Decision Tree,2,0.85,0.36668440659925494,0.36244731106818096,0.18386077880859375,0.0
19,0,RandomForest,2,0.85,0.30175625332623734,0.18999722543518244,0.5743439197540283,0.0
20,0,AdaBoost (Discrete),2,0.85,0.464608834486429,0.2272413839024291,70.48138809204102,0.2272413839024291
21,0,AdaBoost (Real),2,0.85,0.3677488025545503,0.784611766697512,78.52018594741821,0.0
22,0,Logistic Regression (Penalty = L2),2,0.85,0.3751995742416179,0.36889231476638806,1.1323606967926025,0.0
23,0,Naive Bayes,2,0.85,0.39861628525811604,0.39795049660148546,0.3519899845123291,0.39795049660148546
24,1,KNeighbors Classifier,0,0.85,0.7340764331210191,0.8455857904980735,12.908469200134277,0.0
25,1,SVC Classifier,0,0.85,0.7361995753715499,0.873942562614331,21.019120454788208,0.0
26,1,Decision Tree,0,0.85,0.6969214437367304,0.7928052298517908,0.1930246353149414,0.0
27,1,RandomForest,0,0.85,0.5753715498938429,0.4373263362905365,0.5623757839202881,0.0
28,1,AdaBoost (Discrete),0,0.85,0.7234607218683652,0.8171667502714705,68.76031637191772,0.0
29,1,AdaBoost (Real),0,0.85,0.3619957537154989,0.35011387244385067,78.20992732048035,0.35011387244385067
30,1,Logistic Regression (Penalty = L2),0,0.85,0.7367303609341825,0.37182262850934894,1.3960325717926025,0.37182262850934894
31,1,Naive Bayes,0,0.85,0.7107218683651805,0.7702720277511412,0.36049342155456543,0.7702720277511412
32,1,KNeighbors Classifier,1,0.85,0.7777777777777778,0.26077324862933543,14.543298244476318,0.26077324862933543
33,1,SVC Classifier,1,0.85,0.7682083997873471,0.6177320829257733,20.241842031478882,0.0
34,1,Decision Tree,1,0.85,0.7533227006911217,0.6701208424772659,0.1674516201019287,0.0
35,1,RandomForest,1,0.85,0.7698032961190856,0.9975777114203086,0.4799220561981201,0.0
36,1,AdaBoost (Discrete),1,0.85,0.7947900053163212,0.6772366109985666,57.01320791244507,0.0
37,1,AdaBoost (Real),1,0.85,0.7804359383306751,0.9822786963053242,74.14179944992065,0.0
38,1,Logistic Regression (Penalty = L2),1,0.85,0.7666135034556087,0.6169183639901882,1.4855964183807373,0.0
39,1,Naive Bayes,1,0.85,0.8543328017012227,0.9341766402374898,0.3942556381225586,0.9341766402374898
40,1,KNeighbors Classifier,2,0.85,0.39010111761575306,0.28927121558786156,13.905080795288086,0.28927121558786156
41,1,SVC Classifier,2,0.85,0.35763704097924426,0.34605520143234136,8.948742866516113,0.0
42,1,Decision Tree,2,0.85,0.36668440659925494,0.3283704974480539,0.1585698127746582,0.0
43,1,RandomForest,2,0.85,0.30175625332623734,0.18999722543518244,0.5228722095489502,0.0
44,1,AdaBoost (Discrete),2,0.85,0.4986695050558808,0.35846789179344896,58.32741141319275,0.35846789179344896
45,1,AdaBoost (Real),2,0.85,0.3677488025545503,0.784611766697512,65.80804467201233,0.0
46,1,Logistic Regression (Penalty = L2),2,0.85,0.37360298030867484,0.3677257586636381,1.000652551651001,0.0
47,1,Naive Bayes,2,0.85,0.39861628525811604,0.39795049660148546,0.2983276844024658,0.39795049660148546
48,2,KNeighbors Classifier,0,0.85,0.7335456475583864,0.8578608463003836,11.494147300720215,0.0
49,2,SVC Classifier,0,0.85,0.7330148619957537,0.8200160468857968,17.162276029586792,0.0
50,2,Decision Tree,0,0.85,0.7160297239915074,0.8070406564363437,0.15974020957946777,0.0
51,2,RandomForest,0,0.85,0.6056263269639066,0.616312996689062,0.453092098236084,0.0
52,2,AdaBoost (Discrete),0,0.85,0.7239915074309978,0.60871232306992,56.42766761779785,0.60871232306992
53,2,AdaBoost (Real),0,0.85,0.3619957537154989,0.35011387244385067,63.50331783294678,0.35011387244385067
54,2,Logistic Regression (Penalty = L2),0,0.85,0.7367303609341825,0.37182262850934894,1.0836021900177002,0.37182262850934894
55,2,Naive Bayes,0,0.85,0.7107218683651805,0.7702720277511412,0.2786228656768799,0.7702720277511412
56,2,KNeighbors Classifier,1,0.85,0.772461456671983,0.4736873453235875,12.341185808181763,0.0
57,2,SVC Classifier,1,0.85,0.7682083997873471,0.6177320829257733,16.512529134750366,0.0
58,2,Decision Tree,1,0.85,0.7533227006911217,0.6757324654416789,0.1298508644104004,0.0
59,2,RandomForest,1,0.85,0.6198830409356725,0.7654367411871029,0.32228755950927734,0.0
60,2,AdaBoost (Discrete),1,0.85,0.8341307814992025,0.6040359458433461,42.90282917022705,0.6040359458433461
61,2,AdaBoost (Real),1,0.85,0.7804359383306751,0.9822786963053242,52.56942009925842,0.0
62,2,Logistic Regression (Penalty = L2),1,0.85,0.7666135034556087,0.6169183639901882,0.9909472465515137,0.0
63,2,Naive Bayes,1,0.85,0.8543328017012227,0.9341766402374898,0.2341451644897461,0.9341766402374898
64,2,KNeighbors Classifier,2,0.85,0.38105375199574243,0.20975517245694608,8.350018739700317,0.20975517245694608
65,2,SVC Classifier,2,0.85,0.3608302288451304,0.34887700386772735,6.696361780166626,0.0
66,2,Decision Tree,2,0.85,0.4092602448110697,0.4490270523491106,0.09656167030334473,0.0
67,2,RandomForest,2,0.85,0.3081426290580096,0.19184646306324216,0.3156123161315918,0.0
68,2,AdaBoost (Discrete),2,0.85,0.46726982437466735,0.25585014292474667,37.94712734222412,0.25585014292474667
69,2,AdaBoost (Real),2,0.85,0.3677488025545503,0.784611766697512,47.842047929763794,0.0
70,2,Logistic Regression (Penalty = L2),2,0.85,0.37573177221926557,0.3696792591096666,0.7239589691162109,0.0
71,2,Naive Bayes,2,0.85,0.39861628525811604,0.39795049660148546,0.2647585868835449,0.39795049660148546
72,3,KNeighbors Classifier,0,0.85,0.7340764331210191,0.8455857904980735,8.318352937698364,0.0
73,3,SVC Classifier,0,0.85,0.7330148619957537,0.8200160468857968,12.856508493423462,0.0
74,3,Decision Tree,0,0.85,0.6778131634819533,0.7949742642997503,0.1316053867340088,0.0
75,3,RandomForest,0,0.85,0.5955414012738853,0.6888735700719336,0.2819554805755615,0.0
76,3,AdaBoost (Discrete),0,0.85,0.7234607218683652,0.8171667502714705,37.35627460479736,0.0
77,3,AdaBoost (Real),0,0.85,0.3211252653927813,0.31169803187753203,44.23892545700073,0.0
78,3,Logistic Regression (Penalty = L2),0,0.85,0.7367303609341825,0.37182262850934894,0.8978369235992432,0.37182262850934894
79,3,Naive Bayes,0,0.85,0.7048832271762208,0.7681934867237953,0.1898658275604248,0.7681934867237953
80,3,KNeighbors Classifier,1,0.85,0.7777777777777778,0.26077324862933543,8.159646272659302,0.26077324862933543
81,3,SVC Classifier,1,0.85,0.7682083997873471,0.6177320829257733,11.863431930541992,0.0
82,3,Decision Tree,1,0.85,0.7533227006911217,0.6811879228967573,0.11693596839904785,0.0
83,3,RandomForest,1,0.85,0.6140350877192983,0.7475540125430334,0.28403520584106445,0.0
84,3,AdaBoost (Discrete),1,0.85,0.7947900053163212,0.6772366109985666,36.567206621170044,0.0
85,3,AdaBoost (Real),1,0.85,0.7804359383306751,0.9822786963053242,49.013222455978394,0.0
86,3,Logistic Regression (Penalty = L2),1,0.85,0.7671451355661882,0.6171710441021402,0.9627354145050049,0.0
87,3,Naive Bayes,1,0.85,0.7687400318979266,0.8909736327324904,0.21500420570373535,0.8909736327324904
88,3,KNeighbors Classifier,2,0.85,0.39010111761575306,0.28368916600704835,8.298532724380493,0.28368916600704835
89,3,SVC Classifier,2,0.85,0.3571048430015966,0.3455925591338455,5.646152973175049,0.0
90,3,Decision Tree,2,0.85,0.3709419904204364,0.3286110181216786,0.08465766906738281,0.0
91,3,RandomForest,2,0.85,0.30175625332623734,0.18999722543518244,0.25316929817199707,0.0
92,3,AdaBoost (Discrete),2,0.85,0.464608834486429,0.2272413839024291,33.46404671669006,0.2272413839024291
93,3,AdaBoost (Real),2,0.85,0.3677488025545503,0.784611766697512,41.6955680847168,0.0
94,3,Logistic Regression (Penalty = L2),2,0.85,0.3746673762639702,0.36870768388569314,0.7692863941192627,0.0
95,3,Naive Bayes,2,0.85,0.39648749334752525,0.39725659245376743,0.22840023040771484,0.39725659245376743
96,4,KNeighbors Classifier,0,0.85,0.7340764331210191,0.8455857904980735,7.325992107391357,0.0
97,4,SVC Classifier,0,0.85,0.7361995753715499,0.873942562614331,10.55783748626709,0.0
98,4,Decision Tree,0,0.85,0.7282377919320594,0.8103713232920771,0.08981871604919434,0.0
99,4,RandomForest,0,0.85,0.6109341825902336,0.5155874991678422,0.2746007442474365,0.0
100,4,AdaBoost (Discrete),0,0.85,0.7234607218683652,0.8171667502714705,36.28546118736267,0.0
101,4,AdaBoost (Real),0,0.85,0.3619957537154989,0.35011387244385067,45.62120056152344,0.35011387244385067
102,4,Logistic Regression (Penalty = L2),0,0.85,0.7367303609341825,0.37182262850934894,0.8838551044464111,0.37182262850934894
103,4,Naive Bayes,0,0.85,0.7107218683651805,0.7702720277511412,0.20706462860107422,0.7702720277511412
104,4,KNeighbors Classifier,1,0.85,0.7777777777777778,0.26077324862933543,9.443484783172607,0.26077324862933543
105,4,SVC Classifier,1,0.85,0.7676767676767676,0.6174804095865509,13.008927822113037,0.0
106,4,Decision Tree,1,0.85,0.7533227006911217,0.28446255034545576,0.13889145851135254,0.0
107,4,RandomForest,1,0.85,0.6012759170653907,0.7361257624581378,0.3207206726074219,0.0
108,4,AdaBoost (Discrete),1,0.85,0.9170653907496013,0.864794995427021,38.28491020202637,0.864794995427021
109,4,AdaBoost (Real),1,0.85,0.7804359383306751,0.9822786963053242,38.335968017578125,0.0
110,4,Logistic Regression (Penalty = L2),1,0.85,0.7666135034556087,0.6169183639901882,0.6915302276611328,0.0
111,4,Naive Bayes,1,0.85,0.8995215311004785,0.9534804824078693,0.1966261863708496,0.9534804824078693
112,4,KNeighbors Classifier,2,0.85,0.39010111761575306,0.28927121558786156,6.01324987411499,0.28927121558786156
113,4,SVC Classifier,2,0.85,0.35763704097924426,0.34605520143234136,4.61033296585083,0.0
114,4,Decision Tree,2,0.85,0.3943587014369345,0.48307402569896474,0.07227373123168945,0.0
115,4,RandomForest,2,0.85,0.30175625332623734,0.18999722543518244,0.23819375038146973,0.0
116,4,AdaBoost (Discrete),2,0.85,0.4981373070782331,0.3570970190906262,28.443190336227417,0.3570970190906262
117,4,AdaBoost (Real),2,0.85,0.3677488025545503,0.784611766697512,35.59653615951538,0.0
118,4,Logistic Regression (Penalty = L2),2,0.85,0.37360298030867484,0.3677257586636381,0.5623116493225098,0.0
119,4,Naive Bayes,2,0.85,0.39861628525811604,0.39795049660148546,0.17295145988464355,0.39795049660148546
120,5,KNeighbors Classifier,0,0.85,0.7330148619957537,0.8576520193899695,6.0829315185546875,0.0
121,5,SVC Classifier,0,0.85,0.7330148619957537,0.8200160468857968,9.704610586166382,0.0
122,5,Decision Tree,0,0.85,0.7287685774946921,0.8104829487734415,0.09610152244567871,0.0
123,5,RandomForest,0,0.85,0.5509554140127388,0.601514915289286,0.28301572799682617,0.0
124,5,AdaBoost (Discrete),0,0.85,0.7892781316348195,0.7337050630570238,34.97221875190735,0.0
125,5,AdaBoost (Real),0,0.85,0.3619957537154989,0.35011387244385067,41.18777108192444,0.35011387244385067
126,5,Logistic Regression (Penalty = L2),0,0.85,0.7367303609341825,0.37214369183441376,0.728184700012207,0.37214369183441376
127,5,Naive Bayes,0,0.85,0.7107218683651805,0.7702720277511412,0.16938018798828125,0.7702720277511412
128,5,KNeighbors Classifier,1,0.85,0.772461456671983,0.4736873453235875,7.80426287651062,0.0
129,5,SVC Classifier,1,0.85,0.7676767676767676,0.6174804095865509,11.736379384994507,0.0
130,5,Decision Tree,1,0.85,0.7533227006911217,0.6864960793070313,0.1005256175994873,0.0
131,5,RandomForest,1,0.85,0.7698032961190856,0.9975777114203086,0.2593824863433838,0.0
132,5,AdaBoost (Discrete),1,0.85,0.7740563530037214,0.7536251730360297,35.04301047325134,0.0
133,5,AdaBoost (Real),1,0.85,0.7804359383306751,0.9822786963053242,43.05431270599365,0.0
134,5,Logistic Regression (Penalty = L2),1,0.85,0.7666135034556087,0.6169183639901882,0.7551991939544678,0.0
135,5,Naive Bayes,1,0.85,0.8543328017012227,0.9341766402374898,0.22238874435424805,0.9341766402374898
136,5,KNeighbors Classifier,2,0.85,0.38105375199574243,0.20975517245694608,7.200487852096558,0.20975517245694608
137,5,SVC Classifier,2,0.85,0.3608302288451304,0.34887700386772735,5.461307525634766,0.0
138,5,Decision Tree,2,0.85,0.3714741883980841,0.3929591789600603,0.10083699226379395,0.0
139,5,RandomForest,2,0.85,0.30175625332623734,0.18999722543518244,0.31135058403015137,0.0
140,5,AdaBoost (Discrete),2,0.85,0.4715274081958489,0.25635156968883627,33.6724591255188,0.25635156968883627
141,5,AdaBoost (Real),2,0.85,0.3677488025545503,0.784611766697512,40.44703650474548,0.0
142,5,Logistic Regression (Penalty = L2),2,0.85,0.37573177221926557,0.3696792591096666,0.657243013381958,0.0
143,5,Naive Bayes,2,0.85,0.39861628525811604,0.39795049660148546,0.21952366828918457,0.39795049660148546
144,6,KNeighbors Classifier,0,0.85,0.7340764331210191,0.8455857904980735,7.260601758956909,0.0
145,6,SVC Classifier,0,0.85,0.7330148619957537,0.8200160468857968,10.456559896469116,0.0
146,6,Decision Tree,0,0.85,0.7032908704883227,0.7941761661647446,0.09956860542297363,0.0
147,6,RandomForest,0,0.85,0.5981953290870489,0.6909553927994988,0.2580385208129883,0.0
148,6,AdaBoost (Discrete),0,0.85,0.7234607218683652,0.8171667502714705,35.54989314079285,0.0
149,6,AdaBoost (Real),0,0.85,0.3619957537154989,0.35011387244385067,39.935036420822144,0.35011387244385067
150,6,Logistic Regression (Penalty = L2),0,0.85,0.7367303609341825,0.37182262850934894,0.7557449340820312,0.37182262850934894
151,6,Naive Bayes,0,0.85,0.7048832271762208,0.7681934867237953,0.19593596458435059,0.7681934867237953
152,6,KNeighbors Classifier,1,0.85,0.7777777777777778,0.26077324862933543,8.291077136993408,0.26077324862933543
153,6,SVC Classifier,1,0.85,0.7676767676767676,0.6174804095865509,11.483038187026978,0.0
154,6,Decision Tree,1,0.85,0.7533227006911217,0.6701208424772659,0.07472920417785645,0.0
155,6,RandomForest,1,0.85,0.7698032961190856,0.9975777114203086,0.2863798141479492,0.0
156,6,AdaBoost (Discrete),1,0.85,0.9170653907496013,0.864794995427021,34.2901828289032,0.864794995427021
157,6,AdaBoost (Real),1,0.85,0.7804359383306751,0.9822786963053242,39.95750379562378,0.0
158,6,Logistic Regression (Penalty = L2),1,0.85,0.7666135034556087,0.6169183639901882,0.7320921421051025,0.0
159,6,Naive Bayes,1,0.85,0.8830409356725146,0.9466665343897888,0.17030858993530273,0.9466665343897888
160,6,KNeighbors Classifier,2,0.85,0.39010111761575306,0.28368916600704835,5.7414305210113525,0.28368916600704835
161,6,SVC Classifier,2,0.85,0.3571048430015966,0.3455925591338455,4.56836199760437,0.0
162,6,Decision Tree,2,0.85,0.3943587014369345,0.482551113141012,0.07969927787780762,0.0
163,6,RandomForest,2,0.85,0.31133581692389567,0.2624716268879497,0.25615906715393066,0.0
164,6,AdaBoost (Discrete),2,0.85,0.464608834486429,0.2272413839024291,34.61363220214844,0.2272413839024291
165,6,AdaBoost (Real),2,0.85,0.3677488025545503,0.784611766697512,37.749465465545654,0.0
166,6,Logistic Regression (Penalty = L2),2,0.85,0.3746673762639702,0.36870768388569314,0.7435703277587891,0.0
167,6,Naive Bayes,2,0.85,0.39648749334752525,0.39725659245376743,0.22390460968017578,0.39725659245376743
168,7,KNeighbors Classifier,0,0.85,0.7335456475583864,0.8578608463003836,6.197273254394531,0.0
169,7,SVC Classifier,0,0.85,0.7330148619957537,0.8200160468857968,9.004436016082764,0.0
170,7,Decision Tree,0,0.85,0.6725053078556263,0.7707904874981262,0.08072161674499512,0.0
171,7,RandomForest,0,0.85,0.5981953290870489,0.6909553927994988,0.2436833381652832,0.0
172,7,AdaBoost (Discrete),0,0.85,0.7494692144373672,0.6147784526664405,32.57152342796326,0.6147784526664405
173,7,AdaBoost (Real),0,0.85,0.3211252653927813,0.31169803187753203,34.38537621498108,0.0
174,7,Logistic Regression (Penalty = L2),0,0.85,0.7367303609341825,0.37182262850934894,0.6256699562072754,0.37182262850934894
175,7,Naive Bayes,0,0.85,0.7107218683651805,0.7702720277511412,0.2227621078491211,0.7702720277511412
176,7,KNeighbors Classifier,1,0.85,0.7729930887825625,0.47384726681355627,6.050764799118042,0.0
177,7,SVC Classifier,1,0.85,0.7682083997873471,0.6177320829257733,9.186512231826782,0.0
178,7,Decision Tree,1,0.85,0.7533227006911217,0.6967021597961968,0.0731503963470459,0.0
179,7,RandomForest,1,0.85,0.7698032961190856,0.9975777114203086,0.2175757884979248,0.0
180,7,AdaBoost (Discrete),1,0.85,0.8341307814992025,0.6040359458433461,26.077301502227783,0.6040359458433461
181,7,AdaBoost (Real),1,0.85,0.7804359383306751,0.9822786963053242,32.48920702934265,0.0
182,7,Logistic Regression (Penalty = L2),1,0.85,0.7666135034556087,0.6169183639901882,0.6109297275543213,0.0
183,7,Naive Bayes,1,0.85,0.8851674641148325,0.9475596183432052,0.19389605522155762,0.9475596183432052
184,7,KNeighbors Classifier,2,0.85,0.38211814795103777,0.209920529613047,5.4755542278289795,0.209920529613047
185,7,SVC Classifier,2,0.85,0.3613624268227781,0.34934093769341623,4.2064549922943115,0.0
186,7,Decision Tree,2,0.85,0.38265034592868546,0.44049347465000144,0.038156747817993164,0.0
187,7,RandomForest,2,0.85,0.320915380521554,0.3083062412348097,0.18773913383483887,0.0
188,7,AdaBoost (Discrete),2,0.85,0.4741883980840873,0.30884864603165574,25.874380350112915,0.30884864603165574
189,7,AdaBoost (Real),2,0.85,0.3677488025545503,0.784611766697512,29.272878646850586,0.0
190,7,Logistic Regression (Penalty = L2),2,0.85,0.37573177221926557,0.3696792591096666,0.5308773517608643,0.0
191,7,Naive Bayes,2,0.85,0.39861628525811604,0.39795049660148546,0.18154573440551758,0.39795049660148546
192,8,KNeighbors Classifier,0,0.85,0.7340764331210191,0.8455857904980735,5.807353973388672,0.0
193,8,SVC Classifier,0,0.85,0.7356687898089171,0.8658491074288679,8.31204342842102,0.0
194,8,Decision Tree,0,0.85,0.6778131634819533,0.7909906584734148,0.05956125259399414,0.0
195,8,RandomForest,0,0.85,0.6587048832271762,0.5448134730106471,0.2214646339416504,0.0
196,8,AdaBoost (Discrete),0,0.85,0.7234607218683652,0.8171667502714705,25.82176661491394,0.0
197,8,AdaBoost (Real),0,0.85,0.3211252653927813,0.31169803187753203,29.207868099212646,0.0
198,8,Logistic Regression (Penalty = L2),0,0.85,0.7367303609341825,0.37182262850934894,0.49774956703186035,0.37182262850934894
199,8,Naive Bayes,0,0.85,0.7048832271762208,0.7681934867237953,0.17747259140014648,0.7681934867237953
200,8,KNeighbors Classifier,1,0.85,0.7777777777777778,0.26077324862933543,5.472493886947632,0.26077324862933543
201,8,SVC Classifier,1,0.85,0.7682083997873471,0.6177320829257733,8.453640699386597,0.0
202,8,Decision Tree,1,0.85,0.7533227006911217,0.6701208424772659,0.06135082244873047,0.0
203,8,RandomForest,1,0.85,0.7698032961190856,0.9975777114203086,0.19382452964782715,0.0
204,8,AdaBoost (Discrete),1,0.85,0.7947900053163212,0.6772366109985666,26.929525136947632,0.0
205,8,AdaBoost (Real),1,0.85,0.7804359383306751,0.9822786963053242,31.6022732257843,0.0
206,8,Logistic Regression (Penalty = L2),1,0.85,0.7666135034556087,0.6169183639901882,0.5384447574615479,0.0
207,8,Naive Bayes,1,0.85,0.8825093035619351,0.9464426037714792,0.13176202774047852,0.9464426037714792
208,8,KNeighbors Classifier,2,0.85,0.39010111761575306,0.28368916600704835,4.992055654525757,0.28368916600704835
209,8,SVC Classifier,2,0.85,0.35763704097924426,0.34605520143234136,3.574090003967285,0.0
210,8,Decision Tree,2,0.85,0.37626397019691327,0.399426504957969,0.03567218780517578,0.0
211,8,RandomForest,2,0.85,0.30175625332623734,0.18999722543518244,0.16340875625610352,0.0
212,8,AdaBoost (Discrete),2,0.85,0.4981373070782331,0.3570970190906262,22.47452449798584,0.3570970190906262
213,8,AdaBoost (Real),2,0.85,0.3677488025545503,0.784611766697512,27.0880389213562,0.0
214,8,Logistic Regression (Penalty = L2),2,0.85,0.37360298030867484,0.3677257586636381,0.4304385185241699,0.0
215,8,Naive Bayes,2,0.85,0.39648749334752525,0.39725659245376743,0.1496446132659912,0.39725659245376743
216,9,KNeighbors Classifier,0,0.85,0.7335456475583864,0.8578608463003836,4.576782464981079,0.0
217,9,SVC Classifier,0,0.85,0.7330148619957537,0.8200160468857968,6.807842254638672,0.0
218,9,Decision Tree,0,0.85,0.6778131634819533,0.7877455345832637,0.039550065994262695,0.0
219,9,RandomForest,0,0.85,0.5636942675159236,0.6103938443016036,0.18917417526245117,0.0
220,9,AdaBoost (Discrete),0,0.85,0.7494692144373672,0.6147784526664405,19.825239181518555,0.6147784526664405
221,9,AdaBoost (Real),0,0.85,0.3211252653927813,0.31169803187753203,26.35242462158203,0.0
222,9,Logistic Regression (Penalty = L2),0,0.85,0.7367303609341825,0.37182262850934894,0.48783111572265625,0.37182262850934894
223,9,Naive Bayes,0,0.85,0.7048832271762208,0.7681934867237953,0.16223907470703125,0.7681934867237953
224,9,KNeighbors Classifier,1,0.85,0.772461456671983,0.4736873453235875,5.107057332992554,0.0
225,9,SVC Classifier,1,0.85,0.7682083997873471,0.6177320829257733,7.5688652992248535,0.0
226,9,Decision Tree,1,0.85,0.7533227006911217,0.6522463617222266,0.05426526069641113,0.0
227,9,RandomForest,1,0.85,0.7501329080276449,0.9756358042955093,0.16214847564697266,0.0
228,9,AdaBoost (Discrete),1,0.85,0.8341307814992025,0.6040359458433461,21.639650583267212,0.6040359458433461
229,9,AdaBoost (Real),1,0.85,0.7804359383306751,0.9822786963053242,27.10005021095276,0.0
230,9,Logistic Regression (Penalty = L2),1,0.85,0.7666135034556087,0.6169183639901882,0.5067422389984131,0.0
231,9,Naive Bayes,1,0.85,0.8681552365762892,0.9402938954276688,0.1746664047241211,0.9402938954276688
232,9,KNeighbors Classifier,2,0.85,0.38211814795103777,0.209920529613047,4.070379257202148,0.209920529613047
233,9,SVC Classifier,2,0.85,0.35923363491218735,0.3465714471914997,3.500208854675293,0.0
234,9,Decision Tree,2,0.85,0.3943587014369345,0.49025793842441806,0.06214332580566406,0.0
235,9,RandomForest,2,0.85,0.30175625332623734,0.1920633718646669,0.19154596328735352,0.0
236,9,AdaBoost (Discrete),2,0.85,0.46726982437466735,0.25585014292474667,20.590351104736328,0.25585014292474667
237,9,AdaBoost (Real),2,0.85,0.3677488025545503,0.784611766697512,25.746468544006348,0.0
238,9,Logistic Regression (Penalty = L2),2,0.85,0.37573177221926557,0.3696792591096666,0.416259765625,0.0
239,9,Naive Bayes,2,0.85,0.39648749334752525,0.39725659245376743,0.18583226203918457,0.39725659245376743
240,10,KNeighbors Classifier,0,0.85,0.7340764331210191,0.8455857904980735,5.191119194030762,0.0
241,10,SVC Classifier,0,0.85,0.7346072186836518,0.8486899801791715,6.810863018035889,0.0
242,10,Decision Tree,0,0.85,0.6990445859872612,0.5185579810749824,0.09011960029602051,0.5185579810749824
243,10,RandomForest,0,0.85,0.5711252653927813,0.6286185570937122,0.21478676795959473,0.0
244,10,AdaBoost (Discrete),0,0.85,0.7234607218683652,0.8171667502714705,23.133649826049805,0.0
245,10,AdaBoost (Real),0,0.85,0.3211252653927813,0.31169803187753203,27.592389345169067,0.0
246,10,Logistic Regression (Penalty = L2),0,0.85,0.7367303609341825,0.37182262850934894,0.40671753883361816,0.37182262850934894
247,10,Naive Bayes,0,0.85,0.6549893842887473,0.7491714245637258,0.12691116333007812,0.7491714245637258
248,10,KNeighbors Classifier,1,0.85,0.7777777777777778,0.26077324862933543,5.15265417098999,0.26077324862933543
249,10,SVC Classifier,1,0.85,0.7676767676767676,0.6174804095865509,7.0463175773620605,0.0
250,10,Decision Tree,1,0.85,0.7533227006911217,0.6255005561249454,0.049445152282714844,0.0
251,10,RandomForest,1,0.85,0.7666135034556087,0.9927154028057296,0.1360487937927246,0.0
252,10,AdaBoost (Discrete),1,0.85,0.7947900053163212,0.6772366109985666,22.260719299316406,0.0
253,10,AdaBoost (Real),1,0.85,0.7804359383306751,0.9822786963053242,27.57147789001465,0.0
254,10,Logistic Regression (Penalty = L2),1,0.85,0.7666135034556087,0.6169183639901882,0.31202220916748047,0.0
255,10,Naive Bayes,1,0.85,0.8543328017012227,0.9341766402374898,0.1409604549407959,0.9341766402374898
256,10,KNeighbors Classifier,2,0.85,0.39116551357104845,0.28949450521974507,4.157953977584839,0.28949450521974507
257,10,SVC Classifier,2,0.85,0.3571048430015966,0.3455925591338455,3.312530755996704,0.0
258,10,Decision Tree,2,0.85,0.39010111761575306,0.4322010441478576,0.06578850746154785,0.0
259,10,RandomForest,2,0.85,0.300691857370942,0.18968549850051417,0.20917773246765137,0.0
260,10,AdaBoost (Discrete),2,0.85,0.464608834486429,0.2272413839024291,20.99734115600586,0.2272413839024291
261,10,AdaBoost (Real),2,0.85,0.3677488025545503,0.784611766697512,23.704951763153076,0.0
262,10,Logistic Regression (Penalty = L2),2,0.85,0.3751995742416179,0.3691947498960924,0.3738076686859131,0.0
263,10,Naive Bayes,2,0.85,0.39861628525811604,0.39795049660148546,0.177703857421875,0.39795049660148546
264,11,KNeighbors Classifier,0,0.85,0.7340764331210191,0.8455857904980735,4.629496097564697,0.0
265,11,SVC Classifier,0,0.85,0.7346072186836518,0.8486899801791715,6.256492614746094,0.0
266,11,Decision Tree,0,0.85,0.6778131634819533,0.7779477619345645,0.04647016525268555,0.0
267,11,RandomForest,0,0.85,0.5981953290870489,0.6909553927994988,0.16700506210327148,0.0
268,11,AdaBoost (Discrete),0,0.85,0.7234607218683652,0.8171667502714705,20.94740319252014,0.0
269,11,AdaBoost (Real),0,0.85,0.3211252653927813,0.31169803187753203,23.451993227005005,0.0
270,11,Logistic Regression (Penalty = L2),0,0.85,0.7367303609341825,0.37182262850934894,0.45494556427001953,0.37182262850934894
271,11,Naive Bayes,0,0.85,0.6358811040339702,0.7411988693440721,0.15200018882751465,0.7411988693440721
272,11,KNeighbors Classifier,1,0.85,0.7777777777777778,0.26077324862933543,4.694270849227905,0.26077324862933543
273,11,SVC Classifier,1,0.85,0.7676767676767676,0.6174804095865509,6.396273612976074,0.0
274,11,Decision Tree,1,0.85,0.7533227006911217,0.6643433090254673,0.07185959815979004,0.0
275,11,RandomForest,1,0.85,0.7501329080276449,0.9756358042955093,0.13750052452087402,0.0
276,11,AdaBoost (Discrete),1,0.85,0.7947900053163212,0.6772366109985666,18.485756874084473,0.0
277,11,AdaBoost (Real),1,0.85,0.7804359383306751,0.9822786963053242,20.823814868927002,0.0
278,11,Logistic Regression (Penalty = L2),1,0.85,0.7666135034556087,0.6169183639901882,0.32937192916870117,0.0
279,11,Naive Bayes,1,0.85,0.8543328017012227,0.9341766402374898,0.07685017585754395,0.9341766402374898
280,11,KNeighbors Classifier,2,0.85,0.3853113358169239,0.2834212963845766,3.2808921337127686,0.2834212963845766
281,11,SVC Classifier,2,0.85,0.3571048430015966,0.3455925591338455,2.2769534587860107,0.0
282,11,Decision Tree,2,0.85,0.36668440659925494,0.32903024258124014,0.037429094314575195,0.0
283,11,RandomForest,2,0.85,0.3001596593932943,0.18952925007848817,0.12737584114074707,0.0
284,11,AdaBoost (Discrete),2,0.85,0.464608834486429,0.2272413839024291,16.219009160995483,0.2272413839024291
285,11,AdaBoost (Real),2,0.85,0.3677488025545503,0.784611766697512,20.249223470687866,0.0
286,11,Logistic Regression (Penalty = L2),2,0.85,0.3751995742416179,0.36889231476638806,0.28347206115722656,0.0
287,11,Naive Bayes,2,0.85,0.39861628525811604,0.39795049660148546,0.07605314254760742,0.39795049660148546
288,12,KNeighbors Classifier,0,0.85,0.7335456475583864,0.8578608463003836,3.0731122493743896,0.0
289,12,SVC Classifier,0,0.85,0.7330148619957537,0.8200160468857968,4.103305101394653,0.0
290,12,Decision Tree,0,0.85,0.7266454352441614,0.8073293099708975,0.02992701530456543,0.0
291,12,RandomForest,0,0.85,0.5636942675159236,0.6103938443016036,0.16273069381713867,0.0
292,12,AdaBoost (Discrete),0,0.85,0.7638004246284501,0.7250261380166206,13.755632877349854,0.0
293,12,AdaBoost (Real),0,0.85,0.3211252653927813,0.31169803187753203,15.635514259338379,0.0
294,12,Logistic Regression (Penalty = L2),0,0.85,0.7367303609341825,0.3724601860738774,0.238433837890625,0.3724601860738774
295,12,Naive Bayes,0,0.85,0.7048832271762208,0.7681934867237953,0.06312155723571777,0.7681934867237953
296,12,KNeighbors Classifier,1,0.85,0.7729930887825625,0.47384726681355627,2.6136417388916016,0.0
297,12,SVC Classifier,1,0.85,0.7682083997873471,0.6177320829257733,4.0183892250061035,0.0
298,12,Decision Tree,1,0.85,0.7533227006911217,0.6325465240991146,0.046492815017700195,0.0
299,12,RandomForest,1,0.85,0.7698032961190856,0.9975777114203086,0.14104938507080078,0.0
300,12,AdaBoost (Discrete),1,0.85,0.7740563530037214,0.7536251730360297,12.570190191268921,0.0
301,12,AdaBoost (Real),1,0.85,0.7804359383306751,0.9822786963053242,15.888869762420654,0.0
302,12,Logistic Regression (Penalty = L2),1,0.85,0.7666135034556087,0.6169183639901882,0.19413137435913086,0.0
303,12,Naive Bayes,1,0.85,0.9027113237639554,0.9547715935495825,0.08196020126342773,0.9547715935495825
304,12,KNeighbors Classifier,2,0.85,0.38211814795103777,0.209920529613047,2.2197248935699463,0.209920529613047
305,12,SVC Classifier,2,0.85,0.359765832889835,0.3470323151065172,2.19563889503479,0.0
306,12,Decision Tree,2,0.85,0.3709419904204364,0.32681422671106314,0.03782057762145996,0.0
307,12,RandomForest,2,0.85,0.3219797764768494,0.18359847206222624,0.11725640296936035,0.0
308,12,AdaBoost (Discrete),2,0.85,0.4741883980840873,0.30884864603165574,12.78858208656311,0.30884864603165574
309,12,AdaBoost (Real),2,0.85,0.3677488025545503,0.784611766697512,14.720856666564941,0.0
310,12,Logistic Regression (Penalty = L2),2,0.85,0.37573177221926557,0.3696792591096666,0.2165975570678711,0.0
311,12,Naive Bayes,2,0.85,0.39648749334752525,0.39725659245376743,0.07772159576416016,0.39725659245376743
