,feat_set_id,classifier,fold_id,feat_th,score,geo_score,exec_t,geo_score_woz
0,0,KNeighbors Classifier,0,0.35,0.7647058823529411,0.3051845274712292,0.19876432418823242,0.0
1,0,SVC Classifier,0,0.35,0.7607843137254902,1.0,0.32624316215515137,0.0
2,0,Decision Tree,0,0.35,0.7686274509803922,0.3261165666552968,0.09891057014465332,0.0
3,0,RandomForest,0,0.35,0.7607843137254902,1.0,0.8162250518798828,0.0
4,0,AdaBoost (Discrete),0,0.35,0.7686274509803922,0.3261165666552968,44.48989725112915,0.0
5,0,AdaBoost (Real),0,0.35,0.7254901960784313,0.3339672614790544,68.4499683380127,0.0
6,0,Logistic Regression (Penalty = L2),0,0.35,0.7686274509803922,0.3261165666552968,0.3361246585845947,0.0
7,0,Naive Bayes,0,0.35,0.058823529411764705,0.4641588833612779,0.17563748359680176,0.0
8,0,KNeighbors Classifier,1,0.35,0.78,0.32127586985818757,0.2873814105987549,0.0
9,0,SVC Classifier,1,0.35,0.776,1.0,0.2819221019744873,0.0
10,0,Decision Tree,1,0.35,0.796,0.3760603093086394,0.002028226852416992,0.0
11,0,RandomForest,1,0.35,0.776,1.0,0.5455493927001953,0.0
12,0,AdaBoost (Discrete),1,0.35,0.792,0.49324241486609405,39.14482092857361,0.0
13,0,AdaBoost (Real),1,0.35,0.74,0.3902587920470759,48.85300326347351,0.0
14,0,Logistic Regression (Penalty = L2),1,0.35,0.78,0.32127586985818757,0.3864617347717285,0.0
15,0,Naive Bayes,1,0.35,0.052,0.47428812195586234,0.25612711906433105,0.0
16,0,KNeighbors Classifier,2,0.35,0.8065843621399177,0.43603844046495843,0.2636384963989258,0.0
17,0,SVC Classifier,2,0.35,0.7983539094650206,1.0,0.2560586929321289,0.0
18,0,Decision Tree,2,0.35,0.7983539094650206,0.4488613467085362,0.1261005401611328,0.0
19,0,RandomForest,2,0.35,0.7901234567901234,0.6997790520224827,1.0274453163146973,0.0
20,0,AdaBoost (Discrete),2,0.35,0.7942386831275721,0.4482664330796787,49.80728363990784,0.0
21,0,AdaBoost (Real),2,0.35,0.7448559670781894,0.5337527128091236,63.113791942596436,0.0
22,0,Logistic Regression (Penalty = L2),2,0.35,0.8024691358024691,0.44945390423181414,0.3278207778930664,0.0
23,0,Naive Bayes,2,0.35,0.04938271604938271,0.7825422900366437,0.2390751838684082,0.0
24,1,KNeighbors Classifier,0,0.35,0.792156862745098,0.6426280768968415,0.3574180603027344,0.0
25,1,SVC Classifier,0,0.35,0.7607843137254902,1.0,0.23967623710632324,0.0
26,1,Decision Tree,0,0.35,0.8,0.5320540565702795,0.11841583251953125,0.0
27,1,RandomForest,0,0.35,0.7607843137254902,1.0,0.8402645587921143,0.0
28,1,AdaBoost (Discrete),0,0.35,0.7333333333333333,0.4451350517973486,47.95724868774414,0.0
29,1,AdaBoost (Real),0,0.35,0.7058823529411765,0.5051023932249066,63.9339075088501,0.0
30,1,Logistic Regression (Penalty = L2),0,0.35,0.7607843137254902,0.446059493974681,0.3704705238342285,0.0
31,1,Naive Bayes,0,0.35,0.08235294117647059,0.2508096999745844,0.12586522102355957,0.0
32,1,KNeighbors Classifier,1,0.35,0.768,0.8649819079870731,0.2465817928314209,0.0
33,1,SVC Classifier,1,0.35,0.776,1.0,0.244553804397583,0.0
34,1,Decision Tree,1,0.35,0.696,0.6343431055017867,0.0024530887603759766,0.0
35,1,RandomForest,1,0.35,0.776,1.0,0.8658294677734375,0.0
36,1,AdaBoost (Discrete),1,0.35,0.636,0.5281944144774786,48.61789131164551,0.0
37,1,AdaBoost (Real),1,0.35,0.728,0.49520641835417056,82.12226295471191,0.0
38,1,Logistic Regression (Penalty = L2),1,0.35,0.78,0.34140655617640037,0.36003851890563965,0.0
39,1,Naive Bayes,1,0.35,0.056,0.20859155250247424,0.24025487899780273,0.0
40,1,KNeighbors Classifier,2,0.35,0.7325102880658436,0.7571285357250909,0.35953354835510254,0.0
41,1,SVC Classifier,2,0.35,0.7983539094650206,1.0,0.23666667938232422,0.0
42,1,Decision Tree,2,0.35,0.7777777777777778,0.8241482226063539,0.0014524459838867188,0.0
43,1,RandomForest,2,0.35,0.7983539094650206,1.0,0.7316467761993408,0.0
44,1,AdaBoost (Discrete),2,0.35,0.6995884773662552,0.6117284177111479,47.64720702171326,0.0
45,1,AdaBoost (Real),2,0.35,0.7325102880658436,0.6673818213307288,64.19758129119873,0.0
46,1,Logistic Regression (Penalty = L2),2,0.35,0.7942386831275721,0.497416003373807,0.35866761207580566,0.0
47,1,Naive Bayes,2,0.35,0.06584362139917696,0.41008714685326075,0.24012517929077148,0.0
48,2,KNeighbors Classifier,0,0.35,0.7607843137254902,0.2866927669330738,0.3681941032409668,0.0
49,2,SVC Classifier,0,0.35,0.7607843137254902,1.0,0.2375330924987793,0.0
50,2,Decision Tree,0,0.35,0.7686274509803922,0.3115857230292383,0.11813712120056152,0.0
51,2,RandomForest,0,0.35,0.7607843137254902,1.0,0.7341639995574951,0.0
52,2,AdaBoost (Discrete),0,0.35,0.7647058823529411,0.3838431694704549,49.39751410484314,0.0
53,2,AdaBoost (Real),0,0.35,0.7607843137254902,0.304656525504104,67.51984596252441,0.0
54,2,Logistic Regression (Penalty = L2),0,0.35,0.7647058823529411,0.3838431694704549,0.24067378044128418,0.0
55,2,Naive Bayes,0,0.35,0.0392156862745098,0.28573809127083305,0.2521820068359375,0.0
56,2,KNeighbors Classifier,1,0.35,0.776,1.0,0.40157413482666016,0.0
57,2,SVC Classifier,1,0.35,0.776,1.0,0.27144718170166016,0.0
58,2,Decision Tree,1,0.35,0.784,0.3218297948685433,0.13830780982971191,0.0
59,2,RandomForest,1,0.35,0.776,1.0,1.107461929321289,0.0
60,2,AdaBoost (Discrete),1,0.35,0.776,0.4071947447321208,61.16351509094238,0.0
61,2,AdaBoost (Real),1,0.35,0.78,0.32127586985818757,76.61065888404846,0.0
62,2,Logistic Regression (Penalty = L2),1,0.35,0.78,0.408248290463863,0.39789772033691406,0.0
63,2,Naive Bayes,1,0.35,0.04,0.15945775785021718,0.26392126083374023,0.0
64,2,KNeighbors Classifier,2,0.35,0.7983539094650206,1.0,0.3922860622406006,0.0
65,2,SVC Classifier,2,0.35,0.7983539094650206,1.0,0.26325106620788574,0.0
66,2,Decision Tree,2,0.35,0.7942386831275721,0.5455521537286048,0.13054537773132324,0.0
67,2,RandomForest,2,0.35,0.7901234567901234,0.6997790520224827,0.8081083297729492,0.0
68,2,AdaBoost (Discrete),2,0.35,0.7942386831275721,0.5455521537286048,53.357269048690796,0.0
69,2,AdaBoost (Real),2,0.35,0.7983539094650206,1.0,68.72732353210449,0.0
70,2,Logistic Regression (Penalty = L2),2,0.35,0.7942386831275721,0.5455521537286048,0.41069602966308594,0.0
71,2,Naive Bayes,2,0.35,0.04938271604938271,0.23004969224668356,0.2720165252685547,0.0
72,3,KNeighbors Classifier,0,0.35,0.7607843137254902,1.0,0.1397266387939453,0.0
73,3,SVC Classifier,0,0.35,0.7607843137254902,1.0,0.27120089530944824,0.0
74,3,Decision Tree,0,0.35,0.7607843137254902,1.0,0.13404226303100586,0.0
75,3,RandomForest,0,0.35,0.7607843137254902,1.0,0.8191375732421875,0.0
76,3,AdaBoost (Discrete),0,0.35,0.7647058823529411,0.408248290463863,49.89902305603027,0.0
77,3,AdaBoost (Real),0,0.35,0.7607843137254902,1.0,74.87833261489868,0.0
78,3,Logistic Regression (Penalty = L2),0,0.35,0.7607843137254902,1.0,0.288820743560791,0.0
79,3,Naive Bayes,0,0.35,0.01568627450980392,0.28867513459481287,0.15086841583251953,0.0
80,3,KNeighbors Classifier,1,0.35,0.776,1.0,0.29827022552490234,0.0
81,3,SVC Classifier,1,0.35,0.776,1.0,0.29531097412109375,0.0
82,3,Decision Tree,1,0.35,0.776,1.0,0.14212846755981445,0.0
83,3,RandomForest,1,0.35,0.776,1.0,1.0420074462890625,0.0
84,3,AdaBoost (Discrete),1,0.35,0.776,1.0,53.69155192375183,0.0
85,3,AdaBoost (Real),1,0.35,0.776,1.0,71.27640509605408,0.0
86,3,Logistic Regression (Penalty = L2),1,0.35,0.776,1.0,0.2795572280883789,0.0
87,3,Naive Bayes,1,0.35,0.02,0.8333333333333334,0.1462552547454834,0.0
88,3,KNeighbors Classifier,2,0.35,0.7942386831275721,0.9948453608247423,0.14136219024658203,0.0
89,3,SVC Classifier,2,0.35,0.7983539094650206,1.0,0.283937931060791,0.0
90,3,Decision Tree,2,0.35,0.7942386831275721,0.9948453608247423,0.0019440650939941406,0.0
91,3,RandomForest,2,0.35,0.7942386831275721,0.9948453608247423,0.8462038040161133,0.0
92,3,AdaBoost (Discrete),2,0.35,0.7942386831275721,0.9948453608247423,52.8169469833374,0.0
93,3,AdaBoost (Real),2,0.35,0.7942386831275721,0.9948453608247423,70.452463388443,0.0
94,3,Logistic Regression (Penalty = L2),2,0.35,0.7983539094650206,1.0,0.26914262771606445,0.0
95,3,Naive Bayes,2,0.35,0.01646090534979424,1.0,0.15796566009521484,0.0
96,4,KNeighbors Classifier,0,0.35,0.7607843137254902,0.3769890791947507,0.26941585540771484,0.0
97,4,SVC Classifier,0,0.35,0.7607843137254902,1.0,0.1330575942993164,0.0
98,4,Decision Tree,0,0.35,0.7647058823529411,0.3838431694704549,0.13410425186157227,0.0
99,4,RandomForest,0,0.35,0.7607843137254902,1.0,0.8310246467590332,0.0
100,4,AdaBoost (Discrete),0,0.35,0.7647058823529411,0.6308233860042737,60.178338050842285,0.0
101,4,AdaBoost (Real),0,0.35,0.7607843137254902,0.3769890791947507,74.73489475250244,0.0
102,4,Logistic Regression (Penalty = L2),0,0.35,0.7647058823529411,0.3838431694704549,0.3229799270629883,0.0
103,4,Naive Bayes,0,0.35,0.03529411764705882,0.32696253113310975,0.18171286582946777,0.0
104,4,KNeighbors Classifier,1,0.35,0.764,0.9845360824742269,0.2969636917114258,0.0
105,4,SVC Classifier,1,0.35,0.776,1.0,0.2920036315917969,0.0
106,4,Decision Tree,1,0.35,0.776,0.4071947447321208,0.14602875709533691,0.0
107,4,RandomForest,1,0.35,0.776,1.0,1.0273475646972656,0.0
108,4,AdaBoost (Discrete),1,0.35,0.776,0.4071947447321208,59.39608979225159,0.0
109,4,AdaBoost (Real),1,0.35,0.776,0.4071947447321208,71.61704230308533,0.0
110,4,Logistic Regression (Penalty = L2),1,0.35,0.78,0.408248290463863,0.4183633327484131,0.0
111,4,Naive Bayes,1,0.35,0.036,0.3760603093086394,0.28293585777282715,0.0
112,4,KNeighbors Classifier,2,0.35,0.7983539094650206,1.0,0.41797852516174316,0.0
113,4,SVC Classifier,2,0.35,0.7983539094650206,1.0,0.31629014015197754,0.0
114,4,Decision Tree,2,0.35,0.7942386831275721,0.5455521537286048,0.13399171829223633,0.0
115,4,RandomForest,2,0.35,0.7942386831275721,0.5455521537286048,0.9770467281341553,0.0
116,4,AdaBoost (Discrete),2,0.35,0.7901234567901234,0.6997790520224827,57.55618619918823,0.0
117,4,AdaBoost (Real),2,0.35,0.7983539094650206,1.0,68.40205526351929,0.0
118,4,Logistic Regression (Penalty = L2),2,0.35,0.7942386831275721,0.5455521537286048,0.27226948738098145,0.0
119,4,Naive Bayes,2,0.35,0.037037037037037035,0.4518010018049224,0.26819467544555664,0.0
120,5,KNeighbors Classifier,0,0.35,0.7607843137254902,1.0,0.37510037422180176,0.0
121,5,SVC Classifier,0,0.35,0.7607843137254902,1.0,0.33172035217285156,0.0
122,5,Decision Tree,0,0.35,0.7647058823529411,0.408248290463863,0.001985788345336914,0.0
123,5,RandomForest,0,0.35,0.7607843137254902,1.0,1.113781213760376,0.0
124,5,AdaBoost (Discrete),0,0.35,0.7647058823529411,0.408248290463863,50.76517677307129,0.0
125,5,AdaBoost (Real),0,0.35,0.7647058823529411,0.408248290463863,61.096397399902344,0.0
126,5,Logistic Regression (Penalty = L2),0,0.35,0.7607843137254902,1.0,0.22716569900512695,0.0
127,5,Naive Bayes,0,0.35,0.03137254901960784,0.408248290463863,0.21885204315185547,0.0
128,5,KNeighbors Classifier,1,0.35,0.776,1.0,0.3351857662200928,0.0
129,5,SVC Classifier,1,0.35,0.776,1.0,0.22407984733581543,0.0
130,5,Decision Tree,1,0.35,0.78,0.4472135954999579,0.10953092575073242,0.0
131,5,RandomForest,1,0.35,0.776,1.0,0.7879045009613037,0.0
132,5,AdaBoost (Discrete),1,0.35,0.78,0.4472135954999579,46.25762605667114,0.0
133,5,AdaBoost (Real),1,0.35,0.78,0.4472135954999579,59.36900496482849,0.0
134,5,Logistic Regression (Penalty = L2),1,0.35,0.776,1.0,0.22425556182861328,0.0
135,5,Naive Bayes,1,0.35,0.032,0.10102047864498133,0.11834311485290527,0.0
136,5,KNeighbors Classifier,2,0.35,0.7860082304526749,0.9845360824742269,0.31936120986938477,0.0
137,5,SVC Classifier,2,0.35,0.7983539094650206,1.0,0.23253774642944336,0.0
138,5,Decision Tree,2,0.35,0.7983539094650206,1.0,0.1103813648223877,0.0
139,5,RandomForest,2,0.35,0.7983539094650206,1.0,0.6698877811431885,0.0
140,5,AdaBoost (Discrete),2,0.35,0.7983539094650206,1.0,43.84410905838013,0.0
141,5,AdaBoost (Real),2,0.35,0.7983539094650206,1.0,58.944490909576416,0.0
142,5,Logistic Regression (Penalty = L2),2,0.35,0.7983539094650206,1.0,0.22054314613342285,0.0
143,5,Naive Bayes,2,0.35,0.037037037037037035,0.12435400084345175,0.22343921661376953,0.0
144,6,KNeighbors Classifier,0,0.35,0.7607843137254902,0.2866927669330738,0.3331460952758789,0.0
145,6,SVC Classifier,0,0.35,0.7607843137254902,1.0,0.23937535285949707,0.0
146,6,Decision Tree,0,0.35,0.7686274509803922,0.3115857230292383,0.11044907569885254,0.0
147,6,RandomForest,0,0.35,0.7607843137254902,1.0,0.8914399147033691,0.0
148,6,AdaBoost (Discrete),0,0.35,0.7647058823529411,0.31117921763277673,49.67953324317932,0.0
149,6,AdaBoost (Real),0,0.35,0.7647058823529411,0.3838431694704549,65.70254921913147,0.0
150,6,Logistic Regression (Penalty = L2),0,0.35,0.7647058823529411,0.3838431694704549,0.371798038482666,0.0
151,6,Naive Bayes,0,0.35,0.0392156862745098,0.3195771718380609,0.21831202507019043,0.0
152,6,KNeighbors Classifier,1,0.35,0.776,1.0,0.478132963180542,0.0
153,6,SVC Classifier,1,0.35,0.776,1.0,0.28159594535827637,0.0
154,6,Decision Tree,1,0.35,0.784,0.3218297948685433,0.001965761184692383,0.0
155,6,RandomForest,1,0.35,0.776,1.0,0.9360861778259277,0.0
156,6,AdaBoost (Discrete),1,0.35,0.776,0.4071947447321208,49.40306282043457,0.0
157,6,AdaBoost (Real),1,0.35,0.776,0.4071947447321208,69.95317220687866,0.0
158,6,Logistic Regression (Penalty = L2),1,0.35,0.776,0.4071947447321208,0.23379755020141602,0.0
159,6,Naive Bayes,1,0.35,0.04,0.15945775785021718,0.23048782348632812,0.0
160,6,KNeighbors Classifier,2,0.35,0.7942386831275721,0.9948453608247423,0.4587972164154053,0.0
161,6,SVC Classifier,2,0.35,0.7983539094650206,1.0,0.34597277641296387,0.0
162,6,Decision Tree,2,0.35,0.7942386831275721,0.5455521537286048,0.11447358131408691,0.0
163,6,RandomForest,2,0.35,0.7901234567901234,0.6997790520224827,0.8287053108215332,0.0
164,6,AdaBoost (Discrete),2,0.35,0.7860082304526749,0.6979350987461912,46.1183180809021,0.0
165,6,AdaBoost (Real),2,0.35,0.7942386831275721,0.9948453608247423,67.84720873832703,0.0
166,6,Logistic Regression (Penalty = L2),2,0.35,0.7901234567901234,0.5445882786578613,0.4892902374267578,0.0
167,6,Naive Bayes,2,0.35,0.0411522633744856,0.2096801817817821,0.4281470775604248,0.0
168,7,KNeighbors Classifier,0,0.35,0.788235294117647,0.5051339451704815,0.29099035263061523,0.0
169,7,SVC Classifier,0,0.35,0.7607843137254902,1.0,0.2985999584197998,0.0
170,7,Decision Tree,0,0.35,0.7686274509803922,0.6318330346715276,0.14243054389953613,0.0
171,7,RandomForest,0,0.35,0.7607843137254902,1.0,1.0046489238739014,0.0
172,7,AdaBoost (Discrete),0,0.35,0.6588235294117647,0.4576700248933026,61.13179135322571,0.0
173,7,AdaBoost (Real),0,0.35,0.6039215686274509,0.3633741929399339,84.56964206695557,0.0
174,7,Logistic Regression (Penalty = L2),0,0.35,0.7803921568627451,0.3278877973280665,0.59084153175354,0.0
175,7,Naive Bayes,0,0.35,0.09803921568627451,0.278619637636725,0.5060679912567139,0.0
176,7,KNeighbors Classifier,1,0.35,0.808,0.6009085336818761,0.30663371086120605,0.0
177,7,SVC Classifier,1,0.35,0.776,1.0,0.4923079013824463,0.0
178,7,Decision Tree,1,0.35,0.744,0.6997447614796775,0.0024170875549316406,0.0
179,7,RandomForest,1,0.35,0.776,1.0,1.0855820178985596,0.0
180,7,AdaBoost (Discrete),1,0.35,0.676,0.751502179725232,61.54200720787048,0.0
181,7,AdaBoost (Real),1,0.35,0.672,0.4242612825092072,78.45629811286926,0.0
182,7,Logistic Regression (Penalty = L2),1,0.35,0.788,0.33041391263057845,0.6076490879058838,0.0
183,7,Naive Bayes,1,0.35,0.068,0.23804196860365237,0.2964949607849121,0.0
184,7,KNeighbors Classifier,2,0.35,0.7777777777777778,0.5330398935236673,0.4340784549713135,0.0
185,7,SVC Classifier,2,0.35,0.7983539094650206,1.0,0.4409470558166504,0.0
186,7,Decision Tree,2,0.35,0.7777777777777778,0.6815519555192053,0.1467595100402832,0.0
187,7,RandomForest,2,0.35,0.7901234567901234,0.6997790520224827,1.1950297355651855,0.0
188,7,AdaBoost (Discrete),2,0.35,0.6666666666666666,0.7198564619729987,61.82244610786438,0.0
189,7,AdaBoost (Real),2,0.35,0.6255144032921811,0.49896479442849284,78.64624691009521,0.0
190,7,Logistic Regression (Penalty = L2),2,0.35,0.7983539094650206,0.533081631635245,0.7418704032897949,0.0
191,7,Naive Bayes,2,0.35,0.08641975308641975,0.45219191231077444,0.2984325885772705,0.0
192,8,KNeighbors Classifier,0,0.35,0.7607843137254902,1.0,0.1428697109222412,0.0
193,8,SVC Classifier,0,0.35,0.7607843137254902,1.0,0.14840316772460938,0.0
194,8,Decision Tree,0,0.35,0.7607843137254902,1.0,0.1298973560333252,0.0
195,8,RandomForest,0,0.35,0.7450980392156863,0.979381443298969,0.8877162933349609,0.0
196,8,AdaBoost (Discrete),0,0.35,0.7607843137254902,1.0,55.07764410972595,0.0
197,8,AdaBoost (Real),0,0.35,0.7607843137254902,1.0,75.42516136169434,0.0
198,8,Logistic Regression (Penalty = L2),0,0.35,0.7607843137254902,1.0,0.30274438858032227,0.0
199,8,Naive Bayes,0,0.35,0.027450980392156862,1.0,0.28728222846984863,0.0
200,8,KNeighbors Classifier,1,0.35,0.768,0.9896907216494846,0.2872645854949951,0.0
201,8,SVC Classifier,1,0.35,0.776,1.0,0.2826826572418213,0.0
202,8,Decision Tree,1,0.35,0.776,1.0,0.14190411567687988,0.0
203,8,RandomForest,1,0.35,0.776,1.0,1.1690824031829834,0.0
204,8,AdaBoost (Discrete),1,0.35,0.776,1.0,51.84147071838379,0.0
205,8,AdaBoost (Real),1,0.35,0.776,1.0,64.80758929252625,0.0
206,8,Logistic Regression (Penalty = L2),1,0.35,0.776,1.0,0.338254451751709,0.0
207,8,Naive Bayes,1,0.35,0.024,1.0,0.1329638957977295,0.0
208,8,KNeighbors Classifier,2,0.35,0.7983539094650206,1.0,0.12500309944152832,0.0
209,8,SVC Classifier,2,0.35,0.7983539094650206,1.0,0.14246416091918945,0.0
210,8,Decision Tree,2,0.35,0.7983539094650206,1.0,0.0011930465698242188,0.0
211,8,RandomForest,2,0.35,0.7983539094650206,1.0,0.8992793560028076,0.0
212,8,AdaBoost (Discrete),2,0.35,0.7983539094650206,1.0,48.08413362503052,0.0
213,8,AdaBoost (Real),2,0.35,0.7983539094650206,1.0,78.56164407730103,0.0
214,8,Logistic Regression (Penalty = L2),2,0.35,0.7983539094650206,1.0,0.4318275451660156,0.0
215,8,Naive Bayes,2,0.35,0.024691358024691357,1.0,0.359372615814209,0.0
