,feat_set_id,classifier,fold_id,feat_th,score,geo_score,exec_t,geo_score_woz
0,0,KNeighbors Classifier,0,0.65,0.6184971098265896,0.6510659813892656,2.317282199859619,0.0
1,0,SVC Classifier,0,0.65,0.49710982658959535,1.0,2.2293338775634766,0.0
2,0,Decision Tree,0,0.65,0.5722543352601156,0.6410673994477456,0.18787837028503418,0.0
3,0,RandomForest,0,0.65,0.5491329479768786,0.5073440903499385,1.2850127220153809,0.0
4,0,AdaBoost (Discrete),0,0.65,0.7109826589595376,0.763846931660297,127.47561883926392,0.0
5,0,AdaBoost (Real),0,0.65,0.630057803468208,0.6763710438454862,139.56257700920105,0.0
6,0,Logistic Regression (Penalty = L2),0,0.65,0.6184971098265896,0.42148068924300097,2.4490087032318115,0.0
7,0,Naive Bayes,0,0.65,0.21965317919075145,0.3991668535408312,0.5099358558654785,0.0
8,0,KNeighbors Classifier,1,0.65,0.6369047619047619,0.5428009406895165,2.29217791557312,0.0
9,0,SVC Classifier,1,0.65,0.5119047619047619,1.0,2.0520858764648438,0.0
10,0,Decision Tree,1,0.65,0.6369047619047619,0.5889281034987202,0.17271804809570312,0.0
11,0,RandomForest,1,0.65,0.5416666666666666,0.5606189731861652,1.4063506126403809,0.0
12,0,AdaBoost (Discrete),1,0.65,0.7142857142857143,0.7647672425195702,145.02734422683716,0.0
13,0,AdaBoost (Real),1,0.65,0.6369047619047619,0.6915964517405728,153.00186133384705,0.0
14,0,Logistic Regression (Penalty = L2),1,0.65,0.6428571428571429,0.4031247209184877,2.800701379776001,0.0
15,0,Naive Bayes,1,0.65,0.25,0.4181698984778722,0.6864795684814453,0.0
16,0,KNeighbors Classifier,2,0.65,0.656441717791411,0.6462721435199308,2.179474115371704,0.0
17,0,SVC Classifier,2,0.65,0.5153374233128835,1.0,2.3566813468933105,0.0
18,0,Decision Tree,2,0.65,0.5030674846625767,0.6174559848496914,0.29102206230163574,0.0
19,0,RandomForest,2,0.65,0.5766871165644172,0.6381365768169368,1.285569667816162,0.0
20,0,AdaBoost (Discrete),2,0.65,0.6932515337423313,0.672249270045279,141.29410004615784,0.0
21,0,AdaBoost (Real),2,0.65,0.558282208588957,0.5720266825627901,157.31407260894775,0.0
22,0,Logistic Regression (Penalty = L2),2,0.65,0.6809815950920245,0.5445478269963016,2.358372688293457,0.0
23,0,Naive Bayes,2,0.65,0.2392638036809816,0.4232706785719841,0.6351892948150635,0.0
24,1,KNeighbors Classifier,0,0.65,0.5895953757225434,0.498210124812548,1.8909878730773926,0.0
25,1,SVC Classifier,0,0.65,0.49710982658959535,1.0,2.1638388633728027,0.0
26,1,Decision Tree,0,0.65,0.6647398843930635,0.6758990964496854,0.29787445068359375,0.0
27,1,RandomForest,0,0.65,0.5664739884393064,0.43561613976496233,1.3370399475097656,0.0
28,1,AdaBoost (Discrete),0,0.65,0.6936416184971098,0.6597667570349908,163.40456771850586,0.0
29,1,AdaBoost (Real),0,0.65,0.5838150289017341,0.4448289969419534,170.23308777809143,0.0
30,1,Logistic Regression (Penalty = L2),0,0.65,0.6184971098265896,0.4583310432019756,2.7514286041259766,0.0
31,1,Naive Bayes,0,0.65,0.23699421965317918,0.3957462484024412,0.48522520065307617,0.0
32,1,KNeighbors Classifier,1,0.65,0.625,0.4236382896712028,1.670043706893921,0.0
33,1,SVC Classifier,1,0.65,0.5119047619047619,1.0,1.9292569160461426,0.0
34,1,Decision Tree,1,0.65,0.5416666666666666,0.4660960621194286,0.15291547775268555,0.0
35,1,RandomForest,1,0.65,0.5773809523809523,0.46744503325202336,1.0820255279541016,0.0
36,1,AdaBoost (Discrete),1,0.65,0.7440476190476191,0.7307852450879395,159.43522882461548,0.0
37,1,AdaBoost (Real),1,0.65,0.6190476190476191,0.6392385713466103,167.29604864120483,0.0
38,1,Logistic Regression (Penalty = L2),1,0.65,0.6904761904761905,0.5605090048207435,2.8694088459014893,0.0
39,1,Naive Bayes,1,0.65,0.2619047619047619,0.4410714231202338,0.6265320777893066,0.0
40,1,KNeighbors Classifier,2,0.65,0.6012269938650306,0.5911121377418921,1.7792644500732422,0.0
41,1,SVC Classifier,2,0.65,0.5153374233128835,1.0,1.8653149604797363,0.0
42,1,Decision Tree,2,0.65,0.5276073619631901,0.5519419170290968,0.15308761596679688,0.0
43,1,RandomForest,2,0.65,0.6012269938650306,0.8056928971404463,1.3502562046051025,0.0
44,1,AdaBoost (Discrete),2,0.65,0.7300613496932515,0.7840921195320675,154.25269532203674,0.0
45,1,AdaBoost (Real),2,0.65,0.5950920245398773,0.6451685478140002,157.8035488128662,0.0
46,1,Logistic Regression (Penalty = L2),2,0.65,0.6871165644171779,0.5456402279274698,2.5970230102539062,0.0
47,1,Naive Bayes,2,0.65,0.27607361963190186,0.47369883722309636,0.6398108005523682,0.0
48,2,KNeighbors Classifier,0,0.65,0.6416184971098265,0.4766452311751154,1.777848720550537,0.0
49,2,SVC Classifier,0,0.65,0.5028901734104047,0.5227579585747102,2.2295796871185303,0.0
50,2,Decision Tree,0,0.65,0.6358381502890174,0.6631317366486706,0.31360673904418945,0.0
51,2,RandomForest,0,0.65,0.5549132947976878,0.6481388934544839,1.1372528076171875,0.0
52,2,AdaBoost (Discrete),0,0.65,0.7283236994219653,0.5839565761207491,204.4139711856842,0.0
53,2,AdaBoost (Real),0,0.65,0.6242774566473989,0.7244007043050418,220.89841079711914,0.0
54,2,Logistic Regression (Penalty = L2),0,0.65,0.6878612716763006,0.6026119288654211,4.247323751449585,0.0
55,2,Naive Bayes,0,0.65,0.2774566473988439,0.45361838813025823,0.6792762279510498,0.0
56,2,KNeighbors Classifier,1,0.65,0.6488095238095238,0.5950862661927817,1.6908679008483887,0.0
57,2,SVC Classifier,1,0.65,0.5238095238095238,0.6933612743506347,2.39680552482605,0.0
58,2,Decision Tree,1,0.65,0.5833333333333334,0.5716449590626171,0.17003631591796875,0.5716449590626171
59,2,RandomForest,1,0.65,0.5357142857142857,0.4825039881595378,1.412327766418457,0.0
60,2,AdaBoost (Discrete),1,0.65,0.7678571428571429,0.7264513925481743,202.69573140144348,0.0
61,2,AdaBoost (Real),1,0.65,0.6190476190476191,0.6672400127705893,209.3655195236206,0.0
62,2,Logistic Regression (Penalty = L2),1,0.65,0.75,0.7403779589920457,3.456663131713867,0.0
63,2,Naive Bayes,1,0.65,0.27380952380952384,0.44016659968000227,0.4325716495513916,0.44016659968000227
64,2,KNeighbors Classifier,2,0.65,0.6932515337423313,0.7840404299984932,1.659099817276001,0.0
65,2,SVC Classifier,2,0.65,0.5337423312883436,0.7937005259840998,2.034729242324829,0.0
66,2,Decision Tree,2,0.65,0.6319018404907976,0.6241727158839686,0.13297057151794434,0.0
67,2,RandomForest,2,0.65,0.5521472392638037,0.5153701171292969,1.0032334327697754,0.0
68,2,AdaBoost (Discrete),2,0.65,0.7423312883435583,0.5953731496097971,183.55319952964783,0.0
69,2,AdaBoost (Real),2,0.65,0.6257668711656442,0.8513024447199062,196.13253140449524,0.0
70,2,Logistic Regression (Penalty = L2),2,0.65,0.7361963190184049,0.7451045776600257,3.3619699478149414,0.0
71,2,Naive Bayes,2,0.65,0.2822085889570552,0.48190000972166713,0.5892348289489746,0.0
72,3,KNeighbors Classifier,0,0.65,0.5953757225433526,0.5270137789071607,1.5020248889923096,0.0
73,3,SVC Classifier,0,0.65,0.49710982658959535,1.0,1.6604065895080566,0.0
74,3,Decision Tree,0,0.65,0.6242774566473989,0.6068896148236341,0.12821507453918457,0.0
75,3,RandomForest,0,0.65,0.5260115606936416,0.34544275189725415,1.0312416553497314,0.0
76,3,AdaBoost (Discrete),0,0.65,0.6936416184971098,0.7112606590504529,119.24513792991638,0.0
77,3,AdaBoost (Real),0,0.65,0.6589595375722543,0.7290022275036606,131.84205627441406,0.0
78,3,Logistic Regression (Penalty = L2),0,0.65,0.5375722543352601,0.2959764595888634,1.711470603942871,0.0
79,3,Naive Bayes,0,0.65,0.2138728323699422,0.38886280424774666,0.48174405097961426,0.0
80,3,KNeighbors Classifier,1,0.65,0.5952380952380952,0.5655544197720916,1.6056420803070068,0.0
81,3,SVC Classifier,1,0.65,0.5119047619047619,1.0,1.5451328754425049,0.0
82,3,Decision Tree,1,0.65,0.5773809523809523,0.6578473549973308,0.19170022010803223,0.0
83,3,RandomForest,1,0.65,0.5476190476190477,0.4705355686715127,1.113924264907837,0.0
84,3,AdaBoost (Discrete),1,0.65,0.7083333333333334,0.7971915753812949,108.40658974647522,0.0
85,3,AdaBoost (Real),1,0.65,0.6309523809523809,0.6725723433019528,121.7657482624054,0.0
86,3,Logistic Regression (Penalty = L2),1,0.65,0.5654761904761905,0.3971092194394756,1.5782394409179688,0.0
87,3,Naive Bayes,1,0.65,0.25,0.43797356112384767,0.5296573638916016,0.0
88,3,KNeighbors Classifier,2,0.65,0.5950920245398773,0.5126842697304822,1.3665297031402588,0.0
89,3,SVC Classifier,2,0.65,0.5153374233128835,1.0,1.2418503761291504,0.0
90,3,Decision Tree,2,0.65,0.5766871165644172,0.5633793266512562,0.1763608455657959,0.0
91,3,RandomForest,2,0.65,0.5705521472392638,0.42394104413558986,0.9661319255828857,0.0
92,3,AdaBoost (Discrete),2,0.65,0.7055214723926381,0.7127196446979271,110.03367733955383,0.0
93,3,AdaBoost (Real),2,0.65,0.6073619631901841,0.6761576601548726,116.55331182479858,0.0
94,3,Logistic Regression (Penalty = L2),2,0.65,0.6012269938650306,0.44299812916762465,1.4812169075012207,0.0
95,3,Naive Bayes,2,0.65,0.294478527607362,0.4538818118863529,0.5210375785827637,0.4538818118863529
96,4,KNeighbors Classifier,0,0.65,0.630057803468208,0.7041573788326896,0.8844141960144043,0.0
97,4,SVC Classifier,0,0.65,0.49710982658959535,1.0,0.7885067462921143,0.0
98,4,Decision Tree,0,0.65,0.6184971098265896,0.573373333894468,0.13518476486206055,0.0
99,4,RandomForest,0,0.65,0.5606936416184971,0.7186082239261684,0.9354629516601562,0.0
100,4,AdaBoost (Discrete),0,0.65,0.6994219653179191,0.7311104225135504,98.23067378997803,0.0
101,4,AdaBoost (Real),0,0.65,0.630057803468208,0.6763710438454862,108.10960006713867,0.0
102,4,Logistic Regression (Penalty = L2),0,0.65,0.6242774566473989,0.45522432317194483,1.460378646850586,0.0
103,4,Naive Bayes,0,0.65,0.24855491329479767,0.3920243610002215,0.4232800006866455,0.0
104,4,KNeighbors Classifier,1,0.65,0.6428571428571429,0.5781053052209991,0.8222098350524902,0.0
105,4,SVC Classifier,1,0.65,0.5119047619047619,1.0,1.0959043502807617,0.0
106,4,Decision Tree,1,0.65,0.5773809523809523,0.6159375866305387,0.18038630485534668,0.0
107,4,RandomForest,1,0.65,0.5476190476190477,0.5450176720923848,1.1246623992919922,0.0
108,4,AdaBoost (Discrete),1,0.65,0.6904761904761905,0.7494469832228144,99.2456796169281,0.0
109,4,AdaBoost (Real),1,0.65,0.6547619047619048,0.7300644790975188,108.96013522148132,0.0
110,4,Logistic Regression (Penalty = L2),1,0.65,0.6428571428571429,0.4031247209184877,1.9161982536315918,0.0
111,4,Naive Bayes,1,0.65,0.25,0.42197583068803646,0.3687317371368408,0.0
112,4,KNeighbors Classifier,2,0.65,0.6625766871165644,0.6471180639501504,0.8837072849273682,0.0
113,4,SVC Classifier,2,0.65,0.5153374233128835,1.0,0.9201853275299072,0.0
114,4,Decision Tree,2,0.65,0.5521472392638037,0.8135325681904109,0.15254783630371094,0.0
115,4,RandomForest,2,0.65,0.5705521472392638,0.80150862405817,0.9790737628936768,0.0
116,4,AdaBoost (Discrete),2,0.65,0.7300613496932515,0.7693240037169726,97.69360685348511,0.0
117,4,AdaBoost (Real),2,0.65,0.5950920245398773,0.6063426442406735,109.93382811546326,0.0
118,4,Logistic Regression (Penalty = L2),2,0.65,0.6687116564417178,0.6077813647887352,1.9743261337280273,0.0
119,4,Naive Bayes,2,0.65,0.25153374233128833,0.5421961488782738,0.2940182685852051,0.0
120,5,KNeighbors Classifier,0,0.65,0.5895953757225434,0.4683800419842993,0.6820297241210938,0.0
121,5,SVC Classifier,0,0.65,0.49710982658959535,1.0,0.9627907276153564,0.0
122,5,Decision Tree,0,0.65,0.5606936416184971,0.5688373450240415,0.15284371376037598,0.0
123,5,RandomForest,0,0.65,0.5433526011560693,0.32011247998491643,1.0439109802246094,0.0
124,5,AdaBoost (Discrete),0,0.65,0.6878612716763006,0.6465177133888029,138.5603165626526,0.0
125,5,AdaBoost (Real),0,0.65,0.5838150289017341,0.4135632744046018,1158.5345242023468,0.0
126,5,Logistic Regression (Penalty = L2),0,0.65,0.6184971098265896,0.4583310432019756,1.2144050598144531,0.0
127,5,Naive Bayes,0,0.65,0.24855491329479767,0.34383774733251493,0.3034210205078125,0.34383774733251493
128,5,KNeighbors Classifier,1,0.65,0.6309523809523809,0.4024667120582355,0.6275467872619629,0.0
129,5,SVC Classifier,1,0.65,0.5119047619047619,1.0,0.7362837791442871,0.0
130,5,Decision Tree,1,0.65,0.625,0.6729092390749352,0.09996581077575684,0.0
131,5,RandomForest,1,0.65,0.5535714285714286,0.5773502691896257,0.694481611251831,0.0
132,5,AdaBoost (Discrete),1,0.65,0.7023809523809523,0.7610174800594564,86.47141647338867,0.0
133,5,AdaBoost (Real),1,0.65,0.6190476190476191,0.6392385713466103,95.01999616622925,0.0
134,5,Logistic Regression (Penalty = L2),1,0.65,0.6904761904761905,0.5605090048207435,1.4718258380889893,0.0
135,5,Naive Bayes,1,0.65,0.27380952380952384,0.4344714881054409,0.3348822593688965,0.4344714881054409
136,5,KNeighbors Classifier,2,0.65,0.5950920245398773,0.58335070888656,0.6809062957763672,0.0
137,5,SVC Classifier,2,0.65,0.5153374233128835,1.0,0.8327898979187012,0.0
138,5,Decision Tree,2,0.65,0.5950920245398773,0.8231712539930442,0.12746047973632812,0.0
139,5,RandomForest,2,0.65,0.5828220858895705,0.7050027468126489,0.9578747749328613,0.0
140,5,AdaBoost (Discrete),2,0.65,0.7055214723926381,0.6668043001421584,85.5365629196167,0.0
141,5,AdaBoost (Real),2,0.65,0.588957055214724,0.5843444211939197,92.47131943702698,0.0
142,5,Logistic Regression (Penalty = L2),2,0.65,0.6809815950920245,0.5275117164276569,1.279114007949829,0.0
143,5,Naive Bayes,2,0.65,0.31901840490797545,0.49264762208292456,0.3155062198638916,0.49264762208292456
144,6,KNeighbors Classifier,0,0.65,0.6242774566473989,0.637615546223469,1.1392722129821777,0.0
145,6,SVC Classifier,0,0.65,0.49710982658959535,1.0,1.2049312591552734,0.0
146,6,Decision Tree,0,0.65,0.6184971098265896,0.5276830082684111,0.11643385887145996,0.0
147,6,RandomForest,0,0.65,0.5491329479768786,0.3301352998405312,0.6296188831329346,0.0
148,6,AdaBoost (Discrete),0,0.65,0.7052023121387283,0.49500231458044547,91.5904655456543,0.0
149,6,AdaBoost (Real),0,0.65,0.6127167630057804,0.4854549742903391,97.36645269393921,0.0
150,6,Logistic Regression (Penalty = L2),0,0.65,0.6589595375722543,0.5242069853110889,1.7438435554504395,0.0
151,6,Naive Bayes,0,0.65,0.2254335260115607,0.37353471820721296,0.43945789337158203,0.0
152,6,KNeighbors Classifier,1,0.65,0.6488095238095238,0.5310200793570696,1.1447253227233887,0.0
153,6,SVC Classifier,1,0.65,0.5119047619047619,1.0,1.4517498016357422,0.0
154,6,Decision Tree,1,0.65,0.6190476190476191,0.5899960113108563,0.10448002815246582,0.0
155,6,RandomForest,1,0.65,0.5297619047619048,0.7937005259840998,0.7422275543212891,0.0
156,6,AdaBoost (Discrete),1,0.65,0.6845238095238095,0.6046654047474886,95.24734282493591,0.0
157,6,AdaBoost (Real),1,0.65,0.6190476190476191,0.6392385713466103,108.40579795837402,0.0
158,6,Logistic Regression (Penalty = L2),1,0.65,0.7261904761904762,0.6477079607941991,1.7493724822998047,0.0
159,6,Naive Bayes,1,0.65,0.25595238095238093,0.4314179877611909,0.3097395896911621,0.0
160,6,KNeighbors Classifier,2,0.65,0.656441717791411,0.705607985547561,1.2635633945465088,0.0
161,6,SVC Classifier,2,0.65,0.5153374233128835,1.0,1.3227825164794922,0.0
162,6,Decision Tree,2,0.65,0.5950920245398773,0.7061449810351834,0.2098064422607422,0.0
163,6,RandomForest,2,0.65,0.5705521472392638,0.6580370064762462,0.841113805770874,0.0
164,6,AdaBoost (Discrete),2,0.65,0.7361963190184049,0.894043946493757,90.35147380828857,0.0
165,6,AdaBoost (Real),2,0.65,0.5766871165644172,0.746321782228179,99.56555819511414,0.0
166,6,Logistic Regression (Penalty = L2),2,0.65,0.7239263803680982,0.7422920752839466,1.8347134590148926,0.0
167,6,Naive Bayes,2,0.65,0.26380368098159507,0.4257846608395767,0.447357177734375,0.0
168,7,KNeighbors Classifier,0,0.65,0.6416184971098265,0.4766452311751154,1.3909187316894531,0.0
169,7,SVC Classifier,0,0.65,0.5028901734104047,0.5227579585747102,1.9147047996520996,0.0
170,7,Decision Tree,0,0.65,0.6763005780346821,0.5906678868599509,0.17955374717712402,0.0
171,7,RandomForest,0,0.65,0.5202312138728323,0.32696253113310975,0.7616603374481201,0.0
172,7,AdaBoost (Discrete),0,0.65,0.7109826589595376,0.5164504171749293,121.24795985221863,0.0
173,7,AdaBoost (Real),0,0.65,0.6242774566473989,0.7244007043050418,132.439368724823,0.0
174,7,Logistic Regression (Penalty = L2),0,0.65,0.6878612716763006,0.6026119288654211,2.9554173946380615,0.0
175,7,Naive Bayes,0,0.65,0.2543352601156069,0.4375120665169366,0.4657175540924072,0.0
176,7,KNeighbors Classifier,1,0.65,0.6488095238095238,0.5950862661927817,1.455068826675415,0.0
177,7,SVC Classifier,1,0.65,0.5238095238095238,0.6933612743506347,1.9189252853393555,0.0
178,7,Decision Tree,1,0.65,0.5892857142857143,0.7835506588358139,0.0886998176574707,0.0
179,7,RandomForest,1,0.65,0.5416666666666666,0.9410360288810286,0.5764315128326416,0.0
180,7,AdaBoost (Discrete),1,0.65,0.7261904761904762,0.6844203349767278,121.05249190330505,0.0
181,7,AdaBoost (Real),1,0.65,0.6607142857142857,0.6671125599275987,120.54676628112793,0.0
182,7,Logistic Regression (Penalty = L2),1,0.65,0.7321428571428571,0.7311797715927494,2.553027629852295,0.0
183,7,Naive Bayes,1,0.65,0.25595238095238093,0.4410714231202338,0.4334070682525635,0.0
184,7,KNeighbors Classifier,2,0.65,0.6932515337423313,0.7840404299984932,1.3027753829956055,0.0
185,7,SVC Classifier,2,0.65,0.5337423312883436,0.7937005259840998,1.7707607746124268,0.0
186,7,Decision Tree,2,0.65,0.6319018404907976,0.6988524045243883,0.17418336868286133,0.0
187,7,RandomForest,2,0.65,0.5828220858895705,0.6228654698077587,0.6126241683959961,0.0
188,7,AdaBoost (Discrete),2,0.65,0.7668711656441718,0.6361914628017558,114.07311773300171,0.0
189,7,AdaBoost (Real),2,0.65,0.588957055214724,0.7567837271227947,122.01705741882324,0.0
190,7,Logistic Regression (Penalty = L2),2,0.65,0.7239263803680982,0.718169192330571,2.9854233264923096,0.0
191,7,Naive Bayes,2,0.65,0.2822085889570552,0.48870614528562994,0.3502480983734131,0.0
192,8,KNeighbors Classifier,0,0.65,0.5953757225433526,0.4361777784537786,0.5236959457397461,0.0
193,8,SVC Classifier,0,0.65,0.49710982658959535,1.0,0.44509196281433105,0.0
194,8,Decision Tree,0,0.65,0.5317919075144508,0.41243661664060605,0.08765435218811035,0.0
195,8,RandomForest,0,0.65,0.5549132947976878,0.7164072540538523,0.6300945281982422,0.0
196,8,AdaBoost (Discrete),0,0.65,0.7109826589595376,0.723644151623124,62.66566061973572,0.0
197,8,AdaBoost (Real),0,0.65,0.653179190751445,0.7152276433526349,70.7232313156128,0.0
198,8,Logistic Regression (Penalty = L2),0,0.65,0.5375722543352601,0.2959764595888634,0.686267614364624,0.0
199,8,Naive Bayes,0,0.65,0.2254335260115607,0.395965889554805,0.25870680809020996,0.0
200,8,KNeighbors Classifier,1,0.65,0.6071428571428571,0.5944424899215857,0.4151122570037842,0.0
201,8,SVC Classifier,1,0.65,0.5119047619047619,1.0,0.41993141174316406,0.0
202,8,Decision Tree,1,0.65,0.5178571428571429,0.6199956235127866,0.0848853588104248,0.0
203,8,RandomForest,1,0.65,0.5357142857142857,0.4591497693322866,0.5899925231933594,0.0
204,8,AdaBoost (Discrete),1,0.65,0.6785714285714286,0.6325186587189174,54.607462882995605,0.0
205,8,AdaBoost (Real),1,0.65,0.6428571428571429,0.727552209278098,60.14022612571716,0.0
206,8,Logistic Regression (Penalty = L2),1,0.65,0.5595238095238095,0.3537840945603395,0.7662837505340576,0.0
207,8,Naive Bayes,1,0.65,0.27380952380952384,0.4292307602781579,0.18013310432434082,0.4292307602781579
208,8,KNeighbors Classifier,2,0.65,0.6257668711656442,0.5374427135338967,0.4464092254638672,0.0
209,8,SVC Classifier,2,0.65,0.5153374233128835,1.0,0.44106078147888184,0.0
210,8,Decision Tree,2,0.65,0.6012269938650306,0.6165255618179659,0.08817791938781738,0.0
211,8,RandomForest,2,0.65,0.6073619631901841,0.5433074045915983,0.6114487648010254,0.0
212,8,AdaBoost (Discrete),2,0.65,0.6993865030674846,0.7110471010543059,52.56667733192444,0.0
213,8,AdaBoost (Real),2,0.65,0.588957055214724,0.6053303672454788,56.59780836105347,0.0
214,8,Logistic Regression (Penalty = L2),2,0.65,0.6012269938650306,0.44299812916762465,0.6754615306854248,0.0
215,8,Naive Bayes,2,0.65,0.294478527607362,0.5190362028917845,0.1641829013824463,0.0
