,feat_set_id,classifier,fold_id,feat_th,score,geo_score,exec_t,geo_score_woz
0,0,KNeighbors Classifier,0,0.8,0.9686567164179104,0.9682549539640778,8.55717420578003,0.9682549539640778
1,0,SVC Classifier,0,0.8,0.9194029850746268,0.9181695455519914,9.749525308609009,0.9181695455519914
2,0,Decision Tree,0,0.8,0.691044776119403,0.6817784316365463,0.43317294120788574,0.6817784316365463
3,0,RandomForest,0,0.8,0.7268656716417911,0.7158155888883843,1.9644086360931396,0.7158155888883843
4,0,AdaBoost (Discrete),0,0.8,0.9447761194029851,0.9443011461203722,420.91766023635864,0.9443011461203722
5,0,AdaBoost (Real),0,0.8,0.8686567164179104,0.8650847215747244,475.1830518245697,0.8650847215747244
6,0,Logistic Regression (Penalty = L2),0,0.8,0.9567164179104478,0.956041526359599,3.9619579315185547,0.956041526359599
7,0,Naive Bayes,0,0.8,0.9492537313432836,0.9486593250160058,0.4167149066925049,0.9486593250160058
8,0,KNeighbors Classifier,1,0.8,0.9567164179104478,0.9563774092669024,7.804073810577393,0.9563774092669024
9,0,SVC Classifier,1,0.8,0.9328358208955224,0.9319830094009564,9.929609298706055,0.9319830094009564
10,0,Decision Tree,1,0.8,0.7014925373134329,0.697058175346065,0.5795578956604004,0.697058175346065
11,0,RandomForest,1,0.8,0.7417910447761195,0.7294704130293458,1.6726274490356445,0.7294704130293458
12,0,AdaBoost (Discrete),1,0.8,0.9283582089552239,0.9280070231497091,548.3691737651825,0.9280070231497091
13,0,AdaBoost (Real),1,0.8,0.8895522388059701,0.888156935333083,526.5633103847504,0.888156935333083
14,0,Logistic Regression (Penalty = L2),1,0.8,0.9432835820895522,0.9427869076345057,4.746088743209839,0.9427869076345057
15,0,Naive Bayes,1,0.8,0.9298507462686567,0.929375775791459,0.4788064956665039,0.929375775791459
16,0,KNeighbors Classifier,2,0.8,0.9712121212121212,0.970840327101839,9.97679853439331,0.970840327101839
17,0,SVC Classifier,2,0.8,0.9257575757575758,0.9248489288367596,12.072731018066406,0.9248489288367596
18,0,Decision Tree,2,0.8,0.7560606060606061,0.7535247719015105,0.6903061866760254,0.7535247719015105
19,0,RandomForest,2,0.8,0.7560606060606061,0.7467716686989906,1.9542901515960693,0.7467716686989906
20,0,AdaBoost (Discrete),2,0.8,0.9424242424242424,0.9416901028000649,562.7712762355804,0.9416901028000649
21,0,AdaBoost (Real),2,0.8,0.8939393939393939,0.8925239483836488,545.9365966320038,0.8925239483836488
22,0,Logistic Regression (Penalty = L2),2,0.8,0.95,0.9496856778445547,3.5119142532348633,0.9496856778445547
23,0,Naive Bayes,2,0.8,0.9424242424242424,0.9421604121430377,0.41057658195495605,0.9421604121430377
24,1,KNeighbors Classifier,0,0.8,0.9686567164179104,0.968323748947508,7.964462041854858,0.968323748947508
25,1,SVC Classifier,0,0.8,0.9208955223880597,0.9200474249287229,9.64588212966919,0.9200474249287229
26,1,Decision Tree,0,0.8,0.6925373134328359,0.6831261836160367,0.39372682571411133,0.6831261836160367
27,1,RandomForest,0,0.8,0.6895522388059702,0.6763467343884951,1.6537935733795166,0.6763467343884951
28,1,AdaBoost (Discrete),0,0.8,0.9149253731343283,0.913260923291294,519.7352421283722,0.913260923291294
29,1,AdaBoost (Real),0,0.8,0.8641791044776119,0.8611495078872348,517.434513092041,0.8611495078872348
30,1,Logistic Regression (Penalty = L2),0,0.8,0.9492537313432836,0.9485132762883438,4.36757230758667,0.9485132762883438
31,1,Naive Bayes,0,0.8,0.9373134328358209,0.9368208527748969,0.4424407482147217,0.9368208527748969
32,1,KNeighbors Classifier,1,0.8,0.9552238805970149,0.9546111962589411,9.62616753578186,0.9546111962589411
33,1,SVC Classifier,1,0.8,0.9238805970149254,0.922565734891471,11.67867660522461,0.922565734891471
34,1,Decision Tree,1,0.8,0.6865671641791045,0.6813977894450145,0.571791410446167,0.6813977894450145
35,1,RandomForest,1,0.8,0.7208955223880597,0.7096595862863493,1.7338333129882812,0.7096595862863493
36,1,AdaBoost (Discrete),1,0.8,0.9298507462686567,0.9291552091755636,503.52735805511475,0.9291552091755636
37,1,AdaBoost (Real),1,0.8,0.5746268656716418,0.534477659320929,510.9508020877838,0.534477659320929
38,1,Logistic Regression (Penalty = L2),1,0.8,0.9492537313432836,0.9489204423207673,3.641490936279297,0.9489204423207673
39,1,Naive Bayes,1,0.8,0.935820895522388,0.9353482460282071,0.4372067451477051,0.9353482460282071
40,1,KNeighbors Classifier,2,0.8,0.9621212121212122,0.9616311864440218,8.290507316589355,0.9616311864440218
41,1,SVC Classifier,2,0.8,0.9257575757575758,0.9245858511674943,10.760351419448853,0.9245858511674943
42,1,Decision Tree,2,0.8,0.693939393939394,0.6912331576602385,0.48350071907043457,0.6912331576602385
43,1,RandomForest,2,0.8,0.753030303030303,0.7424143746423805,1.802320957183838,0.7424143746423805
44,1,AdaBoost (Discrete),2,0.8,0.9333333333333333,0.9322106072058985,484.7801864147186,0.9322106072058985
45,1,AdaBoost (Real),2,0.8,0.8924242424242425,0.8904747417642028,448.7709250450134,0.8904747417642028
46,1,Logistic Regression (Penalty = L2),2,0.8,0.9484848484848485,0.9482104819948648,4.0343194007873535,0.9482104819948648
47,1,Naive Bayes,2,0.8,0.9363636363636364,0.9360734215496771,0.5829613208770752,0.9360734215496771
48,2,KNeighbors Classifier,0,0.8,0.9597014925373134,0.9587907547481023,8.213369131088257,0.9587907547481023
49,2,SVC Classifier,0,0.8,0.9119402985074627,0.9108198826715695,9.069397211074829,0.9108198826715695
50,2,Decision Tree,0,0.8,0.7089552238805971,0.7045605274956577,0.5258340835571289,0.7045605274956577
51,2,RandomForest,0,0.8,0.6970149253731344,0.6679941920975219,1.45023512840271,0.6679941920975219
52,2,AdaBoost (Discrete),0,0.8,0.9432835820895522,0.9424372207487545,1479.6294360160828,0.9424372207487545
53,2,AdaBoost (Real),0,0.8,0.8820895522388059,0.8801341692795195,350.1545100212097,0.8801341692795195
54,2,Logistic Regression (Penalty = L2),0,0.8,0.9507462686567164,0.9501335144086935,3.0843849182128906,0.9501335144086935
55,2,Naive Bayes,0,0.8,0.9253731343283582,0.9248953022560445,0.33380651473999023,0.9248953022560445
56,2,KNeighbors Classifier,1,0.8,0.9522388059701492,0.951496722748372,5.677759170532227,0.951496722748372
57,2,SVC Classifier,1,0.8,0.9059701492537313,0.9040934120471333,7.8249218463897705,0.9040934120471333
58,2,Decision Tree,1,0.8,0.6597014925373135,0.6533336073083864,0.49683547019958496,0.6533336073083864
59,2,RandomForest,1,0.8,0.7268656716417911,0.7067818892247895,1.2943003177642822,0.7067818892247895
60,2,AdaBoost (Discrete),1,0.8,0.926865671641791,0.9262529255318784,324.8090310096741,0.9262529255318784
61,2,AdaBoost (Real),1,0.8,0.8671641791044776,0.8644153155717138,317.05771017074585,0.8644153155717138
62,2,Logistic Regression (Penalty = L2),1,0.8,0.9417910447761194,0.9411399046194909,2.462888240814209,0.9411399046194909
63,2,Naive Bayes,1,0.8,0.9164179104477612,0.9157286162404157,0.3296692371368408,0.9157286162404157
64,2,KNeighbors Classifier,2,0.8,0.9515151515151515,0.9503935160711482,5.371775388717651,0.9503935160711482
65,2,SVC Classifier,2,0.8,0.9196969696969697,0.9182950691406775,6.979252576828003,0.9182950691406775
66,2,Decision Tree,2,0.8,0.7196969696969697,0.7173351873692545,0.40714097023010254,0.7173351873692545
67,2,RandomForest,2,0.8,0.703030303030303,0.6846230390425506,1.3908531665802002,0.6846230390425506
68,2,AdaBoost (Discrete),2,0.8,0.9287878787878788,0.9275972748692796,305.3455402851105,0.9275972748692796
69,2,AdaBoost (Real),2,0.8,0.8924242424242425,0.8914730041903568,301.503214597702,0.8914730041903568
70,2,Logistic Regression (Penalty = L2),2,0.8,0.9454545454545454,0.9447076853772551,2.5650293827056885,0.9447076853772551
71,2,Naive Bayes,2,0.8,0.9348484848484848,0.9345274355817835,0.25223755836486816,0.9345274355817835
72,3,KNeighbors Classifier,0,0.8,0.9746268656716418,0.9743274815505715,4.33174991607666,0.9743274815505715
73,3,SVC Classifier,0,0.8,0.9253731343283582,0.9244052022003283,5.408692359924316,0.9244052022003283
74,3,Decision Tree,0,0.8,0.691044776119403,0.6880868523366861,0.17895221710205078,0.6880868523366861
75,3,RandomForest,0,0.8,0.682089552238806,0.6621298799149141,0.995415210723877,0.6621298799149141
76,3,AdaBoost (Discrete),0,0.8,0.9343283582089552,0.9335006107651509,255.86003732681274,0.9335006107651509
77,3,AdaBoost (Real),0,0.8,0.8597014925373134,0.8569524905784157,249.8483588695526,0.8569524905784157
78,3,Logistic Regression (Penalty = L2),0,0.8,0.9477611940298507,0.9470483898475723,1.925952434539795,0.9470483898475723
79,3,Naive Bayes,0,0.8,0.9447761194029851,0.9441306150298989,0.3226912021636963,0.9441306150298989
80,3,KNeighbors Classifier,1,0.8,0.9611940298507463,0.9607632770148445,3.6606030464172363,0.9607632770148445
81,3,SVC Classifier,1,0.8,0.9238805970149254,0.9226401683728082,4.99042272567749,0.9226401683728082
82,3,Decision Tree,1,0.8,0.7104477611940299,0.7034985444043151,0.16302227973937988,0.7034985444043151
83,3,RandomForest,1,0.8,0.7089552238805971,0.6524457974991356,0.8846695423126221,0.6524457974991356
84,3,AdaBoost (Discrete),1,0.8,0.9328358208955224,0.9322353213766852,201.3189435005188,0.9322353213766852
85,3,AdaBoost (Real),1,0.8,0.8582089552238806,0.8578128723631189,206.90893530845642,0.8578128723631189
86,3,Logistic Regression (Penalty = L2),1,0.8,0.9477611940298507,0.9474720095962391,1.7815814018249512,0.9474720095962391
87,3,Naive Bayes,1,0.8,0.9417910447761194,0.9414043669163472,0.2352597713470459,0.9414043669163472
88,3,KNeighbors Classifier,2,0.8,0.9727272727272728,0.9725184525849595,3.2256486415863037,0.9725184525849595
89,3,SVC Classifier,2,0.8,0.9287878787878788,0.9280568044069979,4.54980731010437,0.9280568044069979
90,3,Decision Tree,2,0.8,0.7515151515151515,0.7396933236290811,0.15411758422851562,0.7396933236290811
91,3,RandomForest,2,0.8,0.7,0.6351549665569883,0.7858531475067139,0.6351549665569883
92,3,AdaBoost (Discrete),2,0.8,0.9393939393939394,0.9388560453009412,188.21820306777954,0.9388560453009412
93,3,AdaBoost (Real),2,0.8,0.8863636363636364,0.8834292503968417,212.38537120819092,0.8834292503968417
94,3,Logistic Regression (Penalty = L2),2,0.8,0.956060606060606,0.9558330241480523,1.7892520427703857,0.9558330241480523
95,3,Naive Bayes,2,0.8,0.9409090909090909,0.9404998092257734,0.2533388137817383,0.9404998092257734
96,4,KNeighbors Classifier,0,0.8,0.9731343283582089,0.9728410647635627,3.741210460662842,0.9728410647635627
97,4,SVC Classifier,0,0.8,0.9074626865671642,0.9062772533174711,4.67513370513916,0.9062772533174711
98,4,Decision Tree,0,0.8,0.7,0.6971698555584663,0.16212105751037598,0.6971698555584663
99,4,RandomForest,0,0.8,0.7298507462686568,0.7076233581775287,0.8922905921936035,0.7076233581775287
100,4,AdaBoost (Discrete),0,0.8,0.9298507462686567,0.9288826537572344,202.6548719406128,0.9288826537572344
101,4,AdaBoost (Real),0,0.8,0.8940298507462686,0.8924276540895341,218.97159814834595,0.8924276540895341
102,4,Logistic Regression (Penalty = L2),0,0.8,0.9432835820895522,0.9421556863374076,1.8307507038116455,0.9421556863374076
103,4,Naive Bayes,0,0.8,0.926865671641791,0.9259977616162728,0.24598169326782227,0.9259977616162728
104,4,KNeighbors Classifier,1,0.8,0.9492537313432836,0.9488209455868286,3.5824172496795654,0.9488209455868286
105,4,SVC Classifier,1,0.8,0.9074626865671642,0.9061678355567049,4.61265230178833,0.9061678355567049
106,4,Decision Tree,1,0.8,0.7059701492537314,0.7041047946285709,0.22371482849121094,0.7041047946285709
107,4,RandomForest,1,0.8,0.6522388059701493,0.6008934034584453,0.8021938800811768,0.6008934034584453
108,4,AdaBoost (Discrete),1,0.8,0.9223880597014925,0.9218659277452083,189.87461829185486,0.9218659277452083
109,4,AdaBoost (Real),1,0.8,0.8611940298507462,0.8579396154553829,221.43005919456482,0.8579396154553829
110,4,Logistic Regression (Penalty = L2),1,0.8,0.9522388059701492,0.951648723783504,2.055392026901245,0.951648723783504
111,4,Naive Bayes,1,0.8,0.917910447761194,0.9171933684518606,0.24486422538757324,0.9171933684518606
112,4,KNeighbors Classifier,2,0.8,0.9621212121212122,0.9614847556382564,3.867544412612915,0.9614847556382564
113,4,SVC Classifier,2,0.8,0.9166666666666666,0.9152338044716318,5.177708387374878,0.9152338044716318
114,4,Decision Tree,2,0.8,0.7484848484848485,0.7428918725552653,0.2459275722503662,0.7428918725552653
115,4,RandomForest,2,0.8,0.6818181818181818,0.652960288935153,0.8018598556518555,0.652960288935153
116,4,AdaBoost (Discrete),2,0.8,0.9318181818181818,0.931235025652773,234.1002655029297,0.931235025652773
117,4,AdaBoost (Real),2,0.8,0.896969696969697,0.895723682822108,251.30682396888733,0.895723682822108
118,4,Logistic Regression (Penalty = L2),2,0.8,0.946969696969697,0.9463036587488391,2.184798240661621,0.9463036587488391
119,4,Naive Bayes,2,0.8,0.9393939393939394,0.9391714927767687,0.23998355865478516,0.9391714927767687
120,5,KNeighbors Classifier,0,0.8,0.9671641791044776,0.9665378524583883,4.315990447998047,0.9665378524583883
121,5,SVC Classifier,0,0.8,0.9074626865671642,0.90644285610573,5.700365781784058,0.90644285610573
122,5,Decision Tree,0,0.8,0.6537313432835821,0.6499106492724193,0.31726932525634766,0.6499106492724193
123,5,RandomForest,0,0.8,0.6417910447761194,0.5969461757177681,0.9676518440246582,0.5969461757177681
124,5,AdaBoost (Discrete),0,0.8,0.9208955223880597,0.9202792542495155,258.7115352153778,0.9202792542495155
125,5,AdaBoost (Real),0,0.8,0.8716417910447761,0.8684720329745445,268.5859405994415,0.8684720329745445
126,5,Logistic Regression (Penalty = L2),0,0.8,0.9477611940298507,0.9467997708550622,2.214592933654785,0.9467997708550622
127,5,Naive Bayes,0,0.8,0.9223880597014925,0.9219664929487724,0.25191164016723633,0.9219664929487724
128,5,KNeighbors Classifier,1,0.8,0.9388059701492537,0.9379405221741501,4.368582010269165,0.9379405221741501
129,5,SVC Classifier,1,0.8,0.9059701492537313,0.904588298211622,5.945906639099121,0.904588298211622
130,5,Decision Tree,1,0.8,0.6417910447761194,0.6366760604219539,0.267017126083374,0.6366760604219539
131,5,RandomForest,1,0.8,0.6925373134328359,0.6711754725427176,0.9029285907745361,0.6711754725427176
132,5,AdaBoost (Discrete),1,0.8,0.9119402985074627,0.9113669166937702,250.65163445472717,0.9113669166937702
133,5,AdaBoost (Real),1,0.8,0.8865671641791045,0.8854494809998209,266.6292266845703,0.8854494809998209
134,5,Logistic Regression (Penalty = L2),1,0.8,0.9507462686567164,0.9501758639601252,2.293611764907837,0.9501758639601252
135,5,Naive Bayes,1,0.8,0.9194029850746268,0.9187149199718749,0.3524305820465088,0.9187149199718749
136,5,KNeighbors Classifier,2,0.8,0.9636363636363636,0.9628730475883066,4.359820127487183,0.9628730475883066
137,5,SVC Classifier,2,0.8,0.9151515151515152,0.9137756564754975,5.732356548309326,0.9137756564754975
138,5,Decision Tree,2,0.8,0.7106060606060606,0.7062945935153332,0.263653039932251,0.7062945935153332
139,5,RandomForest,2,0.8,0.693939393939394,0.6371200117176546,0.9231829643249512,0.6371200117176546
140,5,AdaBoost (Discrete),2,0.8,0.9257575757575758,0.924681152826872,246.75319576263428,0.924681152826872
141,5,AdaBoost (Real),2,0.8,0.8954545454545455,0.8937764626806765,260.235276222229,0.8937764626806765
142,5,Logistic Regression (Penalty = L2),2,0.8,0.943939393939394,0.9433983404798867,2.16408371925354,0.9433983404798867
143,5,Naive Bayes,2,0.8,0.9348484848484848,0.9344981715909118,0.23757290840148926,0.9344981715909118
144,6,KNeighbors Classifier,0,0.8,0.9701492537313433,0.9697573188524662,4.805575847625732,0.9697573188524662
145,6,SVC Classifier,0,0.8,0.9253731343283582,0.9246107626392012,5.831855058670044,0.9246107626392012
146,6,Decision Tree,0,0.8,0.6716417910447762,0.6617655417537016,0.2497539520263672,0.6617655417537016
147,6,RandomForest,0,0.8,0.6492537313432836,0.6192525136528242,1.0668818950653076,0.6192525136528242
148,6,AdaBoost (Discrete),0,0.8,0.926865671641791,0.9255536092144274,281.784539937973,0.9255536092144274
149,6,AdaBoost (Real),0,0.8,0.8507462686567164,0.8478884465916663,278.7531228065491,0.8478884465916663
150,6,Logistic Regression (Penalty = L2),0,0.8,0.9462686567164179,0.9455736141488363,2.275968074798584,0.9455736141488363
151,6,Naive Bayes,0,0.8,0.9417910447761194,0.9410915603859936,0.30304813385009766,0.9410915603859936
152,6,KNeighbors Classifier,1,0.8,0.9507462686567164,0.9499964795269763,4.83003830909729,0.9499964795269763
153,6,SVC Classifier,1,0.8,0.9328358208955224,0.9320299796163649,5.948022842407227,0.9320299796163649
154,6,Decision Tree,1,0.8,0.6940298507462687,0.690411747086594,0.22844696044921875,0.690411747086594
155,6,RandomForest,1,0.8,0.6253731343283582,0.5988727151155155,0.9152965545654297,0.5988727151155155
156,6,AdaBoost (Discrete),1,0.8,0.9283582089552239,0.9275836978080924,270.51473331451416,0.9275836978080924
157,6,AdaBoost (Real),1,0.8,0.8955223880597015,0.8942311926855525,272.2439033985138,0.8942311926855525
158,6,Logistic Regression (Penalty = L2),1,0.8,0.9507462686567164,0.9504654342494435,2.069262981414795,0.9504654342494435
159,6,Naive Bayes,1,0.8,0.9298507462686567,0.9294233762829391,0.23419904708862305,0.9294233762829391
160,6,KNeighbors Classifier,2,0.8,0.9651515151515152,0.9645437396467552,4.591031312942505,0.9645437396467552
161,6,SVC Classifier,2,0.8,0.9272727272727272,0.9258678493801599,5.604963302612305,0.9258678493801599
162,6,Decision Tree,2,0.8,0.7318181818181818,0.7279450568208904,0.21263670921325684,0.7279450568208904
163,6,RandomForest,2,0.8,0.5924242424242424,0.5455465986449579,0.8080646991729736,0.5455465986449579
164,6,AdaBoost (Discrete),2,0.8,0.953030303030303,0.9523118202988586,256.763964176178,0.9523118202988586
165,6,AdaBoost (Real),2,0.8,0.8787878787878788,0.8770801751949275,248.1411328315735,0.8770801751949275
166,6,Logistic Regression (Penalty = L2),2,0.8,0.9484848484848485,0.9480152403266197,1.939204216003418,0.9480152403266197
167,6,Naive Bayes,2,0.8,0.9348484848484848,0.9345274355817835,0.23355484008789062,0.9345274355817835
168,7,KNeighbors Classifier,0,0.8,0.9656716417910448,0.9651363132046806,4.903408050537109,0.9651363132046806
169,7,SVC Classifier,0,0.8,0.9313432835820895,0.9307404311000904,6.01063871383667,0.9307404311000904
170,7,Decision Tree,0,0.8,0.6791044776119403,0.6720243040145553,0.22847604751586914,0.6720243040145553
171,7,RandomForest,0,0.8,0.6970149253731344,0.6844823006479682,0.80246901512146,0.6844823006479682
172,7,AdaBoost (Discrete),0,0.8,0.9298507462686567,0.9290091841322308,262.4903984069824,0.9290091841322308
173,7,AdaBoost (Real),0,0.8,0.8776119402985074,0.8761367639099716,250.8010699748993,0.8761367639099716
174,7,Logistic Regression (Penalty = L2),0,0.8,0.9477611940298507,0.9471918681007496,2.089142084121704,0.9471918681007496
175,7,Naive Bayes,0,0.8,0.9432835820895522,0.9426453826110143,0.2625620365142822,0.9426453826110143
176,7,KNeighbors Classifier,1,0.8,0.9507462686567164,0.9500501683288389,4.536047458648682,0.9500501683288389
177,7,SVC Classifier,1,0.8,0.9283582089552239,0.9270242190488679,5.141207933425903,0.9270242190488679
178,7,Decision Tree,1,0.8,0.7089552238805971,0.7036404012472538,0.25413942337036133,0.7036404012472538
179,7,RandomForest,1,0.8,0.6925373134328359,0.6809812318062038,0.8119451999664307,0.6809812318062038
180,7,AdaBoost (Discrete),1,0.8,0.9238805970149254,0.9231186462889684,227.41602206230164,0.9231186462889684
181,7,AdaBoost (Real),1,0.8,0.8537313432835821,0.8517752689831183,221.95541310310364,0.8517752689831183
182,7,Logistic Regression (Penalty = L2),1,0.8,0.9462686567164179,0.9460302974154462,1.7759435176849365,0.9460302974154462
183,7,Naive Bayes,1,0.8,0.9298507462686567,0.9295186577896144,0.2317793369293213,0.9295186577896144
184,7,KNeighbors Classifier,2,0.8,0.953030303030303,0.9520177848756906,3.9429471492767334,0.9520177848756906
185,7,SVC Classifier,2,0.8,0.9287878787878788,0.9279147658915096,4.821190595626831,0.9279147658915096
186,7,Decision Tree,2,0.8,0.6651515151515152,0.6617286724884747,0.23541712760925293,0.6617286724884747
187,7,RandomForest,2,0.8,0.7212121212121212,0.6981209733362013,0.6975142955780029,0.6981209733362013
188,7,AdaBoost (Discrete),2,0.8,0.9454545454545454,0.9449099008820817,216.41672658920288,0.9449099008820817
189,7,AdaBoost (Real),2,0.8,0.8666666666666667,0.8619885097887567,211.87424278259277,0.8619885097887567
190,7,Logistic Regression (Penalty = L2),2,0.8,0.95,0.9495325692701441,1.5925054550170898,0.9495325692701441
191,7,Naive Bayes,2,0.8,0.943939393939394,0.9436453289352951,0.21550989151000977,0.9436453289352951
192,8,KNeighbors Classifier,0,0.8,0.9701492537313433,0.9698262205796493,2.309879779815674,0.9698262205796493
193,8,SVC Classifier,0,0.8,0.908955223880597,0.9079479124180067,3.171842098236084,0.9079479124180067
194,8,Decision Tree,0,0.8,0.6701492537313433,0.6660305539260224,0.19793343544006348,0.6660305539260224
195,8,RandomForest,0,0.8,0.7253731343283583,0.7116086577421956,0.6634507179260254,0.7116086577421956
196,8,AdaBoost (Discrete),0,0.8,0.9253731343283582,0.9237673234052791,133.9709017276764,0.9237673234052791
197,8,AdaBoost (Real),0,0.8,0.8611940298507462,0.858029319740548,133.9046928882599,0.858029319740548
198,8,Logistic Regression (Penalty = L2),0,0.8,0.9462686567164179,0.9451000010649467,1.2234997749328613,0.9451000010649467
199,8,Naive Bayes,0,0.8,0.926865671641791,0.9263286871713037,0.1548159122467041,0.9263286871713037
200,8,KNeighbors Classifier,1,0.8,0.9626865671641791,0.9621393181632435,2.131702423095703,0.9621393181632435
201,8,SVC Classifier,1,0.8,0.9104477611940298,0.9092718780037572,2.7706820964813232,0.9092718780037572
202,8,Decision Tree,1,0.8,0.7477611940298508,0.7428731759931836,0.10139727592468262,0.7428731759931836
203,8,RandomForest,1,0.8,0.7223880597014926,0.7010262650800335,0.5880153179168701,0.7010262650800335
204,8,AdaBoost (Discrete),1,0.8,0.9104477611940298,0.9097793983648083,123.97660303115845,0.9097793983648083
205,8,AdaBoost (Real),1,0.8,0.8522388059701492,0.8511557969947421,134.53637433052063,0.8511557969947421
206,8,Logistic Regression (Penalty = L2),1,0.8,0.9447761194029851,0.9440099649354383,0.9976732730865479,0.9440099649354383
207,8,Naive Bayes,1,0.8,0.917910447761194,0.9172222555626615,0.13334155082702637,0.9172222555626615
208,8,KNeighbors Classifier,2,0.8,0.9696969696969697,0.969410506896652,2.0149002075195312,0.969410506896652
209,8,SVC Classifier,2,0.8,0.9272727272727272,0.9265852858327431,2.928518533706665,0.9265852858327431
210,8,Decision Tree,2,0.8,0.7363636363636363,0.7289703128414174,0.1738724708557129,0.7289703128414174
211,8,RandomForest,2,0.8,0.7318181818181818,0.7181535160626895,0.5724945068359375,0.7181535160626895
212,8,AdaBoost (Discrete),2,0.8,0.9272727272727272,0.9264991555232794,114.03776144981384,0.9264991555232794
213,8,AdaBoost (Real),2,0.8,0.8833333333333333,0.8816669837076347,122.68200254440308,0.8816669837076347
214,8,Logistic Regression (Penalty = L2),2,0.8,0.95,0.9494884288301663,1.1612625122070312,0.9494884288301663
215,8,Naive Bayes,2,0.8,0.9363636363636364,0.9360684634154961,0.16324377059936523,0.9360684634154961
