,feat_set_id,classifier,fold_id,feat_th,score,geo_score,exec_t,geo_score_woz
0,0,KNeighbors Classifier,0,0.8,0.8029850746268656,0.7741501671019012,8.749071836471558,0.7741501671019012
1,0,SVC Classifier,0,0.8,0.764179104477612,0.7397770807908258,9.56907868385315,0.7397770807908258
2,0,Decision Tree,0,0.8,0.6253731343283582,0.6087576159722711,0.4927072525024414,0.6087576159722711
3,0,RandomForest,0,0.8,0.5925373134328358,0.5385318215878641,1.5883700847625732,0.5385318215878641
4,0,AdaBoost (Discrete),0,0.8,0.7805970149253731,0.7628037498380368,556.2112157344818,0.7628037498380368
5,0,AdaBoost (Real),0,0.8,0.5313432835820896,0.34048298349319206,632.7686245441437,0.34048298349319206
6,0,Logistic Regression (Penalty = L2),0,0.8,0.7940298507462686,0.7726970005638993,5.725420713424683,0.7726970005638993
7,0,Naive Bayes,0,0.8,0.7582089552238805,0.7290077458920377,0.6393697261810303,0.7290077458920377
8,0,KNeighbors Classifier,1,0.8,0.8164179104477612,0.7859783048468065,10.259756326675415,0.7859783048468065
9,0,SVC Classifier,1,0.8,0.7656716417910447,0.7345396297040946,11.987753868103027,0.7345396297040946
10,0,Decision Tree,1,0.8,0.6492537313432836,0.6351970955542217,0.625791072845459,0.6351970955542217
11,0,RandomForest,1,0.8,0.6238805970149254,0.423723778907485,2.0939977169036865,0.423723778907485
12,0,AdaBoost (Discrete),1,0.8,0.7611940298507462,0.7415924750793139,600.8143844604492,0.7415924750793139
13,0,AdaBoost (Real),1,0.8,0.5194029850746269,0.446037937896442,639.7542290687561,0.446037937896442
14,0,Logistic Regression (Penalty = L2),1,0.8,0.7970149253731343,0.7756415189205846,5.55859637260437,0.7756415189205846
15,0,Naive Bayes,1,0.8,0.7656716417910447,0.7424993871855068,0.6228134632110596,0.7424993871855068
16,0,KNeighbors Classifier,2,0.8,0.806060606060606,0.7746889915746152,10.305282831192017,0.7746889915746152
17,0,SVC Classifier,2,0.8,0.7878787878787878,0.7447694309725453,10.215877056121826,0.7447694309725453
18,0,Decision Tree,2,0.8,0.7015151515151515,0.6789991688418661,0.4290318489074707,0.6789991688418661
19,0,RandomForest,2,0.8,0.6590909090909091,0.6159232074461044,2.570528268814087,0.6159232074461044
20,0,AdaBoost (Discrete),2,0.8,0.7712121212121212,0.7548171017281775,544.133987903595,0.7548171017281775
21,0,AdaBoost (Real),2,0.8,0.7,0.6807138601024566,562.1851828098297,0.6807138601024566
22,0,Logistic Regression (Penalty = L2),2,0.8,0.8151515151515152,0.7958232361954878,5.117778539657593,0.7958232361954878
23,0,Naive Bayes,2,0.8,0.7818181818181819,0.7621595919230361,0.41210436820983887,0.7621595919230361
24,1,KNeighbors Classifier,0,0.8,0.7955223880597015,0.7629641465221307,9.080577373504639,0.7629641465221307
25,1,SVC Classifier,0,0.8,0.7626865671641792,0.7376510146240236,9.727025270462036,0.7376510146240236
26,1,Decision Tree,0,0.8,0.6313432835820896,0.6055676157354627,0.41582798957824707,0.6055676157354627
27,1,RandomForest,0,0.8,0.5925373134328358,0.5385318215878641,1.5962727069854736,0.5385318215878641
28,1,AdaBoost (Discrete),0,0.8,0.7567164179104477,0.7394646813328549,576.857837677002,0.7394646813328549
29,1,AdaBoost (Real),0,0.8,0.5313432835820896,0.34048298349319206,585.4342246055603,0.34048298349319206
30,1,Logistic Regression (Penalty = L2),0,0.8,0.817910447761194,0.8011028508797943,5.232349157333374,0.8011028508797943
31,1,Naive Bayes,0,0.8,0.7626865671641792,0.7388324190725152,0.5513267517089844,0.7388324190725152
32,1,KNeighbors Classifier,1,0.8,0.8044776119402985,0.7703336718737263,9.978814125061035,0.7703336718737263
33,1,SVC Classifier,1,0.8,0.7626865671641792,0.7312983509404082,10.197815895080566,0.7312983509404082
34,1,Decision Tree,1,0.8,0.6895522388059702,0.6705315707796704,0.5458729267120361,0.6705315707796704
35,1,RandomForest,1,0.8,0.6238805970149254,0.423723778907485,1.8672764301300049,0.423723778907485
36,1,AdaBoost (Discrete),1,0.8,0.7746268656716417,0.7631636757436171,538.8940873146057,0.7631636757436171
37,1,AdaBoost (Real),1,0.8,0.5194029850746269,0.44567248078113164,540.1401371955872,0.44567248078113164
38,1,Logistic Regression (Penalty = L2),1,0.8,0.7985074626865671,0.7804193007895859,3.1244685649871826,0.7804193007895859
39,1,Naive Bayes,1,0.8,0.7507462686567165,0.724365037932987,0.05728602409362793,0.724365037932987
40,1,KNeighbors Classifier,2,0.8,0.8166666666666667,0.7886886318696509,8.128256797790527,0.7886886318696509
41,1,SVC Classifier,2,0.8,0.793939393939394,0.7624022817934415,12.126484394073486,0.7624022817934415
42,1,Decision Tree,2,0.8,0.6742424242424242,0.6466410122261848,0.6849238872528076,0.6466410122261848
43,1,RandomForest,2,0.8,0.6590909090909091,0.6159232074461044,2.148560047149658,0.6159232074461044
44,1,AdaBoost (Discrete),2,0.8,0.7772727272727272,0.7627501737645285,1476.0780868530273,0.7627501737645285
45,1,AdaBoost (Real),2,0.8,0.7196969696969697,0.7035295692150337,397.34270119667053,0.7035295692150337
46,1,Logistic Regression (Penalty = L2),2,0.8,0.8348484848484848,0.8184838786046452,3.795156717300415,0.8184838786046452
47,1,Naive Bayes,2,0.8,0.7863636363636364,0.7671402500454767,0.4038078784942627,0.7671402500454767
48,2,KNeighbors Classifier,0,0.8,0.7850746268656716,0.7532163795568563,6.990663528442383,0.7532163795568563
49,2,SVC Classifier,0,0.8,0.7611940298507462,0.734337665424175,7.803722620010376,0.734337665424175
50,2,Decision Tree,0,0.8,0.6701492537313433,0.6461517534637008,0.39421510696411133,0.6461517534637008
51,2,RandomForest,0,0.8,0.6388059701492538,0.6139873872252438,1.3033556938171387,0.6139873872252438
52,2,AdaBoost (Discrete),0,0.8,0.7701492537313432,0.7596091233459988,368.8222827911377,0.7596091233459988
53,2,AdaBoost (Real),0,0.8,0.5313432835820896,0.34048298349319206,371.4521999359131,0.34048298349319206
54,2,Logistic Regression (Penalty = L2),0,0.8,0.8074626865671641,0.7897492545742809,3.17132830619812,0.7897492545742809
55,2,Naive Bayes,0,0.8,0.7477611940298508,0.7182756295885595,0.37969470024108887,0.7182756295885595
56,2,KNeighbors Classifier,1,0.8,0.7940298507462686,0.7515902025768063,6.190834283828735,0.7515902025768063
57,2,SVC Classifier,1,0.8,0.744776119402985,0.7077177401872651,6.584124565124512,0.7077177401872651
58,2,Decision Tree,1,0.8,0.655223880597015,0.6262366454680388,0.3406410217285156,0.6262366454680388
59,2,RandomForest,1,0.8,0.6671641791044776,0.6059416745468484,1.0893235206604004,0.6059416745468484
60,2,AdaBoost (Discrete),1,0.8,0.7701492537313432,0.749652076046414,343.223103761673,0.749652076046414
61,2,AdaBoost (Real),1,0.8,0.6298507462686567,0.5991339658746432,303.92378854751587,0.5991339658746432
62,2,Logistic Regression (Penalty = L2),1,0.8,0.7910447761194029,0.7677166020925184,2.6972508430480957,0.7677166020925184
63,2,Naive Bayes,1,0.8,0.744776119402985,0.7147297049140472,0.28305816650390625,0.7147297049140472
64,2,KNeighbors Classifier,2,0.8,0.796969696969697,0.7649567150790927,4.968566179275513,0.7649567150790927
65,2,SVC Classifier,2,0.8,0.7893939393939394,0.7566121106604082,5.516865253448486,0.7566121106604082
66,2,Decision Tree,2,0.8,0.703030303030303,0.6754043360312832,0.3132293224334717,0.6754043360312832
67,2,RandomForest,2,0.8,0.6318181818181818,0.49767264950277523,0.7938828468322754,0.49767264950277523
68,2,AdaBoost (Discrete),2,0.8,0.7833333333333333,0.7629117804457763,293.37243843078613,0.7629117804457763
69,2,AdaBoost (Real),2,0.8,0.6363636363636364,0.5650979728701047,246.71954226493835,0.5650979728701047
70,2,Logistic Regression (Penalty = L2),2,0.8,0.8045454545454546,0.7763631354866727,2.7621827125549316,0.7763631354866727
71,2,Naive Bayes,2,0.8,0.7712121212121212,0.746348293390427,0.1675701141357422,0.746348293390427
72,3,KNeighbors Classifier,0,0.8,0.8059701492537313,0.7767582921959961,4.338457107543945,0.7767582921959961
73,3,SVC Classifier,0,0.8,0.7656716417910447,0.7407201865034994,4.606099605560303,0.7407201865034994
74,3,Decision Tree,0,0.8,0.6611940298507463,0.6348686159631939,0.2124323844909668,0.6348686159631939
75,3,RandomForest,0,0.8,0.5791044776119403,0.41881657960190977,0.9313039779663086,0.41881657960190977
76,3,AdaBoost (Discrete),0,0.8,0.7671641791044777,0.7551413628031698,275.5196747779846,0.7551413628031698
77,3,AdaBoost (Real),0,0.8,0.5328358208955224,0.34108615761380573,278.43744826316833,0.34108615761380573
78,3,Logistic Regression (Penalty = L2),0,0.8,0.8044776119402985,0.7864780508451958,2.533799886703491,0.7864780508451958
79,3,Naive Bayes,0,0.8,0.7626865671641792,0.7382542374948985,0.17559313774108887,0.7382542374948985
80,3,KNeighbors Classifier,1,0.8,0.8298507462686567,0.8046285989137446,5.0389838218688965,0.8046285989137446
81,3,SVC Classifier,1,0.8,0.7746268656716417,0.7464016645002931,5.810986757278442,0.7464016645002931
82,3,Decision Tree,1,0.8,0.6343283582089553,0.6132153932331343,0.24570631980895996,0.6132153932331343
83,3,RandomForest,1,0.8,0.673134328358209,0.7295401096340085,1.0751004219055176,0.0
84,3,AdaBoost (Discrete),1,0.8,0.7611940298507462,0.7396414338336378,258.1639142036438,0.7396414338336378
85,3,AdaBoost (Real),1,0.8,0.5194029850746269,0.44567248078113164,262.2817757129669,0.44567248078113164
86,3,Logistic Regression (Penalty = L2),1,0.8,0.8134328358208955,0.795267089628949,2.9269721508026123,0.795267089628949
87,3,Naive Bayes,1,0.8,0.7611940298507462,0.736777489836778,0.2553131580352783,0.736777489836778
88,3,KNeighbors Classifier,2,0.8,0.8196969696969697,0.7916097325818162,5.373987913131714,0.7916097325818162
89,3,SVC Classifier,2,0.8,0.7878787878787878,0.7457059296687241,6.387740612030029,0.7457059296687241
90,3,Decision Tree,2,0.8,0.6606060606060606,0.631515313345405,0.257967472076416,0.631515313345405
91,3,RandomForest,2,0.8,0.6363636363636364,0.4250335745195366,1.1194219589233398,0.4250335745195366
92,3,AdaBoost (Discrete),2,0.8,0.7772727272727272,0.7622243988866524,274.0362288951874,0.7622243988866524
93,3,AdaBoost (Real),2,0.8,0.7121212121212122,0.6852605830153188,268.11394906044006,0.6852605830153188
94,3,Logistic Regression (Penalty = L2),2,0.8,0.8348484848484848,0.8160924955306589,3.074411392211914,0.8160924955306589
95,3,Naive Bayes,2,0.8,0.7803030303030303,0.760452839051895,0.30840110778808594,0.760452839051895
96,4,KNeighbors Classifier,0,0.8,0.7910447761194029,0.7608633461696279,5.089011192321777,0.7608633461696279
97,4,SVC Classifier,0,0.8,0.7507462686567165,0.7208640113351028,6.38480281829834,0.7208640113351028
98,4,Decision Tree,0,0.8,0.664179104477612,0.6429165327285489,0.3668975830078125,0.6429165327285489
99,4,RandomForest,0,0.8,0.6537313432835821,0.6017130840984097,1.0958640575408936,0.6017130840984097
100,4,AdaBoost (Discrete),0,0.8,0.7686567164179104,0.7456007126934427,289.91678047180176,0.7456007126934427
101,4,AdaBoost (Real),0,0.8,0.5313432835820896,0.34048298349319206,283.52032446861267,0.34048298349319206
102,4,Logistic Regression (Penalty = L2),0,0.8,0.7865671641791044,0.7663811536224027,2.6107125282287598,0.7663811536224027
103,4,Naive Bayes,0,0.8,0.755223880597015,0.7231043029914949,0.33049702644348145,0.7231043029914949
104,4,KNeighbors Classifier,1,0.8,0.808955223880597,0.7739043979013484,5.135349273681641,0.7739043979013484
105,4,SVC Classifier,1,0.8,0.7492537313432835,0.714663101382424,5.68446683883667,0.714663101382424
106,4,Decision Tree,1,0.8,0.6716417910447762,0.6543937427444564,0.2534005641937256,0.6543937427444564
107,4,RandomForest,1,0.8,0.6880597014925374,0.5542375927626668,0.9197957515716553,0.5542375927626668
108,4,AdaBoost (Discrete),1,0.8,0.7656716417910447,0.7486606355258651,277.7258310317993,0.7486606355258651
109,4,AdaBoost (Real),1,0.8,0.5,0.35278304822257806,268.23848152160645,0.35278304822257806
110,4,Logistic Regression (Penalty = L2),1,0.8,0.8044776119402985,0.7850967415078676,2.5533809661865234,0.7850967415078676
111,4,Naive Bayes,1,0.8,0.764179104477612,0.7364127474575197,0.34037256240844727,0.7364127474575197
112,4,KNeighbors Classifier,2,0.8,0.8045454545454546,0.7695782051680806,4.619304180145264,0.7695782051680806
113,4,SVC Classifier,2,0.8,0.796969696969697,0.7741488619687473,5.46091890335083,0.7741488619687473
114,4,Decision Tree,2,0.8,0.6606060606060606,0.6360117520107414,0.3393547534942627,0.6360117520107414
115,4,RandomForest,2,0.8,0.6909090909090909,0.6348246849286124,1.0161504745483398,0.6348246849286124
116,4,AdaBoost (Discrete),2,0.8,0.7757575757575758,0.7630316342132383,271.7295870780945,0.7630316342132383
117,4,AdaBoost (Real),2,0.8,0.6515151515151515,0.6061399157696836,260.1216895580292,0.6061399157696836
118,4,Logistic Regression (Penalty = L2),2,0.8,0.8121212121212121,0.791507457148821,2.3987908363342285,0.791507457148821
119,4,Naive Bayes,2,0.8,0.7833333333333333,0.7643018907762205,0.2489311695098877,0.7643018907762205
120,5,KNeighbors Classifier,0,0.8,0.7850746268656716,0.7502637282897112,4.5202107429504395,0.7502637282897112
121,5,SVC Classifier,0,0.8,0.764179104477612,0.7382173574590701,5.344219923019409,0.7382173574590701
122,5,Decision Tree,0,0.8,0.6791044776119403,0.6581147445975003,0.31983184814453125,0.6581147445975003
123,5,RandomForest,0,0.8,0.6238805970149254,0.6767678850595662,0.9042954444885254,0.0
124,5,AdaBoost (Discrete),0,0.8,0.753731343283582,0.7353712969933343,252.08433485031128,0.7353712969933343
125,5,AdaBoost (Real),0,0.8,0.5313432835820896,0.34048298349319206,258.4551947116852,0.34048298349319206
126,5,Logistic Regression (Penalty = L2),0,0.8,0.7970149253731343,0.7776647669578215,2.355825424194336,0.7776647669578215
127,5,Naive Bayes,0,0.8,0.7582089552238805,0.7273739424986446,0.3515162467956543,0.7273739424986446
128,5,KNeighbors Classifier,1,0.8,0.808955223880597,0.7761933229198332,4.74095344543457,0.7761933229198332
129,5,SVC Classifier,1,0.8,0.753731343283582,0.7182850672233605,5.426397800445557,0.7182850672233605
130,5,Decision Tree,1,0.8,0.6343283582089553,0.6002689874091427,0.31081271171569824,0.6002689874091427
131,5,RandomForest,1,0.8,0.6074626865671642,0.6361595208018591,0.934201717376709,0.0
132,5,AdaBoost (Discrete),1,0.8,0.7567164179104477,0.7437273655180568,249.6865496635437,0.7437273655180568
133,5,AdaBoost (Real),1,0.8,0.682089552238806,0.6604997492919494,226.79053354263306,0.6604997492919494
134,5,Logistic Regression (Penalty = L2),1,0.8,0.7970149253731343,0.7774026707075756,2.1245384216308594,0.7774026707075756
135,5,Naive Bayes,1,0.8,0.7597014925373134,0.7325269900336893,0.3024003505706787,0.7325269900336893
136,5,KNeighbors Classifier,2,0.8,0.8181818181818182,0.7850457594453605,4.350464820861816,0.7850457594453605
137,5,SVC Classifier,2,0.8,0.7909090909090909,0.7628234230871641,5.051651954650879,0.7628234230871641
138,5,Decision Tree,2,0.8,0.7151515151515152,0.6876351507477715,0.22283029556274414,0.6876351507477715
139,5,RandomForest,2,0.8,0.6378787878787879,0.5263637157237572,0.9603967666625977,0.5263637157237572
140,5,AdaBoost (Discrete),2,0.8,0.7772727272727272,0.7578997817744659,236.71734142303467,0.7578997817744659
141,5,AdaBoost (Real),2,0.8,0.7166666666666667,0.6963069427032456,221.35863780975342,0.6963069427032456
142,5,Logistic Regression (Penalty = L2),2,0.8,0.8242424242424242,0.8065124869443692,2.3234169483184814,0.8065124869443692
143,5,Naive Bayes,2,0.8,0.7833333333333333,0.76124794446202,0.2386763095855713,0.76124794446202
144,6,KNeighbors Classifier,0,0.8,0.7865671641791044,0.7556446364526119,4.9996795654296875,0.7556446364526119
145,6,SVC Classifier,0,0.8,0.7522388059701492,0.7253683967723732,5.566796064376831,0.7253683967723732
146,6,Decision Tree,0,0.8,0.6477611940298508,0.6222199839792473,0.26659107208251953,0.6222199839792473
147,6,RandomForest,0,0.8,0.6074626865671642,0.5409160929061664,0.8018980026245117,0.5409160929061664
148,6,AdaBoost (Discrete),0,0.8,0.7716417910447761,0.7567911673780179,275.64940309524536,0.7567911673780179
149,6,AdaBoost (Real),0,0.8,0.5328358208955224,0.34108615761380573,260.2379298210144,0.34108615761380573
150,6,Logistic Regression (Penalty = L2),0,0.8,0.8074626865671641,0.79025983527562,2.1852023601531982,0.79025983527562
151,6,Naive Bayes,0,0.8,0.7507462686567165,0.7222683225072801,0.2825348377227783,0.7222683225072801
152,6,KNeighbors Classifier,1,0.8,0.8029850746268656,0.7673356024456217,4.140019178390503,0.7673356024456217
153,6,SVC Classifier,1,0.8,0.7597014925373134,0.7258527378452235,4.408453464508057,0.7258527378452235
154,6,Decision Tree,1,0.8,0.6194029850746269,0.5812258918609795,0.2246255874633789,0.5812258918609795
155,6,RandomForest,1,0.8,0.6388059701492538,0.6700681690184029,0.757648229598999,0.0
156,6,AdaBoost (Discrete),1,0.8,0.764179104477612,0.74703844277468,240.8085753917694,0.74703844277468
157,6,AdaBoost (Real),1,0.8,0.5194029850746269,0.446037937896442,231.6710181236267,0.446037937896442
158,6,Logistic Regression (Penalty = L2),1,0.8,0.7955223880597015,0.7750725226100472,2.2698545455932617,0.7750725226100472
159,6,Naive Bayes,1,0.8,0.7582089552238805,0.7330318061599603,0.24205470085144043,0.7330318061599603
160,6,KNeighbors Classifier,2,0.8,0.8106060606060606,0.7819881467458305,4.38273286819458,0.7819881467458305
161,6,SVC Classifier,2,0.8,0.7954545454545454,0.7633311784526101,4.699826717376709,0.7633311784526101
162,6,Decision Tree,2,0.8,0.6575757575757576,0.6386596024879643,0.22572922706604004,0.6386596024879643
163,6,RandomForest,2,0.8,0.65,0.6174947137689223,0.716151237487793,0.6174947137689223
164,6,AdaBoost (Discrete),2,0.8,0.7681818181818182,0.7495038579412981,232.56794047355652,0.7495038579412981
165,6,AdaBoost (Real),2,0.8,0.7333333333333333,0.7114937240122278,207.31998777389526,0.7114937240122278
166,6,Logistic Regression (Penalty = L2),2,0.8,0.8151515151515152,0.79559558681974,1.7543056011199951,0.79559558681974
167,6,Naive Bayes,2,0.8,0.7863636363636364,0.7679444074321985,0.15489768981933594,0.7679444074321985
168,7,KNeighbors Classifier,0,0.8,0.7850746268656716,0.7532845811576314,3.989426612854004,0.7532845811576314
169,7,SVC Classifier,0,0.8,0.7522388059701492,0.7212601914407843,4.105470895767212,0.7212601914407843
170,7,Decision Tree,0,0.8,0.6268656716417911,0.603570961877377,0.195359468460083,0.603570961877377
171,7,RandomForest,0,0.8,0.5955223880597015,0.5243162014655386,0.6199769973754883,0.5243162014655386
172,7,AdaBoost (Discrete),0,0.8,0.7701492537313432,0.7556879904773046,210.46624517440796,0.7556879904773046
173,7,AdaBoost (Real),0,0.8,0.5313432835820896,0.34048298349319206,197.8011453151703,0.34048298349319206
174,7,Logistic Regression (Penalty = L2),0,0.8,0.808955223880597,0.7936823477417628,1.95098876953125,0.7936823477417628
175,7,Naive Bayes,0,0.8,0.7507462686567165,0.7252983007748174,0.19250130653381348,0.7252983007748174
176,7,KNeighbors Classifier,1,0.8,0.8044776119402985,0.7743551395215753,3.574742555618286,0.7743551395215753
177,7,SVC Classifier,1,0.8,0.755223880597015,0.7256744422525926,3.882797956466675,0.7256744422525926
178,7,Decision Tree,1,0.8,0.6343283582089553,0.6175232762954466,0.19600534439086914,0.6175232762954466
179,7,RandomForest,1,0.8,0.5895522388059702,0.46348636037837093,0.5341856479644775,0.46348636037837093
180,7,AdaBoost (Discrete),1,0.8,0.7477611940298508,0.734047489102791,189.23204851150513,0.734047489102791
181,7,AdaBoost (Real),1,0.8,0.5029850746268657,0.3746341580390796,177.2979772090912,0.3746341580390796
182,7,Logistic Regression (Penalty = L2),1,0.8,0.7880597014925373,0.7681951965073343,1.6675336360931396,0.7681951965073343
183,7,Naive Bayes,1,0.8,0.7417910447761195,0.7130343383470291,0.16149568557739258,0.7130343383470291
184,7,KNeighbors Classifier,2,0.8,0.8,0.7719448319834697,2.979475498199463,0.7719448319834697
185,7,SVC Classifier,2,0.8,0.7909090909090909,0.7471382548482925,3.2788004875183105,0.7471382548482925
186,7,Decision Tree,2,0.8,0.6515151515151515,0.6254637337843825,0.15707755088806152,0.6254637337843825
187,7,RandomForest,2,0.8,0.6272727272727273,0.5821342123988031,0.44767236709594727,0.5821342123988031
188,7,AdaBoost (Discrete),2,0.8,0.7772727272727272,0.7599404201949893,169.31317520141602,0.7599404201949893
189,7,AdaBoost (Real),2,0.8,0.6651515151515152,0.6182411382468667,154.12254214286804,0.6182411382468667
190,7,Logistic Regression (Penalty = L2),2,0.8,0.8121212121212121,0.7920678837968937,1.479860544204712,0.7920678837968937
191,7,Naive Bayes,2,0.8,0.7742424242424243,0.7497123697024829,0.14381957054138184,0.7497123697024829
192,8,KNeighbors Classifier,0,0.8,0.8029850746268656,0.7733233259403081,1.4774384498596191,0.7733233259403081
193,8,SVC Classifier,0,0.8,0.755223880597015,0.7278019089387077,2.0338542461395264,0.7278019089387077
194,8,Decision Tree,0,0.8,0.664179104477612,0.6341021956554159,0.10712337493896484,0.6341021956554159
195,8,RandomForest,0,0.8,0.6313432835820896,0.569815949504526,0.29335927963256836,0.569815949504526
196,8,AdaBoost (Discrete),0,0.8,0.746268656716418,0.7236040389799941,96.15833044052124,0.7236040389799941
197,8,AdaBoost (Real),0,0.8,0.5328358208955224,0.34108615761380573,93.27861213684082,0.34108615761380573
198,8,Logistic Regression (Penalty = L2),0,0.8,0.7925373134328358,0.7735865314602165,0.8758385181427002,0.7735865314602165
199,8,Naive Bayes,0,0.8,0.7597014925373134,0.7325478549328875,0.1225128173828125,0.7325478549328875
200,8,KNeighbors Classifier,1,0.8,0.8164179104477612,0.7819061696849171,1.524686336517334,0.7819061696849171
201,8,SVC Classifier,1,0.8,0.7567164179104477,0.7214874010284485,2.0691142082214355,0.7214874010284485
202,8,Decision Tree,1,0.8,0.6597014925373135,0.6356386404050001,0.10857748985290527,0.6356386404050001
203,8,RandomForest,1,0.8,0.6611940298507463,0.5693593037668243,0.3626291751861572,0.5693593037668243
204,8,AdaBoost (Discrete),1,0.8,0.7671641791044777,0.7336985173019761,85.7908685207367,0.7336985173019761
205,8,AdaBoost (Real),1,0.8,0.6626865671641791,0.6313554201880418,81.90972352027893,0.6313554201880418
206,8,Logistic Regression (Penalty = L2),1,0.8,0.8029850746268656,0.7831128638818073,0.8009419441223145,0.7831128638818073
207,8,Naive Bayes,1,0.8,0.7701492537313432,0.7441953094719328,0.09206938743591309,0.7441953094719328
208,8,KNeighbors Classifier,2,0.8,0.8166666666666667,0.7903975500569945,1.4931166172027588,0.7903975500569945
209,8,SVC Classifier,2,0.8,0.7924242424242425,0.7702806866128936,1.83158540725708,0.7702806866128936
210,8,Decision Tree,2,0.8,0.6878787878787879,0.6681938862538104,0.09892702102661133,0.6681938862538104
211,8,RandomForest,2,0.8,0.6621212121212121,0.6249922942529668,0.3453044891357422,0.6249922942529668
212,8,AdaBoost (Discrete),2,0.8,0.7772727272727272,0.7633157393630243,79.5407965183258,0.7633157393630243
213,8,AdaBoost (Real),2,0.8,0.7378787878787879,0.7199478476434654,78.02177548408508,0.7199478476434654
214,8,Logistic Regression (Penalty = L2),2,0.8,0.8287878787878787,0.811240566134657,0.8034601211547852,0.811240566134657
215,8,Naive Bayes,2,0.8,0.7863636363636364,0.7664555986220194,0.09764909744262695,0.7664555986220194
