,feat_set_id,classifier,fold_id,feat_th,score,geo_score,exec_t,geo_score_woz
0,0,KNeighbors Classifier,0,0.05,0.453,0.49704450502265307,6.320558309555054,0.49704450502265307
1,0,SVC Classifier,0,0.05,0.7795,0.09014398837291854,30.532504081726074,0.09014398837291854
2,0,Decision Tree,0,0.05,0.8087,0.5399942204299294,0.059543609619140625,0.5399942204299294
3,0,RandomForest,0,0.05,0.8031,0.45868793940557906,0.3714451789855957,0.45868793940557906
4,0,AdaBoost (Discrete),0,0.05,0.809,0.5426281056022232,20.08545470237732,0.5426281056022232
5,0,AdaBoost (Real),0,0.05,0.8088,0.541475122779432,192.91792058944702,0.541475122779432
6,0,Logistic Regression (Penalty = L2),0,0.05,0.8031,0.4618062302747353,0.2096564769744873,0.4618062302747353
7,0,Naive Bayes,0,0.05,0.7987,0.6128809750946417,0.06680631637573242,0.6128809750946417
8,0,KNeighbors Classifier,1,0.05,0.6211,0.4148293367289105,6.333554029464722,0.4148293367289105
9,0,SVC Classifier,1,0.05,0.7788,1.0,21.20921277999878,0.0
10,0,Decision Tree,1,0.05,0.8254,0.5870325605476784,0.037607669830322266,0.5870325605476784
11,0,RandomForest,1,0.05,0.8122,0.49291982489552855,0.2350022792816162,0.49291982489552855
12,0,AdaBoost (Discrete),1,0.05,0.825,0.5785533636821976,16.490558624267578,0.5785533636821976
13,0,AdaBoost (Real),1,0.05,0.8254,0.5880194354845573,146.995698928833,0.5880194354845573
14,0,Logistic Regression (Penalty = L2),1,0.05,0.8123,0.4933653015566221,0.15774178504943848,0.4933653015566221
15,0,Naive Bayes,1,0.05,0.813,0.6579739274509033,0.09131693840026855,0.6579739274509033
16,0,KNeighbors Classifier,2,0.05,0.7111,0.3583258941737551,6.442169904708862,0.3583258941737551
17,0,SVC Classifier,2,0.05,0.7788,1.0,19.74410367012024,0.0
18,0,Decision Tree,2,0.05,0.823,0.5499084112747326,0.0638573169708252,0.5499084112747326
19,0,RandomForest,2,0.05,0.8122,0.4672526082648893,0.34942007064819336,0.4672526082648893
20,0,AdaBoost (Discrete),2,0.05,0.8231,0.5463129546800016,18.591151237487793,0.5463129546800016
21,0,AdaBoost (Real),2,0.05,0.8227,0.5497989876518654,147.5200057029724,0.5497989876518654
22,0,Logistic Regression (Penalty = L2),2,0.05,0.8122,0.46769559972944375,0.12391090393066406,0.46769559972944375
23,0,Naive Bayes,2,0.05,0.8198,0.6373842013740348,0.08774805068969727,0.6373842013740348
24,1,KNeighbors Classifier,0,0.05,0.7528,0.5069345903313763,1.663466215133667,0.5069345903313763
25,1,SVC Classifier,0,0.05,0.7788,1.0,27.281795501708984,0.0
26,1,Decision Tree,0,0.05,0.7709,0.5186009450516573,0.16408300399780273,0.5186009450516573
27,1,RandomForest,0,0.05,0.81,0.537559170967288,0.3587021827697754,0.537559170967288
28,1,AdaBoost (Discrete),0,0.05,0.8099,0.5375229948394522,25.346927642822266,0.5375229948394522
29,1,AdaBoost (Real),0,0.05,0.7865,0.5132601269813758,40.155680656433105,0.5132601269813758
30,1,Logistic Regression (Penalty = L2),0,0.05,0.8098,0.5374868162767433,0.15662574768066406,0.5374868162767433
31,1,Naive Bayes,0,0.05,0.8102,0.537266290375669,0.0652925968170166,0.537266290375669
32,1,KNeighbors Classifier,1,0.05,0.7234,0.6277010334721602,1.2694673538208008,0.6277010334721602
33,1,SVC Classifier,1,0.05,0.7788,1.0,24.172722339630127,0.0
34,1,Decision Tree,1,0.05,0.7884,0.5697238224194039,0.1618022918701172,0.5697238224194039
35,1,RandomForest,1,0.05,0.8169,0.5165779636134972,0.39028120040893555,0.5165779636134972
36,1,AdaBoost (Discrete),1,0.05,0.825,0.586216000514813,26.685203075408936,0.586216000514813
37,1,AdaBoost (Real),1,0.05,0.8007,0.5583726603995962,40.55772686004639,0.5583726603995962
38,1,Logistic Regression (Penalty = L2),1,0.05,0.825,0.586216000514813,0.1520082950592041,0.586216000514813
39,1,Naive Bayes,1,0.05,0.8249,0.5851859609408057,0.06273603439331055,0.5851859609408057
40,1,KNeighbors Classifier,2,0.05,0.7698,0.48328194631405186,1.2906394004821777,0.48328194631405186
41,1,SVC Classifier,2,0.05,0.7788,1.0,21.63550639152527,0.0
42,1,Decision Tree,2,0.05,0.7814,0.5292441753428829,0.11810851097106934,0.5292441753428829
43,1,RandomForest,2,0.05,0.7941,0.3248903337611793,0.2761545181274414,0.3248903337611793
44,1,AdaBoost (Discrete),2,0.05,0.8231,0.553542491711878,23.791078567504883,0.553542491711878
45,1,AdaBoost (Real),2,0.05,0.7984,0.5271481268506738,37.998743295669556,0.5271481268506738
46,1,Logistic Regression (Penalty = L2),2,0.05,0.8158,0.5022842621365722,0.16788148880004883,0.5022842621365722
47,1,Naive Bayes,2,0.05,0.8225,0.5500871477541514,0.07812094688415527,0.5500871477541514
48,2,KNeighbors Classifier,0,0.05,0.453,0.49704450502265307,6.290405035018921,0.49704450502265307
49,2,SVC Classifier,0,0.05,0.7795,0.09014398837291854,24.42920422554016,0.09014398837291854
50,2,Decision Tree,0,0.05,0.8087,0.5399942204299294,0.06453776359558105,0.5399942204299294
51,2,RandomForest,0,0.05,0.8031,0.45868793940557906,0.3061027526855469,0.45868793940557906
52,2,AdaBoost (Discrete),0,0.05,0.809,0.5426281056022232,17.64801836013794,0.5426281056022232
53,2,AdaBoost (Real),0,0.05,0.8088,0.541475122779432,166.3623242378235,0.541475122779432
54,2,Logistic Regression (Penalty = L2),0,0.05,0.8031,0.4618062302747353,0.15167760848999023,0.4618062302747353
55,2,Naive Bayes,0,0.05,0.7987,0.6128809750946417,0.06635594367980957,0.6128809750946417
56,2,KNeighbors Classifier,1,0.05,0.6211,0.4148293367289105,6.57121729850769,0.4148293367289105
57,2,SVC Classifier,1,0.05,0.7788,1.0,22.640832662582397,0.0
58,2,Decision Tree,1,0.05,0.8254,0.5870325605476784,0.05797266960144043,0.5870325605476784
59,2,RandomForest,1,0.05,0.8122,0.49291982489552855,0.31766748428344727,0.49291982489552855
60,2,AdaBoost (Discrete),1,0.05,0.825,0.5785533636821976,17.69487690925598,0.5785533636821976
61,2,AdaBoost (Real),1,0.05,0.8254,0.5880194354845573,151.37486958503723,0.5880194354845573
62,2,Logistic Regression (Penalty = L2),1,0.05,0.8123,0.4933653015566221,0.15631747245788574,0.4933653015566221
63,2,Naive Bayes,1,0.05,0.813,0.6579739274509033,0.07428908348083496,0.6579739274509033
64,2,KNeighbors Classifier,2,0.05,0.7111,0.3583258941737551,6.51298975944519,0.3583258941737551
65,2,SVC Classifier,2,0.05,0.7788,1.0,20.48090362548828,0.0
66,2,Decision Tree,2,0.05,0.823,0.5499084112747326,0.0631411075592041,0.5499084112747326
67,2,RandomForest,2,0.05,0.8122,0.4672526082648893,0.327225923538208,0.4672526082648893
68,2,AdaBoost (Discrete),2,0.05,0.8231,0.5463129546800016,18.085830450057983,0.5463129546800016
69,2,AdaBoost (Real),2,0.05,0.8228,0.5505575376209837,136.69740629196167,0.5505575376209837
70,2,Logistic Regression (Penalty = L2),2,0.05,0.8122,0.46769559972944375,0.13321375846862793,0.46769559972944375
71,2,Naive Bayes,2,0.05,0.8198,0.6373842013740348,0.10795402526855469,0.6373842013740348
72,3,KNeighbors Classifier,0,0.05,0.453,0.49704450502265307,6.2998387813568115,0.49704450502265307
73,3,SVC Classifier,0,0.05,0.7795,0.09014398837291854,25.03556990623474,0.09014398837291854
74,3,Decision Tree,0,0.05,0.8087,0.5399942204299294,0.062418460845947266,0.5399942204299294
75,3,RandomForest,0,0.05,0.8031,0.45868793940557906,0.23346233367919922,0.45868793940557906
76,3,AdaBoost (Discrete),0,0.05,0.809,0.5426281056022232,17.54036235809326,0.5426281056022232
77,3,AdaBoost (Real),0,0.05,0.8088,0.541475122779432,164.9635989665985,0.541475122779432
78,3,Logistic Regression (Penalty = L2),0,0.05,0.8031,0.4618062302747353,0.1588573455810547,0.4618062302747353
79,3,Naive Bayes,0,0.05,0.7987,0.6128809750946417,0.09241557121276855,0.6128809750946417
80,3,KNeighbors Classifier,1,0.05,0.6211,0.4148293367289105,6.130228281021118,0.4148293367289105
81,3,SVC Classifier,1,0.05,0.7788,1.0,23.317903757095337,0.0
82,3,Decision Tree,1,0.05,0.8254,0.5870325605476784,0.06216788291931152,0.5870325605476784
83,3,RandomForest,1,0.05,0.8122,0.49291982489552855,0.2550687789916992,0.49291982489552855
84,3,AdaBoost (Discrete),1,0.05,0.825,0.5785533636821976,17.518120765686035,0.5785533636821976
85,3,AdaBoost (Real),1,0.05,0.8254,0.5880194354845573,133.65365529060364,0.5880194354845573
86,3,Logistic Regression (Penalty = L2),1,0.05,0.8123,0.4933653015566221,0.1333308219909668,0.4933653015566221
87,3,Naive Bayes,1,0.05,0.813,0.6579739274509033,0.05020260810852051,0.6579739274509033
88,3,KNeighbors Classifier,2,0.05,0.7111,0.3583258941737551,5.976613283157349,0.3583258941737551
89,3,SVC Classifier,2,0.05,0.7788,1.0,21.311436891555786,0.0
90,3,Decision Tree,2,0.05,0.823,0.5499084112747326,0.03827548027038574,0.5499084112747326
91,3,RandomForest,2,0.05,0.8122,0.4672526082648893,0.32477331161499023,0.4672526082648893
92,3,AdaBoost (Discrete),2,0.05,0.8231,0.5463129546800016,19.11605954170227,0.5463129546800016
93,3,AdaBoost (Real),2,0.05,0.8227,0.5497989876518654,156.70796489715576,0.5497989876518654
94,3,Logistic Regression (Penalty = L2),2,0.05,0.8122,0.46769559972944375,0.12890625,0.46769559972944375
95,3,Naive Bayes,2,0.05,0.8198,0.6373842013740348,0.06675410270690918,0.6373842013740348
96,4,KNeighbors Classifier,0,0.05,0.3898,0.4465368785977873,4.454490900039673,0.4465368785977873
97,4,SVC Classifier,0,0.05,0.7788,1.0,16.81890892982483,0.0
98,4,Decision Tree,0,0.05,0.8091,0.5331998579600798,0.03429388999938965,0.5331998579600798
99,4,RandomForest,0,0.05,0.8098,0.5374868162767433,0.28432178497314453,0.5374868162767433
100,4,AdaBoost (Discrete),0,0.05,0.8091,0.5331998579600798,16.413399934768677,0.5331998579600798
101,4,AdaBoost (Real),0,0.05,0.8097,0.5359881800938336,331.0791664123535,0.5359881800938336
102,4,Logistic Regression (Penalty = L2),0,0.05,0.8098,0.5374868162767433,0.12838959693908691,0.5374868162767433
103,4,Naive Bayes,0,0.05,0.8098,0.5374868162767433,0.0683445930480957,0.5374868162767433
104,4,KNeighbors Classifier,1,0.05,0.7373,0.4167498066475552,5.694751262664795,0.4167498066475552
105,4,SVC Classifier,1,0.05,0.7788,1.0,17.781936168670654,0.0
106,4,Decision Tree,1,0.05,0.8245,0.584698307625315,0.04524564743041992,0.584698307625315
107,4,RandomForest,1,0.05,0.8249,0.5865063598458912,0.2596547603607178,0.5865063598458912
108,4,AdaBoost (Discrete),1,0.05,0.8245,0.584698307625315,16.760133743286133,0.584698307625315
109,4,AdaBoost (Real),1,0.05,0.8245,0.584698307625315,317.08581805229187,0.584698307625315
110,4,Logistic Regression (Penalty = L2),1,0.05,0.8249,0.5865063598458912,0.13406872749328613,0.5865063598458912
111,4,Naive Bayes,1,0.05,0.8249,0.5865063598458912,0.04362916946411133,0.5865063598458912
112,4,KNeighbors Classifier,2,0.05,0.7875,0.23526314858897693,5.083255290985107,0.23526314858897693
113,4,SVC Classifier,2,0.05,0.7788,1.0,16.621087789535522,0.0
114,4,Decision Tree,2,0.05,0.824,0.5545891737925498,0.06154489517211914,0.5545891737925498
115,4,RandomForest,2,0.05,0.8241,0.5578316001828668,0.2454361915588379,0.5578316001828668
116,4,AdaBoost (Discrete),2,0.05,0.8241,0.5578316001828668,15.183628559112549,0.5578316001828668
117,4,AdaBoost (Real),2,0.05,0.8241,0.5553406581675171,362.6195869445801,0.5553406581675171
118,4,Logistic Regression (Penalty = L2),2,0.05,0.8241,0.5578316001828668,0.16773581504821777,0.5578316001828668
119,4,Naive Bayes,2,0.05,0.8241,0.5578316001828668,0.049337148666381836,0.5578316001828668
120,5,KNeighbors Classifier,0,0.05,0.453,0.49704450502265307,6.666532039642334,0.49704450502265307
121,5,SVC Classifier,0,0.05,0.7795,0.09014398837291854,25.1801118850708,0.09014398837291854
122,5,Decision Tree,0,0.05,0.8087,0.5399942204299294,0.06406784057617188,0.5399942204299294
123,5,RandomForest,0,0.05,0.8031,0.45868793940557906,0.2782752513885498,0.45868793940557906
124,5,AdaBoost (Discrete),0,0.05,0.809,0.5426281056022232,18.2768292427063,0.5426281056022232
125,5,AdaBoost (Real),0,0.05,0.8088,0.541475122779432,195.75474572181702,0.541475122779432
126,5,Logistic Regression (Penalty = L2),0,0.05,0.8031,0.4618062302747353,0.11872029304504395,0.4618062302747353
127,5,Naive Bayes,0,0.05,0.7987,0.6128809750946417,0.03807425498962402,0.6128809750946417
128,5,KNeighbors Classifier,1,0.05,0.6211,0.4148293367289105,6.251814126968384,0.4148293367289105
129,5,SVC Classifier,1,0.05,0.7788,1.0,21.75582766532898,0.0
130,5,Decision Tree,1,0.05,0.8254,0.5870325605476784,0.06165289878845215,0.5870325605476784
131,5,RandomForest,1,0.05,0.8122,0.49291982489552855,0.24309349060058594,0.49291982489552855
132,5,AdaBoost (Discrete),1,0.05,0.825,0.5785533636821976,18.85647988319397,0.5785533636821976
133,5,AdaBoost (Real),1,0.05,0.8254,0.5880194354845573,140.7938256263733,0.5880194354845573
134,5,Logistic Regression (Penalty = L2),1,0.05,0.8123,0.4933653015566221,0.1562812328338623,0.4933653015566221
135,5,Naive Bayes,1,0.05,0.813,0.6579739274509033,0.0648353099822998,0.6579739274509033
136,5,KNeighbors Classifier,2,0.05,0.7111,0.3583258941737551,7.0268394947052,0.3583258941737551
137,5,SVC Classifier,2,0.05,0.7788,1.0,19.716821908950806,0.0
138,5,Decision Tree,2,0.05,0.823,0.5499084112747326,0.06422662734985352,0.5499084112747326
139,5,RandomForest,2,0.05,0.8122,0.4672526082648893,0.254347562789917,0.4672526082648893
140,5,AdaBoost (Discrete),2,0.05,0.8231,0.5463129546800016,18.169275522232056,0.5463129546800016
141,5,AdaBoost (Real),2,0.05,0.8227,0.5497989876518654,149.47639060020447,0.5497989876518654
142,5,Logistic Regression (Penalty = L2),2,0.05,0.8122,0.46769559972944375,0.1322791576385498,0.46769559972944375
143,5,Naive Bayes,2,0.05,0.8198,0.6373842013740348,0.09060788154602051,0.6373842013740348
144,6,KNeighbors Classifier,0,0.05,0.453,0.49704450502265307,6.509099721908569,0.49704450502265307
145,6,SVC Classifier,0,0.05,0.7795,0.09014398837291854,24.26845359802246,0.09014398837291854
146,6,Decision Tree,0,0.05,0.8087,0.5399942204299294,0.03673529624938965,0.5399942204299294
147,6,RandomForest,0,0.05,0.8031,0.45868793940557906,0.2717599868774414,0.45868793940557906
148,6,AdaBoost (Discrete),0,0.05,0.809,0.5426281056022232,16.94433617591858,0.5426281056022232
149,6,AdaBoost (Real),0,0.05,0.8088,0.541475122779432,155.78314900398254,0.541475122779432
150,6,Logistic Regression (Penalty = L2),0,0.05,0.8031,0.4618062302747353,0.1551222801208496,0.4618062302747353
151,6,Naive Bayes,0,0.05,0.7987,0.6128809750946417,0.06273412704467773,0.6128809750946417
152,6,KNeighbors Classifier,1,0.05,0.6211,0.4148293367289105,6.327984809875488,0.4148293367289105
153,6,SVC Classifier,1,0.05,0.7788,1.0,23.52811574935913,0.0
154,6,Decision Tree,1,0.05,0.8254,0.5870325605476784,0.061049461364746094,0.5870325605476784
155,6,RandomForest,1,0.05,0.8122,0.49291982489552855,0.3456406593322754,0.49291982489552855
156,6,AdaBoost (Discrete),1,0.05,0.825,0.5785533636821976,17.63604497909546,0.5785533636821976
157,6,AdaBoost (Real),1,0.05,0.8254,0.5880194354845573,152.8041229248047,0.5880194354845573
158,6,Logistic Regression (Penalty = L2),1,0.05,0.8123,0.4933653015566221,0.15775346755981445,0.4933653015566221
159,6,Naive Bayes,1,0.05,0.813,0.6579739274509033,0.05674099922180176,0.6579739274509033
160,6,KNeighbors Classifier,2,0.05,0.7111,0.3583258941737551,6.146267414093018,0.3583258941737551
161,6,SVC Classifier,2,0.05,0.7788,1.0,18.23571515083313,0.0
162,6,Decision Tree,2,0.05,0.823,0.5499084112747326,0.01843571662902832,0.5499084112747326
163,6,RandomForest,2,0.05,0.8122,0.4672526082648893,0.3530702590942383,0.4672526082648893
164,6,AdaBoost (Discrete),2,0.05,0.8231,0.5463129546800016,17.786925792694092,0.5463129546800016
165,6,AdaBoost (Real),2,0.05,0.8229,0.5509546220848809,164.05019736289978,0.5509546220848809
166,6,Logistic Regression (Penalty = L2),2,0.05,0.8122,0.46769559972944375,0.1318371295928955,0.46769559972944375
167,6,Naive Bayes,2,0.05,0.8198,0.6373842013740348,0.09113526344299316,0.6373842013740348
168,7,KNeighbors Classifier,0,0.05,0.3898,0.4465368785977873,5.046243906021118,0.4465368785977873
169,7,SVC Classifier,0,0.05,0.7788,1.0,18.43473482131958,0.0
170,7,Decision Tree,0,0.05,0.8091,0.5331998579600798,0.03677845001220703,0.5331998579600798
171,7,RandomForest,0,0.05,0.8098,0.5374868162767433,0.28726792335510254,0.5374868162767433
172,7,AdaBoost (Discrete),0,0.05,0.8091,0.5331998579600798,16.040637969970703,0.5331998579600798
173,7,AdaBoost (Real),0,0.05,0.8097,0.5359881800938336,335.51857471466064,0.5359881800938336
174,7,Logistic Regression (Penalty = L2),0,0.05,0.8098,0.5374868162767433,0.135026216506958,0.5374868162767433
175,7,Naive Bayes,0,0.05,0.8098,0.5374868162767433,0.03323054313659668,0.5374868162767433
176,7,KNeighbors Classifier,1,0.05,0.7373,0.4167498066475552,5.677428960800171,0.4167498066475552
177,7,SVC Classifier,1,0.05,0.7788,1.0,17.458664894104004,0.0
178,7,Decision Tree,1,0.05,0.8245,0.584698307625315,0.046187400817871094,0.584698307625315
179,7,RandomForest,1,0.05,0.8249,0.5865063598458912,0.2577066421508789,0.5865063598458912
180,7,AdaBoost (Discrete),1,0.05,0.8245,0.584698307625315,17.053165435791016,0.584698307625315
181,7,AdaBoost (Real),1,0.05,0.8245,0.584698307625315,332.45622539520264,0.584698307625315
182,7,Logistic Regression (Penalty = L2),1,0.05,0.8249,0.5865063598458912,0.10476565361022949,0.5865063598458912
183,7,Naive Bayes,1,0.05,0.8249,0.5865063598458912,0.0320284366607666,0.5865063598458912
184,7,KNeighbors Classifier,2,0.05,0.7875,0.23526314858897693,5.0620903968811035,0.23526314858897693
185,7,SVC Classifier,2,0.05,0.7788,1.0,17.702504634857178,0.0
186,7,Decision Tree,2,0.05,0.824,0.5545891737925498,0.06225728988647461,0.5545891737925498
187,7,RandomForest,2,0.05,0.8241,0.5578316001828668,0.29314303398132324,0.5578316001828668
188,7,AdaBoost (Discrete),2,0.05,0.8241,0.5578316001828668,16.186386108398438,0.5578316001828668
189,7,AdaBoost (Real),2,0.05,0.8241,0.5553406581675171,362.19255805015564,0.5553406581675171
190,7,Logistic Regression (Penalty = L2),2,0.05,0.8241,0.5578316001828668,0.13032865524291992,0.5578316001828668
191,7,Naive Bayes,2,0.05,0.8241,0.5578316001828668,0.05257534980773926,0.5578316001828668
192,8,KNeighbors Classifier,0,0.05,0.3898,0.4465368785977873,5.293209552764893,0.4465368785977873
193,8,SVC Classifier,0,0.05,0.7788,1.0,19.580567598342896,0.0
194,8,Decision Tree,0,0.05,0.8091,0.5331998579600798,0.05950808525085449,0.5331998579600798
195,8,RandomForest,0,0.05,0.8098,0.5374868162767433,0.3493313789367676,0.5374868162767433
196,8,AdaBoost (Discrete),0,0.05,0.8091,0.5331998579600798,16.417253732681274,0.5331998579600798
197,8,AdaBoost (Real),0,0.05,0.8097,0.5359881800938336,334.3090569972992,0.5359881800938336
198,8,Logistic Regression (Penalty = L2),0,0.05,0.8098,0.5374868162767433,0.11850643157958984,0.5374868162767433
199,8,Naive Bayes,0,0.05,0.8098,0.5374868162767433,0.0551602840423584,0.5374868162767433
200,8,KNeighbors Classifier,1,0.05,0.7373,0.4167498066475552,5.1707141399383545,0.4167498066475552
201,8,SVC Classifier,1,0.05,0.7788,1.0,17.122265577316284,0.0
202,8,Decision Tree,1,0.05,0.8245,0.584698307625315,0.034275054931640625,0.584698307625315
203,8,RandomForest,1,0.05,0.8249,0.5865063598458912,0.29099464416503906,0.5865063598458912
204,8,AdaBoost (Discrete),1,0.05,0.8245,0.584698307625315,17.505359649658203,0.584698307625315
205,8,AdaBoost (Real),1,0.05,0.8245,0.584698307625315,334.09188890457153,0.584698307625315
206,8,Logistic Regression (Penalty = L2),1,0.05,0.8249,0.5865063598458912,0.11481595039367676,0.5865063598458912
207,8,Naive Bayes,1,0.05,0.8249,0.5865063598458912,0.03839731216430664,0.5865063598458912
208,8,KNeighbors Classifier,2,0.05,0.7875,0.23526314858897693,5.670655727386475,0.23526314858897693
209,8,SVC Classifier,2,0.05,0.7788,1.0,16.847187519073486,0.0
210,8,Decision Tree,2,0.05,0.824,0.5545891737925498,0.0615694522857666,0.5545891737925498
211,8,RandomForest,2,0.05,0.8241,0.5578316001828668,0.2576601505279541,0.5578316001828668
212,8,AdaBoost (Discrete),2,0.05,0.8241,0.5578316001828668,15.821388959884644,0.5578316001828668
213,8,AdaBoost (Real),2,0.05,0.8241,0.5553406581675171,366.09562826156616,0.5553406581675171
214,8,Logistic Regression (Penalty = L2),2,0.05,0.8241,0.5578316001828668,0.13921189308166504,0.5578316001828668
215,8,Naive Bayes,2,0.05,0.8241,0.5578316001828668,0.03426218032836914,0.5578316001828668
216,9,KNeighbors Classifier,0,0.05,0.453,0.49704450502265307,5.6329665184021,0.49704450502265307
217,9,SVC Classifier,0,0.05,0.7795,0.09014398837291854,24.223366260528564,0.09014398837291854
218,9,Decision Tree,0,0.05,0.8087,0.5399942204299294,0.035822391510009766,0.5399942204299294
219,9,RandomForest,0,0.05,0.8031,0.45868793940557906,0.21799993515014648,0.45868793940557906
220,9,AdaBoost (Discrete),0,0.05,0.809,0.5426281056022232,17.539064168930054,0.5426281056022232
221,9,AdaBoost (Real),0,0.05,0.8088,0.541475122779432,164.00130343437195,0.541475122779432
222,9,Logistic Regression (Penalty = L2),0,0.05,0.8031,0.4618062302747353,0.12649083137512207,0.4618062302747353
223,9,Naive Bayes,0,0.05,0.7987,0.6128809750946417,0.06245303153991699,0.6128809750946417
224,9,KNeighbors Classifier,1,0.05,0.6211,0.4148293367289105,5.669643878936768,0.4148293367289105
225,9,SVC Classifier,1,0.05,0.7788,1.0,22.81155014038086,0.0
226,9,Decision Tree,1,0.05,0.8254,0.5870325605476784,0.06192183494567871,0.5870325605476784
227,9,RandomForest,1,0.05,0.8122,0.49291982489552855,0.31798768043518066,0.49291982489552855
228,9,AdaBoost (Discrete),1,0.05,0.825,0.5785533636821976,16.742439031600952,0.5785533636821976
229,9,AdaBoost (Real),1,0.05,0.8254,0.5880194354845573,135.97744584083557,0.5880194354845573
230,9,Logistic Regression (Penalty = L2),1,0.05,0.8123,0.4933653015566221,0.1296403408050537,0.4933653015566221
231,9,Naive Bayes,1,0.05,0.813,0.6579739274509033,0.09072709083557129,0.6579739274509033
232,9,KNeighbors Classifier,2,0.05,0.7111,0.3583258941737551,7.496375799179077,0.3583258941737551
233,9,SVC Classifier,2,0.05,0.7788,1.0,19.734905004501343,0.0
234,9,Decision Tree,2,0.05,0.823,0.5499084112747326,0.07623004913330078,0.5499084112747326
235,9,RandomForest,2,0.05,0.8122,0.4672526082648893,0.3534970283508301,0.4672526082648893
236,9,AdaBoost (Discrete),2,0.05,0.8231,0.5463129546800016,18.20712900161743,0.5463129546800016
237,9,AdaBoost (Real),2,0.05,0.8227,0.5497989876518654,139.79657888412476,0.5497989876518654
238,9,Logistic Regression (Penalty = L2),2,0.05,0.8122,0.46769559972944375,0.13179612159729004,0.46769559972944375
239,9,Naive Bayes,2,0.05,0.8198,0.6373842013740348,0.06363415718078613,0.6373842013740348
240,10,KNeighbors Classifier,0,0.05,0.453,0.49704450502265307,5.856395959854126,0.49704450502265307
241,10,SVC Classifier,0,0.05,0.7795,0.09014398837291854,23.43016743659973,0.09014398837291854
242,10,Decision Tree,0,0.05,0.8087,0.5399942204299294,0.07046008110046387,0.5399942204299294
243,10,RandomForest,0,0.05,0.8031,0.45868793940557906,0.2224438190460205,0.45868793940557906
244,10,AdaBoost (Discrete),0,0.05,0.809,0.5426281056022232,17.559828758239746,0.5426281056022232
245,10,AdaBoost (Real),0,0.05,0.8088,0.541475122779432,167.61860132217407,0.541475122779432
246,10,Logistic Regression (Penalty = L2),0,0.05,0.8031,0.4618062302747353,0.13431763648986816,0.4618062302747353
247,10,Naive Bayes,0,0.05,0.7987,0.6128809750946417,0.04843640327453613,0.6128809750946417
248,10,KNeighbors Classifier,1,0.05,0.6211,0.4148293367289105,5.017087936401367,0.4148293367289105
249,10,SVC Classifier,1,0.05,0.7788,1.0,20.943008184432983,0.0
250,10,Decision Tree,1,0.05,0.8254,0.5870325605476784,0.04761457443237305,0.5870325605476784
251,10,RandomForest,1,0.05,0.8122,0.49291982489552855,0.26225805282592773,0.49291982489552855
252,10,AdaBoost (Discrete),1,0.05,0.825,0.5785533636821976,14.420651197433472,0.5785533636821976
253,10,AdaBoost (Real),1,0.05,0.8254,0.5880194354845573,133.54158926010132,0.5880194354845573
254,10,Logistic Regression (Penalty = L2),1,0.05,0.8123,0.4933653015566221,0.14695072174072266,0.4933653015566221
255,10,Naive Bayes,1,0.05,0.813,0.6579739274509033,0.050099849700927734,0.6579739274509033
256,10,KNeighbors Classifier,2,0.05,0.7111,0.3583258941737551,5.831449508666992,0.3583258941737551
257,10,SVC Classifier,2,0.05,0.7788,1.0,16.15790104866028,0.0
258,10,Decision Tree,2,0.05,0.823,0.5499084112747326,0.0474700927734375,0.5499084112747326
259,10,RandomForest,2,0.05,0.8122,0.4672526082648893,0.25995922088623047,0.4672526082648893
260,10,AdaBoost (Discrete),2,0.05,0.8231,0.5463129546800016,14.775907516479492,0.5463129546800016
261,10,AdaBoost (Real),2,0.05,0.8228,0.5501966723242271,127.11909031867981,0.5501966723242271
262,10,Logistic Regression (Penalty = L2),2,0.05,0.8122,0.46769559972944375,0.15366005897521973,0.46769559972944375
263,10,Naive Bayes,2,0.05,0.8198,0.6373842013740348,0.08428263664245605,0.6373842013740348
264,11,KNeighbors Classifier,0,0.05,0.7519,0.5777305966366398,1.4563555717468262,0.5777305966366398
265,11,SVC Classifier,0,0.05,0.7795,0.09014398837291854,23.897595167160034,0.09014398837291854
266,11,Decision Tree,0,0.05,0.7678,0.5280104123027326,0.16244935989379883,0.5280104123027326
267,11,RandomForest,0,0.05,0.8104,0.5362405710304716,0.29445433616638184,0.5362405710304716
268,11,AdaBoost (Discrete),0,0.05,0.8081,0.5426572557990559,22.976659059524536,0.5426572557990559
269,11,AdaBoost (Real),0,0.05,0.7897,0.524740249550609,34.850037574768066,0.524740249550609
270,11,Logistic Regression (Penalty = L2),0,0.05,0.8031,0.4618062302747353,0.15265488624572754,0.4618062302747353
271,11,Naive Bayes,0,0.05,0.7952,0.6244904655755414,0.07125401496887207,0.6244904655755414
272,11,KNeighbors Classifier,1,0.05,0.7683,0.5818378355263657,1.4043195247650146,0.5818378355263657
273,11,SVC Classifier,1,0.05,0.7788,1.0,24.095203638076782,0.0
274,11,Decision Tree,1,0.05,0.7882,0.5715662452303192,0.16356825828552246,0.5715662452303192
275,11,RandomForest,1,0.05,0.8253,0.5800134290808993,0.24587702751159668,0.5800134290808993
276,11,AdaBoost (Discrete),1,0.05,0.8253,0.5800134290808993,22.974933624267578,0.5800134290808993
277,11,AdaBoost (Real),1,0.05,0.8061,0.5784136325546297,31.795008420944214,0.5784136325546297
278,11,Logistic Regression (Penalty = L2),1,0.05,0.8123,0.4933653015566221,0.13873815536499023,0.4933653015566221
279,11,Naive Bayes,1,0.05,0.8089,0.6741215074290099,0.061014413833618164,0.6741215074290099
280,11,KNeighbors Classifier,2,0.05,0.7903,0.499287124006843,1.306037187576294,0.499287124006843
281,11,SVC Classifier,2,0.05,0.7788,1.0,18.923162698745728,0.0
282,11,Decision Tree,2,0.05,0.7804,0.5313434263765147,0.14491868019104004,0.5313434263765147
283,11,RandomForest,2,0.05,0.8233,0.5485689678291474,0.2546241283416748,0.5485689678291474
284,11,AdaBoost (Discrete),2,0.05,0.8232,0.5485326182967332,20.75010347366333,0.5485326182967332
285,11,AdaBoost (Real),2,0.05,0.8039,0.5421853114374483,32.894283294677734,0.5421853114374483
286,11,Logistic Regression (Penalty = L2),2,0.05,0.8103,0.4554302931091201,0.13439702987670898,0.4554302931091201
287,11,Naive Bayes,2,0.05,0.8145,0.6497844195859046,0.0702517032623291,0.6497844195859046
288,12,KNeighbors Classifier,0,0.05,0.3898,0.4465368785977873,4.136742830276489,0.4465368785977873
289,12,SVC Classifier,0,0.05,0.7788,1.0,14.44813847541809,0.0
290,12,Decision Tree,0,0.05,0.8091,0.5331998579600798,0.04451394081115723,0.5331998579600798
291,12,RandomForest,0,0.05,0.8098,0.5374868162767433,0.26112866401672363,0.5374868162767433
292,12,AdaBoost (Discrete),0,0.05,0.8091,0.5331998579600798,12.203459978103638,0.5331998579600798
293,12,AdaBoost (Real),0,0.05,0.8097,0.5359881800938336,244.1370873451233,0.5359881800938336
294,12,Logistic Regression (Penalty = L2),0,0.05,0.8098,0.5374868162767433,0.10409021377563477,0.5374868162767433
295,12,Naive Bayes,0,0.05,0.8098,0.5374868162767433,0.04427742958068848,0.5374868162767433
296,12,KNeighbors Classifier,1,0.05,0.7373,0.4167498066475552,4.172396659851074,0.4167498066475552
297,12,SVC Classifier,1,0.05,0.7788,1.0,11.445452213287354,0.0
298,12,Decision Tree,1,0.05,0.8245,0.584698307625315,0.0252535343170166,0.584698307625315
299,12,RandomForest,1,0.05,0.8249,0.5865063598458912,0.19714927673339844,0.5865063598458912
300,12,AdaBoost (Discrete),1,0.05,0.8245,0.584698307625315,10.256943941116333,0.584698307625315
301,12,AdaBoost (Real),1,0.05,0.8245,0.584698307625315,202.10015678405762,0.584698307625315
302,12,Logistic Regression (Penalty = L2),1,0.05,0.8249,0.5865063598458912,0.10681366920471191,0.5865063598458912
303,12,Naive Bayes,1,0.05,0.8249,0.5865063598458912,0.022492408752441406,0.5865063598458912
304,12,KNeighbors Classifier,2,0.05,0.7875,0.23526314858897693,3.580047369003296,0.23526314858897693
305,12,SVC Classifier,2,0.05,0.7788,1.0,9.545819759368896,0.0
306,12,Decision Tree,2,0.05,0.824,0.5545891737925498,0.03776097297668457,0.5545891737925498
307,12,RandomForest,2,0.05,0.8241,0.5578316001828668,0.13880276679992676,0.5578316001828668
308,12,AdaBoost (Discrete),2,0.05,0.8241,0.5578316001828668,9.953591346740723,0.5578316001828668
309,12,AdaBoost (Real),2,0.05,0.8241,0.5553406581675171,222.15925979614258,0.5553406581675171
310,12,Logistic Regression (Penalty = L2),2,0.05,0.8241,0.5578316001828668,0.1182558536529541,0.5578316001828668
311,12,Naive Bayes,2,0.05,0.8241,0.5578316001828668,0.04592180252075195,0.5578316001828668
