,feat_set_id,classifier,fold_id,feat_th,score,geo_score,exec_t,geo_score_woz
0,0,KNeighbors Classifier,0,1.0,0.8115365489806067,0.7172431293026255,260.2672870159149,0.7172431293026255
1,0,SVC Classifier,0,1.0,0.8302337145698657,0.7018442708992747,80.10354971885681,0.7018442708992747
2,0,Decision Tree,0,1.0,0.8016907011437095,0.7277933293481794,0.1362295150756836,0.7277933293481794
3,0,RandomForest,0,1.0,0.790750870213824,0.40256055983389943,0.17522048950195312,0.40256055983389943
4,0,AdaBoost (Discrete),0,1.0,0.8555942317255097,0.7485880048886243,53.38515901565552,0.7485880048886243
5,0,AdaBoost (Real),0,1.0,0.8479363500745898,0.7700502646961802,60.856080770492554,0.7700502646961802
6,0,Logistic Regression (Penalty = L2),0,1.0,0.8433615116857285,0.7422843541983939,0.28817081451416016,0.7422843541983939
7,0,Naive Bayes,0,1.0,0.48095474888115364,0.5561480093804088,0.13827276229858398,0.5561480093804088
8,0,KNeighbors Classifier,1,1.0,0.8149990053709966,0.7231690979172299,60.8454806804657,0.7231690979172299
9,0,SVC Classifier,1,1.0,0.83061468072409,0.713227635318125,60.69950604438782,0.713227635318125
10,0,Decision Tree,1,1.0,0.8074398249452954,0.7319250198581072,0.15813446044921875,0.7319250198581072
11,0,RandomForest,1,1.0,0.7888402625820569,0.3925460525581129,0.1750802993774414,0.3925460525581129
12,0,AdaBoost (Discrete),1,1.0,0.856972349313706,0.7695589814534102,56.13055467605591,0.7695589814534102
13,0,AdaBoost (Real),1,1.0,0.8512035010940919,0.7746017648546829,59.76223826408386,0.7746017648546829
14,0,Logistic Regression (Penalty = L2),1,1.0,0.8485180027849613,0.7526310581301203,0.21075105667114258,0.7526310581301203
15,0,Naive Bayes,1,1.0,0.5545056693853193,0.6333097169605519,0.1295335292816162,0.6333097169605519
16,0,KNeighbors Classifier,2,1.0,0.814881130010942,0.7205030754369048,58.0789737701416,0.7205030754369048
17,0,SVC Classifier,2,1.0,0.8338804337013827,0.6998761696056429,55.137590169906616,0.6998761696056429
18,0,Decision Tree,2,1.0,0.7971749726449816,0.7186027466838594,0.11397171020507812,0.7186027466838594
19,0,RandomForest,2,1.0,0.7913060777877251,0.40183432324942947,0.15314483642578125,0.40183432324942947
20,0,AdaBoost (Discrete),2,1.0,0.8681985476972048,0.7875094700457456,56.374523401260376,0.7875094700457456
21,0,AdaBoost (Real),2,1.0,0.8517855366557247,0.7744945315092635,58.74842548370361,0.7744945315092635
22,0,Logistic Regression (Penalty = L2),2,1.0,0.8498955535660997,0.750770501207795,0.21308422088623047,0.750770501207795
23,0,Naive Bayes,2,1.0,0.4884114194767731,0.5647234803732183,0.21493124961853027,0.5647234803732183
