{
    "SERVER_ENV": {
        "APP_NAME": "Flask",
        "ENV": "dev",
        "URL": "http://localhost:5000",
        "STATIC_PATH": "./src/static",
        "TEMPLATE_PATH": "./src/template"
    },
    "LOGIN_DATA": {
    },
    "DATABASE": {
        "default": "mysql",
        "mysql": {
          "driver": "mysql+pymysql",
          "user": "mysql-user",
          "password": "mysql-pass",
          "database": "flask",
          "address": "mysql-server"
        }
    },
    "SERVICES": {
    }
}
