Division,WeightClassKg,Place,Name,Team,BodyweightKg,Best3SquatKg,Best3BenchKg,Best3DeadliftKg,TotalKg,Equipment,Event,Sex
Boys,51.71,1,Dominique Moreland,Mansfield Summit,51.26,140.61,81.65,147.42,369.68,Single-ply,SBD,M
Boys,51.71,2,Jeston England,Mansfield,51.71,136.08,88.45,140.61,365.14,Single-ply,SBD,M
Boys,51.71,3,Michael Dixon,Mansfield,48.31,122.47,74.84,136.08,333.39,Single-ply,SBD,M
Boys,51.71,4,Austin Farrar,Fort Worth Western Hills,49.21,102.06,47.63,117.93,267.62,Single-ply,SBD,M
Boys,51.71,5,Brennan Morrell,Mansfield Legacy,48.99,77.11,52.16,99.79,229.06,Single-ply,SBD,M
Boys,51.71,DQ,Mohammad Ali,Mansfield Timberview,45.36,,,,,Single-ply,SBD,M
Boys,59.87,1,Austin Wooldridge,Mansfield Legacy,55.97,136.08,102.06,140.61,378.75,Single-ply,SBD,M
Boys,55.79,2,Michael Lester,Mansfield Summit,55.7,136.08,72.57,158.76,367.41,Single-ply,SBD,M
Boys,55.79,DQ,Celso Granda,Waco University,53.61,,,,,Single-ply,SBD,M
Boys,55.79,4,Reuben Sims,Fort Worth Arlington Heights,54.88,117.93,61.23,102.06,281.23,Single-ply,SBD,M
Boys,55.79,DQ,Kevin Henry,Mansfield,53.8,111.13,79.38,,,Single-ply,SBD,M
Boys,59.87,1,AmonTab Settle,Mansfield Summit,59.65,138.35,79.38,163.29,381.02,Single-ply,SBD,M
Boys,59.87,2,Jarquise DeGrate,Waco University,57.88,140.61,81.65,147.42,369.68,Single-ply,SBD,M
Boys,59.87,3,Tyler Madsen,Fort Worth Western Hills,59.65,106.59,61.23,154.22,322.05,Single-ply,SBD,M
Boys,59.87,4,Brandon Green,Mansfield Timberview,58.6,90.72,49.9,127.01,267.62,Single-ply,SBD,M
Boys,59.87,DQ,Caleb Waugh,Mansfield Legacy,58.97,113.4,,,,Single-ply,SBD,M
Boys,67.13,1,Antwan Coleman,Waco University,64.95,195.04,99.79,158.76,453.59,Single-ply,SBD,M
Boys,67.13,2,Donovan Ellis,Mansfield Summit,66,163.29,90.72,172.37,426.38,Single-ply,SBD,M
Boys,67.13,3,Jake Cook,Mansfield,61.42,154.22,83.91,149.69,387.82,Single-ply,SBD,M
Boys,67.13,4,Matt Jones #5,Mansfield,67.04,140.61,97.52,149.69,387.82,Single-ply,SBD,M
Boys,67.13,DQ,Larron Black,Mansfield Summit,64.18,,,,,Single-ply,SBD,M
Boys,74.84,DQ,Emiliano Andrada,Fort Worth Arlington Heights,67.22,124.74,,,,Single-ply,SBD,M
Boys,67.13,DQ,Travis Hord,Granbury,66.45,138.35,,,,Single-ply,SBD,M
Boys,74.84,1,Terrance Majors,Waco University,72.03,204.12,133.81,195.04,532.97,Single-ply,SBD,M
Boys,82.1,2,Brandon Allen #3,Mansfield Summit,75.02,170.1,129.27,217.72,517.1,Single-ply,SBD,M
Boys,74.84,3,Ja'Darius Wright,Waco University,74.48,181.44,86.18,172.37,439.98,Single-ply,SBD,M
Boys,74.84,4,Richard Akinwale,Mansfield,72.57,147.42,99.79,161.03,408.23,Single-ply,SBD,M
Boys,74.84,5,Aaron Stevonson,Fort Worth Western Hills,73.3,138.35,88.45,163.29,390.09,Single-ply,SBD,M
Boys,74.84,6,David Hutto,Fort Worth Western Hills,69.85,124.74,83.91,176.9,385.55,Single-ply,SBD,M
Boys,74.84,7,Jt Ibe,Mansfield,68.4,158.76,72.57,151.95,383.29,Single-ply,SBD,M
Boys,74.84,8,Ashoton Goodson,Granbury,70.53,136.08,86.18,158.76,381.02,Single-ply,SBD,M
Boys,74.84,9,Josh Williams,Fort Worth Western Hills,73.26,147.42,61.23,151.95,360.61,Single-ply,SBD,M
Boys,82.1,1,Derrious Burns,Waco University,78.56,204.12,127.01,204.12,535.24,Single-ply,SBD,M
Boys,82.1,2,Tremayne Green,Mansfield,80.2,188.24,142.88,179.17,510.29,Single-ply,SBD,M
Boys,82.1,3,Brendan Lavergne,Mansfield Summit,80.06,179.17,111.13,217.72,508.02,Single-ply,SBD,M
Boys,82.1,4,Marcus Lattimore,Mansfield Legacy,75.66,170.1,127.01,185.97,483.08,Single-ply,SBD,M
Boys,82.1,5,Matthew Nieman,Mansfield Legacy,79.15,188.24,111.13,183.7,483.08,Single-ply,SBD,M
Boys,82.1,6,Ben Ohene,Mansfield Summit,82.1,181.44,108.86,213.19,503.49,Single-ply,SBD,M
Boys,82.1,7,Zak Worthington,Mansfield Legacy,80.29,170.1,113.4,165.56,449.06,Single-ply,SBD,M
Boys,82.1,8,Miguel Guerra,Waco University,82.01,163.29,99.79,185.97,449.06,Single-ply,SBD,M
Boys,82.1,9,Keynon Smith,Fort Worth Arlington Heights,78.47,142.88,102.06,181.44,426.38,Single-ply,SBD,M
Boys,82.1,10,Kameron Holmes,Fort Worth Arlington Heights,80.51,142.88,113.4,142.88,399.16,Single-ply,SBD,M
Boys,82.1,11,Sean Slater,Fort Worth Western Hills,78.02,142.88,65.77,185.97,394.63,Single-ply,SBD,M
Boys,82.1,12,Mike Milson,Granbury,78.93,124.74,113.4,154.22,392.36,Single-ply,SBD,M
Boys,82.1,13,Tyler Huddelston,Granbury,80.74,124.74,77.11,136.08,337.93,Single-ply,SBD,M
Boys,82.1,14,Antonio Santoyo,Mansfield Timberview,80.29,102.06,61.23,129.27,292.57,Single-ply,SBD,M
Boys,89.81,1,Michael Adefolarin,Mansfield Timberview,87.09,208.65,120.2,195.04,523.9,Single-ply,SBD,M
Boys,89.81,2,Derrick Ndede,Mansfield Legacy,88.45,195.04,117.93,192.78,505.76,Single-ply,SBD,M
Boys,89.81,3,Anthony Rodriguez #3,Waco University,87.63,172.37,104.33,183.7,460.4,Single-ply,SBD,M
Boys,89.81,4,Nick Tull,Granbury,85.96,161.03,102.06,170.1,433.18,Single-ply,SBD,M
Boys,89.81,5,Quade Gibson,Granbury,88,131.54,97.52,158.76,387.82,Single-ply,SBD,M
Boys,89.81,6,Lane Walker,Mansfield Timberview,86.41,151.95,81.65,151.95,385.55,Single-ply,SBD,M
Boys,89.81,7,Antonio Settle,Mansfield Timberview,88,117.93,102.06,145.15,365.14,Single-ply,SBD,M
Boys,89.81,DQ,Omar Valadez,Fort Worth Arlington Heights,84.82,158.76,,,,Single-ply,SBD,M
Boys,99.79,1,Kentrell Joyner,Mansfield,97.61,235.87,142.88,235.87,614.62,Single-ply,SBD,M
Boys,99.79,2,Dub Ingram,Mansfield Legacy,97.43,213.19,145.15,183.7,542.04,Single-ply,SBD,M
Boys,99.79,3,Andrew Loos,Mansfield Summit,97.89,199.58,129.27,201.85,530.7,Single-ply,SBD,M
Boys,99.79,4,Jason Poole,Fort Worth Western Hills,93.44,197.31,104.33,219.99,521.63,Single-ply,SBD,M
Boys,99.79,5,Chris McCoy,Mansfield Timberview,99.11,204.12,111.13,192.78,508.02,Single-ply,SBD,M
Boys,99.79,6,Jorge Acevedo,Mansfield Timberview,93.89,181.44,127.01,172.37,480.81,Single-ply,SBD,M
Boys,99.79,7,Bimi Shabani,Fort Worth Arlington Heights,91.63,165.56,102.06,190.51,458.13,Single-ply,SBD,M
Boys,99.79,8,Kelby Wiley,Granbury,99.11,181.44,108.86,163.29,453.59,Single-ply,SBD,M
Boys,99.79,DQ,Nate Milson,Granbury,93.21,90.72,,,,Single-ply,SBD,M
Boys,109.77,1,Devin Benton,Mansfield Summit,106.59,226.8,158.76,258.55,644.1,Single-ply,SBD,M
Boys,109.77,2,Albert Willingham,Fort Worth Western Hills,109.13,226.8,163.29,199.58,589.67,Single-ply,SBD,M
Boys,109.77,3,Reme Lawson,Mansfield Timberview,107.05,204.12,113.4,215.46,532.97,Single-ply,SBD,M
Boys,124.74,4,Darius Alley,Waco University,109.95,210.92,117.93,199.58,528.44,Single-ply,SBD,M
Boys,109.77,5,Juan Gutierrez,Granbury,109.77,195.04,104.33,172.37,471.74,Single-ply,SBD,M
Boys,124.74,1,Jeremy Miller,Mansfield Timberview,123.83,235.87,145.15,204.12,585.13,Single-ply,SBD,M
Boys,124.74,2,Ernest Thomas,Fort Worth Arlington Heights,118.61,233.6,145.15,201.85,580.6,Single-ply,SBD,M
Boys,124.74,DQ,Joseph Pilgram,Granbury,112.94,,,,,Single-ply,SBD,M
Boys,124.74,4,Othon Perales,Fort Worth Arlington Heights,112.94,183.7,147.42,215.46,546.58,Single-ply,SBD,M
Boys,124.74,5,Chad Whitener,Mansfield,115.39,197.31,140.61,206.38,544.31,Single-ply,SBD,M
Boys,124.74,6,Zac Pincomb,Mansfield,118.57,213.19,131.54,174.63,519.36,Single-ply,SBD,M
Boys,124.74,7,Christian Reyes,Fort Worth Western Hills,119.11,151.95,97.52,174.63,424.11,Single-ply,SBD,M
Boys,124.74,8,Thomas Turner,Waco University,113.67,165.56,97.52,156.49,419.57,Single-ply,SBD,M
Boys,124.74,9,Sean Partridge,Fort Worth Western Hills,123.38,156.49,74.84,151.95,383.29,Single-ply,SBD,M
Boys,124.74,10,Colt Casner,Mansfield Timberview,112.49,113.4,74.84,136.08,324.32,Single-ply,SBD,M
Boys,124.74,DQ,Kenny Johnson,Fort Worth Western Hills,121.29,,,,,Single-ply,SBD,M
Boys,124.74+,1,Ben Hughes,Waco University,141.79,233.6,145.15,238.14,616.89,Single-ply,SBD,M
Boys,124.74+,2,Jimmy Miller,Mansfield Summit,189.15,233.6,145.15,224.53,603.28,Single-ply,SBD,M
Boys,124.74+,3,Benny Willliams,Fort Worth Arlington Heights,127.46,233.6,136.08,183.7,553.38,Single-ply,SBD,M
Boys,124.74+,4,Jd Brener,Granbury,132.45,204.12,142.88,192.78,539.77,Single-ply,SBD,M
Boys,124.74+,5,Robert Byrd,Fort Worth Arlington Heights,143.79,183.7,83.91,161.03,428.64,Single-ply,SBD,M
