Place,Name,Sex,BirthDate,Age,Equipment,Division,BodyweightKg,WeightClassKg,Squat1Kg,Squat2Kg,Squat3Kg,Best3SquatKg,Bench1Kg,Bench2Kg,Bench3Kg,Best3BenchKg,Deadlift1Kg,Deadlift2Kg,Deadlift3Kg,Best3DeadliftKg,TotalKg,Event
1,Albert Thomas Nieboer,M,1980-12-18,42,Wraps,M40-44,121.75,125,245,270,-290,270,165,185,190,190,220,245,-265,245,705,SBD
1,Jason Allen,M,1979-07-19,43,Raw,M40-44,131.5,140,265,280,-290,280,165,172.5,-182.5,172.5,255,265,-272.5,265,717.5,SBD
1,James Hummel,M,1993-02-04,30,Raw,Open,79.5,82.5,,,,,,,,,232.5,245,255,255,255,D
1,Ches Vandenberg,M,,,Wraps,Open,88.8,90,245,255,-272.5,255,155,-162.5,-162.5,155,282.5,290,-300,290,700,SBD
2,Aaron Theilade,M,1985-09-23,37,Raw,Open,88,90,162.5,-175,182.5,182.5,100,-107.5,-110,100,205,225,235,235,517.5,SBD
DQ,Mackie Fleishman,M,1987-08-12,35,Wraps,Open,89.3,90,-305,,,,215,,,215,,,,,,SBD
1,Drew Byron,M,1990-10-01,32,Raw,Open,108.35,110,205,215,220,220,152.5,162.5,167.5,167.5,235,250,-260,250,637.5,SBD
2,Antonio Thomas Calvert,M,1998-08-15,24,Raw,Open,104.5,110,195,205,215,215,120,125,-130,125,210,-225,,210,550,SBD
1,Wil Dejong,M,1992-06-09,31,Raw,Open,115.55,125,287.5,310,320,320,175,-190,-190,175,320,355,-380,355,850,SBD
1,Joseph Favia,M,,36,Raw,Open,133.75,140,275,310,,310,202.5,-215,-215,202.5,227.5,275,,275,787.5,SBD
2,Jason Allen,M,1979-07-19,43,Raw,Open,131.5,140,265,280,-290,280,165,172.5,-182.5,172.5,255,265,-272.5,265,717.5,SBD
1,Jonathan Archibald,M,2004-04-14,19,Raw,J17-19,119.1,125,197.5,215,227.5,227.5,110,120,122.5,122.5,205,225,240,240,590,SBD
1,Brent Gardiner,M,1984-12-12,38,Raw,S35-39,107.55,110,215,227.5,237.5,237.5,-142.5,155,-167.5,155,215,250,257.5,257.5,650,SBD
1,Joseph Favia,M,,36,Raw,S35-39,133.75,140,275,310,,310,202.5,-215,-215,202.5,227.5,275,,275,787.5,SBD
1,Simardeep Virk,M,1989-09-15,33,Single-ply,Open,99.9,100,270,300,,300,160,200,,200,230,,,230,730,SBD
1,Lucky Sandhar,M,1990-04-10,33,Single-ply,Open,104.85,110,-225,230,250,250,142.5,160,180,180,-240,260,-275,260,690,SBD
1,James Hummel,M,1993-02-04,30,Raw,Open,79.5,82.5,,,,,135,145,-155,145,232.5,245,255,255,400,BD
1,Tony Wiens,M,1962-11-27,60,Raw,M60-64,108.45,110,,,,,160,170,175,175,,,,,175,B
1,James Hummel,M,1993-02-04,30,Raw,Open,79.5,82.5,,,,,135,145,-155,145,,,,,145,B
1,Cam St Amand,M,1998-04-03,25,Raw,Open,134.1,140,,,,,200,-207.5,-207.5,200,,,,,200,B
