Division,WeightClassKg,Place,Name,Team,BodyweightKg,Best3SquatKg,Best3BenchKg,Best3DeadliftKg,TotalKg,Equipment,Event,Sex
Boys,51.71,1,Kyler Snell,Grapeland,51.53,106.59,56.7,115.67,278.96,Single-ply,SBD,M
Boys,51.71,2,Heath Schlottman,Mount Vernon,47.54,97.52,58.97,113.4,269.89,Single-ply,SBD,M
Boys,51.71,3,Nate Brower,Maud,50.98,99.79,56.7,102.06,258.55,Single-ply,SBD,M
Boys,55.79,1,Chandler Bush,Elysian Fields,51.8,149.69,68.04,172.37,390.09,Single-ply,SBD,M
Boys,55.79,2,Aaron Butler,Celeste,55.7,142.88,92.99,154.22,390.09,Single-ply,SBD,M
Boys,55.79,3,Kadin Daniels,Maud,55.7,136.08,72.57,151.95,360.61,Single-ply,SBD,M
Boys,55.79,4,Elijah Webster,Queen City,55.43,124.74,70.31,149.69,344.73,Single-ply,SBD,M
Boys,55.79,5,Gavin Rhea,Simms Bowie,55.61,120.2,70.31,136.08,326.59,Single-ply,SBD,M
Boys,59.87,1,Ben Harris #2,Queen City,59.06,154.22,117.93,181.44,453.59,Single-ply,SBD,M
Boys,59.87,2,Ethan Adair,Lone Oak,59.78,163.29,92.99,163.29,419.57,Single-ply,SBD,M
Boys,59.87,3,Osbaldo Chavez,Gilmer Union Hill,59.78,142.88,97.52,170.1,410.5,Single-ply,SBD,M
Boys,59.87,4,Chris Counts,Lone Oak,56.15,154.22,79.38,158.76,392.36,Single-ply,SBD,M
Boys,59.87,5,Kasen Haynes,Lone Oak,56.15,165.56,79.38,133.81,378.75,Single-ply,SBD,M
Boys,59.87,6,Karson Bynum,Linden-Kildare,59.78,131.54,88.45,142.88,362.87,Single-ply,SBD,M
Boys,59.87,7,Christopher Cochran,New Boston,58.88,88.45,52.16,108.86,249.48,Single-ply,SBD,M
Boys,67.13,1,Jason Jackson #5,De Kalb,66.86,217.72,122.47,204.12,544.31,Single-ply,SBD,M
Boys,67.13,2,Cole Hahn,Lone Oak,65.68,199.58,120.2,181.44,501.22,Single-ply,SBD,M
Boys,67.13,3,Patrick Dreesen,Linden-Kildare,62.78,183.7,102.06,170.1,455.86,Single-ply,SBD,M
Boys,67.13,4,Kavontae Starling,Tatum,64.5,156.49,81.65,158.76,396.89,Single-ply,SBD,M
Boys,67.13,5,Thezak Wright,Lone Oak,62.23,142.88,88.45,161.03,392.36,Single-ply,SBD,M
Boys,67.13,6,DeAndre Doss,Diana New Diana,67.13,149.69,81.65,133.81,365.14,Single-ply,SBD,M
Boys,67.13,7,Larry Chandler,Mount Vernon,64.23,113.4,61.23,158.76,333.39,Single-ply,SBD,M
Boys,67.13,8,Jace Bramlett,Maud,61.87,83.91,49.9,102.06,235.87,Single-ply,SBD,M
Boys,67.13,DQ,Hunter Camarillo,Linden-Kildare,67.04,,,,,Single-ply,SBD,M
Boys,67.13,DQ,Joshua Davis,Queen City,66.68,149.69,,,,Single-ply,SBD,M
Boys,74.84,1,John Wims,Detroit,74.75,226.8,151.95,213.19,591.94,Single-ply,SBD,M
Boys,74.84,2,Cole Morris,Lone Oak,73.75,192.78,117.93,181.44,492.15,Single-ply,SBD,M
Boys,74.84,3,Kaman Seals,Celeste,74.48,181.44,108.86,176.9,467.2,Single-ply,SBD,M
Boys,74.84,4,Aj Singleton,Tatum,74.48,174.63,83.91,181.44,439.98,Single-ply,SBD,M
Boys,74.84,5,De'Marcus Williams,Marshall,68.95,170.1,83.91,183.7,437.72,Single-ply,SBD,M
Boys,74.84,6,Jacky Jackson,Lone Oak,71.03,174.63,79.38,183.7,437.72,Single-ply,SBD,M
Boys,74.84,7,Tommy Stagner,Queen City,73.57,161.03,86.18,176.9,424.11,Single-ply,SBD,M
Boys,74.84,8,Joshua Freemna,Mount Vernon,73.39,158.76,83.91,179.17,421.84,Single-ply,SBD,M
Boys,74.84,9,Tony Mason,Elysian Fields,67.86,158.76,86.18,174.63,419.57,Single-ply,SBD,M
Boys,74.84,10,Sebastian Lewis,Hawkins,73.94,145.15,111.13,151.95,408.23,Single-ply,SBD,M
Boys,74.84,11,Paul Leal,De Kalb,73.12,149.69,92.99,156.49,399.16,Single-ply,SBD,M
Boys,74.84,12,Justin Jackson #2,Simms Bowie,71.76,136.08,70.31,145.15,351.53,Single-ply,SBD,M
Boys,74.84,13,Blade Green,Simms Bowie,72.94,131.54,61.23,142.88,335.66,Single-ply,SBD,M
Boys,74.84,14,Kaden Finney,Mount Vernon,73.39,120.2,74.84,124.74,319.78,Single-ply,SBD,M
Boys,74.84,DQ,Trey Schuler,Linden-Kildare,69.76,179.17,,,,Single-ply,SBD,M
Boys,82.1,1,Joe McCallum,Lone Oak,78.38,242.67,117.93,224.53,585.13,Single-ply,SBD,M
Boys,82.1,2,Zane Freeman,Diana New Diana,81.65,213.19,129.27,222.26,564.72,Single-ply,SBD,M
Boys,82.1,3,Bryce Jurca,Celeste,75.84,197.31,120.2,226.8,544.31,Single-ply,SBD,M
Boys,82.1,4,Gage Mauch,Lone Oak,81.65,213.19,106.59,206.38,526.17,Single-ply,SBD,M
Boys,82.1,5,Dillion Kizer,De Kalb,79.56,190.51,117.93,197.31,505.76,Single-ply,SBD,M
Boys,82.1,6,Ty Watkins,Lone Oak,79.83,190.51,113.4,188.24,492.15,Single-ply,SBD,M
Boys,82.1,7,Tyler Williams,Lone Oak,81.37,195.04,104.33,181.44,480.81,Single-ply,SBD,M
Boys,82.1,8,Caden Hoefar,Lone Oak,81.28,190.51,111.13,174.63,476.27,Single-ply,SBD,M
Boys,82.1,9,Brady Henslee,Celeste,82.1,163.29,108.86,181.44,453.59,Single-ply,SBD,M
Boys,82.1,10,Jayden Wilson,Diana New Diana,79.02,161.03,111.13,161.03,433.18,Single-ply,SBD,M
Boys,82.1,11,Garrison Conner,Diana New Diana,82.1,136.08,79.38,158.76,374.21,Single-ply,SBD,M
Boys,82.1,12,Questyn Dunlap,Mount Vernon,79.38,147.42,65.77,147.42,360.61,Single-ply,SBD,M
Boys,82.1,13,Hunter Cathey,Mount Vernon,78.2,136.08,72.57,147.42,356.07,Single-ply,SBD,M
Boys,82.1,14,Keaton Decker,Mount Vernon,78.65,113.4,86.18,151.95,351.53,Single-ply,SBD,M
Boys,82.1,15,Kaden Sutton,Simms Bowie,81.92,124.74,63.5,145.15,333.39,Single-ply,SBD,M
Boys,89.81,1,Dylan Perkins,New Boston,86.55,206.38,127.01,226.8,560.19,Single-ply,SBD,M
Boys,89.81,2,Dylan Dodson,Diana New Diana,85.82,213.19,117.93,195.04,526.17,Single-ply,SBD,M
Boys,89.81,3,Seth Brower,Maud,87.45,172.37,108.86,190.51,471.74,Single-ply,SBD,M
Boys,89.81,4,Bradley Parsons,Detroit,89.81,183.7,111.13,174.63,469.47,Single-ply,SBD,M
Boys,89.81,5,Caden Lambert,Diana New Diana,89.54,161.03,92.99,190.51,444.52,Single-ply,SBD,M
Boys,89.81,6,Elisha Higginbotham,Diana New Diana,89.72,156.49,92.99,133.81,383.29,Single-ply,SBD,M
Boys,89.81,7,James Smith,Simms Bowie,85.64,140.61,63.5,158.76,362.87,Single-ply,SBD,M
Boys,89.81,8,Austin Sagura,Mount Vernon,85.37,102.06,88.45,133.81,324.32,Single-ply,SBD,M
Boys,89.81,DQ,Gunner Minor,Linden-Kildare,84.73,181.44,,,,Single-ply,SBD,M
Boys,99.79,1,Ty Watts,Simms Bowie,98.61,256.28,154.22,238.14,648.64,Single-ply,SBD,M
Boys,99.79,2,Nathan Slemmons,Lone Oak,95.35,244.94,120.2,190.51,555.65,Single-ply,SBD,M
Boys,99.79,3,Aaron Hill,New Boston,99.25,204.12,113.4,238.14,555.65,Single-ply,SBD,M
Boys,99.79,4,Londell Howard,De Kalb,94.53,190.51,106.59,208.65,505.76,Single-ply,SBD,M
Boys,99.79,5,Nic Kunze,Linden-Kildare,95.16,183.7,97.52,183.7,464.93,Single-ply,SBD,M
Boys,99.79,6,Joel Martinez,Mount Vernon,96.07,170.1,113.4,167.83,451.32,Single-ply,SBD,M
Boys,99.79,7,Brandon Obenoskey,Simms Bowie,98.07,176.9,99.79,170.1,446.79,Single-ply,SBD,M
Boys,99.79,8,Keylan Easley,Diana New Diana,92.9,136.08,97.52,167.83,401.43,Single-ply,SBD,M
Boys,99.79,9,Ethan Lum,Simms Bowie,99.7,147.42,102.06,145.15,394.63,Single-ply,SBD,M
Boys,99.79,DQ,Justin Jenkins,Detroit,94.98,,,,,Single-ply,SBD,M
Boys,99.79,DQ,Wordell Glaspie,Tatum,99.52,183.7,,,,Single-ply,SBD,M
Boys,109.77,1,Brevin Randle,Marshall,104.05,249.48,136.08,254.01,639.57,Single-ply,SBD,M
Boys,109.77,2,Seth Gammage,Lone Oak,109.04,240.4,136.08,213.19,589.67,Single-ply,SBD,M
Boys,109.77,3,Chance Hicks,Maud,107.59,204.12,136.08,204.12,544.31,Single-ply,SBD,M
Boys,109.77,4,Jaden Luhn,Lone Oak,107.77,215.46,108.86,192.78,517.1,Single-ply,SBD,M
Boys,109.77,5,Brock Foster,Maud,109.59,181.44,131.54,185.97,498.95,Single-ply,SBD,M
Boys,109.77,6,Landon Liles,Linden-Kildare,105.6,172.37,113.4,197.31,483.08,Single-ply,SBD,M
Boys,109.77,7,Dawson Parker,New Boston,109.77,124.74,88.45,136.08,349.27,Single-ply,SBD,M
Boys,109.77,DQ,Tanner Smith,Celeste,107.41,,,,,Single-ply,SBD,M
Boys,124.74,1,Ian Stewart,Simms Bowie,119.48,224.53,115.67,190.51,530.7,Single-ply,SBD,M
Boys,124.74,2,Christopher McDaniel,De Kalb,124.65,181.44,111.13,204.12,496.68,Single-ply,SBD,M
Boys,124.74,3,Michael Dancer,Mount Vernon,111.77,158.76,83.91,149.69,392.36,Single-ply,SBD,M
Boys,124.74+,1,Christian Hood,Marshall,137.26,258.55,147.42,240.4,646.37,Single-ply,SBD,M
Boys,124.74+,2,Tj Fagan,Tatum,170.1,272.16,142.88,226.8,641.83,Single-ply,SBD,M
Boys,124.74+,3,Cody Rutherford,New Boston,138.8,222.26,136.08,226.8,585.13,Single-ply,SBD,M
Boys,124.74+,4,Quiton Johnson,Mount Vernon,133.72,181.44,106.59,183.7,471.74,Single-ply,SBD,M
Boys,124.74+,DQ,Lucas Stephenson,Simms Bowie,142.97,308.44,142.88,,,Single-ply,SBD,M
Boys,124.74+,DQ,Cj Hubbard,Lone Oak,131.27,226.8,204.12,,,Single-ply,SBD,M
