Place,Name,Sex,BirthDate,Age,Country,State,Equipment,Division,BodyweightKg,WeightClassKg,Squat1Kg,Squat2Kg,Squat3Kg,Best3SquatKg,Bench1Kg,Bench2Kg,Bench3Kg,Bench4Kg,Best3BenchKg,Deadlift1Kg,Deadlift2Kg,Deadlift3Kg,Deadlift4Kg,Best3DeadliftKg,TotalKg,Event
1,Everette Sherrill,F,2003-03-26,20,USA,NC,Raw,J-T,65.6,67.5,125,132.5,-137.5,132.5,52.5,55,-60,,55,127.5,132.5,-137.5,,132.5,320,SBD
2,Courtney Fox,F,2000-05-01,23,USA,NC,Raw,J-T,67.4,67.5,110,120,-125,120,37.5,45,50,,50,102.5,110,120,,120,290,SBD
1,Christina Walton,F,2002-04-11,21,USA,NC,Raw,J-T,82,82.5,120,125,-132.5,125,45,52.5,-60,,52.5,120,132.5,-140,,132.5,310,SBD
1,Isabella Heffner,F,1999-09-09,23,USA,SC,Raw,J-T,88.5,90,147.5,157.5,162.5,162.5,62.5,70,77.5,,77.5,152.5,167.5,177.5,,177.5,417.5,SBD
1,Cindy Thompson,F,1982-10-15,40,USA,NC,Raw,M1-T,72.6,75,90,97.5,102.5,102.5,60,65,72.5,,72.5,70,82.5,87.5,,87.5,262.5,SBD
1,Mandy Self-Sparrow,F,1975-09-07,47,USA,NC,Raw,M2-T,86,90,97.5,102.5,110,110,55,-60,-60,,55,112.5,-120,120,,120,285,SBD
1,Kimberly Dorton,F,1979-10-16,43,USA,NC,Raw,M1-T,102.1,110,102.5,-125,-132.5,102.5,40,70,-75,,70,142.5,165,175,,175,347.5,SBD
1,Jennifer Zwaan,F,1978-08-19,44,USA,NC,Raw,M1-U,71.8,75,125,135,145,145,80,87.5,-95,,87.5,142.5,165,175,,175,407.5,SBD
1,Sonja Drury,F,1969-11-19,53,USA,NC,Raw,M3-T,67.1,67.5,82.5,92.5,-102.5,92.5,37.5,45,-50,,45,90,97.5,105,,105,242.5,SBD
1,Sue Ann Hurlbert,F,1960-11-30,62,USA,SC,Raw,M5-T,50.2,52,57.5,-61.5,61.5,61.5,42.5,45,47.5,-48.5,47.5,85,95,101.5,,101.5,210.5,SBD
1,Christina Walton,F,2002-04-11,21,USA,NC,Raw,N-X,82,82.5,120,125,-132.5,125,45,52.5,-60,,52.5,120,132.5,-140,,132.5,310,SBD
1,Angela Dunn,F,1990-06-14,33,USA,NC,Raw,N-X,140,110+,105,117.5,122.5,122.5,65,77.5,82.5,,82.5,105,122.5,127.5,,127.5,332.5,SBD
1,Christina Walton,F,2002-04-11,21,USA,NC,Raw,O-T,82,82.5,120,125,-132.5,125,45,52.5,-60,,52.5,120,132.5,-140,,132.5,310,SBD
1,Liz Gutierrez,F,1999-07-11,24,USA,NC,Raw,O-T,83.2,90,85,95,105,105,42.5,47.5,50,,50,97.5,107.5,112.5,,112.5,267.5,SBD
1,Amy Portillo,F,1997-02-21,26,USA,NC,Raw,O-T,99.1,100,145,-152.5,155,155,50,57.5,-62.5,,57.5,135,145,152.5,167.5,152.5,365,SBD
1,Jennifer Zwaan,F,1978-08-19,44,USA,NC,Raw,O-U,71.8,75,125,135,145,145,80,87.5,-95,,87.5,142.5,165,175,,175,407.5,SBD
1,Sophia Drury,F,2006-06-23,17,USA,NC,Raw,T2-X,58.8,60,50,60,65,65,25,-32.5,-32.5,,25,67.5,72.5,77.5,,77.5,167.5,SBD
1,Sara Hampton,F,2007-02-06,16,USA,NC,Raw,T2-X,65,67.5,80,90,100,100,42.5,52.5,57.5,,57.5,92.5,100,105,,105,262.5,SBD
1,Katy Silvers,F,1981-06-08,42,USA,NC,Wraps,M1-T,109,110,160,170,185,185,72.5,77.5,82.5,,82.5,140,162.5,180,,180,447.5,SBD
1,Bethany Brooks,F,1994-09-02,28,USA,NC,Wraps,N-X,54.6,56,-82.5,82.5,-92.5,82.5,25,30,-32.5,,30,80,90,97.5,,97.5,210,SBD
1,Kristie Johnston,F,1989-01-03,34,USA,NC,Wraps,O-T,80.1,82.5,155,167.5,177.5,177.5,92.5,100,-105,,100,155,167.5,177.5,-190.5,177.5,455,SBD
1,Jordan Berryhill,F,1991-03-27,32,USA,NC,Wraps,O-T,84.5,90,90,97.5,102.5,102.5,45,50,-52.5,,50,102.5,107.5,110,,110,262.5,SBD
1,Katy Silvers,F,1981-06-08,42,USA,NC,Wraps,O-T,109,110,160,170,185,185,72.5,77.5,82.5,,82.5,140,162.5,180,,180,447.5,SBD
1,Kari Rankin,F,1996-09-12,26,USA,NC,Wraps,O-U,77.8,82.5,92.5,110,-122.5,110,67.5,-75,-75,,67.5,142.5,165,180,,180,357.5,SBD
DQ,Kristen Smith #6,F,1997-11-15,25,USA,NC,Wraps,O-U,79.7,82.5,-155,-155,-155,,70,77.5,-82.5,,77.5,140,162.5,-170,,162.5,,SBD
1,Melissa Smith #1,F,1974-08-28,48,USA,NC,Multi-ply,M2-U,64.1,67.5,232.5,247.5,-252.5,247.5,-135,-150,150,,150,140,152.5,165,,165,562.5,SBD
1,Shelley Yates,F,1975-07-19,48,USA,NC,Multi-ply,M2-U,89.1,90,277.5,-295,295,295,-180,180,205,,205,177.5,190,197.5,,197.5,697.5,SBD
2,Jeanine Russell,F,1979-11-19,43,USA,SC,Multi-ply,M1-U,83.5,90,175,190,-200,190,70,-115,115,,115,170,185,-200,,185,490,SBD
1,Melissa Smith #1,F,1974-08-28,48,USA,NC,Multi-ply,O-U,64.1,67.5,232.5,247.5,-252.5,247.5,-135,-150,150,,150,140,152.5,165,,165,562.5,SBD
1,Shelley Yates,F,1975-07-19,48,USA,NC,Multi-ply,O-U,89.1,90,277.5,-295,295,295,-180,180,205,,205,177.5,190,197.5,,197.5,697.5,SBD
1,Ciearra Jackson-Griffen,F,1991-06-24,32,USA,NC,Raw,N-X,81.2,82.5,,,,,87.5,95,100,105,100,142.5,150,157.5,162.5,157.5,257.5,BD
1,Jessica Littleton,F,1992-11-30,30,USA,NC,Raw,N-X,97,100,,,,,50,57.5,-60,,57.5,125,137.5,150,166,150,207.5,BD
1,Ciearra Jackson-Griffen,F,1991-06-24,32,USA,NC,Raw,O-T,81.2,82.5,,,,,87.5,95,100,105,100,142.5,150,157.5,162.5,157.5,257.5,BD
1,Kristen Smith #6,F,1997-11-15,25,USA,NC,Raw,O-U,79.7,82.5,,,,,70,77.5,-82.5,,77.5,140,162.5,-170,,162.5,240,BD
1,Anika Harper,F,1980-04-03,43,USA,NC,Single-ply,M1-T,97.7,100,,,,,-112.5,-122.5,122.5,,122.5,140,162.5,-180,,162.5,285,BD
1,Anika Harper,F,1980-04-03,43,USA,NC,Single-ply,O-T,97.7,100,,,,,-112.5,-122.5,122.5,,122.5,140,162.5,-180,,162.5,285,BD
DQ,Sarah Harris,F,2000-11-29,22,USA,SC,Raw,J-T,64.8,67.5,,,,,-62.5,-62.5,-62.5,,,,,,,,,B
1,Anika Harper,F,1980-04-03,43,USA,NC,Single-ply,M1-T,97.7,100,,,,,-112.5,-122.5,122.5,,122.5,,,,,,122.5,B
1,Anika Harper,F,1980-04-03,43,USA,NC,Single-ply,O-T,97.7,100,,,,,-112.5,-122.5,122.5,,122.5,,,,,,122.5,B
1,Melissa Smith #1,F,1974-08-28,48,USA,NC,Multi-ply,M2-U,64.1,67.5,,,,,-135,-150,150,,150,,,,,,150,B
1,Shelley Yates,F,1975-07-19,48,USA,NC,Multi-ply,M2-U,89.1,90,,,,,-180,180,205,,205,,,,,,205,B
1,Melissa Smith #1,F,1974-08-28,48,USA,NC,Multi-ply,O-U,64.1,67.5,,,,,-135,-150,150,,150,,,,,,150,B
1,Shelley Yates,F,1975-07-19,48,USA,NC,Multi-ply,O-U,89.1,90,,,,,-180,180,205,,205,,,,,,205,B
1,Anika Harper,F,1980-04-03,43,USA,NC,Single-ply,M1-T,97.7,100,,,,,,,,,,140,162.5,-180,,162.5,162.5,D
1,Anika Harper,F,1980-04-03,43,USA,NC,Single-ply,O-T,97.7,100,,,,,,,,,,140,162.5,-180,,162.5,162.5,D
