{
    "version": "https://jsonfeed.org/version/1",
    "title": "Fred&#x27;s Blog",
    "description": "",
    "home_page_url": "https://fred.tr3nt.gitlab.io/publii",
    "feed_url": "https://fred.tr3nt.gitlab.io/publii/feed.json",
    "user_comment": "",
    "author": {
        "name": "Fred"
    },
    "items": [
    ]
}
