[
    {
      "source_id":null,
      "source_name": "Threatpost",
      "author": "Tara Seals",
      "title": "Singtel Suffers Zero-Day Cyberattack, Damage Unknown",
      "description": "The Tier 1 telecom giant was caught up in a coordinated, wide-ranging attack using unpatched security bugs in the Accellion legacy file-transfer program.",
      "url": "https://threatpost.com/singtel-zero-day-cyberattack/163938/",
      "urlToImage": "https://media.threatpost.com/wp-content/uploads/sites/103/2021/02/12111228/singtel-telecom-hack-asia.jpg",
      "publishedAt": "2021-02-12T17:05:10Z",
      "content": "The Tier 1 telecom giant was caught up in a coordinated, wide-ranging attack using unpatched security bugs in the Accellion legacy file-transfer program. Singtel, owner of Australian telco Optus, was… [+7516 chars]"
    },
    {
      "source_id":null,
      "source_name": "Motley Fool",
      "author": "newsfeedback@fool.com (Motley Fool Transcribing)",
      "title": "Walt Disney (DIS) Q1 2021 Earnings Call Transcript",
      "description": "DIS earnings call for the period ending December 31, 2020.",
      "url": "https://www.fool.com/earnings/call-transcripts/2021/02/11/walt-disney-dis-q1-2021-earnings-call-transcript/",
      "urlToImage": "https://g.foolcdn.com/editorial/images/1/featured-transcript-logo-template.jpg",
      "publishedAt": "2021-02-12T04:01:27Z",
      "content": "Image source: The Motley Fool.\r\nWalt Disney (NYSE:DIS)Q1 2021 Earnings CallFeb 11, 2021, 4:30 p.m. ET\r\nContents:\r\n<ul><li>Prepared Remarks</li><li>Questions and Answers</li><li>Call Participants</li>… [+54996 chars]"
    },
    {
      "source_id":null,
      "source_name": "Viva.co.id",
      "author": "Fikri Halim, Mohammad Yudha Prasetya",
      "title": "DKI Permudah Perizinan Pembangunan Properti, Ini Tanggapan REI",
      "description": "Berita DKI Permudah Perizinan Pembangunan Properti, Ini Tanggapan REI terbaru hari ini 2021-02-11 17:23:28 dari sumber yang terpercaya",
      "url": "https://www.viva.co.id/berita/bisnis/1347675-dki-permudah-perizinan-pembangunan-properti-ini-tanggapan-rei",
      "urlToImage": "https://thumb.viva.co.id/media/frontend/thumbs3/2016/12/05/5845584511da4-proyek-pembangunan-apartemen_665_374.jpg",
      "publishedAt": "2021-02-11T10:23:28Z",
      "content": "VIVA  Dewan Pengurus Daerah (DPD) Realestat Indonesia (REI) DKI Jakarta, mengapresiasi langkah dan kebijakan Pemerintah Provinsi DKI Jakarta atas terbitnya Peraturan Gubernur (Pergub) Nomor 118 Tahun… [+527 chars]"
    },
    {
        "source_id":null,
        "source_name": "Viva.co.id",
      "author": "Lazuardhi Utama",
      "title": "Kamu Bisa Dapat Kuota Internet 50GB Harga Rp100 Ribu, Cuma 2 Hari",
      "description": "Berita Kamu Bisa Dapat Kuota Internet 50GB Harga Rp100 Ribu, Cuma 2 Hari terbaru hari ini 2021-02-11 15:31:01 dari sumber yang terpercaya",
      "url": "https://www.viva.co.id/digital/digilife/1347629-kamu-bisa-dapat-kuota-internet-50gb-harga-rp100-ribu-cuma-2-hari",
      "urlToImage": "https://thumb.viva.co.id/media/frontend/thumbs3/2016/06/10/575a92955496e-booth-telkomsel-di-jakarta-fair-kemayoran-2016_665_374.jpg",
      "publishedAt": "2021-02-11T08:31:01Z",
      "content": "VIVA  Operator telekomunikasi Telkomsel kembali menggelar program Surprise Deal, di mana pelanggan dapat menikmati kuota internet unlimited alias tanpa batas hingga 50GB seharga Rp100 ribu. Program i… [+442 chars]"
    },
    {
        "source_id":null,
        "source_name": "Viva.co.id",
      "author": "Fikri Halim, Mohammad Yudha Prasetya",
      "title": "Wishnutama Diangkat Jadi Komisaris Utama Telkomsel",
      "description": "Berita Wishnutama Diangkat Jadi Komisaris Utama Telkomsel terbaru hari ini 2021-02-11 15:18:45 dari sumber yang terpercaya",
      "url": "https://www.viva.co.id/berita/bisnis/1347623-wishnutama-diangkat-jadi-komisaris-utama-telkomsel",
      "urlToImage": "https://thumb.viva.co.id/media/frontend/thumbs3/2020/03/23/5e78a543d03a8-menteri-pariwisata-dan-ekonomi-kreatif-wishnutama_665_374.jpg",
      "publishedAt": "2021-02-11T08:18:45Z",
      "content": "VIVA  PT Telkom Indonesia Tbk (Telkom) dan Singapore Telecommunications Ltd (SingTel), selaku pemegang saham PT Telekomunikasi Selular (Telkomsel), telah resmi mengangkat Wishnutama Kusubandio sebaga… [+525 chars]"
    },
    {
        "source_id":null,
        "source_name": "Slashdot.org",
      "author": "Mugniar",
      "title": "Tanya Veronika Asisten Virtual Telkomsel via Whatsapp, Jangan Sampai Salah",
      "description": "eronika adalah sapaan bagi asisten virtual Telkomsel yang mana merupakan pelayan para pengguna kartu telekomunikasi berwarna dominan merah ini. Layanan ini berbasis digital chat yang bertujuan memudahkan para pelanggannya dalam melakukan beragam aktivitas, se…",
      "url": "https://slashdot.org/submission/13239466/tanya-veronika-asisten-virtual-telkomsel-via-whatsapp-jangan-sampai-salah",
      "urlToImage": null,
      "publishedAt": "2021-02-09T12:12:22Z",
      "content": "The Fine Print: The following comments are owned by whoever posted them. We are not responsible for them in any way."
    },
    {
        "source_id":null,
        "source_name": "PRNewswire",
      "author": null,
      "title": "Parallel Wireless est le premier fournisseur à alimenter le RAN ouvert du laboratoire communautaire du TIP en Indonésie",
      "description": "Les solutions de RAN ouvert conformes aux réseaux 2G, 3G et 4G les plus évolués aident Telkomsel, Indosat Ooredoo, XL Axiata et Smartfren à déployer le RAN ouvert en Indonésie NASHUA, New Hampshire, 3 février 2021 /PRNewswire/ -- Aujourd'hui, la société améri…",
      "url": "https://www.prnewswire.com/news-releases/parallel-wireless-est-le-premier-fournisseur-a-alimenter-le-ran-ouvert-du-laboratoire-communautaire-du-tip-en-indonesie-841736842.html",
      "urlToImage": "https://mma.prnewswire.com/media/1004727/PW_FullColor_CMYK_Logo.jpg?p=facebook",
      "publishedAt": "2021-02-03T21:20:00Z",
      "content": "Les solutions de RAN ouvert conformes aux réseaux 2G, 3G et 4G les plus évolués aident Telkomsel, Indosat Ooredoo, XL Axiata et Smartfren à déployer le RAN ouvert en Indonésie\r\nNASHUA, New Hampshire,… [+8735 chars]"
    },
    {
        "source_id":null,
        "source_name": "PRNewswire",
      "author": null,
      "title": "Parallel Wireless ist der erste Anbieter, der das OpenRAN Community Lab von TIP in Indonesien betreibt",
      "description": "Ausgereiftestes 2G 3G 4G Open RAN zur Unterstützung von Telkomsel, Indosat Ooredoo, XL Axiata und Smartfren beim Einsatz von Open RAN in Indonesien NASHUA, New Hampshire, 3. Februar 2021 /PRNewswire/ -- Parallel Wireless, Inc., das führende Open-RAN-Unternehm…",
      "url": "https://www.prnewswire.com/news-releases/parallel-wireless-ist-der-erste-anbieter-der-das-openran-community-lab-von-tip-in-indonesien-betreibt-840855129.html",
      "urlToImage": "https://mma.prnewswire.com/media/1004727/PW_FullColor_CMYK_Logo.jpg?p=facebook",
      "publishedAt": "2021-02-03T16:54:00Z",
      "content": "Ausgereiftestes 2G 3G 4G Open RAN zur Unterstützung von Telkomsel, Indosat Ooredoo, XL Axiata und Smartfren beim Einsatz von Open RAN in Indonesien\r\nNASHUA, New Hampshire, 3. Februar 2021 /PRNewswire… [+7746 chars]"
    },
    {
        "source_id":null,
        "source_name": "PRNewswire",
      "author": null,
      "title": "Parallel Wireless ist der erste Anbieter, der das OpenRAN Community Lab von TIP in Indonesien betreibt",
      "description": "Ausgereiftestes 2G 3G 4G Open RAN zur Unterstützung von Telkomsel, Indosat Ooredoo, XL Axiata und Smartfren beim Einsatz von Open RAN in Indonesien NASHUA, New Hampshire, 3. Februar 2021 /PRNewswire/ -- Parallel Wireless, Inc., das führende Open-RAN-Unternehm…",
      "url": "https://prnmedia.prnewswire.com/news-releases/parallel-wireless-ist-der-erste-anbieter-der-das-openran-community-lab-von-tip-in-indonesien-betreibt-840855129.html",
      "urlToImage": null,
      "publishedAt": "2021-02-03T16:54:00Z",
      "content": null
    },
    {
        "source_id":null,
        "source_name": "PRNewswire",
      "author": null,
      "title": "Automated Network Optimization from Cellwize is to be Deployed by Indonesia's Telkomsel to Enhance Network Performance & Customer Experience - PRNewswire",
      "description": "/PRNewswire/ -- Cellwize Wireless Technologies Inc. (Cellwize), a global leader in mobile network automation and orchestration today announced that leading...",
      "url": "https://www.prnewswire.com/il/news-releases/automated-network-optimization-from-cellwize-is-to-be-deployed-by-indonesias-telkomsel-to-enhance-network-performance--customer-experience-301221058.html",
      "urlToImage": "https://www.prnewswire.com/content/dam/prnewswire/common/prn_facebook_sharing_logo.jpg",
      "publishedAt": "2021-02-03T14:00:00Z",
      "content": "DALLAS, Feb. 3, 2021 /PRNewswire/ -- Cellwize\r\n Wireless Technologies Inc. (Cellwize), a global leader in mobile network automation and orchestration today announced that leading Indonesian mobile op… [+3858 chars]"
    },
    {
        "source_id":null,
        "source_name": "PRNewswire",
      "author": null,
      "title": "Automated Network Optimization from Cellwize is to be Deployed by Indonesia's Telkomsel to Enhance Network Performance & Customer Experience",
      "description": "DALLAS, Feb. 3, 2021 /PRNewswire/ -- Cellwize Wireless Technologies Inc. (Cellwize), a global leader in mobile network automation and orchestration today announced that leading Indonesian mobile operator, Telkomsel, has selected Cellwize CHIME to improve netw…",
      "url": "https://www.prnewswire.com/news-releases/automated-network-optimization-from-cellwize-is-to-be-deployed-by-indonesias-telkomsel-to-enhance-network-performance--customer-experience-301221058.html",
      "urlToImage": "https://www.prnewswire.com/content/dam/prnewswire/common/prn_facebook_sharing_logo.jpg",
      "publishedAt": "2021-02-03T14:00:00Z",
      "content": "DALLAS, Feb. 3, 2021 /PRNewswire/ -- Cellwize\r\n Wireless Technologies Inc. (Cellwize), a global leader in mobile network automation and orchestration today announced that leading Indonesian mobile op… [+3861 chars]"
    },
    {
        "source_id":null,
        "source_name": "TelecomTV",
      "author": "Ray Le Maistre",
      "title": "Indonesian operators put Open RAN to the test",
      "description": "TIP Community Lab opens for testing, validationAmdocs acts as integrator for the Lab, multiple vendors participateOperators already engaged in lab and field tr…",
      "url": "https://www.telecomtv.com/content/open-ran/indonesian-operators-put-open-ran-to-the-test-40766/",
      "urlToImage": "https://assets.telecomtv.com/assets/telecomtv/telkom-university-10855.jpeg?w=1200",
      "publishedAt": "2021-02-03T12:23:54Z",
      "content": "With the planned Telecom Infra Project (TIP) Community Lab based in Bandung, Indonesia, now open and acting as the local hub of test and validation activity, Indonesia’s mobile operators are accelera… [+2428 chars]"
    },
    {
        "source_id":null,
        "source_name": "CNET",
      "author": null,
      "title": "Parallel WirelessParallel WirelessがインドネシアでTIPのOpenRANコミュニティー・ラボを支援する初のベンダーに",
      "description": "AsiaNet 87886 （0250）【ナシュア（米ニューハンプシャー州）2021年2月3日PR Newswire＝共同通信JBN】＊インドネシアでTelkomsel、Indosat Ooredoo、XL Axiata、SmartfrenのOpen RAN展開を支援する最も成熟した2G 3G 4G Open RAN米国を拠点に、地方と都市のコネクティビティー向けで世界唯一の2G 3G 4G 5G O-RAN準拠の...",
      "url": "https://japan.cnet.com/release/30516389/",
      "urlToImage": "https://japan.cnet.com/media/c/2012/images/logo/logo_ogp.png",
      "publishedAt": "2021-02-03T00:45:00Z",
      "content": "AsiaNet 87886 0250\r\n202123PR NewswireJBNTelkomselIndosat OoredooXL AxiataSmartfrenOpen RAN2G 3G 4G Open RAN\r\n2G 3G 4G 5G O-RANOpen RANOpen RANParallel Wireless, Inc.3Telecom Infra ProjectTIPOpen RANO… [+803 chars]"
    },
    {
        "source_id":null,
        "source_name": "PRNewswire",
      "author": null,
      "title": "Parallel Wireless es el primer vendedor en utilizar el OpenRAN Community Lab de TIP en Indonesia",
      "description": "Los más maduros 2G 3G 4G Open RAN ayudan a Telkomsel, Indosat Ooredoo, XL Axiata y Smartfren a desplegar Open RAN en Indonesia NASHUA, N.H., 2 de febrero de 2021 /PRNewswire/ -- Parallel Wireless, Inc., principal compañía Open RAN con sede en Estados Unidos q…",
      "url": "https://prnmedia.prnewswire.com/news-releases/parallel-wireless-es-el-primer-vendedor-en-utilizar-el-openran-community-lab-de-tip-en-indonesia-804951743.html",
      "urlToImage": null,
      "publishedAt": "2021-02-02T17:00:00Z",
      "content": null
    },
    {
        "source_id":null,
        "source_name": "PRNewswire",
      "author": null,
      "title": "Parallel Wireless é o primeiro fornecedor de energia do laboratório comunitário de OpenRAN do TIP na Indonésia",
      "description": "NASHUA, New Hampshire, 2 de fevereiro de 2021 /PRNewswire/ -- A Parallel Wireless, Inc., empresa líder de Open RAN com sede nos EUA, que oferece uma única solução macro de Open RAN compatível de O-RAN 2G 3G 4G 5G com conectividade rural e urbana, anunciou hoj…",
      "url": "https://www.prnewswire.com/news-releases/parallel-wireless-e-o-primeiro-fornecedor-de-energia-do-laboratorio-comunitario-de-openran-do-tip-na-indonesia-804377948.html",
      "urlToImage": "https://mma.prnewswire.com/media/1004727/PW_FullColor_CMYK_Logo.jpg?p=facebook",
      "publishedAt": "2021-02-02T17:00:00Z",
      "content": "NASHUA, New Hampshire, 2 de fevereiro de 2021 /PRNewswire/ -- A Parallel Wireless, Inc., empresa líder de Open RAN com sede nos EUA, que oferece uma única solução macro de Open RAN compatível de O-RA… [+7382 chars]"
    },
    {
        "source_id":null,
        "source_name": "PRNewswire",
      "author": null,
      "title": "Parallel Wireless es el primer vendedor en utilizar el OpenRAN Community Lab de TIP en Indonesia",
      "description": "Los más maduros 2G 3G 4G Open RAN ayudan a Telkomsel, Indosat Ooredoo, XL Axiata y Smartfren a desplegar Open RAN en Indonesia NASHUA, N.H., 2 de febrero de 2021 /PRNewswire/ -- Parallel Wireless, Inc., principal compañía Open RAN con sede en Estados Unidos q…",
      "url": "https://www.prnewswire.com/news-releases/parallel-wireless-es-el-primer-vendedor-en-utilizar-el-openran-community-lab-de-tip-en-indonesia-804951743.html",
      "urlToImage": "https://mma.prnewswire.com/media/1004727/PW_FullColor_CMYK_Logo.jpg?p=facebook",
      "publishedAt": "2021-02-02T17:00:00Z",
      "content": "Los más maduros 2G 3G 4G Open RAN ayudan a Telkomsel, Indosat Ooredoo, XL Axiata y Smartfren a desplegar Open RAN en Indonesia\r\nNASHUA, N.H., 2 de febrero de 2021 /PRNewswire/ -- Parallel Wireless, I… [+7686 chars]"
    },
    {
        "source_id":null,
        "source_name": "PRNewswire",
      "author": null,
      "title": "Parallel Wireless is the First Vendor to Power TIP's OpenRAN Community Lab in Indonesia",
      "description": "Most mature 2G 3G 4G Open RAN to help Telkomsel, Indosat Ooredoo, XL Axiata, and Smartfren deploy Open RAN in Indonesia NASHUA, N.H., Feb. 2, 2021 /PRNewswire/ -- Parallel Wireless, Inc., the leading U.S.-based Open RAN company delivering the world's only 2G …",
      "url": "https://prnmedia.prnewswire.com/news-releases/parallel-wireless-is-the-first-vendor-to-power-tips-openran-community-lab-in-indonesia-301219409.html",
      "urlToImage": null,
      "publishedAt": "2021-02-02T17:00:00Z",
      "content": null
    },
    {
        "source_id":null,
        "source_name": "PRNewswire",
      "author": null,
      "title": "Parallel Wireless es el primer proveedor de energía en el Laboratorio comunitario OpenRAN de TIP en Indonesia",
      "description": "NASHUA, Nuevo Hampshire, 2 de febrero, 2021 /PRNewswire/ -- Parallel Wireless, Inc., la empresa líder de Open RAN con sede en los Estados Unidos que ofrece la única solución macro de Open RAN de 2G, 3G, 4G y 5G que cumple con las normas de Open RAN para conec…",
      "url": "https://www.prnewswire.com/news-releases/parallel-wireless-es-el-primer-proveedor-de-energia-en-el-laboratorio-comunitario-openran-de-tip-en-indonesia-878704103.html",
      "urlToImage": "https://mma.prnewswire.com/media/1004727/PW_FullColor_CMYK_Logo.jpg?p=facebook",
      "publishedAt": "2021-02-02T17:00:00Z",
      "content": "NASHUA, Nuevo Hampshire, 2 de febrero, 2021 /PRNewswire/ -- Parallel Wireless, Inc., la empresa líder de Open RAN con sede en los Estados Unidos que ofrece la única solución macro de Open RAN de 2G, … [+7829 chars]"
    },
    {
      "source_id":null,
        "source_name": "Yahoo Entertainment",
      "author": "PR Newswire",
      "title": "Parallel Wireless is the First Vendor to Power TIP's OpenRAN Community Lab in Indonesia",
      "description": "Parallel Wireless, Inc., the leading U.S.-based Open RAN company delivering the world's only 2G 3G 4G 5G O-RAN-compliant Open RAN macro solution for rural...",
      "url": "https://finance.yahoo.com/news/parallel-wireless-first-vendor-power-170000339.html",
      "urlToImage": "https://s.yimg.com/uu/api/res/1.2/qd3VDlwKk6bX_CyVqkcGnw--~B/aD0yMTU7dz00MDA7YXBwaWQ9eXRhY2h5b24-/https://media.zenfs.com/en/prnewswire.com/e3b83660098a1b031bd76beb43417581",
      "publishedAt": "2021-02-02T17:00:00Z",
      "content": "Most mature 2G 3G 4G Open RAN to help Telkomsel, Indosat Ooredoo, XL Axiata, and Smartfren deploy Open RAN in Indonesia\r\nNASHUA, N.H., Feb. 2, 2021 /PRNewswire/ -- Parallel Wireless, Inc., the leadin… [+6803 chars]"
    }
  ]