{
  "development": {
    "username": "teama",
    "password": "teamaSofd3ft4cademY2021",
    "database": "teama_dev",
    "host": "139.59.124.53",
    "dialect": "postgres",
    "port": "5400"
  },
  "production": {
    "username": "teama",
    "password": "teamaSofd3ft4cademY2021",
    "database": "teama_prod",
    "host": "139.59.124.53",
    "dialect": "postgres",
    "port": "5400"
  }
}