@startuml
set namespaceSeparator ::

class "uml::main.dart::MyApp" {
  +Widget build()
}

"flutter::src::widgets::framework.dart::StatelessWidget" <|-- "uml::main.dart::MyApp"

class "uml::main.dart::MyHomePage" {
  +dynamic title
  +_MyHomePageState createState()
}

"flutter::src::widgets::framework.dart::StatefulWidget" <|-- "uml::main.dart::MyHomePage"

class "uml::main.dart::_MyHomePageState" {
  -int _counter
  -void _incrementCounter()
  +Widget build()
}

"flutter::src::widgets::framework.dart::State<T>" <|-- "uml::main.dart::_MyHomePageState"


@enduml