Time,position,timestamp,velocity,voltage (V),
0.538314,-119.281738,0.536926,0.000000,0.000000,
0.556736,-119.281738,0.556293,0.000000,0.000000,
0.57673,-119.281738,0.576282,0.000000,0.000000,
0.596636,-119.281738,0.596203,0.000000,0.000000,
0.616977,-119.281738,0.616192,0.000000,0.000000,
0.63673,-119.281738,0.636263,0.000000,0.000000,
0.656662,-119.281738,0.656228,0.000000,0.000000,
0.676686,-119.281738,0.676251,0.000000,0.000000,
0.696764,-119.281738,0.696237,0.000000,0.000000,
0.716715,-119.281738,0.716266,0.000000,0.000000,
0.736682,-119.281738,0.736216,0.000000,0.000000,
0.756722,-119.281738,0.756261,0.000000,0.000000,
0.776709,-119.281738,0.776254,0.000000,0.000000,
0.796666,-119.281738,0.796229,0.000000,0.000000,
0.816631,-119.281738,0.816197,0.000000,0.000000,
0.836812,-119.281738,0.836179,0.000000,0.000000,
0.856678,-119.281738,0.856238,0.000000,0.000000,
0.876707,-119.281738,0.876256,0.000000,0.000000,
0.896751,-119.281738,0.896208,0.000000,0.000000,
0.916733,-119.281738,0.916209,0.000000,0.000000,
0.936745,-119.281738,0.936286,0.000000,0.000000,
0.956674,-119.281738,0.956232,0.000000,0.000000,
0.976756,-119.281738,0.976232,0.000000,0.000000,
0.996706,-119.281738,0.996208,0.000000,0.000000,
1.01669,-119.281738,1.016246,0.000000,0.000000,
1.03666,-119.281738,1.036210,0.000000,0.000000,
1.0567,-119.281738,1.056255,0.000000,0.000000,
1.07671,-119.281738,1.076224,0.000000,0.000000,
1.09664,-119.281738,1.096185,0.000000,0.000000,
1.11664,-119.281738,1.116195,0.000000,0.000000,
1.13664,-119.281738,1.136217,0.000000,0.000000,
1.1567,-119.281738,1.156260,0.000000,0.000000,
1.17664,-119.281738,1.176205,0.000000,0.000000,
1.19665,-119.281738,1.196212,0.000000,0.000000,
1.21674,-119.281738,1.216283,0.000000,0.000000,
1.23667,-119.281738,1.236206,0.000000,0.000000,
1.25663,-119.281738,1.256183,0.000000,0.000000,
1.27662,-119.281738,1.276186,0.000000,0.000000,
1.29663,-119.281738,1.296186,0.000000,0.000000,
1.3168,-119.281738,1.316370,0.000000,0.000000,
1.33665,-119.281738,1.336187,0.000000,0.000000,
1.35669,-119.281738,1.356250,0.000000,0.000000,
1.37664,-119.281738,1.376197,0.000000,0.000000,
1.39666,-119.281738,1.396209,0.000000,0.000000,
1.4168,-119.281738,1.416358,0.000000,0.000000,
1.43666,-119.281738,1.436207,0.000000,0.000000,
1.45661,-119.281738,1.456181,0.000000,0.000000,
1.4767,-119.281738,1.476260,0.000000,0.000000,
1.49679,-119.281738,1.496257,0.000000,0.000000,
1.51674,-119.281738,1.516278,0.000000,0.000000,
1.53668,-119.281738,1.536208,0.000000,0.000000,
1.55665,-119.281738,1.556204,0.000000,0.000000,
1.57665,-119.281738,1.576208,0.000000,0.000000,
1.59665,-119.281738,1.596209,0.000000,0.000000,
1.6167,-119.281738,1.616252,0.000000,0.000000,
1.63666,-119.281738,1.636214,0.000000,0.000000,
1.6567,-119.281738,1.656252,0.000000,0.000000,
1.67676,-119.281738,1.676263,0.000000,0.000000,
1.69671,-119.281738,1.696266,0.000000,0.000000,
1.71668,-119.281738,1.716233,0.000000,0.000000,
1.73668,-119.281738,1.736219,0.000000,0.000000,
1.75667,-119.281738,1.756238,0.000000,0.000000,
1.77665,-119.281738,1.776207,0.000000,0.000000,
1.7967,-119.281738,1.796266,0.000000,0.000000,
1.81686,-119.281738,1.816261,0.000000,0.000000,
1.83666,-119.281738,1.836223,0.000000,0.000000,
1.85676,-119.281738,1.856321,0.000000,0.000000,
1.87669,-119.281738,1.876238,0.000000,0.000000,
1.89679,-119.281738,1.896248,0.000000,0.000000,
1.91666,-119.281738,1.916233,0.000000,0.000000,
1.93666,-119.281738,1.936217,0.000000,0.000000,
1.95667,-119.281738,1.956249,0.000000,0.000000,
1.97672,-119.281738,1.976272,0.000000,0.000000,
1.99664,-119.281738,1.996196,0.000000,0.000000,
2.01663,-119.281738,2.016192,0.000000,0.000000,
2.0367,-119.281738,2.036243,0.000000,0.000000,
2.05666,-119.281738,2.056185,0.000000,0.000000,
2.0768,-119.281738,2.076251,0.000000,0.000000,
2.0967,-119.281738,2.096209,0.000000,0.000000,
2.1167,-119.281738,2.116253,0.000000,0.000000,
2.13668,-119.281738,2.136239,0.000000,0.000000,
2.15668,-119.281738,2.156228,0.000000,0.000000,
2.17664,-119.281738,2.176190,0.000000,0.000000,
2.19668,-119.281738,2.196183,0.000000,0.000000,
2.2167,-119.281738,2.216267,0.000000,0.000000,
2.23662,-119.281738,2.236185,0.000000,0.000000,
2.25664,-119.281738,2.256215,0.000000,0.000000,
2.27676,-119.281738,2.276181,0.000000,0.000000,
2.29663,-119.281738,2.296187,0.000000,0.000000,
2.31669,-119.281738,2.316245,0.000000,0.000000,
2.33666,-119.281738,2.336216,0.000000,0.000000,
2.35666,-119.281738,2.356208,0.000000,0.000000,
2.37668,-119.281738,2.376201,0.000000,0.000000,
2.39661,-119.281738,2.396179,0.000000,0.000000,
2.41666,-119.281738,2.416232,0.000000,0.000000,
2.43671,-119.281738,2.436261,0.000000,0.000000,
2.45662,-119.281738,2.456182,0.000000,0.000000,
2.47669,-119.281738,2.476233,0.000000,0.000000,
2.49669,-119.281738,2.496252,0.000000,0.000000,
2.51669,-119.281738,2.516248,0.000000,0.000000,
2.53674,-119.281738,2.536182,0.000000,0.000000,
2.55665,-119.281738,2.556206,0.000000,0.000000,
2.57666,-119.281738,2.576235,0.000000,0.000000,
2.59661,-119.281738,2.596186,0.000000,0.000000,
2.61665,-119.281738,2.616210,0.000000,0.000000,
2.63669,-119.281738,2.636239,0.000000,0.000000,
2.65669,-119.281738,2.656251,0.000000,0.000000,
2.67666,-119.281738,2.676206,0.000000,0.000000,
2.69667,-119.281738,2.696182,0.000000,0.000000,
2.71663,-119.281738,2.716189,0.000000,0.000000,
2.73668,-119.281738,2.736252,0.000000,0.000000,
2.75677,-119.281738,2.756330,0.000000,0.000000,
2.77666,-119.281738,2.776216,0.000000,0.000000,
2.79666,-119.281738,2.796204,0.000000,0.000000,
2.81666,-119.281738,2.816205,0.000000,0.000000,
2.83664,-119.281738,2.836202,0.000000,0.000000,
2.85665,-119.281738,2.856206,0.000000,0.000000,
2.87671,-119.281738,2.876261,0.000000,0.000000,
2.8967,-119.281738,2.896258,0.000000,0.000000,
2.91669,-119.281738,2.916251,0.000000,0.000000,
2.93677,-119.281738,2.936265,0.000000,0.000000,
2.9567,-119.281738,2.956259,0.000000,0.000000,
2.97668,-119.281738,2.976233,0.000000,0.000000,
2.99669,-119.281738,2.996252,0.000000,0.000000,
3.01671,-119.281738,3.016270,0.000000,0.000000,
3.03671,-119.281738,3.036188,0.000000,0.000000,
3.05666,-119.281738,3.056236,0.000000,0.000000,
3.07665,-119.281738,3.076212,0.000000,0.000000,
3.09665,-119.281738,3.096201,0.000000,0.000000,
3.11673,-119.281738,3.116288,0.000000,0.000000,
3.13667,-119.281738,3.136208,0.000000,0.000000,
3.15675,-119.281738,3.156248,0.000000,0.000000,
3.1767,-119.281738,3.176267,0.000000,0.000000,
3.19671,-119.281738,3.196267,0.000000,0.000000,
3.21664,-119.281738,3.216217,0.000000,0.000000,
3.23665,-119.281738,3.236207,0.000000,0.000000,
3.25665,-119.281738,3.256193,0.000000,0.000000,
3.27664,-119.281738,3.276207,0.000000,0.000000,
3.29669,-119.281738,3.296241,0.000000,0.000000,
3.31668,-119.281738,3.316237,0.000000,0.000000,
3.33683,-119.281738,3.336178,0.000000,0.000000,
3.35665,-119.281738,3.356210,0.000000,0.000000,
3.37677,-119.281738,3.376333,0.000000,0.000000,
3.39667,-119.281738,3.396242,0.000000,0.000000,
3.41663,-119.281738,3.416173,0.000000,0.000000,
3.43668,-119.281738,3.436219,0.000000,0.000000,
3.45663,-119.281738,3.456198,0.000000,0.000000,
3.47668,-119.281738,3.476242,0.000000,0.000000,
3.49665,-119.281738,3.496199,0.000000,0.000000,
3.51663,-119.281738,3.516182,0.000000,0.000000,
3.53666,-119.281738,3.536213,0.000000,0.000000,
3.55669,-119.281738,3.556246,0.000000,0.000000,
3.57676,-119.281738,3.576295,0.000000,0.000000,
3.5968,-119.281738,3.596275,0.000000,0.000000,
3.61675,-119.281738,3.616256,0.000000,0.000000,
3.63692,-119.281738,3.636274,0.000000,0.000000,
3.65665,-119.281738,3.656182,0.000000,0.000000,
3.67668,-119.281738,3.676245,0.000000,0.000000,
3.69665,-119.281738,3.696210,0.000000,0.000000,
3.71666,-119.281738,3.716223,0.000000,0.000000,
3.73669,-119.281738,3.736238,0.000000,0.000000,
3.75668,-119.281738,3.756240,0.000000,0.000000,
3.77675,-119.281738,3.776298,0.000000,0.000000,
3.79663,-119.281738,3.796198,0.000000,0.000000,
3.81671,-119.281738,3.816262,0.000000,0.000000,
3.83669,-119.281738,3.836246,0.000000,0.000000,
3.85671,-119.281738,3.856275,0.000000,0.000000,
3.87668,-119.281738,3.876249,0.000000,0.000000,
3.89666,-119.281738,3.896213,0.000000,0.000000,
3.91662,-119.281738,3.916178,0.000000,0.000000,
3.93669,-119.281738,3.936232,0.000000,0.000000,
3.95664,-119.281738,3.956202,0.000000,0.000000,
3.97666,-119.281738,3.976205,0.000000,0.000000,
3.99662,-119.281738,3.996186,0.000000,0.000000,
4.01661,-119.281738,4.016179,0.000000,0.000000,
4.03666,-119.281738,4.036204,0.000000,0.000000,
4.05668,-119.281738,4.056224,0.000000,0.000000,
4.07678,-119.281738,4.076189,0.000000,0.000000,
4.09678,-119.281738,4.096253,0.000000,0.000000,
4.11662,-119.281738,4.116178,0.000000,0.000000,
4.13664,-119.281738,4.136186,0.000000,0.000000,
4.15665,-119.281738,4.156207,0.000000,0.000000,
4.17668,-119.281738,4.176243,0.000000,0.000000,
4.19664,-119.281738,4.196200,0.000000,0.000000,
4.21669,-119.281738,4.216258,0.000000,0.000000,
4.23691,-119.281738,4.236453,0.000000,0.000000,
4.25663,-119.281738,4.256182,0.000000,0.000000,
4.27684,-119.281738,4.276249,0.000000,0.000000,
4.29667,-119.281738,4.296242,0.000000,0.000000,
4.31665,-119.281738,4.316201,0.000000,0.000000,
4.33664,-119.281738,4.336200,0.000000,0.000000,
4.35663,-119.281738,4.356201,0.000000,0.000000,
4.37669,-119.281738,4.376239,0.000000,0.000000,
4.39668,-119.281738,4.396215,0.000000,0.000000,
4.41664,-119.281738,4.416199,0.000000,0.000000,
4.43669,-119.281738,4.436239,0.000000,0.000000,
4.45681,-119.281738,4.456177,0.000000,0.000000,
4.47686,-119.281738,4.476243,0.000000,0.000000,
4.49669,-119.281738,4.496262,0.000000,0.000000,
4.51668,-119.281738,4.516242,0.000000,0.000000,
4.53683,-119.281738,4.536335,0.000000,0.000000,
4.5569,-119.281738,4.556228,0.000000,0.000000,
4.57671,-119.281738,4.576264,0.000000,0.000000,
4.59669,-119.281738,4.596259,0.000000,0.000000,
4.61668,-119.281738,4.616236,0.000000,0.000000,
4.63671,-119.281738,4.636248,0.000000,0.000000,
4.65662,-119.281738,4.656187,0.000000,0.000000,
4.67676,-119.281738,4.676254,0.000000,0.000000,
4.69669,-119.281738,4.696243,0.000000,0.000000,
4.71664,-119.281738,4.716207,0.000000,0.000000,
4.73671,-119.281738,4.736247,0.000000,0.000000,
4.75665,-119.281738,4.756212,0.000000,0.000000,
4.77668,-119.281738,4.776230,0.000000,0.000000,
4.79667,-119.281738,4.796230,0.000000,0.000000,
4.81661,-119.281738,4.816179,0.000000,0.000000,
4.83667,-119.281738,4.836239,0.000000,0.000000,
4.85668,-119.281738,4.856236,0.000000,0.000000,
4.87666,-119.281738,4.876226,0.000000,0.000000,
4.89665,-119.281738,4.896202,0.000000,0.000000,
4.91664,-119.281738,4.916205,0.000000,0.000000,
4.93672,-119.281738,4.936260,0.000000,0.000000,
4.95669,-119.281738,4.956249,0.000000,0.000000,
4.97661,-119.281738,4.976184,0.000000,0.000000,
4.99664,-119.281738,4.996210,0.000000,0.000000,
5.01667,-119.281738,5.016227,0.000000,0.000000,
5.03668,-119.281738,5.036233,0.000000,0.000000,
5.05666,-119.281738,5.056219,0.000000,0.000000,
5.07692,-119.281738,5.076479,0.000000,0.000000,
5.09674,-119.281738,5.096241,0.000000,0.000000,
5.11675,-119.281738,5.116175,0.000000,0.000000,
5.1367,-119.281738,5.136264,0.000000,0.000000,
5.15665,-119.281738,5.156221,0.000000,0.000000,
5.17663,-119.281738,5.176184,0.000000,0.000000,
5.19662,-119.281738,5.196176,0.000000,0.000000,
5.21661,-119.281738,5.216176,0.000000,0.000000,
5.23674,-119.281738,5.236231,0.000000,0.000000,
5.25676,-119.281738,5.256287,0.000000,0.000000,
5.27661,-119.281738,5.276179,0.000000,0.000000,
5.29661,-119.281738,5.296176,0.000000,0.000000,
5.31676,-119.281738,5.316182,0.000000,0.000000,
5.33668,-119.281738,5.336245,0.000000,0.000000,
5.35662,-119.281738,5.356186,0.000000,0.000000,
5.37661,-119.281738,5.376173,0.000000,0.000000,
5.39671,-119.281738,5.396178,0.000000,0.000000,
5.41673,-119.281738,5.416236,0.000000,0.000000,
5.43668,-119.281738,5.436218,0.000000,0.000000,
5.45663,-119.281738,5.456187,0.000000,0.000000,
5.47664,-119.281738,5.476189,0.000000,0.000000,
5.49672,-119.281738,5.496262,0.000000,0.000000,
5.51663,-119.281738,5.516191,0.000000,0.000000,
5.53664,-119.281738,5.536181,0.000000,0.000000,
5.55662,-119.281738,5.556186,0.000000,0.000000,
5.57662,-119.281738,5.576183,0.000000,0.000000,
5.59662,-119.281738,5.596186,0.000000,0.000000,
5.61672,-119.281738,5.616254,0.000000,0.000000,
5.63672,-119.281738,5.636266,0.000000,0.000000,
5.65671,-119.281738,5.656241,0.000000,0.000000,
5.67682,-119.281738,5.676213,0.000000,0.000000,
5.69666,-119.281738,5.696204,0.000000,0.000000,
5.71666,-119.281738,5.716207,0.000000,0.000000,
5.73664,-119.281738,5.736188,0.000000,0.000000,
5.75668,-119.281738,5.756236,0.000000,0.000000,
5.77663,-119.281738,5.776202,0.000000,0.000000,
5.79669,-119.281738,5.796252,0.000000,0.000000,
5.81663,-119.281738,5.816187,0.000000,0.000000,
5.83665,-119.281738,5.836203,0.000000,0.000000,
5.85665,-119.281738,5.856206,0.000000,0.000000,
5.87668,-119.281738,5.876228,0.000000,0.000000,
5.89663,-119.281738,5.896196,0.000000,0.000000,
5.91672,-119.281738,5.916284,0.000000,0.000000,
5.93668,-119.281738,5.936236,0.000000,0.000000,
5.95667,-119.281738,5.956237,0.000000,0.000000,
5.97672,-119.281738,5.976245,0.000000,0.000000,
5.99677,-119.281738,5.996327,0.000000,0.000000,
6.01662,-119.281738,6.016187,0.000000,0.000000,
6.03669,-119.281738,6.036186,0.000000,0.000000,
6.05664,-119.281738,6.056188,0.000000,0.000000,
6.07669,-119.281738,6.076235,0.000000,0.000000,
6.0967,-119.281738,6.096261,0.000000,0.000000,
6.11662,-119.281738,6.116185,0.000000,0.000000,
6.13673,-119.281738,6.136220,0.000000,0.000000,
6.15675,-119.281738,6.156247,0.000000,0.000000,
6.17668,-119.281738,6.176236,0.000000,0.000000,
6.19668,-119.281738,6.196239,0.000000,0.000000,
6.21668,-119.281738,6.216203,0.000000,0.000000,
6.23669,-119.281738,6.236244,0.000000,0.000000,
6.25666,-119.281738,6.256241,0.000000,0.000000,
6.27667,-119.281738,6.276229,0.000000,0.000000,
6.29665,-119.281738,6.296202,0.000000,0.000000,
6.31665,-119.281738,6.316203,0.000000,0.000000,
6.33671,-119.281738,6.336259,0.000000,0.000000,
6.35668,-119.281738,6.356231,0.000000,0.000000,
6.37677,-119.281738,6.376287,0.000000,0.000000,
6.39688,-119.281738,6.396429,0.000000,0.000000,
6.41674,-119.281738,6.416209,0.000000,0.000000,
6.43668,-119.281738,6.436231,0.000000,0.000000,
6.45665,-119.281738,6.456200,0.000000,0.000000,
6.47671,-119.281738,6.476255,0.000000,0.000000,
6.49672,-119.281738,6.496265,0.000000,0.000000,
6.51668,-119.281738,6.516230,0.000000,0.000000,
6.53675,-119.281738,6.536267,0.000000,0.000000,
6.55663,-119.281738,6.556188,0.000000,0.000000,
6.57662,-119.281738,6.576190,0.000000,0.000000,
6.59669,-119.281738,6.596253,0.000000,0.000000,
6.61664,-119.281738,6.616197,0.000000,0.000000,
6.6367,-119.281738,6.636215,0.000000,0.000000,
6.65669,-119.281738,6.656234,0.000000,0.000000,
6.67667,-119.281738,6.676228,0.000000,0.000000,
6.69675,-119.281738,6.696203,0.000000,0.000000,
6.71664,-119.281738,6.716182,0.000000,0.000000,
6.73674,-119.281738,6.736273,0.000000,0.000000,
6.75666,-119.281738,6.756208,0.000000,0.000000,
6.77669,-119.281738,6.776208,0.000000,0.000000,
6.79675,-119.281738,6.796259,0.000000,0.000000,
6.81667,-119.281738,6.816210,0.000000,0.000000,
6.83663,-119.281738,6.836180,0.000000,0.000000,
6.85668,-119.281738,6.856205,0.000000,0.000000,
6.87669,-119.281738,6.876245,0.000000,0.000000,
6.89666,-119.281738,6.896221,0.000000,0.000000,
6.91668,-119.281738,6.916245,0.000000,0.000000,
6.93666,-119.281738,6.936195,0.000000,0.000000,
6.95666,-119.281738,6.956202,0.000000,0.000000,
6.97678,-119.281738,6.976329,0.000000,0.000000,
6.99667,-119.281738,6.996208,0.000000,0.000000,
7.01664,-119.281738,7.016194,0.000000,0.000000,
7.03666,-119.281738,7.036209,0.000000,0.000000,
7.05679,-119.281738,7.056205,0.000000,0.000000,
7.07671,-119.281738,7.076272,0.000000,0.000000,
7.09669,-119.281738,7.096231,0.000000,0.000000,
7.11666,-119.281738,7.116211,0.000000,0.000000,
7.13673,-119.281738,7.136199,0.000000,0.000000,
7.15662,-119.281738,7.156176,0.000000,0.000000,
7.17669,-119.281738,7.176245,0.000000,0.000000,
7.19667,-119.281738,7.196226,0.000000,0.000000,
7.21672,-119.281738,7.216208,0.000000,0.000000,
7.23668,-119.281738,7.236249,0.000000,0.000000,
7.25665,-119.281738,7.256203,0.000000,0.000000,
7.27668,-119.281738,7.276238,0.000000,0.000000,
7.29673,-119.281738,7.296254,0.000000,0.000000,
7.31667,-119.281738,7.316210,0.000000,0.000000,
7.33675,-119.281738,7.336233,0.000000,0.000000,
7.35669,-119.281738,7.356245,0.000000,0.000000,
7.37662,-119.281738,7.376183,0.000000,0.000000,
7.39682,-119.281738,7.396269,0.000000,0.000000,
7.41669,-119.281738,7.416229,0.000000,0.000000,
7.43684,-119.281738,7.436382,0.000000,0.000000,
7.45669,-119.281738,7.456233,0.000000,0.000000,
7.4767,-119.281738,7.476245,0.000000,0.000000,
7.4967,-119.281738,7.496188,0.000000,0.000000,
7.51673,-119.281738,7.516260,0.000000,0.000000,
7.53662,-119.281738,7.536180,0.000000,0.000000,
7.55665,-119.281738,7.556208,0.000000,0.000000,
7.5767,-119.281738,7.576215,0.000000,0.000000,
7.59683,-119.281738,7.596223,0.000000,0.000000,
7.61666,-119.281738,7.616203,0.000000,0.000000,
7.63686,-119.281738,7.636236,0.000000,0.000000,
7.65673,-119.281738,7.656266,0.000000,0.000000,
7.67688,-119.281738,7.676265,0.000000,0.000000,
7.69663,-119.281738,7.696193,0.000000,0.000000,
7.71664,-119.281738,7.716206,0.000000,0.000000,
7.73676,-119.281738,7.736311,0.000000,0.000000,
7.75677,-119.281738,7.756174,0.000000,0.000000,
7.7768,-119.281738,7.776263,0.000000,0.000000,
7.79662,-119.281738,7.796178,0.000000,0.000000,
7.81673,-119.281738,7.816255,0.000000,0.000000,
7.83667,-119.281738,7.836238,0.000000,0.000000,
7.85668,-119.281738,7.856246,0.000000,0.000000,
7.87678,-119.281738,7.876257,0.000000,0.000000,
7.89675,-119.281738,7.896300,0.000000,0.000000,
7.91662,-119.281738,7.916176,0.000000,0.000000,
7.93671,-119.281738,7.936254,0.000000,0.000000,
7.95663,-119.281738,7.956182,0.000000,0.000000,
7.9769,-119.281738,7.976223,0.000000,0.000000,
7.99669,-119.281738,7.996254,0.000000,0.000000,
8.01667,-119.281738,8.016228,0.000000,0.000000,
8.03666,-119.281738,8.036220,0.000000,0.000000,
8.05669,-119.281738,8.056248,0.000000,0.000000,
8.07673,-119.281738,8.076222,0.000000,0.000000,
8.09672,-119.281738,8.096265,0.000000,0.000000,
8.11669,-119.281738,8.116219,0.000000,0.000000,
8.13673,-119.281738,8.136231,0.000000,0.000000,
8.15662,-119.281738,8.156182,0.000000,0.000000,
8.17664,-119.281738,8.176203,0.000000,0.000000,
8.19675,-119.281738,8.196315,0.000000,0.000000,
8.21666,-119.281738,8.216205,0.000000,0.000000,
8.23673,-119.281738,8.236273,0.000000,0.000000,
8.25667,-119.281738,8.256211,0.000000,0.000000,
8.27663,-119.281738,8.276173,0.000000,0.000000,
8.29668,-119.281738,8.296213,0.000000,0.000000,
8.31668,-119.281738,8.316236,0.000000,0.000000,
8.33674,-119.281738,8.336249,0.000000,0.000000,
8.35678,-119.281738,8.356239,0.000000,0.000000,
8.3768,-119.281738,8.376280,0.000000,0.000000,
8.39678,-119.281738,8.396235,0.000000,0.000000,
8.41668,-119.281738,8.416222,0.000000,0.000000,
8.43698,-119.281738,8.436263,0.000000,0.000000,
8.45666,-119.281738,8.456204,0.000000,0.000000,
8.47666,-119.281738,8.476209,0.000000,0.000000,
8.49668,-119.281738,8.496233,0.000000,0.000000,
8.51668,-119.281738,8.516252,0.000000,0.000000,
8.53673,-119.281738,8.536267,0.000000,0.000000,
8.55672,-119.281738,8.556260,0.000000,0.000000,
8.57676,-119.281738,8.576250,0.000000,0.000000,
8.59668,-119.281738,8.596214,0.000000,0.000000,
8.61675,-119.281738,8.616233,0.000000,0.000000,
8.63673,-119.281738,8.636285,0.000000,0.000000,
8.65665,-119.281738,8.656210,0.000000,0.000000,
8.67667,-119.281738,8.676220,0.000000,0.000000,
8.69668,-119.281738,8.696230,0.000000,0.000000,
8.71666,-119.281738,8.716207,0.000000,0.000000,
8.73681,-119.281738,8.736264,0.000000,0.000000,
8.75664,-119.281738,8.756182,0.000000,0.000000,
8.77681,-119.281738,8.776242,0.000000,0.000000,
8.79672,-119.281738,8.796209,0.000000,0.000000,
8.81664,-119.281738,8.816204,0.000000,0.000000,
8.83667,-119.281738,8.836227,0.000000,0.000000,
8.8567,-119.281738,8.856244,0.000000,0.000000,
8.87664,-119.281738,8.876191,0.000000,0.000000,
8.89668,-119.281738,8.896226,0.000000,0.000000,
8.91672,-119.281738,8.916251,0.000000,0.000000,
8.93671,-119.281738,8.936249,0.000000,0.000000,
8.95667,-119.281738,8.956211,0.000000,0.000000,
8.9767,-119.281738,8.976262,0.000000,0.000000,
8.99665,-119.281738,8.996206,0.000000,0.000000,
9.01666,-119.281738,9.016204,0.000000,0.000000,
9.03674,-119.281738,9.036261,0.000000,0.000000,
9.05674,-119.281738,9.056281,0.000000,0.000000,
9.07674,-119.281738,9.076205,0.000000,0.000000,
9.09673,-119.281738,9.096185,0.000000,0.000000,
9.11672,-119.281738,9.116206,0.000000,0.000000,
9.1367,-119.281738,9.136255,0.000000,0.000000,
9.15671,-119.281738,9.156271,0.000000,0.000000,
9.17678,-119.281738,9.176278,0.000000,0.000000,
9.19675,-119.281738,9.196243,0.000000,0.000000,
9.21669,-119.281738,9.216215,0.000000,0.000000,
9.23673,-119.281738,9.236263,0.000000,0.000000,
9.25688,-119.281738,9.256375,0.000000,0.000000,
9.27679,-119.281738,9.276264,0.000000,0.000000,
9.29675,-119.281738,9.296231,0.000000,0.000000,
9.31675,-119.281738,9.316255,0.000000,0.000000,
9.33672,-119.281738,9.336262,0.000000,0.000000,
9.35677,-119.281738,9.356250,0.000000,0.000000,
9.37665,-119.281738,9.376197,0.000000,0.000000,
9.39669,-119.281738,9.396237,0.000000,0.000000,
9.41675,-119.281738,9.416263,0.000000,0.000000,
9.4367,-119.281738,9.436235,0.000000,0.000000,
9.45672,-119.281738,9.456209,0.000000,0.000000,
9.47672,-119.281738,9.476267,0.000000,0.000000,
9.49667,-119.281738,9.496210,0.000000,0.000000,
9.51668,-119.281738,9.516215,0.000000,0.000000,
9.53667,-119.281738,9.536211,0.000000,0.000000,
9.55682,-119.281738,9.556300,0.000000,0.000000,
9.57667,-119.281738,9.576207,0.000000,0.000000,
9.59677,-119.281738,9.596229,0.000000,0.000000,
9.61668,-119.281738,9.616235,0.000000,0.000000,
9.6367,-119.281738,9.636237,0.000000,0.000000,
9.65673,-119.281738,9.656207,0.000000,0.000000,
9.67671,-119.281738,9.676265,0.000000,0.000000,
9.69676,-119.281738,9.696209,0.000000,0.000000,
9.71668,-119.281738,9.716231,0.000000,0.000000,
9.73669,-119.281738,9.736207,0.000000,0.000000,
9.75676,-119.281738,9.756308,0.000000,0.000000,
9.77668,-119.281738,9.776237,0.000000,0.000000,
9.79666,-119.281738,9.796213,0.000000,0.000000,
9.81669,-119.281738,9.816235,0.000000,0.000000,
9.83671,-119.281738,9.836245,0.000000,0.000000,
9.85671,-119.281738,9.856249,0.000000,0.000000,
9.87665,-119.281738,9.876208,0.000000,0.000000,
9.89665,-119.281738,9.896203,0.000000,0.000000,
9.91667,-119.281738,9.916224,0.000000,0.000000,
9.9367,-119.281738,9.936244,0.000000,0.000000,
9.95674,-119.281738,9.956269,0.000000,0.000000,
9.97666,-119.281738,9.976206,0.000000,0.000000,
9.9968,-119.281738,9.996250,0.000000,0.000000,
10.0168,-119.281738,10.016235,0.000000,0.000000,
10.0367,-119.281738,10.036212,0.000000,0.000000,
10.0567,-119.281738,10.056210,0.000000,0.000000,
10.0766,-119.281738,10.076189,0.000000,0.000000,
10.0967,-119.281738,10.096273,0.000000,0.000000,
10.1166,-119.281738,10.116191,0.000000,0.000000,
10.1367,-119.281738,10.136182,0.000000,0.000000,
10.1566,-119.281738,10.156190,0.000000,0.000000,
10.1767,-119.281738,10.176204,0.000000,0.000000,
10.1969,-119.281738,10.196239,0.000000,0.000000,
10.2167,-119.281738,10.216213,0.000000,0.000000,
10.2369,-119.281738,10.236266,0.000000,0.000000,
10.2568,-119.281738,10.256226,0.000000,0.000000,
10.2767,-119.281738,10.276213,0.000000,0.000000,
10.2968,-119.281738,10.296230,0.000000,0.000000,
10.3174,-119.281738,10.316337,0.000000,0.000000,
10.3368,-119.281738,10.336272,0.000000,0.000000,
10.3569,-119.281738,10.356434,0.000000,0.000000,
10.3769,-119.281738,10.376362,0.000000,0.000000,
10.3969,-119.281738,10.396251,0.000000,0.000000,
10.4167,-119.281738,10.416262,0.000000,0.000000,
10.4367,-119.281738,10.436248,0.000000,0.000000,
10.457,-119.281738,10.456431,0.000000,0.000000,
10.4769,-119.281738,10.476327,0.000000,0.000000,
10.4967,-119.281738,10.496264,0.000000,0.000000,
10.5169,-119.281738,10.516237,0.000000,0.000000,
10.5369,-119.281738,10.536341,0.000000,0.000000,
10.5568,-119.281738,10.556293,0.000000,0.000000,
10.5767,-119.281738,10.576215,0.000000,0.000000,
10.5967,-119.281738,10.596266,0.000000,0.000000,
10.617,-119.281738,10.616319,0.000000,0.000000,
10.6369,-119.281738,10.636340,0.000000,0.000000,
10.6568,-119.281738,10.656289,0.000000,0.000000,
10.6772,-119.281738,10.676328,0.000000,0.000000,
10.6969,-119.281738,10.696362,0.000000,0.000000,
10.7168,-119.281738,10.716253,0.000000,0.000000,
10.7373,-119.281738,10.736821,0.000000,0.000000,
10.7585,-119.281738,10.756312,0.000000,0.000000,
10.7794,-119.281738,10.777732,0.000000,0.000000,
10.7991,-119.281738,10.798266,0.000000,0.000000,
10.8168,-119.281738,10.816226,0.000000,0.000000,
10.837,-119.281738,10.836450,0.000000,0.000000,
10.857,-119.281738,10.856331,0.000000,0.000000,
10.8767,-119.281738,10.876218,0.000000,0.000000,
10.8979,-119.281738,10.896973,0.000000,0.000000,
10.9178,-119.281738,10.916594,0.000000,0.000000,
10.9372,-119.281738,10.936732,0.000000,0.000000,
10.9571,-119.281738,10.956210,0.000000,0.000000,
10.9775,-119.281738,10.976604,0.000000,0.000000,
10.9977,-119.281738,10.996628,0.000000,0.000000,
11.0188,-119.281738,11.016786,0.000000,0.000000,
11.0386,-119.281738,11.036812,0.000000,0.000000,
11.0578,-119.281738,11.056684,0.000000,0.000000,
11.0803,-119.281738,11.078196,0.000000,0.000000,
11.0983,-119.281738,11.097067,0.000000,0.000000,
11.1199,-119.281738,11.117164,0.000000,0.000000,
11.1369,-119.281738,11.136395,0.000000,0.000000,
11.1574,-119.281738,11.156703,0.000000,0.000000,
11.1768,-119.281738,11.176292,0.000000,0.000000,
11.1968,-119.281738,11.196281,0.000000,0.000000,
11.2169,-119.281738,11.216430,0.000000,0.000000,
11.2374,-119.281738,11.236282,0.000000,0.000000,
11.257,-119.281738,11.256257,0.000000,0.000000,
11.2768,-119.281738,11.276269,0.000000,0.000000,
11.2969,-119.281738,11.296375,0.000000,0.000000,
11.3168,-119.281738,11.316240,0.000000,0.000000,
11.3368,-119.281738,11.336271,0.000000,0.000000,
11.3569,-119.281738,11.356262,0.000000,0.000000,
11.377,-119.281738,11.376476,0.000000,0.000000,
11.3968,-119.281738,11.396234,0.000000,0.000000,
11.4168,-119.281738,11.416227,0.000000,0.000000,
11.4368,-119.281738,11.436278,0.000000,0.000000,
11.4574,-119.281738,11.456473,0.000000,0.000000,
11.4768,-119.281738,11.476268,0.000000,0.000000,
11.4969,-119.281738,11.496357,0.000000,0.000000,
11.5175,-119.281738,11.516630,0.000000,0.000000,
11.5385,-119.281738,11.537293,0.000000,0.000000,
11.5578,-119.281738,11.556661,0.000000,0.000000,
11.5771,-119.281738,11.576292,0.000000,0.000000,
11.5973,-119.281738,11.596472,0.000000,0.000000,
11.6172,-119.281738,11.616439,0.000000,0.000000,
11.637,-119.281738,11.636506,0.000000,0.000000,
11.6569,-119.281738,11.656331,0.000000,0.000000,
11.6768,-119.281738,11.676322,0.000000,0.000000,
