#Zastavky;Cas prestupu;Prestupni zastavka
Aut. nadrazi;2;1
Jana Palacha;2;0
Namesti TGM;2;1
Lesni;2;0
Postorna, kostel;2;1
Postorna, Nadrazni;2;0
PKZ;2;0
Tovarni ctvrt;2;0
Valticka tocna;2;1
Valticka;2;0
J. Skacela;2;0
Hranicni;2;0
Fosfa;2;1
Dum kultury;2;1
Poliklinika;2;1
Prumyslova skola;2;1
BORS;2;0
Gumotex;2;0
Lanzhotska;2;0
Mestsky hrbitov;2;1
Pohansko, rozc.;2;0
Slovacka;2;0
Sovadinova;2;0
Cukrovar;2;1
Lidicka;2;1
Skopalikova;2;1
Vinohradni;2;0
Manesova;2;1
St. Breclav, kult. dum;2;0
St. Breclav, u parku;2;0
Hlavni;2;1
Hlavni na konci;2;0
Dum duchodcu;2;0
Obrancu Miru;2;1
Lednicka;2;0
Palackeho;2;0
Krizovatka Ladna;2;1
Jana Molaka;2;1
Nemocnice;2;1