<svg width="18" height="16" viewBox="0 0 18 16" fill="none" xmlns="http://www.w3.org/2000/svg">
<path d="M9.0058 0.171875C8.74367 0.190306 8.54503 0.414891 8.55868 0.67702V0.805355C8.57097 0.950754 8.59281 1.09479 8.62148 1.23746C8.66335 1.51066 8.67844 1.7873 8.66653 2.06344C8.6406 2.15423 8.58872 2.23614 8.51772 2.29895L8.50748 2.49145C8.23102 2.51466 7.9566 2.55698 7.68628 2.61842C6.54902 2.87509 5.51347 3.46488 4.71411 4.31475L4.55028 4.1987C4.46018 4.22601 4.36324 4.21577 4.28064 4.1714C4.05907 4.0074 3.854 3.82222 3.66833 3.61847C3.57506 3.50703 3.47546 3.40104 3.37002 3.30105L3.26899 3.2205C3.17888 3.14814 3.0683 3.1065 2.95293 3.10104C2.88409 3.09738 2.81536 3.11008 2.75236 3.13808C2.68936 3.16608 2.63388 3.20859 2.59046 3.26214C2.43618 3.47853 2.4867 3.7782 2.70241 3.93316L2.79661 4.00825C2.91787 4.08893 3.04368 4.16255 3.17342 4.22874C3.41507 4.36322 3.64307 4.5209 3.85468 4.70658C3.90882 4.78377 3.94027 4.87457 3.94547 4.96871L4.09429 5.10523C3.29083 6.31076 2.96112 7.7709 3.16728 9.2051L2.97614 9.25971C2.92631 9.3389 2.86009 9.40648 2.78091 9.45631C2.51424 9.52752 2.24126 9.57256 1.96585 9.59079C1.81969 9.59376 1.67382 9.60515 1.52897 9.62492L1.40814 9.65222H1.39449C1.31064 9.66386 1.23167 9.69854 1.16636 9.7524C1.10105 9.80626 1.05198 9.87719 1.02459 9.95729C0.997208 10.0374 0.992591 10.1235 1.01126 10.2061C1.02992 10.2887 1.07114 10.3644 1.13031 10.425C1.19004 10.4852 1.26534 10.5276 1.3478 10.5475C1.43025 10.5674 1.51661 10.564 1.59723 10.5376H1.60611L1.72898 10.5239C1.86755 10.483 2.00408 10.4325 2.13719 10.3751C2.39318 10.2727 2.65872 10.1942 2.93041 10.143C3.02461 10.1485 3.11471 10.1806 3.19117 10.2352L3.39596 10.2011C3.83967 11.5779 4.77214 12.7445 6.01725 13.4797L5.93397 13.6538C5.9722 13.7337 5.98653 13.8224 5.97493 13.9105C5.8623 14.1712 5.7244 14.4211 5.5633 14.6559C5.47493 14.7724 5.39333 14.8939 5.31892 15.0197L5.2609 15.1426C5.2188 15.2156 5.1977 15.2989 5.19994 15.3831C5.20217 15.4674 5.22764 15.5494 5.27355 15.6201C5.31946 15.6908 5.38401 15.7474 5.46008 15.7838C5.53614 15.8201 5.62077 15.8347 5.70461 15.8259C5.78864 15.8165 5.86841 15.7839 5.93505 15.7318C6.00169 15.6798 6.05259 15.6103 6.0821 15.531L6.13876 15.415C6.19064 15.2785 6.23433 15.1392 6.26983 14.9986C6.39065 14.7003 6.45618 14.3801 6.62138 14.1821C6.67537 14.1314 6.74341 14.0981 6.81661 14.0866L6.919 13.9002C8.26872 14.419 9.76221 14.4227 11.1144 13.9105L11.2052 14.0845C11.2981 14.0982 11.3813 14.1494 11.4373 14.2245C11.5657 14.4689 11.6694 14.7248 11.7486 14.989C11.7847 15.1305 11.8289 15.2697 11.881 15.4061L11.9377 15.5221C11.9675 15.6011 12.0185 15.6703 12.0852 15.722C12.1519 15.7737 12.2315 15.806 12.3154 15.8152C12.3993 15.8245 12.4841 15.8104 12.5604 15.7744C12.6368 15.7385 12.7017 15.6821 12.748 15.6116C12.7938 15.5406 12.8191 15.4583 12.821 15.3739C12.823 15.2894 12.8015 15.206 12.7589 15.1331L12.6995 15.0102C12.6251 14.8847 12.5435 14.7637 12.4551 14.6477C12.2981 14.4211 12.163 14.1794 12.0455 13.9262C12.0346 13.8799 12.0331 13.8318 12.041 13.7849C12.049 13.738 12.0663 13.6932 12.092 13.6531C12.0628 13.5936 12.0375 13.5322 12.0162 13.4695C13.2586 12.7288 14.187 11.5581 14.6259 10.1792L14.8198 10.2133C14.8894 10.1499 14.9809 10.1164 15.0744 10.1191C15.3454 10.171 15.6109 10.2557 15.8676 10.3512C16.0007 10.4127 16.1372 10.4646 16.2758 10.5082C16.3086 10.5171 16.3563 10.5246 16.3932 10.5335H16.4021C16.4827 10.5595 16.5689 10.5627 16.6511 10.5426C16.7334 10.5225 16.8084 10.48 16.8679 10.4198C16.9275 10.3595 16.9691 10.284 16.9882 10.2015C17.0073 10.119 17.0031 10.0328 16.9762 9.95258C16.9486 9.8724 16.8992 9.80146 16.8337 9.7477C16.7681 9.69394 16.6889 9.65946 16.6048 9.64813L16.4724 9.61673C16.3275 9.59696 16.1817 9.58556 16.0355 9.58259C15.7597 9.56485 15.4867 9.51979 15.2205 9.44812C15.1385 9.40238 15.0703 9.33412 15.0239 9.25152L14.8395 9.19691C15.0361 7.76338 14.6994 6.3076 13.8934 5.10592L14.0545 4.9571C14.0477 4.86358 14.0784 4.77075 14.1392 4.69907C14.3487 4.51886 14.5761 4.3598 14.815 4.22396C14.9447 4.15774 15.0705 4.08412 15.1918 4.00347L15.2914 3.92292C15.3648 3.87738 15.4238 3.81198 15.4616 3.73431C15.4993 3.65664 15.5143 3.56987 15.5048 3.48403C15.4953 3.39818 15.4617 3.31679 15.4079 3.24925C15.3541 3.18172 15.2822 3.1308 15.2007 3.1024C15.1192 3.07403 15.0313 3.0693 14.9472 3.08875C14.8632 3.1082 14.7863 3.15103 14.7255 3.2123L14.6245 3.29285C14.5191 3.39287 14.4195 3.49886 14.3262 3.61028C14.146 3.81643 13.9467 4.00415 13.7303 4.17208C13.643 4.20763 13.5474 4.21804 13.4545 4.20212L13.2818 4.32499C12.2852 3.28057 10.9424 2.63207 9.50344 2.50237C9.50344 2.43411 9.49456 2.33171 9.4932 2.29963C9.41606 2.24638 9.36213 2.16515 9.34439 2.073C9.33492 1.79732 9.35229 1.52138 9.39627 1.24906C9.42562 1.10571 9.4461 0.962359 9.45907 0.816959V0.680434C9.47272 0.418304 9.27476 0.193719 9.01194 0.175288L9.0058 0.171875ZM8.43649 3.69834L8.29996 6.08276H8.28972C8.2829 6.23021 8.1962 6.35581 8.06309 6.4268C7.92998 6.4978 7.77229 6.47663 7.65351 6.38994L5.69778 5.0042C6.32027 4.39279 7.1012 3.96745 7.95251 3.77615C8.11224 3.74202 8.27334 3.71608 8.43512 3.69834H8.43649ZM9.57511 3.69834C10.6025 3.82599 11.5588 4.28744 12.2988 5.01171L10.3615 6.38858C10.242 6.48414 10.0782 6.50326 9.93964 6.43772C9.80106 6.37219 9.71232 6.23294 9.71027 6.08003L9.57511 3.69834ZM4.98785 5.90118L6.77634 7.49716V7.5074C6.8876 7.60434 6.93607 7.7552 6.9033 7.89923C6.87054 8.04327 6.75995 8.15727 6.61865 8.19618V8.203L4.32365 8.8631C4.21009 7.82913 4.44402 6.78678 4.98853 5.9005L4.98785 5.90118ZM13.0108 5.90118C13.5542 6.78518 13.7944 7.8221 13.6948 8.85491L11.3964 8.19276V8.18389C11.253 8.14498 11.1438 8.03098 11.1117 7.88695C11.0796 7.74291 11.1274 7.59342 11.2387 7.49512L13.0135 5.90664L13.0108 5.90118ZM8.63923 7.6214H9.37101L9.81813 8.18935L9.65566 8.89928L8.99829 9.21534L8.33956 8.89928L8.1846 8.18935L8.63923 7.6214ZM10.9834 9.5587C11.0141 9.55529 11.0516 9.55529 11.0755 9.5587L13.4422 9.95804C13.1009 10.941 12.4271 11.7807 11.5479 12.3425L10.6332 10.128C10.608 10.0686 10.5975 10.004 10.6025 9.9397C10.6076 9.87539 10.628 9.81321 10.662 9.75842C10.6961 9.70362 10.7428 9.65781 10.7982 9.62484C10.8537 9.59187 10.9162 9.5727 10.9806 9.56894L10.9834 9.5587ZM7.00843 9.56894C7.14223 9.57099 7.26578 9.63994 7.33882 9.75189C7.41186 9.86384 7.42347 10.0045 7.37091 10.1273V10.1362L6.46164 12.3329C5.59129 11.7752 4.93051 10.9458 4.57895 9.97306L6.92515 9.57509C6.95109 9.57236 6.97771 9.57236 7.00433 9.57509L7.00843 9.56894ZM8.99078 10.5246C9.06536 10.5223 9.13913 10.5407 9.20386 10.5778C9.26859 10.6149 9.32173 10.6693 9.35736 10.7349H9.36623L10.5226 12.8217L10.0605 12.9582C9.20991 13.1527 8.32181 13.107 7.49514 12.8258L8.65561 10.739C8.72592 10.6161 8.85562 10.541 8.99693 10.5376L8.99078 10.5246Z" fill="#326CE5" stroke="#FFC914" stroke-width="0.11"/>
</svg>
