<svg width="16" height="16" viewBox="0 0 16 16" fill="none" xmlns="http://www.w3.org/2000/svg">
<path d="M8 2.66666V13.3333" stroke="#00003A" stroke-width="1.33333" stroke-linecap="round" stroke-linejoin="round"/>
<path d="M2.66667 8H13.3333" stroke="#00003A" stroke-width="1.33333" stroke-linecap="round" stroke-linejoin="round"/>
<path d="M8 2.66666V13.3333" stroke="#00003A" stroke-width="1.33333" stroke-linecap="round" stroke-linejoin="round"/>
<path d="M2.66667 8H13.3333" stroke="#00003A" stroke-width="1.33333" stroke-linecap="round" stroke-linejoin="round"/>
</svg>
