<svg width="16" height="16" viewBox="0 0 16 16" fill="none" xmlns="http://www.w3.org/2000/svg">
<path d="M6.66659 12C9.61211 12 11.9999 9.61219 11.9999 6.66667C11.9999 3.72115 9.61211 1.33334 6.66659 1.33334C3.72107 1.33334 1.33325 3.72115 1.33325 6.66667C1.33325 9.61219 3.72107 12 6.66659 12Z" stroke="#000427" stroke-opacity="0.6" stroke-width="1.33333" stroke-linecap="round" stroke-linejoin="round"/>
<path d="M14.6665 14.6667L10.6665 10.6667" stroke="#000427" stroke-opacity="0.6" stroke-width="1.33333" stroke-linecap="round" stroke-linejoin="round"/>
</svg>
