<svg width="16" height="16" viewBox="0 0 16 16" fill="none" xmlns="http://www.w3.org/2000/svg">
<path d="M7.33301 14.6668L9.99968 12.0002L7.33301 9.3335" stroke="#D90368" stroke-width="1.33333" stroke-linecap="round" stroke-linejoin="round"/>
<path d="M9.99984 12H0.666504" stroke="#D90368" stroke-width="1.33333" stroke-linecap="round" stroke-linejoin="round"/>
<path d="M8.66667 1.3335L6 4.00016L8.66667 6.66683" stroke="#D90368" stroke-width="1.33333" stroke-linecap="round" stroke-linejoin="round"/>
<path d="M6 4H15.3333" stroke="#D90368" stroke-width="1.33333" stroke-linecap="round" stroke-linejoin="round"/>
</svg>
