<svg width="103" height="40" viewBox="0 0 103 40" fill="none" xmlns="http://www.w3.org/2000/svg">
<path fill-rule="evenodd" clip-rule="evenodd" d="M12.0028 10.1255C12.0166 10.8926 12.335 11.6237 12.8894 12.1613C13.4437 12.6989 14.1897 13.0001 14.9667 13H21.5104C21.906 12.9986 22.2849 12.8425 22.5642 12.5658C22.8434 12.2891 23.0002 11.9144 23.0002 11.5238V10.0424C22.9794 7.3727 21.891 4.81932 19.9722 2.93836C18.0534 1.0574 15.4595 0.00129197 12.7556 0H11.2448C8.54089 0.00129197 5.947 1.0574 4.02818 2.93836C2.10936 4.81932 1.02108 7.3727 1.00024 10.0424V11.5238C1.00024 11.9144 1.15696 12.2891 1.4362 12.5658C1.71545 12.8425 2.09437 12.9986 2.48999 13H9.03374C9.81127 13.0001 10.5578 12.6991 11.113 12.1616C11.6682 11.6241 11.9876 10.8931 12.0028 10.1255ZM12.9945 16V18.5867H11.0055V16H0V22H11.0055V19.408H12.9945V22H24V16H12.9945ZM9.1809 20.1654H1.80326V17.808H9.16497L9.1809 20.1654ZM22.1754 20.1654H14.819V17.808H22.1754V20.1654ZM4.00063 36.9589C2.07949 35.0131 1.00035 32.3747 1.00035 29.6236V25.1492C0.999609 25.1294 1.00284 25.1097 1.00998 25.0913C1.01712 25.0728 1.02801 25.0561 1.04184 25.0421C1.05567 25.0281 1.07219 25.0172 1.0904 25.0099C1.10861 25.0027 1.12815 24.9994 1.1477 25.0001H22.853C22.8724 25.0001 22.8914 25.0039 22.9093 25.0114C22.9272 25.0189 22.9435 25.0299 22.9572 25.0437C22.9709 25.0576 22.9817 25.074 22.9891 25.0921C22.9965 25.1102 23.0002 25.1296 23.0002 25.1492V29.6236C23.0002 32.3747 21.9211 35.0131 20 36.9589C18.0788 38.9047 15.4729 39.9986 12.7553 40H11.2452C8.52764 39.9986 5.92177 38.9047 4.00063 36.9589ZM16.5544 28.1695H7.44617C7.44617 29.27 7.87796 30.3254 8.64667 31.1036C9.41539 31.8817 10.4581 32.319 11.5452 32.319H12.4555C13.5426 32.319 14.5852 31.8817 15.3539 31.1036C16.1226 30.3254 16.5544 29.27 16.5544 28.1695Z" fill="#00003A"/>
<path d="M32 24L32 12H40.0513V14.049H34.4382V17.1136H39V19.1626H34.4382V24H32Z" fill="#00003A"/>
<path d="M42.395 22.0926H44.5701V16.7117H42.395V14.8053H46.9556V17.3531H47.0784C47.5111 15.6546 48.4875 14.8053 50.0078 14.8053H50.9199V17.0681H49.043C48.3765 17.0681 47.8619 17.2641 47.4994 17.656C47.1369 18.048 46.9556 18.5469 46.9556 19.1527V22.0926H50.0253V23.999H42.395V22.0926Z" fill="#00003A"/>
<path d="M60.1572 23.999C59.6309 23.999 59.2041 23.8624 58.8767 23.5892C58.5609 23.3041 58.3797 22.9062 58.3329 22.3955H58.2452C58.0815 22.9894 57.754 23.4407 57.2629 23.7496C56.7834 24.0584 56.1929 24.2128 55.4913 24.2128C54.5908 24.2128 53.8716 23.9693 53.3337 23.4823C52.8075 22.9953 52.5444 22.3183 52.5444 21.4511C52.5444 19.5863 53.895 18.6538 56.5963 18.6538H58.1224V18.1193C58.1224 17.5373 57.9821 17.1037 57.7014 16.8186C57.4325 16.5335 56.9939 16.391 56.3858 16.391C55.8596 16.391 55.4211 16.4979 55.0703 16.7117C54.7194 16.9137 54.4096 17.2047 54.1406 17.5848L52.8075 16.4088C53.1115 15.8624 53.591 15.4229 54.2458 15.0903C54.9007 14.7577 55.7017 14.5915 56.649 14.5915C57.8768 14.5915 58.8299 14.8825 59.5081 15.4645C60.1864 16.0465 60.5255 16.8899 60.5255 17.9946V21.5937C60.5255 21.76 60.584 21.9025 60.7009 22.0213C60.8179 22.1401 60.9582 22.1995 61.1219 22.1995H61.5604V23.999H60.1572ZM56.3508 22.5736C56.877 22.5736 57.3038 22.4489 57.6313 22.1995C57.9587 21.95 58.1224 21.6174 58.1224 21.2017V20.0258H56.649C56.0877 20.0258 55.655 20.1208 55.3509 20.3108C55.0586 20.5009 54.9124 20.786 54.9124 21.1661V21.5224C54.9124 21.8669 55.041 22.1282 55.2983 22.3064C55.5556 22.4845 55.9064 22.5736 56.3508 22.5736Z" fill="#00003A"/>
<path d="M63.3603 23.999V14.8053H65.7459V16.4445H65.8511C66.0733 15.8862 66.4008 15.4407 66.8334 15.1082C67.2661 14.7637 67.8216 14.5915 68.4998 14.5915C69.4003 14.5915 70.1195 14.8943 70.6574 15.5001C71.207 16.1059 71.4818 16.9612 71.4818 18.0658V23.999H69.0787V18.3866C69.0787 17.7689 68.9384 17.2997 68.6577 16.979C68.3887 16.6583 67.9853 16.4979 67.4474 16.4979C66.9913 16.4979 66.5937 16.6226 66.2546 16.8721C65.9155 17.1215 65.7459 17.466 65.7459 17.9055V23.999H63.3603Z" fill="#00003A"/>
<path d="M77.8248 24.2128C76.8425 24.2128 75.983 24.0584 75.2463 23.7496C74.8192 23.5706 74.4492 23.3516 74.1361 23.0928C73.7559 22.7785 73.8149 22.2135 74.1747 21.8761C74.5783 21.4977 75.2082 21.5456 75.6673 21.8544C75.835 21.9672 76.0104 22.0644 76.1935 22.146C76.6846 22.3598 77.2343 22.4667 77.8423 22.4667C78.392 22.4667 78.8246 22.3776 79.1404 22.1995C79.4561 22.0094 79.614 21.7422 79.614 21.3977C79.614 21.1245 79.5146 20.9226 79.3158 20.7919C79.1287 20.6612 78.8305 20.5662 78.4212 20.5068L76.9653 20.2752C76.3923 20.192 75.8894 20.0554 75.4568 19.8654C75.0358 19.6635 74.6908 19.3843 74.4219 19.028C74.1646 18.6598 74.0359 18.1906 74.0359 17.6204C74.0359 16.6701 74.3926 15.9278 75.1059 15.3932C75.831 14.8587 76.825 14.5915 78.0879 14.5915C79.4183 14.5915 80.4787 14.8839 81.2692 15.4689C81.6402 15.7434 81.6287 16.2741 81.3207 16.6178C80.9477 17.034 80.2824 17.0144 79.787 16.7555C79.7091 16.7148 79.628 16.6765 79.5438 16.6405C79.1111 16.4385 78.6025 16.3376 78.0178 16.3376C77.4915 16.3376 77.0881 16.4266 76.8074 16.6048C76.5268 16.7711 76.3864 17.0206 76.3864 17.3531C76.3864 17.6382 76.4858 17.8461 76.6846 17.9768C76.8834 18.0955 77.1875 18.1846 77.5968 18.244L79.0176 18.4756C79.6023 18.5707 80.111 18.7132 80.5437 18.9033C80.9763 19.0933 81.3213 19.3724 81.5786 19.7407C81.8359 20.1089 81.9645 20.5722 81.9645 21.1304C81.9645 22.0926 81.602 22.8468 80.8769 23.3932C80.1519 23.9396 79.1345 24.2128 77.8248 24.2128Z" fill="#00003A"/>
<path d="M90.7983 14.8053H93.2365L89 26.0045C88.7427 26.6815 88.3919 27.1804 87.9475 27.5011C87.5149 27.8337 86.936 28 86.211 28H84V26.0935H86.2811C86.3981 26.0935 86.4975 26.0579 86.5793 25.9866C86.6729 25.9272 86.7431 25.8441 86.7898 25.7372C87.1176 24.8533 87.1102 23.88 86.7692 23.0011L83.5889 14.8053H86.1499L87.5006 18.6716L88.4127 21.4868H88.5355L89.4301 18.6716L90.7983 14.8053Z" fill="#00003A"/>
<path d="M98.8603 24.2128C97.878 24.2128 97.0185 24.0584 96.2818 23.7496C95.5451 23.4407 94.9779 23.0131 94.5803 22.4667L95.9485 21.1839C96.3227 21.6115 96.7495 21.9322 97.229 22.146C97.7202 22.3598 98.2698 22.4667 98.8779 22.4667C99.4275 22.4667 99.8602 22.3776 100.176 22.1995C100.492 22.0094 100.65 21.7422 100.65 21.3977C100.65 21.1245 100.55 20.9226 100.351 20.7919C100.164 20.6612 99.866 20.5662 99.4567 20.5068L98.0008 20.2752C97.4278 20.192 96.925 20.0554 96.4923 19.8654C96.0713 19.6635 95.7263 19.3843 95.4574 19.028C95.2001 18.6598 95.0715 18.1906 95.0715 17.6204C95.0715 16.6701 95.4281 15.9278 96.1415 15.3932C96.8665 14.8587 97.8605 14.5915 99.1234 14.5915C100.819 14.5915 102.076 15.0666 102.895 16.0168L101.649 17.4066C101.38 17.0859 101.024 16.8305 100.579 16.6405C100.147 16.4385 99.638 16.3376 99.0533 16.3376C98.527 16.3376 98.1236 16.4266 97.8429 16.6048C97.5623 16.7711 97.422 17.0206 97.422 17.3531C97.422 17.6382 97.5214 17.8461 97.7202 17.9768C97.919 18.0955 98.223 18.1846 98.6323 18.244L100.053 18.4756C100.638 18.5707 101.146 18.7132 101.579 18.9033C102.012 19.0933 102.357 19.3724 102.614 19.7407C102.871 20.1089 103 20.5722 103 21.1304C103 22.0926 102.637 22.8468 101.912 23.3932C101.187 23.9396 100.17 24.2128 98.8603 24.2128Z" fill="#00003A"/>
</svg>
