<?xml version="1.0" encoding="utf-8"?>
<!-- Generator: Adobe Illustrator 25.2.1, SVG Export Plug-In . SVG Version: 6.00 Build 0)  -->
<svg version="1.1" id="Capa_1" xmlns="http://www.w3.org/2000/svg" xmlns:xlink="http://www.w3.org/1999/xlink" x="0px" y="0px" viewBox="0 0 512 512" style="enable-background:new 0 0 512 512;" xml:space="preserve">
	<style type="text/css">
	.st0{fill:none;}
</style>
	<polygon fill="white" class="st0" points="151.4,111.8 119.9,143.3 151.4,143.3 " />
	<g>
		<path fill="white" d="M128,186.6h74.1c5.8,0,10.6-4.7,10.6-10.6c0-5.8-4.7-10.6-10.6-10.6H128c-5.8,0-10.6,4.7-10.6,10.6
		C117.4,181.8,122.1,186.6,128,186.6z" />
		<path fill="white" d="M128,228.8h101.1c5.8,0,10.6-4.7,10.6-10.6s-4.7-10.6-10.6-10.6H128c-5.8,0-10.6,4.7-10.6,10.6S122.1,228.8,128,228.8z" />
		<path fill="white" d="M128,271.1h101.1c5.8,0,10.6-4.7,10.6-10.6c0-5.9-4.7-10.6-10.6-10.6H128c-5.8,0-10.6,4.7-10.6,10.6
		C117.4,266.4,122.1,271.1,128,271.1z" />
		<path fill="white" d="M128,313.4h101.1c5.8,0,10.6-4.7,10.6-10.6c0-5.9-4.7-10.6-10.6-10.6H128c-5.8,0-10.6,4.7-10.6,10.6
		C117.4,308.7,122.1,313.4,128,313.4z" />
		<path fill="white" d="M277.3,334.5H127.9c-5.8,0-10.6,4.7-10.6,10.6c0,5.9,4.7,10.6,10.6,10.6h149.4c5.8,0,10.6-4.7,10.6-10.6
		S283.2,334.5,277.3,334.5z" />
		<g>
			<ellipse fill="white" cx="330.1" cy="158.9" rx="35.7" ry="35.1" />
			<path fill="white" d="M432.7,152.8L432.7,152.8c-0.4-0.6-10.8-15.2-28.3-29.8c-20.3-16.8-42.2-26.8-63.8-29.3V66.1c0-5.8-4.7-10.6-10.6-10.6
			H153.3c-2.8,0-5.5,1.1-7.5,3.1l-67.5,67.5c-2.1,2.1-3.2,4.9-3.2,7.5v272.1c0,5.8,4.7,10.6,10.6,10.6h28.4h1.3v29.7
			c0,5.8,4.7,10.6,10.6,10.6h28.4H183h188.5c5.2-0.7,9.2-5.1,9.2-10.5v-99.1l0-82.7l0-53.5c8-4.4,15.9-9.8,23.6-16.1
			c17.5-14.6,27.9-29.2,28.3-29.8l4.2-6L432.7,152.8z M96.3,395.1V144.3h57c5.8,0,10.6-4.7,10.6-10.6v-57h155.4v15h0.1v2.1
			c-21.6,2.5-43.4,12.5-63.6,29.3c-17.6,14.6-27.9,29.2-28.3,29.8l-4.2,6l4.2,6c0.4,0.6,10.7,15.2,28.3,29.8
			c20.2,16.8,42,26.8,63.6,29.3v82.6v61.8v26.8H96.3z M359.7,264.2v82.6v61.8v26.8H136.6v-19.1h6.1h188.5c5.2-0.7,9.2-5.1,9.2-10.5
			v-99.1l0-82.7c6.4-0.7,12.8-2.1,19.3-4.2V264.2z M393.4,179.2c-14.2,11.7-36.7,25.7-63.3,25.7c-26.6,0-49.1-14-63.3-25.7
			c-9.1-7.5-16.1-15.1-20.5-20.4c4.5-5.3,11.4-12.9,20.5-20.4c14.2-11.7,36.7-25.7,63.3-25.7c26.6,0,49.1,14,63.3,25.7
			c9.1,7.5,16.1,15.1,20.5,20.4C409.5,164.2,402.5,171.7,393.4,179.2z" />
		</g>
	</g>
</svg>
