<?xml version="1.0" encoding="utf-8"?>
<!-- Generator: Adobe Illustrator 22.0.1, SVG Export Plug-In . SVG Version: 6.00 Build 0)  -->
<svg version="1.1" xmlns="http://www.w3.org/2000/svg" xmlns:xlink="http://www.w3.org/1999/xlink" x="0px" y="0px"
	 viewBox="0 0 117.8 118" style="enable-background:new 0 0 117.8 118;" xml:space="preserve">
<style type="text/css">
	.st0{fill:#FFFFFF;}
</style>
<g id="Capa_1">
	<g id="Grupo_2189" transform="translate(-715.297 -45)">
		<path class="st0" d="M781.1,141c0-0.4,0-0.8,0-1.2h-27.7c-0.9,0-1.5-0.7-1.5-1.5v-9.3c17.3-0.8,30.8-15.1,30.9-32.3
			c0-0.9-0.7-1.5-1.5-1.5h-29.3V54.9c0-0.9,0.7-1.5,1.5-1.5h37v12.3c0,2.6,2.1,4.6,4.6,4.6h12.3v43.4c0.3,0,0.7,0,1,0
			c0.7,0,1.4,0,2.1,0.1v-45c0-0.4-0.2-0.8-0.4-1.1l-17-17c-0.3-0.3-0.7-0.4-1.1-0.4h-38.6c-2.6,0-4.6,2.1-4.6,4.6v9.3
			c-17.9,0.8-31.7,16-30.8,33.8c0.8,16.7,14.1,30,30.8,30.8v9.3c0,2.6,2.1,4.6,4.6,4.6h27.8C781.2,142.2,781.1,141.6,781.1,141z
			 M793.6,55.5l11.7,11.7h-10.2c-0.9,0-1.5-0.7-1.5-1.5V55.5z M721,96.6c0-15.6,12.2-28.4,27.8-29.3v28.6l-20.2,20.2
			C723.7,110.8,721,103.8,721,96.6z M748.9,125.8c-6.7-0.3-13.1-3-18.1-7.5h0L751,98.1h28.6C778.8,114.2,765.1,126.7,748.9,125.8z"
			/>
		<g>
			<path class="st0" d="M824.8,141.4v10.1c0,0.8-0.7,1.5-1.5,1.5h-28.5c-0.8,0-1.5-0.7-1.5-1.5v-10.1h-2.9v10.1c0,2.4,2,4.4,4.4,4.4
				h28.5c2.4,0,4.4-2,4.4-4.4v-10.1H824.8z"/>
			<polygon class="st0" points="818.1,137.8 816,135.7 810.5,141.3 810.5,118.6 807.6,118.6 807.6,141.3 802.1,135.7 800,137.8 
				809.1,146.8 			"/>
		</g>
	</g>
</g>
<g id="Capa_2">
	<path class="st0" d="M41.2,13c-0.9,0-1.5,0.7-1.5,1.5v30.9c0,0.9,0.7,1.5,1.5,1.5h30.9c0.9,0,1.5-0.7,1.5-1.5
		C73.6,27.5,59.1,13,41.2,13z M42.8,43.8V16.1c15,0.8,26.9,12.8,27.7,27.7H42.8z"/>
	<rect x="76.7" y="31.5" class="st0" width="12.3" height="3.1"/>
	<rect x="76.7" y="40.8" class="st0" width="12.3" height="3.1"/>
	<rect x="76.7" y="50" class="st0" width="12.3" height="3.1"/>
</g>
</svg>
