<?xml version="1.0" encoding="utf-8"?>
<!-- Generator: Adobe Illustrator 25.2.1, SVG Export Plug-In . SVG Version: 6.00 Build 0)  -->
<svg version="1.1" id="ConsultarDocumento" xmlns="http://www.w3.org/2000/svg" xmlns:xlink="http://www.w3.org/1999/xlink" x="0px"
	 y="0px" viewBox="0 0 83.4 109.7" style="enable-background:new 0 0 83.4 109.7;" xml:space="preserve">
<style type="text/css">
	.st0{fill:#FFFFFF;}
</style>
<g>
	<rect x="16" y="38.5" class="st0" width="35.2" height="3.7"/>
	<rect x="16" y="49.9" class="st0" width="35.2" height="3.7"/>
	<rect x="16" y="61.4" class="st0" width="35.2" height="3.7"/>
	<path class="st0" d="M62.1,107.7c-5,0-10-2.1-13.5-5.6c-2-2-3.6-4.5-4.5-7.2l-0.2-0.7H2V24.6L14.5,12h8.3V2h52.4v63.1H65.1v4.3
		l0.8,0.2c3.7,0.7,7.1,2.6,9.8,5.2c7.5,7.5,7.5,19.7,0,27.2c-3.6,3.6-8.5,5.6-13.5,5.6C62.2,107.7,62.1,107.7,62.1,107.7z
		 M62.1,72.9c-4.1,0-8,1.6-10.9,4.5s-4.6,6.9-4.5,11c0,4.1,1.6,8.1,4.5,11s6.9,4.5,10.9,4.5c4.2,0,8.1-1.7,11-4.5
		c6-6.1,6-15.9,0-21.9C70.2,74.5,66.3,72.9,62.1,72.9L62.1,72.9z M5.7,90.4H43l-0.1-1c0-0.3,0-0.6,0-1c0-5.1,2-10,5.6-13.6
		c3.2-3.2,7.4-5.2,12-5.6l0.9-0.1V15.8H20.7v15h-15C5.7,30.8,5.7,90.4,5.7,90.4z M65.1,61.4h6.4V5.7h-45V12H65L65.1,61.4L65.1,61.4z
		 M4.8,27.1H17V14.8L4.8,27.1z"/>
	<g>
		<path class="st0" d="M61.6,91.5c0.2,0.2,0.4,0.2,0.6,0.2c0.2,0,0.4-0.1,0.6-0.2l4.2-4.2c0.3-0.3,0.3-0.8,0-1.1
			c-0.1-0.1-0.4-0.2-0.6-0.2h-3.1v-5.7c0-0.3-0.1-0.6-0.3-0.8c-0.2-0.2-0.5-0.3-0.8-0.3c-0.6,0-1.1,0.5-1.1,1.1v5.7H58
			c-0.2,0-0.4,0.1-0.6,0.2c-0.2,0.2-0.2,0.4-0.2,0.6c0,0.2,0.1,0.4,0.2,0.6L61.6,91.5z"/>
		<path class="st0" d="M67.6,93.4l-10.7,0l-0.1,0c-0.3,0.1-0.5,0.2-0.7,0.4c-0.2,0.2-0.3,0.5-0.2,0.8c0.1,0.5,0.4,0.8,0.9,0.9
			l10.7,0l0.1,0c0.6-0.1,0.9-0.7,0.9-1.3C68.4,93.9,68,93.5,67.6,93.4z"/>
	</g>
</g>
</svg>
