<?xml version="1.0" encoding="utf-8"?>
<!-- Generator: Adobe Illustrator 22.0.1, SVG Export Plug-In . SVG Version: 6.00 Build 0)  -->
<svg version="1.1" xmlns="http://www.w3.org/2000/svg" xmlns:xlink="http://www.w3.org/1999/xlink" x="0px" y="0px"
	 viewBox="0 0 53.5 63.5" style="enable-background:new 0 0 53.5 63.5;" xml:space="preserve">
<style type="text/css">
	.st0{opacity:0;}
	.st1{fill:#D9D9D9;}
	.st2{fill:none;}
	.st3{display:none;}
	.st4{display:inline;}
	.st5{fill:#43413B;fill-opacity:0;}
	.st6{display:inline;opacity:0.25;}
	.st7{fill:#43413B;}
	.st8{fill:#FFFFFF;}
	.st9{fill:none;stroke:#FFFFFF;}
	.st10{stroke:#FFFFFF;stroke-width:2;}
	.st11{opacity:0.25;}
</style>
<g id="Capa_1">
	<title>icoRechazadaPorAtender</title>
	<g id="Capa_2_1_" class="st0">
		<g id="Capa_1-2">
			<path class="st1" d="M24,49c0-0.6,0-1.2,0.1-1.8H4.7c-1.5,0-2.8-1.3-2.8-2.8v-36c0-1.5,1.3-2.8,2.8-2.8l0,0h6
				c-0.3,0.8-0.5,1.6-0.5,2.4v0.6c0,0.6,0.4,1,1,1h18.4c0.6,0,1-0.4,1-1V8c0-0.8-0.2-1.6-0.5-2.4h6c1.5,0,2.8,1.3,2.8,2.8V34h0.2
				c0.6,0,1.1,0,1.7,0.1V8.4c0-2.6-2.1-4.7-4.7-4.7c0,0,0,0,0,0h-7.3c-1.1-1-2.6-1.6-4.1-1.6h-0.8c-1-1.9-3.3-2.7-5.2-1.7
				c0,0,0,0,0,0c-0.7,0.4-1.3,1-1.7,1.7h-0.8c-1.5,0-3,0.6-4.1,1.6H4.7C2.1,3.7,0,5.8,0,8.4c0,0,0,0,0,0v36c0,2.6,2.1,4.7,4.7,4.7
				c0,0,0,0,0,0H24V49z M16.1,4h1.5c0.4,0,0.8-0.3,0.9-0.7c0.3-1,1.3-1.6,2.4-1.3c0,0,0,0,0,0c0.6,0.1,1.2,0.7,1.3,1.3
				C22.3,3.7,22.7,4,23.1,4h1.5c2.1,0,3.8,1.5,4,3.6H12.1C12.3,5.5,14,4,16.1,4z"/>
			<circle class="st2" cx="39" cy="49" r="14.5"/>
			<path class="st1" d="M34.2,43c-0.3,0-0.6,0.1-0.8,0.3c-0.4,0.3-0.5,1-0.2,1.4c0.1,0.1,0.1,0.1,0.2,0.2l4.1,4.1l-4,4
				c-0.4,0.5-0.4,1.1,0,1.6c0.5,0.4,1.1,0.4,1.6,0l4-4l4,4c0.5,0.4,1.1,0.4,1.6,0c0.4-0.5,0.4-1.2-0.1-1.6c0,0,0,0,0,0l-4-4l4-4
				c0.4-0.4,0.4-1.2,0-1.6s-1.2-0.4-1.6,0l-4,4"/>
			<path id="Trazado_1916" class="st1" d="M9.6,19.1l1.5,1.5c0.3,0.4,1,0.5,1.4,0.2s0.5-1,0.2-1.4c-0.1-0.1-0.1-0.1-0.2-0.2l0,0
				L11,17.7l1.5-1.5c0.3-0.4,0.2-1.1-0.2-1.4c-0.4-0.3-0.8-0.3-1.2,0l-1.5,1.5l-1.5-1.5C7.7,14.5,7,14.6,6.7,15
				c-0.3,0.4-0.3,0.8,0,1.2l0,0l1.5,1.5l-1.5,1.5c-0.3,0.4-0.2,1.1,0.2,1.4c0.4,0.3,0.8,0.3,1.2,0l0,0L9.6,19.1z"/>
			<path id="Trazado_1917" class="st1" d="M9.6,29l1.5,1.5c0.4,0.3,1.1,0.2,1.4-0.2c0.3-0.4,0.3-0.8,0-1.2l0,0L11,27.7l1.5-1.5
				c0.3-0.4,0.2-1.1-0.2-1.4c-0.4-0.3-0.8-0.3-1.2,0l-1.5,1.5l-1.5-1.5C7.7,24.5,7,24.6,6.7,25c-0.3,0.4-0.3,0.8,0,1.2l0,0l1.5,1.5
				l-1.5,1.5c-0.3,0.4-0.2,1.1,0.2,1.4c0.4,0.3,0.8,0.3,1.2,0l0,0L9.6,29z"/>
			<g id="Grupo_2607">
				<g id="Grupo_2606">
					<path id="Trazado_1904" class="st1" d="M21,4.5c-0.4-0.3-1.1-0.2-1.4,0.2c-0.3,0.4-0.3,0.8,0,1.2c0.4,0.4,1,0.4,1.4,0
						c0.2-0.2,0.3-0.4,0.3-0.7C21.3,4.9,21.2,4.6,21,4.5z"/>
				</g>
			</g>
			<g id="Grupo_2605">
				<g id="Grupo_2604">
					<path id="Trazado_1903" class="st1" d="M30.8,19.5c-0.4-0.4-1-0.4-1.4,0c-0.4,0.4-0.4,1,0,1.4c0.4,0.4,1,0.4,1.4,0c0,0,0,0,0,0
						c0.2-0.2,0.3-0.4,0.3-0.7C31.1,20,31,19.7,30.8,19.5z"/>
				</g>
			</g>
			<g id="Grupo_2609">
				<g id="Grupo_2608">
					<path id="Trazado_1905_1_" class="st1" d="M20.4,19.2c-0.6,0-1,0.4-1,1s0.4,1,1,1h5.7c0.6,0,1-0.4,1-1s-0.4-1-1-1"/>
				</g>
			</g>
			<g id="Grupo_2611">
				<g id="Grupo_2610">
					<path id="Trazado_1906_1_" class="st1" d="M20.4,25c-0.6,0-1,0.4-1,1s0.4,1,1,1h13.8c0.6,0,1-0.4,1-1s-0.4-1-1-1"/>
				</g>
			</g>
			<g id="Grupo_2613">
				<g id="Grupo_2612">
					<path id="Trazado_1907" class="st1" d="M30.8,29.9c-0.4-0.4-1-0.4-1.4,0c-0.4,0.4-0.4,1,0,1.4c0.4,0.4,1,0.4,1.4,0c0,0,0,0,0,0
						c0.2-0.2,0.3-0.4,0.3-0.7C31.1,30.3,31,30.1,30.8,29.9z"/>
				</g>
			</g>
			<g id="Grupo_2621">
				<g id="Grupo_2620">
					<path id="Trazado_1911" class="st1" d="M26.1,39.9h-5.7c-0.6,0-1,0.4-1,1s0.4,1,1,1h5.7c0.6,0,1-0.4,1-1S26.6,39.9,26.1,39.9z"
						/>
				</g>
			</g>
			<path id="Trazado_1918" class="st1" d="M9.6,39.6l1.5,1.5c0.3,0.4,1,0.5,1.4,0.2c0.4-0.3,0.5-1,0.2-1.4c-0.1-0.1-0.1-0.1-0.2-0.2
				l0,0L11,38.2l1.5-1.5c0.3-0.4,0.2-1.1-0.2-1.4c-0.4-0.3-0.8-0.3-1.2,0l-1.5,1.5l-1.5-1.5C7.7,35,7,35.1,6.7,35.5
				c-0.3,0.4-0.3,0.8,0,1.2l0,0l1.5,1.5l-1.5,1.5c-0.3,0.4-0.2,1.1,0.2,1.4c0.4,0.3,0.8,0.3,1.2,0l0,0L9.6,39.6z"/>
		</g>
	</g>
</g>
<g id="Capa_2" class="st3">
	<g id="Capa_2_2_" class="st4">
		<g id="Capa_1-2_1_">
			<path class="st1" d="M34.6,15.2H20.7c-0.6,0-1,0.4-1,1c0,0.5,0.4,1,0.9,1c0,0,0.1,0,0.1,0h13.8c0.6,0,1-0.4,1-1
				C35.5,15.7,35.2,15.2,34.6,15.2C34.6,15.2,34.6,15.2,34.6,15.2z"/>
			<path class="st1" d="M31.2,21.4c0.4-0.4,0.4-1,0-1.4c-0.4-0.4-1-0.4-1.4,0c-0.4,0.4-0.4,1,0,1.4C30.1,21.8,30.8,21.8,31.2,21.4
				C31.2,21.4,31.2,21.4,31.2,21.4z"/>
			<path class="st1" d="M20.1,5c-0.4,0.3-0.5,1-0.2,1.4c0.3,0.4,1,0.5,1.4,0.2c0.1-0.1,0.1-0.1,0.2-0.2c0.4-0.4,0.4-1,0-1.4
				C21.1,4.6,20.5,4.6,20.1,5z"/>
			<path class="st1" d="M20.7,21.7h5.7c0.6,0,1-0.4,1-1s-0.4-1-1-1h-5.7c-0.6,0-1,0.4-1,1C19.7,21.2,20.2,21.6,20.7,21.7z"/>
			<path class="st1" d="M34.6,25.5H20.7c-0.6,0-1,0.4-1,1c0,0.5,0.4,1,0.9,1c0,0,0.1,0,0.1,0h13.8c0.6,0,1-0.4,1-1
				C35.5,26,35.2,25.5,34.6,25.5C34.6,25.5,34.6,25.5,34.6,25.5z"/>
			<path class="st1" d="M31.2,31.8c0.4-0.4,0.4-1,0-1.4c-0.4-0.4-1-0.4-1.4,0c-0.4,0.4-0.4,1,0,1.4C30.1,32.2,30.8,32.2,31.2,31.8
				C31.2,31.8,31.2,31.8,31.2,31.8z"/>
			<path class="st1" d="M20.7,32.1h5.7c0.6,0,1-0.4,1-1c0-0.5-0.4-1-0.9-1c0,0-0.1,0-0.1,0h-5.7c-0.6,0-1,0.4-1,1
				S20.1,32.1,20.7,32.1z"/>
			<path class="st1" d="M20.7,37.8h13.8c0.6,0,1-0.4,1-1c0-0.5-0.4-1-0.9-1c0,0-0.1,0-0.1,0H20.7c-0.6,0-1,0.4-1,1
				S20.1,37.8,20.7,37.8z"/>
			<path class="st1" d="M31.5,41.5c0-0.3-0.1-0.5-0.3-0.7c-0.4-0.4-1-0.4-1.4,0s-0.4,1,0,1.4c0.4,0.4,1,0.4,1.4,0c0,0,0,0,0,0
				C31.4,42,31.5,41.7,31.5,41.5z"/>
			<path class="st1" d="M26.5,40.5h-5.7c-0.6,0-1,0.4-1,1c0,0.5,0.4,1,0.9,1c0,0,0.1,0,0.1,0h5.7c0.6,0,1-0.4,1-1S27,40.5,26.5,40.5
				z"/>
			<path class="st1" d="M14.7,14.9c-0.4-0.4-1-0.4-1.4,0l-3.7,3.7L8.1,17c-0.4-0.3-1.1-0.2-1.4,0.2c-0.3,0.4-0.3,0.8,0,1.2l2.2,2.2
				c0.4,0.4,1,0.4,1.4,0l0,0l4.5-4.5C15.1,15.7,15,15.2,14.7,14.9z"/>
			<path class="st1" d="M14.7,25.7c-0.4-0.4-1-0.4-1.4,0l-3.8,3.8L8,28c-0.4-0.3-1.1-0.2-1.4,0.2c-0.3,0.4-0.3,0.8,0,1.2l2.3,2.2
				c0.4,0.4,1,0.4,1.4,0l0,0l4.5-4.4C15.1,26.7,15.1,26.1,14.7,25.7z"/>
			<path class="st1" d="M13.3,36.7l-3.8,3.8L8,39c-0.3-0.4-1-0.5-1.4-0.2c-0.4,0.3-0.5,1-0.2,1.4c0.1,0.1,0.1,0.1,0.2,0.2l2.3,2.2
				c0.4,0.4,1,0.4,1.4,0l0,0l4.5-4.4c0.4-0.4,0.4-1,0-1.4C14.4,36.4,13.7,36.3,13.3,36.7z"/>
			<path class="st1" d="M5.1,47.8c-1.5,0-2.8-1.3-2.8-2.8V9c0-1.5,1.3-2.8,2.8-2.8l0,0h6c-0.3,0.7-0.5,1.6-0.5,2.4v0.6
				c0,0.6,0.4,1,1,1H30c0.6,0,1-0.4,1-1V8.5c0-0.8-0.2-1.6-0.5-2.4h6c1.5,0,2.8,1.3,2.8,2.8v25.7h0.2c0.6,0,1.1,0,1.7,0.1V9
				c0-2.6-2.1-4.7-4.7-4.7c0,0,0,0,0,0h-7.3c-1.1-1-2.6-1.6-4.1-1.6h-0.8C23.3,0.8,21,0,19.1,1c0,0,0,0,0,0c-0.7,0.4-1.3,1-1.7,1.7
				h-0.8c-1.5,0-3,0.6-4.1,1.6H5.1c-2.6,0-4.7,2.1-4.7,4.7c0,0,0,0,0,0v36c0,2.6,2.1,4.7,4.7,4.7c0,0,0,0,0,0h19.3
				c0-0.7,0.1-1.3,0.1-1.9H5.1z M16.5,4.5H18c0.4,0,0.8-0.3,0.9-0.7c0.3-1,1.3-1.6,2.4-1.3c0,0,0,0,0,0c0.6,0.1,1.2,0.7,1.3,1.3
				c0.1,0.4,0.5,0.7,0.9,0.7H25c2.1,0,3.8,1.5,4,3.6H12.5C12.7,6.1,14.4,4.5,16.5,4.5z"/>
			<path class="st1" d="M47.8,42.8c-0.4-0.5-1.2-0.5-1.6-0.1c0,0-0.1,0-0.1,0.1L36.9,52l-4.1-4.1c-0.2-0.2-0.5-0.3-0.8-0.3l0,0
				c-0.3,0-0.7,0.1-0.9,0.4c-0.5,0.4-0.5,1.2-0.1,1.6c0,0,0,0.1,0.1,0.1l4.9,4.9c0.4,0.5,1.2,0.5,1.6,0.1c0,0,0.1,0,0.1-0.1l10-10
				c0.2-0.2,0.3-0.6,0.3-0.9C48.2,43.4,48,43.1,47.8,42.8z"/>
		</g>
	</g>
</g>
<g id="Capa_3" class="st3">
	<g id="Capa_2_3_" class="st4">
		<g id="Capa_1-2_2_">
			<g id="Capa_2-2">
				<g id="Capa_3_1_">
					<rect x="-0.2" y="-0.2" class="st5" width="54" height="64.1"/>
				</g>
				<g id="Capa_2-2-2">
					<path class="st1" d="M34,14.4H20.1c-0.6,0-1,0.4-1,1c0,0.5,0.4,1,0.9,1c0,0,0,0,0,0h13.9c0.6,0,1-0.4,1-1
						C34.9,14.9,34.5,14.4,34,14.4L34,14.4z"/>
					<path class="st1" d="M30.6,20.6c0.4-0.4,0.4-1,0-1.4c-0.4-0.4-1-0.4-1.4,0c-0.4,0.4-0.4,1,0,1.4C29.5,21,30.1,21,30.6,20.6
						C30.5,20.6,30.5,20.6,30.6,20.6z"/>
					<path class="st1" d="M19.5,4.2C19,4.5,18.8,5.1,19,5.5s0.9,0.7,1.4,0.4c0.1,0,0.2-0.1,0.2-0.2c0.1-0.1,0.1-0.1,0.2-0.2
						c0.3-0.4,0.2-1.1-0.2-1.4C20.3,3.9,19.8,3.9,19.5,4.2L19.5,4.2z"/>
					<path class="st1" d="M20.1,20.9h5.7c0.6,0,1-0.4,1-1c0-0.5-0.4-1-0.9-1c0,0,0,0,0,0h-5.8c-0.6,0-1,0.4-1,1S19.5,20.9,20.1,20.9
						z"/>
					<path class="st1" d="M34,24.7H20.1c-0.6,0-1,0.4-1,1c0,0.5,0.4,1,0.9,1c0,0,0,0,0,0h13.9c0.6,0,1-0.4,1-1
						C34.9,25.2,34.5,24.7,34,24.7L34,24.7z"/>
					<path class="st1" d="M30.6,31c0.4-0.4,0.4-1,0-1.4c-0.4-0.4-1-0.4-1.4,0c-0.4,0.4-0.4,1,0,1.4C29.5,31.4,30.1,31.4,30.6,31
						C30.5,31,30.5,31,30.6,31z"/>
					<path class="st1" d="M20.1,31.3h5.7c0.6,0,1-0.4,1-1c0-0.5-0.4-1-0.9-1c0,0,0,0,0,0h-5.8c-0.6,0-1,0.4-1,1S19.5,31.3,20.1,31.3
						z"/>
					<path class="st1" d="M34,35.1H20.1c-0.6,0-1,0.4-1,1c0,0.5,0.4,1,0.9,1c0,0,0,0,0,0h13.9c0.6,0,1-0.4,1-1
						C34.9,35.6,34.5,35.1,34,35.1L34,35.1z"/>
					<path class="st1" d="M29.2,40c-0.3,0.4-0.2,1.1,0.2,1.4h0c0.4,0.3,0.8,0.3,1.2,0c0.4-0.3,0.5-1,0.2-1.4c-0.3-0.4-1-0.5-1.4-0.2
						C29.3,39.8,29.2,39.9,29.2,40z"/>
					<path class="st1" d="M25.9,39.7h-5.7c-0.6,0-1,0.4-1,1c0,0.5,0.4,1,0.9,1c0,0,0,0,0,0h5.8c0.6,0,1-0.4,1-1S26.4,39.7,25.9,39.7
						z"/>
					<path class="st1" d="M35.8,3.5h-7.3c-1.1-1-2.6-1.6-4.1-1.6h-0.8c-1-1.9-3.3-2.7-5.2-1.7l0,0c-0.7,0.4-1.3,1-1.7,1.7h-0.8
						c-1.5,0-3,0.6-4.1,1.6H4.5c-2.6,0-4.7,2.1-4.7,4.7c0,0,0,0,0,0v36c0,2.6,2.1,4.7,4.7,4.7c0,0,0,0,0,0h31.3
						c2.6,0,4.7-2.1,4.7-4.7c0,0,0,0,0,0v-36C40.5,5.6,38.4,3.5,35.8,3.5C35.8,3.5,35.8,3.5,35.8,3.5z M15.9,3.8h1.5
						c0.4,0,0.8-0.3,0.9-0.7c0.3-1,1.3-1.6,2.4-1.3l0,0c0.6,0.1,1.2,0.7,1.3,1.3c0.1,0.4,0.5,0.7,0.9,0.7h1.5c2.1,0,3.8,1.5,4,3.6
						H11.9C12.1,5.3,13.8,3.7,15.9,3.8z M38.6,44.2c0,1.5-1.3,2.8-2.8,2.8H4.5c-1.5,0-2.8-1.3-2.8-2.8v-36c0-1.5,1.3-2.8,2.8-2.8h6
						C10.1,6.1,9.9,6.9,10,7.8v0.6c0,0.6,0.4,1,1,1h18.4c0.6,0,1-0.4,1-1V7.8c0-0.8-0.2-1.6-0.5-2.4h6c1.5,0,2.8,1.3,2.8,2.8
						L38.6,44.2L38.6,44.2z"/>
					<path class="st1" d="M12.2,14.7c-0.4-0.4-1-0.4-1.4,0l-1.5,1.5l-1.5-1.5c-0.4-0.3-1.1-0.2-1.4,0.2l0,0c-0.3,0.4-0.3,0.8,0,1.2
						l1.5,1.5l-1.5,1.5c-0.4,0.3-0.5,1-0.2,1.4s1,0.5,1.4,0.2l0,0c0.1-0.1,0.1-0.1,0.2-0.2L9.3,19l1.5,1.5c0.3,0.4,1,0.5,1.4,0.2
						c0.4-0.3,0.5-1,0.2-1.4c-0.1-0.1-0.1-0.1-0.2-0.2l-1.4-1.6l1.5-1.5C12.6,15.6,12.5,15,12.2,14.7z"/>
					<path class="st1" d="M12.2,24.6c-0.4-0.4-1-0.4-1.4,0l-1.5,1.5l-1.5-1.5c-0.4-0.3-1.1-0.2-1.4,0.2l0,0c-0.3,0.4-0.3,0.8,0,1.2
						l1.5,1.5L6.4,29c-0.3,0.4-0.2,1.1,0.2,1.4c0.4,0.3,0.8,0.3,1.2,0l1.6-1.6l1.5,1.5c0.4,0.3,1.1,0.2,1.4-0.2
						c0.3-0.4,0.3-0.8,0-1.2l-1.5-1.4l1.5-1.5C12.6,25.6,12.5,25,12.2,24.6z"/>
					<path class="st1" d="M12.2,35.2c-0.4-0.4-1-0.4-1.4,0l-1.5,1.5l-1.5-1.5c-0.3-0.4-1-0.5-1.4-0.2s-0.5,1-0.2,1.4
						c0.1,0.1,0.1,0.1,0.2,0.2l1.5,1.5l-1.5,1.5c-0.4,0.3-0.5,1-0.2,1.4c0.3,0.4,1,0.5,1.4,0.2c0,0,0,0,0,0c0.1-0.1,0.1-0.1,0.2-0.2
						l1.5-1.5l1.5,1.5c0.3,0.4,1,0.5,1.4,0.2c0.4-0.3,0.5-1,0.2-1.4c-0.1-0.1-0.1-0.1-0.2-0.2L10.8,38l1.5-1.5
						C12.5,36.1,12.5,35.5,12.2,35.2z"/>
				</g>
			</g>
		</g>
	</g>
</g>
<g id="Capa_4" class="st3">
	<g id="Capa_2_4_" class="st4">
		<g id="Capa_1-2_3_">
			<path class="st1" d="M5.1,47.6c-1.5,0-2.8-1.3-2.8-2.8v-36C2.3,7.2,3.5,6,5.1,6l0,0h6c-0.3,0.7-0.5,1.6-0.5,2.4V9
				c0,0.6,0.4,1,1,1H30c0.6,0,1-0.4,1-1V8.4c0-0.8-0.2-1.6-0.5-2.4h6c1.5,0,2.8,1.3,2.8,2.8v25.7h0.2c0.6,0,1.1,0,1.7,0.1V8.8
				c0-2.6-2.1-4.7-4.7-4.7c0,0,0,0,0,0h-7.3c-1.1-1-2.6-1.6-4.1-1.6h-0.8c-1-1.9-3.3-2.7-5.2-1.7c0,0,0,0,0,0
				c-0.7,0.4-1.3,1-1.7,1.7h-0.8c-1.5,0-3,0.6-4.1,1.6H5.1c-2.6,0-4.7,2.1-4.7,4.7c0,0,0,0,0,0v36c0,2.6,2.1,4.7,4.7,4.7
				c0,0,0,0,0,0h19.3c0-0.7,0.1-1.3,0.1-1.9H5.1z M16.5,4.4H18c0.4,0,0.8-0.3,0.9-0.7c0.3-1,1.3-1.6,2.4-1.3c0,0,0,0,0,0
				c0.6,0.1,1.2,0.7,1.3,1.3c0.1,0.4,0.5,0.7,0.9,0.7H25c2.1,0,3.8,1.5,4,3.6H12.5C12.7,5.9,14.4,4.4,16.5,4.4z"/>
			<path class="st1" d="M37.9,37.2c-6,0-10.8,4.8-10.8,10.8s4.8,10.8,10.8,10.8S48.7,54,48.7,48l0,0C48.6,42,43.8,37.2,37.9,37.2z
				 M37.9,56.8c-4.9,0-8.9-4-8.9-8.9s4-8.9,8.9-8.9s8.9,4,8.9,8.9C46.7,52.8,42.8,56.8,37.9,56.8z"/>
			<polygon class="st1" points="38.8,41.1 37,41.1 37,48.3 41.4,52.7 42.7,51.4 38.8,47.5 			"/>
			<path class="st1" d="M12.8,15.3c-0.4-0.4-1-0.4-1.4,0l-1.5,1.5l-1.5-1.5C7.9,15,7.3,15,7,15.5c-0.3,0.4-0.3,0.8,0,1.2l1.5,1.5
				L7,19.7c-0.4,0.3-0.5,1-0.2,1.4s1,0.5,1.4,0.2c0.1-0.1,0.1-0.1,0.2-0.2l1.5-1.5l1.5,1.5c0.3,0.4,1,0.5,1.4,0.2s0.5-1,0.2-1.4
				c-0.1-0.1-0.1-0.1-0.2-0.2l-1.4-1.6l1.5-1.5C13.2,16.2,13.1,15.6,12.8,15.3z"/>
			<path class="st1" d="M34.6,15H20.7c-0.6,0-1,0.4-1,1c0,0.6,0.4,1,1,1h13.8c0.6,0,1-0.4,1-1C35.5,15.5,35.1,15,34.6,15
				C34.6,15,34.6,15,34.6,15z"/>
			<path class="st1" d="M31.2,21.2c0.4-0.4,0.4-1,0-1.4c-0.4-0.4-1-0.4-1.4,0c-0.4,0.4-0.4,1,0,1.4C30.1,21.6,30.7,21.6,31.2,21.2
				C31.1,21.2,31.1,21.2,31.2,21.2z"/>
			<path class="st1" d="M20.1,4.8c-0.4,0.3-0.5,1-0.2,1.4c0.3,0.4,1,0.5,1.4,0.2c0.1-0.1,0.1-0.1,0.2-0.2c0.4-0.4,0.4-1,0-1.4
				C21.1,4.4,20.4,4.4,20.1,4.8z"/>
			<path class="st1" d="M20.7,21.5h5.7c0.6,0,1-0.4,1-1s-0.4-1-1-1h-5.7c-0.6,0-1,0.4-1,1C19.7,21,20.1,21.5,20.7,21.5z"/>
			<path class="st1" d="M35.5,26.3c0-0.6-0.4-1-1-1H20.7c-0.6,0-1,0.4-1,1c0,0.5,0.4,1,0.9,1c0,0,0.1,0,0.1,0h13.8
				C35,27.3,35.5,26.8,35.5,26.3z"/>
			<path class="st1" d="M31.2,31.6c0.4-0.4,0.4-1,0-1.4c-0.4-0.4-1-0.4-1.4,0c-0.4,0.4-0.4,1,0,1.4C30.1,32,30.7,32,31.2,31.6
				C31.1,31.6,31.1,31.6,31.2,31.6z"/>
			<path class="st1" d="M20.7,31.9h5.7c0.6,0,1-0.4,1-1c0-0.5-0.4-1-0.9-1c0,0-0.1,0-0.1,0h-5.7c-0.6,0-1,0.4-1,1
				S20.1,31.9,20.7,31.9z"/>
			<path class="st1" d="M12.8,25.2c-0.4-0.4-1-0.4-1.4,0l-1.5,1.5l-1.5-1.5c-0.4-0.3-1.1-0.2-1.4,0.2c-0.3,0.4-0.3,0.8,0,1.2
				l1.5,1.5L7,29.6C6.6,30,6.7,30.7,7.2,31c0.4,0.3,0.8,0.3,1.2,0l1.6-1.6l1.5,1.5c0.4,0.3,1.1,0.2,1.4-0.2c0.3-0.4,0.3-0.8,0-1.2
				l-1.5-1.4l1.5-1.5C13.2,26.2,13.1,25.6,12.8,25.2z"/>
			<path class="st1" d="M12.8,35.8c-0.4-0.4-1-0.4-1.4,0l-1.5,1.5l-1.5-1.5c-0.3-0.4-1-0.5-1.4-0.2c-0.4,0.3-0.5,1-0.2,1.4
				c0.1,0.1,0.1,0.1,0.2,0.2l1.5,1.5L7,40.2c-0.4,0.3-0.5,1-0.2,1.4s1,0.5,1.4,0.2c0.1-0.1,0.1-0.1,0.2-0.2l1.5-1.5l1.5,1.5
				c0.3,0.4,1,0.5,1.4,0.2c0.4-0.3,0.5-1,0.2-1.4c-0.1-0.1-0.1-0.1-0.2-0.2l-1.4-1.6l1.5-1.5C13.1,36.7,13.1,36.1,12.8,35.8z"/>
			<path class="st1" d="M20.7,37.6H30c1-0.8,2-1.4,3.2-1.9H20.7c-0.6,0-1,0.4-1,1C19.7,37.2,20.1,37.6,20.7,37.6
				C20.6,37.6,20.6,37.6,20.7,37.6z"/>
			<path class="st1" d="M26.5,40.3h-5.7c-0.6,0-1,0.4-1,1c0,0.5,0.4,1,0.9,1c0,0,0.1,0,0.1,0h5.4c0.3-0.6,0.7-1.1,1-1.6
				C27,40.4,26.7,40.3,26.5,40.3z"/>
		</g>
	</g>
</g>
<g id="Capa_5" class="st3">
	
		<image style="display:inline;overflow:visible;" width="144" height="123" xlink:href="icoPorAtender.png"  transform="matrix(0.3333 0 0 0.3333 2.4 4.9684)">
	</image>
</g>
<g id="Capa_6" class="st3">
	<g transform="translate(-3718 1174)" class="st6">
		<g transform="translate(3718 -1174)">
			<g transform="translate(19.38 14.583)">
				<path class="st7" d="M21.2,5.6H7.4c-0.5,0-1,0.4-1,1s0.4,1,1,1h13.8c0.5,0,1-0.4,1-1S21.7,5.6,21.2,5.6L21.2,5.6z"/>
			</g>
			<g transform="translate(29.16 19.188)">
				<path class="st7" d="M8.1,5.8c-0.4-0.4-1-0.4-1.4,0c-0.4,0.4-0.4,1,0,1.4s1,0.4,1.4,0C8.2,7,8.3,6.8,8.3,6.5
					C8.3,6.3,8.2,6,8.1,5.8z"/>
			</g>
			<g transform="translate(19.379 4.125)">
				<path class="st7" d="M8.1,5.8c-0.4-0.4-1-0.4-1.4,0c-0.4,0.4-0.4,1,0,1.4c0.4,0.4,1,0.4,1.4,0C8.2,7,8.3,6.8,8.3,6.5
					C8.3,6.3,8.2,6,8.1,5.8z"/>
			</g>
			<g transform="translate(19.38 19.188)">
				<path class="st7" d="M13.1,5.6H7.4c-0.5,0-1,0.4-1,1s0.4,1,1,1h5.7c0.5,0,1-0.4,1-1S13.6,5.6,13.1,5.6L13.1,5.6z"/>
			</g>
			<g transform="translate(19.38 24.944)">
				<path class="st7" d="M21.2,5.6H7.4c-0.5,0-1,0.4-1,1s0.4,1,1,1h13.8c0.5,0,1-0.4,1-1S21.7,5.6,21.2,5.6L21.2,5.6z"/>
			</g>
			<g transform="translate(29.16 29.549)">
				<path class="st7" d="M8.1,5.8c-0.4-0.4-1-0.4-1.4,0s-0.4,1,0,1.4s1,0.4,1.4,0C8.2,7,8.3,6.8,8.3,6.5C8.3,6.3,8.2,6,8.1,5.8z"/>
			</g>
			<g transform="translate(19.38 29.549)">
				<path class="st7" d="M13.1,5.6H7.4c-0.5,0-1,0.4-1,1s0.4,1,1,1h5.7c0.5,0,1-0.4,1-1S13.6,5.6,13.1,5.6L13.1,5.6z"/>
			</g>
			<g transform="translate(19.38 35.305)">
				<path class="st7" d="M21.2,5.6H7.4c-0.5,0-1,0.4-1,1s0.4,1,1,1h13.8c0.5,0,1-0.4,1-1S21.7,5.6,21.2,5.6L21.2,5.6z"/>
			</g>
			<g transform="translate(29.16 39.911)">
				<path class="st7" d="M8.1,5.8c-0.4-0.4-1-0.4-1.4,0s-0.4,1,0,1.4s1,0.4,1.4,0C8.2,7,8.3,6.8,8.3,6.5C8.3,6.3,8.2,6,8.1,5.8z"/>
			</g>
			<g transform="translate(19.38 39.911)">
				<path class="st7" d="M13.1,5.6H7.4c-0.5,0-1,0.4-1,1s0.4,1,1,1h5.7c0.5,0,1-0.4,1-1S13.6,5.6,13.1,5.6L13.1,5.6z"/>
			</g>
			<g transform="translate(0)">
				<path class="st7" d="M42.4,9.3h-7.3c-1.1-1-2.6-1.6-4.1-1.6h-0.8C29.2,5.8,26.9,5,25,6c-0.7,0.4-1.3,1-1.7,1.7h-0.8
					c-1.5,0-3,0.6-4.1,1.6h-7.3c-2.6,0-4.7,2.1-4.7,4.7v36c0,2.6,2.1,4.7,4.7,4.7h31.3c2.6,0,4.7-2.1,4.7-4.7V14
					C47.1,11.4,45,9.3,42.4,9.3z M22.5,9.6H24c0.4,0,0.8-0.3,0.9-0.7c0.3-1,1.3-1.6,2.4-1.3c0.7,0.2,1.2,0.7,1.3,1.3
					c0.1,0.4,0.5,0.7,0.9,0.7H31c2.1,0,3.8,1.6,4,3.6H18.5C18.7,11.2,20.4,9.6,22.5,9.6L22.5,9.6z M45.2,50c0,1.5-1.2,2.8-2.8,2.8
					H11.1c-1.5,0-2.8-1.2-2.8-2.8V14c0-1.5,1.2-2.8,2.8-2.8h6c-0.3,0.7-0.5,1.5-0.5,2.4v0.6c0,0.5,0.4,1,1,1H36c0.5,0,1-0.4,1-1
					v-0.6c0-0.8-0.2-1.6-0.5-2.4h6c1.5,0,2.8,1.2,2.8,2.8V50z"/>
			</g>
		</g>
		<path class="st7" d="M3734-1149.4l1.5,1.5c0.4,0.4,1,0.4,1.4,0s0.4-1,0-1.4l0,0l-1.5-1.5l1.5-1.5c0.4-0.4,0.4-1,0-1.4
			s-1-0.4-1.4,0l-1.5,1.5l-1.5-1.5c-0.4-0.4-1-0.4-1.4,0s-0.4,1,0,1.4l0,0l1.5,1.5l-1.5,1.5c-0.4,0.4-0.4,1,0,1.4s1,0.4,1.4,0l0,0
			L3734-1149.4z"/>
		<path class="st7" d="M3734-1139.4l1.5,1.5c0.4,0.4,1,0.4,1.4,0s0.4-1,0-1.4l0,0l-1.5-1.5l1.5-1.5c0.4-0.4,0.4-1,0-1.4
			s-1-0.4-1.4,0l-1.5,1.5l-1.5-1.5c-0.4-0.4-1-0.4-1.4,0s-0.4,1,0,1.4l0,0l1.5,1.5l-1.5,1.5c-0.4,0.4-0.4,1,0,1.4s1,0.4,1.4,0l0,0
			L3734-1139.4z"/>
		<path class="st7" d="M3734-1128.8l1.5,1.5c0.4,0.4,1,0.4,1.4,0s0.4-1,0-1.4l0,0l-1.5-1.5l1.5-1.5c0.4-0.4,0.4-1,0-1.4
			s-1-0.4-1.4,0l-1.5,1.5l-1.5-1.5c-0.4-0.4-1-0.4-1.4,0s-0.4,1,0,1.4l0,0l1.5,1.5l-1.5,1.5c-0.4,0.4-0.4,1,0,1.4s1,0.4,1.4,0l0,0
			L3734-1128.8z"/>
	</g>
</g>
<g id="Capa_7" class="st3">
	<g transform="translate(-2177 505)" class="st6">
		<g transform="translate(-1541 669)">
			<g transform="translate(3718 -1174)">
				<g transform="translate(19.38 14.583)">
					<path d="M16.6,2.7H3.1c-0.5,0-0.9,0.4-0.9,0.9s0.4,0.9,0.9,0.9h13.5c0.5,0,0.9-0.4,0.9-0.9S17.1,2.7,16.6,2.7L16.6,2.7z"/>
				</g>
				<g transform="translate(29.16 19.188)">
					<path d="M3.5,2.9c-0.4-0.4-1-0.4-1.3,0c-0.4,0.4-0.4,1,0,1.3c0.4,0.4,1,0.4,1.3,0C3.7,4,3.8,3.8,3.8,3.5C3.8,3.3,3.7,3,3.5,2.9
						z"/>
				</g>
				<g transform="translate(19.379 4.125)">
					<path d="M3.7,3.2c-0.4-0.4-1-0.4-1.3,0C2,3.6,2,4.1,2.4,4.5c0.4,0.4,1,0.4,1.3,0C3.9,4.3,4,4.1,4,3.9C4,3.6,3.9,3.4,3.7,3.2z"
						/>
				</g>
				<g transform="translate(19.38 19.188)">
					<path d="M8.7,2.6H3.1C2.5,2.6,2.1,3,2.1,3.5s0.4,0.9,0.9,0.9h5.6c0.5,0,0.9-0.4,0.9-0.9S9.2,2.6,8.7,2.6L8.7,2.6z"/>
				</g>
				<g transform="translate(19.38 24.944)">
					<path d="M16.6,2.5H3.1c-0.5,0-0.9,0.4-0.9,0.9s0.4,0.9,0.9,0.9h13.5c0.5,0,0.9-0.4,0.9-0.9S17.1,2.5,16.6,2.5L16.6,2.5z"/>
				</g>
				<g transform="translate(29.16 29.549)">
					<path d="M3.5,2.6c-0.4-0.4-1-0.4-1.3,0s-0.4,1,0,1.3s1,0.4,1.3,0c0.2-0.2,0.3-0.4,0.3-0.7C3.8,3.1,3.7,2.8,3.5,2.6z"/>
				</g>
				<g transform="translate(19.38 29.549)">
					<path d="M8.7,2.4H3.1c-0.5,0-0.9,0.4-0.9,0.9s0.4,0.9,0.9,0.9h5.6c0.5,0,0.9-0.4,0.9-0.9S9.2,2.4,8.7,2.4L8.7,2.4z"/>
				</g>
				<g transform="translate(19.38 35.305)">
					<path d="M16.6,2.2H3.1c-0.5,0-0.9,0.4-0.9,0.9s0.4,0.9,0.9,0.9h13.5c0.5,0,0.9-0.4,0.9-0.9S17.1,2.2,16.6,2.2L16.6,2.2z"/>
				</g>
				<g transform="translate(29.16 39.911)">
					<path d="M3.5,2.4C3.1,2,2.5,2,2.2,2.4s-0.4,1,0,1.3s1,0.4,1.3,0c0.2-0.2,0.3-0.4,0.3-0.7C3.8,2.8,3.7,2.6,3.5,2.4z"/>
				</g>
				<g transform="translate(19.38 39.911)">
					<path d="M8.7,2.1H3.1c-0.5,0-0.9,0.4-0.9,0.9S2.5,4,3.1,4h5.6c0.5,0,0.9-0.4,0.9-0.9S9.2,2.1,8.7,2.1L8.7,2.1z"/>
				</g>
				<g transform="translate(0)">
					<path d="M37.8,6.7h-7.2c-1.1-1-2.5-1.6-4-1.6h-0.8c-0.9-1.9-3.2-2.6-5-1.7c-0.7,0.4-1.3,0.9-1.7,1.7h-0.8c-1.5,0-2.9,0.6-4,1.6
						H7.1c-2.5,0-4.6,2-4.6,4.6v35.2c0,2.5,2.1,4.6,4.6,4.6h30.6c2.5,0,4.6-2.1,4.6-4.6V11.2C42.3,8.7,40.3,6.7,37.8,6.7z M18.3,6.9
						h1.5c0.4,0,0.8-0.3,0.9-0.7c0.3-1,1.3-1.6,2.3-1.3c0.6,0.2,1.1,0.7,1.3,1.3c0.1,0.4,0.5,0.7,0.9,0.7h1.5c2,0,3.7,1.6,3.9,3.6
						H14.4C14.5,8.5,16.2,6.9,18.3,6.9L18.3,6.9z M40.5,46.5c0,1.5-1.2,2.7-2.7,2.7H7.1c-1.5,0-2.7-1.2-2.7-2.7V11.2
						c0-1.5,1.2-2.7,2.7-2.7H13c-0.3,0.7-0.5,1.5-0.5,2.3v0.6c0,0.5,0.4,0.9,0.9,0.9h18c0.5,0,0.9-0.4,0.9-0.9v-0.6
						c0-0.8-0.2-1.6-0.5-2.3h5.9c1.5,0,2.7,1.2,2.7,2.7V46.5z"/>
				</g>
			</g>
			<path d="M3729.9-1152.3l1.5,1.5c0.4,0.4,1,0.4,1.3,0c0.4-0.4,0.4-1,0-1.3l0,0l-1.5-1.5l1.5-1.5c0.4-0.4,0.4-1,0-1.3
				c-0.4-0.4-1-0.4-1.3,0l-1.5,1.5l-1.5-1.5c-0.4-0.4-1-0.4-1.3,0c-0.4,0.4-0.4,1,0,1.3l0,0l1.5,1.5l-1.5,1.5c-0.4,0.4-0.4,1,0,1.3
				s1,0.4,1.3,0l0,0L3729.9-1152.3z"/>
			<path d="M3729.9-1142.6l1.5,1.5c0.4,0.4,1,0.4,1.3,0c0.4-0.4,0.4-1,0-1.3l0,0l-1.5-1.5l1.5-1.5c0.4-0.4,0.4-1,0-1.3
				c-0.4-0.4-1-0.4-1.3,0l-1.5,1.5l-1.5-1.5c-0.4-0.4-1-0.4-1.3,0c-0.4,0.4-0.4,1,0,1.3l0,0l1.5,1.5l-1.5,1.5c-0.4,0.4-0.4,1,0,1.3
				c0.4,0.4,1,0.4,1.3,0l0,0L3729.9-1142.6z"/>
			<path d="M3729.9-1132.3l1.5,1.5c0.4,0.4,1,0.4,1.3,0c0.4-0.4,0.4-1,0-1.3l0,0l-1.5-1.5l1.5-1.5c0.4-0.4,0.4-1,0-1.3
				c-0.4-0.4-1-0.4-1.3,0l-1.5,1.5l-1.5-1.5c-0.4-0.4-1-0.4-1.3,0s-0.4,1,0,1.3l0,0l1.5,1.5l-1.5,1.5c-0.4,0.4-0.4,1,0,1.3
				c0.4,0.4,1,0.4,1.3,0l0,0L3729.9-1132.3z"/>
		</g>
		<g transform="translate(2201 -471)">
			<circle class="st8" cx="16.7" cy="16.9" r="14.7"/>
			<circle class="st9" cx="16.7" cy="16.9" r="14.2"/>
		</g>
		<path class="st10" d="M2217.7-451.1l3.3,3.2c0.8,0.8,2.1,0.8,3,0c0.8-0.8,0.8-2.1,0-3l0,0l-3.2-3.3l3.2-3.3c0.8-0.8,0.8-2.1,0-3
			c-0.8-0.8-2.1-0.8-3,0l-3.3,3.2l-3.2-3.2c-0.8-0.8-2.1-0.8-3,0c-0.8,0.8-0.8,2.1,0,3c0,0,0,0,0,0l3.2,3.3l-3.2,3.3
			c-0.8,0.8-0.8,2.2,0,3c0.8,0.8,2.1,0.8,2.9,0L2217.7-451.1z"/>
	</g>
</g>
<g id="Capa_8">
	<g transform="translate(-341 -186.88)" class="st11">
		<g transform="translate(-3377 1360.88)">
			<g transform="translate(3718 -1174)">
				<g transform="translate(19.38 14.583)">
					<path d="M16.8,3.1H2.9c-0.5,0-1,0.4-1,1s0.4,1,1,1h13.8c0.5,0,1-0.4,1-1S17.3,3.1,16.8,3.1L16.8,3.1z"/>
				</g>
				<g transform="translate(29.16 19.188)">
					<path d="M3.6,3.4C3.3,3,2.6,3,2.3,3.4c-0.4,0.4-0.4,1,0,1.4s1,0.4,1.4,0C3.8,4.5,3.9,4.3,3.9,4C3.9,3.8,3.8,3.5,3.6,3.4z"/>
				</g>
				<g transform="translate(19.379 4.125)">
					<path d="M3.6,3.4C3.3,3,2.6,3,2.3,3.4c-0.4,0.4-0.4,1,0,1.4c0.4,0.4,1,0.4,1.4,0C3.8,4.5,3.9,4.3,3.9,4
						C3.9,3.8,3.8,3.5,3.6,3.4z"/>
				</g>
				<g transform="translate(19.38 19.188)">
					<path d="M8.7,3.1H2.9c-0.5,0-1,0.4-1,1s0.4,1,1,1h5.7c0.5,0,1-0.4,1-1S9.2,3.1,8.7,3.1L8.7,3.1z"/>
				</g>
				<g transform="translate(19.38 24.944)">
					<path d="M16.8,3.1H2.9c-0.5,0-1,0.4-1,1s0.4,1,1,1h13.8c0.5,0,1-0.4,1-1S17.3,3.1,16.8,3.1L16.8,3.1z"/>
				</g>
				<g transform="translate(29.16 29.549)">
					<path d="M3.6,3.4C3.3,3,2.6,3,2.3,3.4s-0.4,1,0,1.4s1,0.4,1.4,0C3.8,4.5,3.9,4.3,3.9,4C3.9,3.8,3.8,3.5,3.6,3.4z"/>
				</g>
				<g transform="translate(19.38 29.549)">
					<path d="M8.7,3.1H2.9c-0.5,0-1,0.4-1,1s0.4,1,1,1h5.7c0.5,0,1-0.4,1-1S9.2,3.1,8.7,3.1L8.7,3.1z"/>
				</g>
				<g transform="translate(19.38 35.305)">
					<path d="M16.8,3.1H2.9c-0.5,0-1,0.4-1,1s0.4,1,1,1h13.8c0.5,0,1-0.4,1-1S17.3,3.1,16.8,3.1L16.8,3.1z"/>
				</g>
				<g transform="translate(29.16 39.911)">
					<path d="M3.6,3.4C3.3,3,2.6,3,2.3,3.4s-0.4,1,0,1.4s1,0.4,1.4,0C3.8,4.5,3.9,4.3,3.9,4C3.9,3.8,3.8,3.5,3.6,3.4z"/>
				</g>
				<g transform="translate(19.38 39.911)">
					<path d="M8.7,3.1H2.9c-0.5,0-1,0.4-1,1s0.4,1,1,1h5.7c0.5,0,1-0.4,1-1S9.2,3.1,8.7,3.1L8.7,3.1z"/>
				</g>
				<g transform="translate(0)">
					<path d="M38,6.8h-7.3c-1.1-1-2.6-1.6-4.1-1.6h-0.8c-1-1.9-3.3-2.7-5.2-1.7c-0.7,0.4-1.3,1-1.7,1.7h-0.8c-1.5,0-3,0.6-4.1,1.6
						H6.7C4.1,6.8,2,8.9,2,11.5v36c0,2.6,2.1,4.7,4.7,4.7H38c2.6,0,4.7-2.1,4.7-4.7v-36C42.7,8.9,40.6,6.8,38,6.8z M18.1,7.1h1.5
						c0.4,0,0.8-0.3,0.9-0.7c0.3-1,1.3-1.6,2.4-1.3c0.7,0.2,1.2,0.7,1.3,1.3c0.1,0.4,0.5,0.7,0.9,0.7h1.5c2.1,0,3.8,1.6,4,3.6H14.1
						C14.3,8.7,16,7.1,18.1,7.1L18.1,7.1z M40.7,47.5c0,1.5-1.2,2.8-2.8,2.8H6.7c-1.5,0-2.8-1.2-2.8-2.8v-36c0-1.5,1.2-2.8,2.8-2.8
						h6c-0.3,0.7-0.5,1.5-0.5,2.4v0.6c0,0.5,0.4,1,1,1h18.4c0.5,0,1-0.4,1-1v-0.6c0-0.8-0.2-1.6-0.5-2.4h6c1.5,0,2.8,1.2,2.8,2.8
						V47.5z"/>
				</g>
			</g>
			<path d="M3728.5-1150.8c0.4,0.4,1,0.4,1.4,0c0,0,0,0,0,0l4.5-4.5c0.4-0.4,0.4-1,0-1.4c-0.4-0.4-1-0.4-1.4,0l-3.8,3.8l-1.5-1.5
				c-0.4-0.4-1-0.4-1.4,0c-0.4,0.4-0.4,1,0,1.4L3728.5-1150.8z"/>
			<path d="M3728.5-1140c0.4,0.4,1,0.4,1.4,0c0,0,0,0,0,0l4.5-4.4c0.4-0.4,0.4-1,0-1.4c-0.4-0.4-1-0.4-1.4,0l-3.8,3.8l-1.5-1.5
				c-0.4-0.4-1-0.4-1.4,0c-0.4,0.4-0.4,1,0,1.4L3728.5-1140z"/>
			<path d="M3728.5-1129c0.4,0.4,1,0.4,1.4,0c0,0,0,0,0,0l4.5-4.4c0.4-0.4,0.4-1,0-1.4c-0.4-0.4-1-0.4-1.4,0l-3.8,3.8l-1.5-1.5
				c-0.4-0.4-1-0.4-1.4,0c-0.4,0.4-0.4,1,0,1.4L3728.5-1129z"/>
		</g>
		<g transform="translate(365 221)">
			<circle class="st8" cx="17" cy="18.1" r="15"/>
			<circle class="st9" cx="17" cy="18.1" r="14.5"/>
		</g>
		<path class="st10" d="M378,244.7c0.9,0.9,2.3,0.9,3.1,0c0,0,0,0,0,0l10-10c0.9-0.9,0.8-2.3-0.1-3.1c-0.9-0.8-2.2-0.8-3.1,0
			l-8.5,8.5l-3.4-3.4c-0.9-0.9-2.3-0.8-3.1,0.1c-0.8,0.9-0.8,2.2,0,3.1L378,244.7z"/>
	</g>
</g>
</svg>
