<?xml version="1.0" encoding="utf-8"?>
<!-- Generator: Adobe Illustrator 25.2.1, SVG Export Plug-In . SVG Version: 6.00 Build 0)  -->
<svg version="1.1" id="Capa_1" xmlns="http://www.w3.org/2000/svg" xmlns:xlink="http://www.w3.org/1999/xlink" x="0px" y="0px"
	 viewBox="0 0 512 512" style="enable-background:new 0 0 512 512;" xml:space="preserve">
<path d="M452.4,230.3c-10.6,0-19.8,6.5-23.7,15.7h-25.1c11.3-30.8,17.4-55.9,17.4-64.9c0-39.9-72.1-90-155.5-93.8V64.8
	c9.2-3.9,15.7-13,15.7-23.7c0-14.2-11.5-25.7-25.7-25.7s-25.7,11.5-25.7,25.7c0,10.6,6.5,19.8,15.7,23.7v22.6
	C162.1,91.2,90,141.3,90,181.1c0,8.9,6.1,34.1,17.4,64.9H88.7c-3.9-9.2-13-15.7-23.7-15.7c-14.2,0-25.7,11.5-25.7,25.7
	s11.5,25.7,25.7,25.7c10.6,0,19.8-6.5,23.7-15.7h26.4c26.6,64.9,72.6,143.2,130.4,151.4v18c-9.2,3.9-15.7,13-15.7,23.7
	c0,14.2,11.5,25.7,25.7,25.7s25.7-11.5,25.7-25.7c0-10.6-6.5-19.8-15.7-23.7v-18c57.8-8.3,103.8-86.5,130.4-151.4h32.8
	c3.9,9.2,13,15.7,23.7,15.7c14.2,0,25.7-11.5,25.7-25.7S466.6,230.3,452.4,230.3z M286.5,265l6.2,35.9L260.4,284
	c-1.5-0.8-3.2-1.2-4.9-1.2c-1.7,0-3.4,0.4-4.9,1.2l-32.2,16.9l6.2-35.9c0.6-3.4-0.5-6.9-3-9.4l-26.1-25.4l36-5.2
	c3.4-0.5,6.4-2.7,8-5.8l16.1-32.6l16.1,32.6c1.5,3.1,4.5,5.3,8,5.8l36,5.2l-26.1,25.4C287,258.1,285.9,261.6,286.5,265z
	 M239.6,383.3c-61.9-23.7-118-176-118-202.1c0-14,48.1-55.9,118-61.6V171l-16.8,33.9l-51.7,7.5c-4,0.6-7.3,3.4-8.5,7.2
	c-1.2,3.8-0.2,8,2.7,10.8l37.4,36.5l-8.8,51.5c-0.7,4,0.9,8,4.2,10.3c3.3,2.4,7.6,2.7,11.1,0.8l30.4-16V383.3z M271.3,383.3v-69.7
	l30.4,16c1.5,0.8,3.2,1.2,4.9,1.2c2.2,0,4.4-0.7,6.2-2c3.2-2.4,4.9-6.4,4.2-10.3l-8.8-51.5l37.4-36.5c2.9-2.8,3.9-7,2.7-10.8
	c-1.2-3.8-4.5-6.6-8.5-7.2l-51.7-7.5L271.3,171v-51.5c69.8,5.7,118,47.6,118,61.6C389.3,207.2,333.3,359.6,271.3,383.3z"/>
</svg>
