<?xml version="1.0" encoding="utf-8"?>
<!-- Generator: Adobe Illustrator 25.2.1, SVG Export Plug-In . SVG Version: 6.00 Build 0)  -->
<svg version="1.1" id="ActualizarDocumento" xmlns="http://www.w3.org/2000/svg" xmlns:xlink="http://www.w3.org/1999/xlink"
	 x="0px" y="0px" viewBox="0 0 83.4 109.7" style="enable-background:new 0 0 83.4 109.7;" xml:space="preserve">
<style type="text/css">
	.st0{fill:#FFFFFF;}
</style>
<g>
	<g id="Grupo_2648" transform="translate(53.079 80.255)">
		<path id="Trazado_1925" class="st0" d="M16.1,1.5c-0.2-0.1-0.5-0.1-0.7,0.1l-1.3,1.2c-0.7-0.6-1.5-1.2-2.4-1.5
			C10,0.6,8,0.6,6.2,1.4c-1.8,0.7-3.2,2.2-4,4c-0.8,1.8-0.8,3.9,0,5.8c0.7,1.8,2.2,3.2,4,4c0.9,0.4,1.9,0.6,2.9,0.6
			c1.1,0,2.2-0.2,3.2-0.7c1-0.5,1.9-1.1,2.6-2c0.1-0.1,0.1-0.1,0.1-0.2c0-0.1,0-0.1-0.1-0.2l-1.3-1.3c-0.1-0.1-0.2-0.1-0.2-0.1
			c-0.1,0-0.2,0-0.2,0.1c-1.4,1.8-3.8,2.4-5.8,1.5c-1.2-0.5-2.1-1.4-2.6-2.6C4,8.9,4,7.5,4.5,6.3C5,5.1,5.9,4.2,7.1,3.7
			C7.7,3.4,8.4,3.3,9,3.3c1.3,0,2.5,0.5,3.4,1.3l-1.3,1.3c-0.2,0.2-0.2,0.4-0.1,0.7C11,6.8,11.3,7,11.5,7h4.3c0.3,0,0.6-0.3,0.6-0.6
			V2.1C16.5,1.8,16.3,1.6,16.1,1.5z"/>
	</g>
	<rect x="16" y="38.5" class="st0" width="35.2" height="3.7"/>
	<rect x="16" y="49.9" class="st0" width="35.2" height="3.7"/>
	<rect x="16" y="61.4" class="st0" width="35.2" height="3.7"/>
	<path class="st0" d="M62.1,107.7c-5,0-10-2.1-13.5-5.6c-2-2-3.6-4.5-4.5-7.2l-0.2-0.7H2V24.6L14.5,12h8.3V2h52.4v63.1H65.1v4.3
		l0.8,0.2c3.7,0.7,7.1,2.6,9.8,5.2c7.5,7.5,7.5,19.7,0,27.2c-3.6,3.6-8.5,5.6-13.5,5.6C62.2,107.7,62.1,107.7,62.1,107.7z
		 M62.1,72.9c-4.1,0-8,1.6-10.9,4.5s-4.6,6.9-4.5,11c0,4.1,1.6,8.1,4.5,11s6.9,4.5,10.9,4.5c4.2,0,8.1-1.7,11-4.5
		c6-6.1,6-15.9,0-21.9C70.2,74.5,66.3,72.9,62.1,72.9L62.1,72.9z M5.7,90.4H43l-0.1-1c0-0.3,0-0.6,0-1c0-5.1,2-10,5.6-13.6
		c3.2-3.2,7.4-5.2,12-5.6l0.9-0.1V15.8H20.7v15h-15C5.7,30.8,5.7,90.4,5.7,90.4z M65.1,61.4h6.4V5.7h-45V12H65L65.1,61.4L65.1,61.4z
		 M4.8,27.1H17V14.8L4.8,27.1z"/>
</g>
</svg>
