<svg xmlns="http://www.w3.org/2000/svg" width="305.623" height="400.401" viewBox="0 0 305.623 400.401">
  <g id="Grupo_2440" data-name="Grupo 2440" transform="translate(-806.952 -285.099)">
    <g id="Grupo_2435" data-name="Grupo 2435" transform="translate(-2693.966 362.099)">
      <path id="Trazado_1843" data-name="Trazado 1843" d="M3806.5,266.632c-.008-.061-.024-.119-.035-.18-.021-.119-.043-.238-.076-.354-.019-.069-.045-.136-.067-.2-.034-.1-.069-.207-.111-.307-.029-.069-.064-.136-.1-.2-.046-.094-.093-.188-.146-.278-.039-.066-.082-.129-.124-.193-.058-.086-.117-.171-.181-.253-.047-.061-.1-.12-.149-.178-.068-.078-.139-.152-.213-.225-.056-.055-.114-.108-.173-.16-.078-.068-.16-.132-.243-.194-.064-.048-.128-.095-.195-.139-.089-.058-.182-.112-.276-.163-.046-.026-.089-.057-.136-.081l-69.686-34.85h-18.3l77,38.51h0l-139.57,69.8h0l-139.57-69.8h0l77-38.51h-18.3l-69.685,34.85c-.048.024-.091.056-.137.082-.094.052-.187.1-.274.163-.068.044-.132.091-.2.139-.083.062-.164.126-.242.193q-.089.078-.174.16c-.074.072-.145.147-.212.224-.052.058-.1.117-.149.178-.064.082-.124.166-.181.253-.043.063-.085.127-.124.193-.053.09-.1.184-.147.278-.033.067-.067.134-.1.2-.042.1-.077.2-.111.307-.023.068-.048.134-.067.2-.032.116-.054.235-.076.354-.011.06-.027.119-.035.18a4.08,4.08,0,0,0-.039.551V415.9a4.093,4.093,0,0,0,2.262,3.66L3651.9,493.938c.035.018.073.03.108.046.062.029.124.055.186.08.1.042.208.079.314.112.063.02.126.04.19.056.115.03.23.052.347.072.056.009.11.022.166.029a3.835,3.835,0,0,0,1.037,0c.055-.007.11-.02.166-.029.116-.02.232-.042.347-.072.064-.017.127-.037.19-.056q.159-.05.314-.112c.062-.026.125-.052.186-.08.036-.016.073-.029.108-.046l148.72-74.376a4.093,4.093,0,0,0,2.261-3.66V267.183A4.08,4.08,0,0,0,3806.5,266.632ZM3649.637,483.656,3509.1,413.374V273.806h0l140.535,70.282h0Zm148.719-209.85V413.374l-140.535,70.282V344.088h0l140.535-70.282Z" transform="translate(0 -170.969)" fill="#3f3f3f"/>
      <path id="Trazado_1844" data-name="Trazado 1844" d="M3793.729-77H3554V50.212h82.32l3.793,4.55,31.894,38.255,6.77,8.12,6.769-8.12,31.894-38.255,3.793-4.55h81.31V-77Zm0,118.4h-76.623l-6.436,7.72-31.894,38.255L3640.447,41.4h-77.633V-68.186h230.916Z" transform="translate(-29.69)" fill="#3f3f3f"/>
      <g id="Grupo_2438" data-name="Grupo 2438" transform="translate(3523.053 144.41)">
        <path id="Trazado_1845" data-name="Trazado 1845" d="M3560.272,435.413l.414.152a17.7,17.7,0,0,0,1.721.57,17.083,17.083,0,0,0,1.806.432l.315.063.047.009c.264.048.523.078.782.108l.249.029c.176.025.344.043.5.056.2.016.39.026.564.034l.044,0a16.6,16.6,0,0,0,1.923-.022l.12-.006.078-.006a13.057,13.057,0,0,0,7.023-2.74,12.327,12.327,0,0,0,2.466-2.678,11.628,11.628,0,0,0,.92-1.623,9.456,9.456,0,0,0,.678-1.94,1.99,1.99,0,0,0-.93-2.1,2.025,2.025,0,0,0-2.309.068,22.946,22.946,0,0,1-4.67,2.862,16.014,16.014,0,0,1-5.113,1.355l-.208.014a11.2,11.2,0,0,1-1.135.04c-.056,0-.113,0-.169,0a8.678,8.678,0,0,1-.9-.032c-.166-.011-.332-.022-.5-.03a24.375,24.375,0,0,1-3.073-.509,48.827,48.827,0,0,1-7.093-2.49,1.939,1.939,0,0,0-2.406.678,1.9,1.9,0,0,0,.418,2.446,30.056,30.056,0,0,0,8.346,5.223Z" transform="translate(-3551.148 -425.428)" fill="#3f3f3f"/>
        <path id="Trazado_1846" data-name="Trazado 1846" d="M3767.528,515.839a70.968,70.968,0,0,1-7.074-5c-1.174-.986-2.207-1.92-3.16-2.854-.163-.169-.327-.335-.491-.5-.346-.351-.674-.682-.974-1.022l-.061-.066c-.4-.416-.786-.864-1.194-1.339l-.206-.239a61.4,61.4,0,0,1-5.129-7.1c-1.509-2.424-2.943-5.014-4.385-7.919a2.128,2.128,0,0,0-2.321-1.128,1.788,1.788,0,0,0-1.435,1.935,17.083,17.083,0,0,0,.412,2.321c.164.694.378,1.442.656,2.293a37.573,37.573,0,0,0,1.865,4.563,43.027,43.027,0,0,0,5.737,8.8l.11.126c.534.611,1.086,1.243,1.661,1.827.623.654,1.265,1.252,1.906,1.848.022.02.044.04.067.059l.387.334c.508.439,1.033.893,1.6,1.316.578.464,1.15.857,1.7,1.237l.348.239.054.036a24.772,24.772,0,0,0,8.632,3.69c.074.014.147.023.219.03a1.852,1.852,0,0,0,1.919-1.166A1.966,1.966,0,0,0,3767.528,515.839Z" transform="translate(-3657.386 -460.775)" fill="#3f3f3f"/>
        <path id="Trazado_1847" data-name="Trazado 1847" d="M3651.566,644.3l-6.4,2.268a3.291,3.291,0,0,1-2.888-.451,8.758,8.758,0,0,1-2.981-3.545l-1.308-2.614a18.551,18.551,0,0,0-7.853-8.351l-.039-.019c-3.129-1.54-6.083-1.352-8.1.516a2.945,2.945,0,0,1-3.486.405l-.028-.014a8.154,8.154,0,0,1-3.342-3.7l-.624-1.231a18.742,18.742,0,0,0-7.572-8.124c-2.949-1.548-5.807-1.548-7.862-.033l-3.145,2.318a2.939,2.939,0,0,1-2.924.308,6.543,6.543,0,0,1-2.717-2.3l-6.764-9.228c-1.123-1.532-2.859-2.268-3.877-1.646s-.935,2.368.188,3.9l6.764,9.228a17.056,17.056,0,0,0,5.954,5.237c.288.143.578.273.868.388,2.569,1.021,4.973.855,6.769-.47l3.145-2.318a3,3,0,0,1,3.323-.124,8.268,8.268,0,0,1,3.261,3.66l.625,1.231a18.451,18.451,0,0,0,7.871,8.276c3.115,1.52,6.055,1.326,8.065-.535a2.948,2.948,0,0,1,3.5-.4l.014.007a8.191,8.191,0,0,1,3.374,3.764l1.308,2.614a19.242,19.242,0,0,0,6.777,7.751c2.557,1.587,5.128,2.049,7.24,1.3l6.4-2.268c1.16-.412,1.31-2.043.334-3.644S3652.727,643.892,3651.566,644.3Z" transform="translate(-3566.694 -527.901)" fill="#3f3f3f"/>
        <path id="Trazado_1848" data-name="Trazado 1848" d="M3726.062,544.231c-9.978-4.954-18.264-1.184-18.51,8.42s7.644,21.4,17.621,26.358,18.264,1.184,18.509-8.42S3736.038,549.184,3726.062,544.231Zm-3.81,18.416c-3.788-1.881-6.784-6.389-6.689-10.068s3.241-5.138,7.03-3.257,6.784,6.389,6.69,10.069S3726.04,564.528,3722.251,562.647Zm10.262,7.794a4.918,4.918,0,0,1-2.676-4.028c.038-1.471,1.3-2.055,2.812-1.3a4.918,4.918,0,0,1,2.676,4.027C3735.288,570.61,3734.028,571.193,3732.513,570.441Z" transform="translate(-3638.625 -490.657)" fill="#3f3f3f"/>
        <path id="Trazado_1849" data-name="Trazado 1849" d="M3598.053,499.832c.246-9.6-7.644-21.4-17.621-26.358s-18.264-1.184-18.509,8.42,7.644,21.4,17.621,26.358S3597.808,509.436,3598.053,499.832Zm-10.842-5.383a4.918,4.918,0,0,1,2.676,4.027c-.038,1.472-1.3,2.055-2.812,1.3a4.918,4.918,0,0,1-2.676-4.027C3584.436,494.28,3585.7,493.7,3587.21,494.449Zm-10.4-2.463c-3.789-1.881-6.784-6.389-6.689-10.069s3.242-5.138,7.03-3.257,6.784,6.389,6.69,10.069S3580.6,493.867,3576.813,491.986Z" transform="translate(-3557.171 -451.082)" fill="#3f3f3f"/>
      </g>
      <g id="Grupo_2439" data-name="Grupo 2439" transform="translate(3653.729 166.014)">
        <path id="Trazado_1850" data-name="Trazado 1850" d="M3847.681,474.453h0Z" transform="translate(-3847.681 -474.453)" fill="#3f3f3f"/>
      </g>
    </g>
    <text id="_Ooops_" data-name="¡Ooops!" transform="translate(953 363)" fill="#3f3f3f" font-size="54" font-family="AvenirNext-Bold, Avenir Next" font-weight="700" letter-spacing="-0.024em"><tspan x="-102.978" y="0">¡Ooops!</tspan></text>
  </g>
</svg>
