<svg xmlns="http://www.w3.org/2000/svg" width="164.846" height="125.3" viewBox="0 0 164.846 125.3">
  <g id="Grupo_2421" data-name="Grupo 2421" transform="translate(-5.669 -65.723)">
    <path id="Trazado_1763" data-name="Trazado 1763" d="M5.669,191.023V165.107h9.886V65.723H160.629v99.384h9.886v25.916Zm6.145-6.145H164.37V171.251H11.814ZM21.7,165.107H154.484V71.867H21.7Z" transform="translate(0)" fill="#3f3f3f"/>
    <rect id="Rectángulo_90" data-name="Rectángulo 90" width="41.018" height="6.144" transform="translate(99.844 119.274)" fill="#3f3f3f"/>
    <rect id="Rectángulo_91" data-name="Rectángulo 91" width="41.018" height="6.144" transform="translate(99.844 129.957)" fill="#3f3f3f"/>
    <rect id="Rectángulo_92" data-name="Rectángulo 92" width="41.018" height="6.145" transform="translate(99.844 140.639)" fill="#3f3f3f"/>
    <g id="Grupo_2420" data-name="Grupo 2420" transform="translate(37.761 94.203)">
      <path id="Trazado_1764" data-name="Trazado 1764" d="M89.863,226.431V216.412c0-3.273,0-3.273,3.286-3.273.664,0,1.329,0,1.994,0,3.583.03,5.554,1.63,5.877,5.178a12.264,12.264,0,0,1-.591,4.74,4.674,4.674,0,0,1-4.769,3.368C93.816,226.44,91.971,226.431,89.863,226.431Zm2.8-2.555c4.187.508,5.768-.976,5.5-4.888-.2-2.8-2.272-4.234-4.942-3.373a.937.937,0,0,0-.529.682C92.647,218.8,92.661,221.3,92.661,223.875Z" transform="translate(-89.863 -212.753)" fill="#3f3f3f"/>
      <path id="Trazado_1765" data-name="Trazado 1765" d="M175.757,216.777c-1.318.085-2.485.557-3.228-1.055-.465-1.008-2.685-1.143-3.624-.449a1.18,1.18,0,0,0,.338,2.195c1.2.43,2.468.668,3.7,1.023,2.561.739,3.446,1.86,3.269,4.091a4.112,4.112,0,0,1-4.034,3.712,12.836,12.836,0,0,1-4.442-.577,3.505,3.505,0,0,1-2.335-3.692c1.234-.084,2.417-.669,3.188,1.037.521,1.152,3.452,1.263,4.387.343a1.225,1.225,0,0,0-.524-2.143c-1.106-.408-2.283-.623-3.426-.931-2.6-.7-3.662-1.958-3.477-4.111.178-2.07,1.72-3.468,4.152-3.764,3.188-.387,5.583,1.029,6.057,3.591A5.023,5.023,0,0,1,175.757,216.777Z" transform="translate(-126.38 -212.393)" fill="#3f3f3f"/>
      <path id="Trazado_1766" data-name="Trazado 1766" d="M191.163,225.281c.14,1.925,1.5,2.625,2.932,1.84a18.476,18.476,0,0,1,3.194-1.047c-.425,2.775-2.891,4.134-5.566,3.5-2.8-.665-4.2-3.572-3.318-6.857a4.622,4.622,0,0,1,9.059,1.767c-.072.337-.771.741-1.2.763C194.573,225.332,192.871,225.281,191.163,225.281Zm3.407-2.056a1.571,1.571,0,0,0-1.942-1.609,1.329,1.329,0,0,0-1.343,1.609Z" transform="translate(-137.376 -215.694)" fill="#3f3f3f"/>
      <path id="Trazado_1767" data-name="Trazado 1767" d="M122.709,229.718l-3.458-.49a12.924,12.924,0,0,1-2.779.614,2.655,2.655,0,0,1-2.721-2.42,2.846,2.846,0,0,1,1.72-3.259c.828-.325,1.756-.387,2.612-.654a11.07,11.07,0,0,0,1.56-.755c-.142-.272-.28-.774-.425-.776a4.007,4.007,0,0,0-2.134.238c-1.27.871-1.2.97-2.877.66,0-1.641.619-2.777,2.136-3.034a12.967,12.967,0,0,1,4.173.106,2.28,2.28,0,0,1,1.876,2.511c.008,1.332-.023,2.665.025,4C122.452,227.431,122.587,228.4,122.709,229.718Zm-3.141-4.585a7.031,7.031,0,0,0-2.021.5c-.469.287-.716.935-1.061,1.424.5.249,1,.711,1.5.7C119.189,227.745,119.684,226.879,119.567,225.133Z" transform="translate(-101.389 -215.933)" fill="#3f3f3f"/>
      <path id="Trazado_1768" data-name="Trazado 1768" d="M145.64,222.873c.151-1.882.748-2.846,2.407-3.123a11.688,11.688,0,0,1,3.9.135,2.358,2.358,0,0,1,1.941,2.616c0,1.189-.026,2.38.019,3.567.041,1.117.16,2.231.263,3.586l-3.505-.432a12.228,12.228,0,0,1-2.636.59,2.675,2.675,0,0,1-2.776-2.363,2.874,2.874,0,0,1,1.782-3.353c.787-.3,1.669-.352,2.475-.619a11.339,11.339,0,0,0,1.63-.837c-.167-.255-.34-.73-.5-.726-.717.017-1.765-.087-2.083.325C147.655,223.4,146.669,222.941,145.64,222.873Zm5.5,2.212a7.59,7.59,0,0,0-2.173.532c-.451.274-.648.966-.958,1.473.514.223,1.053.677,1.539.625C150.926,227.567,151.211,226.524,151.138,225.085Z" transform="translate(-116.613 -215.896)" fill="#3f3f3f"/>
      <path id="Trazado_1769" data-name="Trazado 1769" d="M217.19,223.038c-1.2,0-2.344.557-3.156-.906a1.417,1.417,0,0,0-2.454.285,9.721,9.721,0,0,0-.067,4.11c.2,1,2.133,1.2,2.562.29.7-1.5,1.785-1.205,3.149-1.018a8.855,8.855,0,0,1-.387,1.487c-.833,1.806-2.367,2.558-4.718,2.373a3.94,3.94,0,0,1-3.622-2.932c-1.063-3.326.365-6.627,3.172-7.335C214.51,218.674,216.939,220.2,217.19,223.038Z" transform="translate(-147.047 -215.691)" fill="#3f3f3f"/>
      <path id="Trazado_1770" data-name="Trazado 1770" d="M133.67,216.962c.657-.765-.454-2.264,1.565-2.342,2.2-.085,1.133,1.576,1.8,2.25.418.526,1.1,1.021,1.165,1.591.046.378-.775.863-1.208,1.3l-.317-.175c0,1.561-.039,3.125.034,4.682a1.156,1.156,0,0,0,.714.836.983.983,0,0,1,.8,1.484,1.693,1.693,0,0,1-1.279.722c-2.188.124-2.949-.634-2.963-2.79-.008-1.19,0-2.381,0-3.571,0-.734.2-1.556-.961-1.7-.18-.022-.479-.781-.367-1.054A5.111,5.111,0,0,1,133.67,216.962Z" transform="translate(-110.538 -213.468)" fill="#3f3f3f"/>
      <path id="Trazado_1771" data-name="Trazado 1771" d="M234.065,225.944v3.436c-2.341.6-2.623.45-2.531-1.708.059-1.386-.4-1.817-1.766-1.75-2.026.1-2.1-.072-1.618-2.423.7,0,1.446-.044,2.185.011.865.065,1.23-.281,1.169-1.139-.027-.378.025-.761,0-1.139-.073-.967.192-1.46,1.326-1.467,1.189-.007,1.326.573,1.268,1.5-.041.659-.008,1.322-.008,2.238.972,0,1.851.029,2.726-.008.914-.039.963.534.956,1.206-.008.648.008,1.271-.922,1.244C236,225.925,235.159,225.944,234.065,225.944Z" transform="translate(-156.6 -215.957)" fill="#3f3f3f"/>
    </g>
  </g>
</svg>
