<svg id="Grupo_2429" data-name="Grupo 2429" xmlns="http://www.w3.org/2000/svg" width="105.285" height="101.557" viewBox="0 0 105.285 101.557">
  <path id="Trazado_1888" data-name="Trazado 1888" d="M193.343,335.338h30.264a2.722,2.722,0,0,0,2.721-2.674c0-.032,0-.063,0-.075V302.366a2.722,2.722,0,0,0-2.674-2.761c-.027,0-.056,0-.084,0H193.355a2.721,2.721,0,0,0-2.761,2.684v30.3l.017.174A2.848,2.848,0,0,0,193.343,335.338Zm2.749-5.264V305.1h24.972v24.972Z" transform="translate(-139.645 -250.062)"/>
  <path id="Trazado_1889" data-name="Trazado 1889" d="M132.508,358.176h.017c.065,0,.129.007.194.007a2.6,2.6,0,0,0,2.587-2.363,2.567,2.567,0,0,0,0-.43v-6.906a2.6,2.6,0,0,0-2.368-2.776,2.63,2.63,0,0,0-.415,0,2.721,2.721,0,0,0-2.714,2.684v7.023a2.724,2.724,0,0,0,2.7,2.762Z" transform="translate(-105.844 -275.696)"/>
  <path id="Trazado_1890" data-name="Trazado 1890" d="M178.357,284.058h-4.921V232.44a14.776,14.776,0,0,0,7.443-12.81,2.291,2.291,0,0,0-.375-1.456l-17.426-28.8a2.784,2.784,0,0,0-2.044-1.363l-.059-.008H94.161l-.1.005a3.253,3.253,0,0,0-2.243,1.282l-.039.052-15.566,28.8a2.03,2.03,0,0,0-.388,1.456A15.194,15.194,0,0,0,83.5,232.674V284.29H79.229v-.244l-.9.012a2.55,2.55,0,0,0-2.513,2.578c0,.069,0,.139.011.207a2.686,2.686,0,0,0,2.434,2.709l.083,0H178.357a2.749,2.749,0,0,0,0-5.5Zm-62.29-41.021v41.021H99V243.037Zm-8.492-49.775-8,23.577H82.859l12.762-23.577ZM120.562,238.6a2.7,2.7,0,0,0-1.9-.825c-.033,0-.065,0-.075,0H96.268a2.721,2.721,0,0,0-2.762,2.684V284.29H88.537V234.376a14.771,14.771,0,0,0,2.6.287h0a14.775,14.775,0,0,0,12.326-6.593,14.822,14.822,0,0,0,24.658-.006A14.913,14.913,0,0,0,153,227.888a14.774,14.774,0,0,0,12.6,6.776,16.637,16.637,0,0,0,2.336-.253V284.29h-46.6V240.534A2.708,2.708,0,0,0,120.562,238.6Zm10.306-21.758V193.262h11.041l8.214,23.577Zm19.176,5.264a9.581,9.581,0,0,1-9.284,7.058h-.073a9.859,9.859,0,0,1-9.353-7.058Zm-33.938,7.058h-.074a9.859,9.859,0,0,1-9.353-7.058H125.39A9.581,9.581,0,0,1,116.106,229.161Zm40.346-7.052h18.694a9.718,9.718,0,0,1-18.694,0Zm-.722-5.27-8.214-23.577h11.5l14.276,23.577ZM125.6,193.262v23.577H104.949l8.214-23.577Zm-34.46,35.9a10.147,10.147,0,0,1-9.561-7.058H100.5a9.582,9.582,0,0,1-9.286,7.058Z" transform="translate(-75.817 -187.998)"/>
</svg>
