{
  "region": "us-east-1",
  "ecr_repository_name": "plataforma-de-franquicia-app-franquicia-dev",
  "cluster": "SERVICIOS-INTERNOS-DEV-CLUSTER",
  "service": "SRV-PLATAFORMAAPP-DEV",
  "family": "task-plataforma-app-dev"
}
