<?xml version="1.0" encoding="utf-8"?>
<!-- Generator: Adobe Illustrator 25.2.1, SVG Export Plug-In . SVG Version: 6.00 Build 0)  -->
<svg version="1.1" id="Capa_1" xmlns="http://www.w3.org/2000/svg" xmlns:xlink="http://www.w3.org/1999/xlink" x="0px" y="0px" viewBox="0 0 512 512" style="enable-background:new 0 0 512 512;" xml:space="preserve">
	<g>
		<path fill="white" d="M210.5,244h31.9c8.1,0,14.9-6.6,14.9-14.9c0-8.1-6.6-14.9-14.9-14.9h-31.9c-8.1,0-14.9,6.6-14.9,14.9
		C195.6,237.2,202.2,244,210.5,244z" />
		<path fill="white" d="M210.5,303.2h61.9c8.1,0,14.9-6.6,14.9-14.9c0-8.3-6.6-14.9-14.9-14.9h-61.9c-8.1,0-14.9,6.6-14.9,14.9
		C195.6,296.6,202.2,303.2,210.5,303.2z" />
		<path fill="white" d="M282.4,332.8h-71.9c-8.1,0-14.9,6.6-14.9,14.9c0,8.3,6.6,14.9,14.9,14.9h71.9c8.1,0,14.9-6.6,14.9-14.9
		S290.7,332.8,282.4,332.8z" />
		<circle fill="white" cx="164.9" cy="227.1" r="20.8" />
		<path fill="white" d="M164.9,265.6c-11.5,0-20.8,9.3-20.8,20.8s9.3,20.8,20.8,20.8s20.8-9.3,20.8-20.8S176.4,265.6,164.9,265.6z M164.9,295.1
		c-4.8,0-8.8-3.9-8.8-8.8c0-4.8,3.9-8.8,8.8-8.8c4.8,0,8.8,3.9,8.8,8.8C173.7,291.2,169.7,295.1,164.9,295.1z" />
		<path fill="white" d="M164.9,324.8c-11.5,0-20.8,9.3-20.8,20.8s9.3,20.8,20.8,20.8s20.8-9.3,20.8-20.8S176.4,324.8,164.9,324.8z M164.9,354.4
		c-4.8,0-8.8-3.9-8.8-8.8c0-4.8,3.9-8.8,8.8-8.8c4.8,0,8.8,3.9,8.8,8.8C173.7,350.4,169.7,354.4,164.9,354.4z" />
		<path fill="white" d="M420.4,189.4c0-19.6-7.6-38.1-21.5-51.9c-11.5-11.5-26.1-18.7-41.9-20.8V86.2c0-5.8-4.7-10.6-10.6-10.6H169.8
		c-2.8,0-5.5,1.1-7.5,3.1l-67.5,67.5c-2.1,2.1-3.2,4.9-3.2,7.5v272.1c0,5.8,4.7,10.6,10.6,10.6h28.4h28.6h188.5
		c5.2-0.7,9.2-5.1,9.2-10.5l0.1-163.7c15.8-2.2,30.4-9.3,41.9-20.8C412.7,227.5,420.4,209.1,420.4,189.4z M335.9,415.2H112.8V164.4
		h57c5.8,0,10.6-4.7,10.6-10.6v-57h155.4v20c-15.4,2.3-29.6,9.5-40.8,20.7c-13.9,13.9-21.5,32.3-21.5,51.9
		c0,19.6,7.6,38.1,21.5,51.9c11.2,11.2,25.5,18.4,40.9,20.7v126.3V415.2z M346.9,247.7c-15.6,0-30.2-6.1-41.2-17.1
		c-11-11-17.1-25.6-17.1-41.2c0-15.6,6.1-30.2,17.1-41.2c11-11,25.6-17.1,41.2-17.1c15.6,0,30.2,6.1,41.2,17.1
		c11,11,17.1,25.6,17.1,41.2c0,15.6-6.1,30.2-17.1,41.2C377.1,241.6,362.5,247.7,346.9,247.7z" />
		<rect fill="white" x="341" y="141.8" width="11.9" height="14.2" />
		<rect fill="white" x="368.5" y="154.8" transform="matrix(0.7071 -0.7071 0.7071 0.7071 -3.6782 312.6656)" width="14.2" height="11.9" />
		<rect fill="white" x="380.4" y="183.5" width="14.2" height="11.9" />
		<rect fill="white" x="369.6" y="211" transform="matrix(0.7071 -0.7071 0.7071 0.7071 -44.227 329.4581)" width="11.9" height="14.2" />
		<rect fill="white" x="341" y="222.9" width="11.9" height="14.2" />
		<rect fill="white" x="311.1" y="212.2" transform="matrix(0.7071 -0.7071 0.7071 0.7071 -61.018 288.9066)" width="14.2" height="11.9" />
		<rect fill="white" x="299.3" y="183.5" width="14.2" height="11.9" />
		<rect fill="white" x="312.3" y="153.7" transform="matrix(0.7071 -0.7071 0.7071 0.7071 -20.4626 272.1341)" width="11.9" height="14.2" />
		<polygon fill="white" points="372.4,184.3 352,184.3 352,164 340.3,164 340.3,196 372.4,196 	" />
	</g>
</svg>
