<svg xmlns="http://www.w3.org/2000/svg" width="109.448" height="111.303" viewBox="0 0 109.448 111.303">
  <g id="Grupo_2408" data-name="Grupo 2408" transform="translate(1327.871 -103.49)">
    <g id="Grupo_2533" data-name="Grupo 2533" transform="translate(-1327.871 103.49)">
      <path id="Trazado_1885" data-name="Trazado 1885" d="M-1118.331,218.457h18.556V199.9h-18.556Zm3.71-14.84h11.131v3.71h-11.131Zm0,7.42h11.131v3.71h-11.131Z" transform="translate(1160.998 -151.67)"/>
      <path id="Trazado_1886" data-name="Trazado 1886" d="M-1104.128,185.7h3.7v3.711h-3.7Z" transform="translate(1154.216 -144.89)"/>
      <path id="Trazado_1887" data-name="Trazado 1887" d="M-1104.128,242.5h3.7v3.711h-3.7Z" transform="translate(1154.216 -172.01)"/>
      <path id="Trazado_1888" data-name="Trazado 1888" d="M-1075.73,210.551h3.71v3.711h-3.71Z" transform="translate(1140.657 -156.755)"/>
      <path id="Trazado_1889" data-name="Trazado 1889" d="M-1132.533,210.551h3.71v3.711h-3.71Z" transform="translate(1167.779 -156.755)"/>
      <path id="Trazado_1890" data-name="Trazado 1890" d="M-1175.868,189.61h-4.8l4.253-4.254a1.855,1.855,0,0,0-.064-2.623,1.856,1.856,0,0,0-2.559,0l-6.109,6.108-6.107-6.108a1.855,1.855,0,0,0-2.623.064,1.855,1.855,0,0,0,0,2.559l4.253,4.254h-6.653a3.71,3.71,0,0,0-3.711,3.7V213.72a3.711,3.711,0,0,0,3.711,3.711h20.4a3.711,3.711,0,0,0,3.711-3.711V193.313A3.71,3.71,0,0,0-1175.868,189.61Zm0,24.115h-20.4v-3.711h20.4Zm0-7.42h-20.4V193.313h20.4Z" transform="translate(1199.983 -143.229)"/>
      <path id="Trazado_1891" data-name="Trazado 1891" d="M-1114.783,146.652h14.84v3.71h-14.84Z" transform="translate(1159.304 -126.246)"/>
      <path id="Trazado_1892" data-name="Trazado 1892" d="M-1114.783,157.3h14.84v3.711h-14.84Z" transform="translate(1159.304 -131.33)"/>
      <path id="Trazado_1893" data-name="Trazado 1893" d="M-1099.942,121.8h-14.841v11.13h14.84Zm-3.71,7.42h-7.42V125.51h7.42Z" transform="translate(1159.304 -114.379)"/>
      <path id="Trazado_1894" data-name="Trazado 1894" d="M-1128.98,139.137a5.566,5.566,0,0,0,5.565,5.566h24.115a7.421,7.421,0,0,0,7.42-7.421v-16.7h-7.42v-9.275a3.711,3.711,0,0,0-3.709-3.711h-22.26a3.711,3.711,0,0,0-3.71,3.711Zm29.68-14.841h3.71V137.28a3.71,3.71,0,0,1-3.709,3.712h0Zm-25.97-12.985h22.26v29.68h-20.4a1.856,1.856,0,0,1-1.855-1.856Z" transform="translate(1166.082 -107.6)"/>
      <path id="Trazado_1895" data-name="Trazado 1895" d="M-1011.83,217.65h3.711v3.712h-3.711Z" transform="translate(1110.148 -160.144)"/>
      <path id="Trazado_1896" data-name="Trazado 1896" d="M-1026.031,217.65h3.71v3.712h-3.71Z" transform="translate(1116.928 -160.144)"/>
      <path id="Trazado_1897" data-name="Trazado 1897" d="M-1040.231,217.65h3.71v3.712h-3.71Z" transform="translate(1123.708 -160.144)"/>
      <path id="Trazado_1898" data-name="Trazado 1898" d="M-1021.041,215.222v-22.26a3.71,3.71,0,0,0-3.711-3.711h-25.97a3.71,3.71,0,0,0-3.71,3.711v22.261a5.565,5.565,0,0,0,5.564,5.565h22.262a5.565,5.565,0,0,0,5.565-5.565Zm-3.711,0a1.855,1.855,0,0,1-1.854,1.855h-22.261a1.855,1.855,0,0,1-1.854-1.855V200.381h25.97Zm0-18.551h-25.97v-3.711h25.97Z" transform="translate(1130.488 -146.585)"/>
      <path id="Trazado_1899" data-name="Trazado 1899" d="M-1121.882,278.973V290.1h22.26v-11.13a7.42,7.42,0,0,0-4.333-6.726,9.26,9.26,0,0,0-.557-13.084,9.259,9.259,0,0,0-13.083.557,9.259,9.259,0,0,0-.372,12.1c.127.158.285.281.42.428A7.423,7.423,0,0,0-1121.882,278.973Zm7.632-17.315a5.651,5.651,0,0,1,7.958.739,5.651,5.651,0,0,1-.74,7.957,5.651,5.651,0,0,1-7.957-.739,5.651,5.651,0,0,1,.719-7.941Zm-3.921,17.315a3.71,3.71,0,0,1,3.71-3.711h7.42a3.711,3.711,0,0,1,3.71,3.711v7.42h-14.84Z" transform="translate(1162.693 -178.8)"/>
    </g>
  </g>
</svg>
