<?xml version="1.0" encoding="utf-8"?>
<!-- Generator: Adobe Illustrator 25.2.1, SVG Export Plug-In . SVG Version: 6.00 Build 0)  -->
<svg version="1.1" id="Capa_1" xmlns="http://www.w3.org/2000/svg" xmlns:xlink="http://www.w3.org/1999/xlink" x="0px" y="0px" viewBox="0 0 512 512" style="enable-background:new 0 0 512 512;" xml:space="preserve">
	<g>
		<path fill="white" d="M263.5,316.4h33.4v22.3h-33.4V316.4z" />
		<path fill="white" d="M319.2,316.4h33.4v22.3h-33.4V316.4z" />
		<path fill="white" d="M375,316.4h33.4v22.3H375V316.4z" />
		<path fill="white" d="M218.9,204.9v-22.3h111.5V93.4H218.9V71.1h-22.3v22.3v89.2v22.3H152v-44.6h-33.4c-24.6,0-44.6,20-44.6,44.6v200.6
		c0,24.6,20,44.6,44.6,44.6H453V204.9H218.9z M308.1,115.7v44.6h-89.2v-44.6H308.1z M96.3,204.9c0-12.3,10-22.3,22.3-22.3h11.1V361
		c-11.1-0.3-23.7-0.2-33.4,6V204.9z M430.7,427.8H118.6c-29.6-1.2-29.6-43.4,0-44.6H152V227.2h44.6V296
		c-34.9,12.9-26.5,64.3,11.1,65c37.7-0.7,46.1-52.1,11.1-65v-68.8h211.8V427.8z M218.9,327.5c0,6.1-5,11.1-11.1,11.1
		c-14.8-0.6-14.8-21.7,0-22.3C213.9,316.4,218.9,321.4,218.9,327.5z" />
	</g>
</svg>
