<?xml version="1.0" encoding="utf-8"?>
<!-- Generator: Adobe Illustrator 25.2.1, SVG Export Plug-In . SVG Version: 6.00 Build 0)  -->
<svg version="1.1" id="Capa_1" xmlns="http://www.w3.org/2000/svg" xmlns:xlink="http://www.w3.org/1999/xlink" x="0px" y="0px" viewBox="0 0 512 512" style="enable-background:new 0 0 512 512;" xml:space="preserve">
	<g>
		<g>
			<path fill="white" d="M256,192.9c-18.7,0-33.9-15.2-33.9-33.9s15.2-33.9,33.9-33.9s33.9,15.2,33.9,33.9S274.7,192.9,256,192.9z M256,143.9
			c-8.3,0-15.1,6.8-15.1,15.1s6.8,15.1,15.1,15.1s15.1-6.8,15.1-15.1S264.3,143.9,256,143.9z" />
		</g>
		<path fill="white" d="M402.9,375.5h-15.1V336c0-5.2-4.2-9.4-9.4-9.4h-113v-32.2l2.5-0.3c26.1-2.9,50.2-15.3,67.8-34.9
		c14.6-16.3,23.9-36.4,26.7-57.8h-19c-2.9,18.6-11.7,35.7-25.5,49.2l-3.7,3.6l-1-5.1c-5.5-27-29.6-46.6-57.2-46.6
		s-51.7,19.6-57.2,46.6l-1,5.1l-3.7-3.6c-17.1-16.8-26.6-39.2-26.6-63.2c0-48.8,39.7-88.5,88.5-88.5c19.1,0,36.9,6.1,51.4,16.5V93.2
		c-15.3-8.4-32.8-13.1-51.4-13.1c-59.2,0-107.3,48.2-107.3,107.3c0,26.5,9.8,52,27.6,71.7c17.7,19.6,41.8,32,67.8,34.9l2.5,0.3v32.2
		h-113c-5.2,0-9.4,4.2-9.4,9.4v39.6h-15.1c-5.2,0-9.4,4.2-9.4,9.4v49c0,5.2,4.2,9.4,9.4,9.4h49c5.2,0,9.4-4.2,9.4-9.4v-49
		c0-5.2-4.2-9.4-9.4-9.4H143v-30.2h103.6v30.2h-15.1c-5.2,0-9.4,4.2-9.4,9.4v49c0,5.2,4.2,9.4,9.4,9.4h49c5.2,0,9.4-4.2,9.4-9.4v-49
		c0-5.2-4.2-9.4-9.4-9.4h-15.1v-30.2H369v30.2h-15.1c-5.2,0-9.4,4.2-9.4,9.4v49c0,5.2,4.2,9.4,9.4,9.4h49c5.2,0,9.4-4.2,9.4-9.4v-49
		C412.3,379.7,408.1,375.5,402.9,375.5z M148.7,394.3v30.2h-30.2v-30.2H148.7z M271.1,394.3v30.2h-30.2v-30.2H271.1z M256,276
		c-13.3,0-26-2.9-37.9-8.6l-1.6-0.8v-5.8c0-21.8,17.7-39.6,39.6-39.6s39.6,17.7,39.6,39.6v5.8l-1.6,0.8C282,273.1,269.3,276,256,276
		z M393.5,424.5h-30.2v-30.2h30.2V424.5z" />
		<g>
			<path fill="white" d="M335.6,122c0,3.2,2.6,5.7,5.7,5.7h38c3.2,0,5.7-2.6,5.7-5.7s-2.6-5.7-5.7-5.7h-38C338.2,116.3,335.6,118.9,335.6,122z" />
			<path fill="white" d="M379.3,135.2h-38c-3.2,0-5.7,2.6-5.7,5.7s2.6,5.7,5.7,5.7h38c3.2,0,5.7-2.6,5.7-5.7S382.5,135.2,379.3,135.2z" />
			<path fill="white" d="M368.7,154h-27.4c-3.2,0-5.7,2.6-5.7,5.7s2.6,5.7,5.7,5.7h27.4c3.2,0,5.7-2.6,5.7-5.7S371.8,154,368.7,154z" />
			<path fill="white" d="M399.8,68.7h-58.7c-1.6,0-3.1,0.6-4.3,1.8l-22.4,22.4c-1.1,1.1-1.8,2.7-1.8,4.3v90.5c0,3.3,2.7,6,6,6h81.7l0.2,0
			c3-0.4,5.2-3,5.2-6l0-112.9C405.8,71.4,403.1,68.7,399.8,68.7z M324.6,181.6v-78.4h16.5c3.3,0,6-2.7,6-6V80.7h46.7l0,100.9H324.6z
			" />
		</g>
	</g>
</svg>
