<svg xmlns="http://www.w3.org/2000/svg" width="98.02" height="108" viewBox="0 0 98.02 108">
  <g id="zoom" transform="translate(-23.03 -0.417)">
    <g id="Grupo_2428" data-name="Grupo 2428" transform="translate(23.03 -0.015)">
      <g id="Grupo_2427" data-name="Grupo 2427" transform="translate(0)">
        <path id="Trazado_1909" data-name="Trazado 1909" d="M156.751,163.032l-1.482-3.3a19.677,19.677,0,0,0-9.247,8.526L149.186,170A16.112,16.112,0,0,1,156.751,163.032Z" transform="translate(-118.24 -123.646)"/>
        <path id="Trazado_1910" data-name="Trazado 1910" d="M135.028,225.243l3.614-.033a16.38,16.38,0,0,1,.4-3.748l-3.524-.8A19.953,19.953,0,0,0,135.028,225.243Z" transform="translate(-109.729 -170.811)"/>
        <rect id="Rectángulo_11" data-name="Rectángulo 11" width="3" height="79" transform="translate(87 0.432)"/>
        <rect id="Rectángulo_12" data-name="Rectángulo 12" width="4" height="108" transform="translate(0 0.432)"/>
        <path id="Trazado_1911" data-name="Trazado 1911" d="M180.325,184.34l-19.878-19.878a1.807,1.807,0,0,0-2.555,0l-2.337,2.337-3.339-3.339a27.028,27.028,0,1,0-6.144,6.187l3.314,3.321L147.05,175.3a1.807,1.807,0,0,0,0,2.555l19.878,19.878a9.474,9.474,0,0,0,13.4-13.4Zm-55.076-13.722a23.481,23.481,0,0,1-12.975-7.852h.007a23.529,23.529,0,0,1-4.975-10.056,23.918,23.918,0,0,1,0-10.069,23.515,23.515,0,0,1,45.9-.011,23.918,23.918,0,0,1,0,10.069A23.481,23.481,0,0,1,125.249,170.617Zm23.826-3.071,1.059-1.059L153,169.354l-1.059,1.059Zm1.807,9.035,2.337-2.337,3.614-3.614,2.337-2.337,2.866,2.866-8.287,8.287Zm26.887,18.6a5.867,5.867,0,0,1-8.287,0L156.3,182l8.287-8.287L177.77,186.9A5.867,5.867,0,0,1,177.77,195.182Z" transform="translate(-85.08 -93.449)"/>
        <rect id="Rectángulo_13" data-name="Rectángulo 13" width="56" height="4" transform="translate(27 3.432)"/>
        <rect id="Rectángulo_14" data-name="Rectángulo 14" width="74" height="4" transform="translate(9 14.432)"/>
        <rect id="Rectángulo_15" data-name="Rectángulo 15" width="21" height="4" transform="translate(62 25.432)"/>
        <rect id="Rectángulo_16" data-name="Rectángulo 16" width="20" height="4" transform="translate(9 25.432)"/>
        <rect id="Rectángulo_17" data-name="Rectángulo 17" width="11" height="3" transform="translate(72 36.432)"/>
        <rect id="Rectángulo_18" data-name="Rectángulo 18" width="9" height="3" transform="translate(9 36.432)"/>
        <rect id="Rectángulo_19" data-name="Rectángulo 19" width="7" height="4" transform="translate(76 46.432)"/>
        <rect id="Rectángulo_20" data-name="Rectángulo 20" width="5" height="4" transform="translate(9 46.432)"/>
        <rect id="Rectángulo_21" data-name="Rectángulo 21" width="7" height="4" transform="translate(76 57.432)"/>
        <rect id="Rectángulo_22" data-name="Rectángulo 22" width="5" height="4" transform="translate(9 57.432)"/>
        <rect id="Rectángulo_23" data-name="Rectángulo 23" width="4" height="4" transform="translate(79 68.432)"/>
        <rect id="Rectángulo_24" data-name="Rectángulo 24" width="9" height="4" transform="translate(9 68.432)"/>
        <rect id="Rectángulo_25" data-name="Rectángulo 25" width="20" height="4" transform="translate(9 79.432)"/>
        <rect id="Rectángulo_26" data-name="Rectángulo 26" width="34" height="4" transform="translate(29 90.432)"/>
        <rect id="Rectángulo_27" data-name="Rectángulo 27" width="65" height="3" transform="translate(9 101.432)"/>
        <rect id="Rectángulo_28" data-name="Rectángulo 28" width="16" height="4" transform="translate(42 39.432)"/>
        <rect id="Rectángulo_29" data-name="Rectángulo 29" width="26" height="3" transform="translate(32 65.432)"/>
        <rect id="Rectángulo_30" data-name="Rectángulo 30" width="33" height="4" transform="translate(32 52.432)"/>
      </g>
    </g>
  </g>
</svg>
