<svg xmlns="http://www.w3.org/2000/svg" width="95.694" height="122.431" viewBox="0 0 95.694 122.431">
  <g id="upload" transform="translate(-55.907)">
    <path id="Trazado_1902" data-name="Trazado 1902" d="M151.076,28.262,141.917,19.1V5.442A5.448,5.448,0,0,0,136.474,0H61.281a5.38,5.38,0,0,0-5.374,5.374V95.531a5.38,5.38,0,0,0,5.374,5.374h3.04V103.9a5.38,5.38,0,0,0,5.374,5.374H81.353a1.793,1.793,0,0,0,0-3.587H69.7a1.789,1.789,0,0,1-1.787-1.787V31.794a1.793,1.793,0,1,0-3.587,0V97.318h-3.04a1.789,1.789,0,0,1-1.787-1.787V5.374a1.789,1.789,0,0,1,1.787-1.787h75.194a1.857,1.857,0,0,1,1.855,1.855V15.517l-6.623-6.623a1.794,1.794,0,0,0-1.268-.525H69.7a5.38,5.38,0,0,0-5.374,5.374v9.7a1.793,1.793,0,1,0,3.587,0v-9.7A1.789,1.789,0,0,1,69.7,11.956h58.95V29.527a1.793,1.793,0,0,0,1.793,1.793l17.576,0V103.9a1.789,1.789,0,0,1-1.787,1.787H134.708a1.793,1.793,0,1,0,0,3.587h11.519A5.38,5.38,0,0,0,151.6,103.9V29.53a1.794,1.794,0,0,0-.525-1.268Zm-18.844-.528V14.492l13.245,13.244Z"/>
    <path id="Trazado_1903" data-name="Trazado 1903" d="M221.266,175.456h-42.9a1.793,1.793,0,0,0,0,3.587h42.9a1.793,1.793,0,0,0,0-3.587Z" transform="translate(-91.808 -133.5)"/>
    <path id="Trazado_1904" data-name="Trazado 1904" d="M221.266,219.688h-42.9a1.793,1.793,0,0,0,0,3.587h42.9a1.793,1.793,0,0,0,0-3.587Z" transform="translate(-91.808 -167.155)"/>
    <path id="Trazado_1905" data-name="Trazado 1905" d="M330.813,264.8h-8.476a1.793,1.793,0,1,0,0,3.587h8.476a1.793,1.793,0,0,0,0-3.587Z" transform="translate(-201.355 -201.481)"/>
    <path id="Trazado_1906" data-name="Trazado 1906" d="M204.349,268.389a1.793,1.793,0,1,0,0-3.587H178.361a1.793,1.793,0,0,0,0,3.587Z" transform="translate(-91.808 -201.481)"/>
    <path id="Trazado_1907" data-name="Trazado 1907" d="M249.693,375.9l-4.781-4.781v17.338a1.793,1.793,0,1,1-3.587,0V371.123l-4.781,4.781a1.793,1.793,0,0,1-2.536-2.536l7.843-7.842a1.794,1.794,0,0,1,2.536,0l7.843,7.842a1.793,1.793,0,0,1-2.536,2.536Z" transform="translate(-135.113 -277.72)"/>
    <path id="Trazado_1908" data-name="Trazado 1908" d="M202.105,323.61a22.524,22.524,0,1,0,22.525,22.524A22.55,22.55,0,0,0,202.105,323.61Zm0,41.462a18.937,18.937,0,1,1,18.938-18.937A18.959,18.959,0,0,1,202.105,365.072Z" transform="translate(-94.1 -246.227)"/>
  </g>
</svg>
