<?xml version="1.0" encoding="utf-8"?>
<!-- Generator: Adobe Illustrator 25.2.1, SVG Export Plug-In . SVG Version: 6.00 Build 0)  -->
<svg version="1.1" id="Capa_1" xmlns="http://www.w3.org/2000/svg" xmlns:xlink="http://www.w3.org/1999/xlink" x="0px" y="0px" viewBox="0 0 512 512" style="enable-background:new 0 0 512 512;" xml:space="preserve">
	<g>
		<path fill="white" d="M427,207l-22.4-2.5l14-17.6c3.4-4.2,3-10.3-0.8-14.1l-9.3-9.3v-56.7c0-5.8-4.7-10.6-10.6-10.6h-56.8v21.1h46.3v27.4
		c-3-0.7-6.3,0-8.9,2.1l-17.3,13.9l-2.4-22c-0.6-5.4-5.1-9.4-10.5-9.4h-7.3V65.5c0-5.8-4.7-10.6-10.6-10.6H153.8
		c-2.8,0-5.5,1.1-7.5,3.1l-67.5,67.5c-2.1,2.1-3.2,4.9-3.2,7.5v272.1c0,5.8,4.7,10.6,10.6,10.6h57v30.7c0,5.8,4.7,10.6,10.6,10.6
		h244.2c5.8,0,10.6-4.7,10.6-10.6v-63.8v-75.5l9.6-9.7c3.8-3.8,4.1-9.9,0.7-14.1l-13.9-17.3l22-2.4c5.4-0.6,9.4-5.1,9.4-10.5v-35.7
		C436.4,212.1,432.3,207.6,427,207z M96.8,394.6V143.7h57c5.8,0,10.6-4.7,10.6-10.6v-57h155.4v53.2h-7.3c-5.4,0-9.9,4.1-10.5,9.4
		l-2.5,22.4l-17.6-14c-4.2-3.4-10.3-3-14.1,0.8l-25.2,25.3c-3.8,3.8-4.1,9.9-0.7,14.1l13.9,17.3l-22,2.4c-5.4,0.6-9.4,5.1-9.4,10.5
		v35.7c0,5.4,4.1,9.9,9.4,10.5l22.4,2.5l-14,17.6c-3.4,4.2-3,10.3,0.8,14.1l25.3,25.2c3.8,3.8,9.9,4.1,14.1,0.7l17.3-13.9l2.4,22
		c0.6,5.4,5.1,9.4,10.5,9.4h7.3v53.2H96.8z M387.3,382.7v53.2h-223v-20.1h166c5.8,0,10.6-4.7,10.6-10.6v-63.8h7.3
		c5.4,0,9.9-4.1,10.5-9.4l2.5-22.4l17.6,14c2.5,2,5.6,2.7,8.5,2.1V382.7z M415.2,243.8l-22.5,2.5c-4.1,0.5-7.5,3.2-8.9,7.1
		c-0.8,2.4-1.8,4.7-2.9,7c-1.8,3.7-1.3,8.1,1.2,11.3l14.2,17.6l-11.8,11.9l-17.7-14.1c-3.2-2.6-7.6-3-11.3-1.2
		c-2.3,1.2-4.8,2.2-7.2,3c-3.9,1.3-6.7,4.8-7.1,8.9l-2.5,22.5h-16.8l-2.5-22.5c-0.5-4.1-3.2-7.5-7.1-8.9c-2.4-0.8-4.7-1.8-7-2.9
		c-3.7-1.8-8.1-1.3-11.3,1.2l-17.6,14.2l-11.9-11.8l14.1-17.7c2.6-3.2,3-7.6,1.2-11.3c-1.2-2.3-2.2-4.8-3-7.2
		c-1.3-3.9-4.8-6.7-8.9-7.1l-22.5-2.5V227l22.5-2.5c4.1-0.5,7.5-3.2,8.9-7.1c0.8-2.4,1.8-4.7,2.9-7c1.8-3.7,1.3-8.1-1.2-11.3
		l-14.2-17.6l11.8-11.9l17.7,14.1c3.2,2.6,7.6,3,11.3,1.2c2.3-1.2,4.8-2.2,7.2-3c3.9-1.3,6.7-4.8,7.1-8.9l2.5-22.5h16.8l2.5,22.5
		c0.5,4.1,3.2,7.5,7.1,8.9c2.4,0.8,4.7,1.8,7,2.9c3.7,1.8,8.1,1.3,11.3-1.2l17.6-14.2l11.9,11.8l-14.1,17.7c-2.6,3.2-3,7.6-1.2,11.3
		c1.2,2.3,2.2,4.8,3,7.2c1.3,3.9,4.8,6.7,8.9,7.1l22.5,2.5V243.8z" />
		<path fill="white" d="M330.3,202.1c-18.4,0-33.3,14.9-33.3,33.3s14.9,33.3,33.3,33.3c18.4,0,33.3-14.9,33.3-33.3S348.7,202.1,330.3,202.1z
		 M330.3,247.5c-6.7,0-12.2-5.5-12.2-12.2s5.5-12.2,12.2-12.2s12.2,5.5,12.2,12.2S337,247.5,330.3,247.5z" />
		<path fill="white" d="M128.5,186h64.1c5.8,0,10.6-4.7,10.6-10.6c0-5.8-4.7-10.6-10.6-10.6h-64.1c-5.8,0-10.6,4.7-10.6,10.6
		C117.9,181.2,122.6,186,128.5,186z" />
		<path fill="white" d="M128.5,228.2h64.1c5.8,0,10.6-4.7,10.6-10.6s-4.7-10.6-10.6-10.6h-64.1c-5.8,0-10.6,4.7-10.6,10.6S122.6,228.2,128.5,228.2
		z" />
		<path fill="white" d="M128.5,270.5h64.1c5.8,0,10.6-4.7,10.6-10.6s-4.7-10.6-10.6-10.6h-64.1c-5.8,0-10.6,4.7-10.6,10.6S122.6,270.5,128.5,270.5
		z" />
		<path fill="white" d="M128.5,312.8h64.1c5.8,0,10.6-4.7,10.6-10.6s-4.7-10.6-10.6-10.6h-64.1c-5.8,0-10.6,4.7-10.6,10.6S122.6,312.8,128.5,312.8
		z" />
		<path fill="white" d="M227.8,333.9h-99.4c-5.8,0-10.6,4.7-10.6,10.6s4.7,10.6,10.6,10.6h99.4c5.8,0,10.6-4.7,10.6-10.6S233.7,333.9,227.8,333.9z
		" />
	</g>
</svg>
