<?xml version="1.0" encoding="utf-8"?>
<!-- Generator: Adobe Illustrator 25.2.1, SVG Export Plug-In . SVG Version: 6.00 Build 0)  -->
<svg version="1.1" id="VisualizarDocumento" xmlns="http://www.w3.org/2000/svg" xmlns:xlink="http://www.w3.org/1999/xlink"
	 x="0px" y="0px" viewBox="0 0 83.4 109.7" style="enable-background:new 0 0 83.4 109.7;" xml:space="preserve">
<style type="text/css">
	.st0{fill:#FFFFFF;}
</style>
<g>
	<rect x="16" y="38.5" class="st0" width="35.2" height="3.7"/>
	<rect x="16" y="49.9" class="st0" width="35.2" height="3.7"/>
	<rect x="16" y="61.4" class="st0" width="35.2" height="3.7"/>
	<path class="st0" d="M62.1,107.7c-5,0-10-2.1-13.5-5.6c-2-2-3.6-4.5-4.5-7.2l-0.2-0.7H2V24.6L14.5,12h8.3V2h52.4v63.1H65.1v4.3
		l0.8,0.2c3.7,0.7,7.1,2.6,9.8,5.2c7.5,7.5,7.5,19.7,0,27.2c-3.6,3.6-8.5,5.6-13.5,5.6C62.2,107.7,62.1,107.7,62.1,107.7z
		 M62.1,72.9c-4.1,0-8,1.6-10.9,4.5c-2.9,2.9-4.6,6.9-4.5,11c0,4.1,1.6,8.1,4.5,11c2.9,2.9,6.9,4.5,10.9,4.5c4.2,0,8.1-1.7,11-4.5
		c6-6.1,6-15.9,0-21.9C70.2,74.5,66.3,72.9,62.1,72.9L62.1,72.9z M5.7,90.4H43l-0.1-1c0-0.3,0-0.6,0-1c0-5.1,2-10,5.6-13.6
		c3.2-3.2,7.4-5.2,12-5.6l0.9-0.1V15.8H20.7v15h-15V90.4z M65.1,61.4h6.4V5.7h-45V12h38.5V61.4z M4.8,27.1H17V14.8L4.8,27.1z"/>
	<g id="Grupo_2553_2_" transform="translate(50.909 80.838)">
		<g id="Grupo_2552-2_2_" transform="translate(0 0)">
			<path id="Trazado_1899_2_" class="st0" d="M21.3,7.2C21.1,7,16.8,1,11.3,1S1.3,7,1.1,7.2C1,7.4,1,7.7,1.1,7.9
				c0.2,0.3,4.6,6.2,10.1,6.2s9.9-6,10.1-6.2C21.5,7.7,21.5,7.4,21.3,7.2z M11.3,11.8C8.9,11.8,7,9.9,7,7.6c0-2.3,1.9-4.2,4.3-4.2
				c2.3,0,4.2,1.9,4.2,4.2C15.4,9.9,13.6,11.8,11.3,11.8L11.3,11.8z"/>
		</g>
	</g>
	<g id="Grupo_2555_2_" transform="translate(59.283 85.623)">
		<g id="Grupo_2554_2_" transform="translate(0 0)">
			<path id="Trazado_1900_2_" class="st0" d="M2.9,1C1.9,1,1,1.8,1,2.8c0,1,0.9,1.8,1.9,1.8c1,0,1.8-0.8,1.8-1.8
				C4.7,1.8,3.9,1,2.9,1z"/>
		</g>
	</g>
</g>
</svg>
