<svg xmlns="http://www.w3.org/2000/svg" width="244" height="49.775" viewBox="0 0 244 49.775">
  <g id="Grupo_2524" data-name="Grupo 2524" transform="translate(-3 -7.985)">
    <g id="Grupo_2517" data-name="Grupo 2517" transform="translate(3 7.985)">
      <path id="Trazado_1873" data-name="Trazado 1873" d="M28.534,7.988c-2.8-.038-12.729.233-21.3,5.28l-.041.025a9,9,0,0,0-4.137,8.6A56.5,56.5,0,0,0,23.437,55.868a8.246,8.246,0,0,0,5.095,1.891,8.24,8.24,0,0,0,5.092-1.891A56.6,56.6,0,0,0,54.007,21.884a9.007,9.007,0,0,0-4.141-8.594l-.041-.025C41.258,8.22,31.34,7.947,28.534,7.988Zm0,3.389c2.582-.036,11.748.21,19.552,4.8a5.593,5.593,0,0,1,2.557,5.316A53.352,53.352,0,0,1,31.505,53.223a4.855,4.855,0,0,1-2.973,1.145,4.861,4.861,0,0,1-2.975-1.145,53.376,53.376,0,0,1-7.266-7.047l9.143-2.164c5.208-1.231,5.757-7.456,5.757-7.456l-5.727,1.353a7.388,7.388,0,0,1-4.891,4.141l-6.376,1.5a54.548,54.548,0,0,1-3.633-5.513L27.94,34.4a.481.481,0,0,1,.526.637l-.278.976L33,34.875a7.443,7.443,0,0,0,5.061-4.394,11.5,11.5,0,0,0,.965-3.414L28.554,29.55a7,7,0,0,1-4.012,2.614L11.111,35.345a55.284,55.284,0,0,1-2.646-6.163l21.748-5.14a.406.406,0,0,1,.465.5,12.724,12.724,0,0,1-.942,3.023l8.958-2.119a7.931,7.931,0,0,0,5.4-4.681,12.333,12.333,0,0,0,1.032-3.649L7.446,26.019A34.492,34.492,0,0,1,6.423,21.5a5.6,5.6,0,0,1,2.553-5.33C16.784,11.587,25.954,11.343,28.532,11.377Z" transform="translate(-3 -7.985)" fill="#3f3f3f"/>
    </g>
    <g id="Grupo_2523" data-name="Grupo 2523" transform="translate(54.064 17.12)">
      <g id="Grupo_2520" data-name="Grupo 2520">
        <g id="Grupo_2519" data-name="Grupo 2519">
          <g id="Grupo_2518" data-name="Grupo 2518">
            <path id="Trazado_1874" data-name="Trazado 1874" d="M31.761,42.44H25.6L44.776,12.972a2.071,2.071,0,0,1,1.74-.944h7.04L34.933,40.718A3.784,3.784,0,0,1,31.761,42.44Z" transform="translate(-25.602 -12.028)" fill="#3f3f3f"/>
            <path id="Trazado_1875" data-name="Trazado 1875" d="M43.283,42.44h-8.3L51.075,18.013H41.862l3.12-5.07a1.935,1.935,0,0,1,1.645-.915H72.895l-2.989,4.86a2.381,2.381,0,0,1-2.022,1.125h-8.5Z" transform="translate(-13.793 -12.028)" fill="#3f3f3f"/>
            <path id="Trazado_1876" data-name="Trazado 1876" d="M74.137,42.44H66.323l1.688-6.127H57.026l-5.56,5.327a2.88,2.88,0,0,1-1.99.8H41.107L72.829,12.563a1.961,1.961,0,0,1,1.347-.535h8.115ZM69.095,32.185l3.1-11.082L61.323,32.131Z" transform="translate(-6.077 -12.028)" fill="#3f3f3f"/>
            <path id="Trazado_1877" data-name="Trazado 1877" d="M121.322,42.44H113.25l1.688-6.127-10.72-.007-5.811,5.571A2.031,2.031,0,0,1,97,42.44H88.294l31.216-29.4a3.714,3.714,0,0,1,2.544-1.01h7.424Zm-5.456-10.255,3.156-11.116L108.51,32.131Z" transform="translate(53.344 -12.028)" fill="#3f3f3f"/>
            <path id="Trazado_1878" data-name="Trazado 1878" d="M84.271,36.322l-3.1,5.124a2.055,2.055,0,0,1-1.762.994H57.124L76.865,12.028h8.35l-16,24.285Z" transform="translate(14.092 -12.028)" fill="#3f3f3f"/>
            <path id="Trazado_1879" data-name="Trazado 1879" d="M76.06,42.44H68.941L88.165,12.891a1.9,1.9,0,0,1,1.591-.863h7.137l-19.147,29.5A2.008,2.008,0,0,1,76.06,42.44Z" transform="translate(28.973 -12.028)" fill="#3f3f3f"/>
            <path id="Trazado_1880" data-name="Trazado 1880" d="M104.278,42.44H97.514a2.009,2.009,0,0,1-1.984-1.7L93.5,27.556,83.385,42.44H75.127L94.338,12.914a1.95,1.95,0,0,1,1.631-.886h7.2l-9.03,14.5,19.021-14.5h9.717l-20.955,15.95Z" transform="translate(36.763 -12.028)" fill="#3f3f3f"/>
          </g>
        </g>
      </g>
      <g id="Grupo_2522" data-name="Grupo 2522" transform="translate(182.822 20.299)">
        <g id="Grupo_2521" data-name="Grupo 2521">
          <path id="Trazado_1881" data-name="Trazado 1881" d="M111.584,21.013a5.2,5.2,0,0,1,2.494.651,4.75,4.75,0,0,1,1.88,1.864,5.1,5.1,0,0,1,.014,5.065,4.822,4.822,0,0,1-1.868,1.868,5.113,5.113,0,0,1-5.04,0,4.843,4.843,0,0,1-1.871-1.868,5.078,5.078,0,0,1,.016-5.065,4.759,4.759,0,0,1,1.877-1.864A5.206,5.206,0,0,1,111.584,21.013Zm0,.994a4.071,4.071,0,0,0-2,.526,3.764,3.764,0,0,0-1.507,1.5,4.071,4.071,0,0,0-.551,2.04,4.143,4.143,0,0,0,.535,2.031,3.839,3.839,0,0,0,1.507,1.5,4.037,4.037,0,0,0,4.042,0,3.843,3.843,0,0,0,1.5-1.5,4.085,4.085,0,0,0-.011-4.071,3.766,3.766,0,0,0-1.514-1.5A4.088,4.088,0,0,0,111.588,22.007ZM109.3,28.778V23.412H110.4c1.019,0,1.593.007,1.717.014a2.041,2.041,0,0,1,.838.215,1.353,1.353,0,0,1,.506.515,1.554,1.554,0,0,1,.2.768,1.448,1.448,0,0,1-.377,1,1.8,1.8,0,0,1-1.071.513,1.131,1.131,0,0,1,.375.2,2.59,2.59,0,0,1,.364.407c.041.061.174.28.4.66l.633,1.082h-1.349l-.447-.872a3.7,3.7,0,0,0-.752-1.107,1.192,1.192,0,0,0-.748-.226H110.4v2.205Zm1.094-3.043h.436a5.389,5.389,0,0,0,1.175-.077.7.7,0,0,0,.359-.255.681.681,0,0,0,.131-.411.646.646,0,0,0-.129-.4.7.7,0,0,0-.364-.255,5.959,5.959,0,0,0-1.173-.072H110.4Z" transform="translate(-106.523 -21.013)" fill="#3f3f3f"/>
        </g>
      </g>
    </g>
  </g>
</svg>
