info face="Beaufort for LOL Bold" size=16 bold=0 italic=0 charset="" unicode=0 stretchH=100 smooth=1 aa=1 padding=1,1,1,1 spacing=-2,-2
common lineHeight=22 base=17 scaleW=512 scaleH=512 pages=1 packed=0
page id=0 file="lol16.png"
chars count=511
char id=0       x=224  y=51   width=11   height=13   xoffset=-1   yoffset=5    xadvance=8    page=0    chnl=0 
char id=13      x=0    y=0    width=0    height=0    xoffset=-1   yoffset=0    xadvance=0    page=0    chnl=0 
char id=33      x=235  y=51   width=7    height=13   xoffset=-1   yoffset=5    xadvance=5    page=0    chnl=0 
char id=34      x=353  y=142  width=8    height=7    xoffset=0    yoffset=5    xadvance=8    page=0    chnl=0 
char id=35      x=242  y=51   width=11   height=13   xoffset=-1   yoffset=5    xadvance=9    page=0    chnl=0 
char id=36      x=184  y=18   width=9    height=16   xoffset=0    yoffset=4    xadvance=9    page=0    chnl=0 
char id=37      x=253  y=51   width=14   height=13   xoffset=-1   yoffset=5    xadvance=12   page=0    chnl=0 
char id=38      x=267  y=51   width=15   height=13   xoffset=-1   yoffset=5    xadvance=13   page=0    chnl=0 
char id=39      x=361  y=142  width=5    height=7    xoffset=0    yoffset=5    xadvance=4    page=0    chnl=0 
char id=40      x=193  y=18   width=8    height=16   xoffset=-1   yoffset=5    xadvance=5    page=0    chnl=0 
char id=41      x=201  y=18   width=7    height=16   xoffset=-1   yoffset=5    xadvance=5    page=0    chnl=0 
char id=42      x=108  y=131  width=9    height=10   xoffset=-1   yoffset=4    xadvance=7    page=0    chnl=0 
char id=43      x=460  y=118  width=11   height=11   xoffset=0    yoffset=7    xadvance=11   page=0    chnl=0 
char id=44      x=366  y=142  width=6    height=7    xoffset=-1   yoffset=14   xadvance=4    page=0    chnl=0 
char id=45      x=18   y=151  width=7    height=4    xoffset=-1   yoffset=11   xadvance=5    page=0    chnl=0 
char id=46      x=460  y=142  width=6    height=5    xoffset=-1   yoffset=13   xadvance=4    page=0    chnl=0 
char id=47      x=282  y=51   width=10   height=13   xoffset=-1   yoffset=5    xadvance=8    page=0    chnl=0 
char id=48      x=292  y=51   width=11   height=13   xoffset=-1   yoffset=5    xadvance=9    page=0    chnl=0 
char id=49      x=303  y=51   width=8    height=13   xoffset=0    yoffset=5    xadvance=9    page=0    chnl=0 
char id=50      x=311  y=51   width=11   height=13   xoffset=-1   yoffset=5    xadvance=9    page=0    chnl=0 
char id=51      x=322  y=51   width=11   height=13   xoffset=-1   yoffset=5    xadvance=9    page=0    chnl=0 
char id=52      x=333  y=51   width=11   height=13   xoffset=-1   yoffset=5    xadvance=9    page=0    chnl=0 
char id=53      x=344  y=51   width=11   height=13   xoffset=-1   yoffset=5    xadvance=9    page=0    chnl=0 
char id=54      x=355  y=51   width=11   height=13   xoffset=-1   yoffset=5    xadvance=9    page=0    chnl=0 
char id=55      x=366  y=51   width=11   height=13   xoffset=-1   yoffset=5    xadvance=9    page=0    chnl=0 
char id=56      x=377  y=51   width=11   height=13   xoffset=-1   yoffset=5    xadvance=9    page=0    chnl=0 
char id=57      x=388  y=51   width=11   height=13   xoffset=-1   yoffset=5    xadvance=9    page=0    chnl=0 
char id=58      x=188  y=131  width=6    height=9    xoffset=-1   yoffset=9    xadvance=4    page=0    chnl=0 
char id=59      x=505  y=35   width=6    height=12   xoffset=-1   yoffset=9    xadvance=4    page=0    chnl=0 
char id=60      x=399  y=51   width=11   height=13   xoffset=0    yoffset=6    xadvance=11   page=0    chnl=0 
char id=61      x=426  y=142  width=11   height=6    xoffset=0    yoffset=9    xadvance=11   page=0    chnl=0 
char id=62      x=410  y=51   width=11   height=13   xoffset=0    yoffset=6    xadvance=11   page=0    chnl=0 
char id=63      x=421  y=51   width=9    height=13   xoffset=0    yoffset=5    xadvance=7    page=0    chnl=0 
char id=64      x=390  y=35   width=16   height=15   xoffset=-1   yoffset=6    xadvance=15   page=0    chnl=0 
char id=65      x=430  y=51   width=14   height=13   xoffset=-1   yoffset=5    xadvance=12   page=0    chnl=0 
char id=66      x=444  y=51   width=12   height=13   xoffset=-1   yoffset=5    xadvance=10   page=0    chnl=0 
char id=67      x=456  y=51   width=12   height=13   xoffset=-1   yoffset=5    xadvance=10   page=0    chnl=0 
char id=68      x=468  y=51   width=13   height=13   xoffset=-1   yoffset=5    xadvance=12   page=0    chnl=0 
char id=69      x=481  y=51   width=11   height=13   xoffset=-1   yoffset=5    xadvance=9    page=0    chnl=0 
char id=70      x=492  y=51   width=10   height=13   xoffset=-1   yoffset=5    xadvance=8    page=0    chnl=0 
char id=71      x=0    y=66   width=13   height=13   xoffset=-1   yoffset=5    xadvance=11   page=0    chnl=0 
char id=72      x=13   y=66   width=14   height=13   xoffset=-1   yoffset=5    xadvance=12   page=0    chnl=0 
char id=73      x=502  y=51   width=7    height=13   xoffset=-1   yoffset=5    xadvance=5    page=0    chnl=0 
char id=74      x=48   y=51   width=8    height=14   xoffset=-2   yoffset=5    xadvance=5    page=0    chnl=0 
char id=75      x=27   y=66   width=14   height=13   xoffset=-1   yoffset=5    xadvance=11   page=0    chnl=0 
char id=76      x=41   y=66   width=11   height=13   xoffset=-1   yoffset=5    xadvance=9    page=0    chnl=0 
char id=77      x=52   y=66   width=16   height=13   xoffset=-1   yoffset=5    xadvance=14   page=0    chnl=0 
char id=78      x=68   y=66   width=14   height=13   xoffset=-1   yoffset=5    xadvance=12   page=0    chnl=0 
char id=79      x=82   y=66   width=14   height=13   xoffset=-1   yoffset=5    xadvance=12   page=0    chnl=0 
char id=80      x=96   y=66   width=11   height=13   xoffset=-1   yoffset=5    xadvance=9    page=0    chnl=0 
char id=81      x=406  y=35   width=15   height=15   xoffset=-1   yoffset=5    xadvance=12   page=0    chnl=0 
char id=82      x=107  y=66   width=12   height=13   xoffset=-1   yoffset=5    xadvance=10   page=0    chnl=0 
char id=83      x=119  y=66   width=10   height=13   xoffset=-1   yoffset=5    xadvance=9    page=0    chnl=0 
char id=84      x=129  y=66   width=12   height=13   xoffset=-1   yoffset=5    xadvance=10   page=0    chnl=0 
char id=85      x=141  y=66   width=13   height=13   xoffset=-1   yoffset=5    xadvance=11   page=0    chnl=0 
char id=86      x=154  y=66   width=14   height=13   xoffset=-1   yoffset=5    xadvance=12   page=0    chnl=0 
char id=87      x=168  y=66   width=19   height=13   xoffset=-1   yoffset=5    xadvance=17   page=0    chnl=0 
char id=88      x=187  y=66   width=14   height=13   xoffset=-1   yoffset=5    xadvance=11   page=0    chnl=0 
char id=89      x=201  y=66   width=13   height=13   xoffset=-1   yoffset=5    xadvance=11   page=0    chnl=0 
char id=90      x=214  y=66   width=12   height=13   xoffset=-1   yoffset=5    xadvance=10   page=0    chnl=0 
char id=91      x=208  y=18   width=7    height=16   xoffset=-1   yoffset=5    xadvance=5    page=0    chnl=0 
char id=92      x=226  y=66   width=10   height=13   xoffset=-1   yoffset=5    xadvance=8    page=0    chnl=0 
char id=93      x=215  y=18   width=6    height=16   xoffset=-1   yoffset=5    xadvance=5    page=0    chnl=0 
char id=94      x=117  y=131  width=11   height=10   xoffset=0    yoffset=5    xadvance=11   page=0    chnl=0 
char id=95      x=33   y=151  width=11   height=3    xoffset=-1   yoffset=17   xadvance=9    page=0    chnl=0 
char id=96      x=466  y=142  width=7    height=5    xoffset=0    yoffset=5    xadvance=8    page=0    chnl=0 
char id=97      x=194  y=131  width=11   height=9    xoffset=-1   yoffset=9    xadvance=8    page=0    chnl=0 
char id=98      x=236  y=66   width=12   height=13   xoffset=-2   yoffset=5    xadvance=9    page=0    chnl=0 
char id=99      x=205  y=131  width=10   height=9    xoffset=-1   yoffset=9    xadvance=7    page=0    chnl=0 
char id=100     x=56   y=51   width=11   height=14   xoffset=-1   yoffset=5    xadvance=9    page=0    chnl=0 
char id=101     x=215  y=131  width=10   height=9    xoffset=-1   yoffset=9    xadvance=8    page=0    chnl=0 
char id=102     x=248  y=66   width=8    height=13   xoffset=-1   yoffset=5    xadvance=6    page=0    chnl=0 
char id=103     x=159  y=118  width=10   height=12   xoffset=-1   yoffset=9    xadvance=8    page=0    chnl=0 
char id=104     x=256  y=66   width=12   height=13   xoffset=-2   yoffset=5    xadvance=9    page=0    chnl=0 
char id=105     x=268  y=66   width=7    height=13   xoffset=-2   yoffset=5    xadvance=4    page=0    chnl=0 
char id=106     x=221  y=18   width=9    height=16   xoffset=-3   yoffset=5    xadvance=4    page=0    chnl=0 
char id=107     x=275  y=66   width=13   height=13   xoffset=-2   yoffset=5    xadvance=9    page=0    chnl=0 
char id=108     x=288  y=66   width=7    height=13   xoffset=-2   yoffset=5    xadvance=4    page=0    chnl=0 
char id=109     x=128  y=131  width=15   height=10   xoffset=-1   yoffset=8    xadvance=13   page=0    chnl=0 
char id=110     x=143  y=131  width=11   height=10   xoffset=-1   yoffset=8    xadvance=9    page=0    chnl=0 
char id=111     x=225  y=131  width=11   height=9    xoffset=-1   yoffset=9    xadvance=9    page=0    chnl=0 
char id=112     x=295  y=66   width=12   height=13   xoffset=-2   yoffset=8    xadvance=9    page=0    chnl=0 
char id=113     x=169  y=118  width=11   height=12   xoffset=-1   yoffset=9    xadvance=9    page=0    chnl=0 
char id=114     x=236  y=131  width=8    height=9    xoffset=-1   yoffset=9    xadvance=6    page=0    chnl=0 
char id=115     x=244  y=131  width=9    height=9    xoffset=-1   yoffset=9    xadvance=6    page=0    chnl=0 
char id=116     x=471  y=118  width=9    height=11   xoffset=-2   yoffset=7    xadvance=6    page=0    chnl=0 
char id=117     x=154  y=131  width=11   height=10   xoffset=-1   yoffset=9    xadvance=9    page=0    chnl=0 
char id=118     x=253  y=131  width=12   height=9    xoffset=-2   yoffset=9    xadvance=9    page=0    chnl=0 
char id=119     x=265  y=131  width=16   height=9    xoffset=-2   yoffset=9    xadvance=13   page=0    chnl=0 
char id=120     x=281  y=131  width=11   height=9    xoffset=-1   yoffset=9    xadvance=8    page=0    chnl=0 
char id=121     x=180  y=118  width=12   height=12   xoffset=-2   yoffset=9    xadvance=9    page=0    chnl=0 
char id=122     x=292  y=131  width=10   height=9    xoffset=-1   yoffset=9    xadvance=8    page=0    chnl=0 
char id=123     x=230  y=18   width=9    height=16   xoffset=-1   yoffset=5    xadvance=6    page=0    chnl=0 
char id=124     x=0    y=0    width=4    height=18   xoffset=0    yoffset=4    xadvance=4    page=0    chnl=0 
char id=125     x=239  y=18   width=9    height=16   xoffset=-2   yoffset=5    xadvance=6    page=0    chnl=0 
char id=126     x=437  y=142  width=12   height=6    xoffset=0    yoffset=10   xadvance=11   page=0    chnl=0 
char id=160     x=0    y=0    width=0    height=0    xoffset=-1   yoffset=0    xadvance=3    page=0    chnl=0 
char id=161     x=307  y=66   width=7    height=13   xoffset=-1   yoffset=8    xadvance=5    page=0    chnl=0 
char id=162     x=314  y=66   width=9    height=13   xoffset=0    yoffset=5    xadvance=9    page=0    chnl=0 
char id=163     x=323  y=66   width=11   height=13   xoffset=-1   yoffset=5    xadvance=9    page=0    chnl=0 
char id=164     x=265  y=142  width=9    height=8    xoffset=0    yoffset=7    xadvance=9    page=0    chnl=0 
char id=165     x=334  y=66   width=12   height=13   xoffset=-2   yoffset=5    xadvance=9    page=0    chnl=0 
char id=166     x=248  y=18   width=4    height=16   xoffset=0    yoffset=5    xadvance=4    page=0    chnl=0 
char id=167     x=252  y=18   width=11   height=16   xoffset=-1   yoffset=5    xadvance=10   page=0    chnl=0 
char id=168     x=25   y=151  width=8    height=4    xoffset=0    yoffset=5    xadvance=8    page=0    chnl=0 
char id=169     x=346  y=66   width=14   height=13   xoffset=-1   yoffset=5    xadvance=12   page=0    chnl=0 
char id=170     x=274  y=142  width=8    height=8    xoffset=-1   yoffset=5    xadvance=6    page=0    chnl=0 
char id=171     x=282  y=142  width=9    height=8    xoffset=-1   yoffset=9    xadvance=7    page=0    chnl=0 
char id=172     x=449  y=142  width=11   height=6    xoffset=0    yoffset=9    xadvance=11   page=0    chnl=0 
char id=173     x=0    y=0    width=0    height=0    xoffset=-1   yoffset=0    xadvance=3    page=0    chnl=0 
char id=174     x=360  y=66   width=14   height=13   xoffset=-1   yoffset=5    xadvance=12   page=0    chnl=0 
char id=175     x=44   y=151  width=8    height=3    xoffset=0    yoffset=6    xadvance=8    page=0    chnl=0 
char id=176     x=372  y=142  width=8    height=7    xoffset=-1   yoffset=5    xadvance=6    page=0    chnl=0 
char id=177     x=192  y=118  width=11   height=12   xoffset=0    yoffset=6    xadvance=11   page=0    chnl=0 
char id=178     x=291  y=142  width=8    height=8    xoffset=-1   yoffset=5    xadvance=6    page=0    chnl=0 
char id=179     x=299  y=142  width=8    height=8    xoffset=-1   yoffset=5    xadvance=6    page=0    chnl=0 
char id=180     x=473  y=142  width=6    height=5    xoffset=2    yoffset=5    xadvance=8    page=0    chnl=0 
char id=181     x=203  y=118  width=11   height=12   xoffset=-1   yoffset=9    xadvance=9    page=0    chnl=0 
char id=182     x=263  y=18   width=12   height=16   xoffset=-1   yoffset=5    xadvance=11   page=0    chnl=0 
char id=183     x=479  y=142  width=6    height=5    xoffset=-1   yoffset=11   xadvance=4    page=0    chnl=0 
char id=184     x=485  y=142  width=6    height=5    xoffset=1    yoffset=16   xadvance=8    page=0    chnl=0 
char id=185     x=307  y=142  width=7    height=8    xoffset=-1   yoffset=5    xadvance=5    page=0    chnl=0 
char id=186     x=314  y=142  width=8    height=8    xoffset=-1   yoffset=5    xadvance=6    page=0    chnl=0 
char id=187     x=322  y=142  width=9    height=8    xoffset=-1   yoffset=9    xadvance=7    page=0    chnl=0 
char id=188     x=374  y=66   width=14   height=13   xoffset=-1   yoffset=5    xadvance=13   page=0    chnl=0 
char id=189     x=388  y=66   width=15   height=13   xoffset=-1   yoffset=5    xadvance=13   page=0    chnl=0 
char id=190     x=403  y=66   width=15   height=13   xoffset=-1   yoffset=5    xadvance=14   page=0    chnl=0 
char id=191     x=418  y=66   width=9    height=13   xoffset=-1   yoffset=8    xadvance=7    page=0    chnl=0 
char id=192     x=13   y=0    width=14   height=17   xoffset=-1   yoffset=1    xadvance=12   page=0    chnl=0 
char id=193     x=27   y=0    width=14   height=17   xoffset=-1   yoffset=1    xadvance=12   page=0    chnl=0 
char id=194     x=41   y=0    width=14   height=17   xoffset=-1   yoffset=1    xadvance=12   page=0    chnl=0 
char id=195     x=55   y=0    width=14   height=17   xoffset=-1   yoffset=1    xadvance=12   page=0    chnl=0 
char id=196     x=275  y=18   width=14   height=16   xoffset=-1   yoffset=2    xadvance=12   page=0    chnl=0 
char id=197     x=69   y=0    width=14   height=17   xoffset=-1   yoffset=1    xadvance=12   page=0    chnl=0 
char id=198     x=427  y=66   width=18   height=13   xoffset=-1   yoffset=5    xadvance=16   page=0    chnl=0 
char id=199     x=83   y=0    width=12   height=17   xoffset=-1   yoffset=5    xadvance=10   page=0    chnl=0 
char id=200     x=95   y=0    width=11   height=17   xoffset=-1   yoffset=1    xadvance=9    page=0    chnl=0 
char id=201     x=106  y=0    width=11   height=17   xoffset=-1   yoffset=1    xadvance=9    page=0    chnl=0 
char id=202     x=117  y=0    width=11   height=17   xoffset=-1   yoffset=1    xadvance=9    page=0    chnl=0 
char id=203     x=289  y=18   width=11   height=16   xoffset=-1   yoffset=2    xadvance=9    page=0    chnl=0 
char id=204     x=128  y=0    width=7    height=17   xoffset=-1   yoffset=1    xadvance=5    page=0    chnl=0 
char id=205     x=135  y=0    width=8    height=17   xoffset=-1   yoffset=1    xadvance=5    page=0    chnl=0 
char id=206     x=143  y=0    width=8    height=17   xoffset=-1   yoffset=1    xadvance=5    page=0    chnl=0 
char id=207     x=300  y=18   width=9    height=16   xoffset=-2   yoffset=2    xadvance=5    page=0    chnl=0 
char id=208     x=445  y=66   width=13   height=13   xoffset=-1   yoffset=5    xadvance=12   page=0    chnl=0 
char id=209     x=151  y=0    width=14   height=17   xoffset=-1   yoffset=1    xadvance=12   page=0    chnl=0 
char id=210     x=165  y=0    width=14   height=17   xoffset=-1   yoffset=1    xadvance=12   page=0    chnl=0 
char id=211     x=179  y=0    width=14   height=17   xoffset=-1   yoffset=1    xadvance=12   page=0    chnl=0 
char id=212     x=193  y=0    width=14   height=17   xoffset=-1   yoffset=1    xadvance=12   page=0    chnl=0 
char id=213     x=207  y=0    width=14   height=17   xoffset=-1   yoffset=1    xadvance=12   page=0    chnl=0 
char id=214     x=309  y=18   width=14   height=16   xoffset=-1   yoffset=2    xadvance=12   page=0    chnl=0 
char id=215     x=480  y=118  width=12   height=11   xoffset=0    yoffset=7    xadvance=11   page=0    chnl=0 
char id=216     x=458  y=66   width=14   height=13   xoffset=-1   yoffset=5    xadvance=12   page=0    chnl=0 
char id=217     x=221  y=0    width=13   height=17   xoffset=-1   yoffset=1    xadvance=11   page=0    chnl=0 
char id=218     x=234  y=0    width=13   height=17   xoffset=-1   yoffset=1    xadvance=11   page=0    chnl=0 
char id=219     x=247  y=0    width=13   height=17   xoffset=-1   yoffset=1    xadvance=11   page=0    chnl=0 
char id=220     x=323  y=18   width=13   height=16   xoffset=-1   yoffset=2    xadvance=11   page=0    chnl=0 
char id=221     x=260  y=0    width=13   height=17   xoffset=-1   yoffset=1    xadvance=11   page=0    chnl=0 
char id=222     x=472  y=66   width=12   height=13   xoffset=-1   yoffset=5    xadvance=10   page=0    chnl=0 
char id=223     x=484  y=66   width=12   height=13   xoffset=-1   yoffset=5    xadvance=10   page=0    chnl=0 
char id=224     x=496  y=66   width=11   height=13   xoffset=-1   yoffset=5    xadvance=8    page=0    chnl=0 
char id=225     x=0    y=79   width=11   height=13   xoffset=-1   yoffset=5    xadvance=8    page=0    chnl=0 
char id=226     x=11   y=79   width=11   height=13   xoffset=-1   yoffset=5    xadvance=8    page=0    chnl=0 
char id=227     x=22   y=79   width=11   height=13   xoffset=-1   yoffset=5    xadvance=8    page=0    chnl=0 
char id=228     x=214  y=118  width=11   height=12   xoffset=-1   yoffset=6    xadvance=8    page=0    chnl=0 
char id=229     x=33   y=79   width=11   height=13   xoffset=-1   yoffset=5    xadvance=8    page=0    chnl=0 
char id=230     x=302  y=131  width=14   height=9    xoffset=-1   yoffset=9    xadvance=12   page=0    chnl=0 
char id=231     x=225  y=118  width=10   height=12   xoffset=-1   yoffset=9    xadvance=7    page=0    chnl=0 
char id=232     x=44   y=79   width=10   height=13   xoffset=-1   yoffset=5    xadvance=8    page=0    chnl=0 
char id=233     x=54   y=79   width=10   height=13   xoffset=-1   yoffset=5    xadvance=8    page=0    chnl=0 
char id=234     x=64   y=79   width=10   height=13   xoffset=-1   yoffset=5    xadvance=8    page=0    chnl=0 
char id=235     x=235  y=118  width=10   height=12   xoffset=-1   yoffset=6    xadvance=8    page=0    chnl=0 
char id=236     x=74   y=79   width=7    height=13   xoffset=-1   yoffset=5    xadvance=4    page=0    chnl=0 
char id=237     x=81   y=79   width=7    height=13   xoffset=-1   yoffset=5    xadvance=4    page=0    chnl=0 
char id=238     x=88   y=79   width=8    height=13   xoffset=-2   yoffset=5    xadvance=4    page=0    chnl=0 
char id=239     x=245  y=118  width=8    height=12   xoffset=-2   yoffset=6    xadvance=4    page=0    chnl=0 
char id=240     x=96   y=79   width=10   height=13   xoffset=-1   yoffset=5    xadvance=8    page=0    chnl=0 
char id=241     x=106  y=79   width=11   height=13   xoffset=-1   yoffset=5    xadvance=9    page=0    chnl=0 
char id=242     x=117  y=79   width=11   height=13   xoffset=-1   yoffset=5    xadvance=9    page=0    chnl=0 
char id=243     x=128  y=79   width=11   height=13   xoffset=-1   yoffset=5    xadvance=9    page=0    chnl=0 
char id=244     x=139  y=79   width=11   height=13   xoffset=-1   yoffset=5    xadvance=9    page=0    chnl=0 
char id=245     x=150  y=79   width=11   height=13   xoffset=-1   yoffset=5    xadvance=9    page=0    chnl=0 
char id=246     x=253  y=118  width=11   height=12   xoffset=-1   yoffset=6    xadvance=9    page=0    chnl=0 
char id=247     x=492  y=118  width=11   height=11   xoffset=0    yoffset=7    xadvance=11   page=0    chnl=0 
char id=248     x=0    y=131  width=11   height=11   xoffset=-1   yoffset=8    xadvance=9    page=0    chnl=0 
char id=249     x=67   y=51   width=11   height=14   xoffset=-1   yoffset=5    xadvance=9    page=0    chnl=0 
char id=250     x=78   y=51   width=11   height=14   xoffset=-1   yoffset=5    xadvance=9    page=0    chnl=0 
char id=251     x=89   y=51   width=11   height=14   xoffset=-1   yoffset=5    xadvance=9    page=0    chnl=0 
char id=252     x=161  y=79   width=11   height=13   xoffset=-1   yoffset=6    xadvance=9    page=0    chnl=0 
char id=253     x=336  y=18   width=12   height=16   xoffset=-2   yoffset=5    xadvance=9    page=0    chnl=0 
char id=254     x=348  y=18   width=12   height=16   xoffset=-2   yoffset=5    xadvance=9    page=0    chnl=0 
char id=255     x=421  y=35   width=12   height=15   xoffset=-2   yoffset=6    xadvance=9    page=0    chnl=0 
char id=256     x=433  y=35   width=14   height=15   xoffset=-1   yoffset=3    xadvance=12   page=0    chnl=0 
char id=257     x=11   y=131  width=11   height=11   xoffset=-1   yoffset=7    xadvance=8    page=0    chnl=0 
char id=258     x=273  y=0    width=14   height=17   xoffset=-1   yoffset=1    xadvance=12   page=0    chnl=0 
char id=259     x=172  y=79   width=11   height=13   xoffset=-1   yoffset=5    xadvance=8    page=0    chnl=0 
char id=260     x=360  y=18   width=14   height=16   xoffset=-1   yoffset=5    xadvance=12   page=0    chnl=0 
char id=261     x=264  y=118  width=11   height=12   xoffset=-1   yoffset=9    xadvance=8    page=0    chnl=0 
char id=262     x=287  y=0    width=12   height=17   xoffset=-1   yoffset=1    xadvance=10   page=0    chnl=0 
char id=263     x=183  y=79   width=10   height=13   xoffset=-1   yoffset=5    xadvance=7    page=0    chnl=0 
char id=264     x=299  y=0    width=12   height=17   xoffset=-1   yoffset=1    xadvance=10   page=0    chnl=0 
char id=265     x=193  y=79   width=10   height=13   xoffset=-1   yoffset=5    xadvance=7    page=0    chnl=0 
char id=266     x=374  y=18   width=12   height=16   xoffset=-1   yoffset=2    xadvance=10   page=0    chnl=0 
char id=267     x=275  y=118  width=10   height=12   xoffset=-1   yoffset=6    xadvance=7    page=0    chnl=0 
char id=268     x=311  y=0    width=12   height=17   xoffset=-1   yoffset=1    xadvance=10   page=0    chnl=0 
char id=269     x=203  y=79   width=10   height=13   xoffset=-1   yoffset=5    xadvance=7    page=0    chnl=0 
char id=270     x=323  y=0    width=13   height=17   xoffset=-1   yoffset=1    xadvance=12   page=0    chnl=0 
char id=271     x=100  y=51   width=14   height=14   xoffset=-1   yoffset=5    xadvance=9    page=0    chnl=0 
char id=272     x=213  y=79   width=13   height=13   xoffset=-1   yoffset=5    xadvance=12   page=0    chnl=0 
char id=273     x=114  y=51   width=11   height=14   xoffset=-1   yoffset=5    xadvance=9    page=0    chnl=0 
char id=274     x=447  y=35   width=11   height=15   xoffset=-1   yoffset=3    xadvance=9    page=0    chnl=0 
char id=275     x=22   y=131  width=10   height=11   xoffset=-1   yoffset=7    xadvance=8    page=0    chnl=0 
char id=276     x=336  y=0    width=11   height=17   xoffset=-1   yoffset=1    xadvance=9    page=0    chnl=0 
char id=277     x=226  y=79   width=10   height=13   xoffset=-1   yoffset=5    xadvance=8    page=0    chnl=0 
char id=278     x=386  y=18   width=11   height=16   xoffset=-1   yoffset=2    xadvance=9    page=0    chnl=0 
char id=279     x=285  y=118  width=10   height=12   xoffset=-1   yoffset=6    xadvance=8    page=0    chnl=0 
char id=280     x=397  y=18   width=11   height=16   xoffset=-1   yoffset=5    xadvance=9    page=0    chnl=0 
char id=281     x=295  y=118  width=10   height=12   xoffset=-1   yoffset=9    xadvance=8    page=0    chnl=0 
char id=282     x=347  y=0    width=11   height=17   xoffset=-1   yoffset=1    xadvance=9    page=0    chnl=0 
char id=283     x=236  y=79   width=10   height=13   xoffset=-1   yoffset=5    xadvance=8    page=0    chnl=0 
char id=284     x=358  y=0    width=13   height=17   xoffset=-1   yoffset=1    xadvance=11   page=0    chnl=0 
char id=285     x=408  y=18   width=10   height=16   xoffset=-1   yoffset=5    xadvance=8    page=0    chnl=0 
char id=286     x=371  y=0    width=13   height=17   xoffset=-1   yoffset=1    xadvance=11   page=0    chnl=0 
char id=287     x=418  y=18   width=10   height=16   xoffset=-1   yoffset=5    xadvance=8    page=0    chnl=0 
char id=288     x=428  y=18   width=13   height=16   xoffset=-1   yoffset=2    xadvance=11   page=0    chnl=0 
char id=289     x=458  y=35   width=10   height=15   xoffset=-1   yoffset=6    xadvance=8    page=0    chnl=0 
char id=290     x=441  y=18   width=13   height=16   xoffset=-1   yoffset=5    xadvance=11   page=0    chnl=0 
char id=291     x=454  y=18   width=10   height=16   xoffset=-1   yoffset=5    xadvance=8    page=0    chnl=0 
char id=292     x=384  y=0    width=14   height=17   xoffset=-1   yoffset=1    xadvance=12   page=0    chnl=0 
char id=293     x=398  y=0    width=12   height=17   xoffset=-2   yoffset=1    xadvance=9    page=0    chnl=0 
char id=294     x=246  y=79   width=14   height=13   xoffset=-1   yoffset=5    xadvance=12   page=0    chnl=0 
char id=295     x=260  y=79   width=11   height=13   xoffset=-1   yoffset=5    xadvance=9    page=0    chnl=0 
char id=296     x=410  y=0    width=8    height=17   xoffset=-1   yoffset=1    xadvance=5    page=0    chnl=0 
char id=297     x=271  y=79   width=8    height=13   xoffset=-2   yoffset=5    xadvance=4    page=0    chnl=0 
char id=298     x=468  y=35   width=9    height=15   xoffset=-2   yoffset=3    xadvance=5    page=0    chnl=0 
char id=299     x=503  y=118  width=8    height=11   xoffset=-2   yoffset=7    xadvance=4    page=0    chnl=0 
char id=300     x=418  y=0    width=7    height=17   xoffset=-1   yoffset=1    xadvance=5    page=0    chnl=0 
char id=301     x=279  y=79   width=7    height=13   xoffset=-1   yoffset=5    xadvance=4    page=0    chnl=0 
char id=302     x=464  y=18   width=7    height=16   xoffset=-1   yoffset=5    xadvance=5    page=0    chnl=0 
char id=303     x=471  y=18   width=6    height=16   xoffset=-1   yoffset=5    xadvance=4    page=0    chnl=0 
char id=304     x=477  y=18   width=7    height=16   xoffset=-1   yoffset=2    xadvance=5    page=0    chnl=0 
char id=305     x=316  y=131  width=7    height=9    xoffset=-1   yoffset=9    xadvance=4    page=0    chnl=0 
char id=306     x=125  y=51   width=12   height=14   xoffset=-1   yoffset=5    xadvance=10   page=0    chnl=0 
char id=307     x=484  y=18   width=11   height=16   xoffset=-2   yoffset=5    xadvance=9    page=0    chnl=0 
char id=308     x=4    y=0    width=9    height=18   xoffset=-2   yoffset=1    xadvance=5    page=0    chnl=0 
char id=309     x=425  y=0    width=10   height=17   xoffset=-3   yoffset=4    xadvance=4    page=0    chnl=0 
char id=310     x=495  y=18   width=14   height=16   xoffset=-1   yoffset=5    xadvance=11   page=0    chnl=0 
char id=311     x=0    y=35   width=13   height=16   xoffset=-2   yoffset=5    xadvance=9    page=0    chnl=0 
char id=312     x=323  y=131  width=12   height=9    xoffset=-1   yoffset=9    xadvance=9    page=0    chnl=0 
char id=313     x=435  y=0    width=11   height=17   xoffset=-1   yoffset=1    xadvance=9    page=0    chnl=0 
char id=314     x=446  y=0    width=8    height=17   xoffset=-2   yoffset=1    xadvance=4    page=0    chnl=0 
char id=315     x=13   y=35   width=11   height=16   xoffset=-1   yoffset=5    xadvance=9    page=0    chnl=0 
char id=316     x=24   y=35   width=7    height=16   xoffset=-2   yoffset=5    xadvance=4    page=0    chnl=0 
char id=317     x=286  y=79   width=11   height=13   xoffset=-1   yoffset=5    xadvance=9    page=0    chnl=0 
char id=318     x=297  y=79   width=12   height=13   xoffset=-2   yoffset=5    xadvance=4    page=0    chnl=0 
char id=319     x=309  y=79   width=11   height=13   xoffset=-1   yoffset=5    xadvance=9    page=0    chnl=0 
char id=320     x=320  y=79   width=11   height=13   xoffset=-2   yoffset=5    xadvance=8    page=0    chnl=0 
char id=321     x=331  y=79   width=11   height=13   xoffset=-1   yoffset=5    xadvance=9    page=0    chnl=0 
char id=322     x=342  y=79   width=8    height=13   xoffset=-2   yoffset=5    xadvance=4    page=0    chnl=0 
char id=323     x=454  y=0    width=14   height=17   xoffset=-1   yoffset=1    xadvance=12   page=0    chnl=0 
char id=324     x=350  y=79   width=11   height=13   xoffset=-1   yoffset=5    xadvance=9    page=0    chnl=0 
char id=325     x=31   y=35   width=14   height=16   xoffset=-1   yoffset=5    xadvance=12   page=0    chnl=0 
char id=326     x=361  y=79   width=11   height=13   xoffset=-1   yoffset=8    xadvance=9    page=0    chnl=0 
char id=327     x=468  y=0    width=14   height=17   xoffset=-1   yoffset=1    xadvance=12   page=0    chnl=0 
char id=328     x=372  y=79   width=11   height=13   xoffset=-1   yoffset=5    xadvance=9    page=0    chnl=0 
char id=329     x=383  y=79   width=11   height=13   xoffset=-1   yoffset=5    xadvance=9    page=0    chnl=0 
char id=330     x=477  y=35   width=14   height=15   xoffset=-1   yoffset=5    xadvance=12   page=0    chnl=0 
char id=331     x=394  y=79   width=10   height=13   xoffset=-1   yoffset=8    xadvance=9    page=0    chnl=0 
char id=332     x=491  y=35   width=14   height=15   xoffset=-1   yoffset=3    xadvance=12   page=0    chnl=0 
char id=333     x=32   y=131  width=11   height=11   xoffset=-1   yoffset=7    xadvance=9    page=0    chnl=0 
char id=334     x=482  y=0    width=14   height=17   xoffset=-1   yoffset=1    xadvance=12   page=0    chnl=0 
char id=335     x=404  y=79   width=11   height=13   xoffset=-1   yoffset=5    xadvance=9    page=0    chnl=0 
char id=336     x=496  y=0    width=14   height=17   xoffset=-1   yoffset=1    xadvance=12   page=0    chnl=0 
char id=337     x=415  y=79   width=11   height=13   xoffset=-1   yoffset=5    xadvance=9    page=0    chnl=0 
char id=338     x=426  y=79   width=18   height=13   xoffset=-1   yoffset=5    xadvance=16   page=0    chnl=0 
char id=339     x=335  y=131  width=16   height=9    xoffset=-1   yoffset=9    xadvance=14   page=0    chnl=0 
char id=340     x=0    y=18   width=12   height=17   xoffset=-1   yoffset=1    xadvance=10   page=0    chnl=0 
char id=341     x=444  y=79   width=8    height=13   xoffset=-1   yoffset=5    xadvance=6    page=0    chnl=0 
char id=342     x=45   y=35   width=12   height=16   xoffset=-1   yoffset=5    xadvance=10   page=0    chnl=0 
char id=343     x=305  y=118  width=8    height=12   xoffset=-1   yoffset=9    xadvance=6    page=0    chnl=0 
char id=344     x=12   y=18   width=12   height=17   xoffset=-1   yoffset=1    xadvance=10   page=0    chnl=0 
char id=345     x=452  y=79   width=8    height=13   xoffset=-1   yoffset=5    xadvance=6    page=0    chnl=0 
char id=346     x=24   y=18   width=10   height=17   xoffset=-1   yoffset=1    xadvance=9    page=0    chnl=0 
char id=347     x=460  y=79   width=9    height=13   xoffset=-1   yoffset=5    xadvance=6    page=0    chnl=0 
char id=348     x=34   y=18   width=10   height=17   xoffset=-1   yoffset=1    xadvance=9    page=0    chnl=0 
char id=349     x=469  y=79   width=9    height=13   xoffset=-1   yoffset=5    xadvance=6    page=0    chnl=0 
char id=350     x=44   y=18   width=10   height=17   xoffset=-1   yoffset=5    xadvance=9    page=0    chnl=0 
char id=351     x=313  y=118  width=9    height=12   xoffset=-1   yoffset=9    xadvance=6    page=0    chnl=0 
char id=352     x=54   y=18   width=10   height=17   xoffset=-1   yoffset=1    xadvance=9    page=0    chnl=0 
char id=353     x=478  y=79   width=9    height=13   xoffset=-1   yoffset=5    xadvance=6    page=0    chnl=0 
char id=354     x=57   y=35   width=12   height=16   xoffset=-1   yoffset=5    xadvance=10   page=0    chnl=0 
char id=355     x=137  y=51   width=9    height=14   xoffset=-2   yoffset=7    xadvance=6    page=0    chnl=0 
char id=356     x=64   y=18   width=12   height=17   xoffset=-1   yoffset=1    xadvance=10   page=0    chnl=0 
char id=357     x=487  y=79   width=10   height=13   xoffset=-2   yoffset=5    xadvance=6    page=0    chnl=0 
char id=358     x=497  y=79   width=12   height=13   xoffset=-1   yoffset=5    xadvance=10   page=0    chnl=0 
char id=359     x=43   y=131  width=8    height=11   xoffset=-1   yoffset=7    xadvance=6    page=0    chnl=0 
char id=360     x=76   y=18   width=13   height=17   xoffset=-1   yoffset=1    xadvance=11   page=0    chnl=0 
char id=361     x=146  y=51   width=11   height=14   xoffset=-1   yoffset=5    xadvance=9    page=0    chnl=0 
char id=362     x=0    y=51   width=13   height=15   xoffset=-1   yoffset=3    xadvance=11   page=0    chnl=0 
char id=363     x=322  y=118  width=11   height=12   xoffset=-1   yoffset=7    xadvance=9    page=0    chnl=0 
char id=364     x=89   y=18   width=13   height=17   xoffset=-1   yoffset=1    xadvance=11   page=0    chnl=0 
char id=365     x=157  y=51   width=11   height=14   xoffset=-1   yoffset=5    xadvance=9    page=0    chnl=0 
char id=366     x=102  y=18   width=13   height=17   xoffset=-1   yoffset=1    xadvance=11   page=0    chnl=0 
char id=367     x=168  y=51   width=11   height=14   xoffset=-1   yoffset=5    xadvance=9    page=0    chnl=0 
char id=368     x=115  y=18   width=13   height=17   xoffset=-1   yoffset=1    xadvance=11   page=0    chnl=0 
char id=369     x=179  y=51   width=11   height=14   xoffset=-1   yoffset=5    xadvance=9    page=0    chnl=0 
char id=370     x=69   y=35   width=13   height=16   xoffset=-1   yoffset=5    xadvance=11   page=0    chnl=0 
char id=371     x=333  y=118  width=11   height=12   xoffset=-1   yoffset=9    xadvance=9    page=0    chnl=0 
char id=372     x=128  y=18   width=19   height=17   xoffset=-1   yoffset=1    xadvance=17   page=0    chnl=0 
char id=373     x=0    y=92   width=16   height=13   xoffset=-2   yoffset=5    xadvance=13   page=0    chnl=0 
char id=374     x=147  y=18   width=13   height=17   xoffset=-1   yoffset=1    xadvance=11   page=0    chnl=0 
char id=375     x=82   y=35   width=12   height=16   xoffset=-2   yoffset=5    xadvance=9    page=0    chnl=0 
char id=376     x=94   y=35   width=13   height=16   xoffset=-1   yoffset=2    xadvance=11   page=0    chnl=0 
char id=377     x=160  y=18   width=12   height=17   xoffset=-1   yoffset=1    xadvance=10   page=0    chnl=0 
char id=378     x=16   y=92   width=10   height=13   xoffset=-1   yoffset=5    xadvance=8    page=0    chnl=0 
char id=379     x=107  y=35   width=12   height=16   xoffset=-1   yoffset=2    xadvance=10   page=0    chnl=0 
char id=380     x=344  y=118  width=10   height=12   xoffset=-1   yoffset=6    xadvance=8    page=0    chnl=0 
char id=381     x=172  y=18   width=12   height=17   xoffset=-1   yoffset=1    xadvance=10   page=0    chnl=0 
char id=382     x=26   y=92   width=10   height=13   xoffset=-1   yoffset=5    xadvance=8    page=0    chnl=0 
char id=383     x=36   y=92   width=8    height=13   xoffset=-1   yoffset=5    xadvance=5    page=0    chnl=0 
char id=894     x=354  y=118  width=6    height=12   xoffset=-1   yoffset=9    xadvance=4    page=0    chnl=0 
char id=900     x=491  y=142  width=6    height=5    xoffset=1    yoffset=5    xadvance=7    page=0    chnl=0 
char id=901     x=497  y=142  width=8    height=5    xoffset=0    yoffset=4    xadvance=8    page=0    chnl=0 
char id=902     x=44   y=92   width=14   height=13   xoffset=-1   yoffset=5    xadvance=12   page=0    chnl=0 
char id=903     x=505  y=142  width=6    height=5    xoffset=-1   yoffset=11   xadvance=4    page=0    chnl=0 
char id=904     x=58   y=92   width=14   height=13   xoffset=-2   yoffset=5    xadvance=10   page=0    chnl=0 
char id=905     x=72   y=92   width=17   height=13   xoffset=-2   yoffset=5    xadvance=13   page=0    chnl=0 
char id=906     x=89   y=92   width=10   height=13   xoffset=-2   yoffset=5    xadvance=6    page=0    chnl=0 
char id=908     x=99   y=92   width=15   height=13   xoffset=-2   yoffset=5    xadvance=12   page=0    chnl=0 
char id=910     x=114  y=92   width=16   height=13   xoffset=-2   yoffset=5    xadvance=12   page=0    chnl=0 
char id=911     x=130  y=92   width=15   height=13   xoffset=-1   yoffset=5    xadvance=13   page=0    chnl=0 
char id=912     x=145  y=92   width=9    height=13   xoffset=-2   yoffset=5    xadvance=5    page=0    chnl=0 
char id=913     x=154  y=92   width=14   height=13   xoffset=-1   yoffset=5    xadvance=12   page=0    chnl=0 
char id=914     x=168  y=92   width=12   height=13   xoffset=-1   yoffset=5    xadvance=10   page=0    chnl=0 
char id=915     x=180  y=92   width=10   height=13   xoffset=-1   yoffset=5    xadvance=8    page=0    chnl=0 
char id=916     x=190  y=92   width=14   height=13   xoffset=-1   yoffset=5    xadvance=12   page=0    chnl=0 
char id=917     x=204  y=92   width=11   height=13   xoffset=-1   yoffset=5    xadvance=9    page=0    chnl=0 
char id=918     x=215  y=92   width=12   height=13   xoffset=-1   yoffset=5    xadvance=10   page=0    chnl=0 
char id=919     x=227  y=92   width=14   height=13   xoffset=-1   yoffset=5    xadvance=12   page=0    chnl=0 
char id=920     x=241  y=92   width=14   height=13   xoffset=-1   yoffset=5    xadvance=12   page=0    chnl=0 
char id=921     x=255  y=92   width=7    height=13   xoffset=-1   yoffset=5    xadvance=5    page=0    chnl=0 
char id=922     x=262  y=92   width=14   height=13   xoffset=-1   yoffset=5    xadvance=11   page=0    chnl=0 
char id=923     x=276  y=92   width=14   height=13   xoffset=-1   yoffset=5    xadvance=12   page=0    chnl=0 
char id=924     x=290  y=92   width=16   height=13   xoffset=-1   yoffset=5    xadvance=14   page=0    chnl=0 
char id=925     x=306  y=92   width=14   height=13   xoffset=-1   yoffset=5    xadvance=12   page=0    chnl=0 
char id=926     x=320  y=92   width=11   height=13   xoffset=-1   yoffset=5    xadvance=9    page=0    chnl=0 
char id=927     x=331  y=92   width=14   height=13   xoffset=-1   yoffset=5    xadvance=12   page=0    chnl=0 
char id=928     x=345  y=92   width=14   height=13   xoffset=-1   yoffset=5    xadvance=12   page=0    chnl=0 
char id=929     x=359  y=92   width=11   height=13   xoffset=-1   yoffset=5    xadvance=9    page=0    chnl=0 
char id=931     x=370  y=92   width=11   height=13   xoffset=-1   yoffset=5    xadvance=9    page=0    chnl=0 
char id=932     x=381  y=92   width=12   height=13   xoffset=-1   yoffset=5    xadvance=10   page=0    chnl=0 
char id=933     x=393  y=92   width=13   height=13   xoffset=-1   yoffset=5    xadvance=11   page=0    chnl=0 
char id=934     x=406  y=92   width=14   height=13   xoffset=-1   yoffset=5    xadvance=12   page=0    chnl=0 
char id=935     x=420  y=92   width=14   height=13   xoffset=-1   yoffset=5    xadvance=11   page=0    chnl=0 
char id=936     x=434  y=92   width=15   height=13   xoffset=-1   yoffset=5    xadvance=13   page=0    chnl=0 
char id=937     x=449  y=92   width=15   height=13   xoffset=-1   yoffset=5    xadvance=13   page=0    chnl=0 
char id=938     x=119  y=35   width=9    height=16   xoffset=-2   yoffset=2    xadvance=5    page=0    chnl=0 
char id=939     x=94   y=35   width=13   height=16   xoffset=-1   yoffset=2    xadvance=11   page=0    chnl=0 
char id=940     x=464  y=92   width=11   height=13   xoffset=-1   yoffset=5    xadvance=9    page=0    chnl=0 
char id=941     x=475  y=92   width=9    height=13   xoffset=-1   yoffset=5    xadvance=7    page=0    chnl=0 
char id=942     x=128  y=35   width=11   height=16   xoffset=-1   yoffset=5    xadvance=9    page=0    chnl=0 
char id=943     x=484  y=92   width=8    height=13   xoffset=-1   yoffset=5    xadvance=5    page=0    chnl=0 
char id=944     x=492  y=92   width=12   height=13   xoffset=-2   yoffset=5    xadvance=9    page=0    chnl=0 
char id=945     x=351  y=131  width=11   height=9    xoffset=-1   yoffset=9    xadvance=9    page=0    chnl=0 
char id=946     x=139  y=35   width=11   height=16   xoffset=-1   yoffset=5    xadvance=9    page=0    chnl=0 
char id=947     x=360  y=118  width=11   height=12   xoffset=-2   yoffset=9    xadvance=9    page=0    chnl=0 
char id=948     x=0    y=105  width=11   height=13   xoffset=-1   yoffset=5    xadvance=9    page=0    chnl=0 
char id=949     x=362  y=131  width=9    height=9    xoffset=-1   yoffset=9    xadvance=7    page=0    chnl=0 
char id=950     x=150  y=35   width=10   height=16   xoffset=-1   yoffset=5    xadvance=7    page=0    chnl=0 
char id=951     x=371  y=118  width=11   height=12   xoffset=-1   yoffset=9    xadvance=9    page=0    chnl=0 
char id=952     x=11   y=105  width=11   height=13   xoffset=-1   yoffset=5    xadvance=9    page=0    chnl=0 
char id=953     x=371  y=131  width=8    height=9    xoffset=-1   yoffset=9    xadvance=5    page=0    chnl=0 
char id=954     x=379  y=131  width=12   height=9    xoffset=-1   yoffset=9    xadvance=9    page=0    chnl=0 
char id=955     x=22   y=105  width=12   height=13   xoffset=-2   yoffset=5    xadvance=9    page=0    chnl=0 
char id=956     x=203  y=118  width=11   height=12   xoffset=-1   yoffset=9    xadvance=9    page=0    chnl=0 
char id=957     x=391  y=131  width=11   height=9    xoffset=-2   yoffset=9    xadvance=9    page=0    chnl=0 
char id=958     x=160  y=35   width=10   height=16   xoffset=-1   yoffset=5    xadvance=7    page=0    chnl=0 
char id=959     x=402  y=131  width=11   height=9    xoffset=-1   yoffset=9    xadvance=9    page=0    chnl=0 
char id=960     x=165  y=131  width=13   height=10   xoffset=-1   yoffset=8    xadvance=10   page=0    chnl=0 
char id=961     x=382  y=118  width=11   height=12   xoffset=-1   yoffset=9    xadvance=9    page=0    chnl=0 
char id=962     x=393  y=118  width=9    height=12   xoffset=-1   yoffset=9    xadvance=7    page=0    chnl=0 
char id=963     x=413  y=131  width=12   height=9    xoffset=-1   yoffset=9    xadvance=9    page=0    chnl=0 
char id=964     x=178  y=131  width=10   height=10   xoffset=-1   yoffset=8    xadvance=7    page=0    chnl=0 
char id=965     x=425  y=131  width=12   height=9    xoffset=-2   yoffset=9    xadvance=9    page=0    chnl=0 
char id=966     x=402  y=118  width=13   height=12   xoffset=-1   yoffset=9    xadvance=12   page=0    chnl=0 
char id=967     x=415  y=118  width=12   height=12   xoffset=-2   yoffset=9    xadvance=8    page=0    chnl=0 
char id=968     x=13   y=51   width=14   height=15   xoffset=-2   yoffset=6    xadvance=11   page=0    chnl=0 
char id=969     x=437  y=131  width=14   height=9    xoffset=-1   yoffset=9    xadvance=12   page=0    chnl=0 
char id=970     x=427  y=118  width=9    height=12   xoffset=-2   yoffset=6    xadvance=5    page=0    chnl=0 
char id=971     x=436  y=118  width=12   height=12   xoffset=-2   yoffset=6    xadvance=9    page=0    chnl=0 
char id=972     x=34   y=105  width=11   height=13   xoffset=-1   yoffset=5    xadvance=9    page=0    chnl=0 
char id=973     x=45   y=105  width=12   height=13   xoffset=-2   yoffset=5    xadvance=9    page=0    chnl=0 
char id=974     x=57   y=105  width=14   height=13   xoffset=-1   yoffset=5    xadvance=12   page=0    chnl=0 
char id=1024    x=170  y=35   width=11   height=16   xoffset=-1   yoffset=2    xadvance=9    page=0    chnl=0 
char id=1025    x=181  y=35   width=11   height=16   xoffset=-1   yoffset=2    xadvance=9    page=0    chnl=0 
char id=1026    x=190  y=51   width=15   height=14   xoffset=-1   yoffset=5    xadvance=13   page=0    chnl=0 
char id=1027    x=192  y=35   width=10   height=16   xoffset=-1   yoffset=2    xadvance=8    page=0    chnl=0 
char id=1028    x=71   y=105  width=12   height=13   xoffset=-1   yoffset=5    xadvance=10   page=0    chnl=0 
char id=1029    x=83   y=105  width=10   height=13   xoffset=-1   yoffset=5    xadvance=9    page=0    chnl=0 
char id=1030    x=504  y=92   width=7    height=13   xoffset=-1   yoffset=5    xadvance=5    page=0    chnl=0 
char id=1031    x=202  y=35   width=9    height=16   xoffset=-2   yoffset=2    xadvance=5    page=0    chnl=0 
char id=1032    x=205  y=51   width=8    height=14   xoffset=-2   yoffset=5    xadvance=5    page=0    chnl=0 
char id=1033    x=93   y=105  width=17   height=13   xoffset=-1   yoffset=5    xadvance=15   page=0    chnl=0 
char id=1034    x=110  y=105  width=18   height=13   xoffset=-1   yoffset=5    xadvance=16   page=0    chnl=0 
char id=1035    x=128  y=105  width=15   height=13   xoffset=-1   yoffset=5    xadvance=13   page=0    chnl=0 
char id=1036    x=211  y=35   width=14   height=16   xoffset=-1   yoffset=2    xadvance=11   page=0    chnl=0 
char id=1037    x=225  y=35   width=14   height=16   xoffset=-1   yoffset=2    xadvance=12   page=0    chnl=0 
char id=1038    x=239  y=35   width=14   height=16   xoffset=-1   yoffset=2    xadvance=12   page=0    chnl=0 
char id=1039    x=253  y=35   width=13   height=16   xoffset=-1   yoffset=5    xadvance=12   page=0    chnl=0 
char id=1040    x=143  y=105  width=14   height=13   xoffset=-1   yoffset=5    xadvance=12   page=0    chnl=0 
char id=1041    x=157  y=105  width=11   height=13   xoffset=-1   yoffset=5    xadvance=10   page=0    chnl=0 
char id=1042    x=168  y=105  width=12   height=13   xoffset=-1   yoffset=5    xadvance=10   page=0    chnl=0 
char id=1043    x=180  y=105  width=10   height=13   xoffset=-1   yoffset=5    xadvance=8    page=0    chnl=0 
char id=1044    x=266  y=35   width=14   height=16   xoffset=-1   yoffset=5    xadvance=12   page=0    chnl=0 
char id=1045    x=190  y=105  width=11   height=13   xoffset=-1   yoffset=5    xadvance=9    page=0    chnl=0 
char id=1046    x=201  y=105  width=19   height=13   xoffset=-1   yoffset=5    xadvance=17   page=0    chnl=0 
char id=1047    x=220  y=105  width=11   height=13   xoffset=-1   yoffset=5    xadvance=9    page=0    chnl=0 
char id=1048    x=231  y=105  width=14   height=13   xoffset=-1   yoffset=5    xadvance=12   page=0    chnl=0 
char id=1049    x=280  y=35   width=14   height=16   xoffset=-1   yoffset=2    xadvance=12   page=0    chnl=0 
char id=1050    x=245  y=105  width=14   height=13   xoffset=-1   yoffset=5    xadvance=11   page=0    chnl=0 
char id=1051    x=259  y=105  width=14   height=13   xoffset=-1   yoffset=5    xadvance=12   page=0    chnl=0 
char id=1052    x=273  y=105  width=16   height=13   xoffset=-1   yoffset=5    xadvance=14   page=0    chnl=0 
char id=1053    x=289  y=105  width=14   height=13   xoffset=-1   yoffset=5    xadvance=12   page=0    chnl=0 
char id=1054    x=303  y=105  width=14   height=13   xoffset=-1   yoffset=5    xadvance=12   page=0    chnl=0 
char id=1055    x=317  y=105  width=14   height=13   xoffset=-1   yoffset=5    xadvance=12   page=0    chnl=0 
char id=1056    x=331  y=105  width=11   height=13   xoffset=-1   yoffset=5    xadvance=9    page=0    chnl=0 
char id=1057    x=342  y=105  width=12   height=13   xoffset=-1   yoffset=5    xadvance=10   page=0    chnl=0 
char id=1058    x=354  y=105  width=12   height=13   xoffset=-1   yoffset=5    xadvance=10   page=0    chnl=0 
char id=1059    x=366  y=105  width=14   height=13   xoffset=-1   yoffset=5    xadvance=12   page=0    chnl=0 
char id=1060    x=380  y=105  width=14   height=13   xoffset=-1   yoffset=5    xadvance=12   page=0    chnl=0 
char id=1061    x=394  y=105  width=14   height=13   xoffset=-1   yoffset=5    xadvance=11   page=0    chnl=0 
char id=1062    x=294  y=35   width=14   height=16   xoffset=-1   yoffset=5    xadvance=12   page=0    chnl=0 
char id=1063    x=408  y=105  width=12   height=13   xoffset=-1   yoffset=5    xadvance=11   page=0    chnl=0 
char id=1064    x=420  y=105  width=18   height=13   xoffset=-1   yoffset=5    xadvance=16   page=0    chnl=0 
char id=1065    x=308  y=35   width=18   height=16   xoffset=-1   yoffset=5    xadvance=16   page=0    chnl=0 
char id=1066    x=438  y=105  width=14   height=13   xoffset=-1   yoffset=5    xadvance=12   page=0    chnl=0 
char id=1067    x=452  y=105  width=16   height=13   xoffset=-1   yoffset=5    xadvance=14   page=0    chnl=0 
char id=1068    x=468  y=105  width=11   height=13   xoffset=-1   yoffset=5    xadvance=9    page=0    chnl=0 
char id=1069    x=479  y=105  width=12   height=13   xoffset=-1   yoffset=5    xadvance=10   page=0    chnl=0 
char id=1070    x=491  y=105  width=18   height=13   xoffset=-1   yoffset=5    xadvance=17   page=0    chnl=0 
char id=1071    x=0    y=118  width=12   height=13   xoffset=-1   yoffset=5    xadvance=10   page=0    chnl=0 
char id=1072    x=451  y=131  width=11   height=9    xoffset=-1   yoffset=9    xadvance=8    page=0    chnl=0 
char id=1073    x=213  y=51   width=11   height=14   xoffset=-1   yoffset=4    xadvance=9    page=0    chnl=0 
char id=1074    x=462  y=131  width=10   height=9    xoffset=-1   yoffset=9    xadvance=8    page=0    chnl=0 
char id=1075    x=472  y=131  width=9    height=9    xoffset=-1   yoffset=9    xadvance=7    page=0    chnl=0 
char id=1076    x=51   y=131  width=11   height=11   xoffset=-1   yoffset=9    xadvance=9    page=0    chnl=0 
char id=1077    x=481  y=131  width=10   height=9    xoffset=-1   yoffset=9    xadvance=8    page=0    chnl=0 
char id=1078    x=491  y=131  width=17   height=9    xoffset=-2   yoffset=9    xadvance=14   page=0    chnl=0 
char id=1079    x=0    y=142  width=9    height=9    xoffset=-1   yoffset=9    xadvance=7    page=0    chnl=0 
char id=1080    x=9    y=142  width=11   height=9    xoffset=-1   yoffset=9    xadvance=9    page=0    chnl=0 
char id=1081    x=12   y=118  width=11   height=13   xoffset=-1   yoffset=5    xadvance=9    page=0    chnl=0 
char id=1082    x=20   y=142  width=12   height=9    xoffset=-1   yoffset=9    xadvance=9    page=0    chnl=0 
char id=1083    x=32   y=142  width=12   height=9    xoffset=-2   yoffset=9    xadvance=9    page=0    chnl=0 
char id=1084    x=44   y=142  width=13   height=9    xoffset=-1   yoffset=9    xadvance=11   page=0    chnl=0 
char id=1085    x=57   y=142  width=11   height=9    xoffset=-1   yoffset=9    xadvance=9    page=0    chnl=0 
char id=1086    x=68   y=142  width=11   height=9    xoffset=-1   yoffset=9    xadvance=9    page=0    chnl=0 
char id=1087    x=79   y=142  width=11   height=9    xoffset=-1   yoffset=9    xadvance=9    page=0    chnl=0 
char id=1088    x=23   y=118  width=12   height=13   xoffset=-2   yoffset=8    xadvance=9    page=0    chnl=0 
char id=1089    x=90   y=142  width=10   height=9    xoffset=-1   yoffset=9    xadvance=7    page=0    chnl=0 
char id=1090    x=100  y=142  width=10   height=9    xoffset=-1   yoffset=9    xadvance=7    page=0    chnl=0 
char id=1091    x=448  y=118  width=12   height=12   xoffset=-2   yoffset=9    xadvance=9    page=0    chnl=0 
char id=1092    x=326  y=35   width=13   height=16   xoffset=-1   yoffset=5    xadvance=11   page=0    chnl=0 
char id=1093    x=110  y=142  width=11   height=9    xoffset=-1   yoffset=9    xadvance=8    page=0    chnl=0 
char id=1094    x=62   y=131  width=11   height=11   xoffset=-1   yoffset=9    xadvance=9    page=0    chnl=0 
char id=1095    x=121  y=142  width=11   height=9    xoffset=-1   yoffset=9    xadvance=9    page=0    chnl=0 
char id=1096    x=132  y=142  width=15   height=9    xoffset=-1   yoffset=9    xadvance=13   page=0    chnl=0 
char id=1097    x=73   y=131  width=15   height=11   xoffset=-1   yoffset=9    xadvance=13   page=0    chnl=0 
char id=1098    x=147  y=142  width=11   height=9    xoffset=-1   yoffset=9    xadvance=9    page=0    chnl=0 
char id=1099    x=158  y=142  width=14   height=9    xoffset=-1   yoffset=9    xadvance=12   page=0    chnl=0 
char id=1100    x=172  y=142  width=10   height=9    xoffset=-1   yoffset=9    xadvance=8    page=0    chnl=0 
char id=1101    x=182  y=142  width=9    height=9    xoffset=-1   yoffset=9    xadvance=7    page=0    chnl=0 
char id=1102    x=191  y=142  width=15   height=9    xoffset=-1   yoffset=9    xadvance=13   page=0    chnl=0 
char id=1103    x=206  y=142  width=12   height=9    xoffset=-2   yoffset=9    xadvance=9    page=0    chnl=0 
char id=1104    x=35   y=118  width=10   height=13   xoffset=-1   yoffset=5    xadvance=8    page=0    chnl=0 
char id=1105    x=45   y=118  width=10   height=13   xoffset=-1   yoffset=5    xadvance=8    page=0    chnl=0 
char id=1106    x=339  y=35   width=10   height=16   xoffset=-1   yoffset=5    xadvance=9    page=0    chnl=0 
char id=1107    x=55   y=118  width=9    height=13   xoffset=-1   yoffset=5    xadvance=7    page=0    chnl=0 
char id=1108    x=218  y=142  width=9    height=9    xoffset=-1   yoffset=9    xadvance=7    page=0    chnl=0 
char id=1109    x=227  y=142  width=9    height=9    xoffset=-1   yoffset=9    xadvance=6    page=0    chnl=0 
char id=1110    x=64   y=118  width=7    height=13   xoffset=-2   yoffset=5    xadvance=4    page=0    chnl=0 
char id=1111    x=71   y=118  width=8    height=13   xoffset=-2   yoffset=5    xadvance=4    page=0    chnl=0 
char id=1112    x=349  y=35   width=9    height=16   xoffset=-3   yoffset=5    xadvance=4    page=0    chnl=0 
char id=1113    x=236  y=142  width=15   height=9    xoffset=-2   yoffset=9    xadvance=12   page=0    chnl=0 
char id=1114    x=251  y=142  width=14   height=9    xoffset=-1   yoffset=9    xadvance=12   page=0    chnl=0 
char id=1115    x=79   y=118  width=11   height=13   xoffset=-1   yoffset=5    xadvance=9    page=0    chnl=0 
char id=1116    x=90   y=118  width=12   height=13   xoffset=-1   yoffset=5    xadvance=9    page=0    chnl=0 
char id=1117    x=102  y=118  width=11   height=13   xoffset=-1   yoffset=5    xadvance=9    page=0    chnl=0 
char id=1118    x=358  y=35   width=12   height=16   xoffset=-2   yoffset=5    xadvance=9    page=0    chnl=0 
char id=1119    x=88   y=131  width=11   height=11   xoffset=-1   yoffset=9    xadvance=9    page=0    chnl=0 
char id=1168    x=27   y=51   width=10   height=15   xoffset=-1   yoffset=3    xadvance=8    page=0    chnl=0 
char id=1169    x=99   y=131  width=9    height=11   xoffset=-1   yoffset=7    xadvance=7    page=0    chnl=0 
char id=8201    x=0    y=0    width=0    height=0    xoffset=-1   yoffset=0    xadvance=1    page=0    chnl=0 
char id=8211    x=52   y=151  width=12   height=3    xoffset=-1   yoffset=12   xadvance=11   page=0    chnl=0 
char id=8212    x=64   y=151  width=19   height=3    xoffset=-1   yoffset=12   xadvance=17   page=0    chnl=0 
char id=8213    x=83   y=151  width=18   height=3    xoffset=-1   yoffset=12   xadvance=16   page=0    chnl=0 
char id=8216    x=380  y=142  width=6    height=7    xoffset=-1   yoffset=5    xadvance=4    page=0    chnl=0 
char id=8217    x=386  y=142  width=6    height=7    xoffset=-1   yoffset=5    xadvance=4    page=0    chnl=0 
char id=8218    x=392  y=142  width=6    height=7    xoffset=-1   yoffset=14   xadvance=4    page=0    chnl=0 
char id=8220    x=398  y=142  width=10   height=7    xoffset=-1   yoffset=5    xadvance=8    page=0    chnl=0 
char id=8221    x=408  y=142  width=10   height=7    xoffset=-1   yoffset=5    xadvance=8    page=0    chnl=0 
char id=8222    x=331  y=142  width=10   height=8    xoffset=-1   yoffset=13   xadvance=8    page=0    chnl=0 
char id=8224    x=370  y=35   width=10   height=16   xoffset=0    yoffset=5    xadvance=9    page=0    chnl=0 
char id=8225    x=380  y=35   width=10   height=16   xoffset=0    yoffset=5    xadvance=9    page=0    chnl=0 
char id=8226    x=418  y=142  width=8    height=7    xoffset=0    yoffset=9    xadvance=8    page=0    chnl=0 
char id=8230    x=0    y=151  width=18   height=5    xoffset=0    yoffset=13   xadvance=18   page=0    chnl=0 
char id=8240    x=113  y=118  width=20   height=13   xoffset=-1   yoffset=5    xadvance=18   page=0    chnl=0 
char id=8249    x=341  y=142  width=6    height=8    xoffset=-1   yoffset=9    xadvance=4    page=0    chnl=0 
char id=8250    x=347  y=142  width=6    height=8    xoffset=-1   yoffset=9    xadvance=4    page=0    chnl=0 
char id=8260    x=133  y=118  width=15   height=13   xoffset=-4   yoffset=5    xadvance=3    page=0    chnl=0 
char id=8363    x=37   y=51   width=11   height=15   xoffset=-1   yoffset=5    xadvance=9    page=0    chnl=0 
char id=8364    x=148  y=118  width=11   height=13   xoffset=-1   yoffset=5    xadvance=9    page=0    chnl=0 
kernings count=0
