Generation,Min result,Max result,Start n,End n,Length,K
0,0.0,1.0,23,168,46,925
1,0.0,1.0,23,168,46,925
2,0.0,2.0,331,496,11,844
3,0.0,3.0,331,496,11,844
4,0.0,5.0,331,496,11,844
5,0.0,4.0,254,414,10,864
6,0.0,3.0,254,414,14,864
7,0.0,4.0,161,414,10,864
8,0.0,3.0,225,383,21,871
9,0.0,5.0,216,398,16,867
10,0.0,3.0,216,398,14,867
11,0.0,4.0,225,383,21,871
12,0.0,5.0,210,398,13,867
13,0.0,4.0,210,398,13,867
14,0.0,4.0,208,395,13,867
15,0.0,5.0,209,392,14,868
16,0.0,4.0,208,391,14,868
17,0.0,6.0,131,389,14,868
18,0.0,5.0,170,391,13,867
19,0.0,5.0,170,391,13,867
20,0.0,5.0,170,391,13,867
21,0.0,4.0,169,390,13,867
22,0.0,4.0,140,389,13,867
23,0.0,6.0,187,388,13,867
24,0.0,6.0,189,388,13,867
25,0.0,9.0,183,388,13,867
26,0.0,5.0,185,388,13,867
27,0.0,5.0,178,388,13,867
28,0.0,6.0,175,388,13,867
29,0.0,5.0,175,388,13,867
30,0.0,4.0,175,388,13,867
31,0.0,6.0,174,388,13,867
32,0.0,4.0,176,388,13,867
33,0.0,5.0,177,388,13,867
34,0.0,6.0,175,388,13,867
35,0.0,5.0,175,388,13,867
36,0.0,6.0,175,388,13,867
37,0.0,6.0,164,388,13,867
38,0.0,5.0,162,388,13,867
39,0.0,6.0,162,388,13,867
40,0.0,9.0,86,388,13,867
41,0.0,5.0,127,388,13,867
42,0.0,5.0,167,337,13,867
43,0.0,6.0,145,388,11,867
44,0.0,6.0,140,375,12,867
45,0.0,5.0,132,349,12,867
46,0.0,5.0,141,378,11,867
47,0.0,5.0,136,363,11,867
48,0.0,6.0,137,365,11,867
49,0.0,7.0,136,365,11,867
50,0.0,4.0,121,362,11,867
51,0.0,4.0,129,362,11,867
52,0.0,6.0,138,362,11,867
53,0.0,4.0,135,362,11,867
54,0.0,6.0,98,361,11,867
55,0.0,4.0,116,360,11,867
56,0.0,6.0,125,361,11,867
57,0.0,5.0,87,335,11,867
58,0.0,6.0,113,328,11,867
59,0.0,3.0,100,360,11,867
60,0.0,6.0,104,347,11,867
61,0.0,6.0,93,347,11,867
62,0.0,6.0,91,348,11,867
63,0.0,6.0,86,343,11,867
64,0.0,5.0,102,347,11,867
65,0.0,5.0,87,346,11,867
66,0.0,5.0,88,345,11,867
67,0.0,7.0,46,345,11,867
68,0.0,4.0,68,345,11,867
69,0.0,4.0,76,345,11,867
70,0.0,6.0,84,345,11,867
71,0.0,5.0,55,345,11,867
72,0.0,6.0,58,345,11,867
73,0.0,6.0,78,345,11,867
74,0.0,5.0,69,345,11,867
75,0.0,5.0,60,345,11,867
76,0.0,4.0,64,345,11,867
77,0.0,5.0,34,345,11,867
78,0.0,5.0,53,345,11,867
79,0.0,6.0,57,300,11,867
80,0.0,4.0,57,315,11,867
81,0.0,4.0,55,322,11,867
82,0.0,4.0,57,326,11,867
83,0.0,6.0,55,333,11,867
84,0.0,4.0,42,331,11,867
85,0.0,5.0,47,329,11,867
86,0.0,7.0,47,328,11,867
87,0.0,6.0,47,328,11,867
88,0.0,6.0,50,327,11,867
89,0.0,8.0,42,327,11,867
90,0.0,5.0,45,327,11,867
91,0.0,5.0,41,327,11,867
92,0.0,5.0,45,327,11,867
93,0.0,5.0,34,327,11,867
94,0.0,3.0,37,327,11,867
95,0.0,6.0,44,327,11,867
96,0.0,4.0,39,327,11,867
97,0.0,5.0,42,327,11,867
98,0.0,6.0,39,327,11,867
99,0.0,4.0,40,327,11,867
