{
   "baseUrl":"https://cockpit.altcoinsurge.com/tapi/v1",
   "debug": true,
   "testing": true,
   "socketCockit":"https://cockpit.altcoinsurge.com/tapi/cockpit-socket",
   "ipbase":"http://161.97.118.63:8080/tapi/v1"
  }
  