{
  "baseUrl":"http://localhost:5050/tapi/v1", 
   "baseUrl2":"XXXXXXXXXXXXXXXXXXXXXX",
   "debug": true,
   "testing": true,
   "socketCockit2":"XXXXXXXXXXXXXXXXXXXXXX",
   "socketCockit":"http://localhost:5050/tapi/cockpit-socket"
  }
 