<?xml version="1.0" encoding="UTF-8"?>
<svg width="151.62" height="89.143" color-interpolation-filters="sRGB" data-v-0dd9719b="" preserveAspectRatio="xMidYMid" version="1.0" viewBox="0 0 151.62 89.143" xmlns="http://www.w3.org/2000/svg">
 <path d="m0 69.933v3.34h1.83v12.26h-1.83v3.33h7.71v-3.33h-1.84v-4.75h5.62v-2.66h-5.62v-4.85h6.75l0.23 2.85h2.97v-6.19zm17.03 4.41v2.85h1.89v8.79h-1.89v2.88h7.63v-2.88h-1.89v-11.64zm0.88-3.84c0 1.44 1.07 2.12 2.77 2.12 1.69 0 2.79-0.68 2.79-2.12 0-1.39-1.1-2.07-2.79-2.07-1.7 0-2.77 0.68-2.77 2.07zm14.86 3.61c-4.27 0-7.35 2.69-7.35 7.43 0 4.86 3.05 7.55 7.4 7.55 2.26 0 4.49-0.82 5.99-2.09l-0.9-3.11c-1.22 0.99-2.83 1.75-4.64 1.75-2.2 0-3.89-1.5-3.89-4.13 0-2.51 1.63-4.01 3.81-4.09 0.48 0.03 0.96 0.08 1.44 0.22l0.26 3.2h3.44v-5.65c-1.18-0.6-3.56-1.08-5.56-1.08zm7.03 0.23v2.85h2.23v5.45c0 4.52 1.67 6.5 4.58 6.5 1.1 0 2.32-0.25 3.7-0.76l-0.45-3.39c-0.88 0.31-1.58 0.51-2.23 0.51-1.11 0-1.76-0.68-1.76-2.74v-5.57h4.07v-2.85h-4.07v-4.24h-3.84v4.24zm11.72 0v2.85h1.9v8.79h-1.9v2.88h7.63v-2.88h-1.89v-11.64zm0.88-3.84c0 1.44 1.07 2.12 2.77 2.12 1.69 0 2.8-0.68 2.8-2.12 0-1.39-1.11-2.07-2.8-2.07-1.7 0-2.77 0.68-2.77 2.07zm7.51 11.04c0 4.86 3.06 7.55 7.43 7.55 2.63 0 4.47-0.82 5.97-2.09l-0.91-3.03c-1.21 0.99-2.46 1.78-4.24 1.78-2.26 0-3.64-1.1-4.12-2.91h9.94c0.03-0.42 0.06-1.27 0.06-1.64 0-4.15-2.15-7.09-6.78-7.09-4.21 0-7.35 2.69-7.35 7.43zm4.02-0.99c0.31-2.06 1.64-3.33 3.44-3.33 2.35 0 3.45 1.64 3.45 3.33zm11.66-3.61v2.88h2.09v6.16h-2.03v2.88h8.31v-2.88h-2.43v-6.16h3.05v-2.88h-3.05v-1.81c0-2.34 0.67-3.05 2.03-3.05 0.82 0 2.26 0.42 2.74 0.68l0.42-3.31c-0.65-0.37-2.42-0.85-3.89-0.85-3.28 0-5.15 1.76-5.15 6.56v1.78zm18.59 2.4c0 6.44 4.1 9.75 9.83 9.75 2.74 0 5.29-0.8 7.01-2.01l-0.9-3.36c-1.36 1.02-3.48 1.83-5.74 1.83-3.7 0-6.1-2.31-6.1-6.21 0-3.81 2.4-6.13 5.48-6.13 1.02 0 1.98 0.06 2.85 0.2l0.34 4.69h3.82v-7.24c-2.07-0.7-4.02-1.15-6.93-1.15-5.53 0-9.66 3.27-9.66 9.63zm33.11 0c0 3.93-2.03 6.24-5.11 6.24-3.14 0-5.14-2.31-5.14-6.24 0-3.84 2-6.13 5.14-6.13 3.08 0 5.11 2.32 5.11 6.13zm4.07 0c0-6.36-3.9-9.63-9.21-9.63s-9.21 3.27-9.21 9.63c0 6.47 3.9 9.75 9.21 9.75s9.21-3.31 9.21-9.75zm7.74 9.52v-3.25h-1.72l0.82-2.4h6.75l0.82 2.4h-1.7v3.25h7.55v-3.25h-1.87l-5.56-15.68h-5.2l-5.6 15.68h-1.83v3.25zm2.49-15.54 2.43 7.15h-4.89z" fill="#4a5699"/>
 <g transform="matrix(.31229 0 0 .31229 45.81 .00018106)" fill="#4a5699">
  <path d="m166.87 100.62a71.54 71.54 0 0 1-70.81 70.8c-38.86 0.33-70.48-32.43-70.8-70.8-0.14-16.28-25.4-16.3-25.26 0a98 98 0 0 0 26.75 66.51c16.88 18 40.66 28 65.06 29.44 24.86 1.46 49.1-8 67.83-24s29.43-39.31 32.07-63.53c0.3-2.8 0.39-5.63 0.42-8.44 0.13-16.3-25.12-16.28-25.26 0z" fill="#4a5699"/>
  <path d="m25.26 96.07a71.54 71.54 0 0 1 70.8-70.81c16.28-0.14 16.3-25.4 0-25.26a97.79 97.79 0 0 0-67.45 27.67c-18.36 17.79-28.4 42.98-28.61 68.4-0.14 16.29 25.12 16.27 25.26 0z" fill="#c45fa0"/>
  <path d="m73.83 118.81c-10.58-14.11-9-30.09 4.14-41.46 12.31-10.62 30.52-6.6 40.93 6.34 4.33 5.37 13.39 4.48 17.86 0 5.26-5.25 4.31-12.5 0-17.86-17.42-21.65-50.71-25.9-73-9.21-23.18 17.38-29.5 51.25-11.76 74.94 4.12 5.5 10.82 8.31 17.28 4.53 5.42-3.18 8.66-11.76 4.53-17.28z" fill="#e5594f"/>
  <path d="m118.3 82.91c6 8 7.54 14 6.68 23.29 0.14-1.14 0.08-0.93-0.18 0.62-0.26 1.32-0.64 2.62-1 3.91a14.07 14.07 0 0 1-1.9 4.44c-2.34 4.43-4.59 6.68-8.84 10.1-5.38 4.32-4.48 13.39 0 17.86 5.25 5.26 12.5 4.31 17.85 0 21.66-17.42 25.91-50.71 9.22-73-4.12-5.5-10.82-8.31-17.28-4.53-5.43 3.18-8.67 11.76-4.53 17.28z" fill="#f39a2b"/>
 </g>
</svg>
