<?xml version="1.0" encoding="UTF-8"?>
<svg width="216.94" height="51.694" color-interpolation-filters="sRGB" data-v-0dd9719b="" preserveAspectRatio="xMidYMid" version="1.0" viewBox="0 0 216.94 51.694" xmlns="http://www.w3.org/2000/svg">
 <g fill="#333">
  <path d="m15.86 5.6644q7.15 0 12.57 2.79 5.43 2.8 8.39 7.97 2.96 5.16 2.96 11.99t-2.96 11.93q-2.96 5.1-8.39 7.9-5.42 2.79-12.57 2.79h-15.86v-45.37zm-0.33 37.63q7.15 0 11.05-3.89 3.9-3.91 3.9-10.99 0-7.09-3.9-11.08-3.9-4-11.05-4h-6.43v29.96zm31.07-37.63h9.1v45.37h-9.1zm49.14 0h9.69l-16.64 45.37h-11.05l-16.64-45.37h9.75l12.48 36.08z"/>
  <path d="m168.71 10.734q-2.4 0-4-1.53-1.59-1.53-1.59-3.8 0-2.28 1.59-3.8 1.6-1.53 4-1.53 2.41 0 4 1.53 1.59 1.52 1.59 3.8 0 2.27-1.59 3.8t-4 1.53zm-4.61 4.29h9.1v36.01h-9.1zm34.06 36.59q-5.21 0-9.36-2.3-4.17-2.31-6.54-6.54-2.37-4.22-2.37-9.74 0-5.53 2.44-9.76 2.44-4.22 6.66-6.53 4.23-2.3 9.42-2.3 5.21 0 9.43 2.3 4.22 2.31 6.66 6.53 2.44 4.23 2.44 9.76 0 5.52-2.5 9.74-2.5 4.23-6.76 6.54-4.26 2.3-9.52 2.3zm0-7.93q2.47 0 4.64-1.2 2.18-1.2 3.48-3.61 1.3-2.4 1.3-5.84 0-5.14-2.7-7.9-2.69-2.77-6.6-2.77-3.89 0-6.53 2.77-2.63 2.76-2.63 7.9 0 5.13 2.57 7.89 2.56 2.76 6.47 2.76z"/>
  <g transform="matrix(.51694 0 0 .51694 108.43 0)" fill-rule="evenodd">
   <path d="m50 50 25 25-25 25h-50l75-75 25 25-25 25z" fill="#2e00ab"/>
   <path d="m75 25-25-25h-50l75 75 25-25z" fill="#33d9ff" opacity=".8"/>
  </g>
 </g>
</svg>
