<?xml version="1.0" encoding="UTF-8"?>
<svg width="142.91" height="48.192" color-interpolation-filters="sRGB" data-v-0dd9719b="" preserveAspectRatio="xMidYMid" version="1.0" viewBox="0 0 142.91 48.192" xmlns="http://www.w3.org/2000/svg">
 <g fill="#147dc8">
  <g transform="translate(.83984)">
   <rect class="image-rect" width="18.029" height="27.043" fill="#147dc8" fill-opacity="0" stroke-width="2"/>
   <svg class="image-svg-svg primary" width="18.029" height="27.043" overflow="visible" filtersec="colorsb8901944911" version="1.1">
    <svg version="1.1" viewBox="0 0 120 180"/>
   </svg>
  </g>
  <g transform="translate(18.868)">
   <rect class="image-rect" width="12.019" height="27.043" fill="#147dc8" fill-opacity="0" stroke-width="2"/>
   <svg class="image-svg-svg primary" width="12.019" height="27.043" overflow="visible" filtersec="colorsb6452295938" version="1.1">
    <svg version="1.1" viewBox="0 0 80 180"/>
   </svg>
  </g>
  <g transform="translate(30.888)">
   <rect class="image-rect" width="19.531" height="27.043" fill="#147dc8" fill-opacity="0" stroke-width="2"/>
   <svg class="image-svg-svg primary" width="19.531" height="27.043" overflow="visible" filtersec="colorsb4504171370" version="1.1">
    <svg version="1.1" viewBox="0 0 130 180"/>
   </svg>
  </g>
  <g transform="translate(50.419)">
   <rect class="image-rect" width="21.033" height="27.043" fill="#147dc8" fill-opacity="0" stroke-width="2"/>
   <svg class="image-svg-svg primary" width="21.033" height="27.043" overflow="visible" filtersec="colorsb3569530163" version="1.1">
    <svg version="1.1" viewBox="0 0 140 180"/>
   </svg>
  </g>
  <g transform="translate(71.452)">
   <rect class="image-rect" width="12.019" height="27.043" fill="#147dc8" fill-opacity="0" stroke-width="2"/>
   <svg class="image-svg-svg primary" width="12.019" height="27.043" overflow="visible" filtersec="colorsb8523985342" version="1.1">
    <svg version="1.1" viewBox="0 0 80 180"/>
   </svg>
  </g>
  <g transform="translate(83.471)">
   <rect class="image-rect" width="18.029" height="27.043" fill="#147dc8" fill-opacity="0" stroke-width="2"/>
   <svg class="image-svg-svg primary" width="18.029" height="27.043" overflow="visible" filtersec="colorsb4134457505" version="1.1">
    <svg version="1.1" viewBox="0 0 120 180"/>
   </svg>
  </g>
  <g transform="translate(101.5)">
   <rect class="image-rect" width="22.536" height="27.043" fill="#147dc8" fill-opacity="0" stroke-width="2"/>
   <svg class="image-svg-svg primary" width="22.536" height="27.043" overflow="visible" filtersec="colorsb9026337096" version="1.1">
    <svg version="1.1" viewBox="0 0 150 180"/>
   </svg>
  </g>
 </g>
 <path d="m9.308 37.181v10.907h-2.184l-4.94-7.475v7.475h-2.184v-10.907h2.184l4.94 7.488v-7.488zm9.555 10.907-0.728-2.08h-4.329l-0.715 2.08h-2.301l3.913-10.907h2.548l3.913 10.907zm-4.472-3.822h3.159l-1.573-4.55zm7.67-7.072h7.982v1.768h-2.899v9.126h-2.184v-9.126h-2.899zm9.568 0h2.184v10.894h-2.184zm9.399 10.998q-1.534 0-2.808-0.715-1.287-0.715-2.028-1.989-0.754-1.274-0.754-2.873t0.754-2.86q0.741-1.274 2.028-1.989 1.274-0.728 2.808-0.728 1.547 0 2.808 0.728 1.274 0.715 2.015 1.989 0.741 1.261 0.741 2.86t-0.741 2.873-2.015 1.989q-1.287 0.715-2.808 0.715zm0-1.95q0.975 0 1.729-0.442t1.17-1.274q0.416-0.819 0.416-1.911t-0.416-1.911-1.17-1.261q-0.754-0.429-1.729-0.429-0.988 0-1.742 0.429-0.754 0.442-1.183 1.261-0.416 0.819-0.416 1.911t0.416 1.911q0.429 0.832 1.183 1.274t1.742 0.442zm16.497-9.061v10.907h-2.184l-4.94-7.475v7.475h-2.184v-10.907h2.184l4.94 7.488v-7.488zm9.555 10.907-0.715-2.08h-4.342l-0.715 2.08h-2.301l3.926-10.907h2.535l3.913 10.907zm-4.459-3.822h3.146l-1.573-4.55zm10.413-7.072v9.165h3.588v1.729h-5.772v-10.894zm11.297 1.768h-4.134v2.73h3.666v1.729h-3.666v2.886h4.134v1.781h-6.318v-10.907h6.318zm13.637 1.612q0 0.871-0.416 1.638-0.416 0.754-1.3 1.222-0.871 0.468-2.223 0.468h-1.82v4.186h-2.184v-10.894h4.004q1.274 0 2.158 0.442t1.339 1.196q0.442 0.767 0.442 1.742zm-4.03 1.573q0.91 0 1.339-0.416 0.442-0.416 0.442-1.157 0-1.599-1.781-1.599h-1.729v3.172zm10.621 6.045q-1.521 0-2.808-0.715-1.274-0.715-2.028-1.989-0.741-1.274-0.741-2.873t0.741-2.86q0.754-1.274 2.028-1.989 1.287-0.728 2.808-0.728 1.547 0 2.821 0.728 1.274 0.715 2.015 1.989 0.741 1.261 0.741 2.86t-0.741 2.873-2.028 1.989q-1.274 0.715-2.808 0.715zm0-1.95q0.988 0 1.742-0.442 0.741-0.442 1.17-1.274 0.416-0.819 0.416-1.911t-0.416-1.911q-0.429-0.819-1.17-1.261-0.754-0.429-1.742-0.429-0.975 0-1.729 0.429-0.767 0.442-1.183 1.261t-0.416 1.911 0.416 1.911q0.416 0.832 1.183 1.274 0.754 0.442 1.729 0.442zm9.386-9.048v9.165h3.588v1.729h-5.772v-10.894zm4.966 0h2.184v10.894h-2.184zm3.77 0h7.982v1.768h-2.899v9.126h-2.184v-9.126h-2.899zm9.568 0h2.184v10.894h-2.184zm10.66 1.768h-4.134v2.73h3.666v1.729h-3.666v2.886h4.134v1.781h-6.318v-10.907h6.318z" fill="#143d8f" stroke-width="1.3"/>
 <g transform="matrix(.15024 0 0 .15024 .83984 0)" fill="#23b5e8">
  <path d="m120 0h-80l-40 40h120z" opacity=".8"/>
  <path d="m0 40v140h40v-180z" opacity=".8"/>
  <path d="m0 70h100v40h-100z" opacity=".8"/>
 </g>
 <g transform="matrix(.15024 0 0 .15024 18.868 0)" fill="#147dc8">
  <path d="m20 0h40v180h-40z" opacity=".8"/>
  <path d="m0 0h80v40h-80zm0 140h80v40h-80z" opacity=".8"/>
 </g>
 <g transform="matrix(.15024 0 0 .15024 30.888 0)" fill="#23b5e8">
  <path d="m130 65v-25l-40-40v65z" opacity=".8"/>
  <path d="m90 0h-50l-40 40h130z" opacity=".8"/>
  <path d="m0 40v100l40 40v-180z" opacity=".8"/>
  <path d="m0 140h130l-40 40h-50z" opacity=".8"/>
  <path d="m90 115v65l40-40v-25z" opacity=".8"/>
 </g>
 <g transform="matrix(.15024 0 0 .15024 50.419 0)" fill="#23b5e8">
  <path d="m50 0h40v180h-40z" opacity=".8"/>
  <path d="m0 0h140v40h-140z" opacity=".8"/>
 </g>
 <g transform="matrix(.15024 0 0 .15024 71.452 0)" fill="#147dc8">
  <path d="m20 0h40v180h-40z" opacity=".8"/>
  <path d="m0 0h80v40h-80zm0 140h80v40h-80z" opacity=".8"/>
 </g>
 <g transform="matrix(.15024 0 0 .15024 124.04 0)" fill="#147dc8">
  <path d="m40 180h80v-40h-120zm80-180h-80l-40 40h120z" opacity=".8"/>
  <path d="m0 40v100l40 40v-180z" opacity=".8"/>
  <path d="m0 70h100v40h-100z" opacity=".8"/>
 </g>
 <g transform="matrix(.15024 0 0 .15024 83.471 0)" fill="#23b5e8">
  <path d="m40 180h80v-40h-120zm80-180h-80l-40 40h120z" opacity=".8"/>
  <path d="m0 40v100l40 40v-180z" opacity=".8"/>
  <path d="m0 70h100v40h-100z" opacity=".8"/>
 </g>
 <g transform="matrix(.15024 0 0 .15024 101.5 0)" fill="#23b5e8">
  <path d="m110 0v171.73l40-48.38v-123.35z" opacity=".8"/>
  <path d="m150 66.71-103.29 113.29h56.58l46.71-56.71z" opacity=".8"/>
  <path d="m0 66.71v56.57l46.71 56.72h56.58z" opacity=".8"/>
  <path d="m40 0v171.73l-40-48.38v-123.35z" opacity=".8"/>
 </g>
</svg>
