{
  "implicitDependencies": {
    "package.json": {
      "dependencies": "*",
      "devDependencies": "*"
    },
    ".eslintrc.json": "*"
  },
  "affected": {
    "defaultBase": "master"
  },
  "npmScope": "test-nx-ci-commit-before-sha",
  "tasksRunnerOptions": {
    "default": {
      "runner": "@nrwl/workspace/tasks-runners/default",
      "options": {
        "cacheableOperations": ["build", "lint", "test", "e2e"]
      }
    }
  },
  "projects": {
    "app-a": {
      "tags": []
    },
    "app-a-e2e": {
      "tags": [],
      "implicitDependencies": ["app-a"]
    },
    "app-b": {
      "tags": []
    },
    "app-b-e2e": {
      "tags": [],
      "implicitDependencies": ["app-b"]
    },
    "app-c": {
      "tags": []
    },
    "app-c-e2e": {
      "tags": [],
      "implicitDependencies": ["app-c"]
    }
  }
}
