id;nom;type;prixAchat;materiel;loyer0;loyer1;loyer2;loyer3;couleur
0;Départ;1;0;0;0;0;0;0;#cde7ce
1;Com;2;60;50;10;30;90;250;#80E1FC
2;Droit;2;80;50;20;60;180;450;#80E1FC
3;?;3;0;0;0;0;0;0;#9673a6
4;Anglais;2;120;50;40;100;300;600;#80E1FC
5;Parking;4;0;0;0;0;0;0;#cde7ce
6;Réseaux;2;160;100;60;180;500;900;#FF8201
7;?;3;0;0;0;0;0;0;#9673a6
8;Archi;2;180;100;70;200;550;600;#FF8201
9;Système;2;200;100;80;220;600;1000;#FF8201
10;Salle de DS;5;0;0;0;0;0;0;#cde7ce
11;Maths;2;240;150;100;300;750;1100;#FFFC01
12;Algo;2;260;150;110;330;800;1150;#FFFC01
13;?;3;0;0;0;0;0;0;#9673a6
14;Web;2;280;150;120;360;850;1200;#FFFC01
15;Taxe de luxe;6;0;0;0;0;0;0;#cde7ce
16;BDD;2;300;200;130;390;900;1275;#4474E0
17;?;3;0;0;0;0;0;0;#9673a6
18;Projet;2;350;200;175;500;1100;1500;#4474E0
19;Alternant;2;400;200;200;600;1400;2000;#4474E0