('C:\\Users\\DEIBIS\\Documents\\sockestpython\\build\\cliente\\out00-PKG.pkg',
 {'BINARY': 1,
  'DATA': 1,
  'EXECUTABLE': 1,
  'EXTENSION': 1,
  'PYMODULE': 1,
  'PYSOURCE': 1},
 [('out00-PYZ.pyz', 'C:\\Users\\DEIBIS\\Documents\\sockestpython\\build\\cliente\\out00-PYZ.pyz', 'PYZ'), ('struct', 'c:\\python27\\lib\\struct.pyc', 'PYMODULE'), ('pyi_os_path', 'c:\\python27\\lib\\site-packages\\PyInstaller\\loader\\pyi_os_path.pyc', 'PYMODULE'), ('pyi_archive', 'c:\\python27\\lib\\site-packages\\PyInstaller\\loader\\pyi_archive.pyc', 'PYMODULE'), ('pyi_importers', 'c:\\python27\\lib\\site-packages\\PyInstaller\\loader\\pyi_importers.pyc', 'PYMODULE'), ('_pyi_bootstrap', 'c:\\python27\\lib\\site-packages\\PyInstaller\\loader\\_pyi_bootstrap.py', 'PYSOURCE'), ('pyi_carchive', 'c:\\python27\\lib\\site-packages\\PyInstaller\\loader\\pyi_carchive.py', 'PYSOURCE'), ('cliente', 'cliente.py', 'PYSOURCE'), ('python27.dll', 'C:\\WINDOWS\\system32\\python27.dll', 'BINARY'), ('win32pipe', 'c:\\python27\\lib\\site-packages\\win32\\win32pipe.pyd', 'EXTENSION'), ('select', 'c:\\python27\\DLLs\\select.pyd', 'EXTENSION'), ('unicodedata', 'c:\\python27\\DLLs\\unicodedata.pyd', 'EXTENSION'), ('_hashlib', 'c:\\python27\\DLLs\\_hashlib.pyd', 'EXTENSION'), ('bz2', 'c:\\python27\\DLLs\\bz2.pyd', 'EXTENSION'), ('_ssl', 'c:\\python27\\DLLs\\_ssl.pyd', 'EXTENSION'), ('_ctypes', 'c:\\python27\\DLLs\\_ctypes.pyd', 'EXTENSION'), ('gdi32', 'C:\\WINDOWS\\system32\\gdi32.dll', 'BINARY'), ('user32', 'C:\\WINDOWS\\system32\\user32.dll', 'BINARY'), ('pyexpat', 'c:\\python27\\DLLs\\pyexpat.pyd', 'EXTENSION'), ('_socket', 'c:\\python27\\DLLs\\_socket.pyd', 'EXTENSION'), ('pywintypes27.dll', 'c:\\python27\\lib\\site-packages\\pywin32_system32\\pywintypes27.dll', 'BINARY'), ('cliente.exe.manifest', 'C:\\Users\\DEIBIS\\Documents\\sockestpython\\build\\cliente\\cliente.exe.manifest', 'BINARY')],
 False,
 None,
 False)
