(['c:\\python27\\lib\\site-packages\\PyInstaller\\loader\\_pyi_bootstrap.py',
  'c:\\python27\\lib\\site-packages\\PyInstaller\\loader\\pyi_importers.py',
  'c:\\python27\\lib\\site-packages\\PyInstaller\\loader\\pyi_archive.py',
  'c:\\python27\\lib\\site-packages\\PyInstaller\\loader\\pyi_carchive.py',
  'c:\\python27\\lib\\site-packages\\PyInstaller\\loader\\pyi_os_path.py',
  'cliente.py'],
 ['C:\\Users\\DEIBIS\\Documents\\sockestpython'],
 None,
 None,
 [('_pyi_bootstrap', 'c:\\python27\\lib\\site-packages\\PyInstaller\\loader\\_pyi_bootstrap.py', 'PYSOURCE'), ('pyi_importers', 'c:\\python27\\lib\\site-packages\\PyInstaller\\loader\\pyi_importers.py', 'PYSOURCE'), ('pyi_archive', 'c:\\python27\\lib\\site-packages\\PyInstaller\\loader\\pyi_archive.py', 'PYSOURCE'), ('pyi_carchive', 'c:\\python27\\lib\\site-packages\\PyInstaller\\loader\\pyi_carchive.py', 'PYSOURCE'), ('pyi_os_path', 'c:\\python27\\lib\\site-packages\\PyInstaller\\loader\\pyi_os_path.py', 'PYSOURCE'), ('cliente', 'cliente.py', 'PYSOURCE')],
 [('encodings.cp932', 'c:\\python27\\lib\\encodings\\cp932.pyc', 'PYMODULE'), ('encodings.cp424', 'c:\\python27\\lib\\encodings\\cp424.pyc', 'PYMODULE'), ('encodings.big5', 'c:\\python27\\lib\\encodings\\big5.pyc', 'PYMODULE'), ('encodings.cp1140', 'c:\\python27\\lib\\encodings\\cp1140.pyc', 'PYMODULE'), ('pprint', 'c:\\python27\\lib\\pprint.pyc', 'PYMODULE'), ('encodings.euc_jis_2004', 'c:\\python27\\lib\\encodings\\euc_jis_2004.pyc', 'PYMODULE'), ('encodings.utf_7', 'c:\\python27\\lib\\encodings\\utf_7.pyc', 'PYMODULE'), ('string', 'c:\\python27\\lib\\string.pyc', 'PYMODULE'), ('SocketServer', 'c:\\python27\\lib\\SocketServer.pyc', 'PYMODULE'), ('chardet.euckrprober', 'c:\\python27\\lib\\site-packages\\chardet\\euckrprober.pyc', 'PYMODULE'), ('encodings.utf_8', 'c:\\python27\\lib\\encodings\\utf_8.pyc', 'PYMODULE'), ('chardet.mbcssm', 'c:\\python27\\lib\\site-packages\\chardet\\mbcssm.pyc', 'PYMODULE'), ('email.quoprimime', 'c:\\python27\\lib\\email\\quoprimime.pyc', 'PYMODULE'), ('json.encoder', 'c:\\python27\\lib\\json\\encoder.pyc', 'PYMODULE'), ('urllib3.util.retry', 'c:\\python27\\lib\\site-packages\\urllib3\\util\\retry.pyc', 'PYMODULE'), ('cmd', 'c:\\python27\\lib\\cmd.pyc', 'PYMODULE'), ('os2emxpath', 'c:\\python27\\lib\\os2emxpath.pyc', 'PYMODULE'), ('encodings.iso8859_9', 'c:\\python27\\lib\\encodings\\iso8859_9.pyc', 'PYMODULE'), ('encodings.iso8859_8', 'c:\\python27\\lib\\encodings\\iso8859_8.pyc', 'PYMODULE'), ('mss.base', 'c:\\python27\\lib\\site-packages\\mss\\base.pyc', 'PYMODULE'), ('shlex', 'c:\\python27\\lib\\shlex.pyc', 'PYMODULE'), ('certifi.core', 'c:\\python27\\lib\\site-packages\\certifi\\core.pyc', 'PYMODULE'), ('encodings.iso8859_3', 'c:\\python27\\lib\\encodings\\iso8859_3.pyc', 'PYMODULE'), ('encodings.iso8859_2', 'c:\\python27\\lib\\encodings\\iso8859_2.pyc', 'PYMODULE'), ('encodings.iso8859_1', 'c:\\python27\\lib\\encodings\\iso8859_1.pyc', 'PYMODULE'), ('encodings.iso8859_7', 'c:\\python27\\lib\\encodings\\iso8859_7.pyc', 'PYMODULE'), ('encodings.iso8859_6', 'c:\\python27\\lib\\encodings\\iso8859_6.pyc', 'PYMODULE'), ('encodings.iso8859_5', 'c:\\python27\\lib\\encodings\\iso8859_5.pyc', 'PYMODULE'), ('encodings.iso8859_4', 'c:\\python27\\lib\\encodings\\iso8859_4.pyc', 'PYMODULE'), ('urllib3.util.response', 'c:\\python27\\lib\\site-packages\\urllib3\\util\\response.pyc', 'PYMODULE'), ('idna.intranges', 'c:\\python27\\lib\\site-packages\\idna\\intranges.pyc', 'PYMODULE'), ('encodings.gbk', 'c:\\python27\\lib\\encodings\\gbk.pyc', 'PYMODULE'), ('abc', 'c:\\python27\\lib\\abc.pyc', 'PYMODULE'), ('bdb', 'c:\\python27\\lib\\bdb.pyc', 'PYMODULE'), ('py_compile', 'c:\\python27\\lib\\py_compile.pyc', 'PYMODULE'), ('encodings.palmos', 'c:\\python27\\lib\\encodings\\palmos.pyc', 'PYMODULE'), ('tarfile', 'c:\\python27\\lib\\tarfile.pyc', 'PYMODULE'), ('ntpath', 'c:\\python27\\lib\\ntpath.pyc', 'PYMODULE'), ('urllib3.packages', 'c:\\python27\\lib\\site-packages\\urllib3\\packages\\__init__.pyc', 'PYMODULE'), ('optparse', 'c:\\python27\\lib\\optparse.pyc', 'PYMODULE'), ('unittest.suite', 'c:\\python27\\lib\\unittest\\suite.pyc', 'PYMODULE'), ('encodings.iso2022_jp_1', 'c:\\python27\\lib\\encodings\\iso2022_jp_1.pyc', 'PYMODULE'), ('encodings.iso2022_jp_3', 'c:\\python27\\lib\\encodings\\iso2022_jp_3.pyc', 'PYMODULE'), ('encodings.iso2022_jp_2', 'c:\\python27\\lib\\encodings\\iso2022_jp_2.pyc', 'PYMODULE'), ('json.scanner', 'c:\\python27\\lib\\json\\scanner.pyc', 'PYMODULE'), ('codecs', 'c:\\python27\\lib\\codecs.pyc', 'PYMODULE'), ('urllib3.util.timeout', 'c:\\python27\\lib\\site-packages\\urllib3\\util\\timeout.pyc', 'PYMODULE'), ('email.header', 'c:\\python27\\lib\\email\\header.pyc', 'PYMODULE'), ('StringIO', 'c:\\python27\\lib\\StringIO.pyc', 'PYMODULE'), ('pydoc_data.topics', 'c:\\python27\\lib\\pydoc_data\\topics.pyc', 'PYMODULE'), ('weakref', 'c:\\python27\\lib\\weakref.pyc', 'PYMODULE'), ('doctest', 'c:\\python27\\lib\\doctest.pyc', 'PYMODULE'), ('encodings.cp720', 'c:\\python27\\lib\\encodings\\cp720.pyc', 'PYMODULE'), ('urllib3.contrib.pyopenssl', 'c:\\python27\\lib\\site-packages\\urllib3\\contrib\\pyopenssl.pyc', 'PYMODULE'), ('base64', 'c:\\python27\\lib\\base64.pyc', 'PYMODULE'), ('encodings.cp875', 'c:\\python27\\lib\\encodings\\cp875.pyc', 'PYMODULE'), ('encodings.cp874', 'c:\\python27\\lib\\encodings\\cp874.pyc', 'PYMODULE'), ('chardet.sbcharsetprober', 'c:\\python27\\lib\\site-packages\\chardet\\sbcharsetprober.pyc', 'PYMODULE'), ('email.charset', 'c:\\python27\\lib\\email\\charset.pyc', 'PYMODULE'), ('encodings.punycode', 'c:\\python27\\lib\\encodings\\punycode.pyc', 'PYMODULE'), ('requests.api', 'c:\\python27\\lib\\site-packages\\requests\\api.pyc', 'PYMODULE'), ('encodings.cp1258', 'c:\\python27\\lib\\encodings\\cp1258.pyc', 'PYMODULE'), ('encodings.cp1257', 'c:\\python27\\lib\\encodings\\cp1257.pyc', 'PYMODULE'), ('encodings.latin_1', 'c:\\python27\\lib\\encodings\\latin_1.pyc', 'PYMODULE'), ('tokenize', 'c:\\python27\\lib\\tokenize.pyc', 'PYMODULE'), ('encodings.charmap', 'c:\\python27\\lib\\encodings\\charmap.pyc', 'PYMODULE'), ('requests.structures', 'c:\\python27\\lib\\site-packages\\requests\\structures.pyc', 'PYMODULE'), ('urllib3.packages.backports.makefile', 'c:\\python27\\lib\\site-packages\\urllib3\\packages\\backports\\makefile.pyc', 'PYMODULE'), ('urllib3.util.ssltransport', 'c:\\python27\\lib\\site-packages\\urllib3\\util\\ssltransport.pyc', 'PYMODULE'), ('webbrowser', 'c:\\python27\\lib\\webbrowser.pyc', 'PYMODULE'), ('urllib3.util.wait', 'c:\\python27\\lib\\site-packages\\urllib3\\util\\wait.pyc', 'PYMODULE'), ('pyi_archive', 'c:\\python27\\lib\\site-packages\\PyInstaller\\loader\\pyi_archive.pyc', 'PYMODULE'), ('encodings.iso2022_kr', 'c:\\python27\\lib\\encodings\\iso2022_kr.pyc', 'PYMODULE'), ('encodings.aliases', 'c:\\python27\\lib\\encodings\\aliases.pyc', 'PYMODULE'), ('fnmatch', 'c:\\python27\\lib\\fnmatch.pyc', 'PYMODULE'), ('sre_parse', 'c:\\python27\\lib\\sre_parse.pyc', 'PYMODULE'), ('pickle', 'c:\\python27\\lib\\pickle.pyc', 'PYMODULE'), ('encodings.hz', 'c:\\python27\\lib\\encodings\\hz.pyc', 'PYMODULE'), ('chardet.sbcsgroupprober', 'c:\\python27\\lib\\site-packages\\chardet\\sbcsgroupprober.pyc', 'PYMODULE'), ('encodings.utf_16', 'c:\\python27\\lib\\encodings\\utf_16.pyc', 'PYMODULE'), ('encodings.cp1256', 'c:\\python27\\lib\\encodings\\cp1256.pyc', 'PYMODULE'), ('encodings.cp1255', 'c:\\python27\\lib\\encodings\\cp1255.pyc', 'PYMODULE'), ('encodings.cp1254', 'c:\\python27\\lib\\encodings\\cp1254.pyc', 'PYMODULE'), ('encodings.cp1253', 'c:\\python27\\lib\\encodings\\cp1253.pyc', 'PYMODULE'), ('encodings.cp1252', 'c:\\python27\\lib\\encodings\\cp1252.pyc', 'PYMODULE'), ('encodings.cp1251', 'c:\\python27\\lib\\encodings\\cp1251.pyc', 'PYMODULE'), ('encodings.cp1250', 'c:\\python27\\lib\\encodings\\cp1250.pyc', 'PYMODULE'), ('mss.screenshot', 'c:\\python27\\lib\\site-packages\\mss\\screenshot.pyc', 'PYMODULE'), ('chardet.version', 'c:\\python27\\lib\\site-packages\\chardet\\version.pyc', 'PYMODULE'), ('requests.exceptions', 'c:\\python27\\lib\\site-packages\\requests\\exceptions.pyc', 'PYMODULE'), ('chardet.euctwfreq', 'c:\\python27\\lib\\site-packages\\chardet\\euctwfreq.pyc', 'PYMODULE'), ('email.message', 'c:\\python27\\lib\\email\\message.pyc', 'PYMODULE'), ('urllib3.fields', 'c:\\python27\\lib\\site-packages\\urllib3\\fields.pyc', 'PYMODULE'), ('shutil', 'c:\\python27\\lib\\shutil.pyc', 'PYMODULE'), ('encodings.shift_jis', 'c:\\python27\\lib\\encodings\\shift_jis.pyc', 'PYMODULE'), ('ctypes.util', 'c:\\python27\\lib\\ctypes\\util.pyc', 'PYMODULE'), ('encodings.shift_jisx0213', 'c:\\python27\\lib\\encodings\\shift_jisx0213.pyc', 'PYMODULE'), ('chardet.jpcntx', 'c:\\python27\\lib\\site-packages\\chardet\\jpcntx.pyc', 'PYMODULE'), ('ctypes.macholib.framework', 'c:\\python27\\lib\\ctypes\\macholib\\framework.pyc', 'PYMODULE'), ('email.parser', 'c:\\python27\\lib\\email\\parser.pyc', 'PYMODULE'), ('types', 'c:\\python27\\lib\\types.pyc', 'PYMODULE'), ('urllib3.packages.six', 'c:\\python27\\lib\\site-packages\\urllib3\\packages\\six.pyc', 'PYMODULE'), ('email.base64mime', 'c:\\python27\\lib\\email\\base64mime.pyc', 'PYMODULE'), ('email.mime.multipart', 'c:\\python27\\lib\\email\\mime\\multipart.pyc', 'PYMODULE'), ('email.generator', 'c:\\python27\\lib\\email\\generator.pyc', 'PYMODULE'), ('_weakrefset', 'c:\\python27\\lib\\_weakrefset.pyc', 'PYMODULE'), ('urllib3.connectionpool', 'c:\\python27\\lib\\site-packages\\urllib3\\connectionpool.pyc', 'PYMODULE'), ('idna.idnadata', 'c:\\python27\\lib\\site-packages\\idna\\idnadata.pyc', 'PYMODULE'), ('tty', 'c:\\python27\\lib\\tty.pyc', 'PYMODULE'), ('functools', 'c:\\python27\\lib\\functools.pyc', 'PYMODULE'), ('email.mime.text', 'c:\\python27\\lib\\email\\mime\\text.pyc', 'PYMODULE'), ('urllib3.exceptions', 'c:\\python27\\lib\\site-packages\\urllib3\\exceptions.pyc', 'PYMODULE'), ('urllib3.util.request', 'c:\\python27\\lib\\site-packages\\urllib3\\util\\request.pyc', 'PYMODULE'), ('tempfile', 'c:\\python27\\lib\\tempfile.pyc', 'PYMODULE'), ('chardet.cp949prober', 'c:\\python27\\lib\\site-packages\\chardet\\cp949prober.pyc', 'PYMODULE'), ('chardet.charsetprober', 'c:\\python27\\lib\\site-packages\\chardet\\charsetprober.pyc', 'PYMODULE'), ('requests.adapters', 'c:\\python27\\lib\\site-packages\\requests\\adapters.pyc', 'PYMODULE'), ('chardet.sjisprober', 'c:\\python27\\lib\\site-packages\\chardet\\sjisprober.pyc', 'PYMODULE'), ('unittest.util', 'c:\\python27\\lib\\unittest\\util.pyc', 'PYMODULE'), ('encodings.base64_codec', 'c:\\python27\\lib\\encodings\\base64_codec.pyc', 'PYMODULE'), ('httplib', 'c:\\python27\\lib\\httplib.pyc', 'PYMODULE'), ('bisect', 'c:\\python27\\lib\\bisect.pyc', 'PYMODULE'), ('token', 'c:\\python27\\lib\\token.pyc', 'PYMODULE'), ('email.encoders', 'c:\\python27\\lib\\email\\encoders.pyc', 'PYMODULE'), ('mss', 'c:\\python27\\lib\\site-packages\\mss\\__init__.pyc', 'PYMODULE'), ('chunk', 'c:\\python27\\lib\\chunk.pyc', 'PYMODULE'), ('encodings', 'c:\\python27\\lib\\encodings\\__init__.pyc', 'PYMODULE'), ('BaseHTTPServer', 'c:\\python27\\lib\\BaseHTTPServer.pyc', 'PYMODULE'), ('pydoc', 'c:\\python27\\lib\\pydoc.pyc', 'PYMODULE'), ('re', 'c:\\python27\\lib\\re.pyc', 'PYMODULE'), ('encodings.utf_8_sig', 'c:\\python27\\lib\\encodings\\utf_8_sig.pyc', 'PYMODULE'), ('urllib3.contrib.socks', 'c:\\python27\\lib\\site-packages\\urllib3\\contrib\\socks.pyc', 'PYMODULE'), ('chardet.langhebrewmodel', 'c:\\python27\\lib\\site-packages\\chardet\\langhebrewmodel.pyc', 'PYMODULE'), ('encodings.uu_codec', 'c:\\python27\\lib\\encodings\\uu_codec.pyc', 'PYMODULE'), ('chardet.langturkishmodel', 'c:\\python27\\lib\\site-packages\\chardet\\langturkishmodel.pyc', 'PYMODULE'), ('logging', 'c:\\python27\\lib\\logging\\__init__.pyc', 'PYMODULE'), ('encodings.euc_jisx0213', 'c:\\python27\\lib\\encodings\\euc_jisx0213.pyc', 'PYMODULE'), ('traceback', 'c:\\python27\\lib\\traceback.pyc', 'PYMODULE'), ('chardet.latin1prober', 'c:\\python27\\lib\\site-packages\\chardet\\latin1prober.pyc', 'PYMODULE'), ('encodings.iso2022_jp_2004', 'c:\\python27\\lib\\encodings\\iso2022_jp_2004.pyc', 'PYMODULE'), ('encodings.zlib_codec', 'c:\\python27\\lib\\encodings\\zlib_codec.pyc', 'PYMODULE'), ('dummy_threading', 'c:\\python27\\lib\\dummy_threading.pyc', 'PYMODULE'), ('dis', 'c:\\python27\\lib\\dis.pyc', 'PYMODULE'), ('chardet.universaldetector', 'c:\\python27\\lib\\site-packages\\chardet\\universaldetector.pyc', 'PYMODULE'), ('urllib3.contrib._appengine_environ', 'c:\\python27\\lib\\site-packages\\urllib3\\contrib\\_appengine_environ.pyc', 'PYMODULE'), ('email.mime.image', 'c:\\python27\\lib\\email\\mime\\image.pyc', 'PYMODULE'), ('encodings.mac_centeuro', 'c:\\python27\\lib\\encodings\\mac_centeuro.pyc', 'PYMODULE'), ('_LWPCookieJar', 'c:\\python27\\lib\\_LWPCookieJar.pyc', 'PYMODULE'), ('posixpath', 'c:\\python27\\lib\\posixpath.pyc', 'PYMODULE'), ('urllib3.request', 'c:\\python27\\lib\\site-packages\\urllib3\\request.pyc', 'PYMODULE'), ('encodings.cp737', 'c:\\python27\\lib\\encodings\\cp737.pyc', 'PYMODULE'), ('encodings.utf_16_be', 'c:\\python27\\lib\\encodings\\utf_16_be.pyc', 'PYMODULE'), ('xml.sax.handler', 'c:\\python27\\lib\\xml\\sax\\handler.pyc', 'PYMODULE'), ('xml.sax.expatreader', 'c:\\python27\\lib\\xml\\sax\\expatreader.pyc', 'PYMODULE'), ('email.feedparser', 'c:\\python27\\lib\\email\\feedparser.pyc', 'PYMODULE'), ('ctypes.macholib.dyld', 'c:\\python27\\lib\\ctypes\\macholib\\dyld.pyc', 'PYMODULE'), ('copy', 'c:\\python27\\lib\\copy.pyc', 'PYMODULE'), ('hashlib', 'c:\\python27\\lib\\hashlib.pyc', 'PYMODULE'), ('keyword', 'c:\\python27\\lib\\keyword.pyc', 'PYMODULE'), ('xml.sax.saxutils', 'c:\\python27\\lib\\xml\\sax\\saxutils.pyc', 'PYMODULE'), ('stringprep', 'c:\\python27\\lib\\stringprep.pyc', 'PYMODULE'), ('encodings.unicode_internal', 'c:\\python27\\lib\\encodings\\unicode_internal.pyc', 'PYMODULE'), ('chardet', 'c:\\python27\\lib\\site-packages\\chardet\\__init__.pyc', 'PYMODULE'), ('encodings.mac_turkish', 'c:\\python27\\lib\\encodings\\mac_turkish.pyc', 'PYMODULE'), ('chardet.escsm', 'c:\\python27\\lib\\site-packages\\chardet\\escsm.pyc', 'PYMODULE'), ('encodings.mac_cyrillic', 'c:\\python27\\lib\\encodings\\mac_cyrillic.pyc', 'PYMODULE'), ('chardet.utf8prober', 'c:\\python27\\lib\\site-packages\\chardet\\utf8prober.pyc', 'PYMODULE'), ('encodings.euc_jp', 'c:\\python27\\lib\\encodings\\euc_jp.pyc', 'PYMODULE'), ('sre_compile', 'c:\\python27\\lib\\sre_compile.pyc', 'PYMODULE'), ('difflib', 'c:\\python27\\lib\\difflib.pyc', 'PYMODULE'), ('getpass', 'c:\\python27\\lib\\getpass.pyc', 'PYMODULE'), ('encodings.string_escape', 'c:\\python27\\lib\\encodings\\string_escape.pyc', 'PYMODULE'), ('unittest.result', 'c:\\python27\\lib\\unittest\\result.pyc', 'PYMODULE'), ('encodings.quopri_codec', 'c:\\python27\\lib\\encodings\\quopri_codec.pyc', 'PYMODULE'), ('encodings.mac_latin2', 'c:\\python27\\lib\\encodings\\mac_latin2.pyc', 'PYMODULE'), ('encodings.cp869', 'c:\\python27\\lib\\encodings\\cp869.pyc', 'PYMODULE'), ('encodings.cp866', 'c:\\python27\\lib\\encodings\\cp866.pyc', 'PYMODULE'), ('encodings.cp864', 'c:\\python27\\lib\\encodings\\cp864.pyc', 'PYMODULE'), ('encodings.cp865', 'c:\\python27\\lib\\encodings\\cp865.pyc', 'PYMODULE'), ('encodings.cp862', 'c:\\python27\\lib\\encodings\\cp862.pyc', 'PYMODULE'), ('encodings.cp863', 'c:\\python27\\lib\\encodings\\cp863.pyc', 'PYMODULE'), ('encodings.cp860', 'c:\\python27\\lib\\encodings\\cp860.pyc', 'PYMODULE'), ('encodings.cp861', 'c:\\python27\\lib\\encodings\\cp861.pyc', 'PYMODULE'), ('warnings', 'c:\\python27\\lib\\warnings.pyc', 'PYMODULE'), ('glob', 'c:\\python27\\lib\\glob.pyc', 'PYMODULE'), ('pyi_importers', 'c:\\python27\\lib\\site-packages\\PyInstaller\\loader\\pyi_importers.pyc', 'PYMODULE'), ('plistlib', 'c:\\python27\\lib\\plistlib.pyc', 'PYMODULE'), ('xml.parsers', 'c:\\python27\\lib\\xml\\parsers\\__init__.pyc', 'PYMODULE'), ('ctypes.macholib', 'c:\\python27\\lib\\ctypes\\macholib\\__init__.pyc', 'PYMODULE'), ('linecache', 'c:\\python27\\lib\\linecache.pyc', 'PYMODULE'), ('encodings.rot_13', 'c:\\python27\\lib\\encodings\\rot_13.pyc', 'PYMODULE'), ('hmac', 'c:\\python27\\lib\\hmac.pyc', 'PYMODULE'), ('email.iterators', 'c:\\python27\\lib\\email\\iterators.pyc', 'PYMODULE'), ('random', 'c:\\python27\\lib\\random.pyc', 'PYMODULE'), ('subprocess', 'c:\\python27\\lib\\subprocess.pyc', 'PYMODULE'), ('ctypes._endian', 'c:\\python27\\lib\\ctypes\\_endian.pyc', 'PYMODULE'), ('encodings.iso2022_jp_ext', 'c:\\python27\\lib\\encodings\\iso2022_jp_ext.pyc', 'PYMODULE'), ('xml', 'c:\\python27\\lib\\xml\\__init__.pyc', 'PYMODULE'), ('importlib', 'c:\\python27\\lib\\importlib\\__init__.pyc', 'PYMODULE'), ('requests.sessions', 'c:\\python27\\lib\\site-packages\\requests\\sessions.pyc', 'PYMODULE'), ('urllib3.connection', 'c:\\python27\\lib\\site-packages\\urllib3\\connection.pyc', 'PYMODULE'), ('encodings.cp775', 'c:\\python27\\lib\\encodings\\cp775.pyc', 'PYMODULE'), ('requests.utils', 'c:\\python27\\lib\\site-packages\\requests\\utils.pyc', 'PYMODULE'), ('encodings.mac_arabic', 'c:\\python27\\lib\\encodings\\mac_arabic.pyc', 'PYMODULE'), ('zipfile', 'c:\\python27\\lib\\zipfile.pyc', 'PYMODULE'), ('repr', 'c:\\python27\\lib\\repr.pyc', 'PYMODULE'), ('ssl', 'c:\\python27\\lib\\ssl.pyc', 'PYMODULE'), ('cookielib', 'c:\\python27\\lib\\cookielib.pyc', 'PYMODULE'), ('_MozillaCookieJar', 'c:\\python27\\lib\\_MozillaCookieJar.pyc', 'PYMODULE'), ('encodings.koi8_u', 'c:\\python27\\lib\\encodings\\koi8_u.pyc', 'PYMODULE'), ('threading', 'c:\\python27\\lib\\threading.pyc', 'PYMODULE'), ('urllib3._version', 'c:\\python27\\lib\\site-packages\\urllib3\\_version.pyc', 'PYMODULE'), ('encodings.gb2312', 'c:\\python27\\lib\\encodings\\gb2312.pyc', 'PYMODULE'), ('ctypes.wintypes', 'c:\\python27\\lib\\ctypes\\wintypes.pyc', 'PYMODULE'), ('encodings.cp857', 'c:\\python27\\lib\\encodings\\cp857.pyc', 'PYMODULE'), ('encodings.cp856', 'c:\\python27\\lib\\encodings\\cp856.pyc', 'PYMODULE'), ('encodings.cp855', 'c:\\python27\\lib\\encodings\\cp855.pyc', 'PYMODULE'), ('urllib3.packages.backports', 'c:\\python27\\lib\\site-packages\\urllib3\\packages\\backports\\__init__.pyc', 'PYMODULE'), ('encodings.cp852', 'c:\\python27\\lib\\encodings\\cp852.pyc', 'PYMODULE'), ('encodings.cp850', 'c:\\python27\\lib\\encodings\\cp850.pyc', 'PYMODULE'), ('locale', 'c:\\python27\\lib\\locale.pyc', 'PYMODULE'), ('encodings.cp858', 'c:\\python27\\lib\\encodings\\cp858.pyc', 'PYMODULE'), ('atexit', 'c:\\python27\\lib\\atexit.pyc', 'PYMODULE'), ('pydoc_data', 'c:\\python27\\lib\\pydoc_data\\__init__.pyc', 'PYMODULE'), ('chardet.euckrfreq', 'c:\\python27\\lib\\site-packages\\chardet\\euckrfreq.pyc', 'PYMODULE'), ('requests.status_codes', 'c:\\python27\\lib\\site-packages\\requests\\status_codes.pyc', 'PYMODULE'), ('calendar', 'c:\\python27\\lib\\calendar.pyc', 'PYMODULE'), ('requests.auth', 'c:\\python27\\lib\\site-packages\\requests\\auth.pyc', 'PYMODULE'), ('encodings.shift_jis_2004', 'c:\\python27\\lib\\encodings\\shift_jis_2004.pyc', 'PYMODULE'), ('chardet.big5prober', 'c:\\python27\\lib\\site-packages\\chardet\\big5prober.pyc', 'PYMODULE'), ('encodings.mac_greek', 'c:\\python27\\lib\\encodings\\mac_greek.pyc', 'PYMODULE'), ('urllib', 'c:\\python27\\lib\\urllib.pyc', 'PYMODULE'), ('chardet.chardistribution', 'c:\\python27\\lib\\site-packages\\chardet\\chardistribution.pyc', 'PYMODULE'), ('encodings.koi8_r', 'c:\\python27\\lib\\encodings\\koi8_r.pyc', 'PYMODULE'), ('formatter', 'c:\\python27\\lib\\formatter.pyc', 'PYMODULE'), ('urllib3.util.connection', 'c:\\python27\\lib\\site-packages\\urllib3\\util\\connection.pyc', 'PYMODULE'), ('email', 'c:\\python27\\lib\\email\\__init__.pyc', 'PYMODULE'), ('chardet.mbcsgroupprober', 'c:\\python27\\lib\\site-packages\\chardet\\mbcsgroupprober.pyc', 'PYMODULE'), ('ftplib', 'c:\\python27\\lib\\ftplib.pyc', 'PYMODULE'), ('chardet.mbcharsetprober', 'c:\\python27\\lib\\site-packages\\chardet\\mbcharsetprober.pyc', 'PYMODULE'), ('encodings.cp1026', 'c:\\python27\\lib\\encodings\\cp1026.pyc', 'PYMODULE'), ('encodings.undefined', 'c:\\python27\\lib\\encodings\\undefined.pyc', 'PYMODULE'), ('encodings.utf_16_le', 'c:\\python27\\lib\\encodings\\utf_16_le.pyc', 'PYMODULE'), ('chardet.escprober', 'c:\\python27\\lib\\site-packages\\chardet\\escprober.pyc', 'PYMODULE'), ('ctypes', 'c:\\python27\\lib\\ctypes\\__init__.pyc', 'PYMODULE'), ('requests.models', 'c:\\python27\\lib\\site-packages\\requests\\models.pyc', 'PYMODULE'), ('chardet.langrussianmodel', 'c:\\python27\\lib\\site-packages\\chardet\\langrussianmodel.pyc', 'PYMODULE'), ('requests.__version__', 'c:\\python27\\lib\\site-packages\\requests\\__version__.pyc', 'PYMODULE'), ('Queue', 'c:\\python27\\lib\\Queue.pyc', 'PYMODULE'), ('encodings.ptcp154', 'c:\\python27\\lib\\encodings\\ptcp154.pyc', 'PYMODULE'), ('mss.linux', 'c:\\python27\\lib\\site-packages\\mss\\linux.pyc', 'PYMODULE'), ('opcode', 'c:\\python27\\lib\\opcode.pyc', 'PYMODULE'), ('requests', 'c:\\python27\\lib\\site-packages\\requests\\__init__.pyc', 'PYMODULE'), ('pdb', 'c:\\python27\\lib\\pdb.pyc', 'PYMODULE'), ('unittest', 'c:\\python27\\lib\\unittest\\__init__.pyc', 'PYMODULE'), ('urllib3.poolmanager', 'c:\\python27\\lib\\site-packages\\urllib3\\poolmanager.pyc', 'PYMODULE'), ('mss.tools', 'c:\\python27\\lib\\site-packages\\mss\\tools.pyc', 'PYMODULE'), ('encodings.bz2_codec', 'c:\\python27\\lib\\encodings\\bz2_codec.pyc', 'PYMODULE'), ('dummy_thread', 'c:\\python27\\lib\\dummy_thread.pyc', 'PYMODULE'), ('encodings.unicode_escape', 'c:\\python27\\lib\\encodings\\unicode_escape.pyc', 'PYMODULE'), ('encodings.mac_croatian', 'c:\\python27\\lib\\encodings\\mac_croatian.pyc', 'PYMODULE'), ('pkgutil', 'c:\\python27\\lib\\pkgutil.pyc', 'PYMODULE'), ('platform', 'c:\\python27\\lib\\platform.pyc', 'PYMODULE'), ('sre_constants', 'c:\\python27\\lib\\sre_constants.pyc', 'PYMODULE'), ('json', 'c:\\python27\\lib\\json\\__init__.pyc', 'PYMODULE'), ('urllib3.contrib', 'c:\\python27\\lib\\site-packages\\urllib3\\contrib\\__init__.pyc', 'PYMODULE'), ('encodings.utf_32', 'c:\\python27\\lib\\encodings\\utf_32.pyc', 'PYMODULE'), ('certifi', 'c:\\python27\\lib\\site-packages\\certifi\\__init__.pyc', 'PYMODULE'), ('urllib3.filepost', 'c:\\python27\\lib\\site-packages\\urllib3\\filepost.pyc', 'PYMODULE'), ('encodings.hp_roman8', 'c:\\python27\\lib\\encodings\\hp_roman8.pyc', 'PYMODULE'), ('urllib3.util.ssl_match_hostname', 'c:\\python27\\lib\\site-packages\\urllib3\\util\\ssl_match_hostname.pyc', 'PYMODULE'), ('mss.windows', 'c:\\python27\\lib\\site-packages\\mss\\windows.pyc', 'PYMODULE'), ('email.utils', 'c:\\python27\\lib\\email\\utils.pyc', 'PYMODULE'), ('chardet.codingstatemachine', 'c:\\python27\\lib\\site-packages\\chardet\\codingstatemachine.pyc', 'PYMODULE'), ('nturl2path', 'c:\\python27\\lib\\nturl2path.pyc', 'PYMODULE'), ('encodings.iso8859_16', 'c:\\python27\\lib\\encodings\\iso8859_16.pyc', 'PYMODULE'), ('encodings.iso8859_15', 'c:\\python27\\lib\\encodings\\iso8859_15.pyc', 'PYMODULE'), ('encodings.iso8859_14', 'c:\\python27\\lib\\encodings\\iso8859_14.pyc', 'PYMODULE'), ('encodings.iso8859_13', 'c:\\python27\\lib\\encodings\\iso8859_13.pyc', 'PYMODULE'), ('encodings.iso8859_11', 'c:\\python27\\lib\\encodings\\iso8859_11.pyc', 'PYMODULE'), ('encodings.iso8859_10', 'c:\\python27\\lib\\encodings\\iso8859_10.pyc', 'PYMODULE'), ('urllib3.util.url', 'c:\\python27\\lib\\site-packages\\urllib3\\util\\url.pyc', 'PYMODULE'), ('idna.uts46data', 'c:\\python27\\lib\\site-packages\\idna\\uts46data.pyc', 'PYMODULE'), ('json.decoder', 'c:\\python27\\lib\\json\\decoder.pyc', 'PYMODULE'), ('chardet.langbulgarianmodel', 'c:\\python27\\lib\\site-packages\\chardet\\langbulgarianmodel.pyc', 'PYMODULE'), ('copy_reg', 'c:\\python27\\lib\\copy_reg.pyc', 'PYMODULE'), ('site', 'c:\\python27\\lib\\site-packages\\PyInstaller\\fake\\fake-site.pyc', 'PYMODULE'), ('email.mime.message', 'c:\\python27\\lib\\email\\mime\\message.pyc', 'PYMODULE'), ('io', 'c:\\python27\\lib\\io.pyc', 'PYMODULE'), ('sndhdr', 'c:\\python27\\lib\\sndhdr.pyc', 'PYMODULE'), ('encodings.utf_32_be', 'c:\\python27\\lib\\encodings\\utf_32_be.pyc', 'PYMODULE'), ('chardet.gb2312freq', 'c:\\python27\\lib\\site-packages\\chardet\\gb2312freq.pyc', 'PYMODULE'), ('idna.package_data', 'c:\\python27\\lib\\site-packages\\idna\\package_data.pyc', 'PYMODULE'), ('encodings.hex_codec', 'c:\\python27\\lib\\encodings\\hex_codec.pyc', 'PYMODULE'), ('chardet.euctwprober', 'c:\\python27\\lib\\site-packages\\chardet\\euctwprober.pyc', 'PYMODULE'), ('rfc822', 'c:\\python27\\lib\\rfc822.pyc', 'PYMODULE'), ('chardet.enums', 'c:\\python27\\lib\\site-packages\\chardet\\enums.pyc', 'PYMODULE'), ('encodings.idna', 'c:\\python27\\lib\\encodings\\idna.pyc', 'PYMODULE'), ('requests.hooks', 'c:\\python27\\lib\\site-packages\\requests\\hooks.pyc', 'PYMODULE'), ('urlparse', 'c:\\python27\\lib\\urlparse.pyc', 'PYMODULE'), ('encodings.cp950', 'c:\\python27\\lib\\encodings\\cp950.pyc', 'PYMODULE'), ('gzip', 'c:\\python27\\lib\\gzip.pyc', 'PYMODULE'), ('heapq', 'c:\\python27\\lib\\heapq.pyc', 'PYMODULE'), ('encodings.johab', 'c:\\python27\\lib\\encodings\\johab.pyc', 'PYMODULE'), ('unittest.case', 'c:\\python27\\lib\\unittest\\case.pyc', 'PYMODULE'), ('aifc', 'c:\\python27\\lib\\aifc.pyc', 'PYMODULE'), ('requests._internal_utils', 'c:\\python27\\lib\\site-packages\\requests\\_internal_utils.pyc', 'PYMODULE'), ('email.mime', 'c:\\python27\\lib\\email\\mime\\__init__.pyc', 'PYMODULE'), ('struct', 'c:\\python27\\lib\\struct.pyc', 'PYMODULE'), ('collections', 'c:\\python27\\lib\\collections.pyc', 'PYMODULE'), ('encodings.utf_32_le', 'c:\\python27\\lib\\encodings\\utf_32_le.pyc', 'PYMODULE'), ('unittest.main', 'c:\\python27\\lib\\unittest\\main.pyc', 'PYMODULE'), ('encodings.euc_kr', 'c:\\python27\\lib\\encodings\\euc_kr.pyc', 'PYMODULE'), ('textwrap', 'c:\\python27\\lib\\textwrap.pyc', 'PYMODULE'), ('chardet.charsetgroupprober', 'c:\\python27\\lib\\site-packages\\chardet\\charsetgroupprober.pyc', 'PYMODULE'), ('encodings.cp037', 'c:\\python27\\lib\\encodings\\cp037.pyc', 'PYMODULE'), ('encodings.big5hkscs', 'c:\\python27\\lib\\encodings\\big5hkscs.pyc', 'PYMODULE'), ('encodings.cp949', 'c:\\python27\\lib\\encodings\\cp949.pyc', 'PYMODULE'), ('mss.factory', 'c:\\python27\\lib\\site-packages\\mss\\factory.pyc', 'PYMODULE'), ('encodings.mac_romanian', 'c:\\python27\\lib\\encodings\\mac_romanian.pyc', 'PYMODULE'), ('quopri', 'c:\\python27\\lib\\quopri.pyc', 'PYMODULE'), ('chardet.langthaimodel', 'c:\\python27\\lib\\site-packages\\chardet\\langthaimodel.pyc', 'PYMODULE'), ('stat', 'c:\\python27\\lib\\stat.pyc', 'PYMODULE'), ('xml.parsers.expat', 'c:\\python27\\lib\\xml\\parsers\\expat.pyc', 'PYMODULE'), ('mss.exception', 'c:\\python27\\lib\\site-packages\\mss\\exception.pyc', 'PYMODULE'), ('encodings.mac_iceland', 'c:\\python27\\lib\\encodings\\mac_iceland.pyc', 'PYMODULE'), ('chardet.gb2312prober', 'c:\\python27\\lib\\site-packages\\chardet\\gb2312prober.pyc', 'PYMODULE'), ('urllib3.util.queue', 'c:\\python27\\lib\\site-packages\\urllib3\\util\\queue.pyc', 'PYMODULE'), ('encodings.iso2022_jp', 'c:\\python27\\lib\\encodings\\iso2022_jp.pyc', 'PYMODULE'), ('email.errors', 'c:\\python27\\lib\\email\\errors.pyc', 'PYMODULE'), ('encodings.ascii', 'c:\\python27\\lib\\encodings\\ascii.pyc', 'PYMODULE'), ('idna.core', 'c:\\python27\\lib\\site-packages\\idna\\core.pyc', 'PYMODULE'), ('UserDict', 'c:\\python27\\lib\\UserDict.pyc', 'PYMODULE'), ('chardet.big5freq', 'c:\\python27\\lib\\site-packages\\chardet\\big5freq.pyc', 'PYMODULE'), ('inspect', 'c:\\python27\\lib\\inspect.pyc', 'PYMODULE'), ('encodings.mac_farsi', 'c:\\python27\\lib\\encodings\\mac_farsi.pyc', 'PYMODULE'), ('unittest.runner', 'c:\\python27\\lib\\unittest\\runner.pyc', 'PYMODULE'), ('urllib3.util.ssl_', 'c:\\python27\\lib\\site-packages\\urllib3\\util\\ssl_.pyc', 'PYMODULE'), ('requests.cookies', 'c:\\python27\\lib\\site-packages\\requests\\cookies.pyc', 'PYMODULE'), ('unittest.loader', 'c:\\python27\\lib\\unittest\\loader.pyc', 'PYMODULE'), ('socket', 'c:\\python27\\lib\\socket.pyc', 'PYMODULE'), ('chardet.langgreekmodel', 'c:\\python27\\lib\\site-packages\\chardet\\langgreekmodel.pyc', 'PYMODULE'), ('imghdr', 'c:\\python27\\lib\\imghdr.pyc', 'PYMODULE'), ('netrc', 'c:\\python27\\lib\\netrc.pyc', 'PYMODULE'), ('encodings.tis_620', 'c:\\python27\\lib\\encodings\\tis_620.pyc', 'PYMODULE'), ('os', 'c:\\python27\\lib\\os.pyc', 'PYMODULE'), ('__future__', 'c:\\python27\\lib\\__future__.pyc', 'PYMODULE'), ('xml.sax.xmlreader', 'c:\\python27\\lib\\xml\\sax\\xmlreader.pyc', 'PYMODULE'), ('_threading_local', 'c:\\python27\\lib\\_threading_local.pyc', 'PYMODULE'), ('encodings.mac_roman', 'c:\\python27\\lib\\encodings\\mac_roman.pyc', 'PYMODULE'), ('encodings.cp437', 'c:\\python27\\lib\\encodings\\cp437.pyc', 'PYMODULE'), ('urllib3.response', 'c:\\python27\\lib\\site-packages\\urllib3\\response.pyc', 'PYMODULE'), ('email._parseaddr', 'c:\\python27\\lib\\email\\_parseaddr.pyc', 'PYMODULE'), ('Cookie', 'c:\\python27\\lib\\Cookie.pyc', 'PYMODULE'), ('urllib3.util', 'c:\\python27\\lib\\site-packages\\urllib3\\util\\__init__.pyc', 'PYMODULE'), ('urllib3._collections', 'c:\\python27\\lib\\site-packages\\urllib3\\_collections.pyc', 'PYMODULE'), ('pyi_os_path', 'c:\\python27\\lib\\site-packages\\PyInstaller\\loader\\pyi_os_path.pyc', 'PYMODULE'), ('chardet.eucjpprober', 'c:\\python27\\lib\\site-packages\\chardet\\eucjpprober.pyc', 'PYMODULE'), ('requests.compat', 'c:\\python27\\lib\\site-packages\\requests\\compat.pyc', 'PYMODULE'), ('ctypes.macholib.dylib', 'c:\\python27\\lib\\ctypes\\macholib\\dylib.pyc', 'PYMODULE'), ('mss.darwin', 'c:\\python27\\lib\\site-packages\\mss\\darwin.pyc', 'PYMODULE'), ('uu', 'c:\\python27\\lib\\uu.pyc', 'PYMODULE'), ('requests.packages', 'c:\\python27\\lib\\site-packages\\requests\\packages.pyc', 'PYMODULE'), ('encodings.cp500', 'c:\\python27\\lib\\encodings\\cp500.pyc', 'PYMODULE'), ('encodings.gb18030', 'c:\\python27\\lib\\encodings\\gb18030.pyc', 'PYMODULE'), ('email.mime.base', 'c:\\python27\\lib\\email\\mime\\base.pyc', 'PYMODULE'), ('mimetools', 'c:\\python27\\lib\\mimetools.pyc', 'PYMODULE'), ('xml.sax', 'c:\\python27\\lib\\xml\\sax\\__init__.pyc', 'PYMODULE'), ('contextlib', 'c:\\python27\\lib\\contextlib.pyc', 'PYMODULE'), ('chardet.jisfreq', 'c:\\python27\\lib\\site-packages\\chardet\\jisfreq.pyc', 'PYMODULE'), ('email.mime.nonmultipart', 'c:\\python27\\lib\\email\\mime\\nonmultipart.pyc', 'PYMODULE'), ('_strptime', 'c:\\python27\\lib\\_strptime.pyc', 'PYMODULE'), ('gettext', 'c:\\python27\\lib\\gettext.pyc', 'PYMODULE'), ('_abcoll', 'c:\\python27\\lib\\_abcoll.pyc', 'PYMODULE'), ('getopt', 'c:\\python27\\lib\\getopt.pyc', 'PYMODULE'), ('email.mime.audio', 'c:\\python27\\lib\\email\\mime\\audio.pyc', 'PYMODULE'), ('xml.sax._exceptions', 'c:\\python27\\lib\\xml\\sax\\_exceptions.pyc', 'PYMODULE'), ('genericpath', 'c:\\python27\\lib\\genericpath.pyc', 'PYMODULE'), ('mimetypes', 'c:\\python27\\lib\\mimetypes.pyc', 'PYMODULE'), ('urllib3', 'c:\\python27\\lib\\site-packages\\urllib3\\__init__.pyc', 'PYMODULE'), ('urllib2', 'c:\\python27\\lib\\urllib2.pyc', 'PYMODULE'), ('unittest.signals', 'c:\\python27\\lib\\unittest\\signals.pyc', 'PYMODULE'), ('requests.certs', 'c:\\python27\\lib\\site-packages\\requests\\certs.pyc', 'PYMODULE'), ('chardet.hebrewprober', 'c:\\python27\\lib\\site-packages\\chardet\\hebrewprober.pyc', 'PYMODULE'), ('encodings.raw_unicode_escape', 'c:\\python27\\lib\\encodings\\raw_unicode_escape.pyc', 'PYMODULE'), ('encodings.mbcs', 'c:\\python27\\lib\\encodings\\mbcs.pyc', 'PYMODULE'), ('urllib3.util.proxy', 'c:\\python27\\lib\\site-packages\\urllib3\\util\\proxy.pyc', 'PYMODULE'), ('encodings.cp1006', 'c:\\python27\\lib\\encodings\\cp1006.pyc', 'PYMODULE'), ('idna', 'c:\\python27\\lib\\site-packages\\idna\\__init__.pyc', 'PYMODULE')],
 [('python27.dll', 'C:\\WINDOWS\\system32\\python27.dll', 'BINARY'), ('win32pipe', 'c:\\python27\\lib\\site-packages\\win32\\win32pipe.pyd', 'EXTENSION'), ('select', 'c:\\python27\\DLLs\\select.pyd', 'EXTENSION'), ('unicodedata', 'c:\\python27\\DLLs\\unicodedata.pyd', 'EXTENSION'), ('_hashlib', 'c:\\python27\\DLLs\\_hashlib.pyd', 'EXTENSION'), ('bz2', 'c:\\python27\\DLLs\\bz2.pyd', 'EXTENSION'), ('_ssl', 'c:\\python27\\DLLs\\_ssl.pyd', 'EXTENSION'), ('_ctypes', 'c:\\python27\\DLLs\\_ctypes.pyd', 'EXTENSION'), ('gdi32', 'C:\\WINDOWS\\system32\\gdi32.dll', 'BINARY'), ('user32', 'C:\\WINDOWS\\system32\\user32.dll', 'BINARY'), ('pyexpat', 'c:\\python27\\DLLs\\pyexpat.pyd', 'EXTENSION'), ('_socket', 'c:\\python27\\DLLs\\_socket.pyd', 'EXTENSION'), ('pywintypes27.dll', 'c:\\python27\\lib\\site-packages\\pywin32_system32\\pywintypes27.dll', 'BINARY')],
 [],
 [],
 ['codecs', 'encodings'])
