Loop ID;Function Name;Sources Infos;Level;Time %;Time (s);CPI ratio;Module;
3;MAIN__;;Innermost;41.53 (11829);236.58;36.23;ep.A;
7;vranlc_;;Single;3.93 (1120);22.40;11.58;ep.A;
4;MAIN__;;Outermost;0.01 (2);0.04;0.00;ep.A;
1;MAIN__;;Single;0.00 (1);0.02;0.00;ep.A;
