plugin_uid = 5c952ce6-11c0-47e8-8f53-132f0515de31
date_time_start = 2010/11/17 15:59:00
date_time_end = 2010/11/17 16:02:03
plugin_exit_code = 0
user_uid = f1452ea1-c8a5-4724-9463-4987f1f85d05
alias = lolilol
