{
    "init": {
        "attributes": {
            "name": "init"
        }, 
        "params": [
            {
                "name": "maqao_cqa_group", 
                "value": "1936e4a4-0cee-11e4-b7c9-0022191169c2"
            }, 
            {
                "name": "loop", 
                "value": "7411ac84-458e-462c-912b-8af16ec8de2b"
            }, 
            {
                "name": "format", 
                "value": "txt"
            }
        ]
    }
}