{
    "init": {
        "attributes": {
            "name": "init"
        }, 
        "params": [
            {
                "name": "loops", 
                "value": [
                    "ae12f8b0-8db9-11e3-9905-ab34cf8dde20"
                ]
            }, 
            {
                "name": "maqao_perf", 
                "value": "44dcbe8a-8db9-11e3-a73b-c3c65a3cbcbc"
            }, 
            {
                "name": "nb_loops", 
                "value": 2
            }, 
            {
                "name": "profiler_version", 
                "value": "maqao-perf 2.0.0 - 67942f755d75f494f8cad7ed1d8b391869a648e8::20140131-153427"
            }
        ]
    }
}