{
    "init": {
        "attributes": {
            "name": "init"
        }, 
        "params": [
            {
                "name": "contents_matrix", 
                "value": {
                    "TEXT":[
                        4, 
                        5, 
                        6
                    ], 
                    "INTEGER":[
                        4, 
                        5, 
                        6
                    ], 
                    "FLOAT":[
                        4.4000000000000004, 
                        5.5, 
                        6.5999999999999996
                    ], 
                    "BOOL":[
                        true, 
                        true, 
                        true
                    ], 
                    "DATE":[
                        "2004/04/04 04:04:04", 
                        "2005/05/05 05:05:05", 
                        "2006/06/06 06:06:06"
                    ]
                }
            }
        ]
    }
}