Loop ID;Function Name;Sources Infos;Level;Time %;Time (s);CPI ratio;Module;
3;MAIN__;;Innermost;40.69 (11598);231.96;35.66;ep.A;
7;vranlc_;;Single;3.93 (1119);22.38;11.58;ep.A;
6;MAIN__;;Innermost;0.00 (1);0.02;0.00;ep.A;
