plugin_uid = 2b54ef94-5b61-11e3-8722-7fd2ea71b72a
date_time_start = 2013/12/05 15:24:12
user_uid = f1452ea1-c8a5-4724-9463-4987f1f85d05
date_time_end = 2013/12/05 15:24:12
plugin_exit_code = 0
alias = test_loop_group
