plugin_uid = 4ac29bf3-dfd3-4ac5-acb4-bcfb51ddc138
date_time_start = 2014/07/21 11:22:19
user_uid = f1452ea1-c8a5-4724-9463-4987f1f85d05
date_time_end = 2014/07/21 11:29:24
plugin_exit_code = 0
alias = wrapper_2014_07_21_11:22:19:856484
