plugin_uid = d9737b5f-b6ce-4a4a-96e5-a13ae8867e99
date_time_start = 2012/04/26 14:55:47
user_uid = f1452ea1-c8a5-4724-9463-4987f1f85d05
date_time_end = 2012/04/26 14:55:47
plugin_exit_code = 0
alias = iznogoud
