{
    "init": {
        "attributes": {
            "name": "init"
        }, 
        "params": [
            {
                "name": "my_param_1", 
                "value": "c"
            }, 
            {
                "name": "my_param_2", 
                "value": "d"
            }
        ]
    }
}