[2014/02/26 13:59:53] Initialization - plugin compile
[2014/02/26 13:59:53] Mode: slurm
[2014/02/26 13:59:54] Copying scripts onto the central node
[2014/02/26 13:59:54] First alloc
[2014/02/26 13:59:54] Waiting for job number to be assigned...
[2014/02/26 14:00:00] Waiting for allocation...
[2014/02/26 14:00:00] Sending tar
[2014/02/26 14:00:01] Untar the archive
[2014/02/26 14:00:01] Removing tar (local and distant)
[2014/02/26 14:00:01] Closing first allocation
[2014/02/26 14:00:01] Launching job
[2014/02/26 14:00:01] Waiting for job number to be assigned...
[2014/02/26 14:00:03] Waiting for termination...
[2014/02/26 14:00:13] Final alloc
[2014/02/26 14:00:13] Waiting for job number to be assigned...
[2014/02/26 14:00:19] Waiting for allocation...
[2014/02/26 14:00:19] Zipping and getting files...
[2014/02/26 14:00:20] Cleaning cluster
[2014/02/26 14:00:20] Closing allocation.
[2014/02/26 14:00:20] Cleaning central node.
[2014/02/26 14:00:20] Got the binary back
[2014/02/26 14:00:20] Unpackaging cti_20140226_135953_784233826.tar.gz
[2014/02/26 14:00:20] Unpackaged
[2014/02/26 14:00:20] Binary from application
[2014/02/26 14:00:20] Importing binary into CTI..
