plugin_uid = 34f27d92-f558-4121-b862-85216c54e18f
date_time_start = 2011/03/22 11:53:28
user_uid = f1452ea1-c8a5-4724-9463-4987f1f85d05
date_time_end = 2011/03/22 11:53:31
plugin_exit_code = 0
alias = internal
