Loop ID;Function Name;Sources Infos;Level;Time %;Time (s);CPI ratio;Module;
3;MAIN__;;Innermost;40.54 (11603);232.06;35.96;ep.A;
7;vranlc_;;Single;4.05 (1159);23.18;12.00;ep.A;
4;MAIN__;;Outermost;0.00 (1);0.02;0.00;ep.A;
