{
    "temp_repository": {
        "attributes": {
            "produce_data": false, 
            "name": "temp_repository", 
            "desc": "Remove entries from the temp repositories",
            "long_desc": "Cleans completely the Temp repository by removing all of the entries inside."
        }, 
        "params": [
            {
                "type": "PLUGIN_UID", 
                "name": "rm_uid", 
                "desc": "The rm plugin UID",
                "long_desc": "The UID or Alias of the plugin that will be used to remove entries.",
                "value": "8b9f58b8-9d01-4af4-8884-42443337da67",
                "optional": true
            } 
        ]
    },
    "entry": {
        "attributes": {
            "produce_data": false, 
            "name": "entry", 
            "desc": "Remove inconsistent entries",
            "long_desc": "Cleans all repositories by removing all of the corrupted entries. Corrupted entries are listed by the reindex plugin when trying to index all data."
        }, 
        "params": [
            {
                "type": "PLUGIN_UID", 
                "name": "rm_uid", 
                "desc": "The rm plugin UID",
                "long_desc": "The UID or Alias of the plugin that will be used to remove entries.",
                "value": "8b9f58b8-9d01-4af4-8884-42443337da67",
                "optional": true
            } 
        ]
    }
}
