Function name;Address in the binary;Source file;Source lines;ID;Can be analyzed;Nb paths;Unroll info (src loop);Unroll confidence level (src loop);Is main/unrolled;Unroll factor;Nb instr.;Nb uops;Size (bytes);Nb used x86 reg.;Nb used MMX reg.;Nb used XMM reg.;Nb used YMM reg.;Nb stack ref.;Pattern;Nb insn: SS;Nb insn: SD;Nb insn: PS-XMM;Nb insn: PS-YMM;Nb insn: PD-XMM;Nb insn: PD-YMM;Nb insn: ADD/SUBSS;Nb insn: MULSS;Nb insn: DIVSS;Nb insn: SQRTSS;Nb insn: ADD/SUBSD;Nb insn: MULSD;Nb insn: DIVSD;Nb insn: SQRTSD;Nb insn: ADD/SUBPS-XMM;Nb insn: MULPS-XMM;Nb insn: DIVPS-XMM;Nb insn: SQRTPS-XMM;Nb insn: ADD/SUBPS-YMM;Nb insn: MULPS-YMM;Nb insn: DIVPS-YMM;Nb insn: SQRTPS-YMM;Nb insn: ADD/SUBPD-XMM;Nb insn: MULPD-XMM;Nb insn: DIVPD-XMM;Nb insn: SQRTPD-XMM;Nb insn: ADD/SUBPD-YMM;Nb insn: MULPD-YMM;Nb insn: DIVPD-YMM;Nb insn: SQRTPD-YMM;Nb 32 bits loads;Nb 32 bits stores;Nb 64 bits loads;Nb 64 bits stores;Nb 128 bits loads;Nb 128 bits stores;Nb 256 bits loads;Nb 256 bits stores;Nb MOVH/LPS/D loads;Nb MOVH/LPS/D stores;Ratio ADD-SUB / MUL;Fit in cache;Macro-fusion;Nb FLOP: add-sub;Nb FLOP: mul;Nb FLOP: div;Nb FLOP: sqrt;Nb FLOP: other;Nb pure loads;Nb impl loads;Nb stores;Bytes prefetched;Bytes loaded;Bytes stored;Arith. intensity (FLOP / ld+st bytes);Arith. intensity extra info;instr. fetch (cycles);predecode (cycles);instr. queue (cycles);decode (cycles);uop queue (cycles);ROB-read (cycles);Front-end (cycles);Nb uops P0;Nb uops P1;Nb uops P2;Nb uops P3;Nb uops P4;Nb uops P5;Nb uops P6;Nb uops P7;Nb cycles P0;Nb cycles P1;Nb cycles P2;Nb cycles P3;Nb cycles P4;Nb cycles P5;Nb cycles P6;Nb cycles P7;Dispatch (cycles);RecMII (cycles);Vec. ratio (%): all (INT);Vec. ratio (%): load (INT);Vec. ratio (%): store (INT);Vec. ratio (%): add-sub (INT);Vec. ratio (%): mul (INT);Vec. ratio (%): other (INT);Vec. ratio (%): all (FP);Vec. ratio (%): load (FP);Vec. ratio (%): store (FP);Vec. ratio (%): add-sub (FP);Vec. ratio (%): mul (FP);Vec. ratio (%): other (FP);Vec. ratio (%): all;Vec. ratio (%): load;Vec. ratio (%): store;Vec. ratio (%): add-sub;Vec. ratio (%): mul;Vec. ratio (%): other;Vec. eff. ratio (%): all (INT);Vec. eff. ratio (%): load (INT);Vec. eff. ratio (%): store (INT);Vec. eff. ratio (%): add-sub (INT);Vec. eff. ratio (%): mul (INT);Vec. eff. ratio (%): other (INT);Vec. eff. ratio (%): all (FP);Vec. eff. ratio (%): load (FP);Vec. eff. ratio (%): store (FP);Vec. eff. ratio (%): add-sub (FP);Vec. eff. ratio (%): mul (FP);Vec. eff. ratio (%): other (FP);Vec. eff. ratio (%): all;Vec. eff. ratio (%): load;Vec. eff. ratio (%): store;Vec. eff. ratio (%): add-sub;Vec. eff. ratio (%): mul;Vec. eff. ratio (%): other;[L1] Nb cycles;[L1] FLOP/cycle;[L1] IPC;[L1] Bytes prefetched / cycle;[L1] Bytes loaded / cycle;[L1] Bytes stored / cycle;[L1] Bytes ld+st / cycle;[L1] Nb cycles if fully vectorized;[L1] Nb cycles if clean;[L1] Nb cycles if only FP;[L1] Nb cycles if only FP arith;[L1, optimistic] Nb cycles;[L1, optimistic] FLOP/cycle;[L1, optimistic] IPC;[L1, optimistic] Bytes prefetched / cycle;[L1, optimistic] Bytes loaded / cycle;[L1, optimistic] Bytes stored / cycle;[L1, optimistic] Bytes ld+st / cycle;[L1, optimistic] Nb cycles if fully vectorized;[L1, optimistic] Nb cycles if clean;[L1, optimistic] Nb cycles if only FP;[L1, optimistic] Nb cycles if only FP arith;
codelet_2fn3nfrn;401884;/tmp/mbordet_20140307_144738_324332304_local/mbordet_20140307_144738_324332304/APP/files/text.c;25-26;4;true;1;multi-versionned but not unrolled;high;NA;NA;8;8;26;8;0;0;0;0;x86;0;0;0;0;0;0;0;0;0;0;0;0;0;0;0;0;0;0;0;0;0;0;0;0;0;0;0;0;0;0;3;1;0;0;0;0;0;0;0;0;NA;Yes (loop buffer);true;0;0;0;0;0;1;2;1;0;8;4;0;NA;NA;NA;NA;NA;2;2;2;2;2;3;1;1;2;0;0;2;2;3;1;1;2;0;0;3;2;0;0;0;0;0;NA;NA;NA;NA;NA;NA;NA;0;0;0;0;0;NA;25;25;25;25;25;NA;NA;NA;NA;NA;NA;NA;25;25;25;25;25;NA;3;0;2.6666666666667;0;2.6666666666667;1.3333333333333;4;1.3333333333333;NA;NA;NA;3;0;2.6666666666667;0;2.6666666666667;1.3333333333333;4;1.3333333333333;NA;NA;NA;
codelet_2fn3nfrn;4018b1;/tmp/mbordet_20140307_144738_324332304_local/mbordet_20140307_144738_324332304/APP/files/text.c;27-28;3;true;1;multi-versionned but not unrolled;high;NA;NA;9;8;30;8;0;0;0;0;x86;0;0;0;0;0;0;0;0;0;0;0;0;0;0;0;0;0;0;0;0;0;0;0;0;0;0;0;0;0;0;3;1;0;0;0;0;0;0;0;0;NA;Yes (loop buffer);true;0;0;0;0;0;1;2;1;0;12;4;0;NA;NA;NA;NA;NA;2;2;2;2;2;3;1;1;2;0;0;2;2;3;1;1;2;0;0;3;2;0;0;0;0;0;NA;NA;NA;NA;NA;NA;NA;0;0;0;0;0;NA;25;25;25;25;25;NA;NA;NA;NA;NA;NA;NA;25;25;25;25;25;NA;3;0;3;0;4;1.3333333333333;5.3333333333333;1.3333333333333;NA;NA;NA;3;0;3;0;4;1.3333333333333;5.3333333333333;1.3333333333333;NA;NA;NA;
