{
    "init": {
        "attributes": {
            "produce_data": true, 
            "name": "init", 
            "repository": "local", 
            "desc": "Initializes a set of applications",
            "long_desc": "Creates a group of applications using the given parameters."
        }, 
        "params": [
            {
                "type": "DATA_UID", 
                "list": true,
                "name": "applications", 
                "produced_by": "45015659-4f12-4ab2-8849-e0a4e7e4fe4b",
                "target": "application_group",
                "desc": "Applications",
                "long_desc": "The application entries that will form the application_group. A list of application UID or Alias.",
                "optional": true
            }
        ]
    }
}
