{
    "add": {
        "attributes": {
            "produce_data": false, 
            "name": "add", 
            "desc": "Add a note",
            "long_desc": "Adds a note to the given entry."
        }, 
        "params": [
            {
                "type": "DATA_UID", 
                "name": "entry", 
                "desc": "entry",
                "long_desc": "The UID or Alias of the data the note will be added to."
            }, 
            {
                "type": "TEXT", 
                "name": "note", 
                "desc": "The note",
                "long_desc": "The note to add to the entry."
            }
        ]
    },
    "rm": {
        "attributes": {
            "produce_data": false, 
            "name": "rm", 
            "desc": "Remove a note",
            "long_desc": "Removes the specified note from the given entry."
        }, 
        "params": [
            {
                "type": "DATA_UID", 
                "name": "entry", 
                "desc": "entry",
                "long_desc": "The UID or Alias of the entry where the note will be removed."
            }, 
            {
                "type": "INTEGER", 
                "name": "note_number", 
                "desc": "note number",
                "long_desc": "The index of the note to remove (0 is the first added, 1 the second, etc.)"
            }
        ]
    },
    "get": {
        "attributes": {
            "produce_data": false, 
            "name": "get", 
            "desc": "Get the note",
            "long_desc": "Returns the list of note for the given entry."
        }, 
        "params": [
            {
                "type": "DATA_UID", 
                "name": "entry", 
                "desc": "entry",
                "long_desc": "The UID or Alias of the entry which note will be listed."
            }, 
            {
                "type": "TEXT",
                "name": "format",
                "value": "txt",
                "desc": "The format (json / txt)",
                "long_desc": "The format of the output. 'txt' will display the output in a human readable manner. 'json' will output a JSON string containing the same Information.",
                "optional": true
            }
        ]
    }
}