{
    "init": {
        "attributes": {
            "name": "init"
        }, 
        "params": [
            {
                "name": "alias", 
                "value": "NAS-MPI_EP_COPY"
            }, 
            {
                "name": "directory", 
                "value": "/mnt/nfs_public/users/mbordet/NAS-MPI/EP"
            }
        ]
    }
}
