Loop ID;Source Infos;Level;Time %;Time (s);CPI ratio;
0;main - 311,348@is.c;Single;49.26 (298);5.96;5.02;
8;rank - 475,476@is.c;Single;28.10 (170);3.40;7.58;
3;main - 380,381@is.c;Single;20.99 (127);2.54;29.10;
36;__intel_ssse3_rep_memcpy - -1,-1@-1;Single;0.33 (2);0.04;3.47;
31;__intel_memset - -1,-1@-1;Single;0.33 (2);0.04;13.20;
9;rank - 484,485@is.c;Single;0.17 (1);0.02;0.65;
4;main - 387,389@is.c;Single;0.17 (1);0.02;1.06;
