Loop ID,Source Infos,Level,Time %,Time (s),CPI ratio,
4,MAIN__ - -1,-1@-1,Innermost,57.68 (10532),329.12,55.36,
8,vranlc_ - -1,-1@-1,Single,14.68 (2681),83.78,45.56,
1137,log - -1,-1@-1,Single,1.38 (252),7.88,136.68,
5,MAIN__ - -1,-1@-1,Outermost,0.02 (4),0.12,0.00,
