plugin_uid = 06e2e012-5b61-11e3-9170-d3f36bd3c5f9
date_time_start = 2014/08/18 16:42:07
user_uid = f1452ea1-c8a5-4724-9463-4987f1f85d05
date_time_end = 2014/08/18 16:43:43
plugin_exit_code = 0
alias = loop_2014_08_18_16:42:07:553226