[2014/02/26 14:00:23] Initialization - plugin maqao_perf
[2014/02/26 14:00:23] Mode: slurm
[2014/02/26 14:00:23] Copying scripts onto the central node
[2014/02/26 14:00:25] First alloc
[2014/02/26 14:00:25] Waiting for job number to be assigned...
[2014/02/26 14:00:31] Waiting for allocation...
[2014/02/26 14:00:31] Sending tar
[2014/02/26 14:00:31] Untar the archive
[2014/02/26 14:00:32] Removing tar (local and distant)
[2014/02/26 14:00:32] Closing first allocation
[2014/02/26 14:00:32] Launching job
[2014/02/26 14:00:32] Waiting for job number to be assigned...
[2014/02/26 14:00:34] Waiting for termination...
[2014/02/26 14:02:44] Final alloc
[2014/02/26 14:02:44] Waiting for job number to be assigned...
[2014/02/26 14:02:50] Waiting for allocation...
[2014/02/26 14:02:50] Zipping and getting files...
[2014/02/26 14:02:53] Cleaning cluster
[2014/02/26 14:02:53] Closing allocation.
[2014/02/26 14:02:53] Cleaning central node.
[2014/02/26 14:02:53] Got the results back
[2014/02/26 14:02:53] Unpackaging cti_20140226_140023_468933715.tar.gz
[2014/02/26 14:02:54] Unpackaged
[2014/02/26 14:02:54] Importing results into CTI..
* List of loops detected by Maqao perf on the application:
	* Loop 0 from is.c (function main), lines: 311-348, coverage (median): 48.905, samples: 267

	* Loop 8 from is.c (function rank), lines: 475-476, coverage (median): 28.23, samples: 154

	* Loop 3 from is.c (function main), lines: 380-381, coverage (median): 21.235, samples: 118

	* Loop 4 from is.c (function main), lines: 387-389, coverage (median): 0.18, samples: 1

	* Loop 9 from is.c (function rank), lines: 484-485, coverage (median): 0.33, samples: 3


* Correspondence with extracted codelets:

Warning : The application has no codelet_group. You have to extract codelets from the application if you want perform the correspondence.
* Total number of stable codelets: 0
* Total number of unstable codelets: 0
* Total coverage of stable codelet: 0.0
* Total coverage of unstable codelet: 0.0
* Ratio codelets / loops: 0.0
