{
    "init": {
        "attributes": {
            "produce_data": true, 
            "name": "init", 
            "repository": "local", 
            "desc": "Initializes data for lib counting results",
            "long_desc": "Creates a lib counting results entry using the given parameters."
        }, 
        "params": [
            {
                "type": "DATA_UID", 
                "name": "lib_counting_group", 
                "desc": "Lib Counting Group",
                "long_desc": "A lib counting group entry UID or Alias.",
                "produced_by": "d1cb7138-6663-11e3-895c-cf84dbff6017"
            },
            {
                "type": "DATA_UID", 
                "name": "loop", 
                "desc": "Loop",
                "long_desc": "A loop entry UID or Alias.",
                "produced_by": "06e2e012-5b61-11e3-9170-d3f36bd3c5f9"
            },
            {
                "type": "FLOAT", 
                "name": "invocations", 
                "desc": "Invocations",
                "long_desc": "The median number of invocations of this loop."
            },
            {
                "type": "FLOAT", 
                "name": "cycles", 
                "desc": "Cycles",
                "long_desc": "The median number of cycles of this loop (per invocation)."
            },
            {
                "type": "FLOAT", 
                "name": "frequency", 
                "desc": "Frequency",
                "long_desc": "The fixed frequency, in cycles per second, of the CPU that was used for this experiment."
            },
            {
                "name": "counters",
                "desc": "Counters",
                "long_desc": "A matrix containing the results for each counter measured.",
                "type": "MATRIX",
                "column_names": [
                    "nehalem_westmere_L1D_REPL",
                    "nehalem_westmere_L2_LINES_IN_ANY",
                    "nehalem_westmere_RESOURCE_STALLS",
                    "nehalem_westmere_ARITH_CYCLES_DIV_BUSY",
                    "nehalem_westmere_L2_RQSTS_PF_MISS",
                    "nehalem_westmere_L2_RQSTS_RFO_MISS",
                    "nehalem_westmere_LLC_MISSES",
                    "nehalem_westmere_DTLB_LOAD_MISSES_CAUSES_A_WALK",
                    "nehalem_westmere_DTLB_STORE_MISSES_CAUSES_A_WALK",
                    "nehalem_westmere_HW_PRE_REQ_L1D_MISS",
                    "nehalem_westmere_FP_COMP_OPS_EXE_SSE_FP_PACKED",
                    "nehalem_westmere_FP_COMP_OPS_EXE_SSE_FP_SCALAR",
                    "nehalem_westmere_L1D_M_EVICT",
                    "nehalem_westmere_UNC_QMC_NORMAL_READS_ANY",
                    "nehalem_westmere_UNC_QMC_WRITES_FULL_ANY",
                    "nehalem_westmere_INSTR_RETIRED",
                    "nehalem_westmere_UNC_LLC_MISS_ANY",
                    "nehalem_westmere_UNC_L3_MISS_ANY",
                    "nehalem_westmere_UNHALTED_REFERENCE_CYCLES",
                    "nehalem_westmere_CPU_CLK_UNHALTED_REF_P",
                    "nehalem_westmere_L2_RQSTS_CODE_RD_MISS",
                    "sandy_bridge_UNHALTED_REFERENCE_CYCLES",
                    "sandy_bridge_CPU_CLK_UNHALTED_THREAD_P",
                    "sandy_bridge_INST_RETIRED",
                    "sandy_bridge_L1D_REPLACEMENT",
                    "sandy_bridge_L2_LINES_IN_ANY",
                    "sandy_bridge_RESOURCE_STALLS",
                    "sandy_bridge_ARITH_FPU_DIV",
                    "sandy_bridge_UOPS_ISSUED_ANY",
                    "sandy_bridge_L2_RQSTS_CODE_RD_MISS",
                    "sandy_bridge_L2_RQSTS_PF_MISS",
                    "sandy_bridge_L2_RQSTS_RFO_MISS",
                    "sandy_bridge_LLC_MISSES",
                    "sandy_bridge_UOPS_DISPATCHED_PORT_PORT_0",
                    "sandy_bridge_UOPS_DISPATCHED_PORT_PORT_1",
                    "sandy_bridge_UOPS_DISPATCHED_PORT_PORT_2",
                    "sandy_bridge_UOPS_DISPATCHED_PORT_PORT_3",
                    "sandy_bridge_UOPS_DISPATCHED_PORT_PORT_4",
                    "sandy_bridge_UOPS_DISPATCHED_PORT_PORT_5",
                    "sandy_bridge_DTLB_LOAD_MISSES_CAUSES_A_WALK",
                    "sandy_bridge_DTLB_STORE_MISSES_CAUSES_A_WALK",
                    "sandy_bridge_HW_PRE_REQ_L1D_MISS",
                    "sandy_bridge_UNC_M_CAS_COUNT_0_RD",
                    "sandy_bridge_UNC_M_CAS_COUNT_0_WR",
                    "sandy_bridge_UNC_M_CAS_COUNT_1_RD",
                    "sandy_bridge_UNC_M_CAS_COUNT_1_WR",
                    "sandy_bridge_UNC_M_CAS_COUNT_2_RD",
                    "sandy_bridge_UNC_M_CAS_COUNT_2_WR",
                    "sandy_bridge_UNC_M_CAS_COUNT_3_RD",
                    "sandy_bridge_UNC_M_CAS_COUNT_3_WR",
                    "sandy_bridge_FP_COMP_OPS_EXE_SSE_FP_PACKED_DOUBLE",
                    "sandy_bridge_FP_COMP_OPS_EXE_SSE_SCALAR_DOUBLE",
                    "sandy_bridge_CPU_CLK_UNHALTED_REF_P",
                    "sandy_bridge_MEM_LOAD_UOPS_RETIRED_HIT_LFB",
                    "sandy_bridge_MEM_LOAD_UOPS_RETIRED_L1_HIT",
                    "sandy_bridge_MEM_LOAD_UOPS_RETIRED_L2_HIT",
                    "sandy_bridge_MEM_LOAD_UOPS_RETIRED_L3_HIT",
                    "sandy_bridge_L2_TRANS_L2_WB",
                    "sandy_bridge_L3_LAT_CACHE_MISS",
                    "sandy_bridge_DRAM_DATA_READS",
                    "sandy_bridge_DRAM_DATA_WRITES",
                    "sandy_bridge_L1D_M_EVICT",
                    "haswell_UOPS_EXECUTED_PORT_PORT_0",
                    "haswell_UOPS_EXECUTED_PORT_PORT_1",
                    "haswell_L1D_REPLACEMENT",
                    "haswell_L2_TRANS_L1D_WB",
                    "haswell_ICACHE_MISSES",
                    "haswell_DRAM_DATA_READS",
                    "haswell_DRAM_DATA_WRITES"
                ],
                "column_descs": [
                    "nehalem westmere L1D:REPL",
                    "nehalem westmere L2 LINES IN:ANY",
                    "nehalem westmere RESOURCE STALLS",
                    "nehalem westmere ARITH:CYCLES DIV BUSY",
                    "nehalem westmere L2 RQSTS:PF MISS",
                    "nehalem westmere L2 RQSTS:RFO MISS",
                    "nehalem westmere LLC MISSES",
                    "nehalem westmere DTLB LOAD MISSES:CAUSES A WALK",
                    "nehalem westmere DTLB STORE MISSES:CAUSES A WALK",
                    "nehalem westmere HW PRE REQ:L1D MISS",
                    "nehalem westmere FP COMP OPS EXE:SSE FP PACKED",
                    "nehalem westmere FP COMP OPS EXE:SSE FP SCALAR",
                    "nehalem westmere L1D:M EVICT",
                    "nehalem westmere UNC QMC NORMAL READS:ANY",
                    "nehalem westmere UNC QMC WRITES:FULL ANY",
                    "nehalem westmere INSTR RETIRED",
                    "nehalem westmere UNC LLC MISS:ANY",
                    "nehalem westmere UNC L3 MISS:ANY",
                    "nehalem westmere UNHALTED REFERENCE CYCLES",
                    "nehalem westmere CPU CLK UNHALTED:REF P",
                    "nehalem westmere L2 RQSTS:CODE RD MISS",
                    "sandy bridge UNHALTED REFERENCE CYCLES",
                    "sandy bridge CPU CLK UNHALTED:THREAD P",
                    "sandy bridge INST RETIRED",
                    "sandy bridge L1D:REPLACEMENT",
                    "sandy bridge L2 LINES IN:ANY",
                    "sandy bridge RESOURCE STALLS",
                    "sandy bridge ARITH:FPU DIV",
                    "sandy bridge UOPS ISSUED:ANY",
                    "sandy bridge L2 RQSTS:CODE RD MISS",
                    "sandy bridge L2 RQSTS:PF MISS",
                    "sandy bridge L2 RQSTS:RFO MISS",
                    "sandy bridge LLC MISSES",
                    "sandy bridge UOPS DISPATCHED PORT:PORT 0",
                    "sandy bridge UOPS DISPATCHED PORT:PORT 1",
                    "sandy bridge UOPS DISPATCHED PORT:PORT 2",
                    "sandy bridge UOPS DISPATCHED PORT:PORT 3",
                    "sandy bridge UOPS DISPATCHED PORT:PORT 4",
                    "sandy bridge UOPS DISPATCHED PORT:PORT 5",
                    "sandy bridge DTLB LOAD MISSES:CAUSES A WALK",
                    "sandy bridge DTLB STORE MISSES:CAUSES A WALK",
                    "sandy bridge HW PRE REQ:L1D MISS",
                    "sandy bridge UNC M CAS COUNT 0:RD",
                    "sandy bridge UNC M CAS COUNT 0:WR",
                    "sandy bridge UNC M CAS COUNT 1:RD",
                    "sandy bridge UNC M CAS COUNT 1:WR",
                    "sandy bridge UNC M CAS COUNT 2:RD",
                    "sandy bridge UNC M CAS_COUNT 2:WR",
                    "sandy bridge UNC M CAS_COUNT 3:RD",
                    "sandy bridge UNC M CAS_COUNT 3:WR",
                    "sandy bridge FP COMP OPS EXE:SSE FP PACKED DOUBLE",
                    "sandy bridge FP COMP OPS EXE:SSE SCALAR DOUBLE",
                    "sandy bridge CPU CLK_UNHALTED:REF_P",
                    "sandy bridge MEM LOAD UOPS RETIRED:HIT LFB",
                    "sandy bridge MEM LOAD UOPS RETIRED:L1 HIT",
                    "sandy bridge MEM LOAD UOPS RETIRED:L2 HIT",
                    "sandy bridge MEM LOAD UOPS RETIRED:L3 HIT",
                    "sandy bridge L2 TRANS:L2 WB",
                    "sandy bridge L3 LAT CACHE:MISS",
                    "sandy bridge DRAM DATA READS",
                    "sandy bridge DRAM DATA WRITES",
                    "sandy bridge L1D:M EVICT",
                    "haswell UOPS EXECUTED PORT:PORT 0",
                    "haswell UOPS EXECUTED PORT:PORT 1",
                    "haswell L1D:REPLACEMENT",
                    "haswell L2 TRANS:L1D WB",
                    "haswell ICACHE:MISSES",
                    "haswell DRAM DATA READS",
                    "haswell DRAM DATA WRITES"
                ],
                "column_long_descs": [
                    "nehalem westmere L1D:REPL",
                    "nehalem westmere L2 LINES IN:ANY",
                    "nehalem westmere RESOURCE STALLS",
                    "nehalem westmere ARITH:CYCLES DIV BUSY",
                    "nehalem westmere L2 RQSTS:PF MISS",
                    "nehalem westmere L2 RQSTS:RFO MISS",
                    "nehalem westmere LLC MISSES",
                    "nehalem westmere DTLB LOAD MISSES:CAUSES A WALK",
                    "nehalem westmere DTLB STORE MISSES:CAUSES A WALK",
                    "nehalem westmere HW PRE REQ:L1D MISS",
                    "nehalem westmere FP COMP OPS EXE:SSE FP PACKED",
                    "nehalem westmere FP COMP OPS EXE:SSE FP SCALAR",
                    "nehalem westmere L1D:M EVICT",
                    "nehalem westmere UNC QMC NORMAL READS:ANY",
                    "nehalem westmere UNC QMC WRITES:FULL ANY",
                    "nehalem westmere INSTR RETIRED",
                    "nehalem westmere UNC LLC MISS:ANY",
                    "nehalem westmere UNC L3 MISS:ANY",
                    "nehalem westmere UNHALTED REFERENCE CYCLES",
                    "nehalem westmere CPU CLK UNHALTED:REF P",
                    "nehalem westmere L2 RQSTS:CODE RD MISS",
                    "sandy bridge UNHALTED REFERENCE CYCLES",
                    "sandy bridge CPU CLK UNHALTED:THREAD P",
                    "sandy bridge INST RETIRED",
                    "sandy bridge L1D:REPLACEMENT",
                    "sandy bridge L2 LINES IN:ANY",
                    "sandy bridge RESOURCE STALLS",
                    "sandy bridge ARITH:FPU DIV",
                    "sandy bridge UOPS ISSUED:ANY",
                    "sandy bridge L2 RQSTS:CODE RD MISS",
                    "sandy bridge L2 RQSTS:PF MISS",
                    "sandy bridge L2 RQSTS:RFO MISS",
                    "sandy bridge LLC MISSES",
                    "sandy bridge UOPS DISPATCHED PORT:PORT 0",
                    "sandy bridge UOPS DISPATCHED PORT:PORT 1",
                    "sandy bridge UOPS DISPATCHED PORT:PORT 2",
                    "sandy bridge UOPS DISPATCHED PORT:PORT 3",
                    "sandy bridge UOPS DISPATCHED PORT:PORT 4",
                    "sandy bridge UOPS DISPATCHED PORT:PORT 5",
                    "sandy bridge DTLB LOAD MISSES:CAUSES A WALK",
                    "sandy bridge DTLB STORE MISSES:CAUSES A WALK",
                    "sandy bridge HW PRE REQ:L1D MISS",
                    "sandy bridge UNC M CAS COUNT 0:RD",
                    "sandy bridge UNC M CAS COUNT 0:WR",
                    "sandy bridge UNC M CAS COUNT 1:RD",
                    "sandy bridge UNC M CAS COUNT 1:WR",
                    "sandy bridge UNC M CAS COUNT 2:RD",
                    "sandy bridge UNC M CAS_COUNT 2:WR",
                    "sandy bridge UNC M CAS_COUNT 3:RD",
                    "sandy bridge UNC M CAS_COUNT 3:WR",
                    "sandy bridge FP COMP OPS EXE:SSE FP PACKED DOUBLE",
                    "sandy bridge FP COMP OPS EXE:SSE SCALAR DOUBLE",
                    "sandy bridge CPU CLK_UNHALTED:REF_P",
                    "sandy bridge MEM LOAD UOPS RETIRED:HIT LFB",
                    "sandy bridge MEM LOAD UOPS RETIRED:L1 HIT",
                    "sandy bridge MEM LOAD UOPS RETIRED:L2 HIT",
                    "sandy bridge MEM LOAD UOPS RETIRED:L3 HIT",
                    "sandy bridge L2 TRANS:L2 WB",
                    "sandy bridge L3 LAT CACHE:MISS",
                    "sandy bridge DRAM DATA READS",
                    "sandy bridge DRAM DATA WRITES",
                    "sandy bridge L1D:M EVICT",
                    "haswell UOPS EXECUTED PORT:PORT 0",
                    "haswell UOPS EXECUTED PORT:PORT 1",
                    "haswell L1D:REPLACEMENT",
                    "haswell L2 TRANS:L1D WB",
                    "haswell ICACHE:MISSES",
                    "haswell DRAM DATA READS",
                    "haswell DRAM DATA WRITES"
                ],
                "column_types": [
                    "FLOAT",
                    "FLOAT",
                    "FLOAT",
                    "FLOAT",
                    "FLOAT",
                    "FLOAT",
                    "FLOAT",
                    "FLOAT",
                    "FLOAT",
                    "FLOAT",
                    "FLOAT",
                    "FLOAT",
                    "FLOAT",
                    "FLOAT",
                    "FLOAT",
                    "FLOAT",
                    "FLOAT",
                    "FLOAT",
                    "FLOAT",
                    "FLOAT",
                    "FLOAT",
                    "FLOAT",
                    "FLOAT",
                    "FLOAT",
                    "FLOAT",
                    "FLOAT",
                    "FLOAT",
                    "FLOAT",
                    "FLOAT",
                    "FLOAT",
                    "FLOAT",
                    "FLOAT",
                    "FLOAT",
                    "FLOAT",
                    "FLOAT",
                    "FLOAT",
                    "FLOAT",
                    "FLOAT",
                    "FLOAT",
                    "FLOAT",
                    "FLOAT",
                    "FLOAT",
                    "FLOAT",
                    "FLOAT",
                    "FLOAT",
                    "FLOAT",
                    "FLOAT",
                    "FLOAT",
                    "FLOAT",
                    "FLOAT",
                    "FLOAT",
                    "FLOAT",
                    "FLOAT",
                    "FLOAT",
                    "FLOAT",
                    "FLOAT",
                    "FLOAT",
                    "FLOAT",
                    "FLOAT",
                    "FLOAT",
                    "FLOAT",
                    "FLOAT",
                    "FLOAT",
                    "FLOAT",
                    "FLOAT",
                    "FLOAT",
                    "FLOAT",
                    "FLOAT",
                    "FLOAT"
                ],
                "value": {
                    "nehalem_westmere_L1D_REPL": [],
                    "nehalem_westmere_L2_LINES_IN_ANY": [],
                    "nehalem_westmere_RESOURCE_STALLS": [],
                    "nehalem_westmere_ARITH_CYCLES_DIV_BUSY": [],
                    "nehalem_westmere_L2_RQSTS_PF_MISS": [],
                    "nehalem_westmere_L2_RQSTS_RFO_MISS": [],
                    "nehalem_westmere_LLC_MISSES": [],
                    "nehalem_westmere_DTLB_LOAD_MISSES_CAUSES_A_WALK": [],
                    "nehalem_westmere_DTLB_STORE_MISSES_CAUSES_A_WALK": [],
                    "nehalem_westmere_HW_PRE_REQ_L1D_MISS": [],
                    "nehalem_westmere_FP_COMP_OPS_EXE_SSE_FP_PACKED": [],
                    "nehalem_westmere_FP_COMP_OPS_EXE_SSE_FP_SCALAR": [],
                    "nehalem_westmere_L1D_M_EVICT": [],
                    "nehalem_westmere_UNC_QMC_NORMAL_READS_ANY": [],
                    "nehalem_westmere_UNC_QMC_WRITES_FULL_ANY": [],
                    "nehalem_westmere_INSTR_RETIRED": [],
                    "nehalem_westmere_UNC_LLC_MISS_ANY": [],
                    "nehalem_westmere_UNC_L3_MISS_ANY": [],
                    "nehalem_westmere_UNHALTED_REFERENCE_CYCLES": [],
                    "nehalem_westmere_CPU_CLK_UNHALTED_REF_P": [],
                    "nehalem_westmere_L2_RQSTS_CODE_RD_MISS": [],
                    "sandy_bridge_UNHALTED_REFERENCE_CYCLES": [],
                    "sandy_bridge_CPU_CLK_UNHALTED_THREAD_P": [],
                    "sandy_bridge_INST_RETIRED": [],
                    "sandy_bridge_L1D_REPLACEMENT": [],
                    "sandy_bridge_L2_LINES_IN_ANY": [],
                    "sandy_bridge_RESOURCE_STALLS": [],
                    "sandy_bridge_ARITH_FPU_DIV": [],
                    "sandy_bridge_UOPS_ISSUED_ANY": [],
                    "sandy_bridge_L2_RQSTS_CODE_RD_MISS": [],
                    "sandy_bridge_L2_RQSTS_PF_MISS": [],
                    "sandy_bridge_L2_RQSTS_RFO_MISS": [],
                    "sandy_bridge_LLC_MISSES": [],
                    "sandy_bridge_UOPS_DISPATCHED_PORT_PORT_0": [],
                    "sandy_bridge_UOPS_DISPATCHED_PORT_PORT_1": [],
                    "sandy_bridge_UOPS_DISPATCHED_PORT_PORT_2": [],
                    "sandy_bridge_UOPS_DISPATCHED_PORT_PORT_3": [],
                    "sandy_bridge_UOPS_DISPATCHED_PORT_PORT_4": [],
                    "sandy_bridge_UOPS_DISPATCHED_PORT_PORT_5": [],
                    "sandy_bridge_DTLB_LOAD_MISSES_CAUSES_A_WALK": [],
                    "sandy_bridge_DTLB_STORE_MISSES_CAUSES_A_WALK": [],
                    "sandy_bridge_HW_PRE_REQ_L1D_MISS": [],
                    "sandy_bridge_UNC_M_CAS_COUNT_0_RD": [],
                    "sandy_bridge_UNC_M_CAS_COUNT_0_WR": [],
                    "sandy_bridge_UNC_M_CAS_COUNT_1_RD": [],
                    "sandy_bridge_UNC_M_CAS_COUNT_1_WR": [],
                    "sandy_bridge_UNC_M_CAS_COUNT_2_RD": [],
                    "sandy_bridge_UNC_M_CAS_COUNT_2_WR": [],
                    "sandy_bridge_UNC_M_CAS_COUNT_3_RD": [],
                    "sandy_bridge_UNC_M_CAS_COUNT_3_WR": [],
                    "sandy_bridge_FP_COMP_OPS_EXE_SSE_FP_PACKED_DOUBLE": [],
                    "sandy_bridge_FP_COMP_OPS_EXE_SSE_SCALAR_DOUBLE": [],
                    "sandy_bridge_CPU_CLK_UNHALTED_REF_P": [],
                    "sandy_bridge_MEM_LOAD_UOPS_RETIRED_HIT_LFB": [],
                    "sandy_bridge_MEM_LOAD_UOPS_RETIRED_L1_HIT": [],
                    "sandy_bridge_MEM_LOAD_UOPS_RETIRED_L2_HIT": [],
                    "sandy_bridge_MEM_LOAD_UOPS_RETIRED_L3_HIT": [],
                    "sandy_bridge_L2_TRANS_L2_WB": [],
                    "sandy_bridge_L3_LAT_CACHE_MISS": [],
                    "sandy_bridge_DRAM_DATA_READS": [],
                    "sandy_bridge_DRAM_DATA_WRITES": [],
                    "sandy_bridge_L1D_M_EVICT": [],
                    "haswell_UOPS_EXECUTED_PORT_PORT_0": [],
                    "haswell_UOPS_EXECUTED_PORT_PORT_1": [],
                    "haswell_L1D_REPLACEMENT": [],
                    "haswell_L2_TRANS_L1D_WB": [],
                    "haswell_ICACHE_MISSES": [],
                    "haswell_DRAM_DATA_READS": [],
                    "haswell_DRAM_DATA_WRITES": []
                }
            },
            {
                "name": "metrics",
                "desc": "Metrics",
                "long_desc": "A matrix containing metrics computed from the other values.",
                "type": "MATRIX",
                "column_names": [
                    "loop_runtime",
                    "nehalem_westmere_double_precision",
                    "nehalem_westmere_L2_bandwidth",
                    "nehalem_westmere_L3_miss_rate",
                    "nehalem_westmere_memory_bandwidth",
                    "sandy_bridge_double_precision",
                    "sandy_bridge_L2_bandwidth",
                    "sandy_bridge_memory_data_volume",
                    "sandy_bridge_memory_bandwidth",
                    "haswell_compute_instructions",
                    "haswell_L2_bandwidth",
                    "haswell_memory_data_volume",
                    "haswell_memory_bandwidth"
 
                ],
                "column_descs": [
                    "loop runtime",
                    "nehalem westmere double precision (MFlops/s)",
                    "nehalem westmere L2 bandwidth (Mbytes/s)",
                    "nehalem westmere L3 miss rate",
                    "nehalem westmere memory bandwidth (Mbytes/s)",
                    "sandy bridge double precision (MFlops/s)",
                    "sandy bridge L2 bandwidth (Mbytes/s)",
                    "sandy bridge L3 data volume (Mbytes)",
                    "sandy bridge memory bandwidth (Mbytes/s)",
                    "haswell compute instructions",
                    "haswell L2 bandwidth (Mbytes/s)",
                    "haswell L3 data volume (Mbytes)",
                    "haswell memory bandwidth (Mbytes/s)"
 
                ],
                "column_long_descs": [
                    "The average runtime for this loop, calculated from the cycles and frequency.",
                    "nehalem westmere double precision (MFlops/s)",
                    "nehalem westmere L2 bandwidth (Mbytes/s)",
                    "nehalem westmere L3 miss rate",
                    "nehalem westmere memory bandwidth (Mbytes/s)",
                    "sandy bridge double precision (MFlops/s)",
                    "sandy bridge L2 bandwidth (Mbytes/s)",
                    "sandy bridge L3 bandwidth (Mbytes/s)",
                    "sandy bridge memory bandwidth (Mbytes/s)",
                    "haswell compute instructions",
                    "haswell L2 bandwidth (Mbytes/s)",
                    "haswell L3 data volume (Mbytes)",
                    "haswell memory bandwidth (Mbytes/s)"
 
                ],
                "column_types": [
                    "FLOAT",
                    "FLOAT",
                    "FLOAT",
                    "FLOAT",
                    "FLOAT",
                    "FLOAT",
                    "FLOAT",
                    "FLOAT",
                    "FLOAT",
                    "FLOAT",
                    "FLOAT",
                    "FLOAT",
                    "FLOAT"
                ],
                "value": {
                    "loop_runtime": [],
                    "nehalem_westmere_double_precision": [],
                    "nehalem_westmere_L2_bandwidth": [],
                    "nehalem_westmere_L3_miss_rate": [],
                    "nehalem_westmere_memory_bandwidth": [],
                    "sandy_bridge_double_precision": [],
                    "sandy_bridge_L2_bandwidth": [],
                    "sandy_bridge_memory_data_volume": [],
                    "sandy_bridge_memory_bandwidth": [],
                    "haswell_compute_instructions": [],
                    "haswell_L2_bandwidth": [],
                    "haswell_memory_data_volume": [],
                    "haswell_memory_bandwidth": []
 
                }
            }
        ]
    }
}
