{
    "init": {
        "attributes": {
            "name": "init"
        }, 
        "params": [
            {
                "name": "loop_files", 
                "value": ["test.txt"]
            }, 
            {
                "name": "loop_id", 
                "value": "10"
            }, 
            {
                "name": "first_line", 
                "value": null
            }, 
            {
                "name": "end_line", 
                "value": null
            }, 
            {
                "name": "language", 
                "value": null
            }, 
            {
                "name": "source_function_name", 
                "value": null
            }, 
            {
                "name": "coverage_maqao", 
                "value": null
            }, 
            {
                "name": "coverage_icc_profiler", 
                "value": null
            }, 
            {
                "name": "coverage_vtune", 
                "value": null
            }, 
            {
                "name": "status_maqao_perf", 
                "value": null
            }, 
            {
                "name": "status_icc_profiler", 
                "value": null
            }, 
            {
                "name": "status_vtune", 
                "value": null
            }, 
            {
                "name": "time_sec", 
                "value": null
            }, 
            {
                "name": "nb_sample", 
                "value": null
            }, 
            {
                "name": "cpi_ratio", 
                "value": null
            }, 
            {
                "name": "loop_type", 
                "value": null
            }, 
            {
                "name": "loop_parents", 
                "value": []
            }, 
            {
                "name": "loop_children", 
                "value": []
            }, 
            {
                "name": "loop_group", 
                "value": null
            }, 
            {
                "name": "maqao_cqa_results"
            }
        ]
    }
}