plugin_uid = ffa07012-60ec-11e3-b233-cbdf068794cd
date_time_start = 2014/08/25 09:49:10
user_uid = f1452ea1-c8a5-4724-9463-4987f1f85d05
date_time_end = 2014/08/25 09:50:10
plugin_exit_code = 0
alias = lib_counting__2014_08_25_09:49:10:671387
