{
    "init": {
        "attributes": {
            "name": "init"
        }, 
        "params": [
            {
                "name": "username", 
                "value": "jdoe"
            }, 
            {
                "name": "password", 
                "value": "a31405d272b94e5d12e9a52a665d3bfe"
            }, 
            {
                "name": "full_name", 
                "value": "John Doe"
            }, 
            {
                "name": "company_name", 
                "value": ""
            }, 
            {
                "name": "email", 
                "value": "jdoe@exascale-computing.eu"
            }, 
            {
                "name": "web_page", 
                "value": ""
            }, 
            {
                "name": "phone", 
                "value": ""
            }, 
            {
                "name": "fax", 
                "value": ""
            }
        ]
    }
}