plugin_uid = 5c952ce6-11c0-47e8-8f53-132f0515de31
date_time_start = 2012/07/26 10:47:45
user_uid = f1452ea1-c8a5-4724-9463-4987f1f85d05
date_time_end = 2012/07/26 10:47:45
plugin_exit_code = 0
alias = intel_query_test