{
    "init": {
        "attributes": {
            "produce_data": true, 
            "name": "init", 
            "repository": "local", 
            "desc": "Initializes a process",
            "long_desc": "Creates a process entry using the given parameters."
        }, 
        "params": [
            {
                "type": "TEXT", 
                "name": "prefix", 
                "desc": "Prefix script",
                "long_desc": "The script to run before each iteration of the process.",
                "optional": true
            }, 
            {
                "type": "TEXT", 
                "name": "run", 
                "desc": "Process script",
                "long_desc": "The script to run on each processed entry.",
                "optional": true
            }, 
            {
                "type": "TEXT", 
                "name": "suffix", 
                "desc": "Suffix-script",
                "long_desc": "The script to run after each iteration of the process.",
                "optional": true
            }
        ]
    },
    "run": {
        "attributes": {
            "produce_data": true, 
            "name": "run", 
            "repository": "local", 
            "desc": "Runs a process",
            "long_desc": "Launches a process entry "
        }, 
        "params": [
            {
                "type": "DATA_UID", 
                "name": "process", 
                "desc": "The process entry",
                "long_desc": "The UID or Alias of the process entry to run.",
                "optional": true,
                "produced_by": "e8690810-69f3-11e1-81a4-0022191169c2"
            },
            {
                "type": "TEXT", 
                "name": "query", 
                "desc": "Query",
                "long_desc": "The query for searching data to process. See the query plugin documentation for more information."
            },
            {
                "type": "TEXT", 
                "name": "repository_query", 
                "desc": "Repository",
                "long_desc": "The repository in which data will be searched. Can be either 'all' for all repositories, 'common'/'temp' for the common or temp repository, or a loval repository UID or Alias."
            },
            {
                "type": "TEXT", 
                "name": "type_query", 
                "desc": "Type",
                "long_desc": "The entry type of the data to search (exp: application, loop...)",
                "optional": true
            }
        ]
    }
}