{
    "init": {
        "attributes": {
            "name": "init"
        }, 
        "params": [
            {
                "name": "loop_files", 
                "value": ["/home/users/npetit/exascale/install/REPOSITORIES/repair_test_clustering/test.c"]
            }, 
            {
                "name": "loop_id", 
                "value": null
            }, 
            {
                "name": "first_line", 
                "value": null
            }, 
            {
                "name": "end_line", 
                "value": null
            }, 
            {
                "name": "language", 
                "value": null
            }, 
            {
                "name": "source_function_name", 
                "value": null
            }, 
            {
                "name": "coverage_maqao", 
                "value": 1.0
            }, 
            {
                "name": "inclusive_coverage", 
                "value": null
            }, 
            {
                "name": "inclusive_nb_sample", 
                "value": 10
            }, 
            {
                "name": "coverage_icc_profiler", 
                "value": null
            }, 
            {
                "name": "coverage_vtune", 
                "value": null
            }, 
            {
                "name": "status_maqao_perf", 
                "value": null
            }, 
            {
                "name": "status_icc_profiler", 
                "value": null
            }, 
            {
                "name": "status_vtune", 
                "value": null
            }, 
            {
                "name": "time_sec", 
                "value": null
            }, 
            {
                "name": "nb_sample", 
                "value": null
            }, 
            {
                "name": "cpi_ratio", 
                "value": null
            },
            {
                "name": "loop_type", 
                "value": "outermost"
            }, 
            {
                "name": "loop_parents", 
                "value": []
            }, 
            {
                "name": "loop_children", 
                "value": []
            }, 
            {
                "name": "loop_group", 
                "value": "0cdedbbe-26e6-11e4-a795-77218bee016c"
            }, 
            {
                "name": "format", 
                "value": "txt"
            }
        ]
    }
}