Nb_32_bits_loads;Nb_cycles_P1;Nb_insn_MULPD_YMM;Ratio_ADD_SUB_/_MUL;Nb_32_bits_stores;(L1)_Nb_cycles_if_clean;Nb_insn_SQRTSS;predecode_(cycles);Nb_insn_SQRTPD_YMM;Nb_insn_SQRTSD;Nb_insn_MULPS_XMM;Nb_insn_MULSD;Nb_uops_P2;RecMII_(cycles);Nb_uops_P5;Nb_64_bits_loads;Nb_uops_P7;Nb_cycles_P0;Nb_128_bits_stores;Dispatch_(cycles);instr_fetch_(cycles);Nb_256_bits_loads;Nb_cycles_P2;Nb_used_YMM_reg;Nb_insn_ADD/SUBPS_XMM;Nb_insn_SQRTPS_XMM;Nb_256_bits_stores;Nb_cycles_P5;Nb_cycles_P4;Nb_cycles_P7;Nb_cycles_P6;Nb_cycles_P3;Nb_insn_MULPS_YMM;(L1_optimistic)_Nb_cycles_if_only_FP;Macro_fusion;Fit_in_cache;Nb_insn_DIVSS;Nb_insn_PD_YMM;Nb_insn_SQRTPD_XMM;Nb_insn_ADD/SUBPD_XMM;uop_queue_(cycles);ROB_read_(cycles);Nb_uops;Nb_insn_DIVPS_XMM;Nb_insn_DIVPD_YMM;Nb_insn_PS_XMM;(L1)_Nb_cycles_if_only_FP_arith;Nb_insn_DIVPD_XMM;Nb_used_MMX_reg;Nb_MOVH/LPS/D_loads;Nb_insn_ADD/SUBSS;Nb_insn_ADD/SUBSD;Nb_uops_P1;Nb_uops_P0;Nb_uops_P3;Nb_uops_P4;Nb_insn_DIVPS_YMM;Nb_uops_P6;Nb_insn_SS;Nb_insn_SD;Nb_insn_PD_XMM;Nb_insn_DIVSD;Nb_64_bits_stores;Nb_insn_PS_YMM;Nb_insn_MULSS;Nb_insn_ADD/SUBPS_YMM;(L1_optimistic)_Nb_cycles_if_clean;(L1_optimistic)_Nb_cycles_if_only_FP_arith;Nb_128_bits_loads;Nb_used_XMM_reg;Nb_insn_ADD/SUBPD_YMM;ID;Nb_MOVH/LPS/D_stores;(L1)_Nb_cycles_if_only_FP;instr_queue_(cycles);Nb_insn_SQRTPS_YMM;Nb_insn_MULPD_XMM
2;1.6666666666667;0;NA;1;NA;0;NA;0;0;0;0;2;2;1.6666666666667;0;0;1.6666666666667;0;2;NA;0;2;0;0;0;0;1.6666666666667;1;0;0;1;0;NA;true;Yes (loop buffer);0;0;0;0;2;2;7;0;0;0;NA;0;0;0;0;0;1.6666666666667;1.6666666666667;1;1;0;0;0;0;0;0;0;0;0;0;NA;NA;0;0;0;2;0;NA;NA;0;0
2;1.6666666666667;0;NA;1;NA;0;NA;0;0;0;0;2;2;1.6666666666667;0;0;1.6666666666667;0;2;NA;0;2;0;0;0;0;1.6666666666667;1;0;0;1;0;NA;true;Yes (loop buffer);0;0;0;0;2;2;7;0;0;0;NA;0;0;0;0;0;1.6666666666667;1.6666666666667;1;1;0;0;0;0;0;0;0;0;0;0;NA;NA;0;0;0;1;0;NA;NA;0;0
