{
    "init": {
        "attributes": {
            "name": "init"
        }, 
        "params": [
            {
                "name": "hostname", 
                "value": "aaa"
            }, 
            {
                "name": "vendor", 
                "value": ""
            }, 
            {
                "name": "organization", 
                "value": ""
            }, 
            {
                "name": "processor", 
                "value": [
                    ""
                ]
            }
        ]
    }
}
