Loop ID,Source Infos,Level,Time %,Time (s),CPI ratio,
4,MAIN__ - -1,-1@-1,Innermost,58.07 (10567),330.22,55.05,
8,vranlc_ - -1,-1@-1,Single,14.46 (2632),82.25,44.97,
1137,log - -1,-1@-1,Single,1.24 (225),7.03,83.72,
5,MAIN__ - -1,-1@-1,Outermost,0.02 (3),0.09,0.00,
