Loop ID;Function Name;Sources Infos;Level;Time %;Time (s);CPI ratio;Module;
3;MAIN__;;Innermost;40.75 (11670);233.40;36.13;ep.A;
7;vranlc_;;Single;3.90 (1118);22.36;11.58;ep.A;
6;MAIN__;;Innermost;0.00 (1);0.02;0.00;ep.A;
