{
    "init": {
        "attributes": {
            "name": "init"
        }, 
        "params": [
            {
                "name": "format", 
                "value": "json"
            }, 
            {
                "name": "auto_run", 
                "value": true
            }
        ]
    }
}