Loop ID,Source Infos,Level,Time %,Time (s),CPI ratio,
4,MAIN__ - -1,-1@-1,Innermost,53.96 (8885),277.66,41.40,
8,vranlc_ - -1,-1@-1,Single,16.34 (2691),84.09,45.59,
1137,log - -1,-1@-1,Single,10.64 (1752),54.75,25.45,
5,MAIN__ - -1,-1@-1,Outermost,0.02 (3),0.09,0.00,
