plugin_uid = 06e2e012-5b61-11e3-9170-d3f36bd3c5f9
date_time_start = 2014/08/25 11:14:38
user_uid = f1452ea1-c8a5-4724-9463-4987f1f85d05
date_time_end = 2014/08/25 11:14:39
plugin_exit_code = 0
alias = loop_2014_08_25_11:14:38:890038