{
    "init": {
        "attributes": {
            "name": "init"
        }, 
        "params": [
            {
                "name": "loop_files", 
                "value": null
            }, 
            {
                "name": "loop_id", 
                "value": "3"
            }, 
            {
                "name": "first_line", 
                "value": null
            }, 
            {
                "name": "end_line", 
                "value": null
            }, 
            {
                "name": "language", 
                "value": null
            }, 
            {
                "name": "source_function_name", 
                "value": "MAIN__"
            }, 
            {
                "name": "coverage_maqao", 
                "value": 40.700000000000003
            }, 
            {
                "name": "coverage_icc_profiler", 
                "value": null
            }, 
            {
                "name": "coverage_vtune", 
                "value": null
            }, 
            {
                "name": "status_maqao_perf", 
                "value": "stable"
            }, 
            {
                "name": "status_icc_profiler", 
                "value": null
            }, 
            {
                "name": "status_vtune", 
                "value": null
            }, 
            {
                "name": "time_sec", 
                "value": 233.88999999999999
            }, 
            {
                "name": "nb_sample", 
                "value": 11694.5
            }, 
            {
                "name": "cpi_ratio", 
                "value": 36.045000000000002
            },
            {
                "name": "loop_type", 
                "value": "innermost"
            }, 
            {
                "name": "loop_parents", 
                "value": [
                    "0dd4889e-10ba-11e4-9462-60eb69ce203c"
                ]
            }, 
            {
                "name": "loop_children", 
                "value": []
            }, 
            {
                "name": "loop_group", 
                "value": "0d349384-10ba-11e4-b14a-60eb69ce203c"
            }, 
            {
                "name": "maqao_cqa_results", 
                "value": null
            }
        ]
    }
}