plugin_uid = dc7711fa-16ea-11e3-8d3b-60eb69a62f1e
date_time_start = 2013/12/05 15:21:15
user_uid = f1452ea1-c8a5-4724-9463-4987f1f85d05
date_time_end = 2013/12/05 15:24:13
plugin_exit_code = 0
alias = test_maqao_perf_loop_group
