{
    "init": {
        "attributes": {
            "name": "init"
        }, 
        "params": [
            {
                "name": "maqao_cqa_results", 
                "value": []
            }, 
            {
                "name": "maqao_cqa", 
                "value": null
            }, 
            {
                "name": "format", 
                "value": "txt"
            }
        ]
    }
}