{
    "init": {
        "attributes": {
            "name": "init"
        }, 
        "params": [
            {
                "name": "type", 
                "value": "public"
            }, 
            {
                "name": "url", 
                "value": "www.lol.fr"
            }, 
            {
                "name": "sub_organizations", 
                "value": []
            }, 
            {
                "name": "cpu", 
                "value": []
            }, 
            {
                "name": "compiler", 
                "value": []
            }, 
            {
                "name": "user", 
                "value": []
            }, 
            {
                "name": "platform", 
                "value": []
            }, 
            {
                "name": "platform_organization", 
                "value": []
            }
        ]
    }
}
