{
    "init": {
        "attributes": {
            "long_desc": "Creates a maqao cqa entry using the given parameters.", 
            "produce_data": true, 
            "name": "init", 
            "repository": "local", 
            "desc": "Initializes data for MAQAO CQA analysis"
        }, 
        "params": [
            {
                "long_desc": "The UID or Alias of the loop_group entry that contains the executable.", 
                "name": "loop_group", 
                "produced_by": "2b54ef94-5b61-11e3-8722-7fd2ea71b72a", 
                "type": "DATA_UID", 
                "optional": true, 
                "desc": "binary entry"
            },  
            {
                "long_desc": "The file from which data will be extracted.", 
                "name": "maqao_cqa_output", 
                "type": "FILE",
                "optional": true, 
                "desc": "Source file"
            }, 
            {
                "long_desc": "The MAQAO version.", 
                "name": "maqao_version", 
                "type": "TEXT",
                "optional": true, 
                "desc": "maqao version"
            }, 
            {
                "long_desc": "When computing the port balancing (arithmetic / load / store...), the tolerance is used to determine if it's memor or arithmetic balanced.", 
                "name": "balancing_tolerance", 
                "type": "FLOAT",
                "optional": true, 
                "desc": "Port balancing's tolerance (in %)"
            },
            {
                "type": "FILE",
                "name": "unprocessed_maqao_csv",
                "desc": "Unprocessed maqao csv",
                "long_desc": "The unprocessed maqao csv.",
                "optional": true
            },
            {
                "type": "DATA_UID", 
                "name": "maqao_cqa_group", 
                "desc": "Maqao cqa group",
                "long_desc": "The maqao_cqa_group entries UIDs or Aliases.",
                "produced_by": "12f9c306-81be-11e3-84d8-57e305f7b932",
                "list": true,
                "target": "maqao_cqa",
                "optional": true
            }
        ]
    }
}
