{
    "init": {
        "attributes": {
            "name": "init"
        }, 
        "params": [
            {
                "name": "lib_counting_group", 
                "value": "7078e2aa-2c2c-11e4-95f6-ab1a240c5b90"
            }, 
            {
                "name": "loop", 
                "value": "3caee3d2-2c38-11e4-8a04-336399a03c27"
            }, 
            {
                "name": "invocations", 
                "value": 77211406408723011
            }, 
            {
                "name": "cycles", 
                "value": 39494962482421233
            }, 
            {
                "name": "frequency", 
                "value": 80575421741382720
            }, 
            {
                "name": "counters", 
                "value": {
                    "nehalem_westmere_L2_RQSTS_PF_MISS": [], 
                    "sandy_bridge_L1D_REPLACEMENT": [], 
                    "sandy_bridge_FP_COMP_OPS_EXE_SSE_FP_PACKED_DOUBLE": [], 
                    "sandy_bridge_CPU_CLK_UNHALTED_REF_P": [], 
                    "nehalem_westmere_L2_LINES_IN_ANY": [], 
                    "sandy_bridge_DTLB_LOAD_MISSES_CAUSES_A_WALK": [], 
                    "sandy_bridge_UOPS_DISPATCHED_PORT_PORT_5": [], 
                    "sandy_bridge_ARITH_FPU_DIV": [], 
                    "sandy_bridge_UNHALTED_REFERENCE_CYCLES": [], 
                    "sandy_bridge_MEM_LOAD_UOPS_RETIRED_HIT_LFB": [], 
                    "sandy_bridge_UNC_M_CAS_COUNT_0_RD": [], 
                    "sandy_bridge_UOPS_ISSUED_ANY": [], 
                    "nehalem_westmere_L2_RQSTS_RFO_MISS": [], 
                    "nehalem_westmere_UNC_QMC_NORMAL_READS_ANY": [], 
                    "nehalem_westmere_CPU_CLK_UNHALTED_REF_P": [], 
                    "sandy_bridge_LLC_MISSES": [], 
                    "sandy_bridge_DTLB_STORE_MISSES_CAUSES_A_WALK": [], 
                    "nehalem_westmere_RESOURCE_STALLS": [], 
                    "nehalem_westmere_UNC_QMC_WRITES_FULL_ANY": [], 
                    "sandy_bridge_UNC_M_CAS_COUNT_3_WR": [], 
                    "sandy_bridge_UNC_M_CAS_COUNT_1_RD": [], 
                    "sandy_bridge_DRAM_DATA_READS": [], 
                    "nehalem_westmere_L1D_M_EVICT": [], 
                    "sandy_bridge_L2_RQSTS_RFO_MISS": [], 
                    "sandy_bridge_UNC_M_CAS_COUNT_2_RD": [], 
                    "nehalem_westmere_FP_COMP_OPS_EXE_SSE_FP_PACKED": [], 
                    "sandy_bridge_L2_TRANS_L2_WB": [], 
                    "nehalem_westmere_L2_RQSTS_CODE_RD_MISS": [], 
                    "nehalem_westmere_UNHALTED_REFERENCE_CYCLES": [], 
                    "nehalem_westmere_INSTR_RETIRED": [], 
                    "sandy_bridge_UNC_M_CAS_COUNT_0_WR": [], 
                    "nehalem_westmere_HW_PRE_REQ_L1D_MISS": [], 
                    "nehalem_westmere_DTLB_LOAD_MISSES_CAUSES_A_WALK": [], 
                    "sandy_bridge_MEM_LOAD_UOPS_RETIRED_L2_HIT": [], 
                    "sandy_bridge_CPU_CLK_UNHALTED_THREAD_P": [], 
                    "sandy_bridge_L2_LINES_IN_ANY": [], 
                    "nehalem_westmere_ARITH_CYCLES_DIV_BUSY": [], 
                    "sandy_bridge_HW_PRE_REQ_L1D_MISS": [], 
                    "sandy_bridge_L2_RQSTS_PF_MISS": [], 
                    "sandy_bridge_UNC_M_CAS_COUNT_2_WR": [], 
                    "sandy_bridge_L1D_M_EVICT": [], 
                    "nehalem_westmere_DTLB_STORE_MISSES_CAUSES_A_WALK": [], 
                    "sandy_bridge_MEM_LOAD_UOPS_RETIRED_L1_HIT": [], 
                    "nehalem_westmere_FP_COMP_OPS_EXE_SSE_FP_SCALAR": [], 
                    "sandy_bridge_MEM_LOAD_UOPS_RETIRED_L3_HIT": [], 
                    "sandy_bridge_UNC_M_CAS_COUNT_1_WR": [], 
                    "sandy_bridge_L3_LAT_CACHE_MISS": [], 
                    "sandy_bridge_L2_RQSTS_CODE_RD_MISS": [], 
                    "sandy_bridge_UOPS_DISPATCHED_PORT_PORT_4": [], 
                    "sandy_bridge_DRAM_DATA_WRITES": [], 
                    "sandy_bridge_UOPS_DISPATCHED_PORT_PORT_2": [], 
                    "sandy_bridge_UOPS_DISPATCHED_PORT_PORT_3": [], 
                    "sandy_bridge_UOPS_DISPATCHED_PORT_PORT_0": [], 
                    "sandy_bridge_UOPS_DISPATCHED_PORT_PORT_1": [], 
                    "sandy_bridge_UNC_M_CAS_COUNT_3_RD": [], 
                    "sandy_bridge_RESOURCE_STALLS": [], 
                    "nehalem_westmere_UNC_L3_MISS_ANY": [], 
                    "nehalem_westmere_LLC_MISSES": [], 
                    "nehalem_westmere_UNC_LLC_MISS_ANY": [], 
                    "nehalem_westmere_L1D_REPL": [], 
                    "sandy_bridge_FP_COMP_OPS_EXE_SSE_SCALAR_DOUBLE": [], 
                    "sandy_bridge_INST_RETIRED": []
                }
            }, 
            {
                "name": "format", 
                "value": "txt"
            }
        ]
    }
}