{
    "my_cmd": {
        "attributes": {
            "produce_data": true, 
            "name": "my_cmd", 
            "repository": "local", 
            "desc": "Short description.",
            "long_desc": "Long description of what the command does."
        }, 
        "params": [
            {
                "type": "TEXT", 
                "name": "my_param_1", 
                "desc": "My param 1",
                "long_desc": "The explanation of what is expected in the my_param_1 parameter."
            }, 
            {
                "type": "TEXT", 
                "name": "my_param_2", 
                "desc": "My param 2",
                "long_desc": "The explanation of what is expected in the my_param_2 parameter."
            },
            {
                "type": "TEXT", 
                "name": "format", 
                "value": "txt", 
                "desc": "Format", 
                "long_desc": "The format of the output. 'txt' will display the output in a human readable manner. 'json' will output a JSON string containing the same Information.",
                "optional": true
            }
        ]
    }
}