{
    "init": {
        "attributes": {
            "name": "init"
        }, 
        "params": [
            {
                "name": "query", 
                "value": "loop_type:(outermost OR single) inclusive_nb_sample:>=5"
            }, 
            {
                "name": "repository_query", 
                "value": "all"
            }, 
            {
                "name": "features_lib_counting", 
                "value": [
                    "double_precision", 
                    "L2_bandwidth", 
                    "memory_data_volume", 
                    "memory_bandwidth"
                ]
            }, 
            {
                "name": "features_maqao_cqa", 
                "value": [
                    "common_Nb_FLOP_div", 
                    "x86_64_Nb_insn_SD", 
                    "x86_64_Nb_uops_P1", 
                    "x86_64_Ratio_ADD_SUB_/_MUL", 
                    "x86_64_RecMII_(cycles)", 
                    "common_Vec_ratio_(%)_mul_(FP)", 
                    "common_Vec_ratio_(%)_other", 
                    "common_Vec_ratio_(%)_other_(FP)", 
                    "common_(L1)_Bytes_stored_/_cycle", 
                    "common_(L1)_IPC"
                ]
            }, 
            {
                "name": "prefix_lib_counting", 
                "value": "sandy_bridge_"
            }, 
            {
                "name": "lib_counting_entry", 
                "value": []
            }, 
            {
                "name": "config_clustering", 
                "value": "config.R"
            }, 
            {
                "name": "CSV", 
                "value": "OUTPUT-features.csv"
            }, 
            {
                "name": "result", 
                "value": [
                    "clustering.csv", 
                    "median.csv"
                ]
            }, 
            {
                "name": "log_clustering", 
                "value": ["log_clustering.txt"]
            }
        ]
    }
}
