{
    "init": {
        "attributes": {
            "name": "init"
        }, 
        "params": [
            {
                "name": "maqao_cqa_group", 
                "value": "3af0e57e-26e6-11e4-a427-ef3f4d044c7e"
            }, 
            {
                "name": "loop", 
                "value": "407bdd6c-2c38-11e4-9099-a33825f1d2e2"
            }, 
            {
                "name": "format", 
                "value": "txt"
            }
        ]
    }
}