{
    "init": {
        "attributes": {
            "name": "init"
        }, 
        "params": [
            {
                "name": "maqao_cqa_output", 
                "value": "tmp.SBnedN1ygw"
            }, 
            {
                "name": "maqao_version", 
                "value": "NA"
            }, 
            {
                "name": "balancing_tolerance", 
                "value": 0.10000000000000001
            }, 
            {
                "name": "matrix_results", 
                "value": {
                    "common_Vec_eff_ratio_(%)_add_sub_(INT)": [
                        25.0
                    ], 
                    "common_Vec_eff_ratio_(%)_all": [
                        25.0
                    ], 
                    "common_(L1)_Nb_cycles": [
                        3.0
                    ], 
                    "common_Nb_stack_ref": [
                        0
                    ], 
                    "common_Nb_stores": [
                        1
                    ], 
                    "common_(L1)_FLOP/cycle": [
                        1.3333333333333
                    ], 
                    "common_Arith_intensity_extra_info": [
                        null
                    ], 
                    "common_Pattern": [
                        "x86"
                    ], 
                    "common_Vec_ratio_(%)_add_sub_(INT)": [
                        0.0
                    ], 
                    "common_(L1_optimistic)_FLOP/cycle": [
                        0.0
                    ], 
                    "common_Vec_eff_ratio_(%)_load": [
                        25.0
                    ], 
                    "common_Vec_eff_ratio_(%)_all_(FP)": [
                        null
                    ], 
                    "common_Vec_eff_ratio_(%)_mul_(FP)": [
                        null
                    ], 
                    "common_Vec_ratio_(%)_all": [
                        0.0
                    ], 
                    "common_Vec_eff_ratio_(%)_mul": [
                        25.0
                    ], 
                    "common_Vec_ratio_(%)_store": [
                        0.0
                    ], 
                    "common_(L1_optimistic)_Bytes_loaded_/_cycle": [
                        4.0
                    ], 
                    "common_Vec_ratio_(%)_mul_(INT)": [
                        0.0
                    ], 
                    "common_Nb_impl_loads": [
                        2
                    ], 
                    "common_Vec_eff_ratio_(%)_all_(INT)": [
                        25.0
                    ], 
                    "common_(L1)_IPC": [
                        0.0
                    ], 
                    "common_Vec_eff_ratio_(%)_store_(FP)": [
                        null
                    ], 
                    "common_(L1_optimistic)_Nb_cycles": [
                        3.0
                    ], 
                    "common_Arith_intensity_(FLOP_/_ld+st_bytes)": [
                        0.0
                    ], 
                    "common_Bytes_stored": [
                        4
                    ], 
                    "common_Can_be_analyzed": [
                        true
                    ], 
                    "common_port_balancing": [
                        1.3333333333333
                    ], 
                    "common_(L1_optimistic)_IPC": [
                        3.0
                    ], 
                    "common_Nb_paths": [
                        1
                    ], 
                    "common_Front_end_(cycles)": [
                        2.0
                    ], 
                    "common_Vec_eff_ratio_(%)_load_(INT)": [
                        25.0
                    ], 
                    "common_Vec_eff_ratio_(%)_store": [
                        25.0
                    ], 
                    "common_Nb_instr": [
                        9
                    ], 
                    "common_Source_file": [
                        "/tmp/mbordet_20140307_144701_681066274_local/mbordet_20140307_144701_681066274/APP/files/textc"
                    ], 
                    "common_Size_(bytes)": [
                        26
                    ], 
                    "common_Vec_ratio_(%)_load_(INT)": [
                        0.0
                    ], 
                    "common_Address_in_the_binary": [
                        "401828"
                    ], 
                    "common_Nb_FLOP_add_sub": [
                        0
                    ], 
                    "common_Unroll_confidence_level_(src_loop)": [
                        "max"
                    ], 
                    "common_Vec_eff_ratio_(%)_store_(INT)": [
                        25.0
                    ], 
                    "common_Vec_ratio_(%)_add_sub_(FP)": [
                        null
                    ], 
                    "common_Vec_ratio_(%)_all_(FP)": [
                        null
                    ], 
                    "common_Vec_eff_ratio_(%)_other_(FP)": [
                        null
                    ], 
                    "common_Vec_ratio_(%)_store_(FP)": [
                        null
                    ], 
                    "common_Bytes_loaded": [
                        12
                    ], 
                    "common_Unroll_info_(src_loop)": [
                        "not unrolled or unrolled with no peel/tail code"
                    ], 
                    "common_Vec_ratio_(%)_store_(INT)": [
                        0.0
                    ], 
                    "common_Vec_eff_ratio_(%)_load_(FP)": [
                        null
                    ], 
                    "common_Vec_ratio_(%)_other_(FP)": [
                        null
                    ], 
                    "common_Nb_FLOP_sqrt": [
                        0
                    ], 
                    "common_(L1_optimistic)_Bytes_stored_/_cycle": [
                        1.3333333333333
                    ], 
                    "common_Vec_eff_ratio_(%)_mul_(INT)": [
                        25.0
                    ], 
                    "common_Vec_eff_ratio_(%)_other_(INT)": [
                        null
                    ], 
                    "common_Bytes_prefetched": [
                        0
                    ], 
                    "common_Nb_used_x86_reg": [
                        8
                    ], 
                    "common_(L1)_Bytes_loaded_/_cycle": [
                        5.3333333333333002
                    ], 
                    "common_Nb_FLOP_div": [
                        0
                    ], 
                    "common_ID": [
                        1
                    ], 
                    "common_Function_name": [
                        "codelet_71ijn9mv"
                    ], 
                    "common_(L1)_Bytes_prefetched_/_cycle": [
                        4.0
                    ], 
                    "common_Source_lines": [
                        "16-17"
                    ], 
                    "common_Vec_eff_ratio_(%)_add_sub_(FP)": [
                        null
                    ], 
                    "common_Nb_pure_loads": [
                        1
                    ], 
                    "common_Vec_ratio_(%)_other": [
                        null
                    ], 
                    "common_Vec_ratio_(%)_load_(FP)": [
                        null
                    ], 
                    "common_Nb_FLOP_mul": [
                        0
                    ], 
                    "common_Vec_ratio_(%)_mul_(FP)": [
                        null
                    ], 
                    "common_Vec_ratio_(%)_load": [
                        0.0
                    ], 
                    "common_Vec_ratio_(%)_mul": [
                        0.0
                    ], 
                    "common_(L1_optimistic)_Bytes_prefetched_/_cycle": [
                        0.0
                    ], 
                    "common_(L1_optimistic)_Bytes_ld+st_/_cycle": [
                        5.3333333333333002
                    ], 
                    "common_Nb_FLOP_other": [
                        0
                    ], 
                    "common_Vec_ratio_(%)_add_sub": [
                        0.0
                    ], 
                    "common_(L1)_Bytes_ld+st_/_cycle": [
                        1.3333333333333
                    ], 
                    "common_Vec_eff_ratio_(%)_other": [
                        null
                    ], 
                    "common_Vec_ratio_(%)_all_(INT)": [
                        0.0
                    ], 
                    "common_decode_(cycles)": [
                        3.0
                    ], 
                    "common_(L1)_Bytes_stored_/_cycle": [
                        0.0
                    ], 
                    "common_Vec_ratio_(%)_other_(INT)": [
                        null
                    ], 
                    "common_Vec_eff_ratio_(%)_add_sub": [
                        25.0
                    ],
                    "k1om_Nb_insn_msk": [
                        null
                    ], 
                    "k1om_Nb_insn_x86": [
                        null
                    ], 
                    "k1om_Nb_insn_INTD": [
                        null
                    ], 
                    "k1om_Nb_insn_INTQ": [
                        null
                    ], 
                    "k1om_Nb_insn_PD": [
                        null
                    ], 
                    "k1om_Nb_insn_other": [
                        null
                    ], 
                    "k1om_Nb_used_ZMM_reg": [
                        null
                    ], 
                    "k1om_Nb_insn_x87": [
                        null
                    ], 
                    "k1om_Nb_insn_PS": [
                        null
                    ], 
                    "k1om_Nb_FLOP_fma": [
                        null
                    ], 
                    "x86_64_Nb_insn_PD_YMM": [
                        0
                    ], 
                    "x86_64_Nb_32_bits_loads": [
                        3
                    ], 
                    "x86_64_Nb_insn_SD": [
                        0
                    ], 
                    "x86_64_Nb_insn_MULPD_YMM": [
                        0
                    ], 
                    "x86_64_Ratio_ADD_SUB_/_MUL": [
                        null
                    ], 
                    "x86_64_Nb_32_bits_stores": [
                        1
                    ], 
                    "x86_64_Nb_insn_ADD/SUBPD_XMM": [
                        0
                    ], 
                    "x86_64_(L1_optimistic)_Nb_cycles_if_fully_vectorized": [
                        null
                    ], 
                    "x86_64_instr_queue_(cycles)": [
                        null
                    ], 
                    "x86_64_Nb_insn_SQRTPS_YMM": [
                        0
                    ], 
                    "x86_64_(L1)_Nb_cycles_if_clean": [
                        null
                    ], 
                    "x86_64_(L1_optimistic)_Nb_cycles_if_only_FP": [
                        null
                    ], 
                    "x86_64_Nb_insn_SQRTPD_XMM": [
                        0
                    ], 
                    "x86_64_Nb_64_bits_stores": [
                        0
                    ], 
                    "x86_64_Nb_insn_SQRTPD_YMM": [
                        0
                    ], 
                    "x86_64_(L1)_Nb_cycles_if_only_FP_arith": [
                        2.0
                    ], 
                    "x86_64_Nb_insn_DIVPD_XMM": [
                        0
                    ], 
                    "x86_64_ROB_read_(cycles)": [
                        2.0
                    ], 
                    "x86_64_Nb_insn_SQRTSS": [
                        0
                    ], 
                    "x86_64_Nb_insn_PD_XMM": [
                        0
                    ], 
                    "x86_64_instr_fetch_(cycles)": [
                        null
                    ], 
                    "x86_64_Nb_insn_SQRTPS_XMM": [
                        0
                    ], 
                    "x86_64_Nb_insn_PS_YMM": [
                        0
                    ], 
                    "x86_64_Nb_256_bits_stores": [
                        0
                    ], 
                    "x86_64_predecode_(cycles)": [
                        null
                    ], 
                    "x86_64_Nb_insn_DIVPD_YMM": [
                        0
                    ], 
                    "x86_64_Nb_insn_ADD/SUBPS_YMM": [
                        0
                    ], 
                    "x86_64_Nb_insn_PS_XMM": [
                        0
                    ], 
                    "x86_64_Macro_fusion": [
                        true
                    ], 
                    "x86_64_(L1_optimistic)_Nb_cycles_if_clean": [
                        null
                    ], 
                    "x86_64_Nb_insn_SQRTSD": [
                        0
                    ], 
                    "x86_64_Nb_cycles_P5": [
                        2.0
                    ], 
                    "x86_64_Nb_cycles_P4": [
                        1.0
                    ], 
                    "x86_64_Nb_cycles_P7": [
                        0.0
                    ], 
                    "x86_64_Nb_cycles_P6": [
                        0.0
                    ], 
                    "x86_64_Nb_cycles_P1": [
                        2.0
                    ], 
                    "x86_64_Nb_cycles_P0": [
                        2.0
                    ], 
                    "x86_64_Nb_cycles_P3": [
                        1.0
                    ], 
                    "x86_64_Nb_cycles_P2": [
                        3.0
                    ], 
                    "x86_64_Nb_used_MMX_reg": [
                        0
                    ], 
                    "x86_64_Nb_insn_MULSS": [
                        0
                    ], 
                    "x86_64_Nb_insn_MULPS_YMM": [
                        0
                    ], 
                    "x86_64_Nb_MOVH/LPS/D_loads": [
                        0
                    ], 
                    "x86_64_(L1_optimistic)_Nb_cycles_if_only_FP_arith": [
                        null
                    ], 
                    "x86_64_Nb_insn_ADD/SUBSS": [
                        0
                    ], 
                    "x86_64_Nb_insn_MULPS_XMM": [
                        0
                    ], 
                    "x86_64_Nb_uops_P3": [
                        1.0
                    ], 
                    "x86_64_Nb_128_bits_loads": [
                        0
                    ], 
                    "x86_64_Nb_used_XMM_reg": [
                        0
                    ], 
                    "x86_64_Nb_insn_ADD/SUBPD_YMM": [
                        0
                    ], 
                    "x86_64_Nb_insn_MULSD": [
                        0
                    ], 
                    "x86_64_Nb_uops": [
                        8
                    ], 
                    "x86_64_RecMII_(cycles)": [
                        2
                    ], 
                    "x86_64_Nb_insn_SS": [
                        0
                    ], 
                    "x86_64_Nb_insn_DIVPS_XMM": [
                        0
                    ], 
                    "x86_64_(L1)_Nb_cycles_if_fully_vectorized": [
                        null
                    ], 
                    "x86_64_uop_queue_(cycles)": [
                        null
                    ], 
                    "x86_64_Nb_insn_ADD/SUBSD": [
                        0
                    ], 
                    "x86_64_Nb_MOVH/LPS/D_stores": [
                        0
                    ], 
                    "x86_64_Nb_uops_P1": [
                        2.0
                    ], 
                    "x86_64_Nb_uops_P0": [
                        2.0
                    ], 
                    "x86_64_Nb_64_bits_loads": [
                        0
                    ], 
                    "x86_64_Nb_uops_P2": [
                        3.0
                    ], 
                    "x86_64_Nb_uops_P5": [
                        2.0
                    ], 
                    "x86_64_Nb_uops_P4": [
                        1.0
                    ], 
                    "x86_64_Nb_uops_P7": [
                        0.0
                    ], 
                    "x86_64_Nb_insn_DIVPS_YMM": [
                        0
                    ], 
                    "x86_64_(L1)_Nb_cycles_if_only_FP": [
                        null
                    ], 
                    "x86_64_Nb_uops_P6": [
                        0.0
                    ], 
                    "x86_64_Nb_insn_DIVSD": [
                        0
                    ], 
                    "x86_64_Nb_128_bits_stores": [
                        0
                    ], 
                    "x86_64_Fit_in_cache": [
                        "Yes (loop buffer)"
                    ], 
                    "x86_64_Dispatch_(cycles)": [
                        3.0
                    ], 
                    "x86_64_Nb_insn_MULPD_XMM": [
                        0
                    ], 
                    "x86_64_Nb_insn_DIVSS": [
                        0
                    ], 
                    "x86_64_Nb_256_bits_loads": [
                        0
                    ], 
                    "x86_64_Nb_used_YMM_reg": [
                        0
                    ], 
                    "x86_64_Nb_insn_ADD/SUBPS_XMM": [
                        0
                    ]
                }
            }, 
            {
                "name": "unprocessed_maqao_csv", 
                "value": "codelet_71ijn9mv.csv"
            }, 
            {
                "name": "maqao_cqa_group", 
                "value": []
            }
        ]
    }
}
