plugin_uid = 1bae6e90-e31d-4dd1-be06-b6ab5f661046
date_time_start = 2012/04/19 13:50:42
user_uid = 92afe58e-4d78-459c-98ad-65906233796c
date_time_end = 2012/04/19 13:50:42
plugin_exit_code = 0
additional_files = file_e.txt
