plugin_uid = fc709de6-6663-11e3-affc-13361bf1c038
date_time_start = 2014/08/25 11:14:44
user_uid = f1452ea1-c8a5-4724-9463-4987f1f85d05
date_time_end = 2014/08/25 11:14:45
plugin_exit_code = 0
alias = lib_counting_results_2014_08_25_11:14:44:824770
