4,5784624
4,5748440
4,5743444
4,5770020
4,5769412
4,5752456
4,5771832
4,5752276
4,5766556
4,5757376
4,5729460
4,5799036
4,5756028
4,5750832
4,5781848
4,5748020
4,5762288
4,5778528
4,5749540
4,5782412
4,5740144
4,5763548
4,5754848
4,5742700
4,5763904
4,5771584
4,5745968
4,5755284
4,5762416
4,5748252
4,5775244
4,5748604
4,5758232
4,5757756
4,5733748
4,5771776
4,5744960
4,5752532
4,5767096
4,5745536
4,5761408
4,5748436
4,5734400
4,5769308
4,5730912
4,5746636
4,5763136
4,5740328
4,5739720
4,5751948
4,5735764
4,5747072
4,5737228
4,5740848
4,5759132
4,5747056
4,5755408
4,5744760
4,5744708
4,5752452
4,5743720
4,5743376
4,5750852
4,5745408
4,5753976
4,5752712
4,5732152
4,5759544
4,5736644
4,5740576
4,5767072
4,5772808
4,5769588
4,5751456
4,5749900
4,5747920
4,5766744
4,5757052
4,5749124
4,5736452
4,5760648
4,5760384
4,5740144
4,5759348
4,5754828
4,5874640
4,5751384
4,5737248
4,5776048
4,5753380
4,5742960
4,5760256
4,5760260
4,5743872
4,5761888
4,5733336
4,5761552
4,5753184
4,5743120
4,5747120
4,5753520
4,5745936
4,5747832
4,5751308
4,5766452
4,6124280
4,5740584
4,5758040
4,5764108
4,5742000
4,5765128
4,5759016
4,5725668
4,5763380
4,5743552
4,5755372
4,5746916
4,5744908
4,5749284
4,5740924
4,5736924
4,5756352
4,5746436
4,5758288
4,5764828
4,5761116
4,5917388
4,5737928
4,5751004
4,5758316
4,5739516
4,5764556
4,5758908
4,5740596
4,5763316
4,5737492
4,5724944
4,5740280
4,5811452
4,5765036
4,5752912
4,5754940
4,5740248
4,5779144
4,5758688
4,5752948
4,5745628
4,5749652
4,5747680
4,5738324
4,5759752
4,5751556
4,5745228
4,5758492
4,5742124
4,5774540
4,5754664
4,5745236
4,5741636
4,5763316
4,5748340
4,5758052
4,5742640
4,5752760
4,5765596
4,5718620
4,5777936
4,5753444
4,5794808
4,5769560
4,5755512
4,5761056
4,5758532
4,5736284
4,5761308
4,5758456
4,5730088
4,5768528
4,5744956
4,5761644
4,5758232
4,5732744
4,5750292
4,5763448
4,5742692
4,5759576
4,5750704
4,5742752
4,5752256
4,5728576
4,5766532
4,5766004
4,5733404
4,5765464
4,5752128
4,5753616
4,5760380
4,5742480
4,5758376
4,5751788
4,5739332
4,5759036
4,5744056
4,5753736
4,5737704
4,5747344
4,5768036
4,5759448
4,5742128
4,5760284
4,5752984
4,5735996
4,5760380
4,5750348
4,5771024
4,5736908
4,5756472
4,5750352
4,5748620
4,5731340
4,5762632
4,5738468
4,5748948
4,5750980
4,5735912
4,5756916
4,5746328
4,5750220
4,5785076
4,5741896
4,5763376
4,5760032
4,5759580
4,5759872
4,5763228
4,5734656
4,5753984
4,5741352
4,5765324
4,5759264
4,5746256
4,5751764
4,5769256
4,5745428
4,5751668
4,5733032
4,5746588
4,5771024
4,5747988
4,5751060
4,5737164
4,5750780
4,5744584
4,5744208
4,5767348
4,5766468
4,5755200
4,5752356
4,5751660
4,5742728
4,5746392
4,5741316
4,5768700
4,5747048
4,5744488
4,5748928
4,5751112
4,5750536
4,5752340
4,5757796
4,5762348
4,5752168
4,5756676
4,5745676
4,5774836
4,5742712
4,5754820
4,5749888
4,5771556
4,5779524
4,5751264
4,5757596
4,5747644
4,5753300
4,5747900
4,5731680
4,5756372
4,5774136
4,5743812
4,5764424
4,5764040
4,5748352
4,5781156
4,5740972
4,5729316
4,5749004
4,5768612
4,5751280
4,5762716
4,5742836
4,5752644
4,5744656
4,5753308
4,5754040
4,5735860
4,5755700
4,5732340
4,5754784
4,5768656
4,5726640
4,5747656
4,5756376
4,5753748
4,5764768
4,5772100
4,5739292
4,5762720
4,5744636
4,5738584
4,5753584
4,5736308
4,5754332
4,5753448
4,5739712
4,5766900
4,5745436
4,5741212
4,5743236
4,5749092
4,5754328
4,5758868
4,5741276
4,5750088
4,5748636
4,5752132
4,5754804
4,5742592
4,5764032
4,5762556
4,5745252
4,5754904
4,5726044
4,5735392
4,5743680
4,5742060
4,5751132
4,5744800
4,5750604
4,5773544
4,5754388
4,5748528
4,5772236
4,5750972
4,5756228
4,5754176
4,5737676
4,5753196
4,5763748
4,5732480
4,5739876
4,5741360
4,5767352
4,5749588
4,5728572
4,5742356
4,5755212
4,5737580
4,5758308
4,5725852
4,5754460
4,5753744
4,5729388
4,5763684
4,5764140
4,5734636
4,5745912
4,5746080
4,5760880
4,5756456
4,5744332
4,5761932
4,5764816
4,5746548
4,5747604
4,5748976
4,5757720
4,5751416
4,5742920
4,5759784
4,5754112
4,5738624
4,5766532
4,5761720
4,5754912
4,5749220
4,5735084
4,5756556
4,5754932
4,5741160
4,5740892
4,5739120
4,5761464
4,5753764
4,5737916
4,5766388
4,5765984
4,5743352
4,5741220
4,5742188
4,5771044
4,5750832
4,5743064
4,5759908
4,5763620
4,5748660
4,5749052
4,5746844
4,5758832
4,5760888
4,5745564
4,5732572
4,5764744
4,5740772
4,5758924
4,5749900
4,5749280
4,5762788
4,5740412
4,5755200
4,5773456
4,5734392
4,5738244
4,5745992
4,5737732
4,5745732
4,5746580
4,5758612
4,5746596
4,5757952
4,5758836
4,5729544
4,5736544
4,5756520
4,5740152
4,5738252
4,5752040
4,5747996
4,5759920
4,5742612
4,5732308
4,5758752
4,5742092
4,5753592
4,5752868
4,5744776
4,5750396
4,5746652
4,5748236
4,5765900
4,5745484
4,5745012
4,5767408
4,5741700
4,5753568
4,5731856
4,5744256
4,5753112
4,5736976
4,5768780
4,5762860
4,5746772
4,5770776
4,5753928
4,5744404
4,5762432
4,5746932
4,5768728
4,5760764
4,5741628
4,5759916
4,5743512
4,5741708
4,5759620
4,5739396
4,5850636
4,5759220
4,5742848
4,5763764
4,5756928
4,5750216
4,5761348
4,5757932
4,5757112
4,5763596
4,5747696
4,5765100
4,5765480
4,5748964
4,5753140
4,5745616
4,5763580
4,5756256
4,5737920
4,5749264
4,5753452
4,5737516
4,5764096
4,5741868
4,5766992
4,5762712
4,5735556
4,5767296
4,5757200
4,5746952
4,5754092
4,5740088
4,5762684
4,5746644
4,5751200
4,5757168
4,5756688
4,5745524
4,5758688
4,5746524
4,5748252
4,5759268
4,5747196
4,5764504
4,5752924
4,5750620
4,5745672
4,5750404
4,5755420
4,5762292
4,5755616
4,5761652
4,5735712
4,5766920
4,5756824
4,5756168
4,5747804
4,5754516
4,5765268
4,5767876
4,5749616
4,5733284
4,5747484
4,5752252
4,5752804
4,5760280
4,5745072
4,5753328
4,5750840
4,5737596
4,5752884
4,5728264
4,5743000
4,5768628
4,5728984
4,5763536
4,5766324
4,5743972
4,5761460
4,5746676
4,5749300
4,5752392
4,5727244
4,5769644
4,5834964
4,5747492
4,5761972
4,5749592
4,5738152
4,5742992
4,5740952
4,5761996
4,5766024
4,5732952
4,5735364
4,5744496
4,5733700
4,5742528
4,5756236
4,5744944
4,5764548
4,5750324
4,5756008
4,5759176
4,5754248
4,5771404
4,5739224
4,5751552
4,5753668
4,5728744
4,5741240
4,5757700
4,5735908
4,5761992
4,5745268
4,5756340
4,5757772
4,5742880
4,5751396
4,5753748
4,5730376
4,5765320
4,5749444
4,5750372
4,5744084
4,5737076
4,5774332
4,5757804
4,5741672
4,5765396
4,5745644
4,5754876
4,5758104
4,5745368
4,5766196
4,5757772
4,5734588
4,5744792
4,5750112
4,5753252
4,5763100
4,5726504
4,5761028
4,5773184
4,5756812
4,5750844
4,5745520
4,5755400
4,5754780
4,5742556
4,5763616
4,5751960
4,5734736
4,5762924
4,5752932
4,5765564
4,5757028
4,5750500
4,5756072
4,5750876
4,5733080
4,5756276
4,5736236
4,5758884
4,5764944
4,5766436
4,5751256
4,5749352
4,5735356
4,5738240
4,5761288
4,5755504
4,5763620
4,5731548
4,5753784
4,5741764
4,5751776
4,5753048
4,5743332
4,5743972
4,5764480
4,5744624
4,5758700
4,5760660
4,5747132
4,5752456
4,5738352
4,5760468
4,5750640
4,5746576
4,5763892
4,5748740
4,5743832
4,5766828
4,5741976
4,5728492
4,5760952
4,5747368
4,5754832
4,5762908
4,5753444
4,5742788
4,5735488
4,5739812
4,5743372
4,5743912
4,5766136
4,5759384
4,5742844
4,5760040
4,5746412
4,5742048
4,5751268
4,5750552
4,5767916
4,5740276
4,5731736
4,5746992
4,5745144
4,5749928
4,5739664
4,5744064
4,5763888
4,5746924
4,5731448
4,5761716
4,5755128
4,5720208
4,5761344
4,5739072
4,5760568
4,5762228
4,5737152
4,5757788
4,5763288
4,5744744
4,5770572
4,5735264
4,5744120
4,5763244
4,5745560
4,5741028
4,5743808
4,5744820
4,5761228
4,5742524
4,5766176
4,7274764
4,7758876
4,7762392
4,7765380
4,7738800
4,6658276
4,5741688
4,5739808
4,5756280
4,5729108
4,5751208
4,5744276
4,5741112
4,5754572
4,5741552
4,5729028
4,5756348
4,5749400
4,5763392
4,5739888
4,5754532
4,5757504
4,5747492
4,5747796
4,5759072
4,5741948
4,5771036
4,5754296
4,5749916
4,5764384
4,5756152
4,5727184
4,5761448
4,5740504
4,5769924
4,5754796
4,5747344
4,5736336
4,5762812
4,5757864
4,5762356
4,5738324
4,5767028
4,5760092
4,5756028
4,5750940
4,5756732
4,5731320
4,5752024
4,5744148
4,5758116
4,5755344
4,5747176
4,5749828
4,5754416
4,5752892
4,5762284
4,5762384
4,5756748
4,5747764
4,5753220
4,5756588
4,5741024
4,5739236
4,5774772
4,5734016
4,5757300
4,5757348
4,5745100
4,5759904
4,5763356
4,5751076
4,5743872
4,5741908
4,5755008
4,5750484
4,5748576
4,5754296
4,5760512
4,5747792
4,5747348
4,5762696
4,5760192
4,5758836
4,5727028
4,5749184
4,5759196
4,5743208
4,5742188
4,5753028
4,5746556
4,5756516
4,5737632
4,5766492
4,5741744
4,5738716
4,5762984
4,5758196
4,5744236
4,5743936
4,5762108
4,5751636
4,5751060
4,5735496
4,5751320
4,5738696
4,5740500
4,5750168
4,5743808
4,5757320
4,5763768
4,5735752
4,5771628
4,5727640
4,5748444
4,5766512
4,5754056
4,5757468
4,5746056
4,5757700
4,5753824
4,5749760
4,5735568
4,5753488
4,5741764
4,5754348
4,5756724
4,5735960
4,5761236
4,5753904
4,5739400
4,5764968
4,5734840
4,5752660
4,5753444
4,5749976
4,5752692
4,5744344
4,5740604
4,5749488
4,5723640
4,5765480
4,5756292
4,5747144
4,5756320
4,5743744
4,5739828
4,5760140
4,5748468
4,5752496
4,5743068
4,5823696
4,5760360
4,5758020
4,5739988
4,5762148
4,5743228
4,5771316
4,5749428
4,5734908
4,5749576
4,5747400
4,5748900
4,5755640
4,5747256
4,5751956
4,5767804
4,5738900
4,5748184
4,5741116
4,5741668
4,5750816
4,5759224
4,5754488
4,5767636
4,5748448
4,5764236
4,5756400
4,5752760
4,5762832
4,5737400
4,5751212
4,5751332
4,5737460
4,5759552
4,5754616
4,5746588
4,5759136
4,5731720
4,5749292
4,5753996
4,5750636
4,5761640
4,5750352
4,5731072
4,5758468
4,5747208
4,5746988
4,5758692
4,5745460
4,5760708
4,5753344
4,5742276
4,5766828
4,5764344
4,5762084
4,5764060
4,5745872
4,5761540
4,5777488
4,5746252
4,5751628
4,5725252
4,5741340
4,5756644
4,5743568
4,5771224
4,5761000
4,5739704
4,5752540
4,5731824
4,5746736
4,5759896
4,5744172
4,5750816
4,5758300
4,5749772
4,5780424
4,5744120
4,5739532
4,5761644
4,5738072
4,5761056
4,5750784
4,5753424
4,5828456
4,5738968
4,5751968
4,5760760
4,5748092
4,5761516
4,5761008
4,5742232
4,5754888
4,5728932
4,5758324
4,5765132
4,5742284
4,5757112
4,5754336
4,5745204
4,5747128
4,5754564
4,5744924
4,5754996
4,5746884
4,5757684
4,5758240
4,5726304
4,5765924
4,5755280
4,5754220
4,5747052
4,5739952
4,5757340
4,5758412
4,5746024
4,5758528
4,5893828
4,5755980
4,5748832
4,5742984
4,5755124
4,5771148
4,5747616
4,5737452
4,5755508
4,5732460
4,5780028
4,5732340
4,5768972
4,5762852
4,5739516
4,5760256
4,5762072
4,5806516
4,5766968
4,5738128
4,5764880
4,5768384
4,5746532
4,5753452
4,5762336
4,5728936
4,5766392
4,5748324
4,5759152
4,5755352
4,5743752
4,5755912
4,5765008
4,5740600
4,5761784
4,5741512
4,5754264
4,5745208
4,5730556
4,5763712
4,5755888
4,5749156
4,5751192
4,5743948
4,5747512
4,5752028
4,5743296
4,5750172
4,5763160
4,5739236
4,5738312
4,5754748
4,5745696
4,5754236
4,5741528
4,5770028
4,5778128
4,5746360
4,5771556
4,5736328
4,5751108
4,5760456
4,5748708
4,5747920
4,5771148
4,5743908
4,5761440
4,5751084
4,5763660
4,5758168
4,5736836
4,5767928
4,5755508
4,5749240
4,5750296
4,5759472
4,5758216
4,5755132
4,5742148
4,5755744
4,5742272
4,5745760
4,5748948
4,5753692
4,5763292
4,5782340
4,5766460
4,5760416
4,5771660
4,5750168
4,5775448
4,5759440
4,5743676
4,5770168
4,5784216
4,5760464
4,5761144
4,5750196
4,5770340
4,5756448
4,5743424
4,5757712
4,5755912
4,5747320
4,5727588
4,5744048
4,5773100
4,5761216
4,5742572
4,5750344
4,5740028
4,5772332
4,5759844
4,5744696
4,5768056
4,5761276
4,5726652
4,5753860
4,5741612
4,5743324
4,5760708
4,5747392
4,5755520
4,5763128
4,5748080
4,5752856
4,5741660
4,5748604
4,5773680
4,5753020
4,5756720
4,5754972
4,5745276
4,5753488
4,5740208
4,5743424
4,5753484
4,5744600
4,5752136
4,5758512
4,5744488
4,5751908
4,5742036
4,5749132
4,5755160
4,5735832
4,5762356
4,5761336
4,5750656
4,5756000
4,5745824
4,5750992
4,5740844
4,5741996
4,5762200
4,5767668
4,5741016
4,5755304
4,5752680
4,5743084
4,5759380
4,5731896
4,5752080
4,5763276
4,5744544
4,5749240
4,5730296
4,5730628
4,5747384
4,5737168
4,5744608
4,5749016
4,5751764
4,5753376
4,5750920
4,5731152
4,5753220
4,5740388
4,5772348
4,5778808
4,5743432
4,5751504
4,5767816
4,5729616
4,5756188
4,5737864
4,5758520
4,5753120
4,5739996
4,5764064
4,5754496
4,5739588
4,5753852
4,5748960
4,5760572
4,5749328
4,5754280
4,5762164
4,5766692
4,5747520
4,5747876
4,5743272
4,5766232
4,5758564
4,5750984
4,5751536
4,5754836
4,5731140
4,5745548
4,5728176
4,5739064
4,5758324
4,5748396
4,5756016
4,5737252
4,5747440
4,5763396
4,5741972
4,5746812
4,5745436
4,5753204
4,5736044
4,5750148
4,5740904
4,5751032
4,5728072
4,5765796
4,5750400
4,5736772
4,5734544
4,5746244
4,5739364
4,5760920
4,5744032
4,5758556
4,5743424
4,5743852
4,5750180
4,5745076
4,5745628
4,5742256
4,5735424
4,5774400
4,5755804
4,5746996
4,5749304
4,5758564
4,5755428
4,5741292
4,5748148
4,5762172
4,5754520
4,5740752
4,5751672
4,5750772
4,5746852
4,5764036
4,5741080
4,5738648
4,5751332
4,5741856
4,5750560
4,5760296
4,5738736
4,5755200
4,5739300
4,5736620
4,5757756
4,5729272
4,5758776
4,5740228
4,5740804
4,5767012
4,5754868
4,5730604
4,5754716
4,5753448
4,5754432
4,5769892
4,5746768
4,5754948
4,5734040
4,5751032
4,5834252
4,5751336
4,5741932
4,5749436
4,5725124
4,5764316
4,5753396
4,5745036
4,5746488
4,5756284
4,5757240
4,5747596
4,5745548
4,5752752
4,5720820
4,5755304
4,5752332
4,5749496
4,5764124
4,5755928
4,5744744
4,5765140
4,5738492
4,5746280
4,5761304
4,5747864
4,5749956
4,5745744
4,5742440
4,5756656
4,5767800
4,5754332
4,5752160
4,5738720
4,5754400
4,5752832
4,5739180
4,5771096
4,5753784
4,5742928
4,5754940
4,5731668
4,5751760
4,5759908
4,5739208
4,5749132
4,5767296
4,5743992
4,5753040
4,5746852
4,5765136
4,5754620
4,5756964
4,5776920
4,5778620
4,5745940
4,5758008
4,5741128
4,5773168
4,5757880
4,5737620
4,5743700
4,5756868
4,5746100
4,5760208
4,5728236
4,5756944
4,5752420
4,5741948
4,5760596
4,5752648
4,5755332
4,5750528
4,5758932
4,5745080
4,5770084
4,5733992
4,5741260
4,5747756
4,5742412
4,5762080
4,5740248
4,5773696
4,5760152
4,5853048
4,5766392
4,5764692
4,5745872
4,5753884
4,5760088
4,5735060
4,5757760
4,5745536
4,5759924
4,5764536
4,5755944
4,5743464
4,5752296
4,5736764
4,5764408
4,5737292
4,5758976
4,5747368
4,5758108
4,5757652
4,5745224
4,5732280
4,5761156
4,5753468
4,5761888
4,5762616
4,5741900
4,5765384
4,5745280
4,5755240
4,5768096
4,5751996
4,5760732
4,5756132
4,5741872
4,5762056
4,5748968
4,5748108
4,5751648
4,5743576
4,5748328
4,5751904
4,5743524
4,5757784
4,5746732
4,5756304
4,5744124
4,5747036
4,5774868
4,5776872
4,5737148
4,5762432
4,5755564
4,5732956
4,5759400
4,5740728
4,5764520
4,5770080
4,5746508
4,5761256
4,5740624
4,5756960
4,5751372
4,5746796
4,5749920
4,5763180
4,5752320
4,5756272
4,5762204
4,6016308
4,5741068
4,5743148
4,5758776
4,5764416
4,5747904
4,5763956
4,5746752
4,5744184
4,5738240
4,5741976
4,5753380
4,5753972
4,5733192
4,5743748
4,5760312
4,5748636
4,5762424
4,5740480
4,5742572
4,5762988
4,5744524
4,5754080
4,5771624
4,5749912
4,5766056
4,5746524
4,5745712
4,5775344
4,5746168
4,5768836
4,5775200
4,5741180
4,5753844
4,5741980
4,5737840
4,5759408
4,5742572
4,5752660
4,5761896
4,5745720
4,5754508
4,5736636
4,5741608
4,5752016
4,5739768
4,5748368
4,5781732
4,5734204
4,5748840
4,5739728
4,5744396
4,5758120
4,5743044
4,5765436
4,5758776
4,5733528
4,5763868
4,5745180
4,5755820
4,5760584
4,5755020
4,5758688
4,5761600
4,5737828
4,5763256
4,5739464
4,5733012
4,5756508
4,5731580
4,5759656
4,5759616
4,5728736
4,5746588
4,5763660
4,5749704
4,5773088
4,5739464
4,5760764
4,5759540
4,5731408
4,5760620
4,5754472
4,5734496
4,5756104
4,5734816
4,5743064
4,5765832
4,5731632
4,5765392
4,5749496
4,5746312
4,7763868
4,7806548
4,7769356
4,7737384
4,7757104
4,6137256
4,5754920
4,5752592
4,5766860
4,5741608
4,5752480
4,5754832
4,5748320
4,5748492
4,5751980
4,5740092
4,5757544
4,5765452
4,5733148
4,5766436
4,5743020
4,5773064
4,5748308
4,5728680
4,5750600
4,5764988
4,5739264
4,5767500
4,5742804
4,5764572
4,5758012
4,5742484
4,5756448
4,5750788
4,5743964
4,5750472
4,5734240
4,5753624
4,5767592
4,5751908
4,5765464
4,5740556
4,5752664
4,5757904
4,5777740
4,5757268
4,5735412
4,5746768
4,5754708
4,5737168
4,5770084
4,5880784
4,5749408
4,5745520
4,5747276
4,5766380
4,5751436
4,5744080
4,5753152
4,5743856
4,5755228
4,5751800
4,5747276
4,5765748
4,5763440
4,5739520
4,5756004
4,5753760
4,5750288
4,5752340
4,5752536
4,5753520
4,5749996
4,5749632
4,5765300
4,5771856
4,5739224
4,5765912
4,5744900
4,5760352
4,5767224
4,5740460
4,5777056
4,5751260
4,5746872
4,5768636
4,5751184
4,5754628
4,5758068
4,5726868
4,5767092
4,5752536
4,5738044
4,5766284
4,5760868
4,5743796
4,5762620
4,5723488
4,5759444
4,5765440
4,5748304
4,5781996
4,5737660
4,5747340
4,5758516
4,5739100
4,5759248
4,5754908
4,5726256
4,5753088
4,5749184
4,5743404
4,5765012
4,5737500
4,5764224
4,5767296
4,5751244
4,5740860
4,5751724
4,5754216
4,5744696
4,5742784
4,5767468
4,5751752
4,5730848
4,5753676
4,5743792
4,5743436
4,5745360
4,5723628
4,5746912
4,5757852
4,5735016
4,5764148
4,5754100
4,5762544
4,5772832
4,5758612
4,5759352
4,5759016
4,5720320
4,5755812
4,5740712
4,5740656
4,5761520
4,5750032
4,5767640
4,5753536
4,5717416
4,5761156
4,5760016
4,5740644
4,5758716
4,5764188
4,5744304
4,5751448
4,5735944
4,5744240
4,5758208
4,5753728
4,5755708
4,5733012
4,5762488
4,5758036
4,5737376
4,5763712
4,5767348
4,5751788
4,5750868
4,5909676
4,5767708
4,5771164
4,5752112
4,5764132
4,5752712
4,5726348
4,5758544
4,5742844
4,5755292
4,5760956
4,5761848
4,5755912
4,5756008
4,5753148
4,5757340
4,5752124
4,5740884
4,5743808
4,5734580
4,5760076
4,5748240
4,5741100
4,5763144
4,5750456
4,5741116
4,5760084
4,5732716
4,5777244
4,5762768
4,5740896
4,5768520
4,5748008
4,5733892
4,5764548
4,5747140
4,5746392
4,5745636
4,5742212
4,5765524
4,5735936
4,5724772
4,5760136
4,5736952
4,5757888
4,5746364
4,5761952
4,5752692
4,5751300
4,5740552
4,5757952
4,5746824
4,5764000
4,5755836
4,5754436
4,5765628
4,5741460
4,5737496
4,5763888
4,5725560
4,5762656
4,5749488
4,5752532
4,5749980
4,5734884
4,5741884
4,5772768
4,5743660
4,5758676
4,5756124
4,5739664
4,5755144
4,5755452
4,5758860
4,5760500
4,5736024
4,5763116
4,5747400
4,5761836
4,5752916
4,5743460
4,5730852
4,5751336
4,5732548
4,5750248
4,5753652
4,5740116
4,5757128
4,5757528
4,5747224
4,5748480
4,5738564
4,5750368
4,5741692
4,5744244
4,5768020
4,5749796
4,5730756
4,5757132
4,5735908
4,5757600
4,5757732
4,5749780
4,5758044
4,5760556
4,5741060
4,5773292
4,5741844
4,5755252
4,5761480
4,5737064
4,5742808
4,5773260
4,5755640
4,5752292
4,5749052
4,5748712
4,5757984
4,5740872
4,5760704
4,5754884
4,5747184
4,5749328
4,5732672
4,5748780
4,5769196
4,5753904
4,5756644
4,5755624
4,5744028
4,5764120
4,5744216
4,5754440
4,5762708
4,5753300
4,5765608
4,5745012
4,5761892
4,5769632
4,5744992
4,5745152
4,5743120
4,5942152
4,5744012
4,5755656
4,5740512
4,5767836
4,5752908
4,5729012
4,5755408
4,5734972
4,5751416
4,5754160
4,5736884
4,5752408
4,5738040
4,5740604
4,5756844
4,5735864
4,5761240
4,5754780
4,5739104
4,5747340
4,5751052
4,5760148
4,5762380
4,5745660
4,5749208
4,5751132
4,5746708
4,5761816
4,5744944
4,5756012
4,5760920
4,5749436
4,5759148
4,5758716
4,5754812
4,5761596
4,5749852
4,5747996
4,5770292
4,5742700
4,5765564
4,5757952
4,5738208
4,5772160
4,5764396
4,5733576
4,5741220
4,5742552
4,5757116
4,5751536
4,5760120
4,5746196
4,5752420
4,5734924
4,5748932
4,5747664
4,5762700
4,5759652
4,5754552
4,5767092
4,5755148
4,5749960
4,5753516
4,5739008
4,5763564
4,5758932
4,5744596
4,5759496
4,5756100
4,5741876
4,5754924
4,5752772
4,5764844
4,5750300
4,5735992
4,5752876
4,5754508
4,5739240
4,5758688
4,5748784
4,5750512
4,5764952
4,5742848
4,5752740
4,5744532
4,5735852
4,5759056
4,5751456
4,5751948
4,5745612
4,5725364
4,5747156
4,5756344
4,5734760
4,5751276
4,5745916
4,5752048
4,5755548
4,5743604
4,5748896
4,5753956
4,5757672
4,5752368
4,5737184
4,5757044
4,5770112
4,5736372
4,5757056
4,5761656
4,5741668
4,5769708
4,5729316
4,5741944
4,5754528
4,5750268
4,5762448
4,5763012
4,5742988
4,5759288
4,5748036
4,5736188
4,5756260
4,5748356
4,5759100
4,5753432
4,5758260
4,5761632
4,5744612
4,5755384
4,5764924
4,5734908
4,5761628
4,5791216
4,5757256
4,5752720
4,5736804
4,5742416
4,5769440
4,5753492
4,5753048
4,5742968
4,5756660
4,5744560
4,5733980
4,5742252
4,5761596
4,5746248
4,5748608
4,5754692
4,5741724
4,5767392
4,5737444
4,5742584
4,5761776
4,5737092
4,5743920
4,5753276
4,5738600
4,5754620
4,5734408
4,5746772
4,5756308
4,5738636
4,5749268
4,5765852
4,5756112
4,5769600
4,5750968
4,5749132
4,5769872
4,5745632
4,5739796
4,5742548
4,5732324
4,5753180
4,5751628
4,5735980
4,5757964
4,5750968
4,5751296
4,5774796
4,5739620
4,5745960
4,5752716
4,5745436
4,5750596
4,5737460
4,5757500
4,5788984
4,5751816
4,5747956
4,5754948
4,5739316
4,5766416
4,5739304
4,5750148
4,5767384
4,5741976
4,5748236
4,5767360
4,5755240
4,5755136
4,5751304
4,5769176
4,5764196
4,5736304
4,5755780
4,5757776
4,5735872
4,5760540
4,5744436
4,5759392
4,5747088
4,5756780
4,5755300
4,5750920
4,5735748
4,5761984
4,5755176
4,5757664
4,5750672
4,5746412
4,5761688
4,5755656
4,5741884
4,5756652
4,5744120
4,5736232
4,5753856
4,5758716
4,5761040
4,5759244
4,5730908
4,5758320
4,5755980
4,5751112
4,5767648
4,5748760
4,5764004
4,5745948
4,5733552
4,5752300
4,5740188
4,5741112
4,5762124
4,5747464
4,5747772
4,5751096
4,5755248
4,5748436
4,5749044
4,5733748
4,5765648
4,5738880
4,5752828
4,5769764
4,5728896
4,5764972
4,5746200
4,5741140
4,5760416
4,5730692
4,5756884
4,5757972
4,5738748
4,5759208
4,5757972
4,5754308
4,5760904
4,5744436
4,5751220
4,5746812
4,5730544
4,5757788
4,5741664
4,5745404
4,5754896
4,5734212
4,5758620
4,5752088
4,5761252
4,5755820
4,5747520
4,5751632
4,5743828
4,5738856
4,5763340
4,5760208
4,5740528
4,5761960
4,5758216
4,5737520
4,5751360
4,5733468
4,5757312
4,5769196
4,5737264
4,5767980
4,5744964
4,5741448
4,5744860
4,5745200
4,5749328
4,5762004
4,5733740
4,5768928
4,5750152
4,5748208
4,5766036
4,5749416
4,5759256
4,5758472
4,5750640
4,5759948
4,5739880
4,5746308
4,5773300
4,5730044
4,5763240
4,5767832
4,5740104
4,5749808
4,5757636
4,5730412
4,5749144
4,5760908
4,5759884
4,5757292
4,5734496
4,5745996
4,5762756
4,5754976
4,5754512
4,5735824
4,5750552
4,5751684
4,5745640
4,5757460
4,5748144
4,5739712
4,5762528
4,5729612
4,5748804
4,5753812
4,5743220
4,5753972
4,5754752
4,5734096
4,5767356
4,5748892
4,5749572
4,5758792
4,5740312
4,5766584
4,5744808
4,5751156
4,5752636
4,5761256
4,5758028
4,5754820
4,5737668
4,5761884
4,5761084
4,5742120
4,5767676
4,5733120
4,5748796
4,5745720
4,5745668
4,5759396
4,5745772
4,5735748
4,5750644
4,5743588
4,5733544
4,5743312
4,5749956
4,5752524
4,5753324
4,5747292
4,5762836
4,5736296
4,5742408
4,5757576
4,5730860
4,5766644
4,5752408
4,5757396
4,5749276
4,5729140
4,5724920
4,5764020
4,5751972
4,5776944
4,5761280
4,5735556
4,5748948
4,5747784
4,5740684
4,5751548
4,5750220
4,5770172
4,5760236
4,5740220
4,5763848
4,5755468
4,5743660
4,5771160
4,5750768
4,5749072
4,5748840
4,5734460
4,5756444
4,5748864
4,5725048
4,5753360
4,5744544
4,5757524
4,5761084
4,5745012
4,5749072
4,5755304
4,5747660
4,5767520
4,5742376
4,5756348
4,5774324
4,5743576
4,5764580
4,5761780
4,5743316
4,5752296
4,5738408
4,5750756
4,5772076
4,5739752
4,5757292
4,5757824
4,5727668
4,5757296
4,5748468
4,5738168
4,5763156
4,5748108
4,5753436
4,5737612
4,5740888
4,5745084
4,5748680
4,5768172
4,5754340
4,5729612
4,5756880
4,5758728
4,5744304
4,5741192
4,5745668
4,5753836
4,5760572
4,5740096
4,5749508
4,5766296
4,5749976
4,5758912
4,5745464
4,5754356
4,5754604
4,5736056
4,5752500
4,5755332
4,5741520
4,5764140
4,5739292
4,5754500
4,5774196
4,5753228
4,5769868
4,5741112
4,5754032
4,5746028
4,5748772
4,5747296
4,5747704
4,5735096
4,5750616
4,5764276
4,5734248
4,5766032
4,5742464
4,5751428
4,5763768
4,5738736
4,5770108
4,5759216
4,5744796
4,5769140
4,5724492
4,5730656
4,5751504
4,5752776
4,5770320
4,5749652
4,5745292
4,5757020
4,5749312
4,5748096
4,5753964
4,5738164
4,5760556
4,5746276
4,5740780
4,5756716
4,5737780
4,5734240
4,5743060
4,5743444
4,5762548
4,5763816
4,5741056
4,5758552
4,5743828
4,5758456
4,5764104
4,5738692
4,5759500
4,5764036
4,5740200
4,5742884
4,5742492
4,5745880
4,5749480
4,5775236
4,5760108
4,5772952
4,5742692
4,5765128
4,5759676
4,5743052
4,5756096
4,5748584
4,5743236
4,5752216
4,5744312
4,5765544
4,5764684
4,5737100
4,5758460
4,5746332
4,5756892
4,5771640
4,5750172
4,5780780
4,5754704
4,5731572
4,5754936
4,5728168
4,5775876
4,5755176
4,5744944
4,5761800
4,5758248
4,5744944
4,5754244
4,5737252
4,5762724
4,5766676
4,5749404
4,5760080
4,5782984
4,5726736
4,5750624
4,5751532
4,5752388
4,5763396
4,5748832
4,5757596
4,5763824
4,5742264
4,5754424
4,5738804
4,5762344
4,5752324
4,5751872
4,5761832
4,5757724
4,5741956
4,5760092
4,5775136
4,5737484
4,5754404
4,5746224
4,5765076
4,5746512
4,5750004
4,5759972
4,5754660
4,5742480
4,5758408
4,5744592
4,5763560
4,5760608
4,5740664
4,5761292
4,5749988
4,5745800
4,5742436
4,5746952
4,5771048
4,5763888
4,5740000
4,5751604
4,5737088
4,5745864
4,5755736
4,5740044
4,5766756
4,5741704
4,5736788
4,5748680
4,5737580
4,5760736
4,5765296
4,5733516
4,5749236
4,5743936
4,5747208
4,5761500
4,5739244
4,5730748
4,5754364
4,5754324
4,5766520
4,5763672
4,5826488
4,5769668
4,5756148
4,5741444
4,5757812
4,5741340
4,5762276
4,5762248
4,5760740
4,5757372
4,5758804
4,5740060
4,5755136
4,5733120
4,5748912
4,5749984
4,5737904
4,5758820
4,5756788
4,5751120
4,5743676
4,5744828
4,5759004
4,5929296
4,5737524
4,5773188
4,5754144
4,5742548
4,5749856
4,5750772
4,5747780
4,5757800
4,5756744
4,5766148
4,5752476
4,5742976
4,5759552
4,5737468
4,5771416
4,5753764
4,5774740
4,5756496
4,5755832
4,5744312
4,5757420
4,5738676
4,5750544
4,5754516
4,5735200
4,5754432
4,5757252
4,5752156
4,5757444
4,5738080
4,5754296
4,5753964
4,5731392
4,5754508
4,5754036
4,5742896
4,5767432
4,5745352
4,5743532
4,5762876
4,5739968
4,5749280
4,5761016
4,5739100
4,5758204
4,5739980
4,5750780
4,5759012
4,5744936
4,5775800
4,5765864
4,5736780
4,5743648
4,5738692
4,5741200
4,5751656
4,5751644
4,5750148
4,5742300
4,5746560
4,5756932
4,5756688
4,5753168
4,5760240
4,5742068
4,5762240
4,5759412
4,5739468
4,5746528
4,5748304
4,5746528
4,5754536
4,5757580
4,5772972
4,5771636
4,5746288
4,5738204
4,5750856
4,5762636
4,5766592
4,5738800
4,5755284
4,5765816
4,5738712
4,5755596
4,5758268
4,5746724
4,5764164
4,5749832
4,5740348
4,5772624
4,5740124
4,5761252
4,5758268
4,5753448
4,5752204
4,5743456
4,5760716
4,5753752
4,5736452
4,5770812
4,5757304
4,5727828
4,5757128
4,5743968
4,5742036
4,5757004
4,5742924
4,5755476
4,5766384
4,5751036
4,5757244
4,5748624
4,5768300
4,5754904
4,5732532
4,5752660
4,5749628
4,5738040
4,5754252
4,5737904
4,5763720
4,5748684
4,5745576
4,5764472
4,5764576
4,5742596
4,5755136
4,5725596
4,5749808
4,5749072
4,5726748
4,5760684
4,5764244
4,5749404
4,5749344
4,5752644
4,5757588
4,5767140
4,5743064
4,5745228
4,5767656
4,5741848
4,5765944
4,5746692
4,5732084
4,5754940
4,5740384
4,5754932
4,5742248
4,5742036
4,5754868
4,5734388
4,5746144
4,5768348
4,5748036
4,5763880
4,5757896
4,5740260
4,5762756
4,5737228
4,5735448
4,5772108
4,5749788
4,5765976
4,5772888
4,5743260
4,5762032
4,5751648
4,5742948
4,5755336
4,5753272
4,5764836
4,5766168
4,5740060
4,5768256
4,5783412
4,5749880
4,5749308
4,5751188
4,5776412
4,5762400
4,5749540
4,5759640
4,5767844
4,5740376
4,5767992
4,5746224
4,5761872
4,5770656
4,5749616
4,5769716
4,5745044
4,5754076
4,5768880
4,5734104
4,5747180
4,5744512
4,5736344
4,5754952
4,5765920
4,5741492
4,5774336
4,5746736
4,5760768
4,5760380
4,5738940
4,5767080
4,5746884
4,5741468
4,5755820
4,5725344
4,5764088
4,5762972
4,5739260
4,5748424
4,5749836
4,5746432
4,5754672
4,5737432
4,5779936
4,5751108
4,5759108
4,5759952
4,5752180
4,5737088
4,5770744
4,5731120
4,5751628
4,5749984
4,5742560
4,5752484
4,5747272
4,5754336
4,5762236
4,5751404
4,5762336
4,5753596
4,5747084
4,5782208
4,5756152
4,5732492
4,5751240
4,5752812
4,5724616
4,5754092
4,5742256
4,5764948
4,5754256
4,5753572
4,5762492
4,5740752
4,5756432
4,5806248
4,5751556
4,5766232
4,5765120
4,5740416
4,5767704
4,5733280
4,5743496
4,5772216
4,5733612
4,5764688
4,5763236
4,5739356
4,5747024
4,5726148
4,5757692
4,5765652
4,5747584
4,5753232
4,5752008
4,5776016
4,5757116
4,5737760
4,5738680
4,5748004
4,5754908
4,5767524
4,5767300
4,5745656
4,5763448
4,5751044
4,5749636
4,5746020
4,5744444
4,5758200
4,5763000
4,5754336
4,5755868
4,5763336
4,5749852
4,5744980
4,5739892
4,5749168
4,5762404
4,5739064
4,5764356
4,5750440
4,5747004
4,5774728
4,5757632
4,5745828
4,5753128
4,5737704
4,5755020
4,5749076
4,5755972
4,5762644
4,5742524
4,5748308
4,5760848
4,5748216
4,5756064
4,5751204
4,5733072
4,5759960
4,5735816
4,5755632
4,5750064
4,5731752
4,5751164
4,5762092
4,5741096
4,5739872
4,5752896
4,5759480
4,5762116
4,5729968
4,5781776
4,5746816
4,5755776
4,5749124
4,5747716
4,5763964
4,5766764
4,5750096
4,5749964
4,5751000
4,5760164
4,5766852
4,5748108
4,5761860
4,5757704
4,5735092
4,5748508
4,5746844
4,5743120
4,5748308
4,5741200
4,5742008
4,5749096
4,5745532
4,5762396
4,5747456
4,5752236
4,5741416
4,5753848
4,5738304
4,5764324
4,5736420
4,5759968
4,5752520
4,5755288
4,5759800
4,5737764
4,5736100
4,5757272
4,5743452
4,5754088
4,5757120
4,5745176
4,5751024
4,5759364
4,5742708
4,5754200
4,5747232
4,5749016
4,5752364
4,5751436
4,5760888
4,5747676
4,5730180
4,5764972
4,5742164
4,5763516
4,5742532
4,5734928
4,5764196
4,5756024
4,5745420
4,5751012
4,5760304
4,5757880
4,5766552
4,5753252
4,5745176
4,5766620
4,5745808
4,5767932
4,5731572
4,5757196
4,5748792
4,5744880
4,5757856
4,5762760
4,5729500
4,5763044
4,5734664
4,5758572
4,5761028
4,5741604
4,5760880
4,5738824
4,5749312
4,5758972
4,5737764
4,5761944
4,5746148
4,5734236
4,5773128
4,5757780
4,5746888
4,5755092
4,5736684
4,5769212
4,5761596
4,5735292
4,5754264
4,5760036
4,5741700
4,5756012
4,5755428
4,5754784
4,5765276
4,5728748
4,5762016
4,5745720
4,5733456
4,5769308
4,5740988
4,5761296
4,5760356
4,5745672
4,5778796
4,5753812
4,5736316
4,5762144
4,5740476
4,5762336
4,5752808
4,5731456
4,5758084
4,5769088
4,5752704
4,5754932
4,5745896
4,5754556
4,5749196
4,5743048
4,5757368
4,5766968
4,5751240
4,5751436
4,5727752
4,5750076
4,5767320
4,5738704
4,5759436
4,5750736
4,5733088
4,5747152
4,5734384
4,5738324
4,5749164
4,5732840
4,5740584
4,5762012
4,5745456
4,5744008
4,5730444
4,5728972
4,5742344
4,5748316
4,5742168
4,5754036
4,5744224
4,5772828
4,5741988
4,5742092
4,5741508
4,5747260
4,5766840
4,5753344
4,5743204
4,5765616
4,5735904
4,5755828
4,5753512
4,5737820
4,5757568
4,5759152
4,5729904
4,5739268
4,5750920
4,5734076
4,5753912
4,5749996
4,5762240
4,5741892
4,5751740
4,5757736
4,5737780
4,5752788
4,5764892
4,5749952
4,5757260
4,5765968
4,5744108
4,5769680
4,5738172
4,5743396
4,5748500
4,5754164
4,5762716
4,5763280
4,5746976
4,5766636
4,5745916
4,5735284
4,5736052
4,5750412
4,5754112
4,5765984
4,5744856
4,5764896
4,5761868
4,5749888
4,5742244
4,5739032
4,5748296
4,5752744
4,5751316
4,5755240
4,5756944
4,5745492
4,5749924
4,5762788
4,5766592
4,5754452
4,5726060
4,5762304
4,5745988
4,5749388
4,5765964
4,5738052
4,5757988
4,5753064
4,5748328
4,5764340
4,5758572
4,5748852
4,5767192
4,5739396
4,5764584
4,5758528
4,5725016
4,5777760
4,5757940
4,5728672
4,5756464
4,5734996
4,5761072
4,5737188
4,5753988
4,5759160
4,5752964
4,5751920
4,5760292
4,5748704
4,5747584
4,5756768
4,5751580
4,5767776
4,5750152
4,5744996
4,5768020
4,5754584
4,5760952
4,5761640
4,5739452
4,5775476
4,5757364
4,5737252
4,5758536
4,5746108
4,5740192
4,5749856
4,5743712
4,5741292
4,5766628
4,5750596
4,5745512
4,5741220
4,5739112
4,5764948
4,5760956
4,5745560
4,5758492
4,5741384
4,5763372
4,5745520
4,5732908
4,5754280
4,5742740
4,5757384
4,5764328
4,5754304
4,5751512
4,5743972
4,5757096
4,5764444
4,5744544
4,5766552
4,5756700
4,5760036
4,5745828
4,5750860
4,5749812
4,5755904
4,5740056
4,6020312
4,5763704
4,5750724
4,5771604
4,5766256
4,5751312
4,5762544
4,5730712
4,5761992
4,5752912
4,5735364
4,5754720
4,5758376
4,5748156
4,5756752
4,5750212
4,5742524
4,5753208
4,5752812
4,5762332
4,5749052
4,5743756
4,5776972
4,5750632
4,5759348
4,5755288
4,5748784
4,5745028
4,5744644
4,5730988
4,5764916
4,5753904
4,5747012
4,5756040
4,5733452
4,5764524
4,5762544
4,5743820
4,5758992
4,5737496
4,5777312
4,5768028
4,5747640
4,5756428
4,5754412
4,5745048
4,5757420
4,5752196
4,5737560
4,5755688
4,5741304
4,5747292
4,5763812
4,5751496
4,5755828
4,5741248
4,5745156
4,5750720
4,5723616
4,5749228
4,5766180
4,5728076
4,5761136
4,5733124
4,5741004
4,5751896
4,5738124
4,5772232
4,5755516
4,5735488
4,5757260
4,5739884
4,5746440
4,5760932
4,5753344
4,5761160
4,5764316
4,5747416
4,5757700
4,5749092
4,5746220
4,5767728
4,5748252
4,5748420
4,5733716
4,5747220
4,5752144
4,5752084
4,5748880
4,5757516
4,5744880
4,5754240
4,5766356
4,5740104
4,5758092
4,5733200
4,5747356
4,5910964
4,5756252
4,5761228
4,5758792
4,5733132
4,5742600
4,5748052
4,5752792
4,5751896
4,5726444
4,5769124
4,5764740
4,5760060
4,5772268
4,5755776
4,5739148
4,5753976
4,5749292
4,5736388
4,5774968
4,5733512
4,5768680
4,5753804
4,5754244
4,5760384
4,5743612
4,5747844
4,5760876
4,5751868
4,5762508
4,5750704
4,5735664
4,5764972
4,5744420
4,5765752
4,5766560
4,5728196
4,5750572
4,5757348
4,5728880
4,5756548
4,5744956
4,5744612
4,5775588
4,5753380
4,5767724
4,5744864
4,5750392
4,5760800
4,5732052
4,5759876
4,5760360
4,5732600
4,5760884
4,5755724
4,5726532
4,5751664
4,5740880
4,5764608
4,5757052
4,5748044
4,5751200
4,5746568
4,5737684
4,5747864
4,5750800
4,5741540
4,5771116
4,5743300
4,5760824
4,5765672
4,5762496
4,5749828
4,5739772
4,5739740
4,5779564
4,5748528
4,5766632
4,5754128
4,5736776
4,5767836
4,5739120
4,5757060
4,5746064
4,5740256
4,5756312
4,5755704
4,5731888
4,5744740
4,5739532
4,5743400
4,5771348
4,5748816
4,5765640
4,5745468
4,5748676
4,5745584
4,5747680
4,5742820
4,5760792
4,5751908
4,5756920
4,5756180
4,5752308
4,5765848
4,5762508
4,5739304
4,5754308
4,5728628
4,5749644
4,5756232
4,5730592
4,5750988
4,5766628
4,5732012
4,5762784
4,5746596
4,5761228
4,5774292
4,5743488
4,5744284
4,5760156
4,5746520
4,5769272
4,5748820
4,5756820
4,5746556
4,5752680
4,5759476
4,5765808
4,5745976
4,5752516
4,5736384
4,5716704
4,5752752
4,5739736
4,5766852
4,5749388
4,5739424
4,5751584
4,5747760
4,5763408
4,5748144
4,5741684
4,5744472
4,5773724
4,5743384
4,5765212
4,5757504
4,5755080
4,5745312
4,5756028
4,5757996
4,5752436
4,5727076
4,5758596
4,5751496
4,5750140
4,5759716
4,5765700
4,5744924
4,5751676
4,5737276
4,5763780
4,5746872
4,5740504
4,5751752
4,5747456
4,5748544
4,5754652
4,5759356
4,5755908
4,5753868
4,5748864
4,5759532
4,5753044
4,5758312
4,5748528
4,5738036
4,5744280
4,5748388
4,5745272
4,5761736
4,5748848
4,5757060
4,5753760
4,5760208
4,5771352
4,5742740
4,5738480
4,5749244
4,5730460
4,5748376
4,5770460
4,5748564
4,5760520
4,5743700
4,5749664
4,5761108
4,5740856
4,5758100
4,5757052
4,5744044
4,5770036
4,5745888
4,5745352
4,5758212
4,5736168
4,5753360
4,5758120
4,5743900
4,5757408
4,5744376
4,5742764
4,5744928
4,5738080
4,5753832
4,5752860
4,5755392
4,5767844
4,5751428
4,5735888
4,5760112
4,5730536
4,5778372
4,5758808
4,5741736
4,5756328
4,5753556
4,5762100
4,5760404
4,5741204
4,5753932
4,5759972
4,5758124
4,5754120
4,5746084
4,5740980
4,5787848
4,5748412
4,5743400
4,5762880
4,5743300
4,5754292
4,5742580
4,5753204
4,5749240
4,5738372
4,5776428
4,5741404
4,5748948
4,5769884
4,5759672
4,5728548
4,5742872
4,5738996
4,5753376
4,5749128
4,5742724
4,5753756
4,5766360
4,5751596
4,5744996
4,5758148
4,5766160
4,5746904
4,5726620
4,5765964
4,5752408
4,5750884
4,5769412
4,5750904
4,5751016
4,5756324
4,5737716
4,5765044
4,5750844
4,5739308
4,5761820
4,5743224
4,5754256
4,5758848
4,5738108
4,5772816
4,5760680
4,5740788
4,5754356
4,5747148
4,5753064
4,5758632
4,5739856
4,5748976
4,5761340
4,5745348
4,5765576
4,5754472
4,5751628
4,5749656
4,5737256
4,5747772
4,5755704
4,5740024
4,5748304
4,5722816
4,5737356
4,5772264
4,5741292
4,5762944
4,5762404
4,5731980
4,5752724
4,5735772
4,5740260
4,5767336
4,5739564
4,5754852
4,5771336
4,5741748
4,5760084
4,5765708
4,5747628
4,5771220
4,5753540
4,5746092
4,5777892
4,5749796
4,5744600
4,5766412
4,5743460
4,5770964
4,5768284
4,5761928
4,5757188
4,5768840
4,5766520
4,5772880
4,5742568
4,5768980
4,5757672
4,5758844
4,5761616
4,5765352
4,5755220
4,5769380
4,5735744
4,5769764
4,5757392
4,5755348
4,5760392
4,5762596
4,5760680
4,5767096
4,5751208
4,5770420
4,5766212
4,5745612
4,5765864
4,5755176
4,5748212
4,5782044
4,5743272
4,5767468
4,5743240
4,5741232
4,5764480
4,5749296
4,5754884
4,5762748
4,5738500
4,5762792
4,5762424
4,5743836
4,5776916
4,5751852
4,5760648
4,5771516
4,5728452
4,5744740
4,5764012
4,5745160
4,5772156
4,5820076
4,5758348
4,5767716
4,5745532
4,5762732
4,5743268
4,5744576
4,5765916
4,5751660
4,5749296
4,5761128
4,5740596
4,5759316
4,5776168
4,5741472
4,5784456
4,5752624
4,5759224
4,5772536
4,5746544
4,5750324
4,5909944
4,5735788
4,5782380
4,5748636
4,5753880
4,5775372
4,5751428
4,5758700
4,5789752
4,5740556
4,5780532
4,5751804
4,5737552
4,5767100
4,5854688
4,5760600
4,5758604
4,5737520
4,5745964
4,5752560
4,5723544
4,5768052
4,5750796
4,5756148
4,5762876
4,5747384
4,5755900
4,5758336
4,5748616
4,5764384
4,5747896
4,5766228
4,5767608
4,5749748
4,5766572
4,5787684
4,5750000
4,5780572
4,5756368
4,5761348
4,5769816
4,5760224
4,5754612
4,5764496
4,5751768
4,5771420
4,5764964
4,5750536
4,5779088
4,5754348
4,5746084
4,5773464
4,5751056
4,5763976
4,5749156
4,5767192
4,5777196
4,5746264
4,5739108
4,5781588
4,5747688
4,5763868
4,5761836
4,5743648
4,5787392
4,5750016
4,5761832
4,5772168
4,5737592
4,5756820
4,5752416
4,5745612
4,5807520
4,5748924
4,5758872
4,5770820
4,5732804
4,5753240
4,5768792
4,5745820
4,5775804
4,5777344
4,5763004
4,5771820
4,5760004
4,5764608
4,5765524
4,5743044
4,5779016
4,5748880
4,5760852
4,5776816
4,5750836
4,5747548
4,5765892
4,5743112
4,5761872
4,5764716
4,5864424
4,5762900
4,5770036
4,5763380
4,5771900
4,5746000
4,5759084
4,5760608
4,5751880
4,5782428
4,5747648
4,5757988
4,5781156
4,5735960
4,5757932
4,5755412
4,5754180
4,5762148
4,5775716
4,5770684
4,5771968
4,5750548
4,5766444
4,5759900
4,5747728
4,5771672
4,5766052
4,5758380
4,5777480
4,5750948
4,5761820
4,5767172
4,5745152
4,5771124
4,5749308
4,5759812
4,5775116
4,5766068
4,5766292
4,5757140
4,5741312
4,5783948
4,5753340
4,5768636
4,5777104
4,5765840
4,5758644
4,5778648
4,5736688
4,5768516
4,5757464
4,5759620
4,5752388
4,5764944
4,5746304
4,5768120
4,5737136
4,5756064
4,5759204
4,5747828
4,5767604
4,5760088
4,5753148
4,5773952
4,5747940
4,5771516
4,5760132
4,5744248
4,5756448
4,5743052
4,5763896
4,5783760
4,5747800
4,5762812
4,5735844
4,5763688
4,5772244
4,5746692
4,5757244
4,5785104
4,5743944
4,5770552
4,5764052
4,5752452
4,5768876
4,5754508
4,5736328
4,5779292
4,5744516
4,5754564
4,5784048
4,5750272
4,5761928
4,5745864
4,5767020
4,5766924
4,5767228
4,5745196
4,5772672
4,5731408
4,5760112
4,5752172
4,5760280
4,5776652
4,5746248
4,5751736
4,5775572
4,5738736
4,5770088
4,5759124
4,5752028
4,5757032
4,5743956
4,5762224
4,5796064
4,5747444
4,5784224
4,5746492
4,5775952
4,5763068
4,5760944
4,5758296
4,5755224
4,5753320
4,5766344
4,5770448
4,5737780
4,5783128
4,5756372
4,5740208
4,5769696
4,5754628
4,5754484
4,5767696
4,5754396
4,5767372
4,5747140
4,5757888
4,5761820
4,5745372
4,5761256
4,5749800
4,5746624
4,5780792
4,5758256
4,5765272
4,5767048
4,5752152
4,5776020
4,5787996
4,5743684
4,5779688
4,5748680
4,5765240
4,5765880
4,5754400
4,5756260
4,5754424
4,5731608
4,5766932
4,6460552
4,7765284
4,7790544
4,7767780
4,7789852
4,7416464
4,5738244
4,5765332
4,5758656
4,5761704
4,5776588
4,5731376
4,5745380
4,5751432
4,5752016
4,5767836
4,5776744
4,5750440
4,5765468
4,5744156
4,5790524
4,5758824
4,5747032
4,5761492
4,5766428
4,5729716
4,5747324
4,5724016
4,5736532
4,5768144
4,5734984
4,5746576
4,5750692
4,5745928
4,5747392
4,5751564
4,5761892
4,5755444
4,5738248
4,5758872
4,5757148
4,5749008
4,5758920
4,5749156
4,5747368
4,5744376
4,5719704
4,5759828
4,5759140
4,5737588
4,5757444
4,5745756
4,5749876
4,5755656
4,5734152
4,5766856
4,5764940
4,5752380
4,5769336
4,5741096
4,5738740
4,5754448
4,5743912
4,5762636
4,5747428
4,5752944
4,5745760
4,5740708
4,5743664
4,5769868
4,5752264
4,5764144
4,5749084
4,5751816
4,5764904
4,5743960
4,5753516
4,5752836
4,5749100
4,5750168
4,5759988
4,5731532
4,5762288
4,5741256
4,5740104
4,5859220
4,5912108
4,5770556
4,5747892
4,5738776
4,5755720
4,5766012
4,5746456
4,5756812
4,5729596
4,5762332
4,5762100
4,5745240
4,5746200
4,5752524
4,5752640
4,5764464
4,5754500
4,5753780
4,5758268
4,5736804
4,5758724
4,5771992
4,5736472
4,5749072
4,5746532
4,5748012
4,5756044
4,5756636
4,5763348
4,5741844
4,5743144
4,5763080
4,5746712
4,5735920
4,5771376
4,5757744
4,5759216
4,5762024
4,5746448
4,5760540
4,5748784
4,5755252
4,5768196
4,5745552
4,5759820
4,5758444
4,5746976
4,5759836
4,5751396
4,5742224
4,5745928
4,5735244
4,5754784
4,5784748
4,5736108
4,5747352
4,5753244
4,5738420
4,5765096
4,5750724
4,5740736
4,5744228
4,5746744
4,5756436
4,5744980
4,5748340
4,5750684
4,5743124
4,5821156
4,5746756
4,5746716
4,5762664
4,5737588
4,5746796
4,5763936
4,5730968
4,5757984
4,5769836
4,5735320
4,5752520
4,5759236
4,5746308
4,5761296
4,5790980
4,5749704
4,5760156
4,5732724
4,5753348
4,5761688
4,5735828
4,5743540
4,5752868
4,5770580
4,5754000
4,5745352
4,5763320
4,5754812
4,5736752
4,5759820
4,5748404
4,5757940
4,5755000
4,5746296
4,5764256
4,5768132
4,5746456
4,5764740
4,5742984
4,5746664
4,5755764
4,5746860
4,5758540
4,5742048
4,5733508
4,5761116
4,5752272
4,5756328
4,5766676
4,5753076
4,5758176
4,5754072
4,5743524
4,5753704
4,5748712
