plugin_uid = e31a6e93-4d41-43a9-b943-60d1a2cc26c8
date_time_start = 2014/07/21 11:24:03
user_uid = f1452ea1-c8a5-4724-9463-4987f1f85d05
date_time_end = 2014/07/21 11:24:03
plugin_exit_code = 0
alias = compile_test_2014_07_21_11:24:03:012772
