[2014/04/15 16:12:28] Begin execution on #locatelli
[2014/04/15 16:12:28] Entry type: application
Copyright (C) 2009-2013 Intel Corporation. All rights reserved.
Intel(R) VTune(TM) Amplifier XE 2013 (build 328102)

 #        ####    ####     ##     #####  ######  #       #          #
 #       #    #  #    #   #  #      #    #       #       #          #
 #       #    #  #       #    #     #    #####   #       #          #
 #       #    #  #       ######     #    #       #       #          #
 #       #    #  #    #  #    #     #    #       #       #          #
 ######   ####    ####   #    #     #    ######  ######  ######     #

icc main.c -o wrapper -O2 -Wall -fno-alias -fno-inline-functions
[2014/04/15 16:12:30] End of compilation
