
* Number of maqao perf run: 10
* Stability_sanity_check: 0.05
* Relevance_threshold_min: 8

##########################################################################
WARNING: Please make sure Hyperthreading and Turboboost are disabled.
On top of that, the frequency of the CPU should be stabilized. To do so, please use cpuspeed.
A script to set the frequency can be found here: '/home/users/npetit/exascale/install/cti/common-tools/set_freq.sh'.
WARNING: The application must be compiled using the -g flag.
##########################################################################

Running Maqao perf.

Run number 1..

Output of Maqao perf:


 NAS Parallel Benchmarks 2.3-serial version - EP Benchmark

 Number of random numbers generated:    536870912  
EP Benchmark Results:

CPU Time =   12.4405
N = 2^   28
No. Gaussian Pairs =     210832767.
Sums =    -4.295875165629885D+03   -1.580732573678432D+04
Counts:
  0      98257395.
  1      93827014.
  2      17611549.
  3       1110028.
  4         26536.
  5           245.
  6             0.
  7             0.
  8             0.
  9             0.


 EP Benchmark Completed.
 Class           =                        A
 Size            =                536870912  
 Iterations      =                        0
 Time in seconds =                    12.44
 Mop/s total     =                    43.16
 Operation type  = Random numbers generated
 Verification    =               SUCCESSFUL
 Version         =                      2.3
 Compile date    =              05 Dec 2013

 Compile options:
    F77          = ifort
    FLINK        = ifort
    F_LIB        = (none)
    F_INC        = (none)
    FFLAGS       = -O3
    FLINKFLAGS   = (none)
    RAND         = randi8


 Please send the results of this run to:

 NPB Development Team 
 Internet: npb@nas.nasa.gov
 
 If email is not available, send this to:

 MS T27A-1
 NASA Ames Research Center
 Moffett Field, CA  94035-1000

 Fax: 415-604-3957


Info: [MAQAO] Bypass kernel detection !
[MAQAO] GENERATION OF METAFILE
[MAQAO] GENERATION OF METAFILE DONE

[MAQAO] PROCESSOR DETECTED : CORE2
[MAQAO] DUMPING DATA
[MAQAO] DUMPING DATA DONE


Output of Maqao perf display:
                                    HASSE - PROCESS #23114
                                         Thread #23116
###############################################################################################
#  Loop ID  |     Source Infos     |    Level    |      Time %     |  Time (s)  |  CPI ratio  #
###############################################################################################
#  4        |  MAIN__ - -1,-1@-1   |  Innermost  |  57.38 (10445)  |  326.41    |  55.57      #
#  8        |  vranlc_ - -1,-1@-1  |  Single     |  14.46 (2632)   |  82.25     |  45.09      #
#  1137     |  log - -1,-1@-1      |  Single     |  1.42 (258)     |  8.06      |  123.22     #
#  2        |  MAIN__ - -1,-1@-1   |  Single     |  0.01 (1)       |  0.03      |  0.00       #
#  5        |  MAIN__ - -1,-1@-1   |  Outermost  |  0.01 (1)       |  0.03      |  32.00      #
###############################################################################################
Info: The CSV file run_0_maqao_output_23116 has been generated



Run number 2..

Output of Maqao perf:


 NAS Parallel Benchmarks 2.3-serial version - EP Benchmark

 Number of random numbers generated:    536870912  
EP Benchmark Results:

CPU Time =   11.7990
N = 2^   28
No. Gaussian Pairs =     210832767.
Sums =    -4.295875165629885D+03   -1.580732573678432D+04
Counts:
  0      98257395.
  1      93827014.
  2      17611549.
  3       1110028.
  4         26536.
  5           245.
  6             0.
  7             0.
  8             0.
  9             0.


 EP Benchmark Completed.
 Class           =                        A
 Size            =                536870912  
 Iterations      =                        0
 Time in seconds =                    11.80
 Mop/s total     =                    45.50
 Operation type  = Random numbers generated
 Verification    =               SUCCESSFUL
 Version         =                      2.3
 Compile date    =              05 Dec 2013

 Compile options:
    F77          = ifort
    FLINK        = ifort
    F_LIB        = (none)
    F_INC        = (none)
    FFLAGS       = -O3
    FLINKFLAGS   = (none)
    RAND         = randi8


 Please send the results of this run to:

 NPB Development Team 
 Internet: npb@nas.nasa.gov
 
 If email is not available, send this to:

 MS T27A-1
 NASA Ames Research Center
 Moffett Field, CA  94035-1000

 Fax: 415-604-3957


Info: [MAQAO] Bypass kernel detection !
[MAQAO] GENERATION OF METAFILE
[MAQAO] GENERATION OF METAFILE DONE

[MAQAO] PROCESSOR DETECTED : CORE2
[MAQAO] DUMPING DATA
[MAQAO] DUMPING DATA DONE


Output of Maqao perf display:
                                    HASSE - PROCESS #23145
                                         Thread #23147
###############################################################################################
#  Loop ID  |     Source Infos     |    Level    |      Time %     |  Time (s)  |  CPI ratio  #
###############################################################################################
#  4        |  MAIN__ - -1,-1@-1   |  Innermost  |  58.31 (10708)  |  334.62    |  55.83      #
#  8        |  vranlc_ - -1,-1@-1  |  Single     |  15.01 (2756)   |  86.12     |  47.01      #
#  1137     |  log - -1,-1@-1      |  Single     |  1.35 (248)     |  7.75      |  128.00     #
#  5        |  MAIN__ - -1,-1@-1   |  Outermost  |  0.01 (2)       |  0.06      |  0.00       #
###############################################################################################
Info: The CSV file run_1_maqao_output_23147 has been generated
                                    HASSE - PROCESS #23114
                                         Thread #23116
###############################################################################################
#  Loop ID  |     Source Infos     |    Level    |      Time %     |  Time (s)  |  CPI ratio  #
###############################################################################################
#  4        |  MAIN__ - -1,-1@-1   |  Innermost  |  57.38 (10445)  |  326.41    |  55.57      #
#  8        |  vranlc_ - -1,-1@-1  |  Single     |  14.46 (2632)   |  82.25     |  45.09      #
#  1137     |  log - -1,-1@-1      |  Single     |  1.42 (258)     |  8.06      |  123.22     #
#  2        |  MAIN__ - -1,-1@-1   |  Single     |  0.01 (1)       |  0.03      |  0.00       #
#  5        |  MAIN__ - -1,-1@-1   |  Outermost  |  0.01 (1)       |  0.03      |  32.00      #
###############################################################################################
Info: The CSV file run_1_maqao_output_23116 has been generated



Run number 3..

Output of Maqao perf:


 NAS Parallel Benchmarks 2.3-serial version - EP Benchmark

 Number of random numbers generated:    536870912  
EP Benchmark Results:

CPU Time =   11.8484
N = 2^   28
No. Gaussian Pairs =     210832767.
Sums =    -4.295875165629885D+03   -1.580732573678432D+04
Counts:
  0      98257395.
  1      93827014.
  2      17611549.
  3       1110028.
  4         26536.
  5           245.
  6             0.
  7             0.
  8             0.
  9             0.


 EP Benchmark Completed.
 Class           =                        A
 Size            =                536870912  
 Iterations      =                        0
 Time in seconds =                    11.85
 Mop/s total     =                    45.31
 Operation type  = Random numbers generated
 Verification    =               SUCCESSFUL
 Version         =                      2.3
 Compile date    =              05 Dec 2013

 Compile options:
    F77          = ifort
    FLINK        = ifort
    F_LIB        = (none)
    F_INC        = (none)
    FFLAGS       = -O3
    FLINKFLAGS   = (none)
    RAND         = randi8


 Please send the results of this run to:

 NPB Development Team 
 Internet: npb@nas.nasa.gov
 
 If email is not available, send this to:

 MS T27A-1
 NASA Ames Research Center
 Moffett Field, CA  94035-1000

 Fax: 415-604-3957


Info: [MAQAO] Bypass kernel detection !
[MAQAO] GENERATION OF METAFILE
[MAQAO] GENERATION OF METAFILE DONE

[MAQAO] PROCESSOR DETECTED : CORE2
[MAQAO] DUMPING DATA
[MAQAO] DUMPING DATA DONE


Output of Maqao perf display:
                                    HASSE - PROCESS #23114
                                         Thread #23116
###############################################################################################
#  Loop ID  |     Source Infos     |    Level    |      Time %     |  Time (s)  |  CPI ratio  #
###############################################################################################
#  4        |  MAIN__ - -1,-1@-1   |  Innermost  |  57.38 (10445)  |  326.41    |  55.57      #
#  8        |  vranlc_ - -1,-1@-1  |  Single     |  14.46 (2632)   |  82.25     |  45.09      #
#  1137     |  log - -1,-1@-1      |  Single     |  1.42 (258)     |  8.06      |  123.22     #
#  2        |  MAIN__ - -1,-1@-1   |  Single     |  0.01 (1)       |  0.03      |  0.00       #
#  5        |  MAIN__ - -1,-1@-1   |  Outermost  |  0.01 (1)       |  0.03      |  32.00      #
###############################################################################################
Info: The CSV file run_2_maqao_output_23116 has been generated
                                    HASSE - PROCESS #23145
                                         Thread #23147
###############################################################################################
#  Loop ID  |     Source Infos     |    Level    |      Time %     |  Time (s)  |  CPI ratio  #
###############################################################################################
#  4        |  MAIN__ - -1,-1@-1   |  Innermost  |  58.31 (10708)  |  334.62    |  55.83      #
#  8        |  vranlc_ - -1,-1@-1  |  Single     |  15.01 (2756)   |  86.12     |  47.01      #
#  1137     |  log - -1,-1@-1      |  Single     |  1.35 (248)     |  7.75      |  128.00     #
#  5        |  MAIN__ - -1,-1@-1   |  Outermost  |  0.01 (2)       |  0.06      |  0.00       #
###############################################################################################
Info: The CSV file run_2_maqao_output_23147 has been generated
                                    HASSE - PROCESS #23177
                                         Thread #23179
###############################################################################################
#  Loop ID  |     Source Infos     |    Level    |      Time %     |  Time (s)  |  CPI ratio  #
###############################################################################################
#  4        |  MAIN__ - -1,-1@-1   |  Innermost  |  58.07 (10567)  |  330.22    |  55.05      #
#  8        |  vranlc_ - -1,-1@-1  |  Single     |  14.46 (2632)   |  82.25     |  44.97      #
#  1137     |  log - -1,-1@-1      |  Single     |  1.24 (225)     |  7.03      |  83.72      #
#  5        |  MAIN__ - -1,-1@-1   |  Outermost  |  0.02 (3)       |  0.09      |  0.00       #
###############################################################################################
Info: The CSV file run_2_maqao_output_23179 has been generated



Run number 4..

Output of Maqao perf:


 NAS Parallel Benchmarks 2.3-serial version - EP Benchmark

 Number of random numbers generated:    536870912  
EP Benchmark Results:

CPU Time =   11.9987
N = 2^   28
No. Gaussian Pairs =     210832767.
Sums =    -4.295875165629885D+03   -1.580732573678432D+04
Counts:
  0      98257395.
  1      93827014.
  2      17611549.
  3       1110028.
  4         26536.
  5           245.
  6             0.
  7             0.
  8             0.
  9             0.


 EP Benchmark Completed.
 Class           =                        A
 Size            =                536870912  
 Iterations      =                        0
 Time in seconds =                    12.00
 Mop/s total     =                    44.74
 Operation type  = Random numbers generated
 Verification    =               SUCCESSFUL
 Version         =                      2.3
 Compile date    =              05 Dec 2013

 Compile options:
    F77          = ifort
    FLINK        = ifort
    F_LIB        = (none)
    F_INC        = (none)
    FFLAGS       = -O3
    FLINKFLAGS   = (none)
    RAND         = randi8


 Please send the results of this run to:

 NPB Development Team 
 Internet: npb@nas.nasa.gov
 
 If email is not available, send this to:

 MS T27A-1
 NASA Ames Research Center
 Moffett Field, CA  94035-1000

 Fax: 415-604-3957


Info: [MAQAO] Bypass kernel detection !
[MAQAO] GENERATION OF METAFILE
[MAQAO] GENERATION OF METAFILE DONE

[MAQAO] PROCESSOR DETECTED : CORE2
[MAQAO] DUMPING DATA
[MAQAO] DUMPING DATA DONE


Output of Maqao perf display:
                                    HASSE - PROCESS #23207
                                         Thread #23209
###############################################################################################
#  Loop ID  |     Source Infos     |    Level    |      Time %     |  Time (s)  |  CPI ratio  #
###############################################################################################
#  4        |  MAIN__ - -1,-1@-1   |  Innermost  |  57.68 (10532)  |  329.12    |  55.36      #
#  8        |  vranlc_ - -1,-1@-1  |  Single     |  14.68 (2681)   |  83.78     |  45.56      #
#  1137     |  log - -1,-1@-1      |  Single     |  1.38 (252)     |  7.88      |  136.68     #
#  5        |  MAIN__ - -1,-1@-1   |  Outermost  |  0.02 (4)       |  0.12      |  0.00       #
###############################################################################################
Info: The CSV file run_3_maqao_output_23209 has been generated
                                    HASSE - PROCESS #23114
                                         Thread #23116
###############################################################################################
#  Loop ID  |     Source Infos     |    Level    |      Time %     |  Time (s)  |  CPI ratio  #
###############################################################################################
#  4        |  MAIN__ - -1,-1@-1   |  Innermost  |  57.38 (10445)  |  326.41    |  55.57      #
#  8        |  vranlc_ - -1,-1@-1  |  Single     |  14.46 (2632)   |  82.25     |  45.09      #
#  1137     |  log - -1,-1@-1      |  Single     |  1.42 (258)     |  8.06      |  123.22     #
#  2        |  MAIN__ - -1,-1@-1   |  Single     |  0.01 (1)       |  0.03      |  0.00       #
#  5        |  MAIN__ - -1,-1@-1   |  Outermost  |  0.01 (1)       |  0.03      |  32.00      #
###############################################################################################
Info: The CSV file run_3_maqao_output_23116 has been generated
                                    HASSE - PROCESS #23145
                                         Thread #23147
###############################################################################################
#  Loop ID  |     Source Infos     |    Level    |      Time %     |  Time (s)  |  CPI ratio  #
###############################################################################################
#  4        |  MAIN__ - -1,-1@-1   |  Innermost  |  58.31 (10708)  |  334.62    |  55.83      #
#  8        |  vranlc_ - -1,-1@-1  |  Single     |  15.01 (2756)   |  86.12     |  47.01      #
#  1137     |  log - -1,-1@-1      |  Single     |  1.35 (248)     |  7.75      |  128.00     #
#  5        |  MAIN__ - -1,-1@-1   |  Outermost  |  0.01 (2)       |  0.06      |  0.00       #
###############################################################################################
Info: The CSV file run_3_maqao_output_23147 has been generated
                                    HASSE - PROCESS #23177
                                         Thread #23179
###############################################################################################
#  Loop ID  |     Source Infos     |    Level    |      Time %     |  Time (s)  |  CPI ratio  #
###############################################################################################
#  4        |  MAIN__ - -1,-1@-1   |  Innermost  |  58.07 (10567)  |  330.22    |  55.05      #
#  8        |  vranlc_ - -1,-1@-1  |  Single     |  14.46 (2632)   |  82.25     |  44.97      #
#  1137     |  log - -1,-1@-1      |  Single     |  1.24 (225)     |  7.03      |  83.72      #
#  5        |  MAIN__ - -1,-1@-1   |  Outermost  |  0.02 (3)       |  0.09      |  0.00       #
###############################################################################################
Info: The CSV file run_3_maqao_output_23179 has been generated



Run number 5..

Output of Maqao perf:


 NAS Parallel Benchmarks 2.3-serial version - EP Benchmark

 Number of random numbers generated:    536870912  
EP Benchmark Results:

CPU Time =   10.4617
N = 2^   28
No. Gaussian Pairs =     210832767.
Sums =    -4.295875165629885D+03   -1.580732573678432D+04
Counts:
  0      98257395.
  1      93827014.
  2      17611549.
  3       1110028.
  4         26536.
  5           245.
  6             0.
  7             0.
  8             0.
  9             0.


 EP Benchmark Completed.
 Class           =                        A
 Size            =                536870912  
 Iterations      =                        0
 Time in seconds =                    10.46
 Mop/s total     =                    51.32
 Operation type  = Random numbers generated
 Verification    =               SUCCESSFUL
 Version         =                      2.3
 Compile date    =              05 Dec 2013

 Compile options:
    F77          = ifort
    FLINK        = ifort
    F_LIB        = (none)
    F_INC        = (none)
    FFLAGS       = -O3
    FLINKFLAGS   = (none)
    RAND         = randi8


 Please send the results of this run to:

 NPB Development Team 
 Internet: npb@nas.nasa.gov
 
 If email is not available, send this to:

 MS T27A-1
 NASA Ames Research Center
 Moffett Field, CA  94035-1000

 Fax: 415-604-3957


Info: [MAQAO] Bypass kernel detection !
[MAQAO] GENERATION OF METAFILE
[MAQAO] GENERATION OF METAFILE DONE

[MAQAO] PROCESSOR DETECTED : CORE2
[MAQAO] DUMPING DATA
[MAQAO] DUMPING DATA DONE


Output of Maqao perf display:
                                    HASSE - PROCESS #23145
                                         Thread #23147
###############################################################################################
#  Loop ID  |     Source Infos     |    Level    |      Time %     |  Time (s)  |  CPI ratio  #
###############################################################################################
#  4        |  MAIN__ - -1,-1@-1   |  Innermost  |  58.31 (10708)  |  334.62    |  55.83      #
#  8        |  vranlc_ - -1,-1@-1  |  Single     |  15.01 (2756)   |  86.12     |  47.01      #
#  1137     |  log - -1,-1@-1      |  Single     |  1.35 (248)     |  7.75      |  128.00     #
#  5        |  MAIN__ - -1,-1@-1   |  Outermost  |  0.01 (2)       |  0.06      |  0.00       #
###############################################################################################
Info: The CSV file run_4_maqao_output_23147 has been generated
                                    HASSE - PROCESS #23177
                                         Thread #23179
###############################################################################################
#  Loop ID  |     Source Infos     |    Level    |      Time %     |  Time (s)  |  CPI ratio  #
###############################################################################################
#  4        |  MAIN__ - -1,-1@-1   |  Innermost  |  58.07 (10567)  |  330.22    |  55.05      #
#  8        |  vranlc_ - -1,-1@-1  |  Single     |  14.46 (2632)   |  82.25     |  44.97      #
#  1137     |  log - -1,-1@-1      |  Single     |  1.24 (225)     |  7.03      |  83.72      #
#  5        |  MAIN__ - -1,-1@-1   |  Outermost  |  0.02 (3)       |  0.09      |  0.00       #
###############################################################################################
Info: The CSV file run_4_maqao_output_23179 has been generated
                                    HASSE - PROCESS #23207
                                         Thread #23209
###############################################################################################
#  Loop ID  |     Source Infos     |    Level    |      Time %     |  Time (s)  |  CPI ratio  #
###############################################################################################
#  4        |  MAIN__ - -1,-1@-1   |  Innermost  |  57.68 (10532)  |  329.12    |  55.36      #
#  8        |  vranlc_ - -1,-1@-1  |  Single     |  14.68 (2681)   |  83.78     |  45.56      #
#  1137     |  log - -1,-1@-1      |  Single     |  1.38 (252)     |  7.88      |  136.68     #
#  5        |  MAIN__ - -1,-1@-1   |  Outermost  |  0.02 (4)       |  0.12      |  0.00       #
###############################################################################################
Info: The CSV file run_4_maqao_output_23209 has been generated
                                    HASSE - PROCESS #23238
                                        Thread #23240
##############################################################################################
#  Loop ID  |     Source Infos     |    Level    |     Time %     |  Time (s)  |  CPI ratio  #
##############################################################################################
#  4        |  MAIN__ - -1,-1@-1   |  Innermost  |  53.96 (8885)  |  277.66    |  41.40      #
#  8        |  vranlc_ - -1,-1@-1  |  Single     |  16.34 (2691)  |  84.09     |  45.59      #
#  1137     |  log - -1,-1@-1      |  Single     |  10.64 (1752)  |  54.75     |  25.45      #
#  5        |  MAIN__ - -1,-1@-1   |  Outermost  |  0.02 (3)      |  0.09      |  0.00       #
##############################################################################################
Info: The CSV file run_4_maqao_output_23240 has been generated
                                    HASSE - PROCESS #23114
                                         Thread #23116
###############################################################################################
#  Loop ID  |     Source Infos     |    Level    |      Time %     |  Time (s)  |  CPI ratio  #
###############################################################################################
#  4        |  MAIN__ - -1,-1@-1   |  Innermost  |  57.38 (10445)  |  326.41    |  55.57      #
#  8        |  vranlc_ - -1,-1@-1  |  Single     |  14.46 (2632)   |  82.25     |  45.09      #
#  1137     |  log - -1,-1@-1      |  Single     |  1.42 (258)     |  8.06      |  123.22     #
#  2        |  MAIN__ - -1,-1@-1   |  Single     |  0.01 (1)       |  0.03      |  0.00       #
#  5        |  MAIN__ - -1,-1@-1   |  Outermost  |  0.01 (1)       |  0.03      |  32.00      #
###############################################################################################
Info: The CSV file run_4_maqao_output_23116 has been generated



Run number 6..

Output of Maqao perf:


 NAS Parallel Benchmarks 2.3-serial version - EP Benchmark

 Number of random numbers generated:    536870912  
EP Benchmark Results:

CPU Time =   10.6230
N = 2^   28
No. Gaussian Pairs =     210832767.
Sums =    -4.295875165629885D+03   -1.580732573678432D+04
Counts:
  0      98257395.
  1      93827014.
  2      17611549.
  3       1110028.
  4         26536.
  5           245.
  6             0.
  7             0.
  8             0.
  9             0.


 EP Benchmark Completed.
 Class           =                        A
 Size            =                536870912  
 Iterations      =                        0
 Time in seconds =                    10.62
 Mop/s total     =                    50.54
 Operation type  = Random numbers generated
 Verification    =               SUCCESSFUL
 Version         =                      2.3
 Compile date    =              05 Dec 2013

 Compile options:
    F77          = ifort
    FLINK        = ifort
    F_LIB        = (none)
    F_INC        = (none)
    FFLAGS       = -O3
    FLINKFLAGS   = (none)
    RAND         = randi8


 Please send the results of this run to:

 NPB Development Team 
 Internet: npb@nas.nasa.gov
 
 If email is not available, send this to:

 MS T27A-1
 NASA Ames Research Center
 Moffett Field, CA  94035-1000

 Fax: 415-604-3957


Info: [MAQAO] Bypass kernel detection !
[MAQAO] GENERATION OF METAFILE
[MAQAO] GENERATION OF METAFILE DONE

[MAQAO] PROCESSOR DETECTED : CORE2
[MAQAO] DUMPING DATA
[MAQAO] DUMPING DATA DONE


Output of Maqao perf display:
                                    HASSE - PROCESS #23145
                                         Thread #23147
###############################################################################################
#  Loop ID  |     Source Infos     |    Level    |      Time %     |  Time (s)  |  CPI ratio  #
###############################################################################################
#  4        |  MAIN__ - -1,-1@-1   |  Innermost  |  58.31 (10708)  |  334.62    |  55.83      #
#  8        |  vranlc_ - -1,-1@-1  |  Single     |  15.01 (2756)   |  86.12     |  47.01      #
#  1137     |  log - -1,-1@-1      |  Single     |  1.35 (248)     |  7.75      |  128.00     #
#  5        |  MAIN__ - -1,-1@-1   |  Outermost  |  0.01 (2)       |  0.06      |  0.00       #
###############################################################################################
Info: The CSV file run_5_maqao_output_23147 has been generated
                                    HASSE - PROCESS #23177
                                         Thread #23179
###############################################################################################
#  Loop ID  |     Source Infos     |    Level    |      Time %     |  Time (s)  |  CPI ratio  #
###############################################################################################
#  4        |  MAIN__ - -1,-1@-1   |  Innermost  |  58.07 (10567)  |  330.22    |  55.05      #
#  8        |  vranlc_ - -1,-1@-1  |  Single     |  14.46 (2632)   |  82.25     |  44.97      #
#  1137     |  log - -1,-1@-1      |  Single     |  1.24 (225)     |  7.03      |  83.72      #
#  5        |  MAIN__ - -1,-1@-1   |  Outermost  |  0.02 (3)       |  0.09      |  0.00       #
###############################################################################################
Info: The CSV file run_5_maqao_output_23179 has been generated
                                    HASSE - PROCESS #23207
                                         Thread #23209
###############################################################################################
#  Loop ID  |     Source Infos     |    Level    |      Time %     |  Time (s)  |  CPI ratio  #
###############################################################################################
#  4        |  MAIN__ - -1,-1@-1   |  Innermost  |  57.68 (10532)  |  329.12    |  55.36      #
#  8        |  vranlc_ - -1,-1@-1  |  Single     |  14.68 (2681)   |  83.78     |  45.56      #
#  1137     |  log - -1,-1@-1      |  Single     |  1.38 (252)     |  7.88      |  136.68     #
#  5        |  MAIN__ - -1,-1@-1   |  Outermost  |  0.02 (4)       |  0.12      |  0.00       #
###############################################################################################
Info: The CSV file run_5_maqao_output_23209 has been generated
                                    HASSE - PROCESS #23238
                                        Thread #23240
##############################################################################################
#  Loop ID  |     Source Infos     |    Level    |     Time %     |  Time (s)  |  CPI ratio  #
##############################################################################################
#  4        |  MAIN__ - -1,-1@-1   |  Innermost  |  53.96 (8885)  |  277.66    |  41.40      #
#  8        |  vranlc_ - -1,-1@-1  |  Single     |  16.34 (2691)  |  84.09     |  45.59      #
#  1137     |  log - -1,-1@-1      |  Single     |  10.64 (1752)  |  54.75     |  25.45      #
#  5        |  MAIN__ - -1,-1@-1   |  Outermost  |  0.02 (3)      |  0.09      |  0.00       #
##############################################################################################
Info: The CSV file run_5_maqao_output_23240 has been generated
                                    HASSE - PROCESS #23269
                                        Thread #23271
##############################################################################################
#  Loop ID  |     Source Infos     |    Level    |     Time %     |  Time (s)  |  CPI ratio  #
##############################################################################################
#  4        |  MAIN__ - -1,-1@-1   |  Innermost  |  54.40 (8945)  |  279.53    |  41.64      #
#  8        |  vranlc_ - -1,-1@-1  |  Single     |  16.08 (2644)  |  82.62     |  44.58      #
#  1137     |  log - -1,-1@-1      |  Single     |  10.79 (1775)  |  55.47     |  26.53      #
#  5        |  MAIN__ - -1,-1@-1   |  Outermost  |  0.01 (2)      |  0.06      |  0.00       #
##############################################################################################
Info: The CSV file run_5_maqao_output_23271 has been generated
                                    HASSE - PROCESS #23114
                                         Thread #23116
###############################################################################################
#  Loop ID  |     Source Infos     |    Level    |      Time %     |  Time (s)  |  CPI ratio  #
###############################################################################################
#  4        |  MAIN__ - -1,-1@-1   |  Innermost  |  57.38 (10445)  |  326.41    |  55.57      #
#  8        |  vranlc_ - -1,-1@-1  |  Single     |  14.46 (2632)   |  82.25     |  45.09      #
#  1137     |  log - -1,-1@-1      |  Single     |  1.42 (258)     |  8.06      |  123.22     #
#  2        |  MAIN__ - -1,-1@-1   |  Single     |  0.01 (1)       |  0.03      |  0.00       #
#  5        |  MAIN__ - -1,-1@-1   |  Outermost  |  0.01 (1)       |  0.03      |  32.00      #
###############################################################################################
Info: The CSV file run_5_maqao_output_23116 has been generated



Run number 7..

Output of Maqao perf:


 NAS Parallel Benchmarks 2.3-serial version - EP Benchmark

 Number of random numbers generated:    536870912  
EP Benchmark Results:

CPU Time =   12.1427
N = 2^   28
No. Gaussian Pairs =     210832767.
Sums =    -4.295875165629885D+03   -1.580732573678432D+04
Counts:
  0      98257395.
  1      93827014.
  2      17611549.
  3       1110028.
  4         26536.
  5           245.
  6             0.
  7             0.
  8             0.
  9             0.


 EP Benchmark Completed.
 Class           =                        A
 Size            =                536870912  
 Iterations      =                        0
 Time in seconds =                    12.14
 Mop/s total     =                    44.21
 Operation type  = Random numbers generated
 Verification    =               SUCCESSFUL
 Version         =                      2.3
 Compile date    =              05 Dec 2013

 Compile options:
    F77          = ifort
    FLINK        = ifort
    F_LIB        = (none)
    F_INC        = (none)
    FFLAGS       = -O3
    FLINKFLAGS   = (none)
    RAND         = randi8


 Please send the results of this run to:

 NPB Development Team 
 Internet: npb@nas.nasa.gov
 
 If email is not available, send this to:

 MS T27A-1
 NASA Ames Research Center
 Moffett Field, CA  94035-1000

 Fax: 415-604-3957


Info: [MAQAO] Bypass kernel detection !
[MAQAO] GENERATION OF METAFILE
[MAQAO] GENERATION OF METAFILE DONE

[MAQAO] PROCESSOR DETECTED : CORE2
[MAQAO] DUMPING DATA
[MAQAO] DUMPING DATA DONE


Output of Maqao perf display:
                                    HASSE - PROCESS #23114
                                         Thread #23116
###############################################################################################
#  Loop ID  |     Source Infos     |    Level    |      Time %     |  Time (s)  |  CPI ratio  #
###############################################################################################
#  4        |  MAIN__ - -1,-1@-1   |  Innermost  |  57.38 (10445)  |  326.41    |  55.57      #
#  8        |  vranlc_ - -1,-1@-1  |  Single     |  14.46 (2632)   |  82.25     |  45.09      #
#  1137     |  log - -1,-1@-1      |  Single     |  1.42 (258)     |  8.06      |  123.22     #
#  2        |  MAIN__ - -1,-1@-1   |  Single     |  0.01 (1)       |  0.03      |  0.00       #
#  5        |  MAIN__ - -1,-1@-1   |  Outermost  |  0.01 (1)       |  0.03      |  32.00      #
###############################################################################################
Info: The CSV file run_6_maqao_output_23116 has been generated
                                    HASSE - PROCESS #23145
                                         Thread #23147
###############################################################################################
#  Loop ID  |     Source Infos     |    Level    |      Time %     |  Time (s)  |  CPI ratio  #
###############################################################################################
#  4        |  MAIN__ - -1,-1@-1   |  Innermost  |  58.31 (10708)  |  334.62    |  55.83      #
#  8        |  vranlc_ - -1,-1@-1  |  Single     |  15.01 (2756)   |  86.12     |  47.01      #
#  1137     |  log - -1,-1@-1      |  Single     |  1.35 (248)     |  7.75      |  128.00     #
#  5        |  MAIN__ - -1,-1@-1   |  Outermost  |  0.01 (2)       |  0.06      |  0.00       #
###############################################################################################
Info: The CSV file run_6_maqao_output_23147 has been generated
                                    HASSE - PROCESS #23177
                                         Thread #23179
###############################################################################################
#  Loop ID  |     Source Infos     |    Level    |      Time %     |  Time (s)  |  CPI ratio  #
###############################################################################################
#  4        |  MAIN__ - -1,-1@-1   |  Innermost  |  58.07 (10567)  |  330.22    |  55.05      #
#  8        |  vranlc_ - -1,-1@-1  |  Single     |  14.46 (2632)   |  82.25     |  44.97      #
#  1137     |  log - -1,-1@-1      |  Single     |  1.24 (225)     |  7.03      |  83.72      #
#  5        |  MAIN__ - -1,-1@-1   |  Outermost  |  0.02 (3)       |  0.09      |  0.00       #
###############################################################################################
Info: The CSV file run_6_maqao_output_23179 has been generated
                                    HASSE - PROCESS #23207
                                         Thread #23209
###############################################################################################
#  Loop ID  |     Source Infos     |    Level    |      Time %     |  Time (s)  |  CPI ratio  #
###############################################################################################
#  4        |  MAIN__ - -1,-1@-1   |  Innermost  |  57.68 (10532)  |  329.12    |  55.36      #
#  8        |  vranlc_ - -1,-1@-1  |  Single     |  14.68 (2681)   |  83.78     |  45.56      #
#  1137     |  log - -1,-1@-1      |  Single     |  1.38 (252)     |  7.88      |  136.68     #
#  5        |  MAIN__ - -1,-1@-1   |  Outermost  |  0.02 (4)       |  0.12      |  0.00       #
###############################################################################################
Info: The CSV file run_6_maqao_output_23209 has been generated
                                    HASSE - PROCESS #23238
                                        Thread #23240
##############################################################################################
#  Loop ID  |     Source Infos     |    Level    |     Time %     |  Time (s)  |  CPI ratio  #
##############################################################################################
#  4        |  MAIN__ - -1,-1@-1   |  Innermost  |  53.96 (8885)  |  277.66    |  41.40      #
#  8        |  vranlc_ - -1,-1@-1  |  Single     |  16.34 (2691)  |  84.09     |  45.59      #
#  1137     |  log - -1,-1@-1      |  Single     |  10.64 (1752)  |  54.75     |  25.45      #
#  5        |  MAIN__ - -1,-1@-1   |  Outermost  |  0.02 (3)      |  0.09      |  0.00       #
##############################################################################################
Info: The CSV file run_6_maqao_output_23240 has been generated
                                    HASSE - PROCESS #23269
                                        Thread #23271
##############################################################################################
#  Loop ID  |     Source Infos     |    Level    |     Time %     |  Time (s)  |  CPI ratio  #
##############################################################################################
#  4        |  MAIN__ - -1,-1@-1   |  Innermost  |  54.40 (8945)  |  279.53    |  41.64      #
#  8        |  vranlc_ - -1,-1@-1  |  Single     |  16.08 (2644)  |  82.62     |  44.58      #
#  1137     |  log - -1,-1@-1      |  Single     |  10.79 (1775)  |  55.47     |  26.53      #
#  5        |  MAIN__ - -1,-1@-1   |  Outermost  |  0.01 (2)      |  0.06      |  0.00       #
##############################################################################################
Info: The CSV file run_6_maqao_output_23271 has been generated
                                          HASSE - PROCESS #23299
                                               Thread #23299
###########################################################################################################
#  Loop ID  |             Source Infos            |    Level    |    Time %    |  Time (s)  |  CPI ratio  #
###########################################################################################################
#  50       |  for_write_seq_fmt_xmit - -1,-1@-1  |  InBetween  |  100.00 (1)  |  0.03      |  0.00       #
###########################################################################################################
Info: The CSV file run_6_maqao_output_23299 has been generated
                                    HASSE - PROCESS #23299
                                         Thread #23301
###############################################################################################
#  Loop ID  |     Source Infos     |    Level    |      Time %     |  Time (s)  |  CPI ratio  #
###############################################################################################
#  4        |  MAIN__ - -1,-1@-1   |  Innermost  |  57.57 (10518)  |  328.69    |  54.17      #
#  8        |  vranlc_ - -1,-1@-1  |  Single     |  14.91 (2724)   |  85.12     |  46.19      #
#  1137     |  log - -1,-1@-1      |  Single     |  1.22 (223)     |  6.97      |  123.03     #
#  5        |  MAIN__ - -1,-1@-1   |  Outermost  |  0.01 (1)       |  0.03      |  0.00       #
###############################################################################################
Info: The CSV file run_6_maqao_output_23301 has been generated



Run number 8..

Output of Maqao perf:


 NAS Parallel Benchmarks 2.3-serial version - EP Benchmark

 Number of random numbers generated:    536870912  
EP Benchmark Results:

CPU Time =   12.0131
N = 2^   28
No. Gaussian Pairs =     210832767.
Sums =    -4.295875165629885D+03   -1.580732573678432D+04
Counts:
  0      98257395.
  1      93827014.
  2      17611549.
  3       1110028.
  4         26536.
  5           245.
  6             0.
  7             0.
  8             0.
  9             0.


 EP Benchmark Completed.
 Class           =                        A
 Size            =                536870912  
 Iterations      =                        0
 Time in seconds =                    12.01
 Mop/s total     =                    44.69
 Operation type  = Random numbers generated
 Verification    =               SUCCESSFUL
 Version         =                      2.3
 Compile date    =              05 Dec 2013

 Compile options:
    F77          = ifort
    FLINK        = ifort
    F_LIB        = (none)
    F_INC        = (none)
    FFLAGS       = -O3
    FLINKFLAGS   = (none)
    RAND         = randi8


 Please send the results of this run to:

 NPB Development Team 
 Internet: npb@nas.nasa.gov
 
 If email is not available, send this to:

 MS T27A-1
 NASA Ames Research Center
 Moffett Field, CA  94035-1000

 Fax: 415-604-3957


Info: [MAQAO] Bypass kernel detection !
[MAQAO] GENERATION OF METAFILE
[MAQAO] GENERATION OF METAFILE DONE

[MAQAO] PROCESSOR DETECTED : CORE2
cp: impossible d'évaluer « /proc/23334/maps »: Aucun fichier ou dossier de ce type
[MAQAO] DUMPING DATA
[MAQAO] DUMPING DATA DONE


Output of Maqao perf display:
                                    HASSE - PROCESS #23331
                                         Thread #23333
###############################################################################################
#  Loop ID  |     Source Infos     |    Level    |      Time %     |  Time (s)  |  CPI ratio  #
###############################################################################################
#  4        |  MAIN__ - -1,-1@-1   |  Innermost  |  58.59 (10639)  |  332.47    |  55.70      #
#  8        |  vranlc_ - -1,-1@-1  |  Single     |  14.21 (2581)   |  80.66     |  43.93      #
#  1137     |  log - -1,-1@-1      |  Single     |  1.29 (234)     |  7.31      |  120.77     #
###############################################################################################
Info: The CSV file run_7_maqao_output_23333 has been generated
                                    HASSE - PROCESS #23114
                                         Thread #23116
###############################################################################################
#  Loop ID  |     Source Infos     |    Level    |      Time %     |  Time (s)  |  CPI ratio  #
###############################################################################################
#  4        |  MAIN__ - -1,-1@-1   |  Innermost  |  57.38 (10445)  |  326.41    |  55.57      #
#  8        |  vranlc_ - -1,-1@-1  |  Single     |  14.46 (2632)   |  82.25     |  45.09      #
#  1137     |  log - -1,-1@-1      |  Single     |  1.42 (258)     |  8.06      |  123.22     #
#  2        |  MAIN__ - -1,-1@-1   |  Single     |  0.01 (1)       |  0.03      |  0.00       #
#  5        |  MAIN__ - -1,-1@-1   |  Outermost  |  0.01 (1)       |  0.03      |  32.00      #
###############################################################################################
Info: The CSV file run_7_maqao_output_23116 has been generated
                                    HASSE - PROCESS #23145
                                         Thread #23147
###############################################################################################
#  Loop ID  |     Source Infos     |    Level    |      Time %     |  Time (s)  |  CPI ratio  #
###############################################################################################
#  4        |  MAIN__ - -1,-1@-1   |  Innermost  |  58.31 (10708)  |  334.62    |  55.83      #
#  8        |  vranlc_ - -1,-1@-1  |  Single     |  15.01 (2756)   |  86.12     |  47.01      #
#  1137     |  log - -1,-1@-1      |  Single     |  1.35 (248)     |  7.75      |  128.00     #
#  5        |  MAIN__ - -1,-1@-1   |  Outermost  |  0.01 (2)       |  0.06      |  0.00       #
###############################################################################################
Info: The CSV file run_7_maqao_output_23147 has been generated
                                    HASSE - PROCESS #23177
                                         Thread #23179
###############################################################################################
#  Loop ID  |     Source Infos     |    Level    |      Time %     |  Time (s)  |  CPI ratio  #
###############################################################################################
#  4        |  MAIN__ - -1,-1@-1   |  Innermost  |  58.07 (10567)  |  330.22    |  55.05      #
#  8        |  vranlc_ - -1,-1@-1  |  Single     |  14.46 (2632)   |  82.25     |  44.97      #
#  1137     |  log - -1,-1@-1      |  Single     |  1.24 (225)     |  7.03      |  83.72      #
#  5        |  MAIN__ - -1,-1@-1   |  Outermost  |  0.02 (3)       |  0.09      |  0.00       #
###############################################################################################
Info: The CSV file run_7_maqao_output_23179 has been generated
                                    HASSE - PROCESS #23207
                                         Thread #23209
###############################################################################################
#  Loop ID  |     Source Infos     |    Level    |      Time %     |  Time (s)  |  CPI ratio  #
###############################################################################################
#  4        |  MAIN__ - -1,-1@-1   |  Innermost  |  57.68 (10532)  |  329.12    |  55.36      #
#  8        |  vranlc_ - -1,-1@-1  |  Single     |  14.68 (2681)   |  83.78     |  45.56      #
#  1137     |  log - -1,-1@-1      |  Single     |  1.38 (252)     |  7.88      |  136.68     #
#  5        |  MAIN__ - -1,-1@-1   |  Outermost  |  0.02 (4)       |  0.12      |  0.00       #
###############################################################################################
Info: The CSV file run_7_maqao_output_23209 has been generated
                                    HASSE - PROCESS #23238
                                        Thread #23240
##############################################################################################
#  Loop ID  |     Source Infos     |    Level    |     Time %     |  Time (s)  |  CPI ratio  #
##############################################################################################
#  4        |  MAIN__ - -1,-1@-1   |  Innermost  |  53.96 (8885)  |  277.66    |  41.40      #
#  8        |  vranlc_ - -1,-1@-1  |  Single     |  16.34 (2691)  |  84.09     |  45.59      #
#  1137     |  log - -1,-1@-1      |  Single     |  10.64 (1752)  |  54.75     |  25.45      #
#  5        |  MAIN__ - -1,-1@-1   |  Outermost  |  0.02 (3)      |  0.09      |  0.00       #
##############################################################################################
Info: The CSV file run_7_maqao_output_23240 has been generated
                                    HASSE - PROCESS #23269
                                        Thread #23271
##############################################################################################
#  Loop ID  |     Source Infos     |    Level    |     Time %     |  Time (s)  |  CPI ratio  #
##############################################################################################
#  4        |  MAIN__ - -1,-1@-1   |  Innermost  |  54.40 (8945)  |  279.53    |  41.64      #
#  8        |  vranlc_ - -1,-1@-1  |  Single     |  16.08 (2644)  |  82.62     |  44.58      #
#  1137     |  log - -1,-1@-1      |  Single     |  10.79 (1775)  |  55.47     |  26.53      #
#  5        |  MAIN__ - -1,-1@-1   |  Outermost  |  0.01 (2)      |  0.06      |  0.00       #
##############################################################################################
Info: The CSV file run_7_maqao_output_23271 has been generated
                                          HASSE - PROCESS #23299
                                               Thread #23299
###########################################################################################################
#  Loop ID  |             Source Infos            |    Level    |    Time %    |  Time (s)  |  CPI ratio  #
###########################################################################################################
#  50       |  for_write_seq_fmt_xmit - -1,-1@-1  |  InBetween  |  100.00 (1)  |  0.03      |  0.00       #
###########################################################################################################
Info: The CSV file run_7_maqao_output_23299 has been generated
                                    HASSE - PROCESS #23299
                                         Thread #23301
###############################################################################################
#  Loop ID  |     Source Infos     |    Level    |      Time %     |  Time (s)  |  CPI ratio  #
###############################################################################################
#  4        |  MAIN__ - -1,-1@-1   |  Innermost  |  57.57 (10518)  |  328.69    |  54.17      #
#  8        |  vranlc_ - -1,-1@-1  |  Single     |  14.91 (2724)   |  85.12     |  46.19      #
#  1137     |  log - -1,-1@-1      |  Single     |  1.22 (223)     |  6.97      |  123.03     #
#  5        |  MAIN__ - -1,-1@-1   |  Outermost  |  0.01 (1)       |  0.03      |  0.00       #
###############################################################################################
Info: The CSV file run_7_maqao_output_23301 has been generated



Run number 9..

Output of Maqao perf:


 NAS Parallel Benchmarks 2.3-serial version - EP Benchmark

 Number of random numbers generated:    536870912  
EP Benchmark Results:

CPU Time =   11.8983
N = 2^   28
No. Gaussian Pairs =     210832767.
Sums =    -4.295875165629885D+03   -1.580732573678432D+04
Counts:
  0      98257395.
  1      93827014.
  2      17611549.
  3       1110028.
  4         26536.
  5           245.
  6             0.
  7             0.
  8             0.
  9             0.


 EP Benchmark Completed.
 Class           =                        A
 Size            =                536870912  
 Iterations      =                        0
 Time in seconds =                    11.90
 Mop/s total     =                    45.12
 Operation type  = Random numbers generated
 Verification    =               SUCCESSFUL
 Version         =                      2.3
 Compile date    =              05 Dec 2013

 Compile options:
    F77          = ifort
    FLINK        = ifort
    F_LIB        = (none)
    F_INC        = (none)
    FFLAGS       = -O3
    FLINKFLAGS   = (none)
    RAND         = randi8


 Please send the results of this run to:

 NPB Development Team 
 Internet: npb@nas.nasa.gov
 
 If email is not available, send this to:

 MS T27A-1
 NASA Ames Research Center
 Moffett Field, CA  94035-1000

 Fax: 415-604-3957


Info: [MAQAO] Bypass kernel detection !
[MAQAO] GENERATION OF METAFILE
[MAQAO] GENERATION OF METAFILE DONE

[MAQAO] PROCESSOR DETECTED : CORE2
[MAQAO] DUMPING DATA
[MAQAO] DUMPING DATA DONE


Output of Maqao perf display:
                                          HASSE - PROCESS #23299
                                               Thread #23299
###########################################################################################################
#  Loop ID  |             Source Infos            |    Level    |    Time %    |  Time (s)  |  CPI ratio  #
###########################################################################################################
#  50       |  for_write_seq_fmt_xmit - -1,-1@-1  |  InBetween  |  100.00 (1)  |  0.03      |  0.00       #
###########################################################################################################
Info: The CSV file run_8_maqao_output_23299 has been generated
                                    HASSE - PROCESS #23299
                                         Thread #23301
###############################################################################################
#  Loop ID  |     Source Infos     |    Level    |      Time %     |  Time (s)  |  CPI ratio  #
###############################################################################################
#  4        |  MAIN__ - -1,-1@-1   |  Innermost  |  57.57 (10518)  |  328.69    |  54.17      #
#  8        |  vranlc_ - -1,-1@-1  |  Single     |  14.91 (2724)   |  85.12     |  46.19      #
#  1137     |  log - -1,-1@-1      |  Single     |  1.22 (223)     |  6.97      |  123.03     #
#  5        |  MAIN__ - -1,-1@-1   |  Outermost  |  0.01 (1)       |  0.03      |  0.00       #
###############################################################################################
Info: The CSV file run_8_maqao_output_23301 has been generated
                                    HASSE - PROCESS #23331
                                         Thread #23333
###############################################################################################
#  Loop ID  |     Source Infos     |    Level    |      Time %     |  Time (s)  |  CPI ratio  #
###############################################################################################
#  4        |  MAIN__ - -1,-1@-1   |  Innermost  |  58.59 (10639)  |  332.47    |  55.70      #
#  8        |  vranlc_ - -1,-1@-1  |  Single     |  14.21 (2581)   |  80.66     |  43.93      #
#  1137     |  log - -1,-1@-1      |  Single     |  1.29 (234)     |  7.31      |  120.77     #
###############################################################################################
Info: The CSV file run_8_maqao_output_23333 has been generated
                                    HASSE - PROCESS #23361
                                         Thread #23363
###############################################################################################
#  Loop ID  |     Source Infos     |    Level    |      Time %     |  Time (s)  |  CPI ratio  #
###############################################################################################
#  4        |  MAIN__ - -1,-1@-1   |  Innermost  |  57.92 (10565)  |  330.16    |  55.61      #
#  8        |  vranlc_ - -1,-1@-1  |  Single     |  14.68 (2677)   |  83.66     |  45.64      #
#  1137     |  log - -1,-1@-1      |  Single     |  1.34 (244)     |  7.62      |  150.15     #
###############################################################################################
Info: The CSV file run_8_maqao_output_23363 has been generated
                                    HASSE - PROCESS #23145
                                         Thread #23147
###############################################################################################
#  Loop ID  |     Source Infos     |    Level    |      Time %     |  Time (s)  |  CPI ratio  #
###############################################################################################
#  4        |  MAIN__ - -1,-1@-1   |  Innermost  |  58.31 (10708)  |  334.62    |  55.83      #
#  8        |  vranlc_ - -1,-1@-1  |  Single     |  15.01 (2756)   |  86.12     |  47.01      #
#  1137     |  log - -1,-1@-1      |  Single     |  1.35 (248)     |  7.75      |  128.00     #
#  5        |  MAIN__ - -1,-1@-1   |  Outermost  |  0.01 (2)       |  0.06      |  0.00       #
###############################################################################################
Info: The CSV file run_8_maqao_output_23147 has been generated
                                    HASSE - PROCESS #23114
                                         Thread #23116
###############################################################################################
#  Loop ID  |     Source Infos     |    Level    |      Time %     |  Time (s)  |  CPI ratio  #
###############################################################################################
#  4        |  MAIN__ - -1,-1@-1   |  Innermost  |  57.38 (10445)  |  326.41    |  55.57      #
#  8        |  vranlc_ - -1,-1@-1  |  Single     |  14.46 (2632)   |  82.25     |  45.09      #
#  1137     |  log - -1,-1@-1      |  Single     |  1.42 (258)     |  8.06      |  123.22     #
#  2        |  MAIN__ - -1,-1@-1   |  Single     |  0.01 (1)       |  0.03      |  0.00       #
#  5        |  MAIN__ - -1,-1@-1   |  Outermost  |  0.01 (1)       |  0.03      |  32.00      #
###############################################################################################
Info: The CSV file run_8_maqao_output_23116 has been generated
                                    HASSE - PROCESS #23207
                                         Thread #23209
###############################################################################################
#  Loop ID  |     Source Infos     |    Level    |      Time %     |  Time (s)  |  CPI ratio  #
###############################################################################################
#  4        |  MAIN__ - -1,-1@-1   |  Innermost  |  57.68 (10532)  |  329.12    |  55.36      #
#  8        |  vranlc_ - -1,-1@-1  |  Single     |  14.68 (2681)   |  83.78     |  45.56      #
#  1137     |  log - -1,-1@-1      |  Single     |  1.38 (252)     |  7.88      |  136.68     #
#  5        |  MAIN__ - -1,-1@-1   |  Outermost  |  0.02 (4)       |  0.12      |  0.00       #
###############################################################################################
Info: The CSV file run_8_maqao_output_23209 has been generated
                                    HASSE - PROCESS #23238
                                        Thread #23240
##############################################################################################
#  Loop ID  |     Source Infos     |    Level    |     Time %     |  Time (s)  |  CPI ratio  #
##############################################################################################
#  4        |  MAIN__ - -1,-1@-1   |  Innermost  |  53.96 (8885)  |  277.66    |  41.40      #
#  8        |  vranlc_ - -1,-1@-1  |  Single     |  16.34 (2691)  |  84.09     |  45.59      #
#  1137     |  log - -1,-1@-1      |  Single     |  10.64 (1752)  |  54.75     |  25.45      #
#  5        |  MAIN__ - -1,-1@-1   |  Outermost  |  0.02 (3)      |  0.09      |  0.00       #
##############################################################################################
Info: The CSV file run_8_maqao_output_23240 has been generated
                                    HASSE - PROCESS #23269
                                        Thread #23271
##############################################################################################
#  Loop ID  |     Source Infos     |    Level    |     Time %     |  Time (s)  |  CPI ratio  #
##############################################################################################
#  4        |  MAIN__ - -1,-1@-1   |  Innermost  |  54.40 (8945)  |  279.53    |  41.64      #
#  8        |  vranlc_ - -1,-1@-1  |  Single     |  16.08 (2644)  |  82.62     |  44.58      #
#  1137     |  log - -1,-1@-1      |  Single     |  10.79 (1775)  |  55.47     |  26.53      #
#  5        |  MAIN__ - -1,-1@-1   |  Outermost  |  0.01 (2)      |  0.06      |  0.00       #
##############################################################################################
Info: The CSV file run_8_maqao_output_23271 has been generated
                                    HASSE - PROCESS #23177
                                         Thread #23179
###############################################################################################
#  Loop ID  |     Source Infos     |    Level    |      Time %     |  Time (s)  |  CPI ratio  #
###############################################################################################
#  4        |  MAIN__ - -1,-1@-1   |  Innermost  |  58.07 (10567)  |  330.22    |  55.05      #
#  8        |  vranlc_ - -1,-1@-1  |  Single     |  14.46 (2632)   |  82.25     |  44.97      #
#  1137     |  log - -1,-1@-1      |  Single     |  1.24 (225)     |  7.03      |  83.72      #
#  5        |  MAIN__ - -1,-1@-1   |  Outermost  |  0.02 (3)       |  0.09      |  0.00       #
###############################################################################################
Info: The CSV file run_8_maqao_output_23179 has been generated



Run number 10..

Output of Maqao perf:


 NAS Parallel Benchmarks 2.3-serial version - EP Benchmark

 Number of random numbers generated:    536870912  
EP Benchmark Results:

CPU Time =   11.5734
N = 2^   28
No. Gaussian Pairs =     210832767.
Sums =    -4.295875165629885D+03   -1.580732573678432D+04
Counts:
  0      98257395.
  1      93827014.
  2      17611549.
  3       1110028.
  4         26536.
  5           245.
  6             0.
  7             0.
  8             0.
  9             0.


 EP Benchmark Completed.
 Class           =                        A
 Size            =                536870912  
 Iterations      =                        0
 Time in seconds =                    11.57
 Mop/s total     =                    46.39
 Operation type  = Random numbers generated
 Verification    =               SUCCESSFUL
 Version         =                      2.3
 Compile date    =              05 Dec 2013

 Compile options:
    F77          = ifort
    FLINK        = ifort
    F_LIB        = (none)
    F_INC        = (none)
    FFLAGS       = -O3
    FLINKFLAGS   = (none)
    RAND         = randi8


 Please send the results of this run to:

 NPB Development Team 
 Internet: npb@nas.nasa.gov
 
 If email is not available, send this to:

 MS T27A-1
 NASA Ames Research Center
 Moffett Field, CA  94035-1000

 Fax: 415-604-3957


Info: [MAQAO] Bypass kernel detection !
[MAQAO] GENERATION OF METAFILE
[MAQAO] GENERATION OF METAFILE DONE

[MAQAO] PROCESSOR DETECTED : CORE2
[MAQAO] DUMPING DATA
[MAQAO] DUMPING DATA DONE


Output of Maqao perf display:
                                          HASSE - PROCESS #23299
                                               Thread #23299
###########################################################################################################
#  Loop ID  |             Source Infos            |    Level    |    Time %    |  Time (s)  |  CPI ratio  #
###########################################################################################################
#  50       |  for_write_seq_fmt_xmit - -1,-1@-1  |  InBetween  |  100.00 (1)  |  0.03      |  0.00       #
###########################################################################################################
Info: The CSV file run_9_maqao_output_23299 has been generated
                                    HASSE - PROCESS #23299
                                         Thread #23301
###############################################################################################
#  Loop ID  |     Source Infos     |    Level    |      Time %     |  Time (s)  |  CPI ratio  #
###############################################################################################
#  4        |  MAIN__ - -1,-1@-1   |  Innermost  |  57.57 (10518)  |  328.69    |  54.17      #
#  8        |  vranlc_ - -1,-1@-1  |  Single     |  14.91 (2724)   |  85.12     |  46.19      #
#  1137     |  log - -1,-1@-1      |  Single     |  1.22 (223)     |  6.97      |  123.03     #
#  5        |  MAIN__ - -1,-1@-1   |  Outermost  |  0.01 (1)       |  0.03      |  0.00       #
###############################################################################################
Info: The CSV file run_9_maqao_output_23301 has been generated
                                    HASSE - PROCESS #23331
                                         Thread #23333
###############################################################################################
#  Loop ID  |     Source Infos     |    Level    |      Time %     |  Time (s)  |  CPI ratio  #
###############################################################################################
#  4        |  MAIN__ - -1,-1@-1   |  Innermost  |  58.59 (10639)  |  332.47    |  55.70      #
#  8        |  vranlc_ - -1,-1@-1  |  Single     |  14.21 (2581)   |  80.66     |  43.93      #
#  1137     |  log - -1,-1@-1      |  Single     |  1.29 (234)     |  7.31      |  120.77     #
###############################################################################################
Info: The CSV file run_9_maqao_output_23333 has been generated
                                    HASSE - PROCESS #23361
                                         Thread #23363
###############################################################################################
#  Loop ID  |     Source Infos     |    Level    |      Time %     |  Time (s)  |  CPI ratio  #
###############################################################################################
#  4        |  MAIN__ - -1,-1@-1   |  Innermost  |  57.92 (10565)  |  330.16    |  55.61      #
#  8        |  vranlc_ - -1,-1@-1  |  Single     |  14.68 (2677)   |  83.66     |  45.64      #
#  1137     |  log - -1,-1@-1      |  Single     |  1.34 (244)     |  7.62      |  150.15     #
###############################################################################################
Info: The CSV file run_9_maqao_output_23363 has been generated
                                    HASSE - PROCESS #23114
                                         Thread #23116
###############################################################################################
#  Loop ID  |     Source Infos     |    Level    |      Time %     |  Time (s)  |  CPI ratio  #
###############################################################################################
#  4        |  MAIN__ - -1,-1@-1   |  Innermost  |  57.38 (10445)  |  326.41    |  55.57      #
#  8        |  vranlc_ - -1,-1@-1  |  Single     |  14.46 (2632)   |  82.25     |  45.09      #
#  1137     |  log - -1,-1@-1      |  Single     |  1.42 (258)     |  8.06      |  123.22     #
#  2        |  MAIN__ - -1,-1@-1   |  Single     |  0.01 (1)       |  0.03      |  0.00       #
#  5        |  MAIN__ - -1,-1@-1   |  Outermost  |  0.01 (1)       |  0.03      |  32.00      #
###############################################################################################
Info: The CSV file run_9_maqao_output_23116 has been generated
                                    HASSE - PROCESS #23145
                                         Thread #23147
###############################################################################################
#  Loop ID  |     Source Infos     |    Level    |      Time %     |  Time (s)  |  CPI ratio  #
###############################################################################################
#  4        |  MAIN__ - -1,-1@-1   |  Innermost  |  58.31 (10708)  |  334.62    |  55.83      #
#  8        |  vranlc_ - -1,-1@-1  |  Single     |  15.01 (2756)   |  86.12     |  47.01      #
#  1137     |  log - -1,-1@-1      |  Single     |  1.35 (248)     |  7.75      |  128.00     #
#  5        |  MAIN__ - -1,-1@-1   |  Outermost  |  0.01 (2)       |  0.06      |  0.00       #
###############################################################################################
Info: The CSV file run_9_maqao_output_23147 has been generated
                                    HASSE - PROCESS #23391
                                         Thread #23393
###############################################################################################
#  Loop ID  |     Source Infos     |    Level    |      Time %     |  Time (s)  |  CPI ratio  #
###############################################################################################
#  4        |  MAIN__ - -1,-1@-1   |  Innermost  |  57.51 (10500)  |  328.12    |  55.02      #
#  8        |  vranlc_ - -1,-1@-1  |  Single     |  14.83 (2707)   |  84.59     |  45.91      #
#  1137     |  log - -1,-1@-1      |  Single     |  1.40 (256)     |  8.00      |  132.13     #
#  5        |  MAIN__ - -1,-1@-1   |  Outermost  |  0.01 (1)       |  0.03      |  0.00       #
###############################################################################################
Info: The CSV file run_9_maqao_output_23393 has been generated
                                    HASSE - PROCESS #23207
                                         Thread #23209
###############################################################################################
#  Loop ID  |     Source Infos     |    Level    |      Time %     |  Time (s)  |  CPI ratio  #
###############################################################################################
#  4        |  MAIN__ - -1,-1@-1   |  Innermost  |  57.68 (10532)  |  329.12    |  55.36      #
#  8        |  vranlc_ - -1,-1@-1  |  Single     |  14.68 (2681)   |  83.78     |  45.56      #
#  1137     |  log - -1,-1@-1      |  Single     |  1.38 (252)     |  7.88      |  136.68     #
#  5        |  MAIN__ - -1,-1@-1   |  Outermost  |  0.02 (4)       |  0.12      |  0.00       #
###############################################################################################
Info: The CSV file run_9_maqao_output_23209 has been generated
                                    HASSE - PROCESS #23238
                                        Thread #23240
##############################################################################################
#  Loop ID  |     Source Infos     |    Level    |     Time %     |  Time (s)  |  CPI ratio  #
##############################################################################################
#  4        |  MAIN__ - -1,-1@-1   |  Innermost  |  53.96 (8885)  |  277.66    |  41.40      #
#  8        |  vranlc_ - -1,-1@-1  |  Single     |  16.34 (2691)  |  84.09     |  45.59      #
#  1137     |  log - -1,-1@-1      |  Single     |  10.64 (1752)  |  54.75     |  25.45      #
#  5        |  MAIN__ - -1,-1@-1   |  Outermost  |  0.02 (3)      |  0.09      |  0.00       #
##############################################################################################
Info: The CSV file run_9_maqao_output_23240 has been generated
                                    HASSE - PROCESS #23269
                                        Thread #23271
##############################################################################################
#  Loop ID  |     Source Infos     |    Level    |     Time %     |  Time (s)  |  CPI ratio  #
##############################################################################################
#  4        |  MAIN__ - -1,-1@-1   |  Innermost  |  54.40 (8945)  |  279.53    |  41.64      #
#  8        |  vranlc_ - -1,-1@-1  |  Single     |  16.08 (2644)  |  82.62     |  44.58      #
#  1137     |  log - -1,-1@-1      |  Single     |  10.79 (1775)  |  55.47     |  26.53      #
#  5        |  MAIN__ - -1,-1@-1   |  Outermost  |  0.01 (2)      |  0.06      |  0.00       #
##############################################################################################
Info: The CSV file run_9_maqao_output_23271 has been generated
                                    HASSE - PROCESS #23177
                                         Thread #23179
###############################################################################################
#  Loop ID  |     Source Infos     |    Level    |      Time %     |  Time (s)  |  CPI ratio  #
###############################################################################################
#  4        |  MAIN__ - -1,-1@-1   |  Innermost  |  58.07 (10567)  |  330.22    |  55.05      #
#  8        |  vranlc_ - -1,-1@-1  |  Single     |  14.46 (2632)   |  82.25     |  44.97      #
#  1137     |  log - -1,-1@-1      |  Single     |  1.24 (225)     |  7.03      |  83.72      #
#  5        |  MAIN__ - -1,-1@-1   |  Outermost  |  0.02 (3)       |  0.09      |  0.00       #
###############################################################################################
Info: The CSV file run_9_maqao_output_23179 has been generated




End of Maqao execution.
