{
    "init": {
        "attributes": {
            "name": "init"
        }, 
        "params": [
            {
                "name": "directory", 
                "value": "/tmp/ludcmp"
            },
            {
                "name": "version", 
                "value": 2
            },
            {
                "name": "format", 
                "value": "txt"
            }
        ]
    }
}
