{
    "init": {
        "attributes": {
            "produce_data": true, 
            "name": "init", 
            "repository": "local", 
            "desc": "Initializes a process",
            "long_desc": "Creates a process entry using the given parameters."
        }, 
        "params": [
            {
                "type": "TEXT", 
                "name": "alias",
                "desc": "Alias", 
                "long_desc": "The alias of the entry to create"
            },
            {
                "type": "TEXT", 
                "name": "prefix", 
                "desc": "Prefix script",
                "long_desc": "The script to run before each iteration of the process.",
                "optional": true
            }, 
            {
                "type": "TEXT", 
                "name": "run", 
                "desc": "Process script",
                "long_desc": "The script to run on each processed entry.",
                "optional": true
            }, 
            {
                "type": "TEXT", 
                "name": "suffix", 
                "desc": "Suffix-script",
                "long_desc": "The script to run after each iteration of the process.",
                "optional": true
            },
            {
                "type": "TEXT", 
                "name": "format", 
                "value": "txt", 
                "desc": "Format", 
                "long_desc": "The format of the output. 'txt' will display the output in a human readable manner. 'json' will output a JSON string containing the same Information.",
                "optional": true
            }
        ]
    },
    "run": {
        "attributes": {
            "produce_data": true, 
            "name": "run", 
            "repository": "local", 
            "desc": "Runs a process",
            "long_desc": "Launches a process entry "
        }, 
        "params": [
            {
                "type": "DATA_UID", 
                "name": "process", 
                "desc": "The process entry",
                "long_desc": "The UID or Alias of the process entry to run.",
                "produced_by": "e8690810-69f3-11e1-81a4-0022191169c2"
            },
            {
                "type": "TEXT", 
                "name": "query", 
                "desc": "Query",
                "long_desc": "The query for searching data to process. See the query plugin documentation for more information."
            },
            {
                "type": "TEXT", 
                "name": "repository_query", 
                "desc": "Repository",
                "long_desc": "The repository in which data will be searched. Can be either 'all' for all repositories, 'common'/'temp' for the common or temp repository, or a local repository UID or Alias."
            },
            {
                "type": "TEXT", 
                "name": "type_query", 
                "desc": "Type",
                "long_desc": "The entry type of the data to search (exp: application, loop...)",
                "optional": true,
                "value": "loop"
            },
            {
                "type": "BOOLEAN", 
                "name": "keep_new_files_only", 
                "desc": "Keep only new files",
                "long_desc": "Whether or not to keep only the new files. false: keep erverything. true: keep only the new files.",
                "optional": true,
                "value": true
            },
            {
                "type": "DATA_UID", 
                "name": "list_uids", 
                "desc": "Data list",
                "long_desc": "A list of data UIDs or Aliases to process.",
                "optional": true,
                "list": true,
                "value": []
            },
            {
                "type": "PLUGIN_UID", 
                "name": "query_uid", 
                "desc": "Query plugin",
                "long_desc": "The query plugin that will be used to search for data to process if the query parameter is filled.",
                "optional": true,
                "value": "f685a9f0-ef89-4c08-8585-4c20c760cfe0"
            }
        ]
    },
    "run_command": {
        "attributes": {
            "produce_data": false, 
            "name": "run_command", 
            "desc": "Runs a command on a set of CTI entries.",
            "long_desc": "Runs a command on the given set of CTI entries. Replace <UID> by the current CTI entry UID to process in the command."
        }, 
        "params": [
            {
                "type": "TEXT", 
                "name": "command",
                "list": true,
                "desc": "The command to run on each CTI entry",
                "long_desc": "The command to run on each CTI entry"
            },
            {
                "type": "TEXT", 
                "name": "query", 
                "desc": "Query",
                "long_desc": "The query for searching data to process. See the query plugin documentation for more information."
            },
            {
                "type": "TEXT", 
                "name": "repository_query", 
                "desc": "Repository",
                "long_desc": "The repository in which data will be searched. Can be either 'all' for all repositories, 'common'/'temp' for the common or temp repository, or a local repository UID or Alias."
            },
            {
                "type": "TEXT", 
                "name": "type_query", 
                "desc": "Type",
                "long_desc": "The entry type of the data to search (exp: application, loop...)",
                "optional": true,
                "value": "loop"
            },
            {
                "type": "TEXT", 
                "name": "date_start", 
                "value": null, 
                "desc": "Start date", 
                "long_desc": "The date at or after which the searched entries have been created.", 
                "optional": true
            },
            {
                "type": "TEXT", 
                "name": "date_end", 
                "value": null, 
                "desc": "End date", 
                "long_desc": "The date at or before which the searched entries have been created.", 
                "optional": true
            },
            {
                "type": "DATA_UID", 
                "name": "list_uids", 
                "desc": "Data list",
                "long_desc": "A list of data UIDs or Aliases to process.",
                "optional": true,
                "list": true,
                "value": []
            },
            {
                "type": "PLUGIN_UID", 
                "name": "query_uid", 
                "desc": "Query plugin",
                "long_desc": "The query plugin that will be used to search for data to process if the query parameter is filled.",
                "optional": true,
                "value": "f685a9f0-ef89-4c08-8585-4c20c760cfe0"
            }
        ]
    }
}
