plugin_uid = 85224814-81bd-11e3-ab2a-5bb78461e8a9
date_time_start = 2014/08/25 11:14:31
user_uid = f1452ea1-c8a5-4724-9463-4987f1f85d05
date_time_end = 2014/08/25 11:14:31
plugin_exit_code = 0
alias = maqao_cqa_results_2014_08_25_11:14:31:617750
