{
    "init": {
        "attributes": {
            "name": "init"
        }, 
        "params": [
            {
                "name": "directory", 
                "value": "/home/users/mbordet/EXASCALE/codes/easy_loops"
            }, 
            {
                "name": "version", 
                "value": null
            }, 
            {
                "name": "compile_entries", 
                "value": []
            }, 
            {
                "name": "application_group", 
                "value": null
            }, 
            {
                "name": "maqao_perf", 
                "value": []
            }, 
            {
                "name": "icc_profiler", 
                "value": []
            }, 
            {
                "name": "vtune", 
                "value": []
            }, 
            {
                "name": "loop_groups", 
                "value": []
            }
        ]
    }
}