plugin_uid = fd498c55-c9ad-4c97-853f-64903c68c433
date_time_start = 2014/03/07 14:49:35
user_uid = f1452ea1-c8a5-4724-9463-4987f1f85d05
date_time_end = 2014/03/07 14:56:00
plugin_exit_code = 0
alias = maqao_cqa_wrapper_2014_03_07_14:46:38:738111_2014_03_07_14:49:35:316763
