{
    "init": {
        "attributes": {
            "name": "init"
        }, 
        "params": [
            {
                "name": "binary", 
                "value": null
            }, 
            {
                "name": "mode", 
                "value": "local"
            }, 
            {
                "name": "partition", 
                "value": "regular"
            }, 
            {
                "name": "platform", 
                "value": null
            },
            {
                "name": "run_parameters", 
                "value": []
            }, 
            {
                "name": "nb_run_profiler"
            },
            {
                "name": "stability_sanity_check", 
                "value": 0.050000000000000003
            },
            {
                "name": "total_coverage_loop"
            }, 
            {
                "name": "walltime"
            },
            {
                "name": "logs"
            }, 
            {
                "name": "xml_output"
            }, 
            {
                "name": "dump_output"
            }, 
            {
                "name": "loop_groups", 
                "value": []
            }
        ]
    }
}
