Loop ID,Source Infos,Level,Time %,Time (s),CPI ratio,
4,MAIN__ - -1,-1@-1,Innermost,57.38 (10445),326.41,55.57,
8,vranlc_ - -1,-1@-1,Single,14.46 (2632),82.25,45.09,
1137,log - -1,-1@-1,Single,1.42 (258),8.06,123.22,
2,MAIN__ - -1,-1@-1,Single,0.01 (1),0.03,0.00,
5,MAIN__ - -1,-1@-1,Outermost,0.01 (1),0.03,32.00,
