{
    "create": {
        "attributes": {
            "produce_data": false, 
            "name": "create", 
            "desc": "Creates a plugin",
            "long_desc": "Creates a new plugin using the given parameters. This will generate a pre-filled template of the minimum required plugin files."
        }, 
        "params": [
            {
                "type": "TEXT", 
                "name": "alias", 
                "desc": "the alias (empty if no alias)", 
                "long_desc": "The alias of the plugin to create. Leave empty if no alias.",
                "optional": true
            }, 
            {
                "type": "TEXT", 
                "name": "category", 
                "desc": "The alias of the category (codelet-management, computing-system, internal, tools, ...)", 
                "long_desc": "The alias of the new plugin's category",
                "optional": true
            }, 
            {
                "type": "TEXT", 
                "name": "description", 
                "desc": "The description of the plugin", 
                "long_desc": "The full description of the new plugin",
                "optional": true
            },
            {
                "type": "TEXT", 
                "name": "author", 
                "desc": "The author of the plugin", 
                "long_desc": "The author of the new plugin",
                "optional": true
            },
            {
                "type": "TEXT", 
                "name": "build-number", 
                "desc": "CTI dependency build number (min:max, for instance '0.3.0:1' or '0.3.0:' or ':' if unlimited')", 
                "long_desc": "CTI dependency build number (min:max, for instance '0.3.0:1' or '0.3.0:' or ':' if unlimited')",
                "optional": true
            },
            {
                "type": "FILE", 
                "name": "model_ctr_input_default", 
                "value": "model_ctr_input_default.json", 
                "desc": "Input default template", 
                "long_desc": "The 'ctr_input_default.json' file template. You can use this parameter to replace the default template for that file.",
                "optional": true
            }, 
            {
                "type": "FILE", 
                "name": "model_python_main", 
                "value": "model_python_main.py", 
                "desc": "Main.py template", 
                "long_desc": "The 'main.py' file template. You can use this parameter to replace the default template for that file.",
                "optional": true
            }, 
            {
                "type": "FILE", 
                "name": "model_makefile", 
                "value": "model_Makefile", 
                "desc": "Makefile template", 
                "long_desc": "The 'Makefile' file template. You can use this parameter to replace the default template for that file.",
                "optional": true
            },
            {
                "type": "FILE", 
                "name": "model_python_run_plugin", 
                "value": "model_python_run_plugin.sh", 
                "desc": "Run_plugin.sh template for python", 
                "long_desc": "The 'run_plugin.sh' file template for python plugins. You can use this parameter to replace the default template for that file.",
                "optional": true
            }, 
            {
                "type": "FILE", 
                "name": "model_ctr_output_default", 
                "value": "model_ctr_output_default.json", 
                "desc": "Output default template", 
                "long_desc": "The 'ctr_output_default.json' file template. You can use this parameter to replace the default template for that file.",
                "optional": true
            }, 
            {
                "type": "FILE", 
                "name": "model_ctr_doc", 
                "value": "model_ctr_doc.txt", 
                "desc": "Doc template", 
                "long_desc": "The 'ctr_doc.txt' file template. You can use this parameter to replace the default template for that file.",
                "optional": true
            },
            {
                "type": "TEXT", 
                "name": "format", 
                "value": "txt", 
                "desc": "Format", 
                "long_desc": "The format of the output. 'txt' will display the output in a human readable manner. 'json' will output a JSON string containing the same Information.",
                "optional": true
            }
        ]
    }
}
