Loop ID;Source Infos;Level;Time %;Time (s);CPI ratio;
0;main - 311,348@is.c;Single;48.63 (267);5.34;4.50;
8;rank - 475,476@is.c;Single;28.23 (155);3.10;6.91;
3;main - 380,381@is.c;Single;21.31 (117);2.34;27.00;
36;__intel_ssse3_rep_memcpy - -1,-1@-1;Single;0.36 (2);0.04;3.14;
4;main - 387,389@is.c;Single;0.18 (1);0.02;1.03;
