{
    "init": {
        "attributes": {
            "name": "init",
            "repository": "local"
        }, 
        "params": [
            {
                "name": "alias",
                "value": "name"
            },
            {
                "name": "type",
                "value": "public"
            },
            {
                "name": "url",
                "value": "www.lol.fr"
            },
            {
                "name": "sub_organizations",
                "value": []
            }
        ]
    }
}