{
    "init": {
        "attributes": {
            "produce_data": true, 
            "name": "init", 
            "repository": "local", 
            "desc": "Import files",
            "long_desc": "Creates a file entry using the given parameters."
        }, 
        "params": [
            {
                "name": "files", 
                "list": true, 
                "visible": "yes", 
                "type": "FILE", 
                "desc": "Imported files",
                "long_desc": "The list of imported files. Will appear as a list of paths relative to the entry's file folder."
            },
            {
                "type": "DATA_UID", 
                "name": "produced_by", 
                "optional": true, 
                "desc": "Produced by",
                "long_desc": "A data UID or Alias of the entry that produced the files, if applicable."
            }
        ]
    }
}
