Loop ID;Source Infos;Level;Time %;Time (s);CPI ratio;
4;embar - 186,197@ep.f;Innermost;67.23 (8686);173.72;29.84;
8;vranlc_ - -1,-1@-1;Single;8.40 (1085);21.70;14.67;
1137;log - -1,-1@-1;Single;0.88 (114);2.28;115.37;
