Loop ID,Source Infos,Level,Time %,Time (s),CPI ratio,
4,MAIN__ - -1,-1@-1,Innermost,58.59 (10639),332.47,55.70,
8,vranlc_ - -1,-1@-1,Single,14.21 (2581),80.66,43.93,
1137,log - -1,-1@-1,Single,1.29 (234),7.31,120.77,
