{
    "init": {
        "attributes": {
            "name": "init"
        }, 
        "params": [
            {
                "name": "hostname", 
                "value": "carissimi"
            }, 
            {
                "name": "vendor", 
                "value": ""
            }, 
            {
                "name": "organization", 
                "value": "8035961a-df08-11e2-8f09-3bb708aac3d0"
            }, 
            {
                "name": "processor", 
                "value": [
                    "87442239-3ba1-412e-8dbc-8f7d9e60ed10"
                ]
            }
        ]
    }
}