{
    "init": {
        "attributes": {
            "produce_data": true, 
            "name": "init", 
            "repository": "local", 
            "desc": "initialize demo",
            "long_desc": "Creates a demo plugin data entry using the given parameters."
        }, 
        "params": [
            {
                "type": "TEXT", 
                "name": "my_param_1", 
                "desc": "Param_1",
                "long_desc": "The first parameter."
            }, 
            {
                "type": "TEXT", 
                "name": "my_param_2", 
                "desc": "Param_2",
                "long_desc": "The second parameter."
            }
        ]
    }
}
