Loop ID;Source Infos;Level;Time %;Time (s);CPI ratio;
0;main - 311,348@is.c;Single;49.26 (298);5.96;5.01;
8;rank - 475,476@is.c;Single;28.60 (173);3.46;7.73;
3;main - 380,381@is.c;Single;20.99 (127);2.54;29.31;
36;__intel_ssse3_rep_memcpy - -1,-1@-1;Single;0.66 (4);0.08;11.00;
9;rank - 484,485@is.c;Single;0.17 (1);0.02;0.63;
