{
    "init": {
        "attributes": {
            "name": "init"
        }, 
        "params": [
            {
                "name": "external_family", 
                "value": ""
            }, 
            {
                "name": "number_of_threads", 
                "value": "2"
            }, 
            {
                "name": "model", 
                "value": "15"
            }, 
            {
                "name": "fsb_speed", 
                "value": "1333000"
            }, 
            {
                "name": "instructions", 
                "value": "fpu vme de pse tsc msr pae mce cx8 apic sep mtrr pge mca cmov pat pse36 clflush dts acpi mmx fxsr sse sse2 ss ht tm syscall nx lm constant_tsc pni monitor ds_cpl vmx tm2 ssse3 cx16 xtpr lahf_lm"
            }, 
            {
                "name": "reference", 
                "value": ""
            }, 
            {
                "name": "number_of_cores", 
                "value": "2"
            }, 
            {
                "name": "core_frequency_multiplier", 
                "value": "1"
            }, 
            {
                "name": "codename", 
                "value": ""
            }, 
            {
                "name": "core_vid", 
                "value": ""
            }, 
            {
                "name": "vendor", 
                "value": ""
            }, 
            {
                "name": "family", 
                "value": "6"
            }, 
            {
                "name": "package", 
                "value": ""
            }, 
            {
                "name": "specification", 
                "value": "Intel(R) Xeon(R) CPU 5130 @ 2.00GHz"
            }, 
            {
                "name": "bus_frequency", 
                "value": "1333000"
            }, 
            {
                "name": "stepping", 
                "value": "6"
            }, 
            {
                "name": "technology", 
                "value": ""
            }, 
            {
                "name": "core_frequency", 
                "value": "2000000"
            }, 
            {
                "name": "external_model", 
                "value": ""
            }, 
            {
                "name": "revision", 
                "value": ""
            }
        ]
    }
}