{
    "init": {
        "attributes": {
            "produce_data": true, 
            "name": "init", 
            "repository": "local", 
            "desc": "initialize application",
            "long_desc": "Creates an application entry using the given parameters."
        }, 
        "params": [
            {
                "type": "TEXT", 
                "name": "alias",
                "desc": "Alias", 
                "long_desc": "The alias of the entry to create"
            },
            {
                "type": "TEXT", 
                "name": "directory", 
                "desc": "Directory",
                "long_desc": "The directory that contains the application on the filesystem."
            },
            {
                "type": "FLOAT", 
                "name": "version", 
                "desc": "Version",
                "long_desc": "The version of the application."
            },
            {
                "type": "DATA_UID",
                "name": "application_group",
                "desc": "Application group",
                "long_desc": "A UID or Alias that identifies the application group of the application.",
                "produced_by": "f89f606a-6472-11e2-bb6e-0022191169c2",
                "optional": true,
                "value": null
            },
            {
                "type": "DATA_UID",
                "name": "compile",
                "desc": "The compile entry",
                "long_desc": "The compile entry used to compile the application.",
                "list": true,
                "optional": true,
                "produced_by": "e31a6e93-4d41-43a9-b943-60d1a2cc26c8",
                "value": []
            },
            {
                "type": "TEXT", 
                "name": "format", 
                "value": "txt", 
                "desc": "Format", 
                "long_desc": "The format of the output. 'txt' will display the output in a human readable manner. 'json' will output a JSON string containing the same Information.",
                "optional": true
            }
        ]
    },
    "update": {
        "attributes": {
            "produce_data": false,
            "name": "update", 
            "desc": "update a application entry",
            "long_desc": "Updates an application entry using the given parameters."
        }, 
        "params": [
            {
                "type": "DATA_UID", 
                "name": "entry", 
                "desc": "Application to update",
                "long_desc": "The UID or Alias of the application entry that will be updated",
                "produced_by": "45015659-4f12-4ab2-8849-e0a4e7e4fe4b"
            },
            {
                "type": "TEXT", 
                "name": "directory", 
                "desc": "Directory",
                "long_desc": "The directory that contains the application on the filesystem.",
                "optional": true
            },
            {
                "type": "FLOAT", 
                "name": "version", 
                "desc": "Version",
                "long_desc": "The version of the application.",
                "optional": true
            },
            {
                "type": "DATA_UID",
                "name": "application_group",
                "desc": "Application group",
                "long_desc": "A UID or Alias that identifies the application group of the application.",
                "produced_by": "f89f606a-6472-11e2-bb6e-0022191169c2",
                "optional": true
            },
            {
                "type": "DATA_UID",
                "name": "compile",
                "desc": "The compile entry",
                "long_desc": "The compile entry used to compile the application.",
                "list": true,
                "optional": true,
                "produced_by": "e31a6e93-4d41-43a9-b943-60d1a2cc26c8",
                "target": "application"
            },
            {
                "type": "TEXT", 
                "name": "format", 
                "value": "txt", 
                "desc": "Format", 
                "long_desc": "The format of the output. 'txt' will display the output in a human readable manner. 'json' will output a JSON string containing the same Information.",
                "optional": true
            }
        ]
    }
}
