{
    "init": {
        "attributes": {
            "name": "init"
        }, 
        "params": [
            {
                "name": "files", 
                "value": [
                    "my_codelet"
                ]
            }, 
            {
                "name": "produced_by", 
                "value": ""
            }
        ]
    }
}
