{
    "init": {
        "attributes": {
            "name": "init"
        }, 
        "params": [
            {
                "name": "name", 
                "value": "cat_y"
            }
        ]
    }
}