{
    "init": {
        "attributes": {
            "name": "init"
        }, 
        "params": [
            {
                "name": "contents_matrix", 
                "value": {
                    "TEXT":[
                        10, 
                        11, 
                        12
                    ], 
                    "INTEGER":[
                        10, 
                        11, 
                        12
                    ], 
                    "FLOAT":[
                        10.1, 
                        11.109999999999999, 
                        12.119999999999999
                    ], 
                    "BOOL":[
                        true, 
                        true, 
                        true
                    ], 
                    "DATE":[
                        "2010/10/10 10:10:10", 
                        "2011/11/11 11:11:11", 
                        "2012/12/12 12:12:12"
                    ]
                }
            }
        ]
    }
}