{
    "init": {
        "attributes": {
            "name": "init"
        }, 
        "params": [
            {
                "name": "binary", 
                "value": null
            },
            {
                "name": "mode", 
                "value": "local"
            }, 
            {
                "name": "partition", 
                "value": "regular"
            }, 
            {
                "name": "platform", 
                "value": null
            }, 
            {
                "name": "run_parameters", 
                "value": ""
            }, 
            {
                "name": "granularity", 
                "value": "medium"
            }, 
            {
                "name": "stability_sanity_check", 
                "value": 0.050000000000000003
            }, 
            {
                "name": "bypass_kernel_detection", 
                "value": true
            }, 
            {
                "name": "format", 
                "value": "txt"
            }, 
            {
                "name": "auto_run", 
                "value": false
            }
        ]
    }
}
