[2014/04/15 16:12:28] Initialization - plugin compile
[2014/04/15 16:12:28] Mode: local
[2014/04/15 16:12:28] Launching job
[2014/04/15 16:12:30] Zipping files...
[2014/04/15 16:12:31] Got the binary back
[2014/04/15 16:12:31] Unpackaging mbordet_20140415_161228_009763252.tar.gz
[2014/04/15 16:12:31] Unpackaged
[2014/04/15 16:12:31] Binary from application
[2014/04/15 16:12:31] Importing binary into CTI..
