Vec_eff_ratio_(%)_all;Nb_stores;(L1_optimistic)_FLOP/cycle;Vec_eff_ratio_(%)_other_(INT);(L1)_Bytes_prefetched_/_cycle;Nb_impl_loads;Vec_eff_ratio_(%)_all_(INT);(L1)_IPC;Arith_intensity_(FLOP_/_ld+st_bytes);Can_be_analyzed;port_balancing;Nb_paths;Vec_ratio_(%)_mul_(INT);Vec_ratio_(%)_load_(INT);Vec_ratio_(%)_mul_(FP);Vec_eff_ratio_(%)_other_(FP);Vec_ratio_(%)_store_(FP);Bytes_loaded;Vec_ratio_(%)_other;Unroll_factor;Vec_eff_ratio_(%)_load_(INT);Function_name;Vec_ratio_(%)_all;Nb_FLOP_mul;Vec_ratio_(%)_other_(INT);(L1)_FLOP/cycle;Vec_ratio_(%)_add_sub;decode_(cycles);Nb_stack_ref;Arith_intensity_extra_info;Pattern;Bytes_stored;Vec_eff_ratio_(%)_all_(FP);Front_end_(cycles);(L1_optimistic)_Nb_cycles_if_fully_vectorized;Source_file;Nb_FLOP_add_sub;Unroll_confidence_level_(src_loop);Vec_eff_ratio_(%)_store_(INT);Vec_ratio_(%)_all_(INT);(L1)_Nb_cycles_if_fully_vectorized;(L1)_Bytes_loaded_/_cycle;Vec_ratio_(%)_other_(FP);Vec_ratio_(%)_load_(FP);Vec_ratio_(%)_load;Vec_eff_ratio_(%)_other;Vec_eff_ratio_(%)_load;Vec_eff_ratio_(%)_mul_(FP);Vec_eff_ratio_(%)_mul;Vec_ratio_(%)_store;(L1_optimistic)_Bytes_loaded_/_cycle;Vec_ratio_(%)_store_(INT);(L1_optimistic)_Nb_cycles;Nb_pure_loads;(L1_optimistic)_IPC;Nb_instr;Vec_ratio_(%)_add_sub_(FP);Vec_ratio_(%)_all_(FP);Unroll_info_(src_loop);Vec_eff_ratio_(%)_load_(FP);Size_(bytes);Nb_FLOP_div;Address_in_the_binary;(L1_optimistic)_Bytes_stored_/_cycle;Vec_eff_ratio_(%)_add_sub_(FP);Vec_ratio_(%)_mul;(L1_optimistic)_Bytes_prefetched_/_cycle;(L1)_Nb_cycles;Vec_eff_ratio_(%)_add_sub;Vec_eff_ratio_(%)_add_sub_(INT);Vec_eff_ratio_(%)_store_(FP);Vec_ratio_(%)_add_sub_(INT);Vec_eff_ratio_(%)_store;Source_lines;(L1_optimistic)_Bytes_ld+st_/_cycle;Vec_eff_ratio_(%)_mul_(INT);Bytes_prefetched;Nb_used_x86_reg;Is_main/unrolled;ID;Nb_FLOP_sqrt;Nb_FLOP_other;(L1)_Bytes_ld+st_/_cycle;(L1)_Bytes_stored_/_cycle
25;1;0;NA;0;2;25;2.6666666666667;0;true;NA;1;0;0;NA;NA;NA;8;NA;NA;25;codelet_5ap61u7v;0;0;NA;0;0;NA;0;NA;x86;4;NA;2;1.3333333333333;/tmp/mbordet_20140307_144708_790408727_local/mbordet_20140307_144708_790408727/APP/files/textc;0;high;25;0;1.3333333333333;2.6666666666667;NA;NA;0;NA;25;NA;25;0;2.6666666666667;0;3;1;2.6666666666667;8;NA;NA;multi-versionned but not unrolled;NA;23;0;401828;1.3333333333333;NA;0;0;3;25;25;NA;0;25;17-18;4;25;0;8;NA;2;0;0;4;1.3333333333333
25;1;0;NA;0;2;25;3;0;true;NA;1;0;0;NA;NA;NA;12;NA;NA;25;codelet_5ap61u7v;0;0;NA;0;0;NA;0;NA;x86;4;NA;2;1.3333333333333;/tmp/mbordet_20140307_144708_790408727_local/mbordet_20140307_144708_790408727/APP/files/textc;0;high;25;0;1.3333333333333;4;NA;NA;0;NA;25;NA;25;0;4;0;3;1;3;9;NA;NA;multi-versionned but not unrolled;NA;30;0;401854;1.3333333333333;NA;0;0;3;25;25;NA;0;25;19-20;5.3333333333333;25;0;8;NA;1;0;0;5.3333333333333;1.3333333333333
