{
    "init": {
        "attributes": {
            "name": "init"
        }, 
        "params": [
            {
                "name": "hostname", 
                "value": "campion"
            }, 
            {
                "name": "vendor", 
                "value": ""
            }, 
            {
                "name": "organization", 
                "value": "8035961a-df08-11e2-8f09-3bb708aac3d0"
            }, 
            {
                "name": "processor", 
                "value": [
                    "804cf134-df08-11e2-8851-a75d84aee60a"
                ]
            }
        ]
    }
}