plugin_uid = 06e2e012-5b61-11e3-9170-d3f36bd3c5f9
date_time_start = 2014/02/26 14:02:56
user_uid = f1452ea1-c8a5-4724-9463-4987f1f85d05
date_time_end = 2014/07/16 15:35:56
plugin_exit_code = 0
alias = nas-ser3.0_is_loop0_2014_02_26_14:02:56:746661
