plugin_uid = 120ceae9-c9b7-4bf0-8b8f-acb38ee0749c
date_time_start = 2013/07/01 17:16:33
user_uid = f1452ea1-c8a5-4724-9463-4987f1f85d05
date_time_end = 2013/07/01 17:16:34
plugin_exit_code = 0
alias = platform_demo
