{
    "init": {
        "attributes": {
            "long_desc": "Please replace this with a proper long description of the command.", 
            "desc": "Descriptive plugin produced by database plugin", 
            "name": "init", 
            "repository": "local", 
            "produce_data": true
        }, 
        "params": [
            {
                "column_long_descs": [
                    "Fill long_desc for data1", 
                    "Fill long_desc for data2"
                ], 
                "long_desc": "The contents of the imported CSV.", 
                "name": "contents_matrix", 
                "column_types": [
                    "TEXT", 
                    "TEXT"
                ], 
                "column_descs": [
                    "data1", 
                    "data2"
                ], 
                "type": "MATRIX", 
                "column_names": [
                    "data1", 
                    "data2"
                ], 
                "desc": "CSV contents."
            }
        ]
    }
}