{
    "init": {
        "attributes": {
            "name": "init",
            "repository": "local"
        }, 
        "params": [
            {
                "name": "hostname",
                "value": "platform_test" 
            },
            {
                "name": "vendor",
                "value": "" 
            },
            {
                "name": "organization", 
                "value": ""
            },
            {
                "name": "processor", 
                "value": []
            }
        ]
    }
}
