{
    "init": {
        "attributes": {
            "name": "init"
        }, 
        "params": [
            {
                "name": "binary", 
                "value": "84db6c50-a83f-42a0-a435-a3393c5a3ddb"
            },
            {
                "name": "application", 
                "value": "d40b3cfd-ba8c-41b9-bf2c-fb11da2f0443"
            }, 
            {
                "name": "mode", 
                "value": "slurm"
            }, 
            {
                "name": "make", 
                "value": "make"
            }, 
            {
                "name": "make_opt", 
                "value": "CLASS=B CC=icc FC=ifort CXX=icpc CTI_PROFILE+=-xSSE4.2 CTI_PROFILE+=\"-g\" "
            }, 
            {
                "name": "compiler", 
                "value": null
            }, 
            {
                "name": "compile_opt", 
                "value": null
            }, 
            {
                "name": "platform", 
                "value": "f1add9cc-0f87-4985-888a-fc6bcc051b40"
            },
            {
                "name": "partition", 
                "value": "special"
            },
            {
                "name": "logs", 
                "value": [
                    "slurm-2656.out", 
                    "daemon_log.out"
                ]
            }
        ]
    }
}
