{
    "init": {
        "attributes": {
            "name": "init"
        }, 
        "params": [
            {
                "name": "binary", 
                "value": "83d027da-10b8-11e4-a9a9-60eb69ce203c"
            }, 
            {
                "name": "run_parameters", 
                "value": null
            }, 
            {
                "name": "granularity", 
                "value": "medium"
            }, 
            {
                "name": "stability_sanity_check", 
                "value": 0.050000000000000003
            }, 
            {
                "name": "total_coverage_loop", 
                "value": 44.634999999999998
            }, 
            {
                "name": "mode", 
                "value": "local"
            }, 
            {
                "name": "partition", 
                "value": "regular"
            }, 
            {
                "name": "platform", 
                "value": null
            }, 
            {
                "name": "prefix_execute_script", 
                "value": null
            }, 
            {
                "name": "suffix_execute_script", 
                "value": null
            }, 
            {
                "name": "submitter_cmd", 
                "value": "sbatch"
            }, 
            {
                "name": "submitter_opt", 
                "value": null
            }, 
            {
                "name": "submitter_user", 
                "value": null
            }, 
            {
                "name": "prefix_cmd", 
                "value": null
            }, 
            {
                "name": "nb_run_maqao_perf", 
                "value": 10
            }, 
            {
                "name": "logs", 
                "value": [
                    "daemon_log.out", 
                    "execution.out"
                ]
            }, 
            {
                "name": "csv_output", 
                "value": [
                    "run_4_maqao_output_14486.csv", 
                    "run_0_maqao_output_13728.csv", 
                    "run_1_maqao_output_14036.csv", 
                    "run_8_maqao_output_14753.csv", 
                    "run_6_maqao_output_14605.csv", 
                    "run_7_maqao_output_14706.csv", 
                    "run_5_maqao_output_14531.csv", 
                    "run_2_maqao_output_14357.csv", 
                    "run_9_maqao_output_14794.csv", 
                    "run_3_maqao_output_14443.csv"
                ]
            }, 
            {
                "name": "loop_groups", 
                "value": [
                    "0d349384-10ba-11e4-b14a-60eb69ce203c"
                ]
            }
        ]
    }
}