{
    "init": {
        "attributes": {
            "name": "init"
        }, 
        "params": [
            {
                "name": "loop_files", 
                "value": ["test.c"]
            }, 
            {
                "name": "loop_id", 
                "value": ""
            }, 
            {
                "name": "first_line", 
                "value": null
            }, 
            {
                "name": "end_line", 
                "value": null
            }, 
            {
                "name": "language", 
                "value": null
            }, 
            {
                "name": "source_function_name", 
                "value": null
            }, 
            {
                "name": "coverage_maqao", 
                "value": null
            }, 
            {
                "name": "inclusive_coverage", 
                "value": null
            }, 
            {
                "name": "coverage_icc_profiler", 
                "value": null
            }, 
            {
                "name": "coverage_vtune", 
                "value": null
            }, 
            {
                "name": "status_maqao_perf", 
                "value": null
            }, 
            {
                "name": "status_icc_profiler", 
                "value": null
            }, 
            {
                "name": "status_vtune", 
                "value": null
            }, 
            {
                "name": "time_sec", 
                "value": null
            }, 
            {
                "name": "inclusive_nb_sample", 
                "value": 10
            }, 
            {
                "name": "cpi_ratio", 
                "value": null
            },
            {
                "name": "loop_type", 
                "value": "single"
            }, 
            {
                "name": "loop_parents", 
                "value": []
            }, 
            {
                "name": "loop_children", 
                "value": []
            }, 
            {
                "name": "loop_group", 
                "value": null
            }, 
            {
                "name": "format", 
                "value": "txt"
            }
        ]
    }
}
