{
    "init": {
        "attributes": {
            "produce_data": true, 
            "name": "init", 
            "repository": "local", 
            "desc": "Initializes a set of applications",
            "long_desc": "Creates a group of applications using the given parameters."
        }, 
        "params": [
            {
                "type": "TEXT", 
                "name": "alias",
                "desc": "Alias", 
                "long_desc": "The alias of the entry to create"
            },
            {
                "type": "DATA_UID", 
                "list": true,
                "name": "applications", 
                "produced_by": "45015659-4f12-4ab2-8849-e0a4e7e4fe4b",
                "desc": "Applications",
                "long_desc": "The application entries that will form the application_group. A list of application UID or Alias.",
                "optional": true
            }, 
            {
                "type": "TEXT", 
                "name": "format", 
                "value": "txt", 
                "desc": "Format", 
                "long_desc": "The format of the output. 'txt' will display the output in a human readable manner. 'json' will output a JSON string containing the same Information.",
                "optional": true
            }
        ]
    },
    "update": {
        "attributes": {
            "produce_data": false,
            "name": "update", 
            "desc": "Updates an application_group entry",
            "long_desc": "Updates an application_group entry using the given parameters."
        }, 
        "params": [
            {
                "type": "DATA_UID", 
                "name": "entry", 
                "desc": "Entry to update",
                "long_desc": "The UID or Alias of the application_group entry to update.",
                "produced_by": "f89f606a-6472-11e2-bb6e-0022191169c2" 
            },
            {
                "type": "DATA_UID", 
                "list": true,
                "name": "applications", 
                "produced_by": "45015659-4f12-4ab2-8849-e0a4e7e4fe4b",
                "target": "application_group",
                "desc": "Applications",
                "long_desc": "The application entries that will form the application_group. A list of application UID or Alias.",
                "optional": true
            },
            {
                "type": "TEXT", 
                "name": "format", 
                "value": "txt", 
                "desc": "Format", 
                "long_desc": "The format of the output. 'txt' will display the output in a human readable manner. 'json' will output a JSON string containing the same Information.",
                "optional": true
            }
        ]
    }
}
