{
    "init": {
        "attributes": {
            "name": "init"
        }, 
        "params": [
            {
                "name": "type", 
                "value": "Company"
            }, 
            {
                "name": "url", 
                "value": "http://www.intel.com"
            }, 
            {
                "name": "sub_organizations", 
                "value": ["e190d332-7fb4-4504-a57e-6529dd866bae"]
            }, 
            {
                "name": "cpu", 
                "value": []
            },
            {
                "name": "compiler", 
                "value": []
            },
            {
                "name": "user", 
                "value": []
            },
            {
                "name": "platform", 
                "value": []
            }, 
            {
                "name": "platform_organization", 
                "value": []
            }
        ]
    }
}
