{
    "init": {
        "attributes": {
            "name": "init"
        }, 
        "params": [
            {
                "name": "binary", 
                "value": null
            }, 
            {
                "name": "frequency", 
                "value": 98479870.0
            }, 
            {
                "name": "repository_query", 
                "value": "all"
            }, 
            {
                "name": "query", 
                "value": null
            }, 
            {
                "name": "type_query", 
                "value": "loop"
            }, 
            {
                "name": "loops", 
                "value": []
            }, 
            {
                "name": "mode", 
                "value": "local"
            }, 
            {
                "name": "platform", 
                "value": null
            }, 
            {
                "name": "partition", 
                "value": "regular"
            }, 
            {
                "name": "run_parameters", 
                "value": ""
            }, 
            {
                "name": "special_permissions", 
                "value": false
            }, 
            {
                "name": "uarch", 
                "value": "nehalem_westmere"
            }, 
            {
                "name": "counter_list", 
                "value": []
            }, 
            {
                "name": "query_uid", 
                "value": "f685a9f0-ef89-4c08-8585-4c20c760cfe0"
            }, 
            {
                "name": "format", 
                "value": "txt"
            }, 
            {
                "name": "auto_run", 
                "value": true
            }
        ]
    }
}