plugin_uid = 2b54ef94-5b61-11e3-8722-7fd2ea71b72a
date_time_start = 2014/08/18 16:43:42
user_uid = f1452ea1-c8a5-4724-9463-4987f1f85d05
date_time_end = 2014/08/25 11:15:07
plugin_exit_code = 0
alias = loop_group_2014_08_18_16:43:42:854594
