{
    "init": {
        "attributes": {
            "name": "init"
        }, 
        "params": [
            {
                "name": "binary_file", 
                "value": "ep.A.tar.gz"
            }, 
            {
                "name": "compile", 
                "value": null
            }, 
            {
                "name": "maqao_perf_entry", 
                "value": "44dcbe8a-8db9-11e3-a73b-c3c65a3cbcbc"
            }
        ]
    }
}
