
* Number of maqao perf run: 10
* Stability_sanity_check: 0.05
* Relevance_threshold_min: 8

##########################################################################
WARNING: Please make sure Hyperthreading and Turboboost are disabled.
On top of that, the frequency of the CPU should be stabilized. To do so, please use cpuspeed.
A script to set the frequency can be found here: '/home/users/ftalbart/exascale/install/cti/common-tools/set_freq.sh'.
WARNING: The application must be compiled using the -g flag.
##########################################################################

Running Maqao perf.

Run number 1..

 /tmp/ftalbart_20140721_112924_570906827_local/ftalbart_20140721_112924_570906827/TOOL/tmp.K0XGIoNSqa/maqao/maqao perf -g=medium xp=./tmpRlsooM t=SX -bkd=on  -- /tmp/ftalbart_20140721_112924_570906827_local/ftalbart_20140721_112924_570906827/APP/ep.A
/tmp/ftalbart_20140721_112924_570906827_local/ftalbart_20140721_112924_570906827/TOOL/tmp.K0XGIoNSqa/maqao/maqao perf xp=./tmpRlsooM d=SLX ssv=on --output-format=csv --output-path=/tmp/ftalbart_20140721_112924_570906827_local/ftalbart_20140721_112924_570906827/RESULTS/run_0_maqao_output
Output of Maqao perf:


 NAS Parallel Benchmarks 2.3-serial version - EP Benchmark

 Number of random numbers generated:    536870912  
EP Benchmark Results:

CPU Time =   22.7917
N = 2^   28
No. Gaussian Pairs =     210832767.
Sums =    -4.295875165629885D+03   -1.580732573678432D+04
Counts:
  0      98257395.
  1      93827014.
  2      17611549.
  3       1110028.
  4         26536.
  5           245.
  6             0.
  7             0.
  8             0.
  9             0.


 EP Benchmark Completed.
 Class           =                        A
 Size            =                536870912  
 Iterations      =                        0
 Time in seconds =                    22.79
 Mop/s total     =                    23.56
 Operation type  = Random numbers generated
 Verification    =               SUCCESSFUL
 Version         =                      2.3
 Compile date    =              03 Jul 2014

 Compile options:
    F77          = gfortran
    FLINK        = gfortran
    F_LIB        = (none)
    F_INC        = (none)
    FFLAGS       = -O3
    FLINKFLAGS   = (none)
    RAND         = randi8


 Please send the results of this run to:

 NPB Development Team 
 Internet: npb@nas.nasa.gov
 
 If email is not available, send this to:

 MS T27A-1
 NASA Ames Research Center
 Moffett Field, CA  94035-1000

 Fax: 415-604-3957


Info: [MAQAO] Bypass kernel detection !
[MAQAO] GENERATION OF METAFILE
[MAQAO] GENERATION OF METAFILE DONE
[MAQAO] Your experiment path is ./tmpRlsooM
                                    MENDELSSOHN - PROCESS #13727
                                           Thread #13728
####################################################################################################
#  Loop ID  |  Source Infos  |    Level    |      Time %     |  Time (s)  |  CPI ratio  |  Module  #
####################################################################################################
#  3        |  MAIN__        |  Innermost  |  40.54 (11603)  |  232.06    |  35.96      |  ep.A    #
#  7        |  vranlc_       |  Single     |  4.05 (1159)    |  23.18     |  12.00      |  ep.A    #
#  4        |  MAIN__        |  Outermost  |  0.00 (1)       |  0.02      |  0.00       |  ep.A    #
####################################################################################################
Info: The CSV file /tmp/ftalbart_20140721_112924_570906827_local/ftalbart_20140721_112924_570906827/RESULTS/run_0_maqao_output_13728.csv has been generated

[MAQAO] PROCESSOR DETECTED : NEHALEM/WESTMERE
[MAQAO] DUMPING DATA
[MAQAO] DUMPING DATA DONE


Run number 2..

 /tmp/ftalbart_20140721_112924_570906827_local/ftalbart_20140721_112924_570906827/TOOL/tmp.K0XGIoNSqa/maqao/maqao perf -g=medium xp=./tmp80kbpV t=SX -bkd=on  -- /tmp/ftalbart_20140721_112924_570906827_local/ftalbart_20140721_112924_570906827/APP/ep.A
/tmp/ftalbart_20140721_112924_570906827_local/ftalbart_20140721_112924_570906827/TOOL/tmp.K0XGIoNSqa/maqao/maqao perf xp=./tmp80kbpV d=SLX ssv=on --output-format=csv --output-path=/tmp/ftalbart_20140721_112924_570906827_local/ftalbart_20140721_112924_570906827/RESULTS/run_1_maqao_output
Output of Maqao perf:


 NAS Parallel Benchmarks 2.3-serial version - EP Benchmark

 Number of random numbers generated:    536870912  
EP Benchmark Results:

CPU Time =   22.8017
N = 2^   28
No. Gaussian Pairs =     210832767.
Sums =    -4.295875165629885D+03   -1.580732573678432D+04
Counts:
  0      98257395.
  1      93827014.
  2      17611549.
  3       1110028.
  4         26536.
  5           245.
  6             0.
  7             0.
  8             0.
  9             0.


 EP Benchmark Completed.
 Class           =                        A
 Size            =                536870912  
 Iterations      =                        0
 Time in seconds =                    22.80
 Mop/s total     =                    23.55
 Operation type  = Random numbers generated
 Verification    =               SUCCESSFUL
 Version         =                      2.3
 Compile date    =              03 Jul 2014

 Compile options:
    F77          = gfortran
    FLINK        = gfortran
    F_LIB        = (none)
    F_INC        = (none)
    FFLAGS       = -O3
    FLINKFLAGS   = (none)
    RAND         = randi8


 Please send the results of this run to:

 NPB Development Team 
 Internet: npb@nas.nasa.gov
 
 If email is not available, send this to:

 MS T27A-1
 NASA Ames Research Center
 Moffett Field, CA  94035-1000

 Fax: 415-604-3957


Info: [MAQAO] Bypass kernel detection !
[MAQAO] GENERATION OF METAFILE
[MAQAO] GENERATION OF METAFILE DONE
[MAQAO] Your experiment path is ./tmp80kbpV
                                    MENDELSSOHN - PROCESS #14035
                                           Thread #14036
####################################################################################################
#  Loop ID  |  Source Infos  |    Level    |      Time %     |  Time (s)  |  CPI ratio  |  Module  #
####################################################################################################
#  3        |  MAIN__        |  Innermost  |  40.75 (11670)  |  233.40    |  36.13      |  ep.A    #
#  7        |  vranlc_       |  Single     |  3.90 (1118)    |  22.36     |  11.58      |  ep.A    #
#  6        |  MAIN__        |  Innermost  |  0.00 (1)       |  0.02      |  0.00       |  ep.A    #
####################################################################################################
Info: The CSV file /tmp/ftalbart_20140721_112924_570906827_local/ftalbart_20140721_112924_570906827/RESULTS/run_1_maqao_output_14036.csv has been generated

[MAQAO] PROCESSOR DETECTED : NEHALEM/WESTMERE
[MAQAO] DUMPING DATA
[MAQAO] DUMPING DATA DONE


Run number 3..

 /tmp/ftalbart_20140721_112924_570906827_local/ftalbart_20140721_112924_570906827/TOOL/tmp.K0XGIoNSqa/maqao/maqao perf -g=medium xp=./tmp48dVMn t=SX -bkd=on  -- /tmp/ftalbart_20140721_112924_570906827_local/ftalbart_20140721_112924_570906827/APP/ep.A
/tmp/ftalbart_20140721_112924_570906827_local/ftalbart_20140721_112924_570906827/TOOL/tmp.K0XGIoNSqa/maqao/maqao perf xp=./tmp48dVMn d=SLX ssv=on --output-format=csv --output-path=/tmp/ftalbart_20140721_112924_570906827_local/ftalbart_20140721_112924_570906827/RESULTS/run_2_maqao_output
Output of Maqao perf:


 NAS Parallel Benchmarks 2.3-serial version - EP Benchmark

 Number of random numbers generated:    536870912  
EP Benchmark Results:

CPU Time =   23.1443
N = 2^   28
No. Gaussian Pairs =     210832767.
Sums =    -4.295875165629885D+03   -1.580732573678432D+04
Counts:
  0      98257395.
  1      93827014.
  2      17611549.
  3       1110028.
  4         26536.
  5           245.
  6             0.
  7             0.
  8             0.
  9             0.


 EP Benchmark Completed.
 Class           =                        A
 Size            =                536870912  
 Iterations      =                        0
 Time in seconds =                    23.14
 Mop/s total     =                    23.20
 Operation type  = Random numbers generated
 Verification    =               SUCCESSFUL
 Version         =                      2.3
 Compile date    =              03 Jul 2014

 Compile options:
    F77          = gfortran
    FLINK        = gfortran
    F_LIB        = (none)
    F_INC        = (none)
    FFLAGS       = -O3
    FLINKFLAGS   = (none)
    RAND         = randi8


 Please send the results of this run to:

 NPB Development Team 
 Internet: npb@nas.nasa.gov
 
 If email is not available, send this to:

 MS T27A-1
 NASA Ames Research Center
 Moffett Field, CA  94035-1000

 Fax: 415-604-3957


Info: [MAQAO] Bypass kernel detection !
[MAQAO] GENERATION OF METAFILE
[MAQAO] GENERATION OF METAFILE DONE
[MAQAO] Your experiment path is ./tmp48dVMn
                                    MENDELSSOHN - PROCESS #14356
                                           Thread #14357
####################################################################################################
#  Loop ID  |  Source Infos  |    Level    |      Time %     |  Time (s)  |  CPI ratio  |  Module  #
####################################################################################################
#  3        |  MAIN__        |  Innermost  |  40.48 (11733)  |  234.66    |  36.47      |  ep.A    #
#  7        |  vranlc_       |  Single     |  3.86 (1118)    |  22.36     |  11.51      |  ep.A    #
#  6        |  MAIN__        |  Innermost  |  0.00 (1)       |  0.02      |  0.00       |  ep.A    #
####################################################################################################
Info: The CSV file /tmp/ftalbart_20140721_112924_570906827_local/ftalbart_20140721_112924_570906827/RESULTS/run_2_maqao_output_14357.csv has been generated

[MAQAO] PROCESSOR DETECTED : NEHALEM/WESTMERE
[MAQAO] DUMPING DATA
[MAQAO] DUMPING DATA DONE


Run number 4..

 /tmp/ftalbart_20140721_112924_570906827_local/ftalbart_20140721_112924_570906827/TOOL/tmp.K0XGIoNSqa/maqao/maqao perf -g=medium xp=./tmpf8sRPn t=SX -bkd=on  -- /tmp/ftalbart_20140721_112924_570906827_local/ftalbart_20140721_112924_570906827/APP/ep.A
/tmp/ftalbart_20140721_112924_570906827_local/ftalbart_20140721_112924_570906827/TOOL/tmp.K0XGIoNSqa/maqao/maqao perf xp=./tmpf8sRPn d=SLX ssv=on --output-format=csv --output-path=/tmp/ftalbart_20140721_112924_570906827_local/ftalbart_20140721_112924_570906827/RESULTS/run_3_maqao_output
Output of Maqao perf:


 NAS Parallel Benchmarks 2.3-serial version - EP Benchmark

 Number of random numbers generated:    536870912  
EP Benchmark Results:

CPU Time =   22.5127
N = 2^   28
No. Gaussian Pairs =     210832767.
Sums =    -4.295875165629885D+03   -1.580732573678432D+04
Counts:
  0      98257395.
  1      93827014.
  2      17611549.
  3       1110028.
  4         26536.
  5           245.
  6             0.
  7             0.
  8             0.
  9             0.


 EP Benchmark Completed.
 Class           =                        A
 Size            =                536870912  
 Iterations      =                        0
 Time in seconds =                    22.51
 Mop/s total     =                    23.85
 Operation type  = Random numbers generated
 Verification    =               SUCCESSFUL
 Version         =                      2.3
 Compile date    =              03 Jul 2014

 Compile options:
    F77          = gfortran
    FLINK        = gfortran
    F_LIB        = (none)
    F_INC        = (none)
    FFLAGS       = -O3
    FLINKFLAGS   = (none)
    RAND         = randi8


 Please send the results of this run to:

 NPB Development Team 
 Internet: npb@nas.nasa.gov
 
 If email is not available, send this to:

 MS T27A-1
 NASA Ames Research Center
 Moffett Field, CA  94035-1000

 Fax: 415-604-3957


Info: [MAQAO] Bypass kernel detection !
[MAQAO] GENERATION OF METAFILE
[MAQAO] GENERATION OF METAFILE DONE
[MAQAO] Your experiment path is ./tmpf8sRPn
                                    MENDELSSOHN - PROCESS #14442
                                           Thread #14443
####################################################################################################
#  Loop ID  |  Source Infos  |    Level    |      Time %     |  Time (s)  |  CPI ratio  |  Module  #
####################################################################################################
#  3        |  MAIN__        |  Innermost  |  41.12 (11637)  |  232.74    |  35.74      |  ep.A    #
#  7        |  vranlc_       |  Single     |  3.97 (1123)    |  22.46     |  11.63      |  ep.A    #
#  4        |  MAIN__        |  Outermost  |  0.00 (1)       |  0.02      |  25.00      |  ep.A    #
####################################################################################################
Info: The CSV file /tmp/ftalbart_20140721_112924_570906827_local/ftalbart_20140721_112924_570906827/RESULTS/run_3_maqao_output_14443.csv has been generated

[MAQAO] PROCESSOR DETECTED : NEHALEM/WESTMERE
[MAQAO] DUMPING DATA
[MAQAO] DUMPING DATA DONE


Run number 5..

 /tmp/ftalbart_20140721_112924_570906827_local/ftalbart_20140721_112924_570906827/TOOL/tmp.K0XGIoNSqa/maqao/maqao perf -g=medium xp=./tmpdqOur2 t=SX -bkd=on  -- /tmp/ftalbart_20140721_112924_570906827_local/ftalbart_20140721_112924_570906827/APP/ep.A
/tmp/ftalbart_20140721_112924_570906827_local/ftalbart_20140721_112924_570906827/TOOL/tmp.K0XGIoNSqa/maqao/maqao perf xp=./tmpdqOur2 d=SLX ssv=on --output-format=csv --output-path=/tmp/ftalbart_20140721_112924_570906827_local/ftalbart_20140721_112924_570906827/RESULTS/run_4_maqao_output
Output of Maqao perf:


 NAS Parallel Benchmarks 2.3-serial version - EP Benchmark

 Number of random numbers generated:    536870912  
EP Benchmark Results:

CPU Time =   22.7035
N = 2^   28
No. Gaussian Pairs =     210832767.
Sums =    -4.295875165629885D+03   -1.580732573678432D+04
Counts:
  0      98257395.
  1      93827014.
  2      17611549.
  3       1110028.
  4         26536.
  5           245.
  6             0.
  7             0.
  8             0.
  9             0.


 EP Benchmark Completed.
 Class           =                        A
 Size            =                536870912  
 Iterations      =                        0
 Time in seconds =                    22.70
 Mop/s total     =                    23.65
 Operation type  = Random numbers generated
 Verification    =               SUCCESSFUL
 Version         =                      2.3
 Compile date    =              03 Jul 2014

 Compile options:
    F77          = gfortran
    FLINK        = gfortran
    F_LIB        = (none)
    F_INC        = (none)
    FFLAGS       = -O3
    FLINKFLAGS   = (none)
    RAND         = randi8


 Please send the results of this run to:

 NPB Development Team 
 Internet: npb@nas.nasa.gov
 
 If email is not available, send this to:

 MS T27A-1
 NASA Ames Research Center
 Moffett Field, CA  94035-1000

 Fax: 415-604-3957


Info: [MAQAO] Bypass kernel detection !
[MAQAO] GENERATION OF METAFILE
[MAQAO] GENERATION OF METAFILE DONE
[MAQAO] Your experiment path is ./tmpdqOur2
                                    MENDELSSOHN - PROCESS #14485
                                           Thread #14486
####################################################################################################
#  Loop ID  |  Source Infos  |    Level    |      Time %     |  Time (s)  |  CPI ratio  |  Module  #
####################################################################################################
#  3        |  MAIN__        |  Innermost  |  40.69 (11598)  |  231.96    |  35.66      |  ep.A    #
#  7        |  vranlc_       |  Single     |  3.93 (1119)    |  22.38     |  11.58      |  ep.A    #
#  6        |  MAIN__        |  Innermost  |  0.00 (1)       |  0.02      |  0.00       |  ep.A    #
####################################################################################################
Info: The CSV file /tmp/ftalbart_20140721_112924_570906827_local/ftalbart_20140721_112924_570906827/RESULTS/run_4_maqao_output_14486.csv has been generated

[MAQAO] PROCESSOR DETECTED : NEHALEM/WESTMERE
[MAQAO] DUMPING DATA
[MAQAO] DUMPING DATA DONE


Run number 6..

 /tmp/ftalbart_20140721_112924_570906827_local/ftalbart_20140721_112924_570906827/TOOL/tmp.K0XGIoNSqa/maqao/maqao perf -g=medium xp=./tmpQjF1TR t=SX -bkd=on  -- /tmp/ftalbart_20140721_112924_570906827_local/ftalbart_20140721_112924_570906827/APP/ep.A
/tmp/ftalbart_20140721_112924_570906827_local/ftalbart_20140721_112924_570906827/TOOL/tmp.K0XGIoNSqa/maqao/maqao perf xp=./tmpQjF1TR d=SLX ssv=on --output-format=csv --output-path=/tmp/ftalbart_20140721_112924_570906827_local/ftalbart_20140721_112924_570906827/RESULTS/run_5_maqao_output
Output of Maqao perf:


 NAS Parallel Benchmarks 2.3-serial version - EP Benchmark

 Number of random numbers generated:    536870912  
EP Benchmark Results:

CPU Time =   22.9042
N = 2^   28
No. Gaussian Pairs =     210832767.
Sums =    -4.295875165629885D+03   -1.580732573678432D+04
Counts:
  0      98257395.
  1      93827014.
  2      17611549.
  3       1110028.
  4         26536.
  5           245.
  6             0.
  7             0.
  8             0.
  9             0.


 EP Benchmark Completed.
 Class           =                        A
 Size            =                536870912  
 Iterations      =                        0
 Time in seconds =                    22.90
 Mop/s total     =                    23.44
 Operation type  = Random numbers generated
 Verification    =               SUCCESSFUL
 Version         =                      2.3
 Compile date    =              03 Jul 2014

 Compile options:
    F77          = gfortran
    FLINK        = gfortran
    F_LIB        = (none)
    F_INC        = (none)
    FFLAGS       = -O3
    FLINKFLAGS   = (none)
    RAND         = randi8


 Please send the results of this run to:

 NPB Development Team 
 Internet: npb@nas.nasa.gov
 
 If email is not available, send this to:

 MS T27A-1
 NASA Ames Research Center
 Moffett Field, CA  94035-1000

 Fax: 415-604-3957


Info: [MAQAO] Bypass kernel detection !
[MAQAO] GENERATION OF METAFILE
[MAQAO] GENERATION OF METAFILE DONE
[MAQAO] Your experiment path is ./tmpQjF1TR
                                    MENDELSSOHN - PROCESS #14530
                                           Thread #14531
####################################################################################################
#  Loop ID  |  Source Infos  |    Level    |      Time %     |  Time (s)  |  CPI ratio  |  Module  #
####################################################################################################
#  3        |  MAIN__        |  Innermost  |  40.39 (11600)  |  232.00    |  35.92      |  ep.A    #
#  7        |  vranlc_       |  Single     |  3.95 (1134)    |  22.68     |  11.71      |  ep.A    #
#  4        |  MAIN__        |  Outermost  |  0.00 (1)       |  0.02      |  0.00       |  ep.A    #
####################################################################################################
Info: The CSV file /tmp/ftalbart_20140721_112924_570906827_local/ftalbart_20140721_112924_570906827/RESULTS/run_5_maqao_output_14531.csv has been generated

[MAQAO] PROCESSOR DETECTED : NEHALEM/WESTMERE
[MAQAO] DUMPING DATA
[MAQAO] DUMPING DATA DONE


Run number 7..

 /tmp/ftalbart_20140721_112924_570906827_local/ftalbart_20140721_112924_570906827/TOOL/tmp.K0XGIoNSqa/maqao/maqao perf -g=medium xp=./tmps31W4Y t=SX -bkd=on  -- /tmp/ftalbart_20140721_112924_570906827_local/ftalbart_20140721_112924_570906827/APP/ep.A
/tmp/ftalbart_20140721_112924_570906827_local/ftalbart_20140721_112924_570906827/TOOL/tmp.K0XGIoNSqa/maqao/maqao perf xp=./tmps31W4Y d=SLX ssv=on --output-format=csv --output-path=/tmp/ftalbart_20140721_112924_570906827_local/ftalbart_20140721_112924_570906827/RESULTS/run_6_maqao_output
Output of Maqao perf:


 NAS Parallel Benchmarks 2.3-serial version - EP Benchmark

 Number of random numbers generated:    536870912  
EP Benchmark Results:

CPU Time =   23.2287
N = 2^   28
No. Gaussian Pairs =     210832767.
Sums =    -4.295875165629885D+03   -1.580732573678432D+04
Counts:
  0      98257395.
  1      93827014.
  2      17611549.
  3       1110028.
  4         26536.
  5           245.
  6             0.
  7             0.
  8             0.
  9             0.


 EP Benchmark Completed.
 Class           =                        A
 Size            =                536870912  
 Iterations      =                        0
 Time in seconds =                    23.23
 Mop/s total     =                    23.11
 Operation type  = Random numbers generated
 Verification    =               SUCCESSFUL
 Version         =                      2.3
 Compile date    =              03 Jul 2014

 Compile options:
    F77          = gfortran
    FLINK        = gfortran
    F_LIB        = (none)
    F_INC        = (none)
    FFLAGS       = -O3
    FLINKFLAGS   = (none)
    RAND         = randi8


 Please send the results of this run to:

 NPB Development Team 
 Internet: npb@nas.nasa.gov
 
 If email is not available, send this to:

 MS T27A-1
 NASA Ames Research Center
 Moffett Field, CA  94035-1000

 Fax: 415-604-3957


Info: [MAQAO] Bypass kernel detection !
[MAQAO] GENERATION OF METAFILE
[MAQAO] GENERATION OF METAFILE DONE
[MAQAO] Your experiment path is ./tmps31W4Y
                                    MENDELSSOHN - PROCESS #14604
                                           Thread #14604
####################################################################################################
#  Loop ID  |  Source Infos  |    Level    |      Time %     |  Time (s)  |  CPI ratio  |  Module  #
####################################################################################################
#  3        |  MAIN__        |  Innermost  |  40.54 (11802)  |  236.04    |  36.34      |  ep.A    #
#  7        |  vranlc_       |  Single     |  4.15 (1208)    |  24.16     |  12.49      |  ep.A    #
#  4        |  MAIN__        |  Outermost  |  0.00 (1)       |  0.02      |  0.00       |  ep.A    #
#  1        |  MAIN__        |  Single     |  0.00 (1)       |  0.02      |  0.00       |  ep.A    #
####################################################################################################
Info: The CSV file /tmp/ftalbart_20140721_112924_570906827_local/ftalbart_20140721_112924_570906827/RESULTS/run_6_maqao_output_14605.csv has been generated

[MAQAO] PROCESSOR DETECTED : NEHALEM/WESTMERE
[MAQAO] DUMPING DATA
[MAQAO] DUMPING DATA DONE


Run number 8..

 /tmp/ftalbart_20140721_112924_570906827_local/ftalbart_20140721_112924_570906827/TOOL/tmp.K0XGIoNSqa/maqao/maqao perf -g=medium xp=./tmp7wkY6D t=SX -bkd=on  -- /tmp/ftalbart_20140721_112924_570906827_local/ftalbart_20140721_112924_570906827/APP/ep.A
/tmp/ftalbart_20140721_112924_570906827_local/ftalbart_20140721_112924_570906827/TOOL/tmp.K0XGIoNSqa/maqao/maqao perf xp=./tmp7wkY6D d=SLX ssv=on --output-format=csv --output-path=/tmp/ftalbart_20140721_112924_570906827_local/ftalbart_20140721_112924_570906827/RESULTS/run_7_maqao_output
Output of Maqao perf:


 NAS Parallel Benchmarks 2.3-serial version - EP Benchmark

 Number of random numbers generated:    536870912  
EP Benchmark Results:

CPU Time =   22.9783
N = 2^   28
No. Gaussian Pairs =     210832767.
Sums =    -4.295875165629885D+03   -1.580732573678432D+04
Counts:
  0      98257395.
  1      93827014.
  2      17611549.
  3       1110028.
  4         26536.
  5           245.
  6             0.
  7             0.
  8             0.
  9             0.


 EP Benchmark Completed.
 Class           =                        A
 Size            =                536870912  
 Iterations      =                        0
 Time in seconds =                    22.98
 Mop/s total     =                    23.36
 Operation type  = Random numbers generated
 Verification    =               SUCCESSFUL
 Version         =                      2.3
 Compile date    =              03 Jul 2014

 Compile options:
    F77          = gfortran
    FLINK        = gfortran
    F_LIB        = (none)
    F_INC        = (none)
    FFLAGS       = -O3
    FLINKFLAGS   = (none)
    RAND         = randi8


 Please send the results of this run to:

 NPB Development Team 
 Internet: npb@nas.nasa.gov
 
 If email is not available, send this to:

 MS T27A-1
 NASA Ames Research Center
 Moffett Field, CA  94035-1000

 Fax: 415-604-3957


Info: [MAQAO] Bypass kernel detection !
[MAQAO] GENERATION OF METAFILE
[MAQAO] GENERATION OF METAFILE DONE
[MAQAO] Your experiment path is ./tmp7wkY6D
                                    MENDELSSOHN - PROCESS #14705
                                           Thread #14705
####################################################################################################
#  Loop ID  |  Source Infos  |    Level    |      Time %     |  Time (s)  |  CPI ratio  |  Module  #
####################################################################################################
#  3        |  MAIN__        |  Innermost  |  40.71 (11743)  |  234.86    |  36.33      |  ep.A    #
#  7        |  vranlc_       |  Single     |  3.82 (1101)    |  22.02     |  11.44      |  ep.A    #
#  4        |  MAIN__        |  Outermost  |  0.00 (1)       |  0.02      |  0.00       |  ep.A    #
#  1        |  MAIN__        |  Single     |  0.00 (1)       |  0.02      |  0.00       |  ep.A    #
####################################################################################################
Info: The CSV file /tmp/ftalbart_20140721_112924_570906827_local/ftalbart_20140721_112924_570906827/RESULTS/run_7_maqao_output_14706.csv has been generated

[MAQAO] PROCESSOR DETECTED : NEHALEM/WESTMERE
[MAQAO] DUMPING DATA
[MAQAO] DUMPING DATA DONE


Run number 9..

 /tmp/ftalbart_20140721_112924_570906827_local/ftalbart_20140721_112924_570906827/TOOL/tmp.K0XGIoNSqa/maqao/maqao perf -g=medium xp=./tmpIjfgkI t=SX -bkd=on  -- /tmp/ftalbart_20140721_112924_570906827_local/ftalbart_20140721_112924_570906827/APP/ep.A
/tmp/ftalbart_20140721_112924_570906827_local/ftalbart_20140721_112924_570906827/TOOL/tmp.K0XGIoNSqa/maqao/maqao perf xp=./tmpIjfgkI d=SLX ssv=on --output-format=csv --output-path=/tmp/ftalbart_20140721_112924_570906827_local/ftalbart_20140721_112924_570906827/RESULTS/run_8_maqao_output
Output of Maqao perf:


 NAS Parallel Benchmarks 2.3-serial version - EP Benchmark

 Number of random numbers generated:    536870912  
EP Benchmark Results:

CPU Time =   22.6742
N = 2^   28
No. Gaussian Pairs =     210832767.
Sums =    -4.295875165629885D+03   -1.580732573678432D+04
Counts:
  0      98257395.
  1      93827014.
  2      17611549.
  3       1110028.
  4         26536.
  5           245.
  6             0.
  7             0.
  8             0.
  9             0.


 EP Benchmark Completed.
 Class           =                        A
 Size            =                536870912  
 Iterations      =                        0
 Time in seconds =                    22.67
 Mop/s total     =                    23.68
 Operation type  = Random numbers generated
 Verification    =               SUCCESSFUL
 Version         =                      2.3
 Compile date    =              03 Jul 2014

 Compile options:
    F77          = gfortran
    FLINK        = gfortran
    F_LIB        = (none)
    F_INC        = (none)
    FFLAGS       = -O3
    FLINKFLAGS   = (none)
    RAND         = randi8


 Please send the results of this run to:

 NPB Development Team 
 Internet: npb@nas.nasa.gov
 
 If email is not available, send this to:

 MS T27A-1
 NASA Ames Research Center
 Moffett Field, CA  94035-1000

 Fax: 415-604-3957


Info: [MAQAO] Bypass kernel detection !
[MAQAO] GENERATION OF METAFILE
[MAQAO] GENERATION OF METAFILE DONE
[MAQAO] Your experiment path is ./tmpIjfgkI
                                    MENDELSSOHN - PROCESS #14752
                                           Thread #14753
####################################################################################################
#  Loop ID  |  Source Infos  |    Level    |      Time %     |  Time (s)  |  CPI ratio  |  Module  #
####################################################################################################
#  3        |  MAIN__        |  Innermost  |  41.53 (11829)  |  236.58    |  36.23      |  ep.A    #
#  7        |  vranlc_       |  Single     |  3.93 (1120)    |  22.40     |  11.58      |  ep.A    #
#  4        |  MAIN__        |  Outermost  |  0.01 (2)       |  0.04      |  0.00       |  ep.A    #
#  1        |  MAIN__        |  Single     |  0.00 (1)       |  0.02      |  0.00       |  ep.A    #
####################################################################################################
Info: The CSV file /tmp/ftalbart_20140721_112924_570906827_local/ftalbart_20140721_112924_570906827/RESULTS/run_8_maqao_output_14753.csv has been generated

[MAQAO] PROCESSOR DETECTED : NEHALEM/WESTMERE
[MAQAO] DUMPING DATA
[MAQAO] DUMPING DATA DONE


Run number 10..

 /tmp/ftalbart_20140721_112924_570906827_local/ftalbart_20140721_112924_570906827/TOOL/tmp.K0XGIoNSqa/maqao/maqao perf -g=medium xp=./tmprVaw11 t=SX -bkd=on  -- /tmp/ftalbart_20140721_112924_570906827_local/ftalbart_20140721_112924_570906827/APP/ep.A
/tmp/ftalbart_20140721_112924_570906827_local/ftalbart_20140721_112924_570906827/TOOL/tmp.K0XGIoNSqa/maqao/maqao perf xp=./tmprVaw11 d=SLX ssv=on --output-format=csv --output-path=/tmp/ftalbart_20140721_112924_570906827_local/ftalbart_20140721_112924_570906827/RESULTS/run_9_maqao_output
Output of Maqao perf:


 NAS Parallel Benchmarks 2.3-serial version - EP Benchmark

 Number of random numbers generated:    536870912  
EP Benchmark Results:

CPU Time =   22.8407
N = 2^   28
No. Gaussian Pairs =     210832767.
Sums =    -4.295875165629885D+03   -1.580732573678432D+04
Counts:
  0      98257395.
  1      93827014.
  2      17611549.
  3       1110028.
  4         26536.
  5           245.
  6             0.
  7             0.
  8             0.
  9             0.


 EP Benchmark Completed.
 Class           =                        A
 Size            =                536870912  
 Iterations      =                        0
 Time in seconds =                    22.84
 Mop/s total     =                    23.50
 Operation type  = Random numbers generated
 Verification    =               SUCCESSFUL
 Version         =                      2.3
 Compile date    =              03 Jul 2014

 Compile options:
    F77          = gfortran
    FLINK        = gfortran
    F_LIB        = (none)
    F_INC        = (none)
    FFLAGS       = -O3
    FLINKFLAGS   = (none)
    RAND         = randi8


 Please send the results of this run to:

 NPB Development Team 
 Internet: npb@nas.nasa.gov
 
 If email is not available, send this to:

 MS T27A-1
 NASA Ames Research Center
 Moffett Field, CA  94035-1000

 Fax: 415-604-3957


Info: [MAQAO] Bypass kernel detection !
[MAQAO] GENERATION OF METAFILE
[MAQAO] GENERATION OF METAFILE DONE
[MAQAO] Your experiment path is ./tmprVaw11
                                    MENDELSSOHN - PROCESS #14793
                                           Thread #14793
####################################################################################################
#  Loop ID  |  Source Infos  |    Level    |      Time %     |  Time (s)  |  CPI ratio  |  Module  #
####################################################################################################
#  3        |  MAIN__        |  Innermost  |  40.86 (11719)  |  234.38    |  35.94      |  ep.A    #
#  7        |  vranlc_       |  Single     |  3.97 (1140)    |  22.80     |  11.83      |  ep.A    #
#  1        |  MAIN__        |  Single     |  0.00 (1)       |  0.02      |  0.00       |  ep.A    #
####################################################################################################
Info: The CSV file /tmp/ftalbart_20140721_112924_570906827_local/ftalbart_20140721_112924_570906827/RESULTS/run_9_maqao_output_14794.csv has been generated

[MAQAO] PROCESSOR DETECTED : NEHALEM/WESTMERE
[MAQAO] DUMPING DATA
[MAQAO] DUMPING DATA DONE



End of Maqao execution.
