{
    "init": {
        "attributes": {
            "name": "init"
        }, 
        "params": [
            {
                "name": "username", 
                "value": "admin"
            }, 
            {
                "name": "password", 
                "value": "21232f297a57a5a743894a0e4a801fc3"
            },
            {
                "name": "full_name", 
                "value": "Administrator"
            }, 
            {
                "name": "company_name", 
                "value": null
            }, 
            {
                "name": "email", 
                "value": "cti@list.exascale-computing.eu"
            }, 
            {
                "name": "web_page", 
                "value": null
            }, 
            {
                "name": "phone", 
                "value": null
            }, 
            {
                "name": "fax", 
                "value": null
            }
        ]
    }
}
