{
    "init": {
        "attributes": {
            "name": "init", 
            "repository": "local"
        }, 
        "params": [
            {
                "name": "my_param_1", 
                "value": ""
            }, 
            {
                "name": "my_param_2", 
                "value": ""
            }, 
            {
                "name": "my_param_3", 
                "value": ""
            }, 
            {
                "name": "my_param_4", 
                "value": ""
            }
        ]
    }
}
