{
    "init": {
        "attributes": {
            "name": "init"
        }, 
        "params": [
            {
                "name": "compiler_name", 
                "value": "icc"
            }, 
            {
                "name": "version", 
                "value": "1.0"
            }, 
            {
                "name": "vendor", 
                "value": []
            }, 
            {
                "name": "compiler_script", 
                "value": ""
            }, 
            {
                "name": "format", 
                "value": "txt"
            }
        ]
    }
}
