{
    "init": {
        "attributes": {
            "name": "init"
        }, 
        "params": [
            {
                "name": "vendor", 
                "value": null
            }, 
            {
                "name": "codename", 
                "value": null
            }, 
            {
                "name": "model", 
                "value": null
            }, 
            {
                "name": "family", 
                "value": null
            }, 
            {
                "name": "external_model", 
                "value": null
            }, 
            {
                "name": "external_family", 
                "value": null
            }, 
            {
                "name": "revision", 
                "value": null
            }, 
            {
                "name": "number_of_cores", 
                "value": null
            }, 
            {
                "name": "number_of_threads", 
                "value": null
            }, 
            {
                "name": "core_frequency", 
                "value": null
            }, 
            {
                "name": "bus_frequency", 
                "value": null
            }, 
            {
                "name": "fsb_speed", 
                "value": null
            }, 
            {
                "name": "core_frequency_multiplier", 
                "value": null
            },
            {
                "name": "instructions", 
                "value": null
            }, 
            {
                "name": "core_vid", 
                "value": null
            }, 
            {
                "name": "package", 
                "value": null
            }, 
            {
                "name": "specification", 
                "value": null
            }, 
            {
                "name": "stepping", 
                "value": null
            }, 
            {
                "name": "technology", 
                "value": null
            }, 
            {
                "name": "reference", 
                "value": null
            }, 
            {
                "name": "micro_architecture", 
                "value": "NEHALEM"
            }, 
            {
                "name": "platform", 
                "value": null
            }, 
            {
                "name": "format", 
                "value": "json"
            }
        ]
    }
}
