Loop ID,Source Infos,Level,Time %,Time (s),CPI ratio,
4,MAIN__ - -1,-1@-1,Innermost,58.31 (10708),334.62,55.83,
8,vranlc_ - -1,-1@-1,Single,15.01 (2756),86.12,47.01,
1137,log - -1,-1@-1,Single,1.35 (248),7.75,128.00,
5,MAIN__ - -1,-1@-1,Outermost,0.01 (2),0.06,0.00,
