{
    "init": {
        "attributes": {
            "name": "init"
        }, 
        "params": [
            {
                "name": "maqao_cqa_group", 
                "value": "3af0e57e-26e6-11e4-a427-ef3f4d044c7e"
            }, 
            {
                "name": "loop", 
                "value": "4ae4b53a-2c38-11e4-947b-83c83f3e324e"
            }, 
            {
                "name": "maqao_cqa_results_csv", 
                "value": []
            }, 
            {
                "name": "matrix_loop_results", 
                "value": {
                    "x86_64_Nb_insn_SQRTSD": [
                        null
                    ], 
                    "common_Size_(bytes)": [
                        null
                    ], 
                    "k1om_Nb_insn_other": [
                        null
                    ], 
                    "common_Vec_ratio_(%)_add_sub": [
                        null
                    ], 
                    "x86_64_Nb_128_bits_loads": [
                        null
                    ], 
                    "common_decode_(cycles)": [
                        null
                    ], 
                    "x86_64_Nb_insn_SQRTSS": [
                        0
                    ], 
                    "common_(L1_optimistic)_Bytes_prefetched_/_cycle": [
                        0.0
                    ], 
                    "common_Bytes_prefetched": [
                        0
                    ], 
                    "x86_64_Nb_insn_DIVSS": [
                        0
                    ], 
                    "x86_64_Nb_64_bits_loads": [
                        5
                    ], 
                    "common_Vec_eff_ratio_(%)_add_sub_(FP)": [
                        50.0
                    ], 
                    "x86_64_Nb_insn_SQRTPD_XMM": [
                        0
                    ], 
                    "x86_64_(L1_optimistic)_Nb_cycles_if_only_FP_arith": [
                        5.0
                    ], 
                    "x86_64_Nb_insn_MULSS": [
                        0
                    ], 
                    "common_Vec_eff_ratio_(%)_other_(INT)": [
                        null
                    ], 
                    "x86_64_Nb_insn_MULPD_YMM": [
                        0
                    ], 
                    "x86_64_Nb_64_bits_stores": [
                        0
                    ], 
                    "x86_64_Nb_insn_DIVSD": [
                        0
                    ], 
                    "common_Can_be_analyzed": [
                        null
                    ], 
                    "common_Nb_FLOP_sqrt": [
                        0
                    ], 
                    "x86_64_Nb_insn_MULSD": [
                        2
                    ], 
                    "common_Vec_ratio_(%)_all": [
                        15.3846153846
                    ], 
                    "common_Nb_impl_loads": [
                        2
                    ], 
                    "x86_64_Nb_cycles_P4": [
                        0.0
                    ], 
                    "x86_64_Nb_cycles_P5": [
                        4.0
                    ], 
                    "common_Bytes_loaded": [
                        40
                    ], 
                    "x86_64_Nb_cycles_P7": [
                        0.0
                    ], 
                    "x86_64_Nb_cycles_P0": [
                        4.0
                    ], 
                    "x86_64_Nb_cycles_P1": [
                        6.0
                    ], 
                    "x86_64_Nb_cycles_P2": [
                        5.0
                    ], 
                    "x86_64_Nb_cycles_P3": [
                        0.0
                    ], 
                    "x86_64_(L1_optimistic)_Nb_cycles_if_only_FP": [
                        null
                    ], 
                    "x86_64_(L1)_Nb_cycles_if_clean": [
                        null
                    ], 
                    "common_Vec_eff_ratio_(%)_store_(FP)": [
                        null
                    ], 
                    "x86_64_(L1_optimistic)_Nb_cycles_if_FP_arith_vectorized": [
                        5.1470588235300001
                    ], 
                    "x86_64_Nb_used_YMM_reg": [
                        0
                    ], 
                    "x86_64_Fit_in_cache": [
                        "No"
                    ], 
                    "common_Arith_intensity_(FLOP_/_ld+st_bytes)": [
                        0.17499999999999999
                    ], 
                    "common_Nb_FLOP_mul": [
                        2
                    ], 
                    "common_Front_end_(cycles)": [
                        7.0
                    ], 
                    "x86_64_Nb_insn_DIVPS_YMM": [
                        0
                    ], 
                    "x86_64_Nb_insn_SD": [
                        56937325038779910
                    ], 
                    "common_Vec_ratio_(%)_add_sub_(INT)": [
                        null
                    ], 
                    "k1om_Nb_insn_msk": [
                        null
                    ], 
                    "common_Vec_eff_ratio_(%)_mul_(INT)": [
                        null
                    ], 
                    "common_(L1_optimistic)_FLOP/cycle": [
                        1.0
                    ], 
                    "x86_64_Nb_128_bits_stores": [
                        0
                    ], 
                    "x86_64_Nb_insn_ADD/SUBPS_XMM": [
                        0
                    ], 
                    "x86_64_Nb_insn_SS": [
                        0
                    ], 
                    "common_Vec_eff_ratio_(%)_all_(INT)": [
                        null
                    ], 
                    "x86_64_Nb_32_bits_stores": [
                        0
                    ], 
                    "x86_64_instr_fetch_(cycles)": [
                        7.0
                    ], 
                    "common_Vec_ratio_(%)_load": [
                        0.0
                    ], 
                    "common_Vec_ratio_(%)_mul": [
                        0.0
                    ], 
                    "x86_64_instr_queue_(cycles)": [
                        5.0
                    ], 
                    "x86_64_Nb_used_MMX_reg": [
                        0
                    ], 
                    "common_Vec_ratio_(%)_load_(INT)": [
                        null
                    ], 
                    "common_Vec_eff_ratio_(%)_add_sub": [
                        50.0
                    ], 
                    "x86_64_Nb_insn_SQRTPD_YMM": [
                        0
                    ], 
                    "common_(L1)_Bytes_ld+st_/_cycle": [
                        5.7142857142899999
                    ], 
                    "common_Vec_eff_ratio_(%)_mul": [
                        50.0
                    ], 
                    "common_Vec_ratio_(%)_store_(FP)": [
                        null
                    ], 
                    "common_Bytes_stored": [
                        0
                    ], 
                    "x86_64_Nb_256_bits_stores": [
                        0
                    ], 
                    "x86_64_Nb_insn_MULPD_XMM": [
                        0
                    ], 
                    "common_Vec_eff_ratio_(%)_all": [
                        57.692307692299998
                    ], 
                    "common_(L1)_IPC": [
                        409449988714.86865
                    ], 
                    "common_Vec_ratio_(%)_add_sub_(FP)": [
                        0.0
                    ], 
                    "common_Vec_ratio_(%)_store": [
                        null
                    ], 
                    "common_Nb_FLOP_add_sub": [
                        5
                    ], 
                    "common_Address_in_the_binary": [
                        "400f0c"
                    ], 
                    "x86_64_Nb_insn_MULPS_YMM": [
                        0
                    ], 
                    "common_Function_name": [
                        "MAIN__"
                    ], 
                    "x86_64_Nb_insn_ADD/SUBPD_XMM": [
                        0
                    ], 
                    "common_Nb_FLOP_div": [
                        78220573248001566
                    ], 
                    "common_Nb_FLOP_other": [
                        0
                    ], 
                    "x86_64_ROB_read_(cycles)": [
                        2.0
                    ], 
                    "x86_64_Nb_insn_MULPS_XMM": [
                        0
                    ], 
                    "x86_64_Macro_fusion": [
                        null
                    ], 
                    "x86_64_Nb_32_bits_loads": [
                        0
                    ], 
                    "common_(L1)_FLOP/cycle": [
                        1.0
                    ], 
                    "k1om_Nb_FLOP_fma": [
                        null
                    ], 
                    "x86_64_Nb_insn_PD_YMM": [
                        0
                    ], 
                    "common_Vec_ratio_(%)_store_(INT)": [
                        null
                    ], 
                    "common_Vec_eff_ratio_(%)_other_(FP)": [
                        83.333333333300004
                    ], 
                    "k1om_Nb_insn_PD": [
                        null
                    ], 
                    "common_(L1_optimistic)_Nb_cycles": [
                        7.0
                    ], 
                    "common_Vec_ratio_(%)_other": [
                        739622530053.85059
                    ], 
                    "common_Pattern": [
                        "PD-XMM,SD,x86"
                    ], 
                    "x86_64_(L1)_Nb_cycles_if_nomem_vectorized": [
                        5.0
                    ], 
                    "common_Vec_ratio_(%)_load_(FP)": [
                        0.0
                    ], 
                    "k1om_Nb_insn_PS": [
                        null
                    ], 
                    "common_(L1_optimistic)_Bytes_loaded_/_cycle": [
                        5.7142857142899999
                    ], 
                    "common_port_balancing": [
                        "Unknown"
                    ], 
                    "common_Vec_eff_ratio_(%)_other": [
                        83.333333333300004
                    ], 
                    "common_(L1)_Bytes_prefetched_/_cycle": [
                        0.0
                    ], 
                    "x86_64_uop_queue_(cycles)": [
                        5.0
                    ], 
                    "x86_64_(L1_optimistic)_Nb_cycles_if_fully_vectorized": [
                        3.5
                    ], 
                    "x86_64_Dispatch_(cycles)": [
                        6.0
                    ], 
                    "common_(L1_optimistic)_Bytes_stored_/_cycle": [
                        0.0
                    ], 
                    "x86_64_Nb_uops": [
                        17
                    ], 
                    "common_Extra_unroll_factor": [
                        null
                    ], 
                    "x86_64_Nb_uops_P4": [
                        0.0
                    ], 
                    "x86_64_Nb_uops_P5": [
                        4.0
                    ], 
                    "x86_64_Nb_uops_P6": [
                        0.0
                    ], 
                    "x86_64_Nb_uops_P7": [
                        0.0
                    ], 
                    "common_Nb_paths": [
                        4
                    ], 
                    "x86_64_Nb_uops_P1": [
                        7467491794429.5361
                    ], 
                    "x86_64_Nb_uops_P2": [
                        5.0
                    ], 
                    "x86_64_Nb_uops_P3": [
                        0.0
                    ], 
                    "common_Nb_used_x86_reg": [
                        1
                    ], 
                    "x86_64_Nb_used_XMM_reg": [
                        4
                    ], 
                    "x86_64_Nb_insn_ADD/SUBPD_YMM": [
                        0
                    ], 
                    "x86_64_Nb_insn_PS_XMM": [
                        0
                    ], 
                    "common_Vec_ratio_(%)_mul_(FP)": [
                        8683667967553051.0
                    ], 
                    "common_ID": [
                        3
                    ], 
                    "common_Arith_intensity_extra_info": [
                        null
                    ], 
                    "x86_64_Nb_insn_SQRTPS_YMM": [
                        0
                    ], 
                    "common_Vec_eff_ratio_(%)_load": [
                        50.0
                    ], 
                    "common_Vec_ratio_(%)_other_(INT)": [
                        null
                    ], 
                    "common_Vec_ratio_(%)_mul_(INT)": [
                        null
                    ], 
                    "x86_64_Nb_MOVH/LPS/D_loads": [
                        0
                    ], 
                    "k1om_Nb_insn_x87": [
                        null
                    ], 
                    "k1om_Nb_insn_x86": [
                        null
                    ], 
                    "common_Vec_eff_ratio_(%)_load_(INT)": [
                        null
                    ], 
                    "common_Vec_eff_ratio_(%)_all_(FP)": [
                        57.692307692299998
                    ], 
                    "x86_64_(L1_optimistic)_Nb_cycles_if_clean": [
                        null
                    ], 
                    "common_(L1)_Bytes_loaded_/_cycle": [
                        5.7142857142899999
                    ], 
                    "common_is_multiple_path": [
                        null
                    ], 
                    "k1om_Nb_insn_INTD": [
                        null
                    ], 
                    "x86_64_Nb_uops_P0": [
                        4.0
                    ], 
                    "common_Source_lines": [
                        "-1--1"
                    ], 
                    "x86_64_Nb_cycles_P6": [
                        0.0
                    ], 
                    "common_Source_file": [
                        "-1"
                    ], 
                    "x86_64_Nb_insn_SQRTPS_XMM": [
                        0
                    ], 
                    "k1om_Nb_insn_INTQ": [
                        null
                    ], 
                    "common_Vec_eff_ratio_(%)_load_(FP)": [
                        50.0
                    ], 
                    "common_Nb_instr": [
                        17
                    ], 
                    "x86_64_Nb_MOVH/LPS/D_stores": [
                        0
                    ], 
                    "common_(L1_optimistic)_IPC": [
                        2.4285714285700002
                    ], 
                    "x86_64_Nb_insn_DIVPD_YMM": [
                        0
                    ], 
                    "x86_64_RecMII_(cycles)": [
                        3619918496746805
                    ], 
                    "x86_64_predecode_(cycles)": [
                        7.0
                    ], 
                    "common_Vec_ratio_(%)_all_(INT)": [
                        null
                    ], 
                    "x86_64_Nb_insn_PD_XMM": [
                        2
                    ], 
                    "common_Vec_eff_ratio_(%)_store_(INT)": [
                        null
                    ], 
                    "common_(L1_optimistic)_Bytes_ld+st_/_cycle": [
                        5.7142857142899999
                    ], 
                    "common_(L1)_Bytes_stored_/_cycle": [
                        2670686362440457.5
                    ], 
                    "common_Unroll_info_(src_loop)": [
                        "NA (not in a source loop)"
                    ], 
                    "x86_64_Nb_256_bits_loads": [
                        0
                    ], 
                    "k1om_Nb_used_ZMM_reg": [
                        null
                    ], 
                    "x86_64_(L1_optimistic)_Nb_cycles_if_nomem_vectorized": [
                        5.0
                    ], 
                    "x86_64_(L1)_Nb_cycles_if_FP_arith_vectorized": [
                        5.1470588235300001
                    ], 
                    "x86_64_Nb_insn_ADD/SUBSS": [
                        0
                    ], 
                    "x86_64_Nb_insn_ADD/SUBPS_YMM": [
                        0
                    ], 
                    "common_Vec_eff_ratio_(%)_store": [
                        null
                    ], 
                    "x86_64_(L1)_Nb_cycles_if_only_FP": [
                        null
                    ], 
                    "x86_64_Ratio_ADD_SUB_/_MUL": [
                        67302042867124832.0
                    ], 
                    "x86_64_Nb_insn_ADD/SUBSD": [
                        5
                    ], 
                    "common_Nb_stores": [
                        0
                    ], 
                    "x86_64_Nb_insn_PS_YMM": [
                        0
                    ], 
                    "common_(L1)_Nb_cycles": [
                        7.0
                    ], 
                    "x86_64_(L1)_Nb_cycles_if_fully_vectorized": [
                        3.5
                    ], 
                    "common_Vec_eff_ratio_(%)_mul_(FP)": [
                        50.0
                    ], 
                    "x86_64_Nb_insn_DIVPS_XMM": [
                        0
                    ], 
                    "x86_64_(L1)_Nb_cycles_if_only_FP_arith": [
                        5.0
                    ], 
                    "common_Nb_stack_ref": [
                        0
                    ], 
                    "common_Vec_eff_ratio_(%)_add_sub_(INT)": [
                        null
                    ], 
                    "common_Nb_pure_loads": [
                        3
                    ], 
                    "common_Unroll_confidence_level_(src_loop)": [
                        null
                    ], 
                    "x86_64_Nb_insn_DIVPD_XMM": [
                        0
                    ], 
                    "common_Vec_ratio_(%)_other_(FP)": [
                        849461744096511.38
                    ], 
                    "common_Vec_ratio_(%)_all_(FP)": [
                        15.3846153846
                    ]
                }
            }
        ]
    }
}