plugin_uid = 1bae6e90-e31d-4dd1-be06-b6ab5f661046
date_time_start = 2012/04/24 15:47:27
user_uid = f1452ea1-c8a5-4724-9463-4987f1f85d05
date_time_end = 2012/04/24 15:47:27
plugin_exit_code = 0
alias = azertyuiop