{
    "repository": {
        "attributes": {
            "produce_data": false, 
            "name": "repository", 
            "desc": "Remove a local repository.",
            "long_desc": "Removes the specified local repository. If the full path is not set, it tries to remove the current repository if the current directory is one."
        }, 
        "params": [
            {
                "type": "REPOSITORY_UID", 
                "name": "repository", 
                "desc": "The repository UID",
                "long_desc": "The UID or Alias of the local repository to remove.",
                "optional": true
            }, 
            {
                "type": "BOOLEAN", 
                "name": "force", 
                "desc": "Force",
                "long_desc": "False: Ask the user to confirm the suppression. True: force suppression without asking any question.",
                "value": false,
                "optional": true
            },
            {
                "type": "BOOLEAN", 
                "name": "rm_files", 
                "desc": "Remove the files from the hard drive ?",
                "value": false,
                "long_desc": "True: Remove the files from the hard-drive. False: Do not.",
                "optional": true
            },
            {
                "type": "BOOLEAN", 
                "name": "remove_dependencies", 
                "desc": "Remove dependencies",
                "long_desc": "False: remove the repository without checking the entries dependencies(faster but the repository must be independent). True: force the dependencies removal. Safer but slower",
                "value": false,
                "optional": true
            },
            {
                "type": "TEXT", 
                "name": "format", 
                "value": "txt", 
                "desc": "Format", 
                "long_desc": "The format of the output. 'txt' will display the output in a human readable manner. 'json' will output a JSON string containing the same Information.",
                "optional": true
            }
        ]
    },
    "entry": {
        "attributes": {
            "produce_data": false, 
            "name": "entry", 
            "desc": "Remove an entry",
            "long_desc": "Removes the specified entry. "
        }, 
        "params": [
            {
                "type": "TEXT", 
                "name": "entry", 
                "desc": "The entry UID",
                "long_desc": "The UID or Alias of the entry to remove."
            }, 
            {
                "type": "BOOLEAN", 
                "name": "force", 
                "desc": "Force",
                "long_desc": "False: Ask the user to confirm the suppression. True: force suppression without asking any question.",
                "value": false,
                "optional": true
            },
            {
                "type": "TEXT", 
                "name": "format", 
                "value": "txt", 
                "desc": "Format", 
                "long_desc": "The format of the output. 'txt' will display the output in a human readable manner. 'json' will output a JSON string containing the same Information.",
                "optional": true
            }
        ]
    }
}
