Loop ID;Function Name;Sources Infos;Level;Time %;Time (s);CPI ratio;Module;
3;MAIN__;;Innermost;40.54 (11802);236.04;36.34;ep.A;
7;vranlc_;;Single;4.15 (1208);24.16;12.49;ep.A;
4;MAIN__;;Outermost;0.00 (1);0.02;0.00;ep.A;
1;MAIN__;;Single;0.00 (1);0.02;0.00;ep.A;
