INDEX VERSION 1.132+/home/franck/Formations/ATELIERS/la-pmn-java-avancé/.metadata/.plugins/org.eclipse.jdt.core
1691043711.index
2187308450.index
2541546132.index
194258434.index
1865797976.index
346820961.index
1154670019.index
2842060330.index
1754905875.index
1088224442.index
4257355461.index
2763668523.index
1692891801.index
965782843.index
2344843051.index
3286286895.index
1154246554.index
2690318596.index
332167145.index
1017589366.index
3461712545.index
745828363.index
1619700359.index
2165170999.index
4159064996.index
2582697290.index
473897686.index
736618109.index
