ISO-10303-21;
HEADER;
FILE_DESCRIPTION(('STEP AP214'),'1');
FILE_NAME('model4.step','2020-03-10T08:26:01',(''),(' '),'Spatial InterOp 3D',' ',' ');
FILE_SCHEMA(('automotive_design'));
ENDSEC;
DATA;
#1=PRODUCT_DEFINITION_CONTEXT('',#9,'design');
#2=APPLICATION_PROTOCOL_DEFINITION('INTERNATIONAL STANDARD','automotive_design',1994,#9);
#3=PRODUCT_CATEGORY_RELATIONSHIP('NONE','NONE',#10,#11);
#4=SHAPE_DEFINITION_REPRESENTATION(#12,#13);
#5= (GEOMETRIC_REPRESENTATION_CONTEXT(3)GLOBAL_UNCERTAINTY_ASSIGNED_CONTEXT((#16))GLOBAL_UNIT_ASSIGNED_CONTEXT((#18,#19,#20))REPRESENTATION_CONTEXT('NONE','WORKSPACE'));
#9=APPLICATION_CONTEXT(' ');
#10=PRODUCT_CATEGORY('part','NONE');
#11=PRODUCT_RELATED_PRODUCT_CATEGORY('detail',' ',(#22));
#12=PRODUCT_DEFINITION_SHAPE('NONE','NONE',#23);
#13=ADVANCED_BREP_SHAPE_REPRESENTATION('1',(#24,#25),#5);
#16=UNCERTAINTY_MEASURE_WITH_UNIT(LENGTH_MEASURE(1.0E-06),#18,'','');
#18= (CONVERSION_BASED_UNIT('MILLIMETRE',#28)LENGTH_UNIT()NAMED_UNIT(#31));
#19= (NAMED_UNIT(#33)PLANE_ANGLE_UNIT()SI_UNIT($,.RADIAN.));
#20= (NAMED_UNIT(#33)SOLID_ANGLE_UNIT()SI_UNIT($,.STERADIAN.));
#22=PRODUCT('1','1','PART-1-DESC',(#39));
#23=PRODUCT_DEFINITION('NONE','NONE',#40,#1);
#24=MANIFOLD_SOLID_BREP('1',#41);
#25=AXIS2_PLACEMENT_3D('',#42,#43,#44);
#28=LENGTH_MEASURE_WITH_UNIT(LENGTH_MEASURE(1.0),#45);
#31=DIMENSIONAL_EXPONENTS(1.0,0.0,0.0,0.0,0.0,0.0,0.0);
#33=DIMENSIONAL_EXPONENTS(0.0,0.0,0.0,0.0,0.0,0.0,0.0);
#39=PRODUCT_CONTEXT('',#9,'mechanical');
#40=PRODUCT_DEFINITION_FORMATION_WITH_SPECIFIED_SOURCE(' ','NONE',#22,.NOT_KNOWN.);
#41=CLOSED_SHELL('',(#46,#47,#48,#49,#50,#51,#52,#53,#54,#55));
#42=CARTESIAN_POINT('',(0.0,0.0,0.0));
#43=DIRECTION('',(0.0,0.0,1.0));
#44=DIRECTION('',(1.0,0.0,0.0));
#45= (NAMED_UNIT(#31)LENGTH_UNIT()SI_UNIT(.MILLI.,.METRE.));
#46=ADVANCED_FACE('',(#57),#58,.T.);
#47=ADVANCED_FACE('',(#59),#60,.T.);
#48=ADVANCED_FACE('',(#61,#62),#63,.T.);
#49=ADVANCED_FACE('',(#64,#65),#66,.T.);
#50=ADVANCED_FACE('',(#67),#68,.T.);
#51=ADVANCED_FACE('',(#69),#70,.T.);
#52=ADVANCED_FACE('',(#71),#72,.T.);
#53=ADVANCED_FACE('',(#73),#74,.T.);
#54=ADVANCED_FACE('',(#75),#76,.T.);
#55=ADVANCED_FACE('',(#77),#78,.T.);
#57=FACE_OUTER_BOUND('',#79,.T.);
#58=CYLINDRICAL_SURFACE('',#80,1.0);
#59=FACE_OUTER_BOUND('',#81,.T.);
#60=CYLINDRICAL_SURFACE('',#82,1.0);
#61=FACE_BOUND('',#83,.T.);
#62=FACE_OUTER_BOUND('',#84,.T.);
#63=CYLINDRICAL_SURFACE('',#85,2.5);
#64=FACE_OUTER_BOUND('',#86,.T.);
#65=FACE_BOUND('',#87,.T.);
#66=CYLINDRICAL_SURFACE('',#88,2.5);
#67=FACE_OUTER_BOUND('',#89,.T.);
#68=PLANE('',#90);
#69=FACE_OUTER_BOUND('',#91,.T.);
#70=PLANE('',#92);
#71=FACE_OUTER_BOUND('',#93,.T.);
#72=CYLINDRICAL_SURFACE('',#94,1.0);
#73=FACE_OUTER_BOUND('',#95,.T.);
#74=CYLINDRICAL_SURFACE('',#96,1.0);
#75=FACE_OUTER_BOUND('',#97,.T.);
#76=PLANE('',#98);
#77=FACE_OUTER_BOUND('',#99,.T.);
#78=PLANE('',#100);
#79=EDGE_LOOP('',(#101,#102,#103,#104));
#80=AXIS2_PLACEMENT_3D('',#105,#106,#107);
#81=EDGE_LOOP('',(#108,#109,#110,#111));
#82=AXIS2_PLACEMENT_3D('',#112,#113,#114);
#83=EDGE_LOOP('',(#115,#116));
#84=EDGE_LOOP('',(#117,#118,#119,#120));
#85=AXIS2_PLACEMENT_3D('',#121,#122,#123);
#86=EDGE_LOOP('',(#124,#125,#126,#127));
#87=EDGE_LOOP('',(#128,#129));
#88=AXIS2_PLACEMENT_3D('',#130,#131,#132);
#89=EDGE_LOOP('',(#133,#134));
#90=AXIS2_PLACEMENT_3D('',#135,#136,#137);
#91=EDGE_LOOP('',(#138,#139));
#92=AXIS2_PLACEMENT_3D('',#140,#141,#142);
#93=EDGE_LOOP('',(#143,#144,#145,#146));
#94=AXIS2_PLACEMENT_3D('',#147,#148,#149);
#95=EDGE_LOOP('',(#150,#151,#152,#153));
#96=AXIS2_PLACEMENT_3D('',#154,#155,#156);
#97=EDGE_LOOP('',(#157,#158));
#98=AXIS2_PLACEMENT_3D('',#159,#160,#161);
#99=EDGE_LOOP('',(#162,#163));
#100=AXIS2_PLACEMENT_3D('',#164,#165,#166);
#101=ORIENTED_EDGE('',*,*,#167,.F.);
#102=ORIENTED_EDGE('',*,*,#168,.F.);
#103=ORIENTED_EDGE('',*,*,#169,.T.);
#104=ORIENTED_EDGE('',*,*,#170,.T.);
#105=CARTESIAN_POINT('',(0.0,0.0,0.0));
#106=DIRECTION('',(0.0,-1.0,6.12323399573676E-17));
#107=DIRECTION('',(1.0,0.0,0.0));
#108=ORIENTED_EDGE('',*,*,#171,.F.);
#109=ORIENTED_EDGE('',*,*,#172,.T.);
#110=ORIENTED_EDGE('',*,*,#173,.T.);
#111=ORIENTED_EDGE('',*,*,#174,.F.);
#112=CARTESIAN_POINT('',(0.0,0.0,0.0));
#113=DIRECTION('',(0.0,-1.0,6.12323399573676E-17));
#114=DIRECTION('',(1.0,0.0,0.0));
#115=ORIENTED_EDGE('',*,*,#175,.F.);
#116=ORIENTED_EDGE('',*,*,#170,.F.);
#117=ORIENTED_EDGE('',*,*,#176,.F.);
#118=ORIENTED_EDGE('',*,*,#177,.F.);
#119=ORIENTED_EDGE('',*,*,#178,.T.);
#120=ORIENTED_EDGE('',*,*,#179,.F.);
#121=CARTESIAN_POINT('',(0.0,0.0,0.0));
#122=DIRECTION('',(0.0,0.0,1.0));
#123=DIRECTION('',(1.0,0.0,0.0));
#124=ORIENTED_EDGE('',*,*,#176,.T.);
#125=ORIENTED_EDGE('',*,*,#180,.F.);
#126=ORIENTED_EDGE('',*,*,#178,.F.);
#127=ORIENTED_EDGE('',*,*,#181,.F.);
#128=ORIENTED_EDGE('',*,*,#172,.F.);
#129=ORIENTED_EDGE('',*,*,#182,.F.);
#130=CARTESIAN_POINT('',(0.0,0.0,0.0));
#131=DIRECTION('',(0.0,0.0,1.0));
#132=DIRECTION('',(1.0,0.0,0.0));
#133=ORIENTED_EDGE('',*,*,#179,.T.);
#134=ORIENTED_EDGE('',*,*,#180,.T.);
#135=CARTESIAN_POINT('',(0.0,0.0,-5.0));
#136=DIRECTION('',(0.0,0.0,-1.0));
#137=DIRECTION('',(-1.0,0.0,0.0));
#138=ORIENTED_EDGE('',*,*,#181,.T.);
#139=ORIENTED_EDGE('',*,*,#177,.T.);
#140=CARTESIAN_POINT('',(0.0,0.0,5.0));
#141=DIRECTION('',(0.0,0.0,1.0));
#142=DIRECTION('',(1.0,0.0,0.0));
#143=ORIENTED_EDGE('',*,*,#171,.T.);
#144=ORIENTED_EDGE('',*,*,#183,.F.);
#145=ORIENTED_EDGE('',*,*,#173,.F.);
#146=ORIENTED_EDGE('',*,*,#182,.T.);
#147=CARTESIAN_POINT('',(0.0,0.0,0.0));
#148=DIRECTION('',(0.0,-1.0,6.12323399573676E-17));
#149=DIRECTION('',(1.0,0.0,0.0));
#150=ORIENTED_EDGE('',*,*,#167,.T.);
#151=ORIENTED_EDGE('',*,*,#175,.T.);
#152=ORIENTED_EDGE('',*,*,#169,.F.);
#153=ORIENTED_EDGE('',*,*,#184,.F.);
#154=CARTESIAN_POINT('',(0.0,0.0,0.0));
#155=DIRECTION('',(0.0,-1.0,6.12323399573676E-17));
#156=DIRECTION('',(1.0,0.0,0.0));
#157=ORIENTED_EDGE('',*,*,#174,.T.);
#158=ORIENTED_EDGE('',*,*,#183,.T.);
#159=CARTESIAN_POINT('',(0.0,4.0,-2.44929359829471E-16));
#160=DIRECTION('',(0.0,1.0,-6.12323399573676E-17));
#161=DIRECTION('',(-1.0,0.0,0.0));
#162=ORIENTED_EDGE('',*,*,#184,.T.);
#163=ORIENTED_EDGE('',*,*,#168,.T.);
#164=CARTESIAN_POINT('',(0.0,-4.0,2.44929359829471E-16));
#165=DIRECTION('',(0.0,-1.0,6.12323399573676E-17));
#166=DIRECTION('',(1.0,0.0,0.0));
#167=EDGE_CURVE('',#185,#186,#187,.T.);
#168=EDGE_CURVE('',#188,#185,#189,.T.);
#169=EDGE_CURVE('',#188,#190,#191,.T.);
#170=EDGE_CURVE('',#190,#186,#192,.T.);
#171=EDGE_CURVE('',#193,#194,#195,.T.);
#172=EDGE_CURVE('',#193,#196,#197,.T.);
#173=EDGE_CURVE('',#196,#198,#199,.T.);
#174=EDGE_CURVE('',#194,#198,#200,.T.);
#175=EDGE_CURVE('',#186,#190,#201,.T.);
#176=EDGE_CURVE('',#202,#203,#204,.T.);
#177=EDGE_CURVE('',#205,#202,#206,.T.);
#178=EDGE_CURVE('',#205,#207,#208,.T.);
#179=EDGE_CURVE('',#203,#207,#209,.T.);
#180=EDGE_CURVE('',#207,#203,#210,.T.);
#181=EDGE_CURVE('',#202,#205,#211,.T.);
#182=EDGE_CURVE('',#196,#193,#212,.T.);
#183=EDGE_CURVE('',#198,#194,#213,.T.);
#184=EDGE_CURVE('',#185,#188,#214,.T.);
#185=VERTEX_POINT('',#215);
#186=VERTEX_POINT('',#216);
#187=LINE('',#217,#218);
#188=VERTEX_POINT('',#219);
#189=CIRCLE('',#220,1.0);
#190=VERTEX_POINT('',#221);
#191=LINE('',#222,#223);
#192=B_SPLINE_CURVE_WITH_KNOTS('',3,(#224,#225,#226,#227,#228,#229,#230,#231,#232,#233,#234,#235,#236,#237,#238,#239,#240,#241),.UNSPECIFIED.,.F.,.F.,(4,2,2,2,2,2,2,2,4),(3.05091734220774,3.43247500746039,3.81403267271304,4.19520434301233,4.57637601331161,4.9575476836109,5.33871935391018,5.72027701916283,6.10183468441548),.UNSPECIFIED.);
#193=VERTEX_POINT('',#242);
#194=VERTEX_POINT('',#243);
#195=LINE('',#244,#245);
#196=VERTEX_POINT('',#246);
#197=B_SPLINE_CURVE_WITH_KNOTS('',3,(#247,#248,#249,#250,#251,#252,#253,#254,#255,#256,#257,#258,#259,#260,#261,#262,#263,#264),.UNSPECIFIED.,.F.,.F.,(4,2,2,2,2,2,2,2,4),(0.0,0.381557665252651,0.763115330505302,1.14428700080459,1.52545867110387,1.90663034140315,2.28780201170244,2.66935967695509,3.05091734220774),.UNSPECIFIED.);
#198=VERTEX_POINT('',#265);
#199=LINE('',#266,#267);
#200=CIRCLE('',#268,1.0);
#201=B_SPLINE_CURVE_WITH_KNOTS('',3,(#269,#270,#271,#272,#273,#274,#275,#276,#277,#278,#279,#280,#281,#282,#283,#284,#285,#286),.UNSPECIFIED.,.F.,.F.,(4,2,2,2,2,2,2,2,4),(0.0,0.381557665252651,0.763115330505303,1.14428700080459,1.52545867110387,1.90663034140316,2.28780201170244,2.66935967695509,3.05091734220774),.UNSPECIFIED.);
#202=VERTEX_POINT('',#287);
#203=VERTEX_POINT('',#288);
#204=LINE('',#289,#290);
#205=VERTEX_POINT('',#291);
#206=CIRCLE('',#292,2.5);
#207=VERTEX_POINT('',#293);
#208=LINE('',#294,#295);
#209=CIRCLE('',#296,2.5);
#210=CIRCLE('',#297,2.5);
#211=CIRCLE('',#298,2.5);
#212=B_SPLINE_CURVE_WITH_KNOTS('',3,(#299,#300,#301,#302,#303,#304,#305,#306,#307,#308,#309,#310,#311,#312,#313,#314,#315,#316),.UNSPECIFIED.,.F.,.F.,(4,2,2,2,2,2,2,2,4),(3.05091734220774,3.43247500746039,3.81403267271304,4.19520434301233,4.57637601331161,4.9575476836109,5.33871935391018,5.72027701916283,6.10183468441548),.UNSPECIFIED.);
#213=CIRCLE('',#317,1.0);
#214=CIRCLE('',#318,1.0);
#215=CARTESIAN_POINT('',(1.0,-4.0,2.44929359829471E-16));
#216=CARTESIAN_POINT('',(1.0,-2.29128784747792,1.40300916416953E-16));
#217=CARTESIAN_POINT('',(1.0,0.0,0.0));
#218=VECTOR('',#319,1.0);
#219=CARTESIAN_POINT('',(-1.0,-4.0,1.22464679914735E-16));
#220=AXIS2_PLACEMENT_3D('',#320,#321,#322);
#221=CARTESIAN_POINT('',(-1.0,-2.29128784747792,9.21848450979957E-17));
#222=CARTESIAN_POINT('',(-1.0,-7.49879891330929E-33,-1.22464679914735E-16));
#223=VECTOR('',#323,1.0);
#224=CARTESIAN_POINT('',(-1.0,-2.29128784747792,1.66533453693773E-16));
#225=CARTESIAN_POINT('',(-1.0,-2.29128784747792,-0.12718588841755));
#226=CARTESIAN_POINT('',(-0.974289100360326,-2.30299791689273,-0.261720299055929));
#227=CARTESIAN_POINT('',(-0.871832955570113,-2.34370342433966,-0.507586762271407));
#228=CARTESIAN_POINT('',(-0.795147225832852,-2.37195405089756,-0.619066336540242));
#229=CARTESIAN_POINT('',(-0.619155400842759,-2.42385120878518,-0.795058161530336));
#230=CARTESIAN_POINT('',(-0.507642115342557,-2.45108038279582,-0.871811436364328));
#231=CARTESIAN_POINT('',(-0.261644153847047,-2.48938504427037,-0.974319283827596));
#232=CARTESIAN_POINT('',(-0.127057223433095,-2.5,-1.0));
#233=CARTESIAN_POINT('',(0.127057223433095,-2.5,-1.0));
#234=CARTESIAN_POINT('',(0.261644153847047,-2.48938504427037,-0.974319283827596));
#235=CARTESIAN_POINT('',(0.507642115342557,-2.45108038279582,-0.871811436364328));
#236=CARTESIAN_POINT('',(0.619155400842759,-2.42385120878518,-0.795058161530336));
#237=CARTESIAN_POINT('',(0.795147225832852,-2.37195405089756,-0.619066336540242));
#238=CARTESIAN_POINT('',(0.871832955570113,-2.34370342433966,-0.507586762271407));
#239=CARTESIAN_POINT('',(0.974289100360326,-2.30299791689273,-0.261720299055929));
#240=CARTESIAN_POINT('',(1.0,-2.29128784747792,-0.12718588841755));
#241=CARTESIAN_POINT('',(1.0,-2.29128784747792,1.40300916416953E-16));
#242=CARTESIAN_POINT('',(1.0,2.29128784747792,-1.40300916416953E-16));
#243=CARTESIAN_POINT('',(1.0,4.0,-2.44929359829471E-16));
#244=CARTESIAN_POINT('',(1.0,0.0,0.0));
#245=VECTOR('',#324,1.0);
#246=CARTESIAN_POINT('',(-1.0,2.29128784747792,-2.14649525012731E-16));
#247=CARTESIAN_POINT('',(1.0,2.29128784747792,-1.40300916416953E-16));
#248=CARTESIAN_POINT('',(1.0,2.29128784747792,-0.127185888417551));
#249=CARTESIAN_POINT('',(0.974289100360326,2.30299791689273,-0.261720299055929));
#250=CARTESIAN_POINT('',(0.871832955570113,2.34370342433966,-0.507586762271408));
#251=CARTESIAN_POINT('',(0.795147225832852,2.37195405089756,-0.619066336540242));
#252=CARTESIAN_POINT('',(0.619155400842759,2.42385120878518,-0.795058161530336));
#253=CARTESIAN_POINT('',(0.507642115342558,2.45108038279582,-0.871811436364328));
#254=CARTESIAN_POINT('',(0.261644153847048,2.48938504427037,-0.974319283827596));
#255=CARTESIAN_POINT('',(0.127057223433095,2.5,-1.0));
#256=CARTESIAN_POINT('',(-0.127057223433095,2.5,-1.0));
#257=CARTESIAN_POINT('',(-0.261644153847047,2.48938504427037,-0.974319283827596));
#258=CARTESIAN_POINT('',(-0.507642115342558,2.45108038279582,-0.871811436364328));
#259=CARTESIAN_POINT('',(-0.619155400842759,2.42385120878518,-0.795058161530336));
#260=CARTESIAN_POINT('',(-0.795147225832852,2.37195405089756,-0.619066336540242));
#261=CARTESIAN_POINT('',(-0.871832955570113,2.34370342433966,-0.507586762271408));
#262=CARTESIAN_POINT('',(-0.974289100360326,2.30299791689273,-0.261720299055929));
#263=CARTESIAN_POINT('',(-1.0,2.29128784747792,-0.127185888417551));
#264=CARTESIAN_POINT('',(-1.0,2.29128784747792,-2.14649525012731E-16));
#265=CARTESIAN_POINT('',(-1.0,4.0,-3.67394039744206E-16));
#266=CARTESIAN_POINT('',(-1.0,-7.49879891330929E-33,-1.22464679914735E-16));
#267=VECTOR('',#325,1.0);
#268=AXIS2_PLACEMENT_3D('',#326,#327,#328);
#269=CARTESIAN_POINT('',(1.0,-2.29128784747792,1.40300916416953E-16));
#270=CARTESIAN_POINT('',(1.0,-2.29128784747792,0.127185888417551));
#271=CARTESIAN_POINT('',(0.974289100360326,-2.30299791689273,0.26172029905593));
#272=CARTESIAN_POINT('',(0.871832955570113,-2.34370342433966,0.507586762271408));
#273=CARTESIAN_POINT('',(0.795147225832852,-2.37195405089756,0.619066336540243));
#274=CARTESIAN_POINT('',(0.619155400842759,-2.42385120878518,0.795058161530336));
#275=CARTESIAN_POINT('',(0.507642115342557,-2.45108038279582,0.871811436364328));
#276=CARTESIAN_POINT('',(0.261644153847047,-2.48938504427037,0.974319283827596));
#277=CARTESIAN_POINT('',(0.127057223433095,-2.5,1.0));
#278=CARTESIAN_POINT('',(-0.127057223433095,-2.5,1.0));
#279=CARTESIAN_POINT('',(-0.261644153847048,-2.48938504427037,0.974319283827596));
#280=CARTESIAN_POINT('',(-0.507642115342558,-2.45108038279582,0.871811436364328));
#281=CARTESIAN_POINT('',(-0.61915540084276,-2.42385120878518,0.795058161530336));
#282=CARTESIAN_POINT('',(-0.795147225832853,-2.37195405089756,0.619066336540242));
#283=CARTESIAN_POINT('',(-0.871832955570113,-2.34370342433966,0.507586762271407));
#284=CARTESIAN_POINT('',(-0.974289100360327,-2.30299791689273,0.261720299055929));
#285=CARTESIAN_POINT('',(-1.0,-2.29128784747792,0.12718588841755));
#286=CARTESIAN_POINT('',(-1.0,-2.29128784747792,9.21848450979957E-17));
#287=CARTESIAN_POINT('',(2.5,0.0,5.0));
#288=CARTESIAN_POINT('',(2.5,0.0,-5.0));
#289=CARTESIAN_POINT('',(2.5,0.0,0.0));
#290=VECTOR('',#329,2.5);
#291=CARTESIAN_POINT('',(-2.5,-3.06161699786838E-16,5.0));
#292=AXIS2_PLACEMENT_3D('',#330,#331,#332);
#293=CARTESIAN_POINT('',(-2.5,-3.06161699786838E-16,-5.0));
#294=CARTESIAN_POINT('',(-2.5,-3.06161699786838E-16,0.0));
#295=VECTOR('',#333,2.5);
#296=AXIS2_PLACEMENT_3D('',#334,#335,#336);
#297=AXIS2_PLACEMENT_3D('',#337,#338,#339);
#298=AXIS2_PLACEMENT_3D('',#340,#341,#342);
#299=CARTESIAN_POINT('',(-1.0,2.29128784747792,-1.66533453693773E-16));
#300=CARTESIAN_POINT('',(-1.0,2.29128784747792,0.12718588841755));
#301=CARTESIAN_POINT('',(-0.974289100360326,2.30299791689273,0.261720299055929));
#302=CARTESIAN_POINT('',(-0.871832955570113,2.34370342433966,0.507586762271407));
#303=CARTESIAN_POINT('',(-0.795147225832853,2.37195405089756,0.619066336540242));
#304=CARTESIAN_POINT('',(-0.619155400842759,2.42385120878518,0.795058161530336));
#305=CARTESIAN_POINT('',(-0.507642115342557,2.45108038279582,0.871811436364328));
#306=CARTESIAN_POINT('',(-0.261644153847047,2.48938504427037,0.974319283827596));
#307=CARTESIAN_POINT('',(-0.127057223433095,2.5,1.0));
#308=CARTESIAN_POINT('',(0.127057223433094,2.5,1.0));
#309=CARTESIAN_POINT('',(0.261644153847047,2.48938504427037,0.974319283827596));
#310=CARTESIAN_POINT('',(0.507642115342557,2.45108038279582,0.871811436364328));
#311=CARTESIAN_POINT('',(0.619155400842759,2.42385120878518,0.795058161530336));
#312=CARTESIAN_POINT('',(0.795147225832852,2.37195405089756,0.619066336540242));
#313=CARTESIAN_POINT('',(0.871832955570113,2.34370342433966,0.507586762271407));
#314=CARTESIAN_POINT('',(0.974289100360326,2.30299791689273,0.261720299055929));
#315=CARTESIAN_POINT('',(1.0,2.29128784747792,0.12718588841755));
#316=CARTESIAN_POINT('',(1.0,2.29128784747792,-1.40300916416953E-16));
#317=AXIS2_PLACEMENT_3D('',#343,#344,#345);
#318=AXIS2_PLACEMENT_3D('',#346,#347,#348);
#319=DIRECTION('',(-0.0,1.0,-6.12323399573676E-17));
#320=CARTESIAN_POINT('',(0.0,-4.0,2.44929359829471E-16));
#321=DIRECTION('',(0.0,-1.0,6.12323399573676E-17));
#322=DIRECTION('',(1.0,0.0,0.0));
#323=DIRECTION('',(-0.0,1.0,-6.12323399573676E-17));
#324=DIRECTION('',(-0.0,1.0,-6.12323399573676E-17));
#325=DIRECTION('',(-0.0,1.0,-6.12323399573676E-17));
#326=CARTESIAN_POINT('',(0.0,4.0,-2.44929359829471E-16));
#327=DIRECTION('',(0.0,1.0,-6.12323399573676E-17));
#328=DIRECTION('',(1.0,0.0,0.0));
#329=DIRECTION('',(-0.0,-0.0,-1.0));
#330=CARTESIAN_POINT('',(0.0,0.0,5.0));
#331=DIRECTION('',(0.0,0.0,1.0));
#332=DIRECTION('',(1.0,0.0,0.0));
#333=DIRECTION('',(-0.0,-0.0,-1.0));
#334=CARTESIAN_POINT('',(0.0,0.0,-5.0));
#335=DIRECTION('',(0.0,0.0,-1.0));
#336=DIRECTION('',(1.0,0.0,0.0));
#337=CARTESIAN_POINT('',(0.0,0.0,-5.0));
#338=DIRECTION('',(0.0,0.0,-1.0));
#339=DIRECTION('',(1.0,0.0,0.0));
#340=CARTESIAN_POINT('',(0.0,0.0,5.0));
#341=DIRECTION('',(0.0,0.0,1.0));
#342=DIRECTION('',(1.0,0.0,0.0));
#343=CARTESIAN_POINT('',(0.0,4.0,-2.44929359829471E-16));
#344=DIRECTION('',(0.0,1.0,-6.12323399573676E-17));
#345=DIRECTION('',(1.0,0.0,0.0));
#346=CARTESIAN_POINT('',(0.0,-4.0,2.44929359829471E-16));
#347=DIRECTION('',(0.0,-1.0,6.12323399573676E-17));
#348=DIRECTION('',(1.0,0.0,0.0));
ENDSEC;
END-ISO-10303-21;
