ISO-10303-21;
HEADER;
FILE_DESCRIPTION(('STEP AP214'),'1');
FILE_NAME('S6.step','2021-10-14T07:16:57',('Cubit 15.2'),(' '),'Spatial InterOp 3D',' ',' ');
FILE_SCHEMA(('automotive_design'));
ENDSEC;
DATA;
#1=PRODUCT_DEFINITION_CONTEXT('',#9,'design');
#2=APPLICATION_PROTOCOL_DEFINITION('INTERNATIONAL STANDARD','automotive_design',1994,#9);
#3=PRODUCT_CATEGORY_RELATIONSHIP('NONE','NONE',#10,#11);
#4=SHAPE_DEFINITION_REPRESENTATION(#12,#13);
#5= (GEOMETRIC_REPRESENTATION_CONTEXT(3)GLOBAL_UNCERTAINTY_ASSIGNED_CONTEXT((#16))GLOBAL_UNIT_ASSIGNED_CONTEXT((#18,#19,#20))REPRESENTATION_CONTEXT('NONE','WORKSPACE'));
#9=APPLICATION_CONTEXT(' ');
#10=PRODUCT_CATEGORY('part','NONE');
#11=PRODUCT_RELATED_PRODUCT_CATEGORY('detail',' ',(#22));
#12=PRODUCT_DEFINITION_SHAPE('NONE','NONE',#23);
#13=ADVANCED_BREP_SHAPE_REPRESENTATION('1',(#24,#25),#5);
#16=UNCERTAINTY_MEASURE_WITH_UNIT(LENGTH_MEASURE(1.0E-06),#18,'','');
#18= (CONVERSION_BASED_UNIT('MILLIMETRE',#28)LENGTH_UNIT()NAMED_UNIT(#31));
#19= (NAMED_UNIT(#33)PLANE_ANGLE_UNIT()SI_UNIT($,.RADIAN.));
#20= (NAMED_UNIT(#33)SOLID_ANGLE_UNIT()SI_UNIT($,.STERADIAN.));
#22=PRODUCT('1','1','PART-1-DESC',(#39));
#23=PRODUCT_DEFINITION('NONE','NONE',#40,#1);
#24=MANIFOLD_SOLID_BREP('1',#41);
#25=AXIS2_PLACEMENT_3D('',#42,#43,#44);
#28=LENGTH_MEASURE_WITH_UNIT(LENGTH_MEASURE(1.0),#45);
#31=DIMENSIONAL_EXPONENTS(1.0,0.0,0.0,0.0,0.0,0.0,0.0);
#33=DIMENSIONAL_EXPONENTS(0.0,0.0,0.0,0.0,0.0,0.0,0.0);
#39=PRODUCT_CONTEXT('',#9,'mechanical');
#40=PRODUCT_DEFINITION_FORMATION_WITH_SPECIFIED_SOURCE(' ','NONE',#22,.NOT_KNOWN.);
#41=CLOSED_SHELL('',(#46,#47,#48,#49,#50,#51,#52,#53,#54,#55,#56,#57,#58,#59,#60,#61,#62,#63,#64,#65,#66,#67,#68,#69,#70,#71,#72,#73,#74,#75,#76,#77,#78,#79,#80,#81,#82,#83,#84,#85,#86,#87,#88,#89,#90,#91,#92,#93,#94,#95,#96));
#42=CARTESIAN_POINT('',(0.0,0.0,0.0));
#43=DIRECTION('',(0.0,0.0,1.0));
#44=DIRECTION('',(1.0,0.0,0.0));
#45= (NAMED_UNIT(#31)LENGTH_UNIT()SI_UNIT(.MILLI.,.METRE.));
#46=ADVANCED_FACE('',(#98),#99,.F.);
#47=ADVANCED_FACE('',(#100),#101,.F.);
#48=ADVANCED_FACE('',(#102),#103,.F.);
#49=ADVANCED_FACE('',(#104,#105),#106,.T.);
#50=ADVANCED_FACE('',(#107),#108,.F.);
#51=ADVANCED_FACE('',(#109),#110,.F.);
#52=ADVANCED_FACE('',(#111),#112,.T.);
#53=ADVANCED_FACE('',(#113),#114,.F.);
#54=ADVANCED_FACE('',(#115),#116,.T.);
#55=ADVANCED_FACE('',(#117,#118,#119),#120,.F.);
#56=ADVANCED_FACE('',(#121),#122,.F.);
#57=ADVANCED_FACE('',(#123),#124,.F.);
#58=ADVANCED_FACE('',(#125),#126,.T.);
#59=ADVANCED_FACE('',(#127),#128,.F.);
#60=ADVANCED_FACE('',(#129),#130,.F.);
#61=ADVANCED_FACE('',(#131),#132,.T.);
#62=ADVANCED_FACE('',(#133),#134,.F.);
#63=ADVANCED_FACE('',(#135),#136,.F.);
#64=ADVANCED_FACE('',(#137),#138,.T.);
#65=ADVANCED_FACE('',(#139),#140,.F.);
#66=ADVANCED_FACE('',(#141),#142,.F.);
#67=ADVANCED_FACE('',(#143),#144,.F.);
#68=ADVANCED_FACE('',(#145),#146,.F.);
#69=ADVANCED_FACE('',(#147),#148,.T.);
#70=ADVANCED_FACE('',(#149,#150),#151,.F.);
#71=ADVANCED_FACE('',(#152,#153),#154,.T.);
#72=ADVANCED_FACE('',(#155),#156,.F.);
#73=ADVANCED_FACE('',(#157),#158,.F.);
#74=ADVANCED_FACE('',(#159),#160,.F.);
#75=ADVANCED_FACE('',(#161),#162,.T.);
#76=ADVANCED_FACE('',(#163),#164,.F.);
#77=ADVANCED_FACE('',(#165),#166,.F.);
#78=ADVANCED_FACE('',(#167),#168,.T.);
#79=ADVANCED_FACE('',(#169,#170),#171,.F.);
#80=ADVANCED_FACE('',(#172),#173,.F.);
#81=ADVANCED_FACE('',(#174),#175,.F.);
#82=ADVANCED_FACE('',(#176,#177,#178),#179,.F.);
#83=ADVANCED_FACE('',(#180,#181,#182),#183,.F.);
#84=ADVANCED_FACE('',(#184),#185,.F.);
#85=ADVANCED_FACE('',(#186),#187,.T.);
#86=ADVANCED_FACE('',(#188),#189,.F.);
#87=ADVANCED_FACE('',(#190),#191,.F.);
#88=ADVANCED_FACE('',(#192),#193,.F.);
#89=ADVANCED_FACE('',(#194),#195,.F.);
#90=ADVANCED_FACE('',(#196),#197,.T.);
#91=ADVANCED_FACE('',(#198),#199,.F.);
#92=ADVANCED_FACE('',(#200),#201,.F.);
#93=ADVANCED_FACE('',(#202),#203,.T.);
#94=ADVANCED_FACE('',(#204),#205,.F.);
#95=ADVANCED_FACE('',(#206),#207,.F.);
#96=ADVANCED_FACE('',(#208,#209,#210),#211,.T.);
#98=FACE_OUTER_BOUND('',#212,.T.);
#99=PLANE('',#213);
#100=FACE_OUTER_BOUND('',#214,.T.);
#101=CYLINDRICAL_SURFACE('',#215,5.00000000000002);
#102=FACE_OUTER_BOUND('',#216,.T.);
#103=CYLINDRICAL_SURFACE('',#217,5.0);
#104=FACE_OUTER_BOUND('',#218,.T.);
#105=FACE_BOUND('',#219,.T.);
#106=PLANE('',#220);
#107=FACE_OUTER_BOUND('',#221,.T.);
#108=PLANE('',#222);
#109=FACE_OUTER_BOUND('',#223,.T.);
#110=PLANE('',#224);
#111=FACE_OUTER_BOUND('',#225,.T.);
#112=CYLINDRICAL_SURFACE('',#226,16.0);
#113=FACE_OUTER_BOUND('',#227,.T.);
#114=PLANE('',#228);
#115=FACE_OUTER_BOUND('',#229,.T.);
#116=CYLINDRICAL_SURFACE('',#230,15.9999999999999);
#117=FACE_OUTER_BOUND('',#231,.T.);
#118=FACE_BOUND('',#232,.T.);
#119=FACE_BOUND('',#233,.T.);
#120=PLANE('',#234);
#121=FACE_OUTER_BOUND('',#235,.T.);
#122=CYLINDRICAL_SURFACE('',#236,4.99999999999998);
#123=FACE_OUTER_BOUND('',#237,.T.);
#124=PLANE('',#238);
#125=FACE_OUTER_BOUND('',#239,.T.);
#126=CYLINDRICAL_SURFACE('',#240,20.0);
#127=FACE_OUTER_BOUND('',#241,.T.);
#128=CYLINDRICAL_SURFACE('',#242,12.5000000000001);
#129=FACE_OUTER_BOUND('',#243,.T.);
#130=CYLINDRICAL_SURFACE('',#244,12.5);
#131=FACE_OUTER_BOUND('',#245,.T.);
#132=PLANE('',#246);
#133=FACE_OUTER_BOUND('',#247,.T.);
#134=CYLINDRICAL_SURFACE('',#248,3.00000000000001);
#135=FACE_OUTER_BOUND('',#249,.T.);
#136=PLANE('',#250);
#137=FACE_OUTER_BOUND('',#251,.T.);
#138=PLANE('',#252);
#139=FACE_OUTER_BOUND('',#253,.T.);
#140=CYLINDRICAL_SURFACE('',#254,12.5000000000018);
#141=FACE_OUTER_BOUND('',#255,.T.);
#142=CYLINDRICAL_SURFACE('',#256,12.4999999999991);
#143=FACE_OUTER_BOUND('',#257,.T.);
#144=CYLINDRICAL_SURFACE('',#258,3.99999999999999);
#145=FACE_OUTER_BOUND('',#259,.T.);
#146=CYLINDRICAL_SURFACE('',#260,4.0);
#147=FACE_OUTER_BOUND('',#261,.T.);
#148=CYLINDRICAL_SURFACE('',#262,7.99999999930247);
#149=FACE_OUTER_BOUND('',#263,.T.);
#150=FACE_BOUND('',#264,.T.);
#151=PLANE('',#265);
#152=FACE_OUTER_BOUND('',#266,.T.);
#153=FACE_BOUND('',#267,.T.);
#154=PLANE('',#268);
#155=FACE_OUTER_BOUND('',#269,.T.);
#156=CYLINDRICAL_SURFACE('',#270,2.99999999968691);
#157=FACE_OUTER_BOUND('',#271,.T.);
#158=PLANE('',#272);
#159=FACE_OUTER_BOUND('',#273,.T.);
#160=CYLINDRICAL_SURFACE('',#274,2.99999999999998);
#161=FACE_OUTER_BOUND('',#275,.T.);
#162=CYLINDRICAL_SURFACE('',#276,7.99999999929979);
#163=FACE_OUTER_BOUND('',#277,.T.);
#164=CYLINDRICAL_SURFACE('',#278,3.99999999999999);
#165=FACE_OUTER_BOUND('',#279,.T.);
#166=CYLINDRICAL_SURFACE('',#280,4.0);
#167=FACE_OUTER_BOUND('',#281,.T.);
#168=PLANE('',#282);
#169=FACE_OUTER_BOUND('',#283,.T.);
#170=FACE_BOUND('',#284,.T.);
#171=PLANE('',#285);
#172=FACE_OUTER_BOUND('',#286,.T.);
#173=CYLINDRICAL_SURFACE('',#287,2.99999999969142);
#174=FACE_OUTER_BOUND('',#288,.T.);
#175=PLANE('',#289);
#176=FACE_OUTER_BOUND('',#290,.T.);
#177=FACE_BOUND('',#291,.T.);
#178=FACE_BOUND('',#292,.T.);
#179=PLANE('',#293);
#180=FACE_OUTER_BOUND('',#294,.T.);
#181=FACE_BOUND('',#295,.T.);
#182=FACE_BOUND('',#296,.T.);
#183=PLANE('',#297);
#184=FACE_OUTER_BOUND('',#298,.T.);
#185=CYLINDRICAL_SURFACE('',#299,4.99999999999993);
#186=FACE_OUTER_BOUND('',#300,.T.);
#187=CYLINDRICAL_SURFACE('',#301,16.0);
#188=FACE_OUTER_BOUND('',#302,.T.);
#189=PLANE('',#303);
#190=FACE_OUTER_BOUND('',#304,.T.);
#191=CYLINDRICAL_SURFACE('',#305,7.99999999999998);
#192=FACE_OUTER_BOUND('',#306,.T.);
#193=CYLINDRICAL_SURFACE('',#307,7.99999999999999);
#194=FACE_OUTER_BOUND('',#308,.T.);
#195=PLANE('',#309);
#196=FACE_OUTER_BOUND('',#310,.T.);
#197=CYLINDRICAL_SURFACE('',#311,16.0);
#198=FACE_OUTER_BOUND('',#312,.T.);
#199=CYLINDRICAL_SURFACE('',#313,4.99999999999998);
#200=FACE_OUTER_BOUND('',#314,.T.);
#201=PLANE('',#315);
#202=FACE_OUTER_BOUND('',#316,.T.);
#203=CYLINDRICAL_SURFACE('',#317,20.0);
#204=FACE_OUTER_BOUND('',#318,.T.);
#205=CYLINDRICAL_SURFACE('',#319,12.5000000000019);
#206=FACE_OUTER_BOUND('',#320,.T.);
#207=CYLINDRICAL_SURFACE('',#321,12.4999999999991);
#208=FACE_OUTER_BOUND('',#322,.T.);
#209=FACE_BOUND('',#323,.T.);
#210=FACE_BOUND('',#324,.T.);
#211=PLANE('',#325);
#212=EDGE_LOOP('',(#326,#327));
#213=AXIS2_PLACEMENT_3D('',#328,#329,#330);
#214=EDGE_LOOP('',(#331,#332,#333,#334));
#215=AXIS2_PLACEMENT_3D('',#335,#336,#337);
#216=EDGE_LOOP('',(#338,#339,#340,#341));
#217=AXIS2_PLACEMENT_3D('',#342,#343,#344);
#218=EDGE_LOOP('',(#345,#346,#347,#348));
#219=EDGE_LOOP('',(#349,#350));
#220=AXIS2_PLACEMENT_3D('',#351,#352,#353);
#221=EDGE_LOOP('',(#354,#355,#356,#357));
#222=AXIS2_PLACEMENT_3D('',#358,#359,#360);
#223=EDGE_LOOP('',(#361,#362,#363,#364));
#224=AXIS2_PLACEMENT_3D('',#365,#366,#367);
#225=EDGE_LOOP('',(#368,#369,#370,#371));
#226=AXIS2_PLACEMENT_3D('',#372,#373,#374);
#227=EDGE_LOOP('',(#375,#376,#377,#378));
#228=AXIS2_PLACEMENT_3D('',#379,#380,#381);
#229=EDGE_LOOP('',(#382,#383,#384,#385));
#230=AXIS2_PLACEMENT_3D('',#386,#387,#388);
#231=EDGE_LOOP('',(#389,#390,#391,#392,#393,#394,#395,#396,#397,#398));
#232=EDGE_LOOP('',(#399,#400));
#233=EDGE_LOOP('',(#401,#402));
#234=AXIS2_PLACEMENT_3D('',#403,#404,#405);
#235=EDGE_LOOP('',(#406,#407,#408,#409,#410,#411));
#236=AXIS2_PLACEMENT_3D('',#412,#413,#414);
#237=EDGE_LOOP('',(#415,#416,#417,#418,#419));
#238=AXIS2_PLACEMENT_3D('',#420,#421,#422);
#239=EDGE_LOOP('',(#423,#424,#425,#426,#427,#428));
#240=AXIS2_PLACEMENT_3D('',#429,#430,#431);
#241=EDGE_LOOP('',(#432,#433,#434,#435,#436,#437));
#242=AXIS2_PLACEMENT_3D('',#438,#439,#440);
#243=EDGE_LOOP('',(#441,#442,#443,#444,#445));
#244=AXIS2_PLACEMENT_3D('',#446,#447,#448);
#245=EDGE_LOOP('',(#449,#450,#451,#452,#453,#454,#455,#456,#457,#458,#459,#460,#461,#462));
#246=AXIS2_PLACEMENT_3D('',#463,#464,#465);
#247=EDGE_LOOP('',(#466,#467,#468,#469));
#248=AXIS2_PLACEMENT_3D('',#470,#471,#472);
#249=EDGE_LOOP('',(#473,#474,#475,#476,#477));
#250=AXIS2_PLACEMENT_3D('',#478,#479,#480);
#251=EDGE_LOOP('',(#481,#482,#483,#484));
#252=AXIS2_PLACEMENT_3D('',#485,#486,#487);
#253=EDGE_LOOP('',(#488,#489,#490,#491,#492,#493));
#254=AXIS2_PLACEMENT_3D('',#494,#495,#496);
#255=EDGE_LOOP('',(#497,#498,#499,#500,#501));
#256=AXIS2_PLACEMENT_3D('',#502,#503,#504);
#257=EDGE_LOOP('',(#505,#506,#507,#508));
#258=AXIS2_PLACEMENT_3D('',#509,#510,#511);
#259=EDGE_LOOP('',(#512,#513,#514,#515));
#260=AXIS2_PLACEMENT_3D('',#516,#517,#518);
#261=EDGE_LOOP('',(#519,#520,#521,#522));
#262=AXIS2_PLACEMENT_3D('',#523,#524,#525);
#263=EDGE_LOOP('',(#526,#527,#528,#529));
#264=EDGE_LOOP('',(#530,#531,#532,#533));
#265=AXIS2_PLACEMENT_3D('',#534,#535,#536);
#266=EDGE_LOOP('',(#537,#538,#539,#540,#541,#542));
#267=EDGE_LOOP('',(#543,#544));
#268=AXIS2_PLACEMENT_3D('',#545,#546,#547);
#269=EDGE_LOOP('',(#548,#549,#550,#551));
#270=AXIS2_PLACEMENT_3D('',#552,#553,#554);
#271=EDGE_LOOP('',(#555,#556,#557,#558));
#272=AXIS2_PLACEMENT_3D('',#559,#560,#561);
#273=EDGE_LOOP('',(#562,#563,#564,#565));
#274=AXIS2_PLACEMENT_3D('',#566,#567,#568);
#275=EDGE_LOOP('',(#569,#570,#571,#572));
#276=AXIS2_PLACEMENT_3D('',#573,#574,#575);
#277=EDGE_LOOP('',(#576,#577,#578,#579));
#278=AXIS2_PLACEMENT_3D('',#580,#581,#582);
#279=EDGE_LOOP('',(#583,#584,#585,#586));
#280=AXIS2_PLACEMENT_3D('',#587,#588,#589);
#281=EDGE_LOOP('',(#590,#591,#592,#593));
#282=AXIS2_PLACEMENT_3D('',#594,#595,#596);
#283=EDGE_LOOP('',(#597,#598,#599,#600,#601,#602));
#284=EDGE_LOOP('',(#603,#604));
#285=AXIS2_PLACEMENT_3D('',#605,#606,#607);
#286=EDGE_LOOP('',(#608,#609,#610,#611));
#287=AXIS2_PLACEMENT_3D('',#612,#613,#614);
#288=EDGE_LOOP('',(#615,#616,#617,#618,#619));
#289=AXIS2_PLACEMENT_3D('',#620,#621,#622);
#290=EDGE_LOOP('',(#623,#624,#625,#626,#627,#628,#629,#630,#631,#632,#633,#634,#635,#636,#637,#638));
#291=EDGE_LOOP('',(#639,#640));
#292=EDGE_LOOP('',(#641,#642));
#293=AXIS2_PLACEMENT_3D('',#643,#644,#645);
#294=EDGE_LOOP('',(#646,#647,#648,#649,#650,#651));
#295=EDGE_LOOP('',(#652,#653));
#296=EDGE_LOOP('',(#654,#655));
#297=AXIS2_PLACEMENT_3D('',#656,#657,#658);
#298=EDGE_LOOP('',(#659,#660,#661,#662));
#299=AXIS2_PLACEMENT_3D('',#663,#664,#665);
#300=EDGE_LOOP('',(#666,#667,#668,#669));
#301=AXIS2_PLACEMENT_3D('',#670,#671,#672);
#302=EDGE_LOOP('',(#673,#674,#675,#676));
#303=AXIS2_PLACEMENT_3D('',#677,#678,#679);
#304=EDGE_LOOP('',(#680,#681,#682,#683));
#305=AXIS2_PLACEMENT_3D('',#684,#685,#686);
#306=EDGE_LOOP('',(#687,#688,#689,#690));
#307=AXIS2_PLACEMENT_3D('',#691,#692,#693);
#308=EDGE_LOOP('',(#694,#695,#696,#697,#698,#699,#700,#701,#702));
#309=AXIS2_PLACEMENT_3D('',#703,#704,#705);
#310=EDGE_LOOP('',(#706,#707,#708,#709));
#311=AXIS2_PLACEMENT_3D('',#710,#711,#712);
#312=EDGE_LOOP('',(#713,#714,#715,#716));
#313=AXIS2_PLACEMENT_3D('',#717,#718,#719);
#314=EDGE_LOOP('',(#720,#721,#722,#723));
#315=AXIS2_PLACEMENT_3D('',#724,#725,#726);
#316=EDGE_LOOP('',(#727,#728,#729,#730,#731,#732));
#317=AXIS2_PLACEMENT_3D('',#733,#734,#735);
#318=EDGE_LOOP('',(#736,#737,#738,#739));
#319=AXIS2_PLACEMENT_3D('',#740,#741,#742);
#320=EDGE_LOOP('',(#743,#744,#745,#746));
#321=AXIS2_PLACEMENT_3D('',#747,#748,#749);
#322=EDGE_LOOP('',(#750,#751,#752,#753,#754,#755,#756,#757,#758,#759));
#323=EDGE_LOOP('',(#760,#761));
#324=EDGE_LOOP('',(#762,#763));
#325=AXIS2_PLACEMENT_3D('',#764,#765,#766);
#326=ORIENTED_EDGE('',*,*,#767,.F.);
#327=ORIENTED_EDGE('',*,*,#768,.F.);
#328=CARTESIAN_POINT('',(0.0,0.0,0.0));
#329=DIRECTION('',(0.0,1.0,0.0));
#330=DIRECTION('',(1.0,0.0,-0.0));
#331=ORIENTED_EDGE('',*,*,#769,.F.);
#332=ORIENTED_EDGE('',*,*,#770,.F.);
#333=ORIENTED_EDGE('',*,*,#771,.F.);
#334=ORIENTED_EDGE('',*,*,#768,.T.);
#335=CARTESIAN_POINT('',(-40.0,-1.6,16.0));
#336=DIRECTION('',(0.0,-1.0,0.0));
#337=DIRECTION('',(8.88178419700121E-17,0.0,1.0));
#338=ORIENTED_EDGE('',*,*,#771,.T.);
#339=ORIENTED_EDGE('',*,*,#772,.F.);
#340=ORIENTED_EDGE('',*,*,#769,.T.);
#341=ORIENTED_EDGE('',*,*,#767,.T.);
#342=CARTESIAN_POINT('',(-40.0,-1.6,16.0));
#343=DIRECTION('',(-4.86242996475504E-16,-1.0,4.68647382202736E-17));
#344=DIRECTION('',(5.32907051820075E-16,-4.68647382202738E-17,-1.0));
#345=ORIENTED_EDGE('',*,*,#773,.F.);
#346=ORIENTED_EDGE('',*,*,#774,.F.);
#347=ORIENTED_EDGE('',*,*,#775,.F.);
#348=ORIENTED_EDGE('',*,*,#776,.F.);
#349=ORIENTED_EDGE('',*,*,#772,.T.);
#350=ORIENTED_EDGE('',*,*,#770,.T.);
#351=CARTESIAN_POINT('',(0.0,-8.0,0.0));
#352=DIRECTION('',(0.0,-1.0,0.0));
#353=DIRECTION('',(0.0,0.0,-1.0));
#354=ORIENTED_EDGE('',*,*,#776,.T.);
#355=ORIENTED_EDGE('',*,*,#777,.F.);
#356=ORIENTED_EDGE('',*,*,#778,.F.);
#357=ORIENTED_EDGE('',*,*,#779,.F.);
#358=CARTESIAN_POINT('',(-56.0,0.0,0.0));
#359=DIRECTION('',(1.0,0.0,0.0));
#360=DIRECTION('',(0.0,1.0,-0.0));
#361=ORIENTED_EDGE('',*,*,#773,.T.);
#362=ORIENTED_EDGE('',*,*,#779,.T.);
#363=ORIENTED_EDGE('',*,*,#780,.F.);
#364=ORIENTED_EDGE('',*,*,#781,.F.);
#365=CARTESIAN_POINT('',(0.0,0.0,8.0));
#366=DIRECTION('',(0.0,0.0,1.0));
#367=DIRECTION('',(1.0,-0.0,0.0));
#368=ORIENTED_EDGE('',*,*,#775,.T.);
#369=ORIENTED_EDGE('',*,*,#782,.F.);
#370=ORIENTED_EDGE('',*,*,#783,.F.);
#371=ORIENTED_EDGE('',*,*,#777,.T.);
#372=CARTESIAN_POINT('',(-40.0,-1.6,16.0));
#373=DIRECTION('',(0.0,-1.0,-0.0));
#374=DIRECTION('',(-1.11022302462516E-16,0.0,-1.0));
#375=ORIENTED_EDGE('',*,*,#774,.T.);
#376=ORIENTED_EDGE('',*,*,#781,.T.);
#377=ORIENTED_EDGE('',*,*,#784,.F.);
#378=ORIENTED_EDGE('',*,*,#782,.T.);
#379=CARTESIAN_POINT('',(-24.0,0.0,0.0));
#380=DIRECTION('',(-1.0,0.0,0.0));
#381=DIRECTION('',(0.0,0.0,1.0));
#382=ORIENTED_EDGE('',*,*,#785,.F.);
#383=ORIENTED_EDGE('',*,*,#786,.F.);
#384=ORIENTED_EDGE('',*,*,#787,.F.);
#385=ORIENTED_EDGE('',*,*,#788,.F.);
#386=CARTESIAN_POINT('',(-64.0,16.0,8.0));
#387=DIRECTION('',(0.0,0.0,1.0));
#388=DIRECTION('',(-0.707106781186547,0.707106781186548,0.0));
#389=ORIENTED_EDGE('',*,*,#789,.F.);
#390=ORIENTED_EDGE('',*,*,#788,.T.);
#391=ORIENTED_EDGE('',*,*,#790,.F.);
#392=ORIENTED_EDGE('',*,*,#791,.F.);
#393=ORIENTED_EDGE('',*,*,#792,.F.);
#394=ORIENTED_EDGE('',*,*,#793,.F.);
#395=ORIENTED_EDGE('',*,*,#794,.F.);
#396=ORIENTED_EDGE('',*,*,#795,.F.);
#397=ORIENTED_EDGE('',*,*,#796,.F.);
#398=ORIENTED_EDGE('',*,*,#797,.F.);
#399=ORIENTED_EDGE('',*,*,#798,.F.);
#400=ORIENTED_EDGE('',*,*,#799,.F.);
#401=ORIENTED_EDGE('',*,*,#800,.F.);
#402=ORIENTED_EDGE('',*,*,#801,.F.);
#403=CARTESIAN_POINT('',(-80.0,0.0,0.0));
#404=DIRECTION('',(1.0,0.0,0.0));
#405=DIRECTION('',(0.0,1.0,-0.0));
#406=ORIENTED_EDGE('',*,*,#802,.F.);
#407=ORIENTED_EDGE('',*,*,#803,.F.);
#408=ORIENTED_EDGE('',*,*,#804,.F.);
#409=ORIENTED_EDGE('',*,*,#793,.T.);
#410=ORIENTED_EDGE('',*,*,#805,.F.);
#411=ORIENTED_EDGE('',*,*,#806,.F.);
#412=CARTESIAN_POINT('',(-76.8,85.0,-4.99999999999998));
#413=DIRECTION('',(1.0,6.40535413340325E-16,5.73438330094323E-16));
#414=DIRECTION('',(-8.58409066165058E-16,0.707106781186547,0.707106781186548));
#415=ORIENTED_EDGE('',*,*,#807,.F.);
#416=ORIENTED_EDGE('',*,*,#806,.T.);
#417=ORIENTED_EDGE('',*,*,#805,.T.);
#418=ORIENTED_EDGE('',*,*,#792,.T.);
#419=ORIENTED_EDGE('',*,*,#808,.F.);
#420=CARTESIAN_POINT('',(0.0,0.0,0.0));
#421=DIRECTION('',(0.0,0.0,1.0));
#422=DIRECTION('',(1.0,-0.0,0.0));
#423=ORIENTED_EDGE('',*,*,#809,.F.);
#424=ORIENTED_EDGE('',*,*,#808,.T.);
#425=ORIENTED_EDGE('',*,*,#791,.T.);
#426=ORIENTED_EDGE('',*,*,#810,.F.);
#427=ORIENTED_EDGE('',*,*,#811,.F.);
#428=ORIENTED_EDGE('',*,*,#812,.F.);
#429=CARTESIAN_POINT('',(-76.8,108.0,20.0));
#430=DIRECTION('',(1.0,-5.22288195685161E-16,1.96601902909668E-15));
#431=DIRECTION('',(2.7534981461251E-16,-0.922828504666825,-0.385211047316133));
#432=ORIENTED_EDGE('',*,*,#813,.F.);
#433=ORIENTED_EDGE('',*,*,#814,.F.);
#434=ORIENTED_EDGE('',*,*,#815,.F.);
#435=ORIENTED_EDGE('',*,*,#816,.F.);
#436=ORIENTED_EDGE('',*,*,#817,.F.);
#437=ORIENTED_EDGE('',*,*,#801,.T.);
#438=CARTESIAN_POINT('',(-78.4,110.0,20.0));
#439=DIRECTION('',(1.0,0.0,-0.0));
#440=DIRECTION('',(0.0,4.97379915032068E-16,1.0));
#441=ORIENTED_EDGE('',*,*,#817,.T.);
#442=ORIENTED_EDGE('',*,*,#818,.F.);
#443=ORIENTED_EDGE('',*,*,#819,.F.);
#444=ORIENTED_EDGE('',*,*,#813,.T.);
#445=ORIENTED_EDGE('',*,*,#800,.T.);
#446=CARTESIAN_POINT('',(-78.4,110.0,20.0));
#447=DIRECTION('',(1.0,-2.77463484143133E-15,2.67422947873924E-16));
#448=DIRECTION('',(2.67422947873926E-16,4.97379915032071E-16,-1.0));
#449=ORIENTED_EDGE('',*,*,#820,.F.);
#450=ORIENTED_EDGE('',*,*,#821,.F.);
#451=ORIENTED_EDGE('',*,*,#822,.F.);
#452=ORIENTED_EDGE('',*,*,#823,.F.);
#453=ORIENTED_EDGE('',*,*,#824,.F.);
#454=ORIENTED_EDGE('',*,*,#825,.F.);
#455=ORIENTED_EDGE('',*,*,#826,.F.);
#456=ORIENTED_EDGE('',*,*,#827,.F.);
#457=ORIENTED_EDGE('',*,*,#828,.F.);
#458=ORIENTED_EDGE('',*,*,#829,.F.);
#459=ORIENTED_EDGE('',*,*,#830,.F.);
#460=ORIENTED_EDGE('',*,*,#831,.F.);
#461=ORIENTED_EDGE('',*,*,#832,.F.);
#462=ORIENTED_EDGE('',*,*,#833,.F.);
#463=CARTESIAN_POINT('',(0.0,0.0,8.0));
#464=DIRECTION('',(0.0,0.0,1.0));
#465=DIRECTION('',(1.0,-0.0,0.0));
#466=ORIENTED_EDGE('',*,*,#825,.T.);
#467=ORIENTED_EDGE('',*,*,#834,.F.);
#468=ORIENTED_EDGE('',*,*,#835,.F.);
#469=ORIENTED_EDGE('',*,*,#836,.F.);
#470=CARTESIAN_POINT('',(-69.0,25.79795897,14.4000000000004));
#471=DIRECTION('',(0.0,0.0,1.0));
#472=DIRECTION('',(-0.852802865256536,0.522232968138016,0.0));
#473=ORIENTED_EDGE('',*,*,#824,.T.);
#474=ORIENTED_EDGE('',*,*,#837,.F.);
#475=ORIENTED_EDGE('',*,*,#811,.T.);
#476=ORIENTED_EDGE('',*,*,#838,.F.);
#477=ORIENTED_EDGE('',*,*,#834,.T.);
#478=CARTESIAN_POINT('',(-72.0,0.0,0.0));
#479=DIRECTION('',(-1.0,0.0,0.0));
#480=DIRECTION('',(0.0,0.0,1.0));
#481=ORIENTED_EDGE('',*,*,#839,.F.);
#482=ORIENTED_EDGE('',*,*,#812,.T.);
#483=ORIENTED_EDGE('',*,*,#837,.T.);
#484=ORIENTED_EDGE('',*,*,#823,.T.);
#485=CARTESIAN_POINT('',(0.0,60.087121533215,0.0));
#486=DIRECTION('',(0.0,-0.710967469402321,0.703224898202317));
#487=DIRECTION('',(-1.0,0.0,0.0));
#488=ORIENTED_EDGE('',*,*,#840,.F.);
#489=ORIENTED_EDGE('',*,*,#841,.F.);
#490=ORIENTED_EDGE('',*,*,#842,.F.);
#491=ORIENTED_EDGE('',*,*,#815,.T.);
#492=ORIENTED_EDGE('',*,*,#814,.T.);
#493=ORIENTED_EDGE('',*,*,#819,.T.);
#494=CARTESIAN_POINT('',(-70.4,110.0,20.0));
#495=DIRECTION('',(1.0,-1.94818924604966E-16,1.0256556228515E-15));
#496=DIRECTION('',(-1.00157406777651E-16,0.96,0.28));
#497=ORIENTED_EDGE('',*,*,#842,.T.);
#498=ORIENTED_EDGE('',*,*,#843,.F.);
#499=ORIENTED_EDGE('',*,*,#840,.T.);
#500=ORIENTED_EDGE('',*,*,#818,.T.);
#501=ORIENTED_EDGE('',*,*,#816,.T.);
#502=CARTESIAN_POINT('',(-70.4,110.0,20.0));
#503=DIRECTION('',(1.0,0.0,0.0));
#504=DIRECTION('',(0.0,-0.96,-0.279999999999999));
#505=ORIENTED_EDGE('',*,*,#844,.F.);
#506=ORIENTED_EDGE('',*,*,#845,.F.);
#507=ORIENTED_EDGE('',*,*,#846,.F.);
#508=ORIENTED_EDGE('',*,*,#847,.F.);
#509=CARTESIAN_POINT('',(-64.0,16.0,8.0));
#510=DIRECTION('',(2.77463484143123E-16,-2.67422947873785E-17,1.0));
#511=DIRECTION('',(-4.44089209850063E-16,1.0,2.67422947873786E-17));
#512=ORIENTED_EDGE('',*,*,#846,.T.);
#513=ORIENTED_EDGE('',*,*,#848,.F.);
#514=ORIENTED_EDGE('',*,*,#844,.T.);
#515=ORIENTED_EDGE('',*,*,#849,.F.);
#516=CARTESIAN_POINT('',(-64.0,16.0,8.0));
#517=DIRECTION('',(-7.50774873416089E-17,4.05518160174158E-17,1.0));
#518=DIRECTION('',(-4.44089209850063E-16,-1.0,4.05518160174158E-17));
#519=ORIENTED_EDGE('',*,*,#826,.T.);
#520=ORIENTED_EDGE('',*,*,#836,.T.);
#521=ORIENTED_EDGE('',*,*,#850,.F.);
#522=ORIENTED_EDGE('',*,*,#851,.F.);
#523=CARTESIAN_POINT('',(-64.0,16.0,14.4000000000004));
#524=DIRECTION('',(3.13436845498504E-16,-3.67608932745611E-16,1.0));
#525=DIRECTION('',(0.707106781186547,-0.707106781186548,-4.81572088094883E-16));
#526=ORIENTED_EDGE('',*,*,#852,.F.);
#527=ORIENTED_EDGE('',*,*,#853,.F.);
#528=ORIENTED_EDGE('',*,*,#854,.F.);
#529=ORIENTED_EDGE('',*,*,#786,.T.);
#530=ORIENTED_EDGE('',*,*,#780,.T.);
#531=ORIENTED_EDGE('',*,*,#778,.T.);
#532=ORIENTED_EDGE('',*,*,#783,.T.);
#533=ORIENTED_EDGE('',*,*,#784,.T.);
#534=CARTESIAN_POINT('',(0.0,0.0,0.0));
#535=DIRECTION('',(0.0,1.0,0.0));
#536=DIRECTION('',(1.0,0.0,-0.0));
#537=ORIENTED_EDGE('',*,*,#802,.T.);
#538=ORIENTED_EDGE('',*,*,#807,.T.);
#539=ORIENTED_EDGE('',*,*,#809,.T.);
#540=ORIENTED_EDGE('',*,*,#839,.T.);
#541=ORIENTED_EDGE('',*,*,#822,.T.);
#542=ORIENTED_EDGE('',*,*,#855,.F.);
#543=ORIENTED_EDGE('',*,*,#843,.T.);
#544=ORIENTED_EDGE('',*,*,#841,.T.);
#545=CARTESIAN_POINT('',(-64.0,0.0,0.0));
#546=DIRECTION('',(1.0,0.0,0.0));
#547=DIRECTION('',(0.0,1.0,-0.0));
#548=ORIENTED_EDGE('',*,*,#827,.T.);
#549=ORIENTED_EDGE('',*,*,#851,.T.);
#550=ORIENTED_EDGE('',*,*,#856,.F.);
#551=ORIENTED_EDGE('',*,*,#857,.F.);
#552=CARTESIAN_POINT('',(-54.20204103,11.0,14.4000000000004));
#553=DIRECTION('',(0.0,0.0,1.0));
#554=DIRECTION('',(-0.522232968139755,0.852802865255471,0.0));
#555=ORIENTED_EDGE('',*,*,#828,.T.);
#556=ORIENTED_EDGE('',*,*,#857,.T.);
#557=ORIENTED_EDGE('',*,*,#858,.F.);
#558=ORIENTED_EDGE('',*,*,#859,.F.);
#559=CARTESIAN_POINT('',(0.0,8.0,0.0));
#560=DIRECTION('',(0.0,-1.0,0.0));
#561=DIRECTION('',(0.0,0.0,-1.0));
#562=ORIENTED_EDGE('',*,*,#829,.T.);
#563=ORIENTED_EDGE('',*,*,#859,.T.);
#564=ORIENTED_EDGE('',*,*,#860,.F.);
#565=ORIENTED_EDGE('',*,*,#861,.F.);
#566=CARTESIAN_POINT('',(-25.79795897,11.0,14.4000000000004));
#567=DIRECTION('',(0.0,0.0,1.0));
#568=DIRECTION('',(-0.522232968138331,-0.852802865256343,0.0));
#569=ORIENTED_EDGE('',*,*,#830,.T.);
#570=ORIENTED_EDGE('',*,*,#861,.T.);
#571=ORIENTED_EDGE('',*,*,#862,.F.);
#572=ORIENTED_EDGE('',*,*,#863,.F.);
#573=CARTESIAN_POINT('',(-16.0,16.0,14.4000000000004));
#574=DIRECTION('',(0.0,-0.0,1.0));
#575=DIRECTION('',(0.707106781186547,0.707106781186548,0.0));
#576=ORIENTED_EDGE('',*,*,#864,.F.);
#577=ORIENTED_EDGE('',*,*,#865,.F.);
#578=ORIENTED_EDGE('',*,*,#866,.F.);
#579=ORIENTED_EDGE('',*,*,#867,.F.);
#580=CARTESIAN_POINT('',(-16.0,16.0,8.0));
#581=DIRECTION('',(-6.38677988769458E-18,8.94450353961961E-18,1.0));
#582=DIRECTION('',(3.88578058618805E-16,1.0,-8.94450353961961E-18));
#583=ORIENTED_EDGE('',*,*,#866,.T.);
#584=ORIENTED_EDGE('',*,*,#868,.F.);
#585=ORIENTED_EDGE('',*,*,#864,.T.);
#586=ORIENTED_EDGE('',*,*,#869,.F.);
#587=CARTESIAN_POINT('',(-16.0,16.0,8.0));
#588=DIRECTION('',(1.98355032449506E-17,-1.91177183790734E-18,1.0));
#589=DIRECTION('',(3.88578058618804E-16,-1.0,-1.91177183790735E-18));
#590=ORIENTED_EDGE('',*,*,#870,.F.);
#591=ORIENTED_EDGE('',*,*,#871,.F.);
#592=ORIENTED_EDGE('',*,*,#872,.F.);
#593=ORIENTED_EDGE('',*,*,#833,.T.);
#594=CARTESIAN_POINT('',(0.0,60.087121533215,0.0));
#595=DIRECTION('',(0.0,-0.710967469402321,0.703224898202317));
#596=DIRECTION('',(-1.0,0.0,0.0));
#597=ORIENTED_EDGE('',*,*,#873,.F.);
#598=ORIENTED_EDGE('',*,*,#874,.F.);
#599=ORIENTED_EDGE('',*,*,#875,.F.);
#600=ORIENTED_EDGE('',*,*,#876,.F.);
#601=ORIENTED_EDGE('',*,*,#820,.T.);
#602=ORIENTED_EDGE('',*,*,#872,.T.);
#603=ORIENTED_EDGE('',*,*,#877,.F.);
#604=ORIENTED_EDGE('',*,*,#878,.F.);
#605=CARTESIAN_POINT('',(-16.0,0.0,0.0));
#606=DIRECTION('',(1.0,0.0,0.0));
#607=DIRECTION('',(0.0,1.0,-0.0));
#608=ORIENTED_EDGE('',*,*,#831,.T.);
#609=ORIENTED_EDGE('',*,*,#863,.T.);
#610=ORIENTED_EDGE('',*,*,#879,.F.);
#611=ORIENTED_EDGE('',*,*,#880,.F.);
#612=CARTESIAN_POINT('',(-11.0,25.79795897,14.4000000000004));
#613=DIRECTION('',(0.0,0.0,1.0));
#614=DIRECTION('',(-0.852802865255763,-0.522232968139279,0.0));
#615=ORIENTED_EDGE('',*,*,#881,.F.);
#616=ORIENTED_EDGE('',*,*,#882,.F.);
#617=ORIENTED_EDGE('',*,*,#870,.T.);
#618=ORIENTED_EDGE('',*,*,#832,.T.);
#619=ORIENTED_EDGE('',*,*,#880,.T.);
#620=CARTESIAN_POINT('',(-8.0,0.0,0.0));
#621=DIRECTION('',(1.0,0.0,0.0));
#622=DIRECTION('',(0.0,1.0,-0.0));
#623=ORIENTED_EDGE('',*,*,#854,.T.);
#624=ORIENTED_EDGE('',*,*,#883,.F.);
#625=ORIENTED_EDGE('',*,*,#884,.F.);
#626=ORIENTED_EDGE('',*,*,#885,.F.);
#627=ORIENTED_EDGE('',*,*,#881,.T.);
#628=ORIENTED_EDGE('',*,*,#879,.T.);
#629=ORIENTED_EDGE('',*,*,#862,.T.);
#630=ORIENTED_EDGE('',*,*,#860,.T.);
#631=ORIENTED_EDGE('',*,*,#858,.T.);
#632=ORIENTED_EDGE('',*,*,#856,.T.);
#633=ORIENTED_EDGE('',*,*,#850,.T.);
#634=ORIENTED_EDGE('',*,*,#835,.T.);
#635=ORIENTED_EDGE('',*,*,#838,.T.);
#636=ORIENTED_EDGE('',*,*,#810,.T.);
#637=ORIENTED_EDGE('',*,*,#790,.T.);
#638=ORIENTED_EDGE('',*,*,#787,.T.);
#639=ORIENTED_EDGE('',*,*,#849,.T.);
#640=ORIENTED_EDGE('',*,*,#847,.T.);
#641=ORIENTED_EDGE('',*,*,#869,.T.);
#642=ORIENTED_EDGE('',*,*,#867,.T.);
#643=CARTESIAN_POINT('',(0.0,0.0,40.0));
#644=DIRECTION('',(0.0,0.0,-1.0));
#645=DIRECTION('',(0.0,-1.0,0.0));
#646=ORIENTED_EDGE('',*,*,#886,.F.);
#647=ORIENTED_EDGE('',*,*,#887,.F.);
#648=ORIENTED_EDGE('',*,*,#852,.T.);
#649=ORIENTED_EDGE('',*,*,#785,.T.);
#650=ORIENTED_EDGE('',*,*,#789,.T.);
#651=ORIENTED_EDGE('',*,*,#888,.F.);
#652=ORIENTED_EDGE('',*,*,#848,.T.);
#653=ORIENTED_EDGE('',*,*,#845,.T.);
#654=ORIENTED_EDGE('',*,*,#868,.T.);
#655=ORIENTED_EDGE('',*,*,#865,.T.);
#656=CARTESIAN_POINT('',(0.0,0.0,0.0));
#657=DIRECTION('',(0.0,0.0,1.0));
#658=DIRECTION('',(1.0,-0.0,0.0));
#659=ORIENTED_EDGE('',*,*,#888,.T.);
#660=ORIENTED_EDGE('',*,*,#797,.T.);
#661=ORIENTED_EDGE('',*,*,#889,.F.);
#662=ORIENTED_EDGE('',*,*,#890,.F.);
#663=CARTESIAN_POINT('',(-64.0,43.0000000000001,-4.99999999999997));
#664=DIRECTION('',(1.0,0.0,0.0));
#665=DIRECTION('',(0.0,0.70710678118655,-0.707106781186545));
#666=ORIENTED_EDGE('',*,*,#891,.F.);
#667=ORIENTED_EDGE('',*,*,#795,.T.);
#668=ORIENTED_EDGE('',*,*,#892,.F.);
#669=ORIENTED_EDGE('',*,*,#893,.F.);
#670=CARTESIAN_POINT('',(-64.0,64.0,-16.0));
#671=DIRECTION('',(1.0,-1.25958182296174E-16,-4.51785968556126E-18));
#672=DIRECTION('',(4.51785968556125E-18,-5.55111512312579E-17,1.0));
#673=ORIENTED_EDGE('',*,*,#889,.T.);
#674=ORIENTED_EDGE('',*,*,#796,.T.);
#675=ORIENTED_EDGE('',*,*,#891,.T.);
#676=ORIENTED_EDGE('',*,*,#894,.F.);
#677=CARTESIAN_POINT('',(0.0,48.0,0.0));
#678=DIRECTION('',(0.0,1.0,0.0));
#679=DIRECTION('',(1.0,0.0,-0.0));
#680=ORIENTED_EDGE('',*,*,#895,.F.);
#681=ORIENTED_EDGE('',*,*,#799,.T.);
#682=ORIENTED_EDGE('',*,*,#896,.F.);
#683=ORIENTED_EDGE('',*,*,#897,.F.);
#684=CARTESIAN_POINT('',(-64.0,64.0,-16.0));
#685=DIRECTION('',(1.0,0.0,-0.0));
#686=DIRECTION('',(0.0,3.33066907387548E-16,1.0));
#687=ORIENTED_EDGE('',*,*,#896,.T.);
#688=ORIENTED_EDGE('',*,*,#798,.T.);
#689=ORIENTED_EDGE('',*,*,#895,.T.);
#690=ORIENTED_EDGE('',*,*,#898,.F.);
#691=CARTESIAN_POINT('',(-64.0,64.0,-16.0));
#692=DIRECTION('',(1.0,0.0,0.0));
#693=DIRECTION('',(0.0,-3.33066907387547E-16,-1.0));
#694=ORIENTED_EDGE('',*,*,#821,.T.);
#695=ORIENTED_EDGE('',*,*,#876,.T.);
#696=ORIENTED_EDGE('',*,*,#899,.F.);
#697=ORIENTED_EDGE('',*,*,#900,.F.);
#698=ORIENTED_EDGE('',*,*,#892,.T.);
#699=ORIENTED_EDGE('',*,*,#794,.T.);
#700=ORIENTED_EDGE('',*,*,#804,.T.);
#701=ORIENTED_EDGE('',*,*,#803,.T.);
#702=ORIENTED_EDGE('',*,*,#855,.T.);
#703=CARTESIAN_POINT('',(0.0,80.0,0.0));
#704=DIRECTION('',(0.0,-1.0,0.0));
#705=DIRECTION('',(0.0,0.0,-1.0));
#706=ORIENTED_EDGE('',*,*,#887,.T.);
#707=ORIENTED_EDGE('',*,*,#901,.F.);
#708=ORIENTED_EDGE('',*,*,#883,.T.);
#709=ORIENTED_EDGE('',*,*,#853,.T.);
#710=CARTESIAN_POINT('',(-16.0,16.0,8.0));
#711=DIRECTION('',(7.42236281407858E-17,2.28147573259382E-17,1.0));
#712=DIRECTION('',(-0.707106781186548,-0.707106781186547,6.86165003989148E-17));
#713=ORIENTED_EDGE('',*,*,#902,.F.);
#714=ORIENTED_EDGE('',*,*,#899,.T.);
#715=ORIENTED_EDGE('',*,*,#875,.T.);
#716=ORIENTED_EDGE('',*,*,#903,.F.);
#717=CARTESIAN_POINT('',(-12.8,85.0,-4.99999999999998));
#718=DIRECTION('',(1.0,6.40535413340325E-16,5.73438330094323E-16));
#719=DIRECTION('',(-8.58409066165057E-16,0.707106781186547,0.707106781186548));
#720=ORIENTED_EDGE('',*,*,#903,.T.);
#721=ORIENTED_EDGE('',*,*,#874,.T.);
#722=ORIENTED_EDGE('',*,*,#904,.F.);
#723=ORIENTED_EDGE('',*,*,#905,.F.);
#724=CARTESIAN_POINT('',(0.0,0.0,0.0));
#725=DIRECTION('',(0.0,0.0,1.0));
#726=DIRECTION('',(1.0,-0.0,0.0));
#727=ORIENTED_EDGE('',*,*,#885,.T.);
#728=ORIENTED_EDGE('',*,*,#906,.F.);
#729=ORIENTED_EDGE('',*,*,#904,.T.);
#730=ORIENTED_EDGE('',*,*,#873,.T.);
#731=ORIENTED_EDGE('',*,*,#871,.T.);
#732=ORIENTED_EDGE('',*,*,#882,.T.);
#733=CARTESIAN_POINT('',(-12.8,108.0,20.0));
#734=DIRECTION('',(1.0,-5.22288195685161E-16,1.96601902909668E-15));
#735=DIRECTION('',(2.75349814505187E-16,-0.922828504687337,-0.385211047266994));
#736=ORIENTED_EDGE('',*,*,#907,.F.);
#737=ORIENTED_EDGE('',*,*,#908,.F.);
#738=ORIENTED_EDGE('',*,*,#909,.F.);
#739=ORIENTED_EDGE('',*,*,#878,.T.);
#740=CARTESIAN_POINT('',(-12.8,110.0,20.0));
#741=DIRECTION('',(1.0,0.0,-0.0));
#742=DIRECTION('',(0.0,0.96,0.28));
#743=ORIENTED_EDGE('',*,*,#877,.T.);
#744=ORIENTED_EDGE('',*,*,#909,.T.);
#745=ORIENTED_EDGE('',*,*,#910,.F.);
#746=ORIENTED_EDGE('',*,*,#907,.T.);
#747=CARTESIAN_POINT('',(-12.8,110.0,20.0));
#748=DIRECTION('',(1.0,0.0,0.0));
#749=DIRECTION('',(0.0,-0.96,-0.279999999999999));
#750=ORIENTED_EDGE('',*,*,#901,.T.);
#751=ORIENTED_EDGE('',*,*,#886,.T.);
#752=ORIENTED_EDGE('',*,*,#890,.T.);
#753=ORIENTED_EDGE('',*,*,#894,.T.);
#754=ORIENTED_EDGE('',*,*,#893,.T.);
#755=ORIENTED_EDGE('',*,*,#900,.T.);
#756=ORIENTED_EDGE('',*,*,#902,.T.);
#757=ORIENTED_EDGE('',*,*,#905,.T.);
#758=ORIENTED_EDGE('',*,*,#906,.T.);
#759=ORIENTED_EDGE('',*,*,#884,.T.);
#760=ORIENTED_EDGE('',*,*,#898,.T.);
#761=ORIENTED_EDGE('',*,*,#897,.T.);
#762=ORIENTED_EDGE('',*,*,#910,.T.);
#763=ORIENTED_EDGE('',*,*,#908,.T.);
#764=CARTESIAN_POINT('',(0.0,0.0,0.0));
#765=DIRECTION('',(1.0,0.0,0.0));
#766=DIRECTION('',(0.0,1.0,-0.0));
#767=EDGE_CURVE('',#911,#912,#913,.T.);
#768=EDGE_CURVE('',#912,#911,#914,.T.);
#769=EDGE_CURVE('',#915,#911,#916,.T.);
#770=EDGE_CURVE('',#917,#915,#918,.T.);
#771=EDGE_CURVE('',#912,#917,#919,.T.);
#772=EDGE_CURVE('',#915,#917,#920,.T.);
#773=EDGE_CURVE('',#921,#922,#923,.T.);
#774=EDGE_CURVE('',#924,#921,#925,.T.);
#775=EDGE_CURVE('',#926,#924,#927,.T.);
#776=EDGE_CURVE('',#922,#926,#928,.T.);
#777=EDGE_CURVE('',#929,#926,#930,.T.);
#778=EDGE_CURVE('',#931,#929,#932,.T.);
#779=EDGE_CURVE('',#922,#931,#933,.T.);
#780=EDGE_CURVE('',#934,#931,#935,.T.);
#781=EDGE_CURVE('',#921,#934,#936,.T.);
#782=EDGE_CURVE('',#937,#924,#938,.T.);
#783=EDGE_CURVE('',#929,#937,#939,.T.);
#784=EDGE_CURVE('',#937,#934,#940,.T.);
#785=EDGE_CURVE('',#941,#942,#943,.T.);
#786=EDGE_CURVE('',#944,#941,#945,.T.);
#787=EDGE_CURVE('',#946,#944,#947,.T.);
#788=EDGE_CURVE('',#942,#946,#948,.T.);
#789=EDGE_CURVE('',#942,#949,#950,.T.);
#790=EDGE_CURVE('',#951,#946,#952,.T.);
#791=EDGE_CURVE('',#953,#951,#954,.T.);
#792=EDGE_CURVE('',#955,#953,#956,.T.);
#793=EDGE_CURVE('',#957,#955,#958,.T.);
#794=EDGE_CURVE('',#959,#957,#960,.T.);
#795=EDGE_CURVE('',#961,#959,#962,.T.);
#796=EDGE_CURVE('',#963,#961,#964,.T.);
#797=EDGE_CURVE('',#949,#963,#965,.T.);
#798=EDGE_CURVE('',#966,#967,#968,.T.);
#799=EDGE_CURVE('',#967,#966,#969,.T.);
#800=EDGE_CURVE('',#970,#971,#972,.T.);
#801=EDGE_CURVE('',#971,#970,#973,.T.);
#802=EDGE_CURVE('',#974,#975,#976,.T.);
#803=EDGE_CURVE('',#977,#974,#978,.T.);
#804=EDGE_CURVE('',#957,#977,#979,.T.);
#805=EDGE_CURVE('',#980,#955,#981,.T.);
#806=EDGE_CURVE('',#975,#980,#982,.T.);
#807=EDGE_CURVE('',#975,#983,#984,.T.);
#808=EDGE_CURVE('',#983,#953,#985,.T.);
#809=EDGE_CURVE('',#983,#986,#987,.T.);
#810=EDGE_CURVE('',#988,#951,#989,.T.);
#811=EDGE_CURVE('',#990,#988,#991,.T.);
#812=EDGE_CURVE('',#986,#990,#992,.T.);
#813=EDGE_CURVE('',#993,#970,#994,.T.);
#814=EDGE_CURVE('',#995,#993,#996,.T.);
#815=EDGE_CURVE('',#997,#995,#998,.T.);
#816=EDGE_CURVE('',#999,#997,#1000,.T.);
#817=EDGE_CURVE('',#971,#999,#1001,.T.);
#818=EDGE_CURVE('',#1002,#999,#1003,.T.);
#819=EDGE_CURVE('',#993,#1002,#1004,.T.);
#820=EDGE_CURVE('',#1005,#1006,#1007,.T.);
#821=EDGE_CURVE('',#1008,#1005,#1009,.T.);
#822=EDGE_CURVE('',#1010,#1008,#1011,.T.);
#823=EDGE_CURVE('',#1012,#1010,#1013,.T.);
#824=EDGE_CURVE('',#1014,#1012,#1015,.T.);
#825=EDGE_CURVE('',#1016,#1014,#1017,.T.);
#826=EDGE_CURVE('',#1018,#1016,#1019,.T.);
#827=EDGE_CURVE('',#1020,#1018,#1021,.T.);
#828=EDGE_CURVE('',#1022,#1020,#1023,.T.);
#829=EDGE_CURVE('',#1024,#1022,#1025,.T.);
#830=EDGE_CURVE('',#1026,#1024,#1027,.T.);
#831=EDGE_CURVE('',#1028,#1026,#1029,.T.);
#832=EDGE_CURVE('',#1030,#1028,#1031,.T.);
#833=EDGE_CURVE('',#1006,#1030,#1032,.T.);
#834=EDGE_CURVE('',#1033,#1014,#1034,.T.);
#835=EDGE_CURVE('',#1035,#1033,#1036,.T.);
#836=EDGE_CURVE('',#1016,#1035,#1037,.T.);
#837=EDGE_CURVE('',#990,#1012,#1038,.T.);
#838=EDGE_CURVE('',#1033,#988,#1039,.T.);
#839=EDGE_CURVE('',#986,#1010,#1040,.T.);
#840=EDGE_CURVE('',#1041,#1002,#1042,.T.);
#841=EDGE_CURVE('',#1043,#1041,#1044,.T.);
#842=EDGE_CURVE('',#997,#1043,#1045,.T.);
#843=EDGE_CURVE('',#1041,#1043,#1046,.T.);
#844=EDGE_CURVE('',#1047,#1048,#1049,.T.);
#845=EDGE_CURVE('',#1050,#1047,#1051,.T.);
#846=EDGE_CURVE('',#1052,#1050,#1053,.T.);
#847=EDGE_CURVE('',#1048,#1052,#1054,.T.);
#848=EDGE_CURVE('',#1047,#1050,#1055,.T.);
#849=EDGE_CURVE('',#1052,#1048,#1056,.T.);
#850=EDGE_CURVE('',#1057,#1035,#1058,.T.);
#851=EDGE_CURVE('',#1018,#1057,#1059,.T.);
#852=EDGE_CURVE('',#1060,#941,#1061,.T.);
#853=EDGE_CURVE('',#1062,#1060,#1063,.T.);
#854=EDGE_CURVE('',#944,#1062,#1064,.T.);
#855=EDGE_CURVE('',#974,#1008,#1065,.T.);
#856=EDGE_CURVE('',#1066,#1057,#1067,.T.);
#857=EDGE_CURVE('',#1020,#1066,#1068,.T.);
#858=EDGE_CURVE('',#1069,#1066,#1070,.T.);
#859=EDGE_CURVE('',#1022,#1069,#1071,.T.);
#860=EDGE_CURVE('',#1072,#1069,#1073,.T.);
#861=EDGE_CURVE('',#1024,#1072,#1074,.T.);
#862=EDGE_CURVE('',#1075,#1072,#1076,.T.);
#863=EDGE_CURVE('',#1026,#1075,#1077,.T.);
#864=EDGE_CURVE('',#1078,#1079,#1080,.T.);
#865=EDGE_CURVE('',#1081,#1078,#1082,.T.);
#866=EDGE_CURVE('',#1083,#1081,#1084,.T.);
#867=EDGE_CURVE('',#1079,#1083,#1085,.T.);
#868=EDGE_CURVE('',#1078,#1081,#1086,.T.);
#869=EDGE_CURVE('',#1083,#1079,#1087,.T.);
#870=EDGE_CURVE('',#1088,#1030,#1089,.T.);
#871=EDGE_CURVE('',#1090,#1088,#1091,.T.);
#872=EDGE_CURVE('',#1006,#1090,#1092,.T.);
#873=EDGE_CURVE('',#1093,#1090,#1094,.T.);
#874=EDGE_CURVE('',#1095,#1093,#1096,.T.);
#875=EDGE_CURVE('',#1097,#1095,#1098,.T.);
#876=EDGE_CURVE('',#1005,#1097,#1099,.T.);
#877=EDGE_CURVE('',#1100,#1101,#1102,.T.);
#878=EDGE_CURVE('',#1101,#1100,#1103,.T.);
#879=EDGE_CURVE('',#1104,#1075,#1105,.T.);
#880=EDGE_CURVE('',#1028,#1104,#1106,.T.);
#881=EDGE_CURVE('',#1107,#1104,#1108,.T.);
#882=EDGE_CURVE('',#1088,#1107,#1109,.T.);
#883=EDGE_CURVE('',#1110,#1062,#1111,.T.);
#884=EDGE_CURVE('',#1112,#1110,#1113,.T.);
#885=EDGE_CURVE('',#1107,#1112,#1114,.T.);
#886=EDGE_CURVE('',#1115,#1116,#1117,.T.);
#887=EDGE_CURVE('',#1060,#1115,#1118,.T.);
#888=EDGE_CURVE('',#1116,#949,#1119,.T.);
#889=EDGE_CURVE('',#1120,#963,#1121,.T.);
#890=EDGE_CURVE('',#1116,#1120,#1122,.T.);
#891=EDGE_CURVE('',#961,#1123,#1124,.T.);
#892=EDGE_CURVE('',#1125,#959,#1126,.T.);
#893=EDGE_CURVE('',#1123,#1125,#1127,.T.);
#894=EDGE_CURVE('',#1120,#1123,#1128,.T.);
#895=EDGE_CURVE('',#967,#1129,#1130,.T.);
#896=EDGE_CURVE('',#1131,#966,#1132,.T.);
#897=EDGE_CURVE('',#1129,#1131,#1133,.T.);
#898=EDGE_CURVE('',#1131,#1129,#1134,.T.);
#899=EDGE_CURVE('',#1135,#1097,#1136,.T.);
#900=EDGE_CURVE('',#1125,#1135,#1137,.T.);
#901=EDGE_CURVE('',#1110,#1115,#1138,.T.);
#902=EDGE_CURVE('',#1135,#1139,#1140,.T.);
#903=EDGE_CURVE('',#1139,#1095,#1141,.T.);
#904=EDGE_CURVE('',#1142,#1093,#1143,.T.);
#905=EDGE_CURVE('',#1139,#1142,#1144,.T.);
#906=EDGE_CURVE('',#1142,#1112,#1145,.T.);
#907=EDGE_CURVE('',#1146,#1100,#1147,.T.);
#908=EDGE_CURVE('',#1148,#1146,#1149,.T.);
#909=EDGE_CURVE('',#1101,#1148,#1150,.T.);
#910=EDGE_CURVE('',#1146,#1148,#1151,.T.);
#911=VERTEX_POINT('',#1152);
#912=VERTEX_POINT('',#1153);
#913=CIRCLE('',#1154,5.0);
#914=CIRCLE('',#1155,5.0);
#915=VERTEX_POINT('',#1156);
#916=LINE('',#1157,#1158);
#917=VERTEX_POINT('',#1159);
#918=CIRCLE('',#1160,5.0);
#919=LINE('',#1161,#1162);
#920=CIRCLE('',#1163,5.0);
#921=VERTEX_POINT('',#1164);
#922=VERTEX_POINT('',#1165);
#923=LINE('',#1166,#1167);
#924=VERTEX_POINT('',#1168);
#925=LINE('',#1169,#1170);
#926=VERTEX_POINT('',#1171);
#927=CIRCLE('',#1172,16.0);
#928=LINE('',#1173,#1174);
#929=VERTEX_POINT('',#1175);
#930=LINE('',#1176,#1177);
#931=VERTEX_POINT('',#1178);
#932=LINE('',#1179,#1180);
#933=LINE('',#1181,#1182);
#934=VERTEX_POINT('',#1183);
#935=LINE('',#1184,#1185);
#936=LINE('',#1186,#1187);
#937=VERTEX_POINT('',#1188);
#938=LINE('',#1189,#1190);
#939=CIRCLE('',#1191,16.0);
#940=LINE('',#1192,#1193);
#941=VERTEX_POINT('',#1194);
#942=VERTEX_POINT('',#1195);
#943=CIRCLE('',#1196,16.0);
#944=VERTEX_POINT('',#1197);
#945=LINE('',#1198,#1199);
#946=VERTEX_POINT('',#1200);
#947=CIRCLE('',#1201,16.0);
#948=LINE('',#1202,#1203);
#949=VERTEX_POINT('',#1204);
#950=LINE('',#1205,#1206);
#951=VERTEX_POINT('',#1207);
#952=LINE('',#1208,#1209);
#953=VERTEX_POINT('',#1210);
#954=CIRCLE('',#1211,20.0);
#955=VERTEX_POINT('',#1212);
#956=LINE('',#1213,#1214);
#957=VERTEX_POINT('',#1215);
#958=CIRCLE('',#1216,5.0);
#959=VERTEX_POINT('',#1217);
#960=LINE('',#1218,#1219);
#961=VERTEX_POINT('',#1220);
#962=CIRCLE('',#1221,16.0);
#963=VERTEX_POINT('',#1222);
#964=LINE('',#1223,#1224);
#965=CIRCLE('',#1225,5.0);
#966=VERTEX_POINT('',#1226);
#967=VERTEX_POINT('',#1227);
#968=CIRCLE('',#1228,8.0);
#969=CIRCLE('',#1229,8.0);
#970=VERTEX_POINT('',#1230);
#971=VERTEX_POINT('',#1231);
#972=CIRCLE('',#1232,12.5);
#973=CIRCLE('',#1233,12.5);
#974=VERTEX_POINT('',#1234);
#975=VERTEX_POINT('',#1235);
#976=CIRCLE('',#1236,5.0);
#977=VERTEX_POINT('',#1237);
#978=LINE('',#1238,#1239);
#979=LINE('',#1240,#1241);
#980=VERTEX_POINT('',#1242);
#981=LINE('',#1243,#1244);
#982=LINE('',#1245,#1246);
#983=VERTEX_POINT('',#1247);
#984=LINE('',#1248,#1249);
#985=LINE('',#1250,#1251);
#986=VERTEX_POINT('',#1252);
#987=CIRCLE('',#1253,20.0);
#988=VERTEX_POINT('',#1254);
#989=LINE('',#1255,#1256);
#990=VERTEX_POINT('',#1257);
#991=CIRCLE('',#1258,20.0);
#992=LINE('',#1259,#1260);
#993=VERTEX_POINT('',#1261);
#994=LINE('',#1262,#1263);
#995=VERTEX_POINT('',#1264);
#996=CIRCLE('',#1265,12.5);
#997=VERTEX_POINT('',#1266);
#998=CIRCLE('',#1267,12.5);
#999=VERTEX_POINT('',#1268);
#1000=CIRCLE('',#1269,12.5);
#1001=LINE('',#1270,#1271);
#1002=VERTEX_POINT('',#1272);
#1003=CIRCLE('',#1273,12.5);
#1004=CIRCLE('',#1274,12.5);
#1005=VERTEX_POINT('',#1275);
#1006=VERTEX_POINT('',#1276);
#1007=LINE('',#1277,#1278);
#1008=VERTEX_POINT('',#1279);
#1009=LINE('',#1280,#1281);
#1010=VERTEX_POINT('',#1282);
#1011=LINE('',#1283,#1284);
#1012=VERTEX_POINT('',#1285);
#1013=LINE('',#1286,#1287);
#1014=VERTEX_POINT('',#1288);
#1015=LINE('',#1289,#1290);
#1016=VERTEX_POINT('',#1291);
#1017=CIRCLE('',#1292,3.0);
#1018=VERTEX_POINT('',#1293);
#1019=CIRCLE('',#1294,8.0);
#1020=VERTEX_POINT('',#1295);
#1021=CIRCLE('',#1296,3.0);
#1022=VERTEX_POINT('',#1297);
#1023=LINE('',#1298,#1299);
#1024=VERTEX_POINT('',#1300);
#1025=CIRCLE('',#1301,3.0);
#1026=VERTEX_POINT('',#1302);
#1027=CIRCLE('',#1303,8.0);
#1028=VERTEX_POINT('',#1304);
#1029=CIRCLE('',#1305,3.0);
#1030=VERTEX_POINT('',#1306);
#1031=LINE('',#1307,#1308);
#1032=LINE('',#1309,#1310);
#1033=VERTEX_POINT('',#1311);
#1034=LINE('',#1312,#1313);
#1035=VERTEX_POINT('',#1314);
#1036=CIRCLE('',#1315,3.0);
#1037=LINE('',#1316,#1317);
#1038=LINE('',#1318,#1319);
#1039=LINE('',#1320,#1321);
#1040=LINE('',#1322,#1323);
#1041=VERTEX_POINT('',#1324);
#1042=LINE('',#1325,#1326);
#1043=VERTEX_POINT('',#1327);
#1044=CIRCLE('',#1328,12.5);
#1045=LINE('',#1329,#1330);
#1046=CIRCLE('',#1331,12.5);
#1047=VERTEX_POINT('',#1332);
#1048=VERTEX_POINT('',#1333);
#1049=LINE('',#1334,#1335);
#1050=VERTEX_POINT('',#1336);
#1051=CIRCLE('',#1337,4.0);
#1052=VERTEX_POINT('',#1338);
#1053=LINE('',#1339,#1340);
#1054=CIRCLE('',#1341,4.0);
#1055=CIRCLE('',#1342,4.0);
#1056=CIRCLE('',#1343,4.0);
#1057=VERTEX_POINT('',#1344);
#1058=CIRCLE('',#1345,8.0);
#1059=LINE('',#1346,#1347);
#1060=VERTEX_POINT('',#1348);
#1061=LINE('',#1349,#1350);
#1062=VERTEX_POINT('',#1351);
#1063=LINE('',#1352,#1353);
#1064=LINE('',#1354,#1355);
#1065=LINE('',#1356,#1357);
#1066=VERTEX_POINT('',#1358);
#1067=CIRCLE('',#1359,3.0);
#1068=LINE('',#1360,#1361);
#1069=VERTEX_POINT('',#1362);
#1070=LINE('',#1363,#1364);
#1071=LINE('',#1365,#1366);
#1072=VERTEX_POINT('',#1367);
#1073=CIRCLE('',#1368,3.0);
#1074=LINE('',#1369,#1370);
#1075=VERTEX_POINT('',#1371);
#1076=CIRCLE('',#1372,8.0);
#1077=LINE('',#1373,#1374);
#1078=VERTEX_POINT('',#1375);
#1079=VERTEX_POINT('',#1376);
#1080=LINE('',#1377,#1378);
#1081=VERTEX_POINT('',#1379);
#1082=CIRCLE('',#1380,4.0);
#1083=VERTEX_POINT('',#1381);
#1084=LINE('',#1382,#1383);
#1085=CIRCLE('',#1384,4.0);
#1086=CIRCLE('',#1385,4.0);
#1087=CIRCLE('',#1386,4.0);
#1088=VERTEX_POINT('',#1387);
#1089=LINE('',#1388,#1389);
#1090=VERTEX_POINT('',#1390);
#1091=LINE('',#1391,#1392);
#1092=LINE('',#1393,#1394);
#1093=VERTEX_POINT('',#1395);
#1094=CIRCLE('',#1396,20.0);
#1095=VERTEX_POINT('',#1397);
#1096=LINE('',#1398,#1399);
#1097=VERTEX_POINT('',#1400);
#1098=CIRCLE('',#1401,5.0);
#1099=LINE('',#1402,#1403);
#1100=VERTEX_POINT('',#1404);
#1101=VERTEX_POINT('',#1405);
#1102=CIRCLE('',#1406,12.5);
#1103=CIRCLE('',#1407,12.5);
#1104=VERTEX_POINT('',#1408);
#1105=CIRCLE('',#1409,3.0);
#1106=LINE('',#1410,#1411);
#1107=VERTEX_POINT('',#1412);
#1108=LINE('',#1413,#1414);
#1109=CIRCLE('',#1415,20.0);
#1110=VERTEX_POINT('',#1416);
#1111=CIRCLE('',#1417,16.0);
#1112=VERTEX_POINT('',#1418);
#1113=LINE('',#1419,#1420);
#1114=LINE('',#1421,#1422);
#1115=VERTEX_POINT('',#1423);
#1116=VERTEX_POINT('',#1424);
#1117=LINE('',#1425,#1426);
#1118=CIRCLE('',#1427,16.0);
#1119=LINE('',#1428,#1429);
#1120=VERTEX_POINT('',#1430);
#1121=LINE('',#1431,#1432);
#1122=CIRCLE('',#1433,5.0);
#1123=VERTEX_POINT('',#1434);
#1124=LINE('',#1435,#1436);
#1125=VERTEX_POINT('',#1437);
#1126=LINE('',#1438,#1439);
#1127=CIRCLE('',#1440,16.0);
#1128=LINE('',#1441,#1442);
#1129=VERTEX_POINT('',#1443);
#1130=LINE('',#1444,#1445);
#1131=VERTEX_POINT('',#1446);
#1132=LINE('',#1447,#1448);
#1133=CIRCLE('',#1449,8.0);
#1134=CIRCLE('',#1450,8.0);
#1135=VERTEX_POINT('',#1451);
#1136=LINE('',#1452,#1453);
#1137=LINE('',#1454,#1455);
#1138=LINE('',#1456,#1457);
#1139=VERTEX_POINT('',#1458);
#1140=CIRCLE('',#1459,5.0);
#1141=LINE('',#1460,#1461);
#1142=VERTEX_POINT('',#1462);
#1143=LINE('',#1463,#1464);
#1144=LINE('',#1465,#1466);
#1145=CIRCLE('',#1467,20.0);
#1146=VERTEX_POINT('',#1468);
#1147=LINE('',#1469,#1470);
#1148=VERTEX_POINT('',#1471);
#1149=CIRCLE('',#1472,12.5);
#1150=LINE('',#1473,#1474);
#1151=CIRCLE('',#1475,12.5);
#1152=CARTESIAN_POINT('',(-45.0,0.0,16.0));
#1153=CARTESIAN_POINT('',(-35.0,0.0,16.0));
#1154=AXIS2_PLACEMENT_3D('',#1476,#1477,#1478);
#1155=AXIS2_PLACEMENT_3D('',#1479,#1480,#1481);
#1156=CARTESIAN_POINT('',(-45.0,-8.0,16.0));
#1157=CARTESIAN_POINT('',(-45.0,0.0,16.0));
#1158=VECTOR('',#1482,1.0);
#1159=CARTESIAN_POINT('',(-35.0,-8.0,16.0));
#1160=AXIS2_PLACEMENT_3D('',#1483,#1484,#1485);
#1161=CARTESIAN_POINT('',(-35.0,-8.0,16.0));
#1162=VECTOR('',#1486,1.0);
#1163=AXIS2_PLACEMENT_3D('',#1487,#1488,#1489);
#1164=CARTESIAN_POINT('',(-24.0,-8.0,8.0));
#1165=CARTESIAN_POINT('',(-56.0,-8.0,8.0));
#1166=CARTESIAN_POINT('',(-24.0,-8.0,8.0));
#1167=VECTOR('',#1490,1.0);
#1168=CARTESIAN_POINT('',(-24.0,-8.0,16.0));
#1169=CARTESIAN_POINT('',(-24.0,-8.0,16.0));
#1170=VECTOR('',#1491,1.0);
#1171=CARTESIAN_POINT('',(-56.0,-8.0,16.0));
#1172=AXIS2_PLACEMENT_3D('',#1492,#1493,#1494);
#1173=CARTESIAN_POINT('',(-56.0,-8.0,8.0));
#1174=VECTOR('',#1495,1.0);
#1175=CARTESIAN_POINT('',(-56.0,0.0,16.0));
#1176=CARTESIAN_POINT('',(-56.0,0.0,16.0));
#1177=VECTOR('',#1496,1.0);
#1178=CARTESIAN_POINT('',(-56.0,0.0,8.0));
#1179=CARTESIAN_POINT('',(-56.0,0.0,16.0));
#1180=VECTOR('',#1497,1.0);
#1181=CARTESIAN_POINT('',(-56.0,-8.0,8.0));
#1182=VECTOR('',#1498,1.0);
#1183=CARTESIAN_POINT('',(-24.0,0.0,8.0));
#1184=CARTESIAN_POINT('',(-56.0,0.0,8.0));
#1185=VECTOR('',#1499,1.0);
#1186=CARTESIAN_POINT('',(-24.0,0.0,8.0));
#1187=VECTOR('',#1500,1.0);
#1188=CARTESIAN_POINT('',(-24.0,0.0,16.0));
#1189=CARTESIAN_POINT('',(-24.0,0.0,16.0));
#1190=VECTOR('',#1501,1.0);
#1191=AXIS2_PLACEMENT_3D('',#1502,#1503,#1504);
#1192=CARTESIAN_POINT('',(-24.0,0.0,8.0));
#1193=VECTOR('',#1505,1.0);
#1194=CARTESIAN_POINT('',(-64.0,0.0,0.0));
#1195=CARTESIAN_POINT('',(-80.0,16.0,0.0));
#1196=AXIS2_PLACEMENT_3D('',#1506,#1507,#1508);
#1197=CARTESIAN_POINT('',(-64.0,0.0,40.0));
#1198=CARTESIAN_POINT('',(-64.0,0.0,0.0));
#1199=VECTOR('',#1509,1.0);
#1200=CARTESIAN_POINT('',(-80.0,16.0,40.0));
#1201=AXIS2_PLACEMENT_3D('',#1510,#1511,#1512);
#1202=CARTESIAN_POINT('',(-80.0,16.0,40.0));
#1203=VECTOR('',#1513,1.0);
#1204=CARTESIAN_POINT('',(-80.0,43.0,0.0));
#1205=CARTESIAN_POINT('',(-80.0,43.0,0.0));
#1206=VECTOR('',#1514,1.0);
#1207=CARTESIAN_POINT('',(-80.0,108.0,40.0));
#1208=CARTESIAN_POINT('',(-80.0,16.0,40.0));
#1209=VECTOR('',#1515,1.0);
#1210=CARTESIAN_POINT('',(-80.0,108.0,0.0));
#1211=AXIS2_PLACEMENT_3D('',#1516,#1517,#1518);
#1212=CARTESIAN_POINT('',(-80.0,85.0,0.0));
#1213=CARTESIAN_POINT('',(-80.0,85.0,0.0));
#1214=VECTOR('',#1519,1.0);
#1215=CARTESIAN_POINT('',(-80.0,80.0,-5.0));
#1216=AXIS2_PLACEMENT_3D('',#1520,#1521,#1522);
#1217=CARTESIAN_POINT('',(-80.0,80.0,-16.0));
#1218=CARTESIAN_POINT('',(-80.0,80.0,-16.0));
#1219=VECTOR('',#1523,1.0);
#1220=CARTESIAN_POINT('',(-80.0,48.0,-16.0));
#1221=AXIS2_PLACEMENT_3D('',#1524,#1525,#1526);
#1222=CARTESIAN_POINT('',(-80.0,48.0,-5.0));
#1223=CARTESIAN_POINT('',(-80.0,48.0,-5.0));
#1224=VECTOR('',#1527,1.0);
#1225=AXIS2_PLACEMENT_3D('',#1528,#1529,#1530);
#1226=CARTESIAN_POINT('',(-80.0,56.0,-16.0));
#1227=CARTESIAN_POINT('',(-80.0,72.0,-16.0));
#1228=AXIS2_PLACEMENT_3D('',#1531,#1532,#1533);
#1229=AXIS2_PLACEMENT_3D('',#1534,#1535,#1536);
#1230=CARTESIAN_POINT('',(-80.0,97.5,20.0));
#1231=CARTESIAN_POINT('',(-80.0,122.5,20.0));
#1232=AXIS2_PLACEMENT_3D('',#1537,#1538,#1539);
#1233=AXIS2_PLACEMENT_3D('',#1540,#1541,#1542);
#1234=CARTESIAN_POINT('',(-64.0,80.0,-5.0));
#1235=CARTESIAN_POINT('',(-64.0,85.0,0.0));
#1236=AXIS2_PLACEMENT_3D('',#1543,#1544,#1545);
#1237=CARTESIAN_POINT('',(-72.0,80.0,-5.0));
#1238=CARTESIAN_POINT('',(-72.0,80.0,-5.0));
#1239=VECTOR('',#1546,1.0);
#1240=CARTESIAN_POINT('',(-80.0,80.0,-5.0));
#1241=VECTOR('',#1547,1.0);
#1242=CARTESIAN_POINT('',(-72.0,85.0,0.0));
#1243=CARTESIAN_POINT('',(-72.0,85.0,0.0));
#1244=VECTOR('',#1548,1.0);
#1245=CARTESIAN_POINT('',(-72.0,85.0,0.0));
#1246=VECTOR('',#1549,1.0);
#1247=CARTESIAN_POINT('',(-64.0,107.99999999893,0.0));
#1248=CARTESIAN_POINT('',(-64.0,108.0,0.0));
#1249=VECTOR('',#1550,1.0);
#1250=CARTESIAN_POINT('',(-72.0,108.0,-5.684341886E-14));
#1251=VECTOR('',#1551,1.0);
#1252=CARTESIAN_POINT('',(-64.0,93.7806506094541,34.0644979615193));
#1253=AXIS2_PLACEMENT_3D('',#1552,#1553,#1554);
#1254=CARTESIAN_POINT('',(-72.0,108.00000000212,40.0));
#1255=CARTESIAN_POINT('',(-80.0,108.0,40.0));
#1256=VECTOR('',#1555,1.0);
#1257=CARTESIAN_POINT('',(-72.0,93.78065061,34.06449796));
#1258=AXIS2_PLACEMENT_3D('',#1556,#1557,#1558);
#1259=CARTESIAN_POINT('',(-64.0,93.78065061,34.06449796));
#1260=VECTOR('',#1559,1.0);
#1261=CARTESIAN_POINT('',(-72.0,97.5,20.0));
#1262=CARTESIAN_POINT('',(-80.0,97.5,20.0));
#1263=VECTOR('',#1560,1.0);
#1264=CARTESIAN_POINT('',(-72.0,106.5,8.0));
#1265=AXIS2_PLACEMENT_3D('',#1561,#1562,#1563);
#1266=CARTESIAN_POINT('',(-72.0,113.5,8.0));
#1267=AXIS2_PLACEMENT_3D('',#1564,#1565,#1566);
#1268=CARTESIAN_POINT('',(-72.0,122.5,20.0));
#1269=AXIS2_PLACEMENT_3D('',#1567,#1568,#1569);
#1270=CARTESIAN_POINT('',(-72.0,122.5,20.0));
#1271=VECTOR('',#1570,1.0);
#1272=CARTESIAN_POINT('',(-72.0,106.5,32.0));
#1273=AXIS2_PLACEMENT_3D('',#1571,#1572,#1573);
#1274=AXIS2_PLACEMENT_3D('',#1574,#1575,#1576);
#1275=CARTESIAN_POINT('',(-16.0,80.0,8.0));
#1276=CARTESIAN_POINT('',(-16.0,68.0,8.0));
#1277=CARTESIAN_POINT('',(-16.0,68.0,8.0));
#1278=VECTOR('',#1577,1.0);
#1279=CARTESIAN_POINT('',(-64.0,80.0,8.0));
#1280=CARTESIAN_POINT('',(-64.0,80.0,8.0));
#1281=VECTOR('',#1578,1.0);
#1282=CARTESIAN_POINT('',(-64.0,68.0,8.0));
#1283=CARTESIAN_POINT('',(-64.0,68.0,8.0));
#1284=VECTOR('',#1579,1.0);
#1285=CARTESIAN_POINT('',(-72.0,68.0,8.0));
#1286=CARTESIAN_POINT('',(-64.0,68.0,8.0));
#1287=VECTOR('',#1580,1.0);
#1288=CARTESIAN_POINT('',(-72.0,25.797958970314,8.0));
#1289=CARTESIAN_POINT('',(-72.0,25.79795897,8.0));
#1290=VECTOR('',#1581,1.0);
#1291=CARTESIAN_POINT('',(-67.6363636382404,23.1257883416843,8.0));
#1292=AXIS2_PLACEMENT_3D('',#1582,#1583,#1584);
#1293=CARTESIAN_POINT('',(-56.8742116592441,12.3636363621601,8.0));
#1294=AXIS2_PLACEMENT_3D('',#1585,#1586,#1587);
#1295=CARTESIAN_POINT('',(-54.20204102968,8.0,8.0));
#1296=AXIS2_PLACEMENT_3D('',#1588,#1589,#1590);
#1297=CARTESIAN_POINT('',(-25.79795897031,8.0,8.0));
#1298=CARTESIAN_POINT('',(-25.79795897,8.0,8.0));
#1299=VECTOR('',#1591,1.0);
#1300=CARTESIAN_POINT('',(-23.1257883416814,12.3636363617541,8.0));
#1301=AXIS2_PLACEMENT_3D('',#1592,#1593,#1594);
#1302=CARTESIAN_POINT('',(-12.3636363621585,23.1257883407551,8.0));
#1303=AXIS2_PLACEMENT_3D('',#1595,#1596,#1597);
#1304=CARTESIAN_POINT('',(-8.0,25.797958970314,8.0));
#1305=AXIS2_PLACEMENT_3D('',#1598,#1599,#1600);
#1306=CARTESIAN_POINT('',(-8.0,68.0,8.0));
#1307=CARTESIAN_POINT('',(-8.0,68.0,8.0));
#1308=VECTOR('',#1601,1.0);
#1309=CARTESIAN_POINT('',(-16.0,68.0,8.0));
#1310=VECTOR('',#1602,1.0);
#1311=CARTESIAN_POINT('',(-72.0,25.797958970314,40.0));
#1312=CARTESIAN_POINT('',(-72.0,25.79795897,40.0));
#1313=VECTOR('',#1603,1.0);
#1314=CARTESIAN_POINT('',(-67.63636364,23.12578834,40.0));
#1315=AXIS2_PLACEMENT_3D('',#1604,#1605,#1606);
#1316=CARTESIAN_POINT('',(-67.63636364,23.12578834,40.0));
#1317=VECTOR('',#1607,1.0);
#1318=CARTESIAN_POINT('',(-72.0,68.0,8.0));
#1319=VECTOR('',#1608,1.0);
#1320=CARTESIAN_POINT('',(-72.0,108.0,40.0));
#1321=VECTOR('',#1609,1.0);
#1322=CARTESIAN_POINT('',(-64.0,93.78065061,34.06449796));
#1323=VECTOR('',#1610,1.0);
#1324=CARTESIAN_POINT('',(-64.0,106.5,32.0));
#1325=CARTESIAN_POINT('',(-72.0,106.5,32.0));
#1326=VECTOR('',#1611,1.0);
#1327=CARTESIAN_POINT('',(-64.0,113.5,8.0));
#1328=AXIS2_PLACEMENT_3D('',#1612,#1613,#1614);
#1329=CARTESIAN_POINT('',(-64.0,113.5,8.0));
#1330=VECTOR('',#1615,1.0);
#1331=AXIS2_PLACEMENT_3D('',#1616,#1617,#1618);
#1332=CARTESIAN_POINT('',(-60.0,16.0,0.0));
#1333=CARTESIAN_POINT('',(-60.0,16.0,40.0));
#1334=CARTESIAN_POINT('',(-60.0,16.0,0.0));
#1335=VECTOR('',#1619,1.0);
#1336=CARTESIAN_POINT('',(-68.0,16.0,0.0));
#1337=AXIS2_PLACEMENT_3D('',#1620,#1621,#1622);
#1338=CARTESIAN_POINT('',(-68.0,16.0,40.0));
#1339=CARTESIAN_POINT('',(-68.0,16.0,40.0));
#1340=VECTOR('',#1623,1.0);
#1341=AXIS2_PLACEMENT_3D('',#1624,#1625,#1626);
#1342=AXIS2_PLACEMENT_3D('',#1627,#1628,#1629);
#1343=AXIS2_PLACEMENT_3D('',#1630,#1631,#1632);
#1344=CARTESIAN_POINT('',(-56.87421166,12.36363636,40.0));
#1345=AXIS2_PLACEMENT_3D('',#1633,#1634,#1635);
#1346=CARTESIAN_POINT('',(-56.87421166,12.36363636,40.0));
#1347=VECTOR('',#1636,1.0);
#1348=CARTESIAN_POINT('',(-16.0,0.0,0.0));
#1349=CARTESIAN_POINT('',(-16.0,0.0,0.0));
#1350=VECTOR('',#1637,1.0);
#1351=CARTESIAN_POINT('',(-16.0,0.0,40.0));
#1352=CARTESIAN_POINT('',(-16.0,0.0,0.0));
#1353=VECTOR('',#1638,1.0);
#1354=CARTESIAN_POINT('',(-16.0,0.0,40.0));
#1355=VECTOR('',#1639,1.0);
#1356=CARTESIAN_POINT('',(-64.0,80.0,-5.0));
#1357=VECTOR('',#1640,1.0);
#1358=CARTESIAN_POINT('',(-54.20204103,8.0,40.0));
#1359=AXIS2_PLACEMENT_3D('',#1641,#1642,#1643);
#1360=CARTESIAN_POINT('',(-54.20204103,8.0,40.0));
#1361=VECTOR('',#1644,1.0);
#1362=CARTESIAN_POINT('',(-25.79795897,8.0,40.0));
#1363=CARTESIAN_POINT('',(-54.20204103,8.0,40.0));
#1364=VECTOR('',#1645,1.0);
#1365=CARTESIAN_POINT('',(-25.79795897,8.0,40.0));
#1366=VECTOR('',#1646,1.0);
#1367=CARTESIAN_POINT('',(-23.12578834,12.36363636,40.0));
#1368=AXIS2_PLACEMENT_3D('',#1647,#1648,#1649);
#1369=CARTESIAN_POINT('',(-23.12578834,12.36363636,40.0));
#1370=VECTOR('',#1650,1.0);
#1371=CARTESIAN_POINT('',(-12.36363636,23.12578834,40.0));
#1372=AXIS2_PLACEMENT_3D('',#1651,#1652,#1653);
#1373=CARTESIAN_POINT('',(-12.36363636,23.12578834,40.0));
#1374=VECTOR('',#1654,1.0);
#1375=CARTESIAN_POINT('',(-12.0,16.0,0.0));
#1376=CARTESIAN_POINT('',(-12.0,16.0,40.0));
#1377=CARTESIAN_POINT('',(-12.0,16.0,0.0));
#1378=VECTOR('',#1655,1.0);
#1379=CARTESIAN_POINT('',(-20.0,16.0,0.0));
#1380=AXIS2_PLACEMENT_3D('',#1656,#1657,#1658);
#1381=CARTESIAN_POINT('',(-20.0,16.0,40.0));
#1382=CARTESIAN_POINT('',(-20.0,16.0,40.0));
#1383=VECTOR('',#1659,1.0);
#1384=AXIS2_PLACEMENT_3D('',#1660,#1661,#1662);
#1385=AXIS2_PLACEMENT_3D('',#1663,#1664,#1665);
#1386=AXIS2_PLACEMENT_3D('',#1666,#1667,#1668);
#1387=CARTESIAN_POINT('',(-8.0,93.78065061,34.06449796));
#1388=CARTESIAN_POINT('',(-8.0,93.78065061,34.06449796));
#1389=VECTOR('',#1669,1.0);
#1390=CARTESIAN_POINT('',(-16.0,93.7806506114946,34.0644979615111));
#1391=CARTESIAN_POINT('',(-8.0,93.78065061,34.06449796));
#1392=VECTOR('',#1670,1.0);
#1393=CARTESIAN_POINT('',(-16.0,93.78065061,34.06449796));
#1394=VECTOR('',#1671,1.0);
#1395=CARTESIAN_POINT('',(-16.0,107.99999999787,0.0));
#1396=AXIS2_PLACEMENT_3D('',#1672,#1673,#1674);
#1397=CARTESIAN_POINT('',(-16.0,85.0,0.0));
#1398=CARTESIAN_POINT('',(-16.0,108.0,0.0));
#1399=VECTOR('',#1675,1.0);
#1400=CARTESIAN_POINT('',(-16.0,80.0,-5.0));
#1401=AXIS2_PLACEMENT_3D('',#1676,#1677,#1678);
#1402=CARTESIAN_POINT('',(-16.0,80.0,8.0));
#1403=VECTOR('',#1679,1.0);
#1404=CARTESIAN_POINT('',(-16.0,106.5,32.0));
#1405=CARTESIAN_POINT('',(-16.0,113.5,8.0));
#1406=AXIS2_PLACEMENT_3D('',#1680,#1681,#1682);
#1407=AXIS2_PLACEMENT_3D('',#1683,#1684,#1685);
#1408=CARTESIAN_POINT('',(-8.0,25.79795897,40.0));
#1409=AXIS2_PLACEMENT_3D('',#1686,#1687,#1688);
#1410=CARTESIAN_POINT('',(-8.0,25.79795897,40.0));
#1411=VECTOR('',#1689,1.0);
#1412=CARTESIAN_POINT('',(-8.0,108.0,40.0));
#1413=CARTESIAN_POINT('',(-8.0,25.79795897,40.0));
#1414=VECTOR('',#1690,1.0);
#1415=AXIS2_PLACEMENT_3D('',#1691,#1692,#1693);
#1416=CARTESIAN_POINT('',(0.0,16.0,40.0));
#1417=AXIS2_PLACEMENT_3D('',#1694,#1695,#1696);
#1418=CARTESIAN_POINT('',(0.0,108.0,40.0));
#1419=CARTESIAN_POINT('',(0.0,108.0,40.0));
#1420=VECTOR('',#1697,1.0);
#1421=CARTESIAN_POINT('',(-8.0,108.0,40.0));
#1422=VECTOR('',#1698,1.0);
#1423=CARTESIAN_POINT('',(0.0,16.0,0.0));
#1424=CARTESIAN_POINT('',(0.0,43.0,0.0));
#1425=CARTESIAN_POINT('',(0.0,16.0,0.0));
#1426=VECTOR('',#1699,1.0);
#1427=AXIS2_PLACEMENT_3D('',#1700,#1701,#1702);
#1428=CARTESIAN_POINT('',(0.0,43.0,0.0));
#1429=VECTOR('',#1703,1.0);
#1430=CARTESIAN_POINT('',(0.0,48.0,-5.0));
#1431=CARTESIAN_POINT('',(-80.0,48.0,-5.0));
#1432=VECTOR('',#1704,1.0);
#1433=AXIS2_PLACEMENT_3D('',#1705,#1706,#1707);
#1434=CARTESIAN_POINT('',(0.0,48.0,-16.0));
#1435=CARTESIAN_POINT('',(-80.0,48.0,-16.0));
#1436=VECTOR('',#1708,1.0);
#1437=CARTESIAN_POINT('',(0.0,80.0,-16.0));
#1438=CARTESIAN_POINT('',(-80.0,80.0,-16.0));
#1439=VECTOR('',#1709,1.0);
#1440=AXIS2_PLACEMENT_3D('',#1710,#1711,#1712);
#1441=CARTESIAN_POINT('',(0.0,48.0,-5.0));
#1442=VECTOR('',#1713,1.0);
#1443=CARTESIAN_POINT('',(0.0,72.0,-16.0));
#1444=CARTESIAN_POINT('',(0.0,72.0,-16.0));
#1445=VECTOR('',#1714,1.0);
#1446=CARTESIAN_POINT('',(0.0,56.0,-16.0));
#1447=CARTESIAN_POINT('',(-80.0,56.0,-16.0));
#1448=VECTOR('',#1715,1.0);
#1449=AXIS2_PLACEMENT_3D('',#1716,#1717,#1718);
#1450=AXIS2_PLACEMENT_3D('',#1719,#1720,#1721);
#1451=CARTESIAN_POINT('',(0.0,80.0,-5.0));
#1452=CARTESIAN_POINT('',(-8.0,80.0,-5.0));
#1453=VECTOR('',#1722,1.0);
#1454=CARTESIAN_POINT('',(0.0,80.0,-16.0));
#1455=VECTOR('',#1723,1.0);
#1456=CARTESIAN_POINT('',(0.0,16.0,40.0));
#1457=VECTOR('',#1724,1.0);
#1458=CARTESIAN_POINT('',(0.0,85.0,0.0));
#1459=AXIS2_PLACEMENT_3D('',#1725,#1726,#1727);
#1460=CARTESIAN_POINT('',(-16.0,85.0,0.0));
#1461=VECTOR('',#1728,1.0);
#1462=CARTESIAN_POINT('',(0.0,108.0,0.0));
#1463=CARTESIAN_POINT('',(-16.0,108.0,0.0));
#1464=VECTOR('',#1729,1.0);
#1465=CARTESIAN_POINT('',(0.0,85.0,0.0));
#1466=VECTOR('',#1730,1.0);
#1467=AXIS2_PLACEMENT_3D('',#1731,#1732,#1733);
#1468=CARTESIAN_POINT('',(0.0,106.5,32.0));
#1469=CARTESIAN_POINT('',(-16.0,106.5,32.0));
#1470=VECTOR('',#1734,1.0);
#1471=CARTESIAN_POINT('',(0.0,113.5,8.0));
#1472=AXIS2_PLACEMENT_3D('',#1735,#1736,#1737);
#1473=CARTESIAN_POINT('',(0.0,113.5,8.0));
#1474=VECTOR('',#1738,1.0);
#1475=AXIS2_PLACEMENT_3D('',#1739,#1740,#1741);
#1476=CARTESIAN_POINT('',(-40.0,0.0,16.0));
#1477=DIRECTION('',(0.0,1.0,0.0));
#1478=DIRECTION('',(-1.0,0.0,-1.421085472E-15));
#1479=CARTESIAN_POINT('',(-40.0,0.0,16.0));
#1480=DIRECTION('',(-0.0,1.0,0.0));
#1481=DIRECTION('',(1.0,0.0,0.0));
#1482=DIRECTION('',(-0.0,1.0,-0.0));
#1483=CARTESIAN_POINT('',(-40.0,-8.0,16.0));
#1484=DIRECTION('',(-0.0,1.0,0.0));
#1485=DIRECTION('',(1.0,0.0,0.0));
#1486=DIRECTION('',(-0.0,-1.0,-0.0));
#1487=CARTESIAN_POINT('',(-40.0,-8.0,16.0));
#1488=DIRECTION('',(0.0,1.0,-0.0));
#1489=DIRECTION('',(-1.0,0.0,0.0));
#1490=DIRECTION('',(-1.0,0.0,0.0));
#1491=DIRECTION('',(0.0,0.0,-1.0));
#1492=CARTESIAN_POINT('',(-40.0,-8.0,16.0));
#1493=DIRECTION('',(0.0,1.0,-0.0));
#1494=DIRECTION('',(-1.0,0.0,2.220446049E-16));
#1495=DIRECTION('',(0.0,0.0,1.0));
#1496=DIRECTION('',(0.0,-1.0,0.0));
#1497=DIRECTION('',(-0.0,-0.0,1.0));
#1498=DIRECTION('',(0.0,1.0,0.0));
#1499=DIRECTION('',(-1.0,-0.0,-0.0));
#1500=DIRECTION('',(-0.0,1.0,-0.0));
#1501=DIRECTION('',(0.0,-1.0,0.0));
#1502=CARTESIAN_POINT('',(-40.0,0.0,16.0));
#1503=DIRECTION('',(-0.0,1.0,0.0));
#1504=DIRECTION('',(1.0,0.0,0.0));
#1505=DIRECTION('',(-0.0,-0.0,-1.0));
#1506=CARTESIAN_POINT('',(-64.0,16.0,0.0));
#1507=DIRECTION('',(-0.0,0.0,-1.0));
#1508=DIRECTION('',(-1.0,5.551115123E-16,0.0));
#1509=DIRECTION('',(-0.0,-0.0,-1.0));
#1510=CARTESIAN_POINT('',(-64.0,16.0,40.0));
#1511=DIRECTION('',(-0.0,0.0,1.0));
#1512=DIRECTION('',(0.0,-1.0,0.0));
#1513=DIRECTION('',(-0.0,-0.0,1.0));
#1514=DIRECTION('',(-0.0,1.0,-0.0));
#1515=DIRECTION('',(-0.0,-1.0,-0.0));
#1516=CARTESIAN_POINT('',(-80.0,108.0,20.0));
#1517=DIRECTION('',(1.0,-0.0,0.0));
#1518=DIRECTION('',(0.0,0.0,-1.0));
#1519=DIRECTION('',(0.0,1.0,0.0));
#1520=CARTESIAN_POINT('',(-80.0,85.0,-5.0));
#1521=DIRECTION('',(-1.0,0.0,0.0));
#1522=DIRECTION('',(0.0,-1.0,1.776356839E-16));
#1523=DIRECTION('',(0.0,0.0,1.0));
#1524=CARTESIAN_POINT('',(-80.0,64.0,-16.0));
#1525=DIRECTION('',(1.0,0.0,0.0));
#1526=DIRECTION('',(0.0,-1.0,0.0));
#1527=DIRECTION('',(0.0,0.0,-1.0));
#1528=CARTESIAN_POINT('',(-80.0,43.0,-5.0));
#1529=DIRECTION('',(-1.0,0.0,0.0));
#1530=DIRECTION('',(0.0,0.0,1.0));
#1531=CARTESIAN_POINT('',(-80.0,64.0,-16.0));
#1532=DIRECTION('',(-1.0,0.0,0.0));
#1533=DIRECTION('',(0.0,-1.0,0.0));
#1534=CARTESIAN_POINT('',(-80.0,64.0,-16.0));
#1535=DIRECTION('',(-1.0,0.0,0.0));
#1536=DIRECTION('',(0.0,1.0,0.0));
#1537=CARTESIAN_POINT('',(-80.0,110.0,20.0));
#1538=DIRECTION('',(-1.0,-0.0,0.0));
#1539=DIRECTION('',(0.0,-1.0,-5.684341886E-16));
#1540=CARTESIAN_POINT('',(-80.0,110.0,20.0));
#1541=DIRECTION('',(-1.0,0.0,0.0));
#1542=DIRECTION('',(0.0,1.0,0.0));
#1543=CARTESIAN_POINT('',(-64.0,85.0,-5.0));
#1544=DIRECTION('',(-1.0,-0.0,0.0));
#1545=DIRECTION('',(0.0,0.0,1.0));
#1546=DIRECTION('',(1.0,0.0,0.0));
#1547=DIRECTION('',(1.0,0.0,0.0));
#1548=DIRECTION('',(-1.0,-0.0,-0.0));
#1549=DIRECTION('',(-1.0,-0.0,-0.0));
#1550=DIRECTION('',(-0.0,1.0,-0.0));
#1551=DIRECTION('',(-1.0,-0.0,-7.1054273575E-15));
#1552=CARTESIAN_POINT('',(-64.0,108.0,20.0));
#1553=DIRECTION('',(1.0,-0.0,0.0));
#1554=DIRECTION('',(0.0,0.0,-1.0));
#1555=DIRECTION('',(-1.0,-0.0,-0.0));
#1556=CARTESIAN_POINT('',(-72.0,108.0,20.0));
#1557=DIRECTION('',(-1.0,-0.0,0.0));
#1558=DIRECTION('',(0.0,0.0,1.0));
#1559=DIRECTION('',(-1.0,0.0,0.0));
#1560=DIRECTION('',(-1.0,-0.0,-0.0));
#1561=CARTESIAN_POINT('',(-72.0,110.0,20.0));
#1562=DIRECTION('',(-1.0,0.0,0.0));
#1563=DIRECTION('',(0.0,0.28,-0.96));
#1564=CARTESIAN_POINT('',(-72.0,110.0,20.0));
#1565=DIRECTION('',(-1.0,0.0,0.0));
#1566=DIRECTION('',(0.0,0.28,-0.96));
#1567=CARTESIAN_POINT('',(-72.0,110.0,20.0));
#1568=DIRECTION('',(-1.0,0.0,0.0));
#1569=DIRECTION('',(0.0,1.0,1.421085472E-15));
#1570=DIRECTION('',(1.0,-0.0,-0.0));
#1571=CARTESIAN_POINT('',(-72.0,110.0,20.0));
#1572=DIRECTION('',(-1.0,0.0,0.0));
#1573=DIRECTION('',(0.0,-0.28,0.96));
#1574=CARTESIAN_POINT('',(-72.0,110.0,20.0));
#1575=DIRECTION('',(-1.0,-0.0,0.0));
#1576=DIRECTION('',(0.0,-1.0,-2.842170943E-16));
#1577=DIRECTION('',(-0.0,-1.0,-0.0));
#1578=DIRECTION('',(1.0,0.0,0.0));
#1579=DIRECTION('',(0.0,1.0,0.0));
#1580=DIRECTION('',(1.0,-0.0,-0.0));
#1581=DIRECTION('',(0.0,1.0,0.0));
#1582=CARTESIAN_POINT('',(-69.0,25.79795897,8.0));
#1583=DIRECTION('',(0.0,0.0,-1.0));
#1584=DIRECTION('',(0.454545454522087,-0.890723542842171,0.0));
#1585=CARTESIAN_POINT('',(-64.0,16.0,8.0));
#1586=DIRECTION('',(-0.0,0.0,1.0));
#1587=DIRECTION('',(0.890723542842171,-0.454545454522087,0.0));
#1588=CARTESIAN_POINT('',(-54.20204103,11.0,8.0));
#1589=DIRECTION('',(0.0,0.0,-1.0));
#1590=DIRECTION('',(0.0,-1.0,0.0));
#1591=DIRECTION('',(-1.0,0.0,0.0));
#1592=CARTESIAN_POINT('',(-25.79795897,11.0,8.0));
#1593=DIRECTION('',(-0.0,0.0,-1.0));
#1594=DIRECTION('',(-1.184237893E-15,-1.0,0.0));
#1595=CARTESIAN_POINT('',(-16.0,16.0,8.0));
#1596=DIRECTION('',(0.0,-0.0,1.0));
#1597=DIRECTION('',(0.454545454522087,0.890723542842171,0.0));
#1598=CARTESIAN_POINT('',(-11.0,25.79795897,8.0));
#1599=DIRECTION('',(0.0,0.0,-1.0));
#1600=DIRECTION('',(1.0,0.0,0.0));
#1601=DIRECTION('',(0.0,-1.0,0.0));
#1602=DIRECTION('',(1.0,0.0,0.0));
#1603=DIRECTION('',(0.0,0.0,-1.0));
#1604=CARTESIAN_POINT('',(-69.0,25.79795897,40.0));
#1605=DIRECTION('',(0.0,0.0,-1.0));
#1606=DIRECTION('',(0.454545454522087,-0.890723542842171,0.0));
#1607=DIRECTION('',(-0.0,-0.0,1.0));
#1608=DIRECTION('',(-0.0,-0.703224898185225,-0.710967469419227));
#1609=DIRECTION('',(-0.0,1.0,-0.0));
#1610=DIRECTION('',(0.0,-0.703224898185225,-0.710967469419227));
#1611=DIRECTION('',(-1.0,-0.0,-0.0));
#1612=CARTESIAN_POINT('',(-64.0,110.0,20.0));
#1613=DIRECTION('',(-1.0,0.0,0.0));
#1614=DIRECTION('',(0.0,0.28,-0.96));
#1615=DIRECTION('',(1.0,-0.0,-0.0));
#1616=CARTESIAN_POINT('',(-64.0,110.0,20.0));
#1617=DIRECTION('',(-1.0,0.0,0.0));
#1618=DIRECTION('',(0.0,-0.28,0.96));
#1619=DIRECTION('',(0.0,0.0,1.0));
#1620=CARTESIAN_POINT('',(-64.0,16.0,0.0));
#1621=DIRECTION('',(0.0,-0.0,1.0));
#1622=DIRECTION('',(1.0,0.0,0.0));
#1623=DIRECTION('',(0.0,0.0,-1.0));
#1624=CARTESIAN_POINT('',(-64.0,16.0,40.0));
#1625=DIRECTION('',(-0.0,0.0,-1.0));
#1626=DIRECTION('',(-1.0,0.0,0.0));
#1627=CARTESIAN_POINT('',(-64.0,16.0,0.0));
#1628=DIRECTION('',(-0.0,0.0,1.0));
#1629=DIRECTION('',(-1.0,-8.881784197E-16,-0.0));
#1630=CARTESIAN_POINT('',(-64.0,16.0,40.0));
#1631=DIRECTION('',(0.0,0.0,-1.0));
#1632=DIRECTION('',(1.0,0.0,0.0));
#1633=CARTESIAN_POINT('',(-64.0,16.0,40.0));
#1634=DIRECTION('',(0.0,-0.0,1.0));
#1635=DIRECTION('',(-0.454545454522087,0.890723542842171,0.0));
#1636=DIRECTION('',(-0.0,-0.0,1.0));
#1637=DIRECTION('',(-1.0,0.0,0.0));
#1638=DIRECTION('',(-0.0,-0.0,-1.0));
#1639=DIRECTION('',(1.0,-0.0,-0.0));
#1640=DIRECTION('',(0.0,0.0,1.0));
#1641=CARTESIAN_POINT('',(-54.20204103,11.0,40.0));
#1642=DIRECTION('',(0.0,0.0,-1.0));
#1643=DIRECTION('',(0.0,-1.0,0.0));
#1644=DIRECTION('',(-0.0,-0.0,1.0));
#1645=DIRECTION('',(-1.0,-0.0,-0.0));
#1646=DIRECTION('',(-0.0,-0.0,1.0));
#1647=CARTESIAN_POINT('',(-25.79795897,11.0,40.0));
#1648=DIRECTION('',(0.0,-0.0,-1.0));
#1649=DIRECTION('',(0.0,-1.0,0.0));
#1650=DIRECTION('',(-0.0,-0.0,1.0));
#1651=CARTESIAN_POINT('',(-16.0,16.0,40.0));
#1652=DIRECTION('',(-0.0,0.0,1.0));
#1653=DIRECTION('',(-0.890723542842171,-0.454545454522087,-0.0));
#1654=DIRECTION('',(-0.0,-0.0,1.0));
#1655=DIRECTION('',(0.0,0.0,1.0));
#1656=CARTESIAN_POINT('',(-16.0,16.0,0.0));
#1657=DIRECTION('',(0.0,-0.0,1.0));
#1658=DIRECTION('',(1.0,0.0,0.0));
#1659=DIRECTION('',(0.0,0.0,-1.0));
#1660=CARTESIAN_POINT('',(-16.0,16.0,40.0));
#1661=DIRECTION('',(-0.0,0.0,-1.0));
#1662=DIRECTION('',(-1.0,0.0,0.0));
#1663=CARTESIAN_POINT('',(-16.0,16.0,0.0));
#1664=DIRECTION('',(-0.0,0.0,1.0));
#1665=DIRECTION('',(-1.0,-8.881784197E-16,-0.0));
#1666=CARTESIAN_POINT('',(-16.0,16.0,40.0));
#1667=DIRECTION('',(0.0,0.0,-1.0));
#1668=DIRECTION('',(1.0,0.0,0.0));
#1669=DIRECTION('',(0.0,-0.703224898185225,-0.710967469419227));
#1670=DIRECTION('',(1.0,-0.0,-0.0));
#1671=DIRECTION('',(-0.0,0.703224898185225,0.710967469419227));
#1672=CARTESIAN_POINT('',(-16.0,108.0,20.0));
#1673=DIRECTION('',(1.0,0.0,-0.0));
#1674=DIRECTION('',(0.0,-0.710967469402321,0.703224898202317));
#1675=DIRECTION('',(-0.0,1.0,-0.0));
#1676=CARTESIAN_POINT('',(-16.0,85.0,-5.0));
#1677=DIRECTION('',(-1.0,0.0,0.0));
#1678=DIRECTION('',(0.0,-1.0,0.0));
#1679=DIRECTION('',(0.0,0.0,-1.0));
#1680=CARTESIAN_POINT('',(-16.0,110.0,20.0));
#1681=DIRECTION('',(-1.0,0.0,0.0));
#1682=DIRECTION('',(0.0,-0.28,0.96));
#1683=CARTESIAN_POINT('',(-16.0,110.0,20.0));
#1684=DIRECTION('',(-1.0,0.0,0.0));
#1685=DIRECTION('',(0.0,0.28,-0.96));
#1686=CARTESIAN_POINT('',(-11.0,25.79795897,40.0));
#1687=DIRECTION('',(0.0,0.0,-1.0));
#1688=DIRECTION('',(1.0,1.184237893E-15,0.0));
#1689=DIRECTION('',(-0.0,-0.0,1.0));
#1690=DIRECTION('',(-0.0,-1.0,-0.0));
#1691=CARTESIAN_POINT('',(-8.0,108.0,20.0));
#1692=DIRECTION('',(-1.0,-0.0,0.0));
#1693=DIRECTION('',(0.0,0.0,1.0));
#1694=CARTESIAN_POINT('',(-16.0,16.0,40.0));
#1695=DIRECTION('',(-0.0,0.0,-1.0));
#1696=DIRECTION('',(-2.220446049E-16,-1.0,0.0));
#1697=DIRECTION('',(0.0,-1.0,0.0));
#1698=DIRECTION('',(1.0,0.0,0.0));
#1699=DIRECTION('',(0.0,1.0,0.0));
#1700=CARTESIAN_POINT('',(-16.0,16.0,0.0));
#1701=DIRECTION('',(-0.0,0.0,1.0));
#1702=DIRECTION('',(1.0,-2.220446049E-16,0.0));
#1703=DIRECTION('',(-1.0,0.0,0.0));
#1704=DIRECTION('',(-1.0,-0.0,-0.0));
#1705=CARTESIAN_POINT('',(0.0,43.0,-5.0));
#1706=DIRECTION('',(-1.0,0.0,0.0));
#1707=DIRECTION('',(0.0,0.0,1.0));
#1708=DIRECTION('',(1.0,0.0,0.0));
#1709=DIRECTION('',(-1.0,-0.0,-0.0));
#1710=CARTESIAN_POINT('',(0.0,64.0,-16.0));
#1711=DIRECTION('',(1.0,0.0,0.0));
#1712=DIRECTION('',(0.0,-1.0,0.0));
#1713=DIRECTION('',(0.0,0.0,-1.0));
#1714=DIRECTION('',(1.0,-0.0,-0.0));
#1715=DIRECTION('',(-1.0,-0.0,-0.0));
#1716=CARTESIAN_POINT('',(0.0,64.0,-16.0));
#1717=DIRECTION('',(-1.0,0.0,0.0));
#1718=DIRECTION('',(0.0,1.0,0.0));
#1719=CARTESIAN_POINT('',(0.0,64.0,-16.0));
#1720=DIRECTION('',(-1.0,0.0,0.0));
#1721=DIRECTION('',(0.0,-1.0,2.220446049E-16));
#1722=DIRECTION('',(-1.0,-0.0,-0.0));
#1723=DIRECTION('',(0.0,0.0,1.0));
#1724=DIRECTION('',(0.0,0.0,-1.0));
#1725=CARTESIAN_POINT('',(0.0,85.0,-5.0));
#1726=DIRECTION('',(-1.0,0.0,0.0));
#1727=DIRECTION('',(0.0,-1.0,1.776356839E-16));
#1728=DIRECTION('',(-1.0,-0.0,-0.0));
#1729=DIRECTION('',(-1.0,-0.0,-0.0));
#1730=DIRECTION('',(0.0,1.0,0.0));
#1731=CARTESIAN_POINT('',(0.0,108.0,20.0));
#1732=DIRECTION('',(1.0,-0.0,0.0));
#1733=DIRECTION('',(0.0,0.0,-1.0));
#1734=DIRECTION('',(-1.0,-0.0,-0.0));
#1735=CARTESIAN_POINT('',(0.0,110.0,20.0));
#1736=DIRECTION('',(-1.0,0.0,0.0));
#1737=DIRECTION('',(0.0,0.28,-0.96));
#1738=DIRECTION('',(1.0,-0.0,-0.0));
#1739=CARTESIAN_POINT('',(0.0,110.0,20.0));
#1740=DIRECTION('',(-1.0,0.0,0.0));
#1741=DIRECTION('',(0.0,-0.28,0.96));
ENDSEC;
END-ISO-10303-21;
