ISO-10303-21;
HEADER;
FILE_DESCRIPTION(('STEP AP214'),'1');
FILE_NAME('B49.step','2020-02-12T14:56:57',('Cubit 15.2'),(' '),'Spatial InterOp 3D',' ',' ');
FILE_SCHEMA(('automotive_design'));
ENDSEC;
DATA;
#1=PRODUCT_DEFINITION_CONTEXT('',#9,'design');
#2=APPLICATION_PROTOCOL_DEFINITION('INTERNATIONAL STANDARD','automotive_design',1994,#9);
#3=PRODUCT_CATEGORY_RELATIONSHIP('NONE','NONE',#10,#11);
#4=SHAPE_DEFINITION_REPRESENTATION(#12,#13);
#5= (GEOMETRIC_REPRESENTATION_CONTEXT(3)GLOBAL_UNCERTAINTY_ASSIGNED_CONTEXT((#16))GLOBAL_UNIT_ASSIGNED_CONTEXT((#18,#19,#20))REPRESENTATION_CONTEXT('NONE','WORKSPACE'));
#9=APPLICATION_CONTEXT(' ');
#10=PRODUCT_CATEGORY('part','NONE');
#11=PRODUCT_RELATED_PRODUCT_CATEGORY('detail',' ',(#22));
#12=PRODUCT_DEFINITION_SHAPE('NONE','NONE',#23);
#13=ADVANCED_BREP_SHAPE_REPRESENTATION('1',(#24,#25),#5);
#16=UNCERTAINTY_MEASURE_WITH_UNIT(LENGTH_MEASURE(1.0E-06),#18,'','');
#18= (CONVERSION_BASED_UNIT('MILLIMETRE',#28)LENGTH_UNIT()NAMED_UNIT(#31));
#19= (NAMED_UNIT(#33)PLANE_ANGLE_UNIT()SI_UNIT($,.RADIAN.));
#20= (NAMED_UNIT(#33)SOLID_ANGLE_UNIT()SI_UNIT($,.STERADIAN.));
#22=PRODUCT('1','1','PART-1-DESC',(#39));
#23=PRODUCT_DEFINITION('NONE','NONE',#40,#1);
#24=MANIFOLD_SOLID_BREP('1',#41);
#25=AXIS2_PLACEMENT_3D('',#42,#43,#44);
#28=LENGTH_MEASURE_WITH_UNIT(LENGTH_MEASURE(1.0),#45);
#31=DIMENSIONAL_EXPONENTS(1.0,0.0,0.0,0.0,0.0,0.0,0.0);
#33=DIMENSIONAL_EXPONENTS(0.0,0.0,0.0,0.0,0.0,0.0,0.0);
#39=PRODUCT_CONTEXT('',#9,'mechanical');
#40=PRODUCT_DEFINITION_FORMATION_WITH_SPECIFIED_SOURCE(' ','NONE',#22,.NOT_KNOWN.);
#41=CLOSED_SHELL('',(#46,#47,#48,#49,#50,#51,#52,#53));
#42=CARTESIAN_POINT('',(0.0,0.0,0.0));
#43=DIRECTION('',(0.0,0.0,1.0));
#44=DIRECTION('',(1.0,0.0,0.0));
#45= (NAMED_UNIT(#31)LENGTH_UNIT()SI_UNIT(.MILLI.,.METRE.));
#46=ADVANCED_FACE('',(#55),#56,.T.);
#47=ADVANCED_FACE('',(#57),#58,.T.);
#48=ADVANCED_FACE('',(#59),#60,.F.);
#49=ADVANCED_FACE('',(#61),#62,.F.);
#50=ADVANCED_FACE('',(#63),#64,.T.);
#51=ADVANCED_FACE('',(#65),#66,.F.);
#52=ADVANCED_FACE('',(#67),#68,.F.);
#53=ADVANCED_FACE('',(#69),#70,.F.);
#55=FACE_OUTER_BOUND('',#71,.T.);
#56=PLANE('',#72);
#57=FACE_OUTER_BOUND('',#73,.T.);
#58=PLANE('',#74);
#59=FACE_OUTER_BOUND('',#75,.T.);
#60=PLANE('',#76);
#61=FACE_OUTER_BOUND('',#77,.T.);
#62=PLANE('',#78);
#63=FACE_OUTER_BOUND('',#79,.T.);
#64=PLANE('',#80);
#65=FACE_OUTER_BOUND('',#81,.T.);
#66=PLANE('',#82);
#67=FACE_OUTER_BOUND('',#83,.T.);
#68=PLANE('',#84);
#69=FACE_OUTER_BOUND('',#85,.T.);
#70=PLANE('',#86);
#71=EDGE_LOOP('',(#87,#88,#89,#90));
#72=AXIS2_PLACEMENT_3D('',#91,#92,#93);
#73=EDGE_LOOP('',(#94,#95,#96));
#74=AXIS2_PLACEMENT_3D('',#97,#98,#99);
#75=EDGE_LOOP('',(#100,#101,#102,#103,#104,#105));
#76=AXIS2_PLACEMENT_3D('',#106,#107,#108);
#77=EDGE_LOOP('',(#109,#110,#111,#112,#113));
#78=AXIS2_PLACEMENT_3D('',#114,#115,#116);
#79=EDGE_LOOP('',(#117,#118,#119,#120,#121,#122));
#80=AXIS2_PLACEMENT_3D('',#123,#124,#125);
#81=EDGE_LOOP('',(#126,#127,#128,#129));
#82=AXIS2_PLACEMENT_3D('',#130,#131,#132);
#83=EDGE_LOOP('',(#133,#134,#135,#136));
#84=AXIS2_PLACEMENT_3D('',#137,#138,#139);
#85=EDGE_LOOP('',(#140,#141,#142,#143));
#86=AXIS2_PLACEMENT_3D('',#144,#145,#146);
#87=ORIENTED_EDGE('',*,*,#147,.F.);
#88=ORIENTED_EDGE('',*,*,#148,.F.);
#89=ORIENTED_EDGE('',*,*,#149,.F.);
#90=ORIENTED_EDGE('',*,*,#150,.F.);
#91=CARTESIAN_POINT('',(2.3529523872437,-5.0,1.58518543427733));
#92=DIRECTION('',(0.258819045102521,0.0,0.965925826289068));
#93=DIRECTION('',(0.965925826289068,0.0,-0.258819045102521));
#94=ORIENTED_EDGE('',*,*,#151,.F.);
#95=ORIENTED_EDGE('',*,*,#152,.F.);
#96=ORIENTED_EDGE('',*,*,#148,.T.);
#97=CARTESIAN_POINT('',(3.0,0.0,4.0));
#98=DIRECTION('',(0.0,-1.0,-0.0));
#99=DIRECTION('',(-0.258819045102521,0.0,-0.965925826289068));
#100=ORIENTED_EDGE('',*,*,#151,.T.);
#101=ORIENTED_EDGE('',*,*,#147,.T.);
#102=ORIENTED_EDGE('',*,*,#153,.T.);
#103=ORIENTED_EDGE('',*,*,#154,.F.);
#104=ORIENTED_EDGE('',*,*,#155,.F.);
#105=ORIENTED_EDGE('',*,*,#156,.F.);
#106=CARTESIAN_POINT('',(5.0,0.0,0.0));
#107=DIRECTION('',(-1.0,0.0,0.0));
#108=DIRECTION('',(0.0,-0.0,1.0));
#109=ORIENTED_EDGE('',*,*,#150,.T.);
#110=ORIENTED_EDGE('',*,*,#157,.F.);
#111=ORIENTED_EDGE('',*,*,#158,.T.);
#112=ORIENTED_EDGE('',*,*,#159,.F.);
#113=ORIENTED_EDGE('',*,*,#153,.F.);
#114=CARTESIAN_POINT('',(0.0,-5.0,0.0));
#115=DIRECTION('',(0.0,1.0,-0.0));
#116=DIRECTION('',(-0.0,0.0,1.0));
#117=ORIENTED_EDGE('',*,*,#152,.T.);
#118=ORIENTED_EDGE('',*,*,#156,.T.);
#119=ORIENTED_EDGE('',*,*,#160,.T.);
#120=ORIENTED_EDGE('',*,*,#161,.T.);
#121=ORIENTED_EDGE('',*,*,#157,.T.);
#122=ORIENTED_EDGE('',*,*,#149,.T.);
#123=CARTESIAN_POINT('',(0.0,0.0,2.5));
#124=DIRECTION('',(0.0,0.0,1.0));
#125=DIRECTION('',(1.0,0.0,0.0));
#126=ORIENTED_EDGE('',*,*,#154,.T.);
#127=ORIENTED_EDGE('',*,*,#159,.T.);
#128=ORIENTED_EDGE('',*,*,#162,.T.);
#129=ORIENTED_EDGE('',*,*,#163,.T.);
#130=CARTESIAN_POINT('',(0.0,0.0,-2.5));
#131=DIRECTION('',(0.0,0.0,1.0));
#132=DIRECTION('',(1.0,0.0,0.0));
#133=ORIENTED_EDGE('',*,*,#164,.T.);
#134=ORIENTED_EDGE('',*,*,#162,.F.);
#135=ORIENTED_EDGE('',*,*,#158,.F.);
#136=ORIENTED_EDGE('',*,*,#161,.F.);
#137=CARTESIAN_POINT('',(-5.0,0.0,0.0));
#138=DIRECTION('',(1.0,0.0,0.0));
#139=DIRECTION('',(0.0,0.0,-1.0));
#140=ORIENTED_EDGE('',*,*,#155,.T.);
#141=ORIENTED_EDGE('',*,*,#163,.F.);
#142=ORIENTED_EDGE('',*,*,#164,.F.);
#143=ORIENTED_EDGE('',*,*,#160,.F.);
#144=CARTESIAN_POINT('',(0.0,5.0,0.0));
#145=DIRECTION('',(0.0,-1.0,0.0));
#146=DIRECTION('',(0.0,0.0,-1.0));
#147=EDGE_CURVE('',#165,#166,#167,.T.);
#148=EDGE_CURVE('',#168,#165,#169,.T.);
#149=EDGE_CURVE('',#170,#168,#171,.T.);
#150=EDGE_CURVE('',#166,#170,#172,.T.);
#151=EDGE_CURVE('',#173,#165,#174,.T.);
#152=EDGE_CURVE('',#168,#173,#175,.T.);
#153=EDGE_CURVE('',#166,#176,#177,.T.);
#154=EDGE_CURVE('',#178,#176,#179,.T.);
#155=EDGE_CURVE('',#180,#178,#181,.T.);
#156=EDGE_CURVE('',#173,#180,#182,.T.);
#157=EDGE_CURVE('',#183,#170,#184,.T.);
#158=EDGE_CURVE('',#183,#185,#186,.T.);
#159=EDGE_CURVE('',#176,#185,#187,.T.);
#160=EDGE_CURVE('',#180,#188,#189,.T.);
#161=EDGE_CURVE('',#188,#183,#190,.T.);
#162=EDGE_CURVE('',#185,#191,#192,.T.);
#163=EDGE_CURVE('',#191,#178,#193,.T.);
#164=EDGE_CURVE('',#188,#191,#194,.T.);
#165=VERTEX_POINT('',#195);
#166=VERTEX_POINT('',#196);
#167=LINE('',#197,#198);
#168=VERTEX_POINT('',#199);
#169=LINE('',#200,#201);
#170=VERTEX_POINT('',#202);
#171=LINE('',#203,#204);
#172=LINE('',#205,#206);
#173=VERTEX_POINT('',#207);
#174=LINE('',#208,#209);
#175=LINE('',#210,#211);
#176=VERTEX_POINT('',#212);
#177=LINE('',#213,#214);
#178=VERTEX_POINT('',#215);
#179=LINE('',#216,#217);
#180=VERTEX_POINT('',#218);
#181=LINE('',#219,#220);
#182=LINE('',#221,#222);
#183=VERTEX_POINT('',#223);
#184=LINE('',#224,#225);
#185=VERTEX_POINT('',#226);
#186=LINE('',#227,#228);
#187=LINE('',#229,#230);
#188=VERTEX_POINT('',#231);
#189=LINE('',#232,#233);
#190=LINE('',#234,#235);
#191=VERTEX_POINT('',#236);
#192=LINE('',#237,#238);
#193=LINE('',#239,#240);
#194=LINE('',#241,#242);
#195=CARTESIAN_POINT('',(5.0,0.0,0.875911164112547));
#196=CARTESIAN_POINT('',(5.0,-5.0,0.875911164112548));
#197=CARTESIAN_POINT('',(5.0,-2.5,0.875911164112547));
#198=VECTOR('',#243,1.0);
#199=CARTESIAN_POINT('',(-1.06118205153736,0.0,2.5));
#200=CARTESIAN_POINT('',(2.3529523872437,0.0,1.58518543427733));
#201=VECTOR('',#244,0.999999999999999);
#202=CARTESIAN_POINT('',(-1.06118205153737,-5.0,2.5));
#203=CARTESIAN_POINT('',(-1.06118205153737,-2.5,2.5));
#204=VECTOR('',#245,1.0);
#205=CARTESIAN_POINT('',(1.45343333440537,-5.0,1.82621083806177));
#206=VECTOR('',#246,1.0);
#207=CARTESIAN_POINT('',(5.0,0.0,2.5));
#208=CARTESIAN_POINT('',(5.0,0.0,2.0));
#209=VECTOR('',#247,1.0);
#210=CARTESIAN_POINT('',(1.5,0.0,2.5));
#211=VECTOR('',#248,1.0);
#212=CARTESIAN_POINT('',(5.0,-5.0,-2.5));
#213=CARTESIAN_POINT('',(5.0,-5.0,0.0));
#214=VECTOR('',#249,1.0);
#215=CARTESIAN_POINT('',(5.0,5.0,-2.5));
#216=CARTESIAN_POINT('',(5.0,0.0,-2.5));
#217=VECTOR('',#250,1.0);
#218=CARTESIAN_POINT('',(5.0,5.0,2.5));
#219=CARTESIAN_POINT('',(5.0,5.0,0.0));
#220=VECTOR('',#251,1.0);
#221=CARTESIAN_POINT('',(5.0,0.0,2.5));
#222=VECTOR('',#252,1.0);
#223=CARTESIAN_POINT('',(-5.0,-5.0,2.5));
#224=CARTESIAN_POINT('',(0.0,-5.0,2.5));
#225=VECTOR('',#253,1.0);
#226=CARTESIAN_POINT('',(-5.0,-5.0,-2.5));
#227=CARTESIAN_POINT('',(-5.0,-5.0,0.0));
#228=VECTOR('',#254,1.0);
#229=CARTESIAN_POINT('',(0.0,-5.0,-2.5));
#230=VECTOR('',#255,1.0);
#231=CARTESIAN_POINT('',(-5.0,5.0,2.5));
#232=CARTESIAN_POINT('',(0.0,5.0,2.5));
#233=VECTOR('',#256,1.0);
#234=CARTESIAN_POINT('',(-5.0,0.0,2.5));
#235=VECTOR('',#257,1.0);
#236=CARTESIAN_POINT('',(-5.0,5.0,-2.5));
#237=CARTESIAN_POINT('',(-5.0,0.0,-2.5));
#238=VECTOR('',#258,1.0);
#239=CARTESIAN_POINT('',(0.0,5.0,-2.5));
#240=VECTOR('',#259,1.0);
#241=CARTESIAN_POINT('',(-5.0,5.0,0.0));
#242=VECTOR('',#260,1.0);
#243=DIRECTION('',(0.0,-1.0,0.0));
#244=DIRECTION('',(0.965925826289068,0.0,-0.258819045102521));
#245=DIRECTION('',(0.0,1.0,0.0));
#246=DIRECTION('',(-0.965925826289068,0.0,0.258819045102521));
#247=DIRECTION('',(-0.0,-0.0,-1.0));
#248=DIRECTION('',(1.0,0.0,-0.0));
#249=DIRECTION('',(0.0,0.0,-1.0));
#250=DIRECTION('',(0.0,-1.0,0.0));
#251=DIRECTION('',(0.0,0.0,-1.0));
#252=DIRECTION('',(0.0,1.0,0.0));
#253=DIRECTION('',(1.0,0.0,0.0));
#254=DIRECTION('',(0.0,0.0,-1.0));
#255=DIRECTION('',(-1.0,0.0,0.0));
#256=DIRECTION('',(-1.0,0.0,0.0));
#257=DIRECTION('',(0.0,-1.0,0.0));
#258=DIRECTION('',(0.0,1.0,0.0));
#259=DIRECTION('',(1.0,0.0,0.0));
#260=DIRECTION('',(0.0,0.0,-1.0));
ENDSEC;
END-ISO-10303-21;
