ISO-10303-21;
HEADER;
FILE_DESCRIPTION(('STEP AP214'),'1');
FILE_NAME('model3.step','2020-02-06T17:50:01',('Cubit 15.2'),(' '),'Spatial InterOp 3D',' ',' ');
FILE_SCHEMA(('automotive_design'));
ENDSEC;
DATA;
#1=PRODUCT_DEFINITION_CONTEXT('',#9,'design');
#2=APPLICATION_PROTOCOL_DEFINITION('INTERNATIONAL STANDARD','automotive_design',1994,#9);
#3=PRODUCT_CATEGORY_RELATIONSHIP('NONE','NONE',#10,#11);
#4=SHAPE_DEFINITION_REPRESENTATION(#12,#13);
#5= (GEOMETRIC_REPRESENTATION_CONTEXT(3)GLOBAL_UNCERTAINTY_ASSIGNED_CONTEXT((#16))GLOBAL_UNIT_ASSIGNED_CONTEXT((#18,#19,#20))REPRESENTATION_CONTEXT('NONE','WORKSPACE'));
#9=APPLICATION_CONTEXT(' ');
#10=PRODUCT_CATEGORY('part','NONE');
#11=PRODUCT_RELATED_PRODUCT_CATEGORY('detail',' ',(#22));
#12=PRODUCT_DEFINITION_SHAPE('NONE','NONE',#23);
#13=ADVANCED_BREP_SHAPE_REPRESENTATION('1',(#24,#25),#5);
#16=UNCERTAINTY_MEASURE_WITH_UNIT(LENGTH_MEASURE(1.0E-06),#18,'','');
#18= (CONVERSION_BASED_UNIT('MILLIMETRE',#28)LENGTH_UNIT()NAMED_UNIT(#31));
#19= (NAMED_UNIT(#33)PLANE_ANGLE_UNIT()SI_UNIT($,.RADIAN.));
#20= (NAMED_UNIT(#33)SOLID_ANGLE_UNIT()SI_UNIT($,.STERADIAN.));
#22=PRODUCT('1','1','PART-1-DESC',(#39));
#23=PRODUCT_DEFINITION('NONE','NONE',#40,#1);
#24=MANIFOLD_SOLID_BREP('1',#41);
#25=AXIS2_PLACEMENT_3D('',#42,#43,#44);
#28=LENGTH_MEASURE_WITH_UNIT(LENGTH_MEASURE(1.0),#45);
#31=DIMENSIONAL_EXPONENTS(1.0,0.0,0.0,0.0,0.0,0.0,0.0);
#33=DIMENSIONAL_EXPONENTS(0.0,0.0,0.0,0.0,0.0,0.0,0.0);
#39=PRODUCT_CONTEXT('',#9,'mechanical');
#40=PRODUCT_DEFINITION_FORMATION_WITH_SPECIFIED_SOURCE(' ','NONE',#22,.NOT_KNOWN.);
#41=CLOSED_SHELL('',(#46,#47,#48,#49,#50,#51,#52,#53));
#42=CARTESIAN_POINT('',(0.0,0.0,0.0));
#43=DIRECTION('',(0.0,0.0,1.0));
#44=DIRECTION('',(1.0,0.0,0.0));
#45= (NAMED_UNIT(#31)LENGTH_UNIT()SI_UNIT(.MILLI.,.METRE.));
#46=ADVANCED_FACE('',(#55),#56,.T.);
#47=ADVANCED_FACE('',(#57),#58,.T.);
#48=ADVANCED_FACE('',(#59),#60,.T.);
#49=ADVANCED_FACE('',(#61),#62,.T.);
#50=ADVANCED_FACE('',(#63),#64,.F.);
#51=ADVANCED_FACE('',(#65),#66,.F.);
#52=ADVANCED_FACE('',(#67),#68,.F.);
#53=ADVANCED_FACE('',(#69),#70,.F.);
#55=FACE_OUTER_BOUND('',#71,.T.);
#56=CYLINDRICAL_SURFACE('',#72,3.0);
#57=FACE_OUTER_BOUND('',#73,.T.);
#58=CYLINDRICAL_SURFACE('',#74,3.0);
#59=FACE_OUTER_BOUND('',#75,.T.);
#60=PLANE('',#76);
#61=FACE_OUTER_BOUND('',#77,.T.);
#62=PLANE('',#78);
#63=FACE_OUTER_BOUND('',#79,.T.);
#64=PLANE('',#80);
#65=FACE_OUTER_BOUND('',#81,.T.);
#66=PLANE('',#82);
#67=FACE_OUTER_BOUND('',#83,.T.);
#68=PLANE('',#84);
#69=FACE_OUTER_BOUND('',#85,.T.);
#70=PLANE('',#86);
#71=EDGE_LOOP('',(#87,#88,#89,#90,#91,#92));
#72=AXIS2_PLACEMENT_3D('',#93,#94,#95);
#73=EDGE_LOOP('',(#96,#97,#98,#99,#100,#101));
#74=AXIS2_PLACEMENT_3D('',#102,#103,#104);
#75=EDGE_LOOP('',(#105,#106));
#76=AXIS2_PLACEMENT_3D('',#107,#108,#109);
#77=EDGE_LOOP('',(#110,#111,#112,#113,#114));
#78=AXIS2_PLACEMENT_3D('',#115,#116,#117);
#79=EDGE_LOOP('',(#118,#119,#120,#121,#122));
#80=AXIS2_PLACEMENT_3D('',#123,#124,#125);
#81=EDGE_LOOP('',(#126,#127,#128,#129));
#82=AXIS2_PLACEMENT_3D('',#130,#131,#132);
#83=EDGE_LOOP('',(#133,#134,#135,#136));
#84=AXIS2_PLACEMENT_3D('',#137,#138,#139);
#85=EDGE_LOOP('',(#140,#141,#142,#143));
#86=AXIS2_PLACEMENT_3D('',#144,#145,#146);
#87=ORIENTED_EDGE('',*,*,#147,.F.);
#88=ORIENTED_EDGE('',*,*,#148,.F.);
#89=ORIENTED_EDGE('',*,*,#149,.F.);
#90=ORIENTED_EDGE('',*,*,#150,.T.);
#91=ORIENTED_EDGE('',*,*,#151,.T.);
#92=ORIENTED_EDGE('',*,*,#152,.F.);
#93=CARTESIAN_POINT('',(0.0,0.0,0.5));
#94=DIRECTION('',(0.0,0.0,1.0));
#95=DIRECTION('',(1.0,0.0,0.0));
#96=ORIENTED_EDGE('',*,*,#147,.T.);
#97=ORIENTED_EDGE('',*,*,#153,.F.);
#98=ORIENTED_EDGE('',*,*,#151,.F.);
#99=ORIENTED_EDGE('',*,*,#154,.T.);
#100=ORIENTED_EDGE('',*,*,#155,.T.);
#101=ORIENTED_EDGE('',*,*,#156,.F.);
#102=CARTESIAN_POINT('',(0.0,0.0,0.5));
#103=DIRECTION('',(0.0,0.0,1.0));
#104=DIRECTION('',(1.0,0.0,0.0));
#105=ORIENTED_EDGE('',*,*,#152,.T.);
#106=ORIENTED_EDGE('',*,*,#153,.T.);
#107=CARTESIAN_POINT('',(0.0,0.0,-1.5));
#108=DIRECTION('',(0.0,0.0,-1.0));
#109=DIRECTION('',(-1.0,0.0,0.0));
#110=ORIENTED_EDGE('',*,*,#157,.T.);
#111=ORIENTED_EDGE('',*,*,#154,.F.);
#112=ORIENTED_EDGE('',*,*,#150,.F.);
#113=ORIENTED_EDGE('',*,*,#158,.T.);
#114=ORIENTED_EDGE('',*,*,#159,.T.);
#115=CARTESIAN_POINT('',(5.0,0.0,1.5));
#116=DIRECTION('',(0.0,0.0,1.0));
#117=DIRECTION('',(1.0,0.0,0.0));
#118=ORIENTED_EDGE('',*,*,#148,.T.);
#119=ORIENTED_EDGE('',*,*,#156,.T.);
#120=ORIENTED_EDGE('',*,*,#160,.T.);
#121=ORIENTED_EDGE('',*,*,#161,.T.);
#122=ORIENTED_EDGE('',*,*,#162,.T.);
#123=CARTESIAN_POINT('',(5.0,0.0,-0.5));
#124=DIRECTION('',(0.0,0.0,1.0));
#125=DIRECTION('',(1.0,0.0,0.0));
#126=ORIENTED_EDGE('',*,*,#149,.T.);
#127=ORIENTED_EDGE('',*,*,#162,.F.);
#128=ORIENTED_EDGE('',*,*,#163,.F.);
#129=ORIENTED_EDGE('',*,*,#158,.F.);
#130=CARTESIAN_POINT('',(5.0,-3.0,0.5));
#131=DIRECTION('',(0.0,1.0,0.0));
#132=DIRECTION('',(0.0,0.0,1.0));
#133=ORIENTED_EDGE('',*,*,#164,.T.);
#134=ORIENTED_EDGE('',*,*,#160,.F.);
#135=ORIENTED_EDGE('',*,*,#155,.F.);
#136=ORIENTED_EDGE('',*,*,#157,.F.);
#137=CARTESIAN_POINT('',(5.0,3.0,0.5));
#138=DIRECTION('',(0.0,-1.0,0.0));
#139=DIRECTION('',(0.0,0.0,-1.0));
#140=ORIENTED_EDGE('',*,*,#163,.T.);
#141=ORIENTED_EDGE('',*,*,#161,.F.);
#142=ORIENTED_EDGE('',*,*,#164,.F.);
#143=ORIENTED_EDGE('',*,*,#159,.F.);
#144=CARTESIAN_POINT('',(10.0,0.0,0.5));
#145=DIRECTION('',(-1.0,0.0,0.0));
#146=DIRECTION('',(0.0,0.0,1.0));
#147=EDGE_CURVE('',#165,#166,#167,.T.);
#148=EDGE_CURVE('',#168,#165,#169,.T.);
#149=EDGE_CURVE('',#170,#168,#171,.T.);
#150=EDGE_CURVE('',#170,#172,#173,.T.);
#151=EDGE_CURVE('',#172,#174,#175,.T.);
#152=EDGE_CURVE('',#166,#174,#176,.T.);
#153=EDGE_CURVE('',#174,#166,#177,.T.);
#154=EDGE_CURVE('',#172,#178,#179,.T.);
#155=EDGE_CURVE('',#178,#180,#181,.T.);
#156=EDGE_CURVE('',#165,#180,#182,.T.);
#157=EDGE_CURVE('',#183,#178,#184,.T.);
#158=EDGE_CURVE('',#170,#185,#186,.T.);
#159=EDGE_CURVE('',#185,#183,#187,.T.);
#160=EDGE_CURVE('',#180,#188,#189,.T.);
#161=EDGE_CURVE('',#188,#190,#191,.T.);
#162=EDGE_CURVE('',#190,#168,#192,.T.);
#163=EDGE_CURVE('',#185,#190,#193,.T.);
#164=EDGE_CURVE('',#183,#188,#194,.T.);
#165=VERTEX_POINT('',#195);
#166=VERTEX_POINT('',#196);
#167=LINE('',#197,#198);
#168=VERTEX_POINT('',#199);
#169=CIRCLE('',#200,3.0);
#170=VERTEX_POINT('',#201);
#171=LINE('',#202,#203);
#172=VERTEX_POINT('',#204);
#173=CIRCLE('',#205,3.0);
#174=VERTEX_POINT('',#206);
#175=LINE('',#207,#208);
#176=CIRCLE('',#209,3.0);
#177=CIRCLE('',#210,3.0);
#178=VERTEX_POINT('',#211);
#179=CIRCLE('',#212,3.0);
#180=VERTEX_POINT('',#213);
#181=LINE('',#214,#215);
#182=CIRCLE('',#216,3.0);
#183=VERTEX_POINT('',#217);
#184=LINE('',#218,#219);
#185=VERTEX_POINT('',#220);
#186=LINE('',#221,#222);
#187=LINE('',#223,#224);
#188=VERTEX_POINT('',#225);
#189=LINE('',#226,#227);
#190=VERTEX_POINT('',#228);
#191=LINE('',#229,#230);
#192=LINE('',#231,#232);
#193=LINE('',#233,#234);
#194=LINE('',#235,#236);
#195=CARTESIAN_POINT('',(3.0,0.0,-0.5));
#196=CARTESIAN_POINT('',(3.0,0.0,-1.5));
#197=CARTESIAN_POINT('',(3.0,0.0,0.5));
#198=VECTOR('',#237,3.0);
#199=CARTESIAN_POINT('',(0.0,-3.0,-0.5));
#200=AXIS2_PLACEMENT_3D('',#238,#239,#240);
#201=CARTESIAN_POINT('',(0.0,-3.0,1.5));
#202=CARTESIAN_POINT('',(0.0,-3.0,0.5));
#203=VECTOR('',#241,1.0);
#204=CARTESIAN_POINT('',(-3.0,-3.67394039744206E-16,1.5));
#205=AXIS2_PLACEMENT_3D('',#242,#243,#244);
#206=CARTESIAN_POINT('',(-3.0,-3.67394039744206E-16,-1.5));
#207=CARTESIAN_POINT('',(-3.0,-3.67394039744206E-16,0.5));
#208=VECTOR('',#245,3.0);
#209=AXIS2_PLACEMENT_3D('',#246,#247,#248);
#210=AXIS2_PLACEMENT_3D('',#249,#250,#251);
#211=CARTESIAN_POINT('',(0.0,3.0,1.5));
#212=AXIS2_PLACEMENT_3D('',#252,#253,#254);
#213=CARTESIAN_POINT('',(0.0,3.0,-0.5));
#214=CARTESIAN_POINT('',(0.0,3.0,0.5));
#215=VECTOR('',#255,1.0);
#216=AXIS2_PLACEMENT_3D('',#256,#257,#258);
#217=CARTESIAN_POINT('',(10.0,3.0,1.5));
#218=CARTESIAN_POINT('',(5.0,3.0,1.5));
#219=VECTOR('',#259,1.0);
#220=CARTESIAN_POINT('',(10.0,-3.0,1.5));
#221=CARTESIAN_POINT('',(5.0,-3.0,1.5));
#222=VECTOR('',#260,1.0);
#223=CARTESIAN_POINT('',(10.0,0.0,1.5));
#224=VECTOR('',#261,1.0);
#225=CARTESIAN_POINT('',(10.0,3.0,-0.5));
#226=CARTESIAN_POINT('',(5.0,3.0,-0.5));
#227=VECTOR('',#262,1.0);
#228=CARTESIAN_POINT('',(10.0,-3.0,-0.5));
#229=CARTESIAN_POINT('',(10.0,0.0,-0.5));
#230=VECTOR('',#263,1.0);
#231=CARTESIAN_POINT('',(5.0,-3.0,-0.5));
#232=VECTOR('',#264,1.0);
#233=CARTESIAN_POINT('',(10.0,-3.0,0.5));
#234=VECTOR('',#265,1.0);
#235=CARTESIAN_POINT('',(10.0,3.0,0.5));
#236=VECTOR('',#266,1.0);
#237=DIRECTION('',(-0.0,-0.0,-1.0));
#238=CARTESIAN_POINT('',(0.0,0.0,-0.5));
#239=DIRECTION('',(0.0,0.0,1.0));
#240=DIRECTION('',(1.0,0.0,0.0));
#241=DIRECTION('',(0.0,0.0,-1.0));
#242=CARTESIAN_POINT('',(0.0,0.0,1.5));
#243=DIRECTION('',(0.0,0.0,-1.0));
#244=DIRECTION('',(1.0,0.0,0.0));
#245=DIRECTION('',(-0.0,-0.0,-1.0));
#246=CARTESIAN_POINT('',(0.0,0.0,-1.5));
#247=DIRECTION('',(0.0,0.0,-1.0));
#248=DIRECTION('',(1.0,0.0,0.0));
#249=CARTESIAN_POINT('',(0.0,0.0,-1.5));
#250=DIRECTION('',(0.0,0.0,-1.0));
#251=DIRECTION('',(1.0,0.0,0.0));
#252=CARTESIAN_POINT('',(0.0,0.0,1.5));
#253=DIRECTION('',(0.0,0.0,-1.0));
#254=DIRECTION('',(1.0,0.0,0.0));
#255=DIRECTION('',(0.0,0.0,-1.0));
#256=CARTESIAN_POINT('',(0.0,0.0,-0.5));
#257=DIRECTION('',(0.0,0.0,1.0));
#258=DIRECTION('',(1.0,0.0,0.0));
#259=DIRECTION('',(-1.0,0.0,0.0));
#260=DIRECTION('',(1.0,0.0,0.0));
#261=DIRECTION('',(0.0,1.0,0.0));
#262=DIRECTION('',(1.0,0.0,0.0));
#263=DIRECTION('',(0.0,-1.0,0.0));
#264=DIRECTION('',(-1.0,0.0,0.0));
#265=DIRECTION('',(0.0,0.0,-1.0));
#266=DIRECTION('',(0.0,0.0,-1.0));
ENDSEC;
END-ISO-10303-21;
