ISO-10303-21;
HEADER;
FILE_DESCRIPTION(('STEP AP214'),'1');
FILE_NAME('S8.step','2021-10-14T07:24:09',('Cubit 15.2'),(' '),'Spatial InterOp 3D',' ',' ');
FILE_SCHEMA(('automotive_design'));
ENDSEC;
DATA;
#1=PRODUCT_DEFINITION_CONTEXT('',#9,'design');
#2=APPLICATION_PROTOCOL_DEFINITION('INTERNATIONAL STANDARD','automotive_design',1994,#9);
#3=PRODUCT_CATEGORY_RELATIONSHIP('NONE','NONE',#10,#11);
#4=SHAPE_DEFINITION_REPRESENTATION(#12,#13);
#5= (GEOMETRIC_REPRESENTATION_CONTEXT(3)GLOBAL_UNCERTAINTY_ASSIGNED_CONTEXT((#16))GLOBAL_UNIT_ASSIGNED_CONTEXT((#18,#19,#20))REPRESENTATION_CONTEXT('NONE','WORKSPACE'));
#9=APPLICATION_CONTEXT(' ');
#10=PRODUCT_CATEGORY('part','NONE');
#11=PRODUCT_RELATED_PRODUCT_CATEGORY('detail',' ',(#22));
#12=PRODUCT_DEFINITION_SHAPE('NONE','NONE',#23);
#13=ADVANCED_BREP_SHAPE_REPRESENTATION('1',(#24,#25),#5);
#16=UNCERTAINTY_MEASURE_WITH_UNIT(LENGTH_MEASURE(1.0E-06),#18,'','');
#18= (CONVERSION_BASED_UNIT('MILLIMETRE',#28)LENGTH_UNIT()NAMED_UNIT(#31));
#19= (NAMED_UNIT(#33)PLANE_ANGLE_UNIT()SI_UNIT($,.RADIAN.));
#20= (NAMED_UNIT(#33)SOLID_ANGLE_UNIT()SI_UNIT($,.STERADIAN.));
#22=PRODUCT('1','1','PART-1-DESC',(#39));
#23=PRODUCT_DEFINITION('NONE','NONE',#40,#1);
#24=MANIFOLD_SOLID_BREP('1',#41);
#25=AXIS2_PLACEMENT_3D('',#42,#43,#44);
#28=LENGTH_MEASURE_WITH_UNIT(LENGTH_MEASURE(1.0),#45);
#31=DIMENSIONAL_EXPONENTS(1.0,0.0,0.0,0.0,0.0,0.0,0.0);
#33=DIMENSIONAL_EXPONENTS(0.0,0.0,0.0,0.0,0.0,0.0,0.0);
#39=PRODUCT_CONTEXT('',#9,'mechanical');
#40=PRODUCT_DEFINITION_FORMATION_WITH_SPECIFIED_SOURCE(' ','NONE',#22,.NOT_KNOWN.);
#41=CLOSED_SHELL('',(#46,#47,#48,#49,#50,#51,#52,#53,#54,#55,#56,#57,#58,#59,#60,#61,#62,#63,#64,#65,#66,#67,#68,#69,#70,#71,#72,#73,#74,#75,#76,#77,#78,#79,#80));
#42=CARTESIAN_POINT('',(0.0,0.0,0.0));
#43=DIRECTION('',(0.0,0.0,1.0));
#44=DIRECTION('',(1.0,0.0,0.0));
#45= (NAMED_UNIT(#31)LENGTH_UNIT()SI_UNIT(.MILLI.,.METRE.));
#46=ADVANCED_FACE('',(#82),#83,.T.);
#47=ADVANCED_FACE('',(#84),#85,.T.);
#48=ADVANCED_FACE('',(#86),#87,.T.);
#49=ADVANCED_FACE('',(#88),#89,.F.);
#50=ADVANCED_FACE('',(#90),#91,.F.);
#51=ADVANCED_FACE('',(#92),#93,.F.);
#52=ADVANCED_FACE('',(#94),#95,.F.);
#53=ADVANCED_FACE('',(#96),#97,.F.);
#54=ADVANCED_FACE('',(#98),#99,.T.);
#55=ADVANCED_FACE('',(#100),#101,.F.);
#56=ADVANCED_FACE('',(#102),#103,.T.);
#57=ADVANCED_FACE('',(#104),#105,.T.);
#58=ADVANCED_FACE('',(#106),#107,.T.);
#59=ADVANCED_FACE('',(#108,#109),#110,.F.);
#60=ADVANCED_FACE('',(#111),#112,.T.);
#61=ADVANCED_FACE('',(#113),#114,.T.);
#62=ADVANCED_FACE('',(#115),#116,.F.);
#63=ADVANCED_FACE('',(#117),#118,.F.);
#64=ADVANCED_FACE('',(#119),#120,.T.);
#65=ADVANCED_FACE('',(#121),#122,.F.);
#66=ADVANCED_FACE('',(#123),#124,.F.);
#67=ADVANCED_FACE('',(#125),#126,.T.);
#68=ADVANCED_FACE('',(#127),#128,.T.);
#69=ADVANCED_FACE('',(#129),#130,.T.);
#70=ADVANCED_FACE('',(#131),#132,.T.);
#71=ADVANCED_FACE('',(#133),#134,.T.);
#72=ADVANCED_FACE('',(#135),#136,.T.);
#73=ADVANCED_FACE('',(#137),#138,.T.);
#74=ADVANCED_FACE('',(#139),#140,.T.);
#75=ADVANCED_FACE('',(#141),#142,.T.);
#76=ADVANCED_FACE('',(#143),#144,.T.);
#77=ADVANCED_FACE('',(#145),#146,.T.);
#78=ADVANCED_FACE('',(#147),#148,.T.);
#79=ADVANCED_FACE('',(#149,#150),#151,.F.);
#80=ADVANCED_FACE('',(#152,#153),#154,.T.);
#82=FACE_OUTER_BOUND('',#155,.T.);
#83=CYLINDRICAL_SURFACE('',#156,37.5);
#84=FACE_OUTER_BOUND('',#157,.T.);
#85=CYLINDRICAL_SURFACE('',#158,5.0);
#86=FACE_OUTER_BOUND('',#159,.T.);
#87=PLANE('',#160);
#88=FACE_OUTER_BOUND('',#161,.T.);
#89=CYLINDRICAL_SURFACE('',#162,5.0);
#90=FACE_OUTER_BOUND('',#163,.T.);
#91=PLANE('',#164);
#92=FACE_OUTER_BOUND('',#165,.T.);
#93=PLANE('',#166);
#94=FACE_OUTER_BOUND('',#167,.T.);
#95=PLANE('',#168);
#96=FACE_OUTER_BOUND('',#169,.T.);
#97=PLANE('',#170);
#98=FACE_OUTER_BOUND('',#171,.T.);
#99=PLANE('',#172);
#100=FACE_OUTER_BOUND('',#173,.T.);
#101=CYLINDRICAL_SURFACE('',#174,5.0);
#102=FACE_OUTER_BOUND('',#175,.T.);
#103=CYLINDRICAL_SURFACE('',#176,5.0);
#104=FACE_OUTER_BOUND('',#177,.T.);
#105=PLANE('',#178);
#106=FACE_OUTER_BOUND('',#179,.T.);
#107=PLANE('',#180);
#108=FACE_OUTER_BOUND('',#181,.T.);
#109=FACE_BOUND('',#182,.T.);
#110=PLANE('',#183);
#111=FACE_OUTER_BOUND('',#184,.T.);
#112=PLANE('',#185);
#113=FACE_OUTER_BOUND('',#186,.T.);
#114=PLANE('',#187);
#115=FACE_OUTER_BOUND('',#188,.T.);
#116=CYLINDRICAL_SURFACE('',#189,5.0);
#117=FACE_OUTER_BOUND('',#190,.T.);
#118=PLANE('',#191);
#119=FACE_OUTER_BOUND('',#192,.T.);
#120=PLANE('',#193);
#121=FACE_OUTER_BOUND('',#194,.T.);
#122=CYLINDRICAL_SURFACE('',#195,5.0);
#123=FACE_OUTER_BOUND('',#196,.T.);
#124=PLANE('',#197);
#125=FACE_OUTER_BOUND('',#198,.T.);
#126=PLANE('',#199);
#127=FACE_OUTER_BOUND('',#200,.T.);
#128=PLANE('',#201);
#129=FACE_OUTER_BOUND('',#202,.T.);
#130=PLANE('',#203);
#131=FACE_OUTER_BOUND('',#204,.T.);
#132=PLANE('',#205);
#133=FACE_OUTER_BOUND('',#206,.T.);
#134=PLANE('',#207);
#135=FACE_OUTER_BOUND('',#208,.T.);
#136=PLANE('',#209);
#137=FACE_OUTER_BOUND('',#210,.T.);
#138=PLANE('',#211);
#139=FACE_OUTER_BOUND('',#212,.T.);
#140=PLANE('',#213);
#141=FACE_OUTER_BOUND('',#214,.T.);
#142=PLANE('',#215);
#143=FACE_OUTER_BOUND('',#216,.T.);
#144=PLANE('',#217);
#145=FACE_OUTER_BOUND('',#218,.T.);
#146=PLANE('',#219);
#147=FACE_OUTER_BOUND('',#220,.T.);
#148=CYLINDRICAL_SURFACE('',#221,37.5);
#149=FACE_BOUND('',#222,.T.);
#150=FACE_BOUND('',#223,.T.);
#151=CYLINDRICAL_SURFACE('',#224,25.0);
#152=FACE_OUTER_BOUND('',#225,.T.);
#153=FACE_BOUND('',#226,.T.);
#154=PLANE('',#227);
#155=EDGE_LOOP('',(#228,#229,#230,#231,#232,#233,#234,#235,#236,#237,#238,#239,#240,#241,#242,#243,#244,#245,#246,#247));
#156=AXIS2_PLACEMENT_3D('',#248,#249,#250);
#157=EDGE_LOOP('',(#251,#252,#253,#254));
#158=AXIS2_PLACEMENT_3D('',#255,#256,#257);
#159=EDGE_LOOP('',(#258,#259,#260,#261));
#160=AXIS2_PLACEMENT_3D('',#262,#263,#264);
#161=EDGE_LOOP('',(#265,#266,#267,#268));
#162=AXIS2_PLACEMENT_3D('',#269,#270,#271);
#163=EDGE_LOOP('',(#272,#273,#274,#275));
#164=AXIS2_PLACEMENT_3D('',#276,#277,#278);
#165=EDGE_LOOP('',(#279,#280,#281,#282));
#166=AXIS2_PLACEMENT_3D('',#283,#284,#285);
#167=EDGE_LOOP('',(#286,#287,#288,#289));
#168=AXIS2_PLACEMENT_3D('',#290,#291,#292);
#169=EDGE_LOOP('',(#293,#294,#295,#296));
#170=AXIS2_PLACEMENT_3D('',#297,#298,#299);
#171=EDGE_LOOP('',(#300,#301,#302,#303));
#172=AXIS2_PLACEMENT_3D('',#304,#305,#306);
#173=EDGE_LOOP('',(#307,#308,#309,#310));
#174=AXIS2_PLACEMENT_3D('',#311,#312,#313);
#175=EDGE_LOOP('',(#314,#315,#316,#317));
#176=AXIS2_PLACEMENT_3D('',#318,#319,#320);
#177=EDGE_LOOP('',(#321,#322,#323,#324));
#178=AXIS2_PLACEMENT_3D('',#325,#326,#327);
#179=EDGE_LOOP('',(#328,#329,#330,#331));
#180=AXIS2_PLACEMENT_3D('',#332,#333,#334);
#181=EDGE_LOOP('',(#335,#336));
#182=EDGE_LOOP('',(#337));
#183=AXIS2_PLACEMENT_3D('',#338,#339,#340);
#184=EDGE_LOOP('',(#341,#342,#343,#344,#345,#346,#347,#348,#349));
#185=AXIS2_PLACEMENT_3D('',#350,#351,#352);
#186=EDGE_LOOP('',(#353,#354,#355,#356,#357,#358,#359,#360));
#187=AXIS2_PLACEMENT_3D('',#361,#362,#363);
#188=EDGE_LOOP('',(#364,#365,#366,#367));
#189=AXIS2_PLACEMENT_3D('',#368,#369,#370);
#190=EDGE_LOOP('',(#371,#372,#373,#374));
#191=AXIS2_PLACEMENT_3D('',#375,#376,#377);
#192=EDGE_LOOP('',(#378,#379,#380,#381,#382,#383,#384,#385,#386));
#193=AXIS2_PLACEMENT_3D('',#387,#388,#389);
#194=EDGE_LOOP('',(#390,#391,#392,#393));
#195=AXIS2_PLACEMENT_3D('',#394,#395,#396);
#196=EDGE_LOOP('',(#397,#398,#399,#400));
#197=AXIS2_PLACEMENT_3D('',#401,#402,#403);
#198=EDGE_LOOP('',(#404,#405,#406,#407,#408,#409,#410,#411));
#199=AXIS2_PLACEMENT_3D('',#412,#413,#414);
#200=EDGE_LOOP('',(#415,#416,#417,#418,#419,#420));
#201=AXIS2_PLACEMENT_3D('',#421,#422,#423);
#202=EDGE_LOOP('',(#424,#425,#426,#427));
#203=AXIS2_PLACEMENT_3D('',#428,#429,#430);
#204=EDGE_LOOP('',(#431,#432,#433,#434));
#205=AXIS2_PLACEMENT_3D('',#435,#436,#437);
#206=EDGE_LOOP('',(#438,#439,#440,#441,#442,#443));
#207=AXIS2_PLACEMENT_3D('',#444,#445,#446);
#208=EDGE_LOOP('',(#447,#448,#449,#450));
#209=AXIS2_PLACEMENT_3D('',#451,#452,#453);
#210=EDGE_LOOP('',(#454,#455,#456,#457));
#211=AXIS2_PLACEMENT_3D('',#458,#459,#460);
#212=EDGE_LOOP('',(#461,#462,#463,#464,#465,#466));
#213=AXIS2_PLACEMENT_3D('',#467,#468,#469);
#214=EDGE_LOOP('',(#470,#471,#472,#473,#474,#475));
#215=AXIS2_PLACEMENT_3D('',#476,#477,#478);
#216=EDGE_LOOP('',(#479,#480,#481,#482,#483,#484,#485,#486,#487));
#217=AXIS2_PLACEMENT_3D('',#488,#489,#490);
#218=EDGE_LOOP('',(#491,#492,#493,#494,#495,#496,#497,#498,#499));
#219=AXIS2_PLACEMENT_3D('',#500,#501,#502);
#220=EDGE_LOOP('',(#503,#504,#505,#506,#507,#508,#509,#510,#511,#512,#513,#514));
#221=AXIS2_PLACEMENT_3D('',#515,#516,#517);
#222=EDGE_LOOP('',(#518));
#223=EDGE_LOOP('',(#519));
#224=AXIS2_PLACEMENT_3D('',#520,#521,#522);
#225=EDGE_LOOP('',(#523,#524));
#226=EDGE_LOOP('',(#525));
#227=AXIS2_PLACEMENT_3D('',#526,#527,#528);
#228=ORIENTED_EDGE('',*,*,#529,.F.);
#229=ORIENTED_EDGE('',*,*,#530,.T.);
#230=ORIENTED_EDGE('',*,*,#531,.T.);
#231=ORIENTED_EDGE('',*,*,#532,.F.);
#232=ORIENTED_EDGE('',*,*,#533,.F.);
#233=ORIENTED_EDGE('',*,*,#534,.F.);
#234=ORIENTED_EDGE('',*,*,#535,.F.);
#235=ORIENTED_EDGE('',*,*,#536,.F.);
#236=ORIENTED_EDGE('',*,*,#537,.F.);
#237=ORIENTED_EDGE('',*,*,#538,.F.);
#238=ORIENTED_EDGE('',*,*,#539,.T.);
#239=ORIENTED_EDGE('',*,*,#540,.F.);
#240=ORIENTED_EDGE('',*,*,#541,.F.);
#241=ORIENTED_EDGE('',*,*,#542,.F.);
#242=ORIENTED_EDGE('',*,*,#543,.F.);
#243=ORIENTED_EDGE('',*,*,#544,.F.);
#244=ORIENTED_EDGE('',*,*,#545,.F.);
#245=ORIENTED_EDGE('',*,*,#546,.F.);
#246=ORIENTED_EDGE('',*,*,#547,.F.);
#247=ORIENTED_EDGE('',*,*,#548,.F.);
#248=CARTESIAN_POINT('',(0.0,0.0,0.0));
#249=DIRECTION('',(-1.0,-0.0,0.0));
#250=DIRECTION('',(0.0,-1.0,0.0));
#251=ORIENTED_EDGE('',*,*,#549,.T.);
#252=ORIENTED_EDGE('',*,*,#550,.T.);
#253=ORIENTED_EDGE('',*,*,#551,.T.);
#254=ORIENTED_EDGE('',*,*,#552,.T.);
#255=CARTESIAN_POINT('',(0.0,-27.0,58.0));
#256=DIRECTION('',(-1.0,0.0,0.0));
#257=DIRECTION('',(0.0,-0.707106781186547,0.707106781186547));
#258=ORIENTED_EDGE('',*,*,#550,.F.);
#259=ORIENTED_EDGE('',*,*,#553,.T.);
#260=ORIENTED_EDGE('',*,*,#554,.T.);
#261=ORIENTED_EDGE('',*,*,#555,.T.);
#262=CARTESIAN_POINT('',(0.0,-12.5,63.0));
#263=DIRECTION('',(0.0,0.0,1.0));
#264=DIRECTION('',(1.0,-0.0,0.0));
#265=ORIENTED_EDGE('',*,*,#556,.T.);
#266=ORIENTED_EDGE('',*,*,#557,.T.);
#267=ORIENTED_EDGE('',*,*,#558,.T.);
#268=ORIENTED_EDGE('',*,*,#559,.T.);
#269=CARTESIAN_POINT('',(0.0,-17.0,48.0));
#270=DIRECTION('',(-1.0,0.0,0.0));
#271=DIRECTION('',(0.0,-0.707106781186547,0.707106781186547));
#272=ORIENTED_EDGE('',*,*,#557,.F.);
#273=ORIENTED_EDGE('',*,*,#560,.T.);
#274=ORIENTED_EDGE('',*,*,#561,.T.);
#275=ORIENTED_EDGE('',*,*,#562,.T.);
#276=CARTESIAN_POINT('',(0.0,22.0,53.0));
#277=DIRECTION('',(0.0,0.0,1.0));
#278=DIRECTION('',(1.0,-0.0,0.0));
#279=ORIENTED_EDGE('',*,*,#561,.F.);
#280=ORIENTED_EDGE('',*,*,#563,.T.);
#281=ORIENTED_EDGE('',*,*,#554,.F.);
#282=ORIENTED_EDGE('',*,*,#564,.T.);
#283=CARTESIAN_POINT('',(0.0,-12.5,63.0));
#284=DIRECTION('',(0.0,-1.0,0.0));
#285=DIRECTION('',(0.0,0.0,-1.0));
#286=ORIENTED_EDGE('',*,*,#565,.T.);
#287=ORIENTED_EDGE('',*,*,#566,.T.);
#288=ORIENTED_EDGE('',*,*,#567,.T.);
#289=ORIENTED_EDGE('',*,*,#568,.T.);
#290=CARTESIAN_POINT('',(0.0,12.5,53.0));
#291=DIRECTION('',(0.0,1.0,0.0));
#292=DIRECTION('',(1.0,0.0,-0.0));
#293=ORIENTED_EDGE('',*,*,#569,.T.);
#294=ORIENTED_EDGE('',*,*,#570,.T.);
#295=ORIENTED_EDGE('',*,*,#567,.F.);
#296=ORIENTED_EDGE('',*,*,#571,.T.);
#297=CARTESIAN_POINT('',(0.0,22.0,53.0));
#298=DIRECTION('',(0.0,0.0,1.0));
#299=DIRECTION('',(1.0,-0.0,0.0));
#300=ORIENTED_EDGE('',*,*,#572,.T.);
#301=ORIENTED_EDGE('',*,*,#573,.T.);
#302=ORIENTED_EDGE('',*,*,#565,.F.);
#303=ORIENTED_EDGE('',*,*,#574,.T.);
#304=CARTESIAN_POINT('',(0.0,-12.5,63.0));
#305=DIRECTION('',(0.0,0.0,1.0));
#306=DIRECTION('',(1.0,-0.0,0.0));
#307=ORIENTED_EDGE('',*,*,#575,.T.);
#308=ORIENTED_EDGE('',*,*,#576,.T.);
#309=ORIENTED_EDGE('',*,*,#577,.T.);
#310=ORIENTED_EDGE('',*,*,#569,.F.);
#311=CARTESIAN_POINT('',(0.0,17.0,48.0));
#312=DIRECTION('',(-1.0,0.0,0.0));
#313=DIRECTION('',(0.0,0.707106781186547,0.707106781186547));
#314=ORIENTED_EDGE('',*,*,#578,.T.);
#315=ORIENTED_EDGE('',*,*,#579,.T.);
#316=ORIENTED_EDGE('',*,*,#580,.T.);
#317=ORIENTED_EDGE('',*,*,#572,.F.);
#318=CARTESIAN_POINT('',(0.0,27.0,58.0));
#319=DIRECTION('',(-1.0,0.0,0.0));
#320=DIRECTION('',(0.0,0.707106781186547,0.707106781186547));
#321=ORIENTED_EDGE('',*,*,#581,.T.);
#322=ORIENTED_EDGE('',*,*,#582,.T.);
#323=ORIENTED_EDGE('',*,*,#583,.T.);
#324=ORIENTED_EDGE('',*,*,#584,.T.);
#325=CARTESIAN_POINT('',(0.0,-47.0,32.0));
#326=DIRECTION('',(0.0,-1.0,-1.973729821556E-16));
#327=DIRECTION('',(0.0,1.973729821556E-16,-1.0));
#328=ORIENTED_EDGE('',*,*,#585,.T.);
#329=ORIENTED_EDGE('',*,*,#586,.T.);
#330=ORIENTED_EDGE('',*,*,#587,.T.);
#331=ORIENTED_EDGE('',*,*,#588,.T.);
#332=CARTESIAN_POINT('',(0.0,47.0,-13.0));
#333=DIRECTION('',(0.0,1.0,-1.973729821556E-16));
#334=DIRECTION('',(1.0,0.0,0.0));
#335=ORIENTED_EDGE('',*,*,#589,.T.);
#336=ORIENTED_EDGE('',*,*,#540,.T.);
#337=ORIENTED_EDGE('',*,*,#590,.T.);
#338=CARTESIAN_POINT('',(-32.0,-1.961685981978E-15,7.894919286223E-16));
#339=DIRECTION('',(1.0,0.0,0.0));
#340=DIRECTION('',(0.0,1.0,-0.0));
#341=ORIENTED_EDGE('',*,*,#551,.F.);
#342=ORIENTED_EDGE('',*,*,#555,.F.);
#343=ORIENTED_EDGE('',*,*,#563,.F.);
#344=ORIENTED_EDGE('',*,*,#560,.F.);
#345=ORIENTED_EDGE('',*,*,#556,.F.);
#346=ORIENTED_EDGE('',*,*,#591,.T.);
#347=ORIENTED_EDGE('',*,*,#592,.T.);
#348=ORIENTED_EDGE('',*,*,#544,.T.);
#349=ORIENTED_EDGE('',*,*,#593,.T.);
#350=CARTESIAN_POINT('',(-19.0,0.0,41.275607398009));
#351=DIRECTION('',(-1.0,0.0,0.0));
#352=DIRECTION('',(0.0,0.0,1.0));
#353=ORIENTED_EDGE('',*,*,#552,.F.);
#354=ORIENTED_EDGE('',*,*,#593,.F.);
#355=ORIENTED_EDGE('',*,*,#543,.T.);
#356=ORIENTED_EDGE('',*,*,#594,.T.);
#357=ORIENTED_EDGE('',*,*,#595,.T.);
#358=ORIENTED_EDGE('',*,*,#596,.T.);
#359=ORIENTED_EDGE('',*,*,#547,.T.);
#360=ORIENTED_EDGE('',*,*,#597,.T.);
#361=CARTESIAN_POINT('',(0.0,-32.0,63.0));
#362=DIRECTION('',(0.0,-1.0,0.0));
#363=DIRECTION('',(0.0,0.0,-1.0));
#364=ORIENTED_EDGE('',*,*,#592,.F.);
#365=ORIENTED_EDGE('',*,*,#598,.T.);
#366=ORIENTED_EDGE('',*,*,#599,.T.);
#367=ORIENTED_EDGE('',*,*,#545,.T.);
#368=CARTESIAN_POINT('',(0.0,-17.0,36.300151516468));
#369=DIRECTION('',(1.0,0.0,-0.0));
#370=DIRECTION('',(-0.0,-0.510242959202948,-0.860030303293912));
#371=ORIENTED_EDGE('',*,*,#559,.F.);
#372=ORIENTED_EDGE('',*,*,#600,.T.);
#373=ORIENTED_EDGE('',*,*,#598,.F.);
#374=ORIENTED_EDGE('',*,*,#591,.F.);
#375=CARTESIAN_POINT('',(0.0,-22.0,53.0));
#376=DIRECTION('',(0.0,-1.0,0.0));
#377=DIRECTION('',(0.0,0.0,-1.0));
#378=ORIENTED_EDGE('',*,*,#580,.F.);
#379=ORIENTED_EDGE('',*,*,#601,.T.);
#380=ORIENTED_EDGE('',*,*,#536,.T.);
#381=ORIENTED_EDGE('',*,*,#602,.T.);
#382=ORIENTED_EDGE('',*,*,#603,.T.);
#383=ORIENTED_EDGE('',*,*,#575,.F.);
#384=ORIENTED_EDGE('',*,*,#571,.F.);
#385=ORIENTED_EDGE('',*,*,#566,.F.);
#386=ORIENTED_EDGE('',*,*,#573,.F.);
#387=CARTESIAN_POINT('',(-19.0,0.0,41.275607398009));
#388=DIRECTION('',(-1.0,0.0,0.0));
#389=DIRECTION('',(0.0,0.0,1.0));
#390=ORIENTED_EDGE('',*,*,#604,.T.);
#391=ORIENTED_EDGE('',*,*,#605,.T.);
#392=ORIENTED_EDGE('',*,*,#602,.F.);
#393=ORIENTED_EDGE('',*,*,#535,.T.);
#394=CARTESIAN_POINT('',(0.0,17.0,36.300151516468));
#395=DIRECTION('',(-1.0,0.0,-0.0));
#396=DIRECTION('',(0.0,0.510242959202948,-0.860030303293912));
#397=ORIENTED_EDGE('',*,*,#576,.F.);
#398=ORIENTED_EDGE('',*,*,#603,.F.);
#399=ORIENTED_EDGE('',*,*,#605,.F.);
#400=ORIENTED_EDGE('',*,*,#606,.T.);
#401=CARTESIAN_POINT('',(0.0,22.0,32.0));
#402=DIRECTION('',(0.0,1.0,0.0));
#403=DIRECTION('',(1.0,0.0,-0.0));
#404=ORIENTED_EDGE('',*,*,#579,.F.);
#405=ORIENTED_EDGE('',*,*,#607,.T.);
#406=ORIENTED_EDGE('',*,*,#533,.T.);
#407=ORIENTED_EDGE('',*,*,#608,.T.);
#408=ORIENTED_EDGE('',*,*,#609,.T.);
#409=ORIENTED_EDGE('',*,*,#610,.T.);
#410=ORIENTED_EDGE('',*,*,#537,.T.);
#411=ORIENTED_EDGE('',*,*,#601,.F.);
#412=CARTESIAN_POINT('',(0.0,32.0,19.551214796017));
#413=DIRECTION('',(0.0,1.0,0.0));
#414=DIRECTION('',(1.0,0.0,-0.0));
#415=ORIENTED_EDGE('',*,*,#542,.T.);
#416=ORIENTED_EDGE('',*,*,#611,.T.);
#417=ORIENTED_EDGE('',*,*,#612,.T.);
#418=ORIENTED_EDGE('',*,*,#584,.F.);
#419=ORIENTED_EDGE('',*,*,#613,.T.);
#420=ORIENTED_EDGE('',*,*,#594,.F.);
#421=CARTESIAN_POINT('',(-5.0,0.0,9.5));
#422=DIRECTION('',(-1.0,0.0,0.0));
#423=DIRECTION('',(0.0,0.0,1.0));
#424=ORIENTED_EDGE('',*,*,#614,.T.);
#425=ORIENTED_EDGE('',*,*,#615,.T.);
#426=ORIENTED_EDGE('',*,*,#581,.F.);
#427=ORIENTED_EDGE('',*,*,#612,.F.);
#428=CARTESIAN_POINT('',(0.0,-47.0,-13.0));
#429=DIRECTION('',(0.0,0.0,-1.0));
#430=DIRECTION('',(0.0,-1.0,0.0));
#431=ORIENTED_EDGE('',*,*,#595,.F.);
#432=ORIENTED_EDGE('',*,*,#613,.F.);
#433=ORIENTED_EDGE('',*,*,#583,.F.);
#434=ORIENTED_EDGE('',*,*,#616,.T.);
#435=CARTESIAN_POINT('',(0.0,47.0,32.0));
#436=DIRECTION('',(0.0,0.0,1.0));
#437=DIRECTION('',(1.0,-0.0,0.0));
#438=ORIENTED_EDGE('',*,*,#617,.T.);
#439=ORIENTED_EDGE('',*,*,#538,.T.);
#440=ORIENTED_EDGE('',*,*,#610,.F.);
#441=ORIENTED_EDGE('',*,*,#618,.T.);
#442=ORIENTED_EDGE('',*,*,#588,.F.);
#443=ORIENTED_EDGE('',*,*,#619,.T.);
#444=CARTESIAN_POINT('',(-5.0,0.0,9.5));
#445=DIRECTION('',(-1.0,0.0,0.0));
#446=DIRECTION('',(0.0,0.0,1.0));
#447=ORIENTED_EDGE('',*,*,#609,.F.);
#448=ORIENTED_EDGE('',*,*,#620,.T.);
#449=ORIENTED_EDGE('',*,*,#585,.F.);
#450=ORIENTED_EDGE('',*,*,#618,.F.);
#451=CARTESIAN_POINT('',(0.0,47.0,32.0));
#452=DIRECTION('',(0.0,0.0,1.0));
#453=DIRECTION('',(1.0,-0.0,0.0));
#454=ORIENTED_EDGE('',*,*,#621,.T.);
#455=ORIENTED_EDGE('',*,*,#619,.F.);
#456=ORIENTED_EDGE('',*,*,#587,.F.);
#457=ORIENTED_EDGE('',*,*,#622,.T.);
#458=CARTESIAN_POINT('',(0.0,-47.0,-13.0));
#459=DIRECTION('',(0.0,0.0,-1.0));
#460=DIRECTION('',(0.0,-1.0,0.0));
#461=ORIENTED_EDGE('',*,*,#623,.T.);
#462=ORIENTED_EDGE('',*,*,#548,.T.);
#463=ORIENTED_EDGE('',*,*,#596,.F.);
#464=ORIENTED_EDGE('',*,*,#616,.F.);
#465=ORIENTED_EDGE('',*,*,#582,.F.);
#466=ORIENTED_EDGE('',*,*,#615,.F.);
#467=CARTESIAN_POINT('',(5.0,0.0,9.5));
#468=DIRECTION('',(1.0,0.0,0.0));
#469=DIRECTION('',(0.0,1.0,-0.0));
#470=ORIENTED_EDGE('',*,*,#532,.T.);
#471=ORIENTED_EDGE('',*,*,#624,.T.);
#472=ORIENTED_EDGE('',*,*,#622,.F.);
#473=ORIENTED_EDGE('',*,*,#586,.F.);
#474=ORIENTED_EDGE('',*,*,#620,.F.);
#475=ORIENTED_EDGE('',*,*,#608,.F.);
#476=CARTESIAN_POINT('',(5.0,0.0,9.5));
#477=DIRECTION('',(1.0,0.0,0.0));
#478=DIRECTION('',(0.0,1.0,-0.0));
#479=ORIENTED_EDGE('',*,*,#549,.F.);
#480=ORIENTED_EDGE('',*,*,#597,.F.);
#481=ORIENTED_EDGE('',*,*,#546,.T.);
#482=ORIENTED_EDGE('',*,*,#599,.F.);
#483=ORIENTED_EDGE('',*,*,#600,.F.);
#484=ORIENTED_EDGE('',*,*,#558,.F.);
#485=ORIENTED_EDGE('',*,*,#562,.F.);
#486=ORIENTED_EDGE('',*,*,#564,.F.);
#487=ORIENTED_EDGE('',*,*,#553,.F.);
#488=CARTESIAN_POINT('',(19.0,0.0,41.275607398009));
#489=DIRECTION('',(1.0,0.0,0.0));
#490=DIRECTION('',(0.0,1.0,-0.0));
#491=ORIENTED_EDGE('',*,*,#578,.F.);
#492=ORIENTED_EDGE('',*,*,#574,.F.);
#493=ORIENTED_EDGE('',*,*,#568,.F.);
#494=ORIENTED_EDGE('',*,*,#570,.F.);
#495=ORIENTED_EDGE('',*,*,#577,.F.);
#496=ORIENTED_EDGE('',*,*,#606,.F.);
#497=ORIENTED_EDGE('',*,*,#604,.F.);
#498=ORIENTED_EDGE('',*,*,#534,.T.);
#499=ORIENTED_EDGE('',*,*,#607,.F.);
#500=CARTESIAN_POINT('',(19.0,0.0,41.275607398009));
#501=DIRECTION('',(1.0,0.0,0.0));
#502=DIRECTION('',(0.0,1.0,-0.0));
#503=ORIENTED_EDGE('',*,*,#529,.T.);
#504=ORIENTED_EDGE('',*,*,#623,.F.);
#505=ORIENTED_EDGE('',*,*,#614,.F.);
#506=ORIENTED_EDGE('',*,*,#611,.F.);
#507=ORIENTED_EDGE('',*,*,#541,.T.);
#508=ORIENTED_EDGE('',*,*,#589,.F.);
#509=ORIENTED_EDGE('',*,*,#539,.F.);
#510=ORIENTED_EDGE('',*,*,#617,.F.);
#511=ORIENTED_EDGE('',*,*,#621,.F.);
#512=ORIENTED_EDGE('',*,*,#624,.F.);
#513=ORIENTED_EDGE('',*,*,#531,.F.);
#514=ORIENTED_EDGE('',*,*,#625,.T.);
#515=CARTESIAN_POINT('',(0.0,0.0,0.0));
#516=DIRECTION('',(-1.0,-0.0,0.0));
#517=DIRECTION('',(0.0,-1.0,0.0));
#518=ORIENTED_EDGE('',*,*,#590,.F.);
#519=ORIENTED_EDGE('',*,*,#626,.T.);
#520=CARTESIAN_POINT('',(-119.7637967369,0.0,0.0));
#521=DIRECTION('',(-1.0,0.0,0.0));
#522=DIRECTION('',(0.0,1.0,0.0));
#523=ORIENTED_EDGE('',*,*,#625,.F.);
#524=ORIENTED_EDGE('',*,*,#530,.F.);
#525=ORIENTED_EDGE('',*,*,#626,.F.);
#526=CARTESIAN_POINT('',(32.0,-1.961685981978E-15,7.894919286223E-16));
#527=DIRECTION('',(1.0,0.0,0.0));
#528=DIRECTION('',(0.0,1.0,-0.0));
#529=EDGE_CURVE('',#627,#628,#629,.T.);
#530=EDGE_CURVE('',#627,#630,#631,.T.);
#531=EDGE_CURVE('',#630,#632,#633,.T.);
#532=EDGE_CURVE('',#634,#632,#635,.T.);
#533=EDGE_CURVE('',#636,#634,#637,.T.);
#534=EDGE_CURVE('',#638,#636,#639,.T.);
#535=EDGE_CURVE('',#640,#638,#641,.T.);
#536=EDGE_CURVE('',#642,#640,#643,.T.);
#537=EDGE_CURVE('',#644,#642,#645,.T.);
#538=EDGE_CURVE('',#646,#644,#647,.T.);
#539=EDGE_CURVE('',#646,#648,#649,.T.);
#540=EDGE_CURVE('',#650,#648,#651,.T.);
#541=EDGE_CURVE('',#652,#650,#653,.T.);
#542=EDGE_CURVE('',#654,#652,#655,.T.);
#543=EDGE_CURVE('',#656,#654,#657,.T.);
#544=EDGE_CURVE('',#658,#656,#659,.T.);
#545=EDGE_CURVE('',#660,#658,#661,.T.);
#546=EDGE_CURVE('',#662,#660,#663,.T.);
#547=EDGE_CURVE('',#664,#662,#665,.T.);
#548=EDGE_CURVE('',#628,#664,#666,.T.);
#549=EDGE_CURVE('',#667,#668,#669,.T.);
#550=EDGE_CURVE('',#668,#670,#671,.T.);
#551=EDGE_CURVE('',#670,#672,#673,.T.);
#552=EDGE_CURVE('',#672,#667,#674,.T.);
#553=EDGE_CURVE('',#668,#675,#676,.T.);
#554=EDGE_CURVE('',#675,#677,#678,.T.);
#555=EDGE_CURVE('',#677,#670,#679,.T.);
#556=EDGE_CURVE('',#680,#681,#682,.T.);
#557=EDGE_CURVE('',#681,#683,#684,.T.);
#558=EDGE_CURVE('',#683,#685,#686,.T.);
#559=EDGE_CURVE('',#685,#680,#687,.T.);
#560=EDGE_CURVE('',#681,#688,#689,.T.);
#561=EDGE_CURVE('',#688,#690,#691,.T.);
#562=EDGE_CURVE('',#690,#683,#692,.T.);
#563=EDGE_CURVE('',#688,#677,#693,.T.);
#564=EDGE_CURVE('',#675,#690,#694,.T.);
#565=EDGE_CURVE('',#695,#696,#697,.T.);
#566=EDGE_CURVE('',#696,#698,#699,.T.);
#567=EDGE_CURVE('',#698,#700,#701,.T.);
#568=EDGE_CURVE('',#700,#695,#702,.T.);
#569=EDGE_CURVE('',#703,#704,#705,.T.);
#570=EDGE_CURVE('',#704,#700,#706,.T.);
#571=EDGE_CURVE('',#698,#703,#707,.T.);
#572=EDGE_CURVE('',#708,#709,#710,.T.);
#573=EDGE_CURVE('',#709,#696,#711,.T.);
#574=EDGE_CURVE('',#695,#708,#712,.T.);
#575=EDGE_CURVE('',#703,#713,#714,.T.);
#576=EDGE_CURVE('',#713,#715,#716,.T.);
#577=EDGE_CURVE('',#715,#704,#717,.T.);
#578=EDGE_CURVE('',#708,#718,#719,.T.);
#579=EDGE_CURVE('',#718,#720,#721,.T.);
#580=EDGE_CURVE('',#720,#709,#722,.T.);
#581=EDGE_CURVE('',#723,#724,#725,.T.);
#582=EDGE_CURVE('',#724,#726,#727,.T.);
#583=EDGE_CURVE('',#726,#728,#729,.T.);
#584=EDGE_CURVE('',#728,#723,#730,.T.);
#585=EDGE_CURVE('',#731,#732,#733,.T.);
#586=EDGE_CURVE('',#732,#734,#735,.T.);
#587=EDGE_CURVE('',#734,#736,#737,.T.);
#588=EDGE_CURVE('',#736,#731,#738,.T.);
#589=EDGE_CURVE('',#648,#650,#739,.T.);
#590=EDGE_CURVE('',#740,#740,#741,.T.);
#591=EDGE_CURVE('',#680,#742,#743,.T.);
#592=EDGE_CURVE('',#742,#658,#744,.T.);
#593=EDGE_CURVE('',#656,#672,#745,.T.);
#594=EDGE_CURVE('',#654,#746,#747,.T.);
#595=EDGE_CURVE('',#746,#748,#749,.T.);
#596=EDGE_CURVE('',#748,#664,#750,.T.);
#597=EDGE_CURVE('',#662,#667,#751,.T.);
#598=EDGE_CURVE('',#742,#752,#753,.T.);
#599=EDGE_CURVE('',#752,#660,#754,.T.);
#600=EDGE_CURVE('',#685,#752,#755,.T.);
#601=EDGE_CURVE('',#720,#642,#756,.T.);
#602=EDGE_CURVE('',#640,#757,#758,.T.);
#603=EDGE_CURVE('',#757,#713,#759,.T.);
#604=EDGE_CURVE('',#638,#760,#761,.T.);
#605=EDGE_CURVE('',#760,#757,#762,.T.);
#606=EDGE_CURVE('',#760,#715,#763,.T.);
#607=EDGE_CURVE('',#718,#636,#764,.T.);
#608=EDGE_CURVE('',#634,#765,#766,.T.);
#609=EDGE_CURVE('',#765,#767,#768,.T.);
#610=EDGE_CURVE('',#767,#644,#769,.T.);
#611=EDGE_CURVE('',#652,#770,#771,.T.);
#612=EDGE_CURVE('',#770,#723,#772,.T.);
#613=EDGE_CURVE('',#728,#746,#773,.T.);
#614=EDGE_CURVE('',#770,#774,#775,.T.);
#615=EDGE_CURVE('',#774,#724,#776,.T.);
#616=EDGE_CURVE('',#726,#748,#777,.T.);
#617=EDGE_CURVE('',#778,#646,#779,.T.);
#618=EDGE_CURVE('',#767,#731,#780,.T.);
#619=EDGE_CURVE('',#736,#778,#781,.T.);
#620=EDGE_CURVE('',#765,#732,#782,.T.);
#621=EDGE_CURVE('',#783,#778,#784,.T.);
#622=EDGE_CURVE('',#734,#783,#785,.T.);
#623=EDGE_CURVE('',#774,#628,#786,.T.);
#624=EDGE_CURVE('',#632,#783,#787,.T.);
#625=EDGE_CURVE('',#630,#627,#788,.T.);
#626=EDGE_CURVE('',#789,#789,#790,.T.);
#627=VERTEX_POINT('',#791);
#628=VERTEX_POINT('',#792);
#629=LINE('',#793,#794);
#630=VERTEX_POINT('',#795);
#631=CIRCLE('',#796,37.5);
#632=VERTEX_POINT('',#797);
#633=B_SPLINE_CURVE_WITH_KNOTS('',1,(#798,#799),.UNSPECIFIED.,.F.,.F.,(2,2),(-32.0,-5.0),.UNSPECIFIED.);
#634=VERTEX_POINT('',#800);
#635=CIRCLE('',#801,37.5);
#636=VERTEX_POINT('',#802);
#637=LINE('',#803,#804);
#638=VERTEX_POINT('',#805);
#639=CIRCLE('',#806,37.5);
#640=VERTEX_POINT('',#807);
#641=LINE('',#808,#809);
#642=VERTEX_POINT('',#810);
#643=CIRCLE('',#811,37.5);
#644=VERTEX_POINT('',#812);
#645=LINE('',#813,#814);
#646=VERTEX_POINT('',#815);
#647=CIRCLE('',#816,37.5);
#648=VERTEX_POINT('',#817);
#649=B_SPLINE_CURVE_WITH_KNOTS('',1,(#818,#819),.UNSPECIFIED.,.F.,.F.,(2,2),(5.0,32.0),.UNSPECIFIED.);
#650=VERTEX_POINT('',#820);
#651=CIRCLE('',#821,37.5);
#652=VERTEX_POINT('',#822);
#653=LINE('',#823,#824);
#654=VERTEX_POINT('',#825);
#655=CIRCLE('',#826,37.5);
#656=VERTEX_POINT('',#827);
#657=LINE('',#828,#829);
#658=VERTEX_POINT('',#830);
#659=CIRCLE('',#831,37.5);
#660=VERTEX_POINT('',#832);
#661=LINE('',#833,#834);
#662=VERTEX_POINT('',#835);
#663=CIRCLE('',#836,37.5);
#664=VERTEX_POINT('',#837);
#665=LINE('',#838,#839);
#666=CIRCLE('',#840,37.5);
#667=VERTEX_POINT('',#841);
#668=VERTEX_POINT('',#842);
#669=CIRCLE('',#843,5.0);
#670=VERTEX_POINT('',#844);
#671=LINE('',#845,#846);
#672=VERTEX_POINT('',#847);
#673=CIRCLE('',#848,5.0);
#674=LINE('',#849,#850);
#675=VERTEX_POINT('',#851);
#676=LINE('',#852,#853);
#677=VERTEX_POINT('',#854);
#678=LINE('',#855,#856);
#679=LINE('',#857,#858);
#680=VERTEX_POINT('',#859);
#681=VERTEX_POINT('',#860);
#682=CIRCLE('',#861,5.0);
#683=VERTEX_POINT('',#862);
#684=LINE('',#863,#864);
#685=VERTEX_POINT('',#865);
#686=CIRCLE('',#866,5.0);
#687=LINE('',#867,#868);
#688=VERTEX_POINT('',#869);
#689=LINE('',#870,#871);
#690=VERTEX_POINT('',#872);
#691=LINE('',#873,#874);
#692=LINE('',#875,#876);
#693=LINE('',#877,#878);
#694=LINE('',#879,#880);
#695=VERTEX_POINT('',#881);
#696=VERTEX_POINT('',#882);
#697=LINE('',#883,#884);
#698=VERTEX_POINT('',#885);
#699=LINE('',#886,#887);
#700=VERTEX_POINT('',#888);
#701=LINE('',#889,#890);
#702=LINE('',#891,#892);
#703=VERTEX_POINT('',#893);
#704=VERTEX_POINT('',#894);
#705=LINE('',#895,#896);
#706=LINE('',#897,#898);
#707=LINE('',#899,#900);
#708=VERTEX_POINT('',#901);
#709=VERTEX_POINT('',#902);
#710=LINE('',#903,#904);
#711=LINE('',#905,#906);
#712=LINE('',#907,#908);
#713=VERTEX_POINT('',#909);
#714=CIRCLE('',#910,5.0);
#715=VERTEX_POINT('',#911);
#716=LINE('',#912,#913);
#717=CIRCLE('',#914,5.0);
#718=VERTEX_POINT('',#915);
#719=CIRCLE('',#916,5.0);
#720=VERTEX_POINT('',#917);
#721=LINE('',#918,#919);
#722=CIRCLE('',#920,5.0);
#723=VERTEX_POINT('',#921);
#724=VERTEX_POINT('',#922);
#725=LINE('',#923,#924);
#726=VERTEX_POINT('',#925);
#727=LINE('',#926,#927);
#728=VERTEX_POINT('',#928);
#729=LINE('',#929,#930);
#730=LINE('',#931,#932);
#731=VERTEX_POINT('',#933);
#732=VERTEX_POINT('',#934);
#733=LINE('',#935,#936);
#734=VERTEX_POINT('',#937);
#735=LINE('',#938,#939);
#736=VERTEX_POINT('',#940);
#737=LINE('',#941,#942);
#738=LINE('',#943,#944);
#739=CIRCLE('',#945,37.5);
#740=VERTEX_POINT('',#946);
#741=CIRCLE('',#947,25.0);
#742=VERTEX_POINT('',#948);
#743=LINE('',#949,#950);
#744=CIRCLE('',#951,5.0);
#745=LINE('',#952,#953);
#746=VERTEX_POINT('',#954);
#747=LINE('',#955,#956);
#748=VERTEX_POINT('',#957);
#749=LINE('',#958,#959);
#750=LINE('',#960,#961);
#751=LINE('',#962,#963);
#752=VERTEX_POINT('',#964);
#753=LINE('',#965,#966);
#754=CIRCLE('',#967,5.0);
#755=LINE('',#968,#969);
#756=LINE('',#970,#971);
#757=VERTEX_POINT('',#972);
#758=CIRCLE('',#973,5.0);
#759=LINE('',#974,#975);
#760=VERTEX_POINT('',#976);
#761=CIRCLE('',#977,5.0);
#762=LINE('',#978,#979);
#763=LINE('',#980,#981);
#764=LINE('',#982,#983);
#765=VERTEX_POINT('',#984);
#766=LINE('',#985,#986);
#767=VERTEX_POINT('',#987);
#768=LINE('',#988,#989);
#769=LINE('',#990,#991);
#770=VERTEX_POINT('',#992);
#771=CIRCLE('',#993,37.5);
#772=LINE('',#994,#995);
#773=LINE('',#996,#997);
#774=VERTEX_POINT('',#998);
#775=LINE('',#999,#1000);
#776=LINE('',#1001,#1002);
#777=LINE('',#1003,#1004);
#778=VERTEX_POINT('',#1005);
#779=CIRCLE('',#1006,37.5);
#780=LINE('',#1007,#1008);
#781=LINE('',#1009,#1010);
#782=LINE('',#1011,#1012);
#783=VERTEX_POINT('',#1013);
#784=LINE('',#1014,#1015);
#785=LINE('',#1016,#1017);
#786=CIRCLE('',#1018,37.5);
#787=CIRCLE('',#1019,37.5);
#788=CIRCLE('',#1020,37.5);
#789=VERTEX_POINT('',#1021);
#790=CIRCLE('',#1022,25.0);
#791=CARTESIAN_POINT('',(32.0,-37.5,0.0));
#792=CARTESIAN_POINT('',(5.0,-37.5,0.0));
#793=CARTESIAN_POINT('',(0.0,-37.5,0.0));
#794=VECTOR('',#1023,37.5);
#795=CARTESIAN_POINT('',(32.0,37.5,-4.59242549680257E-15));
#796=AXIS2_PLACEMENT_3D('',#1024,#1025,#1026);
#797=CARTESIAN_POINT('',(5.0,37.5,-4.592425496803E-15));
#798=CARTESIAN_POINT('',(32.0,37.5,-4.592425496803E-15));
#799=CARTESIAN_POINT('',(5.0,37.5,-4.592425496803E-15));
#800=CARTESIAN_POINT('',(5.0,32.0,19.551214796017));
#801=AXIS2_PLACEMENT_3D('',#1027,#1028,#1029);
#802=CARTESIAN_POINT('',(19.0,32.0,19.551214796017));
#803=CARTESIAN_POINT('',(0.0,32.0,19.551214796017));
#804=VECTOR('',#1030,1.0);
#805=CARTESIAN_POINT('',(19.0,19.551214796017,32.0));
#806=AXIS2_PLACEMENT_3D('',#1031,#1032,#1033);
#807=CARTESIAN_POINT('',(-19.0,19.551214796017,32.0000000000001));
#808=CARTESIAN_POINT('',(0.0,19.551214796017,32.0));
#809=VECTOR('',#1034,1.0);
#810=CARTESIAN_POINT('',(-19.0,32.0,19.551214796017));
#811=AXIS2_PLACEMENT_3D('',#1035,#1036,#1037);
#812=CARTESIAN_POINT('',(-5.0,32.0,19.551214796017));
#813=CARTESIAN_POINT('',(0.0,32.0,19.551214796017));
#814=VECTOR('',#1038,1.0);
#815=CARTESIAN_POINT('',(-5.0,37.5,-4.59242549680257E-15));
#816=AXIS2_PLACEMENT_3D('',#1039,#1040,#1041);
#817=CARTESIAN_POINT('',(-32.0,37.5,1.37772764904077E-14));
#818=CARTESIAN_POINT('',(-5.0,37.5,-4.592425496803E-15));
#819=CARTESIAN_POINT('',(-32.0,37.5,-4.592425496803E-15));
#820=CARTESIAN_POINT('',(-32.0,-37.5,0.0));
#821=AXIS2_PLACEMENT_3D('',#1042,#1043,#1044);
#822=CARTESIAN_POINT('',(-5.0,-37.5,0.0));
#823=CARTESIAN_POINT('',(0.0,-37.5,0.0));
#824=VECTOR('',#1045,37.5);
#825=CARTESIAN_POINT('',(-5.0,-32.0,19.551214796017));
#826=AXIS2_PLACEMENT_3D('',#1046,#1047,#1048);
#827=CARTESIAN_POINT('',(-19.0,-32.0000000000001,19.5512147960171));
#828=CARTESIAN_POINT('',(0.0,-32.0,19.551214796017));
#829=VECTOR('',#1049,1.0);
#830=CARTESIAN_POINT('',(-19.0,-19.5512147960147,31.9999999999984));
#831=AXIS2_PLACEMENT_3D('',#1050,#1051,#1052);
#832=CARTESIAN_POINT('',(19.0,-19.5512147960147,31.9999999999984));
#833=CARTESIAN_POINT('',(0.0,-19.55121479601,32.0));
#834=VECTOR('',#1053,1.0);
#835=CARTESIAN_POINT('',(19.0,-32.0,19.551214796017));
#836=AXIS2_PLACEMENT_3D('',#1054,#1055,#1056);
#837=CARTESIAN_POINT('',(5.0,-32.0,19.551214796017));
#838=CARTESIAN_POINT('',(0.0,-32.0,19.551214796017));
#839=VECTOR('',#1057,1.0);
#840=AXIS2_PLACEMENT_3D('',#1058,#1059,#1060);
#841=CARTESIAN_POINT('',(19.0,-32.0,58.0));
#842=CARTESIAN_POINT('',(19.0,-27.0,63.0));
#843=AXIS2_PLACEMENT_3D('',#1061,#1062,#1063);
#844=CARTESIAN_POINT('',(-19.0,-27.0,63.0));
#845=CARTESIAN_POINT('',(0.0,-27.0,63.0));
#846=VECTOR('',#1064,1.0);
#847=CARTESIAN_POINT('',(-19.0,-32.0,58.0));
#848=AXIS2_PLACEMENT_3D('',#1065,#1066,#1067);
#849=CARTESIAN_POINT('',(0.0,-32.0,58.0));
#850=VECTOR('',#1068,1.0);
#851=CARTESIAN_POINT('',(19.0,-12.5,63.0));
#852=CARTESIAN_POINT('',(19.0,32.0,63.0));
#853=VECTOR('',#1069,1.0);
#854=CARTESIAN_POINT('',(-19.0,-12.5,63.0));
#855=CARTESIAN_POINT('',(0.0,-12.5,63.0));
#856=VECTOR('',#1070,1.0);
#857=CARTESIAN_POINT('',(-19.0,32.0,63.0));
#858=VECTOR('',#1071,1.0);
#859=CARTESIAN_POINT('',(-19.0,-22.0,48.0));
#860=CARTESIAN_POINT('',(-19.0,-17.0,53.0));
#861=AXIS2_PLACEMENT_3D('',#1072,#1073,#1074);
#862=CARTESIAN_POINT('',(19.0,-17.0,53.0));
#863=CARTESIAN_POINT('',(0.0,-17.0,53.0));
#864=VECTOR('',#1075,1.0);
#865=CARTESIAN_POINT('',(19.0,-22.0,48.0));
#866=AXIS2_PLACEMENT_3D('',#1076,#1077,#1078);
#867=CARTESIAN_POINT('',(0.0,-22.0,48.0));
#868=VECTOR('',#1079,1.0);
#869=CARTESIAN_POINT('',(-19.0,-12.5,53.0));
#870=CARTESIAN_POINT('',(-19.0,11.0,53.0));
#871=VECTOR('',#1080,1.0);
#872=CARTESIAN_POINT('',(19.0,-12.5,53.0));
#873=CARTESIAN_POINT('',(0.0,-12.5,53.0));
#874=VECTOR('',#1081,1.0);
#875=CARTESIAN_POINT('',(19.0,11.0,53.0));
#876=VECTOR('',#1082,1.0);
#877=CARTESIAN_POINT('',(-19.0,-12.5,52.137803699004));
#878=VECTOR('',#1083,1.0);
#879=CARTESIAN_POINT('',(19.0,-12.5,52.137803699004));
#880=VECTOR('',#1084,1.0);
#881=CARTESIAN_POINT('',(19.0,12.5,63.0));
#882=CARTESIAN_POINT('',(-19.0,12.5,63.0));
#883=CARTESIAN_POINT('',(0.0,12.5,63.0));
#884=VECTOR('',#1085,1.0);
#885=CARTESIAN_POINT('',(-19.0,12.5,53.0));
#886=CARTESIAN_POINT('',(-19.0,12.5,47.137803699004));
#887=VECTOR('',#1086,1.0);
#888=CARTESIAN_POINT('',(19.0,12.5,53.0));
#889=CARTESIAN_POINT('',(0.0,12.5,53.0));
#890=VECTOR('',#1087,1.0);
#891=CARTESIAN_POINT('',(19.0,12.5,47.137803699004));
#892=VECTOR('',#1088,1.0);
#893=CARTESIAN_POINT('',(-19.0,17.0,53.0));
#894=CARTESIAN_POINT('',(19.0,17.0,53.0));
#895=CARTESIAN_POINT('',(0.0,17.0,53.0));
#896=VECTOR('',#1089,1.0);
#897=CARTESIAN_POINT('',(19.0,11.0,53.0));
#898=VECTOR('',#1090,1.0);
#899=CARTESIAN_POINT('',(-19.0,11.0,53.0));
#900=VECTOR('',#1091,1.0);
#901=CARTESIAN_POINT('',(19.0,27.0,63.0));
#902=CARTESIAN_POINT('',(-19.0,27.0,63.0));
#903=CARTESIAN_POINT('',(0.0,27.0,63.0));
#904=VECTOR('',#1092,1.0);
#905=CARTESIAN_POINT('',(-19.0,32.0,63.0));
#906=VECTOR('',#1093,1.0);
#907=CARTESIAN_POINT('',(19.0,32.0,63.0));
#908=VECTOR('',#1094,1.0);
#909=CARTESIAN_POINT('',(-19.0,22.0,48.0));
#910=AXIS2_PLACEMENT_3D('',#1095,#1096,#1097);
#911=CARTESIAN_POINT('',(19.0,22.0,48.0));
#912=CARTESIAN_POINT('',(0.0,22.0,48.0));
#913=VECTOR('',#1098,1.0);
#914=AXIS2_PLACEMENT_3D('',#1099,#1100,#1101);
#915=CARTESIAN_POINT('',(19.0,32.0,58.0));
#916=AXIS2_PLACEMENT_3D('',#1102,#1103,#1104);
#917=CARTESIAN_POINT('',(-19.0,32.0,58.0));
#918=CARTESIAN_POINT('',(0.0,32.0,58.0));
#919=VECTOR('',#1105,1.0);
#920=AXIS2_PLACEMENT_3D('',#1106,#1107,#1108);
#921=CARTESIAN_POINT('',(-5.0,-47.0,-13.0));
#922=CARTESIAN_POINT('',(5.0,-47.0,-13.0));
#923=CARTESIAN_POINT('',(0.0,-47.0,-13.0));
#924=VECTOR('',#1109,1.0);
#925=CARTESIAN_POINT('',(5.0,-47.0,32.0));
#926=CARTESIAN_POINT('',(5.0,-47.0,32.0));
#927=VECTOR('',#1110,1.0);
#928=CARTESIAN_POINT('',(-5.0,-47.0,32.0));
#929=CARTESIAN_POINT('',(0.0,-47.0,32.0));
#930=VECTOR('',#1111,1.0);
#931=CARTESIAN_POINT('',(-5.0,-47.0,32.0));
#932=VECTOR('',#1112,1.0);
#933=CARTESIAN_POINT('',(-5.0,47.0,32.0));
#934=CARTESIAN_POINT('',(5.0,47.0,32.0));
#935=CARTESIAN_POINT('',(0.0,47.0,32.0));
#936=VECTOR('',#1113,1.0);
#937=CARTESIAN_POINT('',(5.0,47.0,-13.0));
#938=CARTESIAN_POINT('',(5.0,47.0,-13.0));
#939=VECTOR('',#1114,1.0);
#940=CARTESIAN_POINT('',(-5.0,47.0,-13.0));
#941=CARTESIAN_POINT('',(0.0,47.0,-13.0));
#942=VECTOR('',#1115,1.0);
#943=CARTESIAN_POINT('',(-5.0,47.0,-13.0));
#944=VECTOR('',#1116,1.0);
#945=AXIS2_PLACEMENT_3D('',#1117,#1118,#1119);
#946=CARTESIAN_POINT('',(-32.0,-25.0,3.06161699786838E-15));
#947=AXIS2_PLACEMENT_3D('',#1120,#1121,#1122);
#948=CARTESIAN_POINT('',(-19.0,-22.0,36.300151516468));
#949=CARTESIAN_POINT('',(-19.0,-22.0,47.137803699004));
#950=VECTOR('',#1123,1.0);
#951=AXIS2_PLACEMENT_3D('',#1124,#1125,#1126);
#952=CARTESIAN_POINT('',(-19.0,-32.0,63.0));
#953=VECTOR('',#1127,1.0);
#954=CARTESIAN_POINT('',(-5.0,-32.0,32.0));
#955=CARTESIAN_POINT('',(-5.0,-32.0,36.25));
#956=VECTOR('',#1128,1.0);
#957=CARTESIAN_POINT('',(5.0,-32.0,32.0));
#958=CARTESIAN_POINT('',(0.0,-32.0,32.0));
#959=VECTOR('',#1129,1.0);
#960=CARTESIAN_POINT('',(5.0,-32.0,36.25));
#961=VECTOR('',#1130,1.0);
#962=CARTESIAN_POINT('',(19.0,-32.0,63.0));
#963=VECTOR('',#1131,1.0);
#964=CARTESIAN_POINT('',(19.0,-22.0,36.300151516468));
#965=CARTESIAN_POINT('',(0.0,-22.0,36.300151516468));
#966=VECTOR('',#1132,1.0);
#967=AXIS2_PLACEMENT_3D('',#1133,#1134,#1135);
#968=CARTESIAN_POINT('',(19.0,-22.0,47.137803699004));
#969=VECTOR('',#1136,1.0);
#970=CARTESIAN_POINT('',(-19.0,32.0,19.551214796017));
#971=VECTOR('',#1137,1.0);
#972=CARTESIAN_POINT('',(-19.0,22.0,36.300151516468));
#973=AXIS2_PLACEMENT_3D('',#1138,#1139,#1140);
#974=CARTESIAN_POINT('',(-19.0,22.0,36.637803699004));
#975=VECTOR('',#1141,1.0);
#976=CARTESIAN_POINT('',(19.0,22.0,36.300151516468));
#977=AXIS2_PLACEMENT_3D('',#1142,#1143,#1144);
#978=CARTESIAN_POINT('',(0.0,22.0,36.300151516468));
#979=VECTOR('',#1145,1.0);
#980=CARTESIAN_POINT('',(19.0,22.0,36.637803699004));
#981=VECTOR('',#1146,1.0);
#982=CARTESIAN_POINT('',(19.0,32.0,19.551214796017));
#983=VECTOR('',#1147,1.0);
#984=CARTESIAN_POINT('',(5.0,32.0,32.0));
#985=CARTESIAN_POINT('',(5.0,32.0,14.525607398009));
#986=VECTOR('',#1148,1.0);
#987=CARTESIAN_POINT('',(-5.0,32.0,32.0));
#988=CARTESIAN_POINT('',(0.0,32.0,32.0));
#989=VECTOR('',#1149,1.0);
#990=CARTESIAN_POINT('',(-5.0,32.0,14.525607398009));
#991=VECTOR('',#1150,1.0);
#992=CARTESIAN_POINT('',(-5.0,-35.1745646739227,-13.000000000001));
#993=AXIS2_PLACEMENT_3D('',#1151,#1152,#1153);
#994=CARTESIAN_POINT('',(-5.0,-47.0,-13.0));
#995=VECTOR('',#1154,1.0);
#996=CARTESIAN_POINT('',(-5.0,47.0,32.0));
#997=VECTOR('',#1155,1.0);
#998=CARTESIAN_POINT('',(5.0,-35.17456467392,-13.0));
#999=CARTESIAN_POINT('',(0.0,-35.17456467392,-13.0));
#1000=VECTOR('',#1156,1.0);
#1001=CARTESIAN_POINT('',(5.0,-47.0,-13.0));
#1002=VECTOR('',#1157,1.0);
#1003=CARTESIAN_POINT('',(5.0,47.0,32.0));
#1004=VECTOR('',#1158,1.0);
#1005=CARTESIAN_POINT('',(-5.0,35.174564673923,-13.0));
#1006=AXIS2_PLACEMENT_3D('',#1159,#1160,#1161);
#1007=CARTESIAN_POINT('',(-5.0,47.0,32.0));
#1008=VECTOR('',#1162,1.0);
#1009=CARTESIAN_POINT('',(-5.0,-47.0,-13.0));
#1010=VECTOR('',#1163,1.0);
#1011=CARTESIAN_POINT('',(5.0,47.0,32.0));
#1012=VECTOR('',#1164,1.0);
#1013=CARTESIAN_POINT('',(5.0,35.174564673923,-13.0));
#1014=CARTESIAN_POINT('',(0.0,35.174564673923,-13.0));
#1015=VECTOR('',#1165,1.0);
#1016=CARTESIAN_POINT('',(5.0,-47.0,-13.0));
#1017=VECTOR('',#1166,1.0);
#1018=AXIS2_PLACEMENT_3D('',#1167,#1168,#1169);
#1019=AXIS2_PLACEMENT_3D('',#1170,#1171,#1172);
#1020=AXIS2_PLACEMENT_3D('',#1173,#1174,#1175);
#1021=CARTESIAN_POINT('',(32.0,-25.0,3.06161699786838E-15));
#1022=AXIS2_PLACEMENT_3D('',#1176,#1177,#1178);
#1023=DIRECTION('',(-1.0,-0.0,-0.0));
#1024=CARTESIAN_POINT('',(32.0,0.0,0.0));
#1025=DIRECTION('',(-1.0,-0.0,0.0));
#1026=DIRECTION('',(0.0,-1.0,0.0));
#1027=CARTESIAN_POINT('',(5.0,0.0,0.0));
#1028=DIRECTION('',(-1.0,0.0,0.0));
#1029=DIRECTION('',(0.0,-1.0,0.0));
#1030=DIRECTION('',(-1.0,-0.0,-0.0));
#1031=CARTESIAN_POINT('',(19.0,0.0,0.0));
#1032=DIRECTION('',(-1.0,0.0,0.0));
#1033=DIRECTION('',(0.0,-1.0,0.0));
#1034=DIRECTION('',(1.0,0.0,0.0));
#1035=CARTESIAN_POINT('',(-19.0,0.0,0.0));
#1036=DIRECTION('',(1.0,0.0,0.0));
#1037=DIRECTION('',(0.0,-1.0,0.0));
#1038=DIRECTION('',(-1.0,-0.0,-0.0));
#1039=CARTESIAN_POINT('',(-5.0,0.0,0.0));
#1040=DIRECTION('',(1.0,0.0,0.0));
#1041=DIRECTION('',(0.0,-1.0,0.0));
#1042=CARTESIAN_POINT('',(-32.0,0.0,0.0));
#1043=DIRECTION('',(-1.0,0.0,0.0));
#1044=DIRECTION('',(0.0,-1.0,0.0));
#1045=DIRECTION('',(-1.0,-0.0,-0.0));
#1046=CARTESIAN_POINT('',(-5.0,0.0,0.0));
#1047=DIRECTION('',(1.0,0.0,0.0));
#1048=DIRECTION('',(0.0,-1.0,0.0));
#1049=DIRECTION('',(1.0,0.0,0.0));
#1050=CARTESIAN_POINT('',(-19.0,0.0,0.0));
#1051=DIRECTION('',(1.0,0.0,0.0));
#1052=DIRECTION('',(0.0,-1.0,0.0));
#1053=DIRECTION('',(-1.0,0.0,0.0));
#1054=CARTESIAN_POINT('',(19.0,0.0,0.0));
#1055=DIRECTION('',(-1.0,0.0,0.0));
#1056=DIRECTION('',(0.0,-1.0,0.0));
#1057=DIRECTION('',(1.0,0.0,0.0));
#1058=CARTESIAN_POINT('',(5.0,0.0,0.0));
#1059=DIRECTION('',(-1.0,0.0,0.0));
#1060=DIRECTION('',(0.0,-1.0,0.0));
#1061=CARTESIAN_POINT('',(19.0,-27.0,58.0));
#1062=DIRECTION('',(-1.0,0.0,0.0));
#1063=DIRECTION('',(0.0,-0.707106781186547,0.707106781186547));
#1064=DIRECTION('',(-1.0,0.0,0.0));
#1065=CARTESIAN_POINT('',(-19.0,-27.0,58.0));
#1066=DIRECTION('',(1.0,0.0,0.0));
#1067=DIRECTION('',(0.0,-0.707106781186547,0.707106781186547));
#1068=DIRECTION('',(1.0,0.0,0.0));
#1069=DIRECTION('',(-0.0,1.0,-0.0));
#1070=DIRECTION('',(-1.0,0.0,0.0));
#1071=DIRECTION('',(-0.0,-1.0,-0.0));
#1072=CARTESIAN_POINT('',(-19.0,-17.0,48.0));
#1073=DIRECTION('',(-1.0,0.0,0.0));
#1074=DIRECTION('',(0.0,-0.707106781186547,0.707106781186547));
#1075=DIRECTION('',(1.0,0.0,0.0));
#1076=CARTESIAN_POINT('',(19.0,-17.0,48.0));
#1077=DIRECTION('',(1.0,0.0,0.0));
#1078=DIRECTION('',(0.0,-0.707106781186547,0.707106781186547));
#1079=DIRECTION('',(-1.0,0.0,0.0));
#1080=DIRECTION('',(-0.0,1.0,-0.0));
#1081=DIRECTION('',(1.0,0.0,0.0));
#1082=DIRECTION('',(-0.0,-1.0,-0.0));
#1083=DIRECTION('',(-0.0,-0.0,1.0));
#1084=DIRECTION('',(-0.0,-0.0,-1.0));
#1085=DIRECTION('',(-1.0,-0.0,-0.0));
#1086=DIRECTION('',(-0.0,-0.0,-1.0));
#1087=DIRECTION('',(1.0,-0.0,-0.0));
#1088=DIRECTION('',(-0.0,-0.0,1.0));
#1089=DIRECTION('',(1.0,-0.0,-0.0));
#1090=DIRECTION('',(-0.0,-1.0,-0.0));
#1091=DIRECTION('',(-0.0,1.0,-0.0));
#1092=DIRECTION('',(-1.0,-0.0,-0.0));
#1093=DIRECTION('',(-0.0,-1.0,-0.0));
#1094=DIRECTION('',(-0.0,1.0,-0.0));
#1095=CARTESIAN_POINT('',(-19.0,17.0,48.0));
#1096=DIRECTION('',(-1.0,0.0,0.0));
#1097=DIRECTION('',(0.0,0.707106781186547,0.707106781186547));
#1098=DIRECTION('',(1.0,0.0,0.0));
#1099=CARTESIAN_POINT('',(19.0,17.0,48.0));
#1100=DIRECTION('',(1.0,0.0,-0.0));
#1101=DIRECTION('',(0.0,0.707106781186547,0.707106781186547));
#1102=CARTESIAN_POINT('',(19.0,27.0,58.0));
#1103=DIRECTION('',(-1.0,0.0,0.0));
#1104=DIRECTION('',(0.0,0.707106781186547,0.707106781186547));
#1105=DIRECTION('',(-1.0,0.0,0.0));
#1106=CARTESIAN_POINT('',(-19.0,27.0,58.0));
#1107=DIRECTION('',(1.0,0.0,-0.0));
#1108=DIRECTION('',(0.0,0.707106781186547,0.707106781186547));
#1109=DIRECTION('',(1.0,-0.0,-0.0));
#1110=DIRECTION('',(-0.0,-1.973729821556E-16,1.0));
#1111=DIRECTION('',(-1.0,-0.0,-0.0));
#1112=DIRECTION('',(-0.0,1.973729821556E-16,-1.0));
#1113=DIRECTION('',(1.0,0.0,0.0));
#1114=DIRECTION('',(-0.0,-1.973729821556E-16,-1.0));
#1115=DIRECTION('',(-1.0,-0.0,-0.0));
#1116=DIRECTION('',(-0.0,1.973729821556E-16,1.0));
#1117=CARTESIAN_POINT('',(-32.0,0.0,0.0));
#1118=DIRECTION('',(-1.0,0.0,0.0));
#1119=DIRECTION('',(0.0,-1.0,0.0));
#1120=CARTESIAN_POINT('',(-32.0,0.0,0.0));
#1121=DIRECTION('',(1.0,0.0,0.0));
#1122=DIRECTION('',(0.0,1.0,0.0));
#1123=DIRECTION('',(0.0,0.0,-1.0));
#1124=CARTESIAN_POINT('',(-19.0,-17.0,36.300151516468));
#1125=DIRECTION('',(1.0,-0.0,0.0));
#1126=DIRECTION('',(-0.0,-0.510242959202948,-0.860030303293912));
#1127=DIRECTION('',(0.0,0.0,1.0));
#1128=DIRECTION('',(0.0,0.0,1.0));
#1129=DIRECTION('',(1.0,0.0,0.0));
#1130=DIRECTION('',(0.0,0.0,-1.0));
#1131=DIRECTION('',(-0.0,-0.0,1.0));
#1132=DIRECTION('',(1.0,0.0,0.0));
#1133=CARTESIAN_POINT('',(19.0,-17.0,36.300151516468));
#1134=DIRECTION('',(1.0,0.0,0.0));
#1135=DIRECTION('',(0.0,-0.510242959202948,-0.860030303293912));
#1136=DIRECTION('',(-0.0,-0.0,-1.0));
#1137=DIRECTION('',(0.0,0.0,-1.0));
#1138=CARTESIAN_POINT('',(-19.0,17.0,36.300151516468));
#1139=DIRECTION('',(1.0,-0.0,0.0));
#1140=DIRECTION('',(0.0,0.510242959202948,-0.860030303293912));
#1141=DIRECTION('',(0.0,0.0,1.0));
#1142=CARTESIAN_POINT('',(19.0,17.0,36.300151516468));
#1143=DIRECTION('',(1.0,-0.0,0.0));
#1144=DIRECTION('',(0.0,0.510242959202948,-0.860030303293912));
#1145=DIRECTION('',(-1.0,0.0,0.0));
#1146=DIRECTION('',(-0.0,-0.0,1.0));
#1147=DIRECTION('',(-0.0,-0.0,-1.0));
#1148=DIRECTION('',(0.0,0.0,1.0));
#1149=DIRECTION('',(-1.0,0.0,0.0));
#1150=DIRECTION('',(0.0,0.0,-1.0));
#1151=CARTESIAN_POINT('',(-5.0,0.0,0.0));
#1152=DIRECTION('',(1.0,0.0,0.0));
#1153=DIRECTION('',(0.0,-1.0,0.0));
#1154=DIRECTION('',(0.0,-1.0,0.0));
#1155=DIRECTION('',(0.0,1.0,0.0));
#1156=DIRECTION('',(1.0,0.0,0.0));
#1157=DIRECTION('',(-0.0,-1.0,-0.0));
#1158=DIRECTION('',(-0.0,1.0,-0.0));
#1159=CARTESIAN_POINT('',(-5.0,0.0,0.0));
#1160=DIRECTION('',(1.0,0.0,0.0));
#1161=DIRECTION('',(0.0,-1.0,0.0));
#1162=DIRECTION('',(0.0,1.0,0.0));
#1163=DIRECTION('',(0.0,-1.0,0.0));
#1164=DIRECTION('',(-0.0,1.0,-0.0));
#1165=DIRECTION('',(-1.0,0.0,0.0));
#1166=DIRECTION('',(-0.0,-1.0,-0.0));
#1167=CARTESIAN_POINT('',(5.0,0.0,0.0));
#1168=DIRECTION('',(-1.0,0.0,0.0));
#1169=DIRECTION('',(0.0,-1.0,0.0));
#1170=CARTESIAN_POINT('',(5.0,0.0,0.0));
#1171=DIRECTION('',(-1.0,0.0,0.0));
#1172=DIRECTION('',(0.0,-1.0,0.0));
#1173=CARTESIAN_POINT('',(32.0,0.0,0.0));
#1174=DIRECTION('',(-1.0,-0.0,0.0));
#1175=DIRECTION('',(0.0,-1.0,0.0));
#1176=CARTESIAN_POINT('',(32.0,0.0,0.0));
#1177=DIRECTION('',(1.0,0.0,-0.0));
#1178=DIRECTION('',(0.0,1.0,0.0));
ENDSEC;
END-ISO-10303-21;
