ISO-10303-21;
HEADER;
FILE_DESCRIPTION(('STEP AP214'),'1');
FILE_NAME('B10.step','2023-05-04T14:47:54',('Mambo'),(' '),'Spatial InterOp 3D',' ',' ');
FILE_SCHEMA(('automotive_design'));
ENDSEC;
DATA;
#1=PRODUCT_DEFINITION_CONTEXT('',#9,'design');
#2=APPLICATION_PROTOCOL_DEFINITION('INTERNATIONAL STANDARD','automotive_design',1994,#9);
#3=PRODUCT_CATEGORY_RELATIONSHIP('NONE','NONE',#10,#11);
#4=SHAPE_DEFINITION_REPRESENTATION(#12,#13);
#5= (GEOMETRIC_REPRESENTATION_CONTEXT(3)GLOBAL_UNCERTAINTY_ASSIGNED_CONTEXT((#16))GLOBAL_UNIT_ASSIGNED_CONTEXT((#18,#19,#20))REPRESENTATION_CONTEXT('NONE','WORKSPACE'));
#9=APPLICATION_CONTEXT(' ');
#10=PRODUCT_CATEGORY('part','NONE');
#11=PRODUCT_RELATED_PRODUCT_CATEGORY('detail',' ',(#22));
#12=PRODUCT_DEFINITION_SHAPE('NONE','NONE',#23);
#13=ADVANCED_BREP_SHAPE_REPRESENTATION('1',(#24,#25),#5);
#16=UNCERTAINTY_MEASURE_WITH_UNIT(LENGTH_MEASURE(1.0E-06),#18,'','');
#18= (CONVERSION_BASED_UNIT('MILLIMETRE',#28)LENGTH_UNIT()NAMED_UNIT(#31));
#19= (NAMED_UNIT(#33)PLANE_ANGLE_UNIT()SI_UNIT($,.RADIAN.));
#20= (NAMED_UNIT(#33)SOLID_ANGLE_UNIT()SI_UNIT($,.STERADIAN.));
#22=PRODUCT('1','1','PART-1-DESC',(#39));
#23=PRODUCT_DEFINITION('NONE','NONE',#40,#1);
#24=MANIFOLD_SOLID_BREP('1',#41);
#25=AXIS2_PLACEMENT_3D('',#42,#43,#44);
#28=LENGTH_MEASURE_WITH_UNIT(LENGTH_MEASURE(1.0),#45);
#31=DIMENSIONAL_EXPONENTS(1.0,0.0,0.0,0.0,0.0,0.0,0.0);
#33=DIMENSIONAL_EXPONENTS(0.0,0.0,0.0,0.0,0.0,0.0,0.0);
#39=PRODUCT_CONTEXT('',#9,'mechanical');
#40=PRODUCT_DEFINITION_FORMATION_WITH_SPECIFIED_SOURCE(' ','NONE',#22,.NOT_KNOWN.);
#41=CLOSED_SHELL('',(#46,#47,#48,#49,#50,#51,#52));
#42=CARTESIAN_POINT('',(0.0,0.0,0.0));
#43=DIRECTION('',(0.0,0.0,1.0));
#44=DIRECTION('',(1.0,0.0,0.0));
#45= (NAMED_UNIT(#31)LENGTH_UNIT()SI_UNIT(.MILLI.,.METRE.));
#46=ADVANCED_FACE('',(#54),#55,.F.);
#47=ADVANCED_FACE('',(#56),#57,.F.);
#48=ADVANCED_FACE('',(#58,#59),#60,.T.);
#49=ADVANCED_FACE('',(#61),#62,.T.);
#50=ADVANCED_FACE('',(#63,#64),#65,.F.);
#51=ADVANCED_FACE('',(#66),#67,.T.);
#52=ADVANCED_FACE('',(#68,#69),#70,.F.);
#54=FACE_OUTER_BOUND('',#71,.T.);
#55=PLANE('',#72);
#56=FACE_OUTER_BOUND('',#73,.T.);
#57=PLANE('',#74);
#58=FACE_OUTER_BOUND('',#75,.T.);
#59=FACE_BOUND('',#76,.T.);
#60=PLANE('',#77);
#61=FACE_OUTER_BOUND('',#78,.T.);
#62=PLANE('',#79);
#63=FACE_OUTER_BOUND('',#80,.T.);
#64=FACE_BOUND('',#81,.T.);
#65=PLANE('',#82);
#66=FACE_OUTER_BOUND('',#83,.T.);
#67=PLANE('',#84);
#68=FACE_BOUND('',#85,.T.);
#69=FACE_BOUND('',#86,.T.);
#70=CYLINDRICAL_SURFACE('',#87,2.5);
#71=EDGE_LOOP('',(#88,#89,#90,#91));
#72=AXIS2_PLACEMENT_3D('',#92,#93,#94);
#73=EDGE_LOOP('',(#95,#96,#97,#98));
#74=AXIS2_PLACEMENT_3D('',#99,#100,#101);
#75=EDGE_LOOP('',(#102,#103,#104,#105));
#76=EDGE_LOOP('',(#106));
#77=AXIS2_PLACEMENT_3D('',#107,#108,#109);
#78=EDGE_LOOP('',(#110,#111,#112,#113));
#79=AXIS2_PLACEMENT_3D('',#114,#115,#116);
#80=EDGE_LOOP('',(#117,#118,#119,#120));
#81=EDGE_LOOP('',(#121));
#82=AXIS2_PLACEMENT_3D('',#122,#123,#124);
#83=EDGE_LOOP('',(#125,#126,#127,#128));
#84=AXIS2_PLACEMENT_3D('',#129,#130,#131);
#85=EDGE_LOOP('',(#132));
#86=EDGE_LOOP('',(#133));
#87=AXIS2_PLACEMENT_3D('',#134,#135,#136);
#88=ORIENTED_EDGE('',*,*,#137,.T.);
#89=ORIENTED_EDGE('',*,*,#138,.F.);
#90=ORIENTED_EDGE('',*,*,#139,.F.);
#91=ORIENTED_EDGE('',*,*,#140,.T.);
#92=CARTESIAN_POINT('',(0.0,0.0,0.0));
#93=DIRECTION('',(1.0,-0.0,0.0));
#94=DIRECTION('',(0.0,1.0,-0.0));
#95=ORIENTED_EDGE('',*,*,#141,.T.);
#96=ORIENTED_EDGE('',*,*,#142,.F.);
#97=ORIENTED_EDGE('',*,*,#140,.F.);
#98=ORIENTED_EDGE('',*,*,#143,.T.);
#99=CARTESIAN_POINT('',(0.0,0.0,0.0));
#100=DIRECTION('',(-0.0,1.0,0.0));
#101=DIRECTION('',(1.0,0.0,0.0));
#102=ORIENTED_EDGE('',*,*,#137,.F.);
#103=ORIENTED_EDGE('',*,*,#142,.T.);
#104=ORIENTED_EDGE('',*,*,#144,.T.);
#105=ORIENTED_EDGE('',*,*,#145,.F.);
#106=ORIENTED_EDGE('',*,*,#146,.F.);
#107=CARTESIAN_POINT('',(0.0,0.0,10.0));
#108=DIRECTION('',(0.0,0.0,1.0));
#109=DIRECTION('',(1.0,-0.0,0.0));
#110=ORIENTED_EDGE('',*,*,#147,.F.);
#111=ORIENTED_EDGE('',*,*,#138,.T.);
#112=ORIENTED_EDGE('',*,*,#145,.T.);
#113=ORIENTED_EDGE('',*,*,#148,.F.);
#114=CARTESIAN_POINT('',(0.0,10.0,0.0));
#115=DIRECTION('',(-0.0,1.0,0.0));
#116=DIRECTION('',(1.0,0.0,0.0));
#117=ORIENTED_EDGE('',*,*,#147,.T.);
#118=ORIENTED_EDGE('',*,*,#149,.F.);
#119=ORIENTED_EDGE('',*,*,#143,.F.);
#120=ORIENTED_EDGE('',*,*,#139,.T.);
#121=ORIENTED_EDGE('',*,*,#150,.T.);
#122=CARTESIAN_POINT('',(0.0,0.0,0.0));
#123=DIRECTION('',(0.0,0.0,1.0));
#124=DIRECTION('',(1.0,-0.0,0.0));
#125=ORIENTED_EDGE('',*,*,#141,.F.);
#126=ORIENTED_EDGE('',*,*,#149,.T.);
#127=ORIENTED_EDGE('',*,*,#148,.T.);
#128=ORIENTED_EDGE('',*,*,#144,.F.);
#129=CARTESIAN_POINT('',(10.0,0.0,0.0));
#130=DIRECTION('',(1.0,-0.0,0.0));
#131=DIRECTION('',(0.0,1.0,-0.0));
#132=ORIENTED_EDGE('',*,*,#150,.F.);
#133=ORIENTED_EDGE('',*,*,#146,.T.);
#134=CARTESIAN_POINT('',(5.0,5.0,0.0));
#135=DIRECTION('',(0.0,0.0,-1.0));
#136=DIRECTION('',(1.0,0.0,0.0));
#137=EDGE_CURVE('',#151,#152,#153,.T.);
#138=EDGE_CURVE('',#154,#152,#155,.T.);
#139=EDGE_CURVE('',#156,#154,#157,.T.);
#140=EDGE_CURVE('',#156,#151,#158,.T.);
#141=EDGE_CURVE('',#159,#160,#161,.T.);
#142=EDGE_CURVE('',#151,#160,#162,.T.);
#143=EDGE_CURVE('',#156,#159,#163,.T.);
#144=EDGE_CURVE('',#160,#164,#165,.T.);
#145=EDGE_CURVE('',#152,#164,#166,.T.);
#146=EDGE_CURVE('',#167,#167,#168,.T.);
#147=EDGE_CURVE('',#154,#169,#170,.T.);
#148=EDGE_CURVE('',#169,#164,#171,.T.);
#149=EDGE_CURVE('',#159,#169,#172,.T.);
#150=EDGE_CURVE('',#173,#173,#174,.T.);
#151=VERTEX_POINT('',#175);
#152=VERTEX_POINT('',#176);
#153=LINE('',#177,#178);
#154=VERTEX_POINT('',#179);
#155=LINE('',#180,#181);
#156=VERTEX_POINT('',#182);
#157=LINE('',#183,#184);
#158=LINE('',#185,#186);
#159=VERTEX_POINT('',#187);
#160=VERTEX_POINT('',#188);
#161=LINE('',#189,#190);
#162=LINE('',#191,#192);
#163=LINE('',#193,#194);
#164=VERTEX_POINT('',#195);
#165=LINE('',#196,#197);
#166=LINE('',#198,#199);
#167=VERTEX_POINT('',#200);
#168=CIRCLE('',#201,2.5);
#169=VERTEX_POINT('',#202);
#170=LINE('',#203,#204);
#171=LINE('',#205,#206);
#172=LINE('',#207,#208);
#173=VERTEX_POINT('',#209);
#174=CIRCLE('',#210,2.5);
#175=CARTESIAN_POINT('',(0.0,0.0,10.0));
#176=CARTESIAN_POINT('',(0.0,10.0,10.0));
#177=CARTESIAN_POINT('',(0.0,0.0,10.0));
#178=VECTOR('',#211,1.0);
#179=CARTESIAN_POINT('',(0.0,10.0,0.0));
#180=CARTESIAN_POINT('',(0.0,10.0,0.0));
#181=VECTOR('',#212,1.0);
#182=CARTESIAN_POINT('',(0.0,0.0,0.0));
#183=CARTESIAN_POINT('',(0.0,0.0,0.0));
#184=VECTOR('',#213,1.0);
#185=CARTESIAN_POINT('',(0.0,0.0,0.0));
#186=VECTOR('',#214,1.0);
#187=CARTESIAN_POINT('',(10.0,0.0,0.0));
#188=CARTESIAN_POINT('',(10.0,0.0,10.0));
#189=CARTESIAN_POINT('',(10.0,0.0,0.0));
#190=VECTOR('',#215,1.0);
#191=CARTESIAN_POINT('',(0.0,0.0,10.0));
#192=VECTOR('',#216,1.0);
#193=CARTESIAN_POINT('',(0.0,0.0,0.0));
#194=VECTOR('',#217,1.0);
#195=CARTESIAN_POINT('',(10.0,10.0,10.0));
#196=CARTESIAN_POINT('',(10.0,0.0,10.0));
#197=VECTOR('',#218,1.0);
#198=CARTESIAN_POINT('',(0.0,10.0,10.0));
#199=VECTOR('',#219,1.0);
#200=CARTESIAN_POINT('',(2.5,5.0,10.0));
#201=AXIS2_PLACEMENT_3D('',#220,#221,#222);
#202=CARTESIAN_POINT('',(10.0,10.0,0.0));
#203=CARTESIAN_POINT('',(0.0,10.0,0.0));
#204=VECTOR('',#223,1.0);
#205=CARTESIAN_POINT('',(10.0,10.0,0.0));
#206=VECTOR('',#224,1.0);
#207=CARTESIAN_POINT('',(10.0,0.0,0.0));
#208=VECTOR('',#225,1.0);
#209=CARTESIAN_POINT('',(2.5,5.0,0.0));
#210=AXIS2_PLACEMENT_3D('',#226,#227,#228);
#211=DIRECTION('',(-0.0,1.0,0.0));
#212=DIRECTION('',(0.0,0.0,1.0));
#213=DIRECTION('',(-0.0,1.0,0.0));
#214=DIRECTION('',(0.0,0.0,1.0));
#215=DIRECTION('',(0.0,0.0,1.0));
#216=DIRECTION('',(1.0,0.0,-0.0));
#217=DIRECTION('',(1.0,0.0,-0.0));
#218=DIRECTION('',(0.0,1.0,0.0));
#219=DIRECTION('',(1.0,0.0,-0.0));
#220=CARTESIAN_POINT('',(5.0,5.0,10.0));
#221=DIRECTION('',(0.0,0.0,1.0));
#222=DIRECTION('',(1.0,0.0,-0.0));
#223=DIRECTION('',(1.0,0.0,-0.0));
#224=DIRECTION('',(0.0,0.0,1.0));
#225=DIRECTION('',(-0.0,1.0,0.0));
#226=CARTESIAN_POINT('',(5.0,5.0,0.0));
#227=DIRECTION('',(0.0,0.0,1.0));
#228=DIRECTION('',(1.0,0.0,-0.0));
ENDSEC;
END-ISO-10303-21;
