ISO-10303-21;
HEADER;
FILE_DESCRIPTION(('STEP AP214'),'1');
FILE_NAME('B48.step','2020-02-12T14:49:08',('Cubit 15.2'),(' '),'Spatial InterOp 3D',' ',' ');
FILE_SCHEMA(('automotive_design'));
ENDSEC;
DATA;
#1=PRODUCT_DEFINITION_CONTEXT('',#9,'design');
#2=APPLICATION_PROTOCOL_DEFINITION('INTERNATIONAL STANDARD','automotive_design',1994,#9);
#3=PRODUCT_CATEGORY_RELATIONSHIP('NONE','NONE',#10,#11);
#4=SHAPE_DEFINITION_REPRESENTATION(#12,#13);
#5= (GEOMETRIC_REPRESENTATION_CONTEXT(3)GLOBAL_UNCERTAINTY_ASSIGNED_CONTEXT((#16))GLOBAL_UNIT_ASSIGNED_CONTEXT((#18,#19,#20))REPRESENTATION_CONTEXT('NONE','WORKSPACE'));
#9=APPLICATION_CONTEXT(' ');
#10=PRODUCT_CATEGORY('part','NONE');
#11=PRODUCT_RELATED_PRODUCT_CATEGORY('detail',' ',(#22));
#12=PRODUCT_DEFINITION_SHAPE('NONE','NONE',#23);
#13=ADVANCED_BREP_SHAPE_REPRESENTATION('1',(#24,#25),#5);
#16=UNCERTAINTY_MEASURE_WITH_UNIT(LENGTH_MEASURE(1.0E-06),#18,'','');
#18= (CONVERSION_BASED_UNIT('MILLIMETRE',#28)LENGTH_UNIT()NAMED_UNIT(#31));
#19= (NAMED_UNIT(#33)PLANE_ANGLE_UNIT()SI_UNIT($,.RADIAN.));
#20= (NAMED_UNIT(#33)SOLID_ANGLE_UNIT()SI_UNIT($,.STERADIAN.));
#22=PRODUCT('1','1','PART-1-DESC',(#39));
#23=PRODUCT_DEFINITION('NONE','NONE',#40,#1);
#24=MANIFOLD_SOLID_BREP('1',#41);
#25=AXIS2_PLACEMENT_3D('',#42,#43,#44);
#28=LENGTH_MEASURE_WITH_UNIT(LENGTH_MEASURE(1.0),#45);
#31=DIMENSIONAL_EXPONENTS(1.0,0.0,0.0,0.0,0.0,0.0,0.0);
#33=DIMENSIONAL_EXPONENTS(0.0,0.0,0.0,0.0,0.0,0.0,0.0);
#39=PRODUCT_CONTEXT('',#9,'mechanical');
#40=PRODUCT_DEFINITION_FORMATION_WITH_SPECIFIED_SOURCE(' ','NONE',#22,.NOT_KNOWN.);
#41=CLOSED_SHELL('',(#46,#47,#48,#49,#50,#51,#52,#53,#54,#55,#56,#57,#58,#59,#60));
#42=CARTESIAN_POINT('',(0.0,0.0,0.0));
#43=DIRECTION('',(0.0,0.0,1.0));
#44=DIRECTION('',(1.0,0.0,0.0));
#45= (NAMED_UNIT(#31)LENGTH_UNIT()SI_UNIT(.MILLI.,.METRE.));
#46=ADVANCED_FACE('',(#62),#63,.T.);
#47=ADVANCED_FACE('',(#64),#65,.T.);
#48=ADVANCED_FACE('',(#66),#67,.T.);
#49=ADVANCED_FACE('',(#68),#69,.T.);
#50=ADVANCED_FACE('',(#70),#71,.T.);
#51=ADVANCED_FACE('',(#72),#73,.T.);
#52=ADVANCED_FACE('',(#74),#75,.T.);
#53=ADVANCED_FACE('',(#76),#77,.T.);
#54=ADVANCED_FACE('',(#78),#79,.T.);
#55=ADVANCED_FACE('',(#80),#81,.T.);
#56=ADVANCED_FACE('',(#82),#83,.T.);
#57=ADVANCED_FACE('',(#84),#85,.T.);
#58=ADVANCED_FACE('',(#86),#87,.T.);
#59=ADVANCED_FACE('',(#88),#89,.T.);
#60=ADVANCED_FACE('',(#90),#91,.T.);
#62=FACE_OUTER_BOUND('',#92,.T.);
#63=PLANE('',#93);
#64=FACE_OUTER_BOUND('',#94,.T.);
#65=CYLINDRICAL_SURFACE('',#95,1.0);
#66=FACE_OUTER_BOUND('',#96,.T.);
#67=PLANE('',#97);
#68=FACE_OUTER_BOUND('',#98,.T.);
#69=PLANE('',#99);
#70=FACE_OUTER_BOUND('',#100,.T.);
#71=CYLINDRICAL_SURFACE('',#101,1.0);
#72=FACE_OUTER_BOUND('',#102,.T.);
#73=CYLINDRICAL_SURFACE('',#103,5.0);
#74=FACE_OUTER_BOUND('',#104,.T.);
#75=PLANE('',#105);
#76=FACE_OUTER_BOUND('',#106,.T.);
#77=PLANE('',#107);
#78=FACE_OUTER_BOUND('',#108,.T.);
#79=PLANE('',#109);
#80=FACE_OUTER_BOUND('',#110,.T.);
#81=CYLINDRICAL_SURFACE('',#111,5.0);
#82=FACE_OUTER_BOUND('',#112,.T.);
#83=PLANE('',#113);
#84=FACE_OUTER_BOUND('',#114,.T.);
#85=PLANE('',#115);
#86=FACE_OUTER_BOUND('',#116,.T.);
#87=CYLINDRICAL_SURFACE('',#117,5.0);
#88=FACE_OUTER_BOUND('',#118,.T.);
#89=PLANE('',#119);
#90=FACE_OUTER_BOUND('',#120,.T.);
#91=PLANE('',#121);
#92=EDGE_LOOP('',(#122,#123,#124));
#93=AXIS2_PLACEMENT_3D('',#125,#126,#127);
#94=EDGE_LOOP('',(#128,#129,#130,#131));
#95=AXIS2_PLACEMENT_3D('',#132,#133,#134);
#96=EDGE_LOOP('',(#135,#136,#137,#138,#139));
#97=AXIS2_PLACEMENT_3D('',#140,#141,#142);
#98=EDGE_LOOP('',(#143,#144,#145));
#99=AXIS2_PLACEMENT_3D('',#146,#147,#148);
#100=EDGE_LOOP('',(#149,#150,#151,#152));
#101=AXIS2_PLACEMENT_3D('',#153,#154,#155);
#102=EDGE_LOOP('',(#156,#157,#158,#159));
#103=AXIS2_PLACEMENT_3D('',#160,#161,#162);
#104=EDGE_LOOP('',(#163,#164,#165));
#105=AXIS2_PLACEMENT_3D('',#166,#167,#168);
#106=EDGE_LOOP('',(#169,#170,#171,#172,#173));
#107=AXIS2_PLACEMENT_3D('',#174,#175,#176);
#108=EDGE_LOOP('',(#177,#178,#179));
#109=AXIS2_PLACEMENT_3D('',#180,#181,#182);
#110=EDGE_LOOP('',(#183,#184,#185,#186));
#111=AXIS2_PLACEMENT_3D('',#187,#188,#189);
#112=EDGE_LOOP('',(#190,#191,#192));
#113=AXIS2_PLACEMENT_3D('',#193,#194,#195);
#114=EDGE_LOOP('',(#196,#197,#198));
#115=AXIS2_PLACEMENT_3D('',#199,#200,#201);
#116=EDGE_LOOP('',(#202,#203,#204,#205));
#117=AXIS2_PLACEMENT_3D('',#206,#207,#208);
#118=EDGE_LOOP('',(#209,#210,#211));
#119=AXIS2_PLACEMENT_3D('',#212,#213,#214);
#120=EDGE_LOOP('',(#215,#216,#217));
#121=AXIS2_PLACEMENT_3D('',#218,#219,#220);
#122=ORIENTED_EDGE('',*,*,#221,.F.);
#123=ORIENTED_EDGE('',*,*,#222,.F.);
#124=ORIENTED_EDGE('',*,*,#223,.T.);
#125=CARTESIAN_POINT('',(0.0,0.5,-5.0));
#126=DIRECTION('',(-2.24963967399279E-32,-1.22464679914735E-16,-1.0));
#127=DIRECTION('',(1.83697019872103E-16,1.0,-1.22464679914735E-16));
#128=ORIENTED_EDGE('',*,*,#224,.F.);
#129=ORIENTED_EDGE('',*,*,#223,.F.);
#130=ORIENTED_EDGE('',*,*,#225,.F.);
#131=ORIENTED_EDGE('',*,*,#226,.F.);
#132=CARTESIAN_POINT('',(0.0,0.5,-2.5));
#133=DIRECTION('',(-2.24963967399279E-32,-1.22464679914735E-16,-1.0));
#134=DIRECTION('',(1.83697019872103E-16,1.0,-1.22464679914735E-16));
#135=ORIENTED_EDGE('',*,*,#227,.T.);
#136=ORIENTED_EDGE('',*,*,#228,.T.);
#137=ORIENTED_EDGE('',*,*,#229,.F.);
#138=ORIENTED_EDGE('',*,*,#230,.F.);
#139=ORIENTED_EDGE('',*,*,#231,.F.);
#140=CARTESIAN_POINT('',(0.0,-0.5,0.5));
#141=DIRECTION('',(1.0,0.0,0.0));
#142=DIRECTION('',(0.0,0.0,-1.0));
#143=ORIENTED_EDGE('',*,*,#232,.F.);
#144=ORIENTED_EDGE('',*,*,#233,.T.);
#145=ORIENTED_EDGE('',*,*,#234,.F.);
#146=CARTESIAN_POINT('',(-5.0,-0.5,-1.53080849893419E-16));
#147=DIRECTION('',(-1.0,0.0,-6.12323399573676E-17));
#148=DIRECTION('',(-6.12323399573676E-17,0.0,1.0));
#149=ORIENTED_EDGE('',*,*,#235,.F.);
#150=ORIENTED_EDGE('',*,*,#228,.F.);
#151=ORIENTED_EDGE('',*,*,#236,.F.);
#152=ORIENTED_EDGE('',*,*,#233,.F.);
#153=CARTESIAN_POINT('',(-2.5,-0.5,0.0));
#154=DIRECTION('',(1.0,0.0,6.12323399573676E-17));
#155=DIRECTION('',(6.12323399573676E-17,0.0,-1.0));
#156=ORIENTED_EDGE('',*,*,#222,.T.);
#157=ORIENTED_EDGE('',*,*,#237,.F.);
#158=ORIENTED_EDGE('',*,*,#238,.T.);
#159=ORIENTED_EDGE('',*,*,#239,.F.);
#160=CARTESIAN_POINT('',(0.5,0.5,0.0));
#161=DIRECTION('',(-1.0,-6.12323399573676E-17,6.12323399573676E-17));
#162=DIRECTION('',(6.12323399573676E-17,-1.0,0.0));
#163=ORIENTED_EDGE('',*,*,#240,.F.);
#164=ORIENTED_EDGE('',*,*,#241,.T.);
#165=ORIENTED_EDGE('',*,*,#237,.T.);
#166=CARTESIAN_POINT('',(0.0,0.5,3.06161699786838E-17));
#167=DIRECTION('',(-1.0,-6.12323399573676E-17,6.12323399573676E-17));
#168=DIRECTION('',(6.12323399573676E-17,-1.0,0.0));
#169=ORIENTED_EDGE('',*,*,#241,.F.);
#170=ORIENTED_EDGE('',*,*,#227,.F.);
#171=ORIENTED_EDGE('',*,*,#226,.T.);
#172=ORIENTED_EDGE('',*,*,#242,.F.);
#173=ORIENTED_EDGE('',*,*,#238,.F.);
#174=CARTESIAN_POINT('',(0.5,0.5,0.0));
#175=DIRECTION('',(6.12323399573676E-17,3.74939945665464E-33,1.0));
#176=DIRECTION('',(-1.0,-6.12323399573676E-17,6.12323399573676E-17));
#177=ORIENTED_EDGE('',*,*,#225,.T.);
#178=ORIENTED_EDGE('',*,*,#239,.T.);
#179=ORIENTED_EDGE('',*,*,#242,.T.);
#180=CARTESIAN_POINT('',(1.0,0.5,-3.06161699786838E-17));
#181=DIRECTION('',(1.0,6.12323399573676E-17,-6.12323399573676E-17));
#182=DIRECTION('',(-6.12323399573676E-17,1.0,0.0));
#183=ORIENTED_EDGE('',*,*,#221,.T.);
#184=ORIENTED_EDGE('',*,*,#243,.F.);
#185=ORIENTED_EDGE('',*,*,#234,.T.);
#186=ORIENTED_EDGE('',*,*,#244,.F.);
#187=CARTESIAN_POINT('',(0.0,0.0,0.0));
#188=DIRECTION('',(0.0,-1.0,6.12323399573676E-17));
#189=DIRECTION('',(1.0,0.0,0.0));
#190=ORIENTED_EDGE('',*,*,#224,.T.);
#191=ORIENTED_EDGE('',*,*,#245,.F.);
#192=ORIENTED_EDGE('',*,*,#243,.T.);
#193=CARTESIAN_POINT('',(0.0,-0.5,3.06161699786838E-17));
#194=DIRECTION('',(0.0,-1.0,6.12323399573676E-17));
#195=DIRECTION('',(1.0,0.0,0.0));
#196=ORIENTED_EDGE('',*,*,#240,.T.);
#197=ORIENTED_EDGE('',*,*,#244,.T.);
#198=ORIENTED_EDGE('',*,*,#236,.T.);
#199=CARTESIAN_POINT('',(0.0,0.5,-3.06161699786838E-17));
#200=DIRECTION('',(0.0,1.0,-6.12323399573676E-17));
#201=DIRECTION('',(-1.0,0.0,0.0));
#202=ORIENTED_EDGE('',*,*,#230,.T.);
#203=ORIENTED_EDGE('',*,*,#246,.F.);
#204=ORIENTED_EDGE('',*,*,#232,.T.);
#205=ORIENTED_EDGE('',*,*,#247,.F.);
#206=CARTESIAN_POINT('',(0.0,-0.5,0.5));
#207=DIRECTION('',(0.0,0.0,1.0));
#208=DIRECTION('',(1.0,0.0,0.0));
#209=ORIENTED_EDGE('',*,*,#229,.T.);
#210=ORIENTED_EDGE('',*,*,#235,.T.);
#211=ORIENTED_EDGE('',*,*,#246,.T.);
#212=CARTESIAN_POINT('',(0.0,-0.5,1.0));
#213=DIRECTION('',(0.0,0.0,1.0));
#214=DIRECTION('',(1.0,0.0,0.0));
#215=ORIENTED_EDGE('',*,*,#231,.T.);
#216=ORIENTED_EDGE('',*,*,#247,.T.);
#217=ORIENTED_EDGE('',*,*,#245,.T.);
#218=CARTESIAN_POINT('',(0.0,-0.5,0.0));
#219=DIRECTION('',(0.0,0.0,-1.0));
#220=DIRECTION('',(-1.0,0.0,0.0));
#221=EDGE_CURVE('',#248,#249,#250,.T.);
#222=EDGE_CURVE('',#251,#248,#252,.T.);
#223=EDGE_CURVE('',#251,#249,#253,.T.);
#224=EDGE_CURVE('',#249,#254,#255,.T.);
#225=EDGE_CURVE('',#256,#251,#257,.T.);
#226=EDGE_CURVE('',#254,#256,#258,.T.);
#227=EDGE_CURVE('',#254,#259,#260,.T.);
#228=EDGE_CURVE('',#259,#261,#262,.T.);
#229=EDGE_CURVE('',#263,#261,#264,.T.);
#230=EDGE_CURVE('',#265,#263,#266,.T.);
#231=EDGE_CURVE('',#254,#265,#267,.T.);
#232=EDGE_CURVE('',#268,#269,#270,.T.);
#233=EDGE_CURVE('',#268,#271,#272,.T.);
#234=EDGE_CURVE('',#269,#271,#273,.T.);
#235=EDGE_CURVE('',#261,#268,#274,.T.);
#236=EDGE_CURVE('',#271,#259,#275,.T.);
#237=EDGE_CURVE('',#276,#248,#277,.T.);
#238=EDGE_CURVE('',#276,#278,#279,.T.);
#239=EDGE_CURVE('',#251,#278,#280,.T.);
#240=EDGE_CURVE('',#259,#248,#281,.T.);
#241=EDGE_CURVE('',#259,#276,#282,.T.);
#242=EDGE_CURVE('',#278,#256,#283,.T.);
#243=EDGE_CURVE('',#269,#249,#284,.T.);
#244=EDGE_CURVE('',#248,#271,#285,.T.);
#245=EDGE_CURVE('',#269,#254,#286,.T.);
#246=EDGE_CURVE('',#268,#263,#287,.T.);
#247=EDGE_CURVE('',#265,#269,#288,.T.);
#248=VERTEX_POINT('',#289);
#249=VERTEX_POINT('',#290);
#250=LINE('',#291,#292);
#251=VERTEX_POINT('',#293);
#252=LINE('',#294,#295);
#253=CIRCLE('',#296,1.0);
#254=VERTEX_POINT('',#297);
#255=LINE('',#298,#299);
#256=VERTEX_POINT('',#300);
#257=LINE('',#301,#302);
#258=CIRCLE('',#303,1.0);
#259=VERTEX_POINT('',#304);
#260=LINE('',#305,#306);
#261=VERTEX_POINT('',#307);
#262=CIRCLE('',#308,1.0);
#263=VERTEX_POINT('',#309);
#264=LINE('',#310,#311);
#265=VERTEX_POINT('',#312);
#266=LINE('',#313,#314);
#267=LINE('',#315,#316);
#268=VERTEX_POINT('',#317);
#269=VERTEX_POINT('',#318);
#270=LINE('',#319,#320);
#271=VERTEX_POINT('',#321);
#272=CIRCLE('',#322,1.0);
#273=LINE('',#323,#324);
#274=LINE('',#325,#326);
#275=LINE('',#327,#328);
#276=VERTEX_POINT('',#329);
#277=CIRCLE('',#330,5.0);
#278=VERTEX_POINT('',#331);
#279=LINE('',#332,#333);
#280=CIRCLE('',#334,5.0);
#281=LINE('',#335,#336);
#282=LINE('',#337,#338);
#283=LINE('',#339,#340);
#284=CIRCLE('',#341,5.0);
#285=CIRCLE('',#342,5.0);
#286=LINE('',#343,#344);
#287=CIRCLE('',#345,5.0);
#288=CIRCLE('',#346,5.0);
#289=CARTESIAN_POINT('',(0.0,0.5,-5.0));
#290=CARTESIAN_POINT('',(0.0,-0.5,-5.0));
#291=CARTESIAN_POINT('',(0.0,-3.06161699786838E-16,-5.0));
#292=VECTOR('',#347,1.0);
#293=CARTESIAN_POINT('',(1.0,0.5,-5.0));
#294=CARTESIAN_POINT('',(0.5,0.5,-5.0));
#295=VECTOR('',#348,1.0);
#296=AXIS2_PLACEMENT_3D('',#349,#350,#351);
#297=CARTESIAN_POINT('',(0.0,-0.5,0.0));
#298=CARTESIAN_POINT('',(0.0,-0.5,3.06161699786838E-17));
#299=VECTOR('',#352,1.0);
#300=CARTESIAN_POINT('',(1.0,0.5,-3.06161699786838E-17));
#301=CARTESIAN_POINT('',(1.0,0.5,-3.06161699786838E-17));
#302=VECTOR('',#353,1.0);
#303=AXIS2_PLACEMENT_3D('',#354,#355,#356);
#304=CARTESIAN_POINT('',(0.0,0.5,-3.06161699786838E-17));
#305=CARTESIAN_POINT('',(0.0,2.46939586177605E-16,5.55111512312578E-17));
#306=VECTOR('',#357,1.0);
#307=CARTESIAN_POINT('',(0.0,-0.5,1.0));
#308=AXIS2_PLACEMENT_3D('',#358,#359,#360);
#309=CARTESIAN_POINT('',(0.0,-5.5,1.0));
#310=CARTESIAN_POINT('',(0.0,-0.5,1.0));
#311=VECTOR('',#361,1.0);
#312=CARTESIAN_POINT('',(0.0,-5.5,0.0));
#313=CARTESIAN_POINT('',(0.0,-5.5,0.5));
#314=VECTOR('',#362,1.0);
#315=CARTESIAN_POINT('',(0.0,-0.5,0.0));
#316=VECTOR('',#363,1.0);
#317=CARTESIAN_POINT('',(-5.0,-0.5,1.0));
#318=CARTESIAN_POINT('',(-5.0,-0.5,0.0));
#319=CARTESIAN_POINT('',(-5.0,-0.5,0.5));
#320=VECTOR('',#364,1.0);
#321=CARTESIAN_POINT('',(-5.0,0.5,-3.06161699786838E-17));
#322=AXIS2_PLACEMENT_3D('',#365,#366,#367);
#323=CARTESIAN_POINT('',(-5.0,0.0,0.0));
#324=VECTOR('',#368,1.0);
#325=CARTESIAN_POINT('',(0.0,-0.5,1.0));
#326=VECTOR('',#369,1.0);
#327=CARTESIAN_POINT('',(0.0,0.5,-3.06161699786838E-17));
#328=VECTOR('',#370,1.0);
#329=CARTESIAN_POINT('',(-3.33066907387547E-16,5.5,3.06161699786838E-17));
#330=AXIS2_PLACEMENT_3D('',#371,#372,#373);
#331=CARTESIAN_POINT('',(1.0,5.5,-3.06161699786838E-17));
#332=CARTESIAN_POINT('',(0.5,5.5,0.0));
#333=VECTOR('',#374,1.0);
#334=AXIS2_PLACEMENT_3D('',#375,#376,#377);
#335=CARTESIAN_POINT('',(0.0,0.5,-3.06161699786838E-17));
#336=VECTOR('',#378,1.0);
#337=CARTESIAN_POINT('',(0.0,0.5,3.06161699786838E-17));
#338=VECTOR('',#379,1.0);
#339=CARTESIAN_POINT('',(1.0,0.5,-3.06161699786838E-17));
#340=VECTOR('',#380,1.0);
#341=AXIS2_PLACEMENT_3D('',#381,#382,#383);
#342=AXIS2_PLACEMENT_3D('',#384,#385,#386);
#343=CARTESIAN_POINT('',(0.0,-0.5,0.0));
#344=VECTOR('',#387,1.0);
#345=AXIS2_PLACEMENT_3D('',#388,#389,#390);
#346=AXIS2_PLACEMENT_3D('',#391,#392,#393);
#347=DIRECTION('',(0.0,-1.0,6.12323399573676E-17));
#348=DIRECTION('',(-1.0,-6.12323399573676E-17,6.12323399573676E-17));
#349=CARTESIAN_POINT('',(0.0,0.5,-5.0));
#350=DIRECTION('',(-2.24963967399279E-32,-1.22464679914735E-16,-1.0));
#351=DIRECTION('',(1.83697019872103E-16,1.0,-1.22464679914735E-16));
#352=DIRECTION('',(0.0,6.12323399573676E-17,1.0));
#353=DIRECTION('',(-6.12323399573676E-17,-3.74939945665464E-33,-1.0));
#354=CARTESIAN_POINT('',(0.0,0.500000000000001,0.0));
#355=DIRECTION('',(2.24963967399279E-32,1.22464679914735E-16,1.0));
#356=DIRECTION('',(1.83697019872103E-16,1.0,-1.22464679914735E-16));
#357=DIRECTION('',(0.0,1.0,-1.22464679914735E-16));
#358=CARTESIAN_POINT('',(0.0,-0.5,1.53080849893419E-16));
#359=DIRECTION('',(1.0,0.0,6.12323399573676E-17));
#360=DIRECTION('',(6.12323399573676E-17,0.0,-1.0));
#361=DIRECTION('',(0.0,1.0,0.0));
#362=DIRECTION('',(0.0,0.0,1.0));
#363=DIRECTION('',(0.0,-1.0,0.0));
#364=DIRECTION('',(-0.0,-0.0,-1.0));
#365=CARTESIAN_POINT('',(-5.0,-0.5,-1.53080849893419E-16));
#366=DIRECTION('',(-1.0,0.0,-6.12323399573676E-17));
#367=DIRECTION('',(6.12323399573676E-17,0.0,-1.0));
#368=DIRECTION('',(-0.0,1.0,-6.12323399573676E-17));
#369=DIRECTION('',(-1.0,0.0,0.0));
#370=DIRECTION('',(1.0,0.0,0.0));
#371=CARTESIAN_POINT('',(0.0,0.5,3.06161699786838E-17));
#372=DIRECTION('',(-1.0,-6.12323399573676E-17,6.12323399573676E-17));
#373=DIRECTION('',(6.12323399573676E-17,-1.0,0.0));
#374=DIRECTION('',(1.0,6.12323399573676E-17,-6.12323399573676E-17));
#375=CARTESIAN_POINT('',(1.0,0.5,-3.06161699786838E-17));
#376=DIRECTION('',(1.0,6.12323399573676E-17,-6.12323399573676E-17));
#377=DIRECTION('',(6.12323399573676E-17,-1.0,0.0));
#378=DIRECTION('',(0.0,-6.12323399573676E-17,-1.0));
#379=DIRECTION('',(-6.12323399573676E-17,1.0,0.0));
#380=DIRECTION('',(6.12323399573676E-17,-1.0,0.0));
#381=CARTESIAN_POINT('',(0.0,-0.5,3.06161699786838E-17));
#382=DIRECTION('',(0.0,-1.0,6.12323399573676E-17));
#383=DIRECTION('',(1.0,0.0,0.0));
#384=CARTESIAN_POINT('',(0.0,0.5,-3.06161699786838E-17));
#385=DIRECTION('',(0.0,1.0,-6.12323399573676E-17));
#386=DIRECTION('',(1.0,0.0,0.0));
#387=DIRECTION('',(1.0,0.0,0.0));
#388=CARTESIAN_POINT('',(0.0,-0.5,1.0));
#389=DIRECTION('',(0.0,0.0,1.0));
#390=DIRECTION('',(1.0,0.0,0.0));
#391=CARTESIAN_POINT('',(0.0,-0.5,0.0));
#392=DIRECTION('',(0.0,0.0,-1.0));
#393=DIRECTION('',(1.0,0.0,0.0));
ENDSEC;
END-ISO-10303-21;
