ISO-10303-21;
HEADER;
FILE_DESCRIPTION(('STEP AP214'),'1');
FILE_NAME('S26.step','2022-02-01T16:09:07',('Cubit 15.2'),(' '),'Spatial InterOp 3D',' ',' ');
FILE_SCHEMA(('automotive_design'));
ENDSEC;
DATA;
#1=PRODUCT_DEFINITION_CONTEXT('',#9,'design');
#2=APPLICATION_PROTOCOL_DEFINITION('INTERNATIONAL STANDARD','automotive_design',1994,#9);
#3=PRODUCT_CATEGORY_RELATIONSHIP('NONE','NONE',#10,#11);
#4=SHAPE_DEFINITION_REPRESENTATION(#12,#13);
#5= (GEOMETRIC_REPRESENTATION_CONTEXT(3)GLOBAL_UNCERTAINTY_ASSIGNED_CONTEXT((#16))GLOBAL_UNIT_ASSIGNED_CONTEXT((#18,#19,#20))REPRESENTATION_CONTEXT('NONE','WORKSPACE'));
#9=APPLICATION_CONTEXT(' ');
#10=PRODUCT_CATEGORY('part','NONE');
#11=PRODUCT_RELATED_PRODUCT_CATEGORY('detail',' ',(#22));
#12=PRODUCT_DEFINITION_SHAPE('NONE','NONE',#23);
#13=ADVANCED_BREP_SHAPE_REPRESENTATION('1',(#24,#25),#5);
#16=UNCERTAINTY_MEASURE_WITH_UNIT(LENGTH_MEASURE(1.0E-06),#18,'','');
#18= (CONVERSION_BASED_UNIT('MILLIMETRE',#28)LENGTH_UNIT()NAMED_UNIT(#31));
#19= (NAMED_UNIT(#33)PLANE_ANGLE_UNIT()SI_UNIT($,.RADIAN.));
#20= (NAMED_UNIT(#33)SOLID_ANGLE_UNIT()SI_UNIT($,.STERADIAN.));
#22=PRODUCT('1','1','PART-1-DESC',(#39));
#23=PRODUCT_DEFINITION('NONE','NONE',#40,#1);
#24=MANIFOLD_SOLID_BREP('1',#41);
#25=AXIS2_PLACEMENT_3D('',#42,#43,#44);
#28=LENGTH_MEASURE_WITH_UNIT(LENGTH_MEASURE(1.0),#45);
#31=DIMENSIONAL_EXPONENTS(1.0,0.0,0.0,0.0,0.0,0.0,0.0);
#33=DIMENSIONAL_EXPONENTS(0.0,0.0,0.0,0.0,0.0,0.0,0.0);
#39=PRODUCT_CONTEXT('',#9,'mechanical');
#40=PRODUCT_DEFINITION_FORMATION_WITH_SPECIFIED_SOURCE(' ','NONE',#22,.NOT_KNOWN.);
#41=CLOSED_SHELL('',(#46,#47,#48,#49,#50,#51,#52,#53,#54,#55,#56,#57,#58,#59,#60,#61,#62,#63,#64,#65,#66,#67,#68,#69,#70,#71,#72,#73,#74,#75,#76,#77,#78,#79,#80,#81,#82,#83));
#42=CARTESIAN_POINT('',(0.0,0.0,0.0));
#43=DIRECTION('',(0.0,0.0,1.0));
#44=DIRECTION('',(1.0,0.0,0.0));
#45= (NAMED_UNIT(#31)LENGTH_UNIT()SI_UNIT(.MILLI.,.METRE.));
#46=ADVANCED_FACE('',(#85),#86,.F.);
#47=ADVANCED_FACE('',(#87),#88,.F.);
#48=ADVANCED_FACE('',(#89),#90,.T.);
#49=ADVANCED_FACE('',(#91),#92,.T.);
#50=ADVANCED_FACE('',(#93,#94,#95),#96,.F.);
#51=ADVANCED_FACE('',(#97,#98),#99,.T.);
#52=ADVANCED_FACE('',(#100),#101,.T.);
#53=ADVANCED_FACE('',(#102),#103,.F.);
#54=ADVANCED_FACE('',(#104),#105,.F.);
#55=ADVANCED_FACE('',(#106,#107),#108,.T.);
#56=ADVANCED_FACE('',(#109),#110,.T.);
#57=ADVANCED_FACE('',(#111),#112,.T.);
#58=ADVANCED_FACE('',(#113),#114,.T.);
#59=ADVANCED_FACE('',(#115,#116),#117,.T.);
#60=ADVANCED_FACE('',(#118),#119,.T.);
#61=ADVANCED_FACE('',(#120),#121,.T.);
#62=ADVANCED_FACE('',(#122),#123,.T.);
#63=ADVANCED_FACE('',(#124),#125,.T.);
#64=ADVANCED_FACE('',(#126),#127,.T.);
#65=ADVANCED_FACE('',(#128),#129,.T.);
#66=ADVANCED_FACE('',(#130),#131,.F.);
#67=ADVANCED_FACE('',(#132),#133,.F.);
#68=ADVANCED_FACE('',(#134),#135,.F.);
#69=ADVANCED_FACE('',(#136),#137,.F.);
#70=ADVANCED_FACE('',(#138),#139,.T.);
#71=ADVANCED_FACE('',(#140),#141,.T.);
#72=ADVANCED_FACE('',(#142),#143,.T.);
#73=ADVANCED_FACE('',(#144),#145,.T.);
#74=ADVANCED_FACE('',(#146),#147,.F.);
#75=ADVANCED_FACE('',(#148),#149,.F.);
#76=ADVANCED_FACE('',(#150),#151,.F.);
#77=ADVANCED_FACE('',(#152,#153,#154),#155,.T.);
#78=ADVANCED_FACE('',(#156),#157,.F.);
#79=ADVANCED_FACE('',(#158),#159,.T.);
#80=ADVANCED_FACE('',(#160),#161,.T.);
#81=ADVANCED_FACE('',(#162),#163,.F.);
#82=ADVANCED_FACE('',(#164),#165,.F.);
#83=ADVANCED_FACE('',(#166,#167),#168,.F.);
#85=FACE_OUTER_BOUND('',#169,.T.);
#86=CYLINDRICAL_SURFACE('',#170,8.0);
#87=FACE_OUTER_BOUND('',#171,.T.);
#88=CYLINDRICAL_SURFACE('',#172,8.0);
#89=FACE_OUTER_BOUND('',#173,.T.);
#90=PLANE('',#174);
#91=FACE_OUTER_BOUND('',#175,.T.);
#92=CYLINDRICAL_SURFACE('',#176,14.0);
#93=FACE_OUTER_BOUND('',#177,.T.);
#94=FACE_BOUND('',#178,.T.);
#95=FACE_BOUND('',#179,.T.);
#96=PLANE('',#180);
#97=FACE_OUTER_BOUND('',#181,.T.);
#98=FACE_BOUND('',#182,.T.);
#99=PLANE('',#183);
#100=FACE_OUTER_BOUND('',#184,.T.);
#101=PLANE('',#185);
#102=FACE_OUTER_BOUND('',#186,.T.);
#103=CYLINDRICAL_SURFACE('',#187,20.0);
#104=FACE_OUTER_BOUND('',#188,.T.);
#105=CYLINDRICAL_SURFACE('',#189,20.0);
#106=FACE_OUTER_BOUND('',#190,.T.);
#107=FACE_BOUND('',#191,.T.);
#108=PLANE('',#192);
#109=FACE_OUTER_BOUND('',#193,.T.);
#110=PLANE('',#194);
#111=FACE_OUTER_BOUND('',#195,.T.);
#112=CYLINDRICAL_SURFACE('',#196,30.0);
#113=FACE_OUTER_BOUND('',#197,.T.);
#114=CYLINDRICAL_SURFACE('',#198,30.0);
#115=FACE_OUTER_BOUND('',#199,.T.);
#116=FACE_BOUND('',#200,.T.);
#117=PLANE('',#201);
#118=FACE_OUTER_BOUND('',#202,.T.);
#119=PLANE('',#203);
#120=FACE_OUTER_BOUND('',#204,.T.);
#121=PLANE('',#205);
#122=FACE_OUTER_BOUND('',#206,.T.);
#123=PLANE('',#207);
#124=FACE_OUTER_BOUND('',#208,.T.);
#125=PLANE('',#209);
#126=FACE_OUTER_BOUND('',#210,.T.);
#127=PLANE('',#211);
#128=FACE_OUTER_BOUND('',#212,.T.);
#129=PLANE('',#213);
#130=FACE_OUTER_BOUND('',#214,.T.);
#131=CYLINDRICAL_SURFACE('',#215,10.0);
#132=FACE_OUTER_BOUND('',#216,.T.);
#133=CYLINDRICAL_SURFACE('',#217,10.0);
#134=FACE_OUTER_BOUND('',#218,.T.);
#135=CYLINDRICAL_SURFACE('',#219,10.0);
#136=FACE_OUTER_BOUND('',#220,.T.);
#137=CYLINDRICAL_SURFACE('',#221,10.0);
#138=FACE_OUTER_BOUND('',#222,.T.);
#139=CYLINDRICAL_SURFACE('',#223,22.0);
#140=FACE_OUTER_BOUND('',#224,.T.);
#141=CYLINDRICAL_SURFACE('',#225,22.0);
#142=FACE_OUTER_BOUND('',#226,.T.);
#143=CYLINDRICAL_SURFACE('',#227,22.0);
#144=FACE_OUTER_BOUND('',#228,.T.);
#145=CYLINDRICAL_SURFACE('',#229,22.0);
#146=FACE_OUTER_BOUND('',#230,.T.);
#147=PLANE('',#231);
#148=FACE_OUTER_BOUND('',#232,.T.);
#149=CYLINDRICAL_SURFACE('',#233,10.0);
#150=FACE_OUTER_BOUND('',#234,.T.);
#151=CYLINDRICAL_SURFACE('',#235,10.0);
#152=FACE_OUTER_BOUND('',#236,.T.);
#153=FACE_BOUND('',#237,.T.);
#154=FACE_BOUND('',#238,.T.);
#155=PLANE('',#239);
#156=FACE_OUTER_BOUND('',#240,.T.);
#157=PLANE('',#241);
#158=FACE_OUTER_BOUND('',#242,.T.);
#159=PLANE('',#243);
#160=FACE_OUTER_BOUND('',#244,.T.);
#161=CYLINDRICAL_SURFACE('',#245,20.0);
#162=FACE_OUTER_BOUND('',#246,.T.);
#163=PLANE('',#247);
#164=FACE_OUTER_BOUND('',#248,.T.);
#165=PLANE('',#249);
#166=FACE_OUTER_BOUND('',#250,.T.);
#167=FACE_BOUND('',#251,.T.);
#168=PLANE('',#252);
#169=EDGE_LOOP('',(#253,#254,#255,#256,#257));
#170=AXIS2_PLACEMENT_3D('',#258,#259,#260);
#171=EDGE_LOOP('',(#261,#262,#263,#264,#265));
#172=AXIS2_PLACEMENT_3D('',#266,#267,#268);
#173=EDGE_LOOP('',(#269,#270,#271,#272));
#174=AXIS2_PLACEMENT_3D('',#273,#274,#275);
#175=EDGE_LOOP('',(#276,#277,#278,#279,#280));
#176=AXIS2_PLACEMENT_3D('',#281,#282,#283);
#177=EDGE_LOOP('',(#284,#285,#286,#287,#288,#289,#290,#291));
#178=EDGE_LOOP('',(#292,#293));
#179=EDGE_LOOP('',(#294,#295));
#180=AXIS2_PLACEMENT_3D('',#296,#297,#298);
#181=EDGE_LOOP('',(#299,#300,#301,#302));
#182=EDGE_LOOP('',(#303,#304));
#183=AXIS2_PLACEMENT_3D('',#305,#306,#307);
#184=EDGE_LOOP('',(#308,#309));
#185=AXIS2_PLACEMENT_3D('',#310,#311,#312);
#186=EDGE_LOOP('',(#313,#314,#315,#316,#317,#318,#319));
#187=AXIS2_PLACEMENT_3D('',#320,#321,#322);
#188=EDGE_LOOP('',(#323,#324,#325,#326,#327,#328,#329));
#189=AXIS2_PLACEMENT_3D('',#330,#331,#332);
#190=EDGE_LOOP('',(#333,#334));
#191=EDGE_LOOP('',(#335,#336));
#192=AXIS2_PLACEMENT_3D('',#337,#338,#339);
#193=EDGE_LOOP('',(#340,#341,#342,#343));
#194=AXIS2_PLACEMENT_3D('',#344,#345,#346);
#195=EDGE_LOOP('',(#347,#348,#349,#350,#351,#352,#353));
#196=AXIS2_PLACEMENT_3D('',#354,#355,#356);
#197=EDGE_LOOP('',(#357,#358,#359,#360,#361,#362,#363));
#198=AXIS2_PLACEMENT_3D('',#364,#365,#366);
#199=EDGE_LOOP('',(#367,#368,#369,#370,#371,#372,#373,#374,#375,#376,#377,#378,#379,#380));
#200=EDGE_LOOP('',(#381,#382));
#201=AXIS2_PLACEMENT_3D('',#383,#384,#385);
#202=EDGE_LOOP('',(#386,#387,#388,#389));
#203=AXIS2_PLACEMENT_3D('',#390,#391,#392);
#204=EDGE_LOOP('',(#393,#394,#395,#396));
#205=AXIS2_PLACEMENT_3D('',#397,#398,#399);
#206=EDGE_LOOP('',(#400,#401,#402,#403));
#207=AXIS2_PLACEMENT_3D('',#404,#405,#406);
#208=EDGE_LOOP('',(#407,#408,#409,#410,#411,#412));
#209=AXIS2_PLACEMENT_3D('',#413,#414,#415);
#210=EDGE_LOOP('',(#416,#417,#418,#419));
#211=AXIS2_PLACEMENT_3D('',#420,#421,#422);
#212=EDGE_LOOP('',(#423,#424,#425,#426,#427));
#213=AXIS2_PLACEMENT_3D('',#428,#429,#430);
#214=EDGE_LOOP('',(#431,#432,#433,#434));
#215=AXIS2_PLACEMENT_3D('',#435,#436,#437);
#216=EDGE_LOOP('',(#438,#439,#440,#441));
#217=AXIS2_PLACEMENT_3D('',#442,#443,#444);
#218=EDGE_LOOP('',(#445,#446,#447,#448));
#219=AXIS2_PLACEMENT_3D('',#449,#450,#451);
#220=EDGE_LOOP('',(#452,#453,#454,#455));
#221=AXIS2_PLACEMENT_3D('',#456,#457,#458);
#222=EDGE_LOOP('',(#459,#460,#461,#462));
#223=AXIS2_PLACEMENT_3D('',#463,#464,#465);
#224=EDGE_LOOP('',(#466,#467,#468,#469));
#225=AXIS2_PLACEMENT_3D('',#470,#471,#472);
#226=EDGE_LOOP('',(#473,#474,#475,#476));
#227=AXIS2_PLACEMENT_3D('',#477,#478,#479);
#228=EDGE_LOOP('',(#480,#481,#482,#483));
#229=AXIS2_PLACEMENT_3D('',#484,#485,#486);
#230=EDGE_LOOP('',(#487,#488,#489,#490));
#231=AXIS2_PLACEMENT_3D('',#491,#492,#493);
#232=EDGE_LOOP('',(#494,#495,#496,#497));
#233=AXIS2_PLACEMENT_3D('',#498,#499,#500);
#234=EDGE_LOOP('',(#501,#502,#503,#504));
#235=AXIS2_PLACEMENT_3D('',#505,#506,#507);
#236=EDGE_LOOP('',(#508,#509,#510,#511,#512,#513,#514,#515,#516,#517,#518,#519,#520,#521,#522,#523));
#237=EDGE_LOOP('',(#524,#525));
#238=EDGE_LOOP('',(#526,#527));
#239=AXIS2_PLACEMENT_3D('',#528,#529,#530);
#240=EDGE_LOOP('',(#531,#532,#533,#534));
#241=AXIS2_PLACEMENT_3D('',#535,#536,#537);
#242=EDGE_LOOP('',(#538,#539,#540,#541));
#243=AXIS2_PLACEMENT_3D('',#542,#543,#544);
#244=EDGE_LOOP('',(#545,#546,#547,#548));
#245=AXIS2_PLACEMENT_3D('',#549,#550,#551);
#246=EDGE_LOOP('',(#552,#553,#554,#555));
#247=AXIS2_PLACEMENT_3D('',#556,#557,#558);
#248=EDGE_LOOP('',(#559,#560,#561,#562));
#249=AXIS2_PLACEMENT_3D('',#563,#564,#565);
#250=EDGE_LOOP('',(#566,#567,#568,#569,#570,#571));
#251=EDGE_LOOP('',(#572,#573));
#252=AXIS2_PLACEMENT_3D('',#574,#575,#576);
#253=ORIENTED_EDGE('',*,*,#577,.T.);
#254=ORIENTED_EDGE('',*,*,#578,.T.);
#255=ORIENTED_EDGE('',*,*,#579,.T.);
#256=ORIENTED_EDGE('',*,*,#580,.T.);
#257=ORIENTED_EDGE('',*,*,#581,.T.);
#258=CARTESIAN_POINT('',(72.3399999984,57.0,60.0));
#259=DIRECTION('',(1.0,-0.0,0.0));
#260=DIRECTION('',(0.0,1.0,0.0));
#261=ORIENTED_EDGE('',*,*,#582,.T.);
#262=ORIENTED_EDGE('',*,*,#583,.T.);
#263=ORIENTED_EDGE('',*,*,#581,.F.);
#264=ORIENTED_EDGE('',*,*,#584,.T.);
#265=ORIENTED_EDGE('',*,*,#579,.F.);
#266=CARTESIAN_POINT('',(72.3399999984,57.0,60.0));
#267=DIRECTION('',(1.0,-0.0,0.0));
#268=DIRECTION('',(0.0,1.0,0.0));
#269=ORIENTED_EDGE('',*,*,#585,.T.);
#270=ORIENTED_EDGE('',*,*,#586,.T.);
#271=ORIENTED_EDGE('',*,*,#587,.T.);
#272=ORIENTED_EDGE('',*,*,#588,.T.);
#273=CARTESIAN_POINT('',(146.0,43.0,38.0));
#274=DIRECTION('',(0.0,-1.0,0.0));
#275=DIRECTION('',(0.0,0.0,-1.0));
#276=ORIENTED_EDGE('',*,*,#587,.F.);
#277=ORIENTED_EDGE('',*,*,#589,.T.);
#278=ORIENTED_EDGE('',*,*,#590,.T.);
#279=ORIENTED_EDGE('',*,*,#591,.T.);
#280=ORIENTED_EDGE('',*,*,#592,.T.);
#281=CARTESIAN_POINT('',(72.3399999984,57.0,60.0));
#282=DIRECTION('',(1.0,0.0,0.0));
#283=DIRECTION('',(0.0,1.0,-1.62321328254E-14));
#284=ORIENTED_EDGE('',*,*,#593,.T.);
#285=ORIENTED_EDGE('',*,*,#594,.T.);
#286=ORIENTED_EDGE('',*,*,#595,.T.);
#287=ORIENTED_EDGE('',*,*,#596,.T.);
#288=ORIENTED_EDGE('',*,*,#597,.T.);
#289=ORIENTED_EDGE('',*,*,#598,.T.);
#290=ORIENTED_EDGE('',*,*,#599,.T.);
#291=ORIENTED_EDGE('',*,*,#600,.T.);
#292=ORIENTED_EDGE('',*,*,#601,.T.);
#293=ORIENTED_EDGE('',*,*,#602,.T.);
#294=ORIENTED_EDGE('',*,*,#603,.T.);
#295=ORIENTED_EDGE('',*,*,#604,.T.);
#296=CARTESIAN_POINT('',(0.0,0.0,0.0));
#297=DIRECTION('',(1.0,0.0,0.0));
#298=DIRECTION('',(0.0,1.0,-0.0));
#299=ORIENTED_EDGE('',*,*,#605,.T.);
#300=ORIENTED_EDGE('',*,*,#606,.T.);
#301=ORIENTED_EDGE('',*,*,#589,.F.);
#302=ORIENTED_EDGE('',*,*,#586,.F.);
#303=ORIENTED_EDGE('',*,*,#584,.F.);
#304=ORIENTED_EDGE('',*,*,#580,.F.);
#305=CARTESIAN_POINT('',(146.0,0.0,0.0));
#306=DIRECTION('',(1.0,0.0,0.0));
#307=DIRECTION('',(0.0,1.0,-0.0));
#308=ORIENTED_EDGE('',*,*,#607,.T.);
#309=ORIENTED_EDGE('',*,*,#608,.T.);
#310=CARTESIAN_POINT('',(0.0,0.0,38.0));
#311=DIRECTION('',(0.0,0.0,1.0));
#312=DIRECTION('',(1.0,-0.0,0.0));
#313=ORIENTED_EDGE('',*,*,#577,.F.);
#314=ORIENTED_EDGE('',*,*,#583,.F.);
#315=ORIENTED_EDGE('',*,*,#609,.T.);
#316=ORIENTED_EDGE('',*,*,#610,.T.);
#317=ORIENTED_EDGE('',*,*,#611,.T.);
#318=ORIENTED_EDGE('',*,*,#607,.F.);
#319=ORIENTED_EDGE('',*,*,#612,.T.);
#320=CARTESIAN_POINT('',(110.0,57.0,60.0));
#321=DIRECTION('',(-0.0,0.0,1.0));
#322=DIRECTION('',(1.0,0.0,0.0));
#323=ORIENTED_EDGE('',*,*,#582,.F.);
#324=ORIENTED_EDGE('',*,*,#578,.F.);
#325=ORIENTED_EDGE('',*,*,#612,.F.);
#326=ORIENTED_EDGE('',*,*,#608,.F.);
#327=ORIENTED_EDGE('',*,*,#611,.F.);
#328=ORIENTED_EDGE('',*,*,#613,.T.);
#329=ORIENTED_EDGE('',*,*,#609,.F.);
#330=CARTESIAN_POINT('',(110.0,57.0,60.0));
#331=DIRECTION('',(-0.0,0.0,1.0));
#332=DIRECTION('',(1.0,0.0,0.0));
#333=ORIENTED_EDGE('',*,*,#614,.T.);
#334=ORIENTED_EDGE('',*,*,#615,.T.);
#335=ORIENTED_EDGE('',*,*,#613,.F.);
#336=ORIENTED_EDGE('',*,*,#610,.F.);
#337=CARTESIAN_POINT('',(0.0,0.0,82.0));
#338=DIRECTION('',(0.0,0.0,1.0));
#339=DIRECTION('',(1.0,-0.0,0.0));
#340=ORIENTED_EDGE('',*,*,#590,.F.);
#341=ORIENTED_EDGE('',*,*,#606,.F.);
#342=ORIENTED_EDGE('',*,*,#616,.T.);
#343=ORIENTED_EDGE('',*,*,#617,.T.);
#344=CARTESIAN_POINT('',(146.0,71.0,60.0));
#345=DIRECTION('',(0.0,1.0,0.0));
#346=DIRECTION('',(1.0,0.0,-0.0));
#347=ORIENTED_EDGE('',*,*,#618,.T.);
#348=ORIENTED_EDGE('',*,*,#619,.T.);
#349=ORIENTED_EDGE('',*,*,#620,.T.);
#350=ORIENTED_EDGE('',*,*,#614,.F.);
#351=ORIENTED_EDGE('',*,*,#621,.T.);
#352=ORIENTED_EDGE('',*,*,#591,.F.);
#353=ORIENTED_EDGE('',*,*,#617,.F.);
#354=CARTESIAN_POINT('',(110.0,57.0,60.0));
#355=DIRECTION('',(-0.0,0.0,1.0));
#356=DIRECTION('',(1.0,0.0,0.0));
#357=ORIENTED_EDGE('',*,*,#621,.F.);
#358=ORIENTED_EDGE('',*,*,#615,.F.);
#359=ORIENTED_EDGE('',*,*,#622,.T.);
#360=ORIENTED_EDGE('',*,*,#623,.T.);
#361=ORIENTED_EDGE('',*,*,#624,.T.);
#362=ORIENTED_EDGE('',*,*,#588,.F.);
#363=ORIENTED_EDGE('',*,*,#592,.F.);
#364=CARTESIAN_POINT('',(110.0,57.0,60.0));
#365=DIRECTION('',(-0.0,0.0,1.0));
#366=DIRECTION('',(1.0,0.0,0.0));
#367=ORIENTED_EDGE('',*,*,#624,.F.);
#368=ORIENTED_EDGE('',*,*,#625,.T.);
#369=ORIENTED_EDGE('',*,*,#626,.T.);
#370=ORIENTED_EDGE('',*,*,#627,.T.);
#371=ORIENTED_EDGE('',*,*,#628,.T.);
#372=ORIENTED_EDGE('',*,*,#629,.T.);
#373=ORIENTED_EDGE('',*,*,#630,.T.);
#374=ORIENTED_EDGE('',*,*,#631,.T.);
#375=ORIENTED_EDGE('',*,*,#632,.T.);
#376=ORIENTED_EDGE('',*,*,#633,.T.);
#377=ORIENTED_EDGE('',*,*,#618,.F.);
#378=ORIENTED_EDGE('',*,*,#616,.F.);
#379=ORIENTED_EDGE('',*,*,#605,.F.);
#380=ORIENTED_EDGE('',*,*,#585,.F.);
#381=ORIENTED_EDGE('',*,*,#634,.T.);
#382=ORIENTED_EDGE('',*,*,#635,.T.);
#383=CARTESIAN_POINT('',(0.0,0.0,38.0));
#384=DIRECTION('',(0.0,0.0,1.0));
#385=DIRECTION('',(1.0,-0.0,0.0));
#386=ORIENTED_EDGE('',*,*,#636,.T.);
#387=ORIENTED_EDGE('',*,*,#619,.F.);
#388=ORIENTED_EDGE('',*,*,#633,.F.);
#389=ORIENTED_EDGE('',*,*,#637,.T.);
#390=CARTESIAN_POINT('',(0.0,62.0,0.0));
#391=DIRECTION('',(0.0,1.0,0.0));
#392=DIRECTION('',(1.0,0.0,-0.0));
#393=ORIENTED_EDGE('',*,*,#638,.T.);
#394=ORIENTED_EDGE('',*,*,#639,.T.);
#395=ORIENTED_EDGE('',*,*,#596,.F.);
#396=ORIENTED_EDGE('',*,*,#640,.T.);
#397=CARTESIAN_POINT('',(0.0,0.0,0.0));
#398=DIRECTION('',(0.0,0.0,-1.0));
#399=DIRECTION('',(0.0,-1.0,0.0));
#400=ORIENTED_EDGE('',*,*,#594,.F.);
#401=ORIENTED_EDGE('',*,*,#641,.T.);
#402=ORIENTED_EDGE('',*,*,#642,.T.);
#403=ORIENTED_EDGE('',*,*,#643,.T.);
#404=CARTESIAN_POINT('',(0.0,114.0,-2.89507982673E-14));
#405=DIRECTION('',(0.0,1.0,0.0));
#406=DIRECTION('',(1.0,0.0,-0.0));
#407=ORIENTED_EDGE('',*,*,#600,.F.);
#408=ORIENTED_EDGE('',*,*,#644,.T.);
#409=ORIENTED_EDGE('',*,*,#645,.T.);
#410=ORIENTED_EDGE('',*,*,#646,.T.);
#411=ORIENTED_EDGE('',*,*,#647,.T.);
#412=ORIENTED_EDGE('',*,*,#648,.T.);
#413=CARTESIAN_POINT('',(0.0,114.0,130.0));
#414=DIRECTION('',(0.0,0.0,1.0));
#415=DIRECTION('',(1.0,-0.0,0.0));
#416=ORIENTED_EDGE('',*,*,#649,.T.);
#417=ORIENTED_EDGE('',*,*,#650,.T.);
#418=ORIENTED_EDGE('',*,*,#598,.F.);
#419=ORIENTED_EDGE('',*,*,#651,.T.);
#420=CARTESIAN_POINT('',(0.0,0.0,130.0));
#421=DIRECTION('',(0.0,-1.0,0.0));
#422=DIRECTION('',(0.0,0.0,-1.0));
#423=ORIENTED_EDGE('',*,*,#620,.F.);
#424=ORIENTED_EDGE('',*,*,#636,.F.);
#425=ORIENTED_EDGE('',*,*,#646,.F.);
#426=ORIENTED_EDGE('',*,*,#652,.T.);
#427=ORIENTED_EDGE('',*,*,#622,.F.);
#428=CARTESIAN_POINT('',(80.0,57.0,82.0));
#429=DIRECTION('',(0.62469504755418,0.0,0.780868809443225));
#430=DIRECTION('',(0.0,-1.0,0.0));
#431=ORIENTED_EDGE('',*,*,#603,.F.);
#432=ORIENTED_EDGE('',*,*,#653,.T.);
#433=ORIENTED_EDGE('',*,*,#654,.T.);
#434=ORIENTED_EDGE('',*,*,#655,.T.);
#435=CARTESIAN_POINT('',(9.33999999968,22.0,108.0));
#436=DIRECTION('',(1.0,-0.0,0.0));
#437=DIRECTION('',(0.0,1.0,0.0));
#438=ORIENTED_EDGE('',*,*,#604,.F.);
#439=ORIENTED_EDGE('',*,*,#655,.F.);
#440=ORIENTED_EDGE('',*,*,#656,.T.);
#441=ORIENTED_EDGE('',*,*,#653,.F.);
#442=CARTESIAN_POINT('',(9.33999999968,22.0,108.0));
#443=DIRECTION('',(1.0,-0.0,0.0));
#444=DIRECTION('',(0.0,1.0,0.0));
#445=ORIENTED_EDGE('',*,*,#601,.F.);
#446=ORIENTED_EDGE('',*,*,#657,.T.);
#447=ORIENTED_EDGE('',*,*,#658,.T.);
#448=ORIENTED_EDGE('',*,*,#659,.T.);
#449=CARTESIAN_POINT('',(9.33999999968,92.0,108.0));
#450=DIRECTION('',(1.0,-0.0,0.0));
#451=DIRECTION('',(0.0,1.0,0.0));
#452=ORIENTED_EDGE('',*,*,#602,.F.);
#453=ORIENTED_EDGE('',*,*,#659,.F.);
#454=ORIENTED_EDGE('',*,*,#660,.T.);
#455=ORIENTED_EDGE('',*,*,#657,.F.);
#456=CARTESIAN_POINT('',(9.33999999968,92.0,108.0));
#457=DIRECTION('',(1.0,-0.0,0.0));
#458=DIRECTION('',(0.0,1.0,0.0));
#459=ORIENTED_EDGE('',*,*,#661,.T.);
#460=ORIENTED_EDGE('',*,*,#651,.F.);
#461=ORIENTED_EDGE('',*,*,#597,.F.);
#462=ORIENTED_EDGE('',*,*,#639,.F.);
#463=CARTESIAN_POINT('',(10.0,22.0,22.0));
#464=DIRECTION('',(1.0,0.0,0.0));
#465=DIRECTION('',(0.0,-1.0,1.83690953073E-16));
#466=ORIENTED_EDGE('',*,*,#662,.T.);
#467=ORIENTED_EDGE('',*,*,#644,.F.);
#468=ORIENTED_EDGE('',*,*,#599,.F.);
#469=ORIENTED_EDGE('',*,*,#650,.F.);
#470=CARTESIAN_POINT('',(10.0,22.0,108.0));
#471=DIRECTION('',(1.0,-0.0,0.0));
#472=DIRECTION('',(0.0,1.83690953073E-16,1.0));
#473=ORIENTED_EDGE('',*,*,#663,.T.);
#474=ORIENTED_EDGE('',*,*,#641,.F.);
#475=ORIENTED_EDGE('',*,*,#593,.F.);
#476=ORIENTED_EDGE('',*,*,#648,.F.);
#477=CARTESIAN_POINT('',(10.0,92.0,108.0));
#478=DIRECTION('',(1.0,0.0,0.0));
#479=DIRECTION('',(0.0,1.0,-1.83690953073E-16));
#480=ORIENTED_EDGE('',*,*,#664,.T.);
#481=ORIENTED_EDGE('',*,*,#640,.F.);
#482=ORIENTED_EDGE('',*,*,#595,.F.);
#483=ORIENTED_EDGE('',*,*,#643,.F.);
#484=CARTESIAN_POINT('',(10.0,92.0,22.0));
#485=DIRECTION('',(1.0,0.0,0.0));
#486=DIRECTION('',(0.0,-1.83690953073E-16,-1.0));
#487=ORIENTED_EDGE('',*,*,#665,.T.);
#488=ORIENTED_EDGE('',*,*,#625,.F.);
#489=ORIENTED_EDGE('',*,*,#623,.F.);
#490=ORIENTED_EDGE('',*,*,#652,.F.);
#491=CARTESIAN_POINT('',(0.0,52.0,0.0));
#492=DIRECTION('',(0.0,1.0,0.0));
#493=DIRECTION('',(1.0,0.0,-0.0));
#494=ORIENTED_EDGE('',*,*,#666,.T.);
#495=ORIENTED_EDGE('',*,*,#667,.T.);
#496=ORIENTED_EDGE('',*,*,#635,.F.);
#497=ORIENTED_EDGE('',*,*,#668,.T.);
#498=CARTESIAN_POINT('',(184.0,57.0,18.339999999));
#499=DIRECTION('',(-0.0,0.0,1.0));
#500=DIRECTION('',(1.0,0.0,0.0));
#501=ORIENTED_EDGE('',*,*,#669,.T.);
#502=ORIENTED_EDGE('',*,*,#668,.F.);
#503=ORIENTED_EDGE('',*,*,#634,.F.);
#504=ORIENTED_EDGE('',*,*,#667,.F.);
#505=CARTESIAN_POINT('',(184.0,57.0,18.339999999));
#506=DIRECTION('',(-0.0,0.0,1.0));
#507=DIRECTION('',(1.0,0.0,0.0));
#508=ORIENTED_EDGE('',*,*,#638,.F.);
#509=ORIENTED_EDGE('',*,*,#664,.F.);
#510=ORIENTED_EDGE('',*,*,#642,.F.);
#511=ORIENTED_EDGE('',*,*,#663,.F.);
#512=ORIENTED_EDGE('',*,*,#647,.F.);
#513=ORIENTED_EDGE('',*,*,#637,.F.);
#514=ORIENTED_EDGE('',*,*,#632,.F.);
#515=ORIENTED_EDGE('',*,*,#670,.T.);
#516=ORIENTED_EDGE('',*,*,#671,.T.);
#517=ORIENTED_EDGE('',*,*,#672,.T.);
#518=ORIENTED_EDGE('',*,*,#626,.F.);
#519=ORIENTED_EDGE('',*,*,#665,.F.);
#520=ORIENTED_EDGE('',*,*,#645,.F.);
#521=ORIENTED_EDGE('',*,*,#662,.F.);
#522=ORIENTED_EDGE('',*,*,#649,.F.);
#523=ORIENTED_EDGE('',*,*,#661,.F.);
#524=ORIENTED_EDGE('',*,*,#660,.F.);
#525=ORIENTED_EDGE('',*,*,#658,.F.);
#526=ORIENTED_EDGE('',*,*,#656,.F.);
#527=ORIENTED_EDGE('',*,*,#654,.F.);
#528=CARTESIAN_POINT('',(20.0,0.0,0.0));
#529=DIRECTION('',(1.0,0.0,0.0));
#530=DIRECTION('',(0.0,1.0,-0.0));
#531=ORIENTED_EDGE('',*,*,#672,.F.);
#532=ORIENTED_EDGE('',*,*,#673,.T.);
#533=ORIENTED_EDGE('',*,*,#674,.T.);
#534=ORIENTED_EDGE('',*,*,#627,.F.);
#535=CARTESIAN_POINT('',(110.0,20.0,18.0));
#536=DIRECTION('',(0.0,1.0,0.0));
#537=DIRECTION('',(1.0,0.0,-0.0));
#538=ORIENTED_EDGE('',*,*,#674,.F.);
#539=ORIENTED_EDGE('',*,*,#675,.T.);
#540=ORIENTED_EDGE('',*,*,#676,.T.);
#541=ORIENTED_EDGE('',*,*,#628,.F.);
#542=CARTESIAN_POINT('',(110.0,20.0,18.0));
#543=DIRECTION('',(0.217733823490043,-0.976008187521194,0.0));
#544=DIRECTION('',(0.0,0.0,-1.0));
#545=ORIENTED_EDGE('',*,*,#676,.F.);
#546=ORIENTED_EDGE('',*,*,#677,.T.);
#547=ORIENTED_EDGE('',*,*,#678,.T.);
#548=ORIENTED_EDGE('',*,*,#629,.F.);
#549=CARTESIAN_POINT('',(184.0,57.0,28.0));
#550=DIRECTION('',(0.0,0.0,1.0));
#551=DIRECTION('',(0.217733823490043,-0.976008187521194,0.0));
#552=ORIENTED_EDGE('',*,*,#678,.F.);
#553=ORIENTED_EDGE('',*,*,#679,.T.);
#554=ORIENTED_EDGE('',*,*,#680,.T.);
#555=ORIENTED_EDGE('',*,*,#630,.F.);
#556=CARTESIAN_POINT('',(110.0,94.0,18.0));
#557=DIRECTION('',(-0.217733823490043,-0.976008187521194,0.0));
#558=DIRECTION('',(-0.976008187521194,0.217733823490043,0.0));
#559=ORIENTED_EDGE('',*,*,#680,.F.);
#560=ORIENTED_EDGE('',*,*,#681,.T.);
#561=ORIENTED_EDGE('',*,*,#670,.F.);
#562=ORIENTED_EDGE('',*,*,#631,.F.);
#563=CARTESIAN_POINT('',(20.0,94.0,18.0));
#564=DIRECTION('',(0.0,-1.0,0.0));
#565=DIRECTION('',(0.0,0.0,-1.0));
#566=ORIENTED_EDGE('',*,*,#681,.F.);
#567=ORIENTED_EDGE('',*,*,#679,.F.);
#568=ORIENTED_EDGE('',*,*,#677,.F.);
#569=ORIENTED_EDGE('',*,*,#675,.F.);
#570=ORIENTED_EDGE('',*,*,#673,.F.);
#571=ORIENTED_EDGE('',*,*,#671,.F.);
#572=ORIENTED_EDGE('',*,*,#666,.F.);
#573=ORIENTED_EDGE('',*,*,#669,.F.);
#574=CARTESIAN_POINT('',(0.0,0.0,18.0));
#575=DIRECTION('',(0.0,0.0,1.0));
#576=DIRECTION('',(1.0,-0.0,0.0));
#577=EDGE_CURVE('',#682,#683,#684,.T.);
#578=EDGE_CURVE('',#683,#685,#686,.T.);
#579=EDGE_CURVE('',#685,#687,#688,.T.);
#580=EDGE_CURVE('',#687,#689,#690,.F.);
#581=EDGE_CURVE('',#689,#682,#691,.T.);
#582=EDGE_CURVE('',#685,#692,#693,.T.);
#583=EDGE_CURVE('',#692,#682,#694,.T.);
#584=EDGE_CURVE('',#689,#687,#695,.F.);
#585=EDGE_CURVE('',#696,#697,#698,.F.);
#586=EDGE_CURVE('',#697,#699,#700,.T.);
#587=EDGE_CURVE('',#699,#701,#702,.T.);
#588=EDGE_CURVE('',#701,#696,#703,.F.);
#589=EDGE_CURVE('',#699,#704,#705,.T.);
#590=EDGE_CURVE('',#704,#706,#707,.T.);
#591=EDGE_CURVE('',#706,#708,#709,.F.);
#592=EDGE_CURVE('',#708,#701,#710,.F.);
#593=EDGE_CURVE('',#711,#712,#713,.F.);
#594=EDGE_CURVE('',#712,#714,#715,.F.);
#595=EDGE_CURVE('',#714,#716,#717,.F.);
#596=EDGE_CURVE('',#716,#718,#719,.F.);
#597=EDGE_CURVE('',#718,#720,#721,.F.);
#598=EDGE_CURVE('',#720,#722,#723,.F.);
#599=EDGE_CURVE('',#722,#724,#725,.F.);
#600=EDGE_CURVE('',#724,#711,#726,.F.);
#601=EDGE_CURVE('',#727,#728,#729,.T.);
#602=EDGE_CURVE('',#728,#727,#730,.T.);
#603=EDGE_CURVE('',#731,#732,#733,.T.);
#604=EDGE_CURVE('',#732,#731,#734,.T.);
#605=EDGE_CURVE('',#697,#735,#736,.F.);
#606=EDGE_CURVE('',#735,#704,#737,.T.);
#607=EDGE_CURVE('',#738,#739,#740,.T.);
#608=EDGE_CURVE('',#739,#738,#741,.T.);
#609=EDGE_CURVE('',#692,#742,#743,.T.);
#610=EDGE_CURVE('',#742,#744,#745,.F.);
#611=EDGE_CURVE('',#744,#739,#746,.T.);
#612=EDGE_CURVE('',#738,#683,#747,.T.);
#613=EDGE_CURVE('',#744,#742,#748,.F.);
#614=EDGE_CURVE('',#749,#750,#751,.T.);
#615=EDGE_CURVE('',#750,#749,#752,.T.);
#616=EDGE_CURVE('',#735,#753,#754,.F.);
#617=EDGE_CURVE('',#753,#706,#755,.F.);
#618=EDGE_CURVE('',#753,#756,#757,.F.);
#619=EDGE_CURVE('',#756,#758,#759,.F.);
#620=EDGE_CURVE('',#758,#750,#760,.F.);
#621=EDGE_CURVE('',#749,#708,#761,.T.);
#622=EDGE_CURVE('',#750,#762,#763,.F.);
#623=EDGE_CURVE('',#762,#764,#765,.T.);
#624=EDGE_CURVE('',#764,#696,#766,.F.);
#625=EDGE_CURVE('',#764,#767,#768,.T.);
#626=EDGE_CURVE('',#767,#769,#770,.F.);
#627=EDGE_CURVE('',#769,#771,#772,.F.);
#628=EDGE_CURVE('',#771,#773,#774,.T.);
#629=EDGE_CURVE('',#773,#775,#776,.T.);
#630=EDGE_CURVE('',#775,#777,#778,.F.);
#631=EDGE_CURVE('',#777,#779,#780,.F.);
#632=EDGE_CURVE('',#779,#781,#782,.F.);
#633=EDGE_CURVE('',#781,#756,#783,.F.);
#634=EDGE_CURVE('',#784,#785,#786,.F.);
#635=EDGE_CURVE('',#785,#784,#787,.F.);
#636=EDGE_CURVE('',#788,#758,#789,.T.);
#637=EDGE_CURVE('',#781,#788,#790,.F.);
#638=EDGE_CURVE('',#791,#792,#793,.T.);
#639=EDGE_CURVE('',#792,#718,#794,.T.);
#640=EDGE_CURVE('',#716,#791,#795,.F.);
#641=EDGE_CURVE('',#712,#796,#797,.F.);
#642=EDGE_CURVE('',#796,#798,#799,.T.);
#643=EDGE_CURVE('',#798,#714,#800,.T.);
#644=EDGE_CURVE('',#724,#801,#802,.F.);
#645=EDGE_CURVE('',#801,#803,#804,.T.);
#646=EDGE_CURVE('',#803,#788,#805,.T.);
#647=EDGE_CURVE('',#788,#806,#807,.T.);
#648=EDGE_CURVE('',#806,#711,#808,.T.);
#649=EDGE_CURVE('',#809,#810,#811,.T.);
#650=EDGE_CURVE('',#810,#722,#812,.T.);
#651=EDGE_CURVE('',#720,#809,#813,.F.);
#652=EDGE_CURVE('',#803,#762,#814,.F.);
#653=EDGE_CURVE('',#731,#815,#816,.T.);
#654=EDGE_CURVE('',#815,#817,#818,.F.);
#655=EDGE_CURVE('',#817,#732,#819,.T.);
#656=EDGE_CURVE('',#817,#815,#820,.F.);
#657=EDGE_CURVE('',#727,#821,#822,.T.);
#658=EDGE_CURVE('',#821,#823,#824,.F.);
#659=EDGE_CURVE('',#823,#728,#825,.T.);
#660=EDGE_CURVE('',#823,#821,#826,.F.);
#661=EDGE_CURVE('',#792,#809,#827,.T.);
#662=EDGE_CURVE('',#810,#801,#828,.T.);
#663=EDGE_CURVE('',#806,#796,#829,.T.);
#664=EDGE_CURVE('',#798,#791,#830,.T.);
#665=EDGE_CURVE('',#803,#767,#831,.T.);
#666=EDGE_CURVE('',#832,#833,#834,.T.);
#667=EDGE_CURVE('',#833,#784,#835,.T.);
#668=EDGE_CURVE('',#785,#832,#836,.T.);
#669=EDGE_CURVE('',#833,#832,#837,.T.);
#670=EDGE_CURVE('',#779,#838,#839,.T.);
#671=EDGE_CURVE('',#838,#840,#841,.T.);
#672=EDGE_CURVE('',#840,#769,#842,.T.);
#673=EDGE_CURVE('',#840,#843,#844,.T.);
#674=EDGE_CURVE('',#843,#771,#845,.F.);
#675=EDGE_CURVE('',#843,#846,#847,.F.);
#676=EDGE_CURVE('',#846,#773,#848,.F.);
#677=EDGE_CURVE('',#846,#849,#850,.F.);
#678=EDGE_CURVE('',#849,#775,#851,.F.);
#679=EDGE_CURVE('',#849,#852,#853,.T.);
#680=EDGE_CURVE('',#852,#777,#854,.T.);
#681=EDGE_CURVE('',#852,#838,#855,.T.);
#682=VERTEX_POINT('',#856);
#683=VERTEX_POINT('',#857);
#684=B_SPLINE_CURVE_WITH_KNOTS('',3,(#858,#859,#860,#861,#862,#863,#864,#865,#866,#867,#868,#869,#870,#871,#872,#873,#874,#875),.UNSPECIFIED.,.F.,.F.,(4,2,2,2,2,2,2,2,4),(0.0,1.52623066101061,3.05246132202121,4.57869198303182,6.10492264404242,7.62960932523956,9.1542960064367,10.6789826876338,12.203669368831),.UNSPECIFIED.);
#685=VERTEX_POINT('',#876);
#686=B_SPLINE_CURVE_WITH_KNOTS('',3,(#877,#878,#879,#880,#881,#882,#883,#884,#885,#886,#887,#888,#889,#890,#891,#892,#893,#894),.UNSPECIFIED.,.F.,.F.,(4,2,2,2,2,2,2,2,4),(12.203669368831,13.7283560500281,15.2530427312252,16.7777294124224,18.3024160936195,19.8286467546301,21.3548774156407,22.8811080766513,24.4073387376619),.UNSPECIFIED.);
#687=VERTEX_POINT('',#895);
#688=LINE('',#896,#897);
#689=VERTEX_POINT('',#898);
#690=CIRCLE('',#899,8.0);
#691=LINE('',#900,#901);
#692=VERTEX_POINT('',#902);
#693=B_SPLINE_CURVE_WITH_KNOTS('',3,(#903,#904,#905,#906,#907,#908,#909,#910,#911,#912,#913,#914,#915,#916,#917,#918,#919,#920),.UNSPECIFIED.,.F.,.F.,(4,2,2,2,2,2,2,2,4),(24.4073387376619,25.9335693986725,27.4598000596831,28.9860307206937,30.5122613817043,32.0369480629015,33.5616347440986,35.0863214252958,36.6110081064929),.UNSPECIFIED.);
#694=B_SPLINE_CURVE_WITH_KNOTS('',3,(#921,#922,#923,#924,#925,#926,#927,#928,#929,#930,#931,#932,#933,#934,#935,#936,#937,#938),.UNSPECIFIED.,.F.,.F.,(4,2,2,2,2,2,2,2,4),(-12.203669368831,-10.6789826876338,-9.1542960064367,-7.62960932523956,-6.10492264404242,-4.57869198303182,-3.05246132202122,-1.52623066101061,0.0),.UNSPECIFIED.);
#695=CIRCLE('',#939,8.0);
#696=VERTEX_POINT('',#940);
#697=VERTEX_POINT('',#941);
#698=LINE('',#942,#943);
#699=VERTEX_POINT('',#944);
#700=LINE('',#945,#946);
#701=VERTEX_POINT('',#947);
#702=LINE('',#948,#949);
#703=LINE('',#950,#951);
#704=VERTEX_POINT('',#952);
#705=CIRCLE('',#953,14.0);
#706=VERTEX_POINT('',#954);
#707=LINE('',#955,#956);
#708=VERTEX_POINT('',#957);
#709=B_SPLINE_CURVE_WITH_KNOTS('',3,(#958,#959,#960,#961,#962,#963,#964,#965,#966,#967,#968,#969,#970,#971,#972,#973,#974,#975),.UNSPECIFIED.,.F.,.F.,(4,2,2,2,2,2,2,2,4),(-21.4630435230583,-18.782841935853,-16.1026403486477,-13.4224387614424,-10.7422371742371,-8.05667788067781,-5.37111858711854,-2.68555929355928,0.0),.UNSPECIFIED.);
#710=B_SPLINE_CURVE_WITH_KNOTS('',3,(#976,#977,#978,#979,#980,#981,#982,#983,#984,#985,#986,#987,#988,#989,#990,#991,#992,#993),.UNSPECIFIED.,.F.,.F.,(4,2,2,2,2,2,2,2,4),(42.9260870461167,45.611646339676,48.2972056332352,50.9827649267945,53.6683242203538,56.3485258075591,59.0287273947644,61.7089289819697,64.389130569175),.UNSPECIFIED.);
#711=VERTEX_POINT('',#994);
#712=VERTEX_POINT('',#995);
#713=CIRCLE('',#996,22.0);
#714=VERTEX_POINT('',#997);
#715=LINE('',#998,#999);
#716=VERTEX_POINT('',#1000);
#717=CIRCLE('',#1001,22.0);
#718=VERTEX_POINT('',#1002);
#719=LINE('',#1003,#1004);
#720=VERTEX_POINT('',#1005);
#721=CIRCLE('',#1006,22.0);
#722=VERTEX_POINT('',#1007);
#723=LINE('',#1008,#1009);
#724=VERTEX_POINT('',#1010);
#725=CIRCLE('',#1011,22.0);
#726=LINE('',#1012,#1013);
#727=VERTEX_POINT('',#1014);
#728=VERTEX_POINT('',#1015);
#729=CIRCLE('',#1016,10.0);
#730=CIRCLE('',#1017,10.0);
#731=VERTEX_POINT('',#1018);
#732=VERTEX_POINT('',#1019);
#733=CIRCLE('',#1020,10.0);
#734=CIRCLE('',#1021,10.0);
#735=VERTEX_POINT('',#1022);
#736=LINE('',#1023,#1024);
#737=LINE('',#1025,#1026);
#738=VERTEX_POINT('',#1027);
#739=VERTEX_POINT('',#1028);
#740=CIRCLE('',#1029,20.0);
#741=CIRCLE('',#1030,20.0);
#742=VERTEX_POINT('',#1031);
#743=LINE('',#1032,#1033);
#744=VERTEX_POINT('',#1034);
#745=CIRCLE('',#1035,20.0);
#746=LINE('',#1036,#1037);
#747=LINE('',#1038,#1039);
#748=CIRCLE('',#1040,20.0);
#749=VERTEX_POINT('',#1041);
#750=VERTEX_POINT('',#1042);
#751=CIRCLE('',#1043,30.0);
#752=CIRCLE('',#1044,30.0);
#753=VERTEX_POINT('',#1045);
#754=LINE('',#1046,#1047);
#755=LINE('',#1048,#1049);
#756=VERTEX_POINT('',#1050);
#757=CIRCLE('',#1051,30.0);
#758=VERTEX_POINT('',#1052);
#759=LINE('',#1053,#1054);
#760=ELLIPSE('',#1055,38.4187454245875,30.0);
#761=LINE('',#1056,#1057);
#762=VERTEX_POINT('',#1058);
#763=ELLIPSE('',#1059,38.4187454245875,30.0);
#764=VERTEX_POINT('',#1060);
#765=LINE('',#1061,#1062);
#766=CIRCLE('',#1063,30.0);
#767=VERTEX_POINT('',#1064);
#768=LINE('',#1065,#1066);
#769=VERTEX_POINT('',#1067);
#770=LINE('',#1068,#1069);
#771=VERTEX_POINT('',#1070);
#772=LINE('',#1071,#1072);
#773=VERTEX_POINT('',#1073);
#774=LINE('',#1074,#1075);
#775=VERTEX_POINT('',#1076);
#776=CIRCLE('',#1077,20.0);
#777=VERTEX_POINT('',#1078);
#778=LINE('',#1079,#1080);
#779=VERTEX_POINT('',#1081);
#780=LINE('',#1082,#1083);
#781=VERTEX_POINT('',#1084);
#782=LINE('',#1085,#1086);
#783=LINE('',#1087,#1088);
#784=VERTEX_POINT('',#1089);
#785=VERTEX_POINT('',#1090);
#786=CIRCLE('',#1091,10.0);
#787=CIRCLE('',#1092,10.0);
#788=VERTEX_POINT('',#1093);
#789=LINE('',#1094,#1095);
#790=LINE('',#1096,#1097);
#791=VERTEX_POINT('',#1098);
#792=VERTEX_POINT('',#1099);
#793=LINE('',#1100,#1101);
#794=LINE('',#1102,#1103);
#795=LINE('',#1104,#1105);
#796=VERTEX_POINT('',#1106);
#797=LINE('',#1107,#1108);
#798=VERTEX_POINT('',#1109);
#799=LINE('',#1110,#1111);
#800=LINE('',#1112,#1113);
#801=VERTEX_POINT('',#1114);
#802=LINE('',#1115,#1116);
#803=VERTEX_POINT('',#1117);
#804=LINE('',#1118,#1119);
#805=LINE('',#1120,#1121);
#806=VERTEX_POINT('',#1122);
#807=LINE('',#1123,#1124);
#808=LINE('',#1125,#1126);
#809=VERTEX_POINT('',#1127);
#810=VERTEX_POINT('',#1128);
#811=LINE('',#1129,#1130);
#812=LINE('',#1131,#1132);
#813=LINE('',#1133,#1134);
#814=LINE('',#1135,#1136);
#815=VERTEX_POINT('',#1137);
#816=LINE('',#1138,#1139);
#817=VERTEX_POINT('',#1140);
#818=CIRCLE('',#1141,10.0);
#819=LINE('',#1142,#1143);
#820=CIRCLE('',#1144,10.0);
#821=VERTEX_POINT('',#1145);
#822=LINE('',#1146,#1147);
#823=VERTEX_POINT('',#1148);
#824=CIRCLE('',#1149,10.0);
#825=LINE('',#1150,#1151);
#826=CIRCLE('',#1152,10.0);
#827=CIRCLE('',#1153,22.0);
#828=CIRCLE('',#1154,22.0);
#829=CIRCLE('',#1155,22.0);
#830=CIRCLE('',#1156,22.0);
#831=LINE('',#1157,#1158);
#832=VERTEX_POINT('',#1159);
#833=VERTEX_POINT('',#1160);
#834=CIRCLE('',#1161,10.0);
#835=LINE('',#1162,#1163);
#836=LINE('',#1164,#1165);
#837=CIRCLE('',#1166,10.0);
#838=VERTEX_POINT('',#1167);
#839=LINE('',#1168,#1169);
#840=VERTEX_POINT('',#1170);
#841=LINE('',#1171,#1172);
#842=LINE('',#1173,#1174);
#843=VERTEX_POINT('',#1175);
#844=LINE('',#1176,#1177);
#845=LINE('',#1178,#1179);
#846=VERTEX_POINT('',#1180);
#847=LINE('',#1181,#1182);
#848=LINE('',#1183,#1184);
#849=VERTEX_POINT('',#1185);
#850=CIRCLE('',#1186,20.0);
#851=LINE('',#1187,#1188);
#852=VERTEX_POINT('',#1189);
#853=LINE('',#1190,#1191);
#854=LINE('',#1192,#1193);
#855=LINE('',#1194,#1195);
#856=CARTESIAN_POINT('',(128.33030278,65.0,60.0));
#857=CARTESIAN_POINT('',(130.0,57.0,52.0));
#858=CARTESIAN_POINT('',(128.330302779823,65.0,60.0));
#859=CARTESIAN_POINT('',(128.330302779823,65.0,59.4912564463298));
#860=CARTESIAN_POINT('',(128.352082220759,64.9506941225769,58.9672591154358));
#861=CARTESIAN_POINT('',(128.4396813015,64.7453606977336,57.9288943874243));
#862=CARTESIAN_POINT('',(128.505394350036,64.5894005133022,57.4145046811216));
#863=CARTESIAN_POINT('',(128.668216379823,64.1795759341413,56.4310388282597));
#864=CARTESIAN_POINT('',(128.765266604344,63.9253866518226,55.9610713078626));
#865=CARTESIAN_POINT('',(128.971000931203,63.3401368013103,55.0932097431439));
#866=CARTESIAN_POINT('',(129.079479250216,63.0090160280776,54.6953075290928));
#867=CARTESIAN_POINT('',(129.287067881766,62.3050487281172,53.9913402291325));
#868=CARTESIAN_POINT('',(129.393722817552,61.9073177281221,53.6602649585717));
#869=CARTESIAN_POINT('',(129.59290064772,61.0393682939295,53.0748637935486));
#870=CARTESIAN_POINT('',(129.685252385316,60.5691409997494,52.8204928141588));
#871=CARTESIAN_POINT('',(129.838471031214,59.5851491537674,52.4104614243058));
#872=CARTESIAN_POINT('',(129.899353125706,59.0705005684141,52.254475088598));
#873=CARTESIAN_POINT('',(129.98014272629,58.0320484788359,52.049213580092));
#874=CARTESIAN_POINT('',(130.0,57.5082288937324,52.0));
#875=CARTESIAN_POINT('',(130.0,57.0,52.0));
#876=CARTESIAN_POINT('',(128.33030278,49.0,60.0));
#877=CARTESIAN_POINT('',(130.0,57.0,52.0));
#878=CARTESIAN_POINT('',(130.0,56.4917711062676,52.0));
#879=CARTESIAN_POINT('',(129.98014272629,55.9679515211641,52.049213580092));
#880=CARTESIAN_POINT('',(129.899353125706,54.9294994315859,52.254475088598));
#881=CARTESIAN_POINT('',(129.838471031214,54.4148508462326,52.4104614243058));
#882=CARTESIAN_POINT('',(129.685252385316,53.4308590002506,52.8204928141588));
#883=CARTESIAN_POINT('',(129.59290064772,52.9606317060705,53.0748637935486));
#884=CARTESIAN_POINT('',(129.393722817552,52.0926822718779,53.6602649585717));
#885=CARTESIAN_POINT('',(129.287067881766,51.6949512718828,53.9913402291325));
#886=CARTESIAN_POINT('',(129.079479250216,50.9909839719224,54.6953075290928));
#887=CARTESIAN_POINT('',(128.971000931203,50.6598631986897,55.0932097431439));
#888=CARTESIAN_POINT('',(128.765266604344,50.0746133481774,55.9610713078626));
#889=CARTESIAN_POINT('',(128.668216379823,49.8204240658587,56.4310388282597));
#890=CARTESIAN_POINT('',(128.505394350036,49.4105994866978,57.4145046811216));
#891=CARTESIAN_POINT('',(128.4396813015,49.2546393022664,57.9288943874243));
#892=CARTESIAN_POINT('',(128.352082220759,49.0493058774231,58.9672591154358));
#893=CARTESIAN_POINT('',(128.330302779823,49.0,59.4912564463298));
#894=CARTESIAN_POINT('',(128.330302779823,49.0,60.0));
#895=CARTESIAN_POINT('',(146.0,49.0,60.0));
#896=CARTESIAN_POINT('',(72.3399999984,49.0,60.0));
#897=VECTOR('',#1196,1.0);
#898=CARTESIAN_POINT('',(146.0,65.0,60.0));
#899=AXIS2_PLACEMENT_3D('',#1197,#1198,#1199);
#900=CARTESIAN_POINT('',(72.3399999984,65.0,60.0));
#901=VECTOR('',#1200,1.0);
#902=CARTESIAN_POINT('',(130.0,57.0,68.0));
#903=CARTESIAN_POINT('',(128.330302779823,49.0,60.0));
#904=CARTESIAN_POINT('',(128.330302779823,49.0,60.5087435536702));
#905=CARTESIAN_POINT('',(128.352082220759,49.0493058774231,61.0327408845642));
#906=CARTESIAN_POINT('',(128.4396813015,49.2546393022664,62.0711056125757));
#907=CARTESIAN_POINT('',(128.505394350036,49.4105994866978,62.5854953188784));
#908=CARTESIAN_POINT('',(128.668216379823,49.8204240658587,63.5689611717403));
#909=CARTESIAN_POINT('',(128.765266604344,50.0746133481774,64.0389286921373));
#910=CARTESIAN_POINT('',(128.971000931203,50.6598631986897,64.906790256856));
#911=CARTESIAN_POINT('',(129.079479250216,50.9909839719224,65.3046924709071));
#912=CARTESIAN_POINT('',(129.287067881766,51.6949512718828,66.0086597708675));
#913=CARTESIAN_POINT('',(129.393722817551,52.0926822718779,66.3397350414283));
#914=CARTESIAN_POINT('',(129.59290064772,52.9606317060705,66.9251362064514));
#915=CARTESIAN_POINT('',(129.685252385316,53.4308590002505,67.1795071858411));
#916=CARTESIAN_POINT('',(129.838471031214,54.4148508462326,67.5895385756942));
#917=CARTESIAN_POINT('',(129.899353125706,54.9294994315859,67.7455249114019));
#918=CARTESIAN_POINT('',(129.98014272629,55.9679515211641,67.950786419908));
#919=CARTESIAN_POINT('',(130.0,56.4917711062676,68.0));
#920=CARTESIAN_POINT('',(130.0,57.0,68.0));
#921=CARTESIAN_POINT('',(130.0,57.0,68.0));
#922=CARTESIAN_POINT('',(130.0,57.5082288937324,68.0));
#923=CARTESIAN_POINT('',(129.98014272629,58.0320484788359,67.950786419908));
#924=CARTESIAN_POINT('',(129.899353125706,59.070500568414,67.745524911402));
#925=CARTESIAN_POINT('',(129.838471031214,59.5851491537674,67.5895385756942));
#926=CARTESIAN_POINT('',(129.685252385316,60.5691409997494,67.1795071858412));
#927=CARTESIAN_POINT('',(129.59290064772,61.0393682939295,66.9251362064514));
#928=CARTESIAN_POINT('',(129.393722817551,61.9073177281221,66.3397350414283));
#929=CARTESIAN_POINT('',(129.287067881766,62.3050487281172,66.0086597708675));
#930=CARTESIAN_POINT('',(129.079479250216,63.0090160280776,65.3046924709072));
#931=CARTESIAN_POINT('',(128.971000931203,63.3401368013103,64.9067902568561));
#932=CARTESIAN_POINT('',(128.765266604344,63.9253866518226,64.0389286921374));
#933=CARTESIAN_POINT('',(128.668216379823,64.1795759341413,63.5689611717403));
#934=CARTESIAN_POINT('',(128.505394350036,64.5894005133022,62.5854953188784));
#935=CARTESIAN_POINT('',(128.4396813015,64.7453606977336,62.0711056125757));
#936=CARTESIAN_POINT('',(128.352082220759,64.9506941225769,61.0327408845642));
#937=CARTESIAN_POINT('',(128.330302779823,65.0,60.5087435536702));
#938=CARTESIAN_POINT('',(128.330302779823,65.0,60.0));
#939=AXIS2_PLACEMENT_3D('',#1201,#1202,#1203);
#940=CARTESIAN_POINT('',(136.532998322843,43.0,38.0));
#941=CARTESIAN_POINT('',(146.0,43.0,38.0));
#942=CARTESIAN_POINT('',(73.0,43.0,38.0));
#943=VECTOR('',#1204,1.0);
#944=CARTESIAN_POINT('',(146.0,43.0,60.0));
#945=CARTESIAN_POINT('',(146.0,43.0,19.0));
#946=VECTOR('',#1205,1.0);
#947=CARTESIAN_POINT('',(136.532998322843,43.0,60.0));
#948=CARTESIAN_POINT('',(72.3399999984,43.0,60.0));
#949=VECTOR('',#1206,1.0);
#950=CARTESIAN_POINT('',(136.532998322843,43.0,60.0));
#951=VECTOR('',#1207,1.0);
#952=CARTESIAN_POINT('',(146.0,71.0,60.0));
#953=AXIS2_PLACEMENT_3D('',#1208,#1209,#1210);
#954=CARTESIAN_POINT('',(136.532998322843,71.0,60.0));
#955=CARTESIAN_POINT('',(72.3399999984,71.0,60.0));
#956=VECTOR('',#1211,1.0);
#957=CARTESIAN_POINT('',(140.0,57.0,74.0));
#958=CARTESIAN_POINT('',(140.0,57.0,74.0));
#959=CARTESIAN_POINT('',(140.0,57.8934005290684,74.0));
#960=CARTESIAN_POINT('',(139.959115754348,58.8130481390931,73.9130992226075));
#961=CARTESIAN_POINT('',(139.793129314985,60.6338968004446,73.5519838980686));
#962=CARTESIAN_POINT('',(139.668128792712,61.5351305414869,73.2778874663292));
#963=CARTESIAN_POINT('',(139.353453641978,63.2561996316225,72.5590472027631));
#964=CARTESIAN_POINT('',(139.16372379128,64.0776423143687,72.1137304043149));
#965=CARTESIAN_POINT('',(138.753824223588,65.5926363029868,71.0906305662968));
#966=CARTESIAN_POINT('',(138.533982146973,66.2862222659699,70.5127676072534));
#967=CARTESIAN_POINT('',(138.104798347499,67.5139935355194,69.2849963377039));
#968=CARTESIAN_POINT('',(137.879641350202,68.0920247130598,68.5908097218369));
#969=CARTESIAN_POINT('',(137.450744356126,69.1146212658185,67.0760847506172));
#970=CARTESIAN_POINT('',(137.24741888788,69.5593160806925,66.255516437268));
#971=CARTESIAN_POINT('',(136.904795576449,70.2774342685814,64.5362550294407));
#972=CARTESIAN_POINT('',(136.765651454974,70.5514279086815,63.6359326710229));
#973=CARTESIAN_POINT('',(136.579613693099,70.9127794580306,61.8154262162855));
#974=CARTESIAN_POINT('',(136.532998322843,71.0,60.8951864311864));
#975=CARTESIAN_POINT('',(136.532998322843,71.0,60.0));
#976=CARTESIAN_POINT('',(136.532998322843,43.0,60.0));
#977=CARTESIAN_POINT('',(136.532998322843,43.0,60.8951864311864));
#978=CARTESIAN_POINT('',(136.579613693099,43.0872205419694,61.8154262162855));
#979=CARTESIAN_POINT('',(136.765651454974,43.4485720913185,63.6359326710229));
#980=CARTESIAN_POINT('',(136.904795576449,43.7225657314186,64.5362550294407));
#981=CARTESIAN_POINT('',(137.24741888788,44.4406839193076,66.255516437268));
#982=CARTESIAN_POINT('',(137.450744356126,44.8853787341815,67.0760847506172));
#983=CARTESIAN_POINT('',(137.879641350202,45.9079752869402,68.5908097218369));
#984=CARTESIAN_POINT('',(138.104798347499,46.4860064644806,69.2849963377039));
#985=CARTESIAN_POINT('',(138.533982146973,47.7137777340301,70.5127676072535));
#986=CARTESIAN_POINT('',(138.753824223588,48.4073636970133,71.0906305662968));
#987=CARTESIAN_POINT('',(139.16372379128,49.9223576856313,72.1137304043149));
#988=CARTESIAN_POINT('',(139.353453641978,50.7438003683775,72.5590472027631));
#989=CARTESIAN_POINT('',(139.668128792712,52.4648694585131,73.2778874663292));
#990=CARTESIAN_POINT('',(139.793129314985,53.3661031995554,73.5519838980686));
#991=CARTESIAN_POINT('',(139.959115754348,55.1869518609069,73.9130992226075));
#992=CARTESIAN_POINT('',(140.0,56.1065994709316,74.0));
#993=CARTESIAN_POINT('',(140.0,57.0,74.0));
#994=CARTESIAN_POINT('',(0.0,92.0,130.0));
#995=CARTESIAN_POINT('',(0.0,114.0,108.0));
#996=AXIS2_PLACEMENT_3D('',#1212,#1213,#1214);
#997=CARTESIAN_POINT('',(0.0,114.0,22.0));
#998=CARTESIAN_POINT('',(0.0,114.0,-1.447539913365E-14));
#999=VECTOR('',#1215,1.0);
#1000=CARTESIAN_POINT('',(0.0,92.0,0.0));
#1001=AXIS2_PLACEMENT_3D('',#1216,#1217,#1218);
#1002=CARTESIAN_POINT('',(0.0,22.0,0.0));
#1003=CARTESIAN_POINT('',(0.0,0.0,0.0));
#1004=VECTOR('',#1219,1.0);
#1005=CARTESIAN_POINT('',(0.0,0.0,22.0));
#1006=AXIS2_PLACEMENT_3D('',#1220,#1221,#1222);
#1007=CARTESIAN_POINT('',(0.0,0.0,108.0));
#1008=CARTESIAN_POINT('',(0.0,0.0,65.0));
#1009=VECTOR('',#1223,1.0);
#1010=CARTESIAN_POINT('',(0.0,22.0,130.0));
#1011=AXIS2_PLACEMENT_3D('',#1224,#1225,#1226);
#1012=CARTESIAN_POINT('',(0.0,57.0,130.0));
#1013=VECTOR('',#1227,1.0);
#1014=CARTESIAN_POINT('',(0.0,102.0,108.0));
#1015=CARTESIAN_POINT('',(0.0,82.0,108.0));
#1016=AXIS2_PLACEMENT_3D('',#1228,#1229,#1230);
#1017=AXIS2_PLACEMENT_3D('',#1231,#1232,#1233);
#1018=CARTESIAN_POINT('',(0.0,32.0,108.0));
#1019=CARTESIAN_POINT('',(0.0,12.0,108.0));
#1020=AXIS2_PLACEMENT_3D('',#1234,#1235,#1236);
#1021=AXIS2_PLACEMENT_3D('',#1237,#1238,#1239);
#1022=CARTESIAN_POINT('',(146.0,71.0,38.0));
#1023=CARTESIAN_POINT('',(146.0,0.0,38.0));
#1024=VECTOR('',#1240,1.0);
#1025=CARTESIAN_POINT('',(146.0,71.0,30.0));
#1026=VECTOR('',#1241,1.0);
#1027=CARTESIAN_POINT('',(130.0,57.0,38.0));
#1028=CARTESIAN_POINT('',(90.0,57.0,38.0));
#1029=AXIS2_PLACEMENT_3D('',#1242,#1243,#1244);
#1030=AXIS2_PLACEMENT_3D('',#1245,#1246,#1247);
#1031=CARTESIAN_POINT('',(130.0,57.0,82.0));
#1032=CARTESIAN_POINT('',(130.0,57.0,60.0));
#1033=VECTOR('',#1248,1.0);
#1034=CARTESIAN_POINT('',(90.0,57.0,82.0));
#1035=AXIS2_PLACEMENT_3D('',#1249,#1250,#1251);
#1036=CARTESIAN_POINT('',(90.0,57.0,60.0));
#1037=VECTOR('',#1252,1.0);
#1038=CARTESIAN_POINT('',(130.0,57.0,60.0));
#1039=VECTOR('',#1253,1.0);
#1040=AXIS2_PLACEMENT_3D('',#1254,#1255,#1256);
#1041=CARTESIAN_POINT('',(140.0,57.0,82.0));
#1042=CARTESIAN_POINT('',(80.0,57.0,82.0));
#1043=AXIS2_PLACEMENT_3D('',#1257,#1258,#1259);
#1044=AXIS2_PLACEMENT_3D('',#1260,#1261,#1262);
#1045=CARTESIAN_POINT('',(136.532998322843,71.0,38.0));
#1046=CARTESIAN_POINT('',(73.0,71.0,38.0));
#1047=VECTOR('',#1263,1.0);
#1048=CARTESIAN_POINT('',(136.532998322843,71.0,60.0));
#1049=VECTOR('',#1264,1.0);
#1050=CARTESIAN_POINT('',(80.4196010845019,62.0,38.0));
#1051=AXIS2_PLACEMENT_3D('',#1265,#1266,#1267);
#1052=CARTESIAN_POINT('',(80.4196010845019,62.0,81.6643191323987));
#1053=CARTESIAN_POINT('',(80.4196010845019,62.0,60.0));
#1054=VECTOR('',#1268,1.0);
#1055=AXIS2_PLACEMENT_3D('',#1269,#1270,#1271);
#1056=CARTESIAN_POINT('',(140.0,57.0,60.0));
#1057=VECTOR('',#1272,1.0);
#1058=CARTESIAN_POINT('',(80.4196010845019,52.0,81.6643191323987));
#1059=AXIS2_PLACEMENT_3D('',#1273,#1274,#1275);
#1060=CARTESIAN_POINT('',(80.4196010845019,52.0,38.0));
#1061=CARTESIAN_POINT('',(80.4196010845019,52.0,60.0));
#1062=VECTOR('',#1276,1.0);
#1063=AXIS2_PLACEMENT_3D('',#1277,#1278,#1279);
#1064=CARTESIAN_POINT('',(20.0,52.0,38.0));
#1065=CARTESIAN_POINT('',(0.0,52.0,38.0));
#1066=VECTOR('',#1280,1.0);
#1067=CARTESIAN_POINT('',(20.0,20.0,38.0));
#1068=CARTESIAN_POINT('',(20.0,0.0,38.0));
#1069=VECTOR('',#1281,1.0);
#1070=CARTESIAN_POINT('',(110.0,20.0,38.0));
#1071=CARTESIAN_POINT('',(55.0,20.0,38.0));
#1072=VECTOR('',#1282,1.0);
#1073=CARTESIAN_POINT('',(188.354676469805,37.4798362495556,38.0));
#1074=CARTESIAN_POINT('',(55.4823410397719,7.83787012762234,38.0));
#1075=VECTOR('',#1283,1.0);
#1076=CARTESIAN_POINT('',(188.354676469801,76.5201637504239,38.0));
#1077=AXIS2_PLACEMENT_3D('',#1284,#1285,#1286);
#1078=CARTESIAN_POINT('',(110.0,94.0,38.0));
#1079=CARTESIAN_POINT('',(67.5954107220867,103.459872852557,38.0));
#1080=VECTOR('',#1287,1.0);
#1081=CARTESIAN_POINT('',(20.0,94.0,38.0));
#1082=CARTESIAN_POINT('',(10.0,94.0,38.0));
#1083=VECTOR('',#1288,1.0);
#1084=CARTESIAN_POINT('',(20.0,62.0,38.0));
#1085=CARTESIAN_POINT('',(20.0,0.0,38.0));
#1086=VECTOR('',#1289,1.0);
#1087=CARTESIAN_POINT('',(0.0,62.0,38.0));
#1088=VECTOR('',#1290,1.0);
#1089=CARTESIAN_POINT('',(174.0,57.0,38.0));
#1090=CARTESIAN_POINT('',(194.0,57.0,38.0));
#1091=AXIS2_PLACEMENT_3D('',#1291,#1292,#1293);
#1092=AXIS2_PLACEMENT_3D('',#1294,#1295,#1296);
#1093=CARTESIAN_POINT('',(20.0,62.0,130.0));
#1094=CARTESIAN_POINT('',(75.609756097546,62.0,85.512195121961));
#1095=VECTOR('',#1297,1.0);
#1096=CARTESIAN_POINT('',(20.0,62.0,0.0));
#1097=VECTOR('',#1298,1.0);
#1098=CARTESIAN_POINT('',(20.0,92.0,0.0));
#1099=CARTESIAN_POINT('',(20.0,22.0,0.0));
#1100=CARTESIAN_POINT('',(20.0,0.0,0.0));
#1101=VECTOR('',#1299,1.0);
#1102=CARTESIAN_POINT('',(10.0,22.0,0.0));
#1103=VECTOR('',#1300,1.0);
#1104=CARTESIAN_POINT('',(10.0,92.0,0.0));
#1105=VECTOR('',#1301,1.0);
#1106=CARTESIAN_POINT('',(20.0,114.0,108.0));
#1107=CARTESIAN_POINT('',(10.0,114.0,108.0));
#1108=VECTOR('',#1302,1.0);
#1109=CARTESIAN_POINT('',(20.0,114.0,22.0));
#1110=CARTESIAN_POINT('',(20.0,114.0,-1.447539913365E-14));
#1111=VECTOR('',#1303,1.0);
#1112=CARTESIAN_POINT('',(10.0,114.0,22.0));
#1113=VECTOR('',#1304,1.0);
#1114=CARTESIAN_POINT('',(20.0,22.0,130.0));
#1115=CARTESIAN_POINT('',(10.0,22.0,130.0));
#1116=VECTOR('',#1305,1.0);
#1117=CARTESIAN_POINT('',(19.9999999999616,52.0,130.0));
#1118=CARTESIAN_POINT('',(20.0,57.0,130.0));
#1119=VECTOR('',#1306,1.0);
#1120=CARTESIAN_POINT('',(19.9999999999616,85.5,130.0));
#1121=VECTOR('',#1307,1.0);
#1122=CARTESIAN_POINT('',(20.0,92.0,130.0));
#1123=CARTESIAN_POINT('',(20.0,57.0,130.0));
#1124=VECTOR('',#1308,1.0);
#1125=CARTESIAN_POINT('',(10.0,92.0,130.0));
#1126=VECTOR('',#1309,1.0);
#1127=CARTESIAN_POINT('',(20.0,0.0,22.0));
#1128=CARTESIAN_POINT('',(20.0,0.0,108.0));
#1129=CARTESIAN_POINT('',(20.0,0.0,65.0));
#1130=VECTOR('',#1310,1.0);
#1131=CARTESIAN_POINT('',(10.0,0.0,108.0));
#1132=VECTOR('',#1311,1.0);
#1133=CARTESIAN_POINT('',(10.0,0.0,22.0));
#1134=VECTOR('',#1312,1.0);
#1135=CARTESIAN_POINT('',(75.609756097546,52.0,85.512195121961));
#1136=VECTOR('',#1313,1.0);
#1137=CARTESIAN_POINT('',(20.0,32.0,108.0));
#1138=CARTESIAN_POINT('',(9.33999999968,32.0,108.0));
#1139=VECTOR('',#1314,1.0);
#1140=CARTESIAN_POINT('',(20.0,12.0,108.0));
#1141=AXIS2_PLACEMENT_3D('',#1315,#1316,#1317);
#1142=CARTESIAN_POINT('',(9.33999999968,12.0,108.0));
#1143=VECTOR('',#1318,1.0);
#1144=AXIS2_PLACEMENT_3D('',#1319,#1320,#1321);
#1145=CARTESIAN_POINT('',(20.0,102.0,108.0));
#1146=CARTESIAN_POINT('',(9.33999999968,102.0,108.0));
#1147=VECTOR('',#1322,1.0);
#1148=CARTESIAN_POINT('',(20.0,82.0,108.0));
#1149=AXIS2_PLACEMENT_3D('',#1323,#1324,#1325);
#1150=CARTESIAN_POINT('',(9.33999999968,82.0,108.0));
#1151=VECTOR('',#1326,1.0);
#1152=AXIS2_PLACEMENT_3D('',#1327,#1328,#1329);
#1153=AXIS2_PLACEMENT_3D('',#1330,#1331,#1332);
#1154=AXIS2_PLACEMENT_3D('',#1333,#1334,#1335);
#1155=AXIS2_PLACEMENT_3D('',#1336,#1337,#1338);
#1156=AXIS2_PLACEMENT_3D('',#1339,#1340,#1341);
#1157=CARTESIAN_POINT('',(20.0,52.0,0.0));
#1158=VECTOR('',#1342,1.0);
#1159=CARTESIAN_POINT('',(194.0,57.0,18.0));
#1160=CARTESIAN_POINT('',(174.0,57.0,18.0));
#1161=AXIS2_PLACEMENT_3D('',#1343,#1344,#1345);
#1162=CARTESIAN_POINT('',(174.0,57.0,18.339999999));
#1163=VECTOR('',#1346,1.0);
#1164=CARTESIAN_POINT('',(194.0,57.0,18.339999999));
#1165=VECTOR('',#1347,1.0);
#1166=AXIS2_PLACEMENT_3D('',#1348,#1349,#1350);
#1167=CARTESIAN_POINT('',(20.0,94.0,18.0));
#1168=CARTESIAN_POINT('',(20.0,94.0,9.0));
#1169=VECTOR('',#1351,1.0);
#1170=CARTESIAN_POINT('',(20.0,20.0,18.0));
#1171=CARTESIAN_POINT('',(20.0,0.0,18.0));
#1172=VECTOR('',#1352,1.0);
#1173=CARTESIAN_POINT('',(20.0,20.0,9.0));
#1174=VECTOR('',#1353,1.0);
#1175=CARTESIAN_POINT('',(110.0,20.0,18.0));
#1176=CARTESIAN_POINT('',(55.0,20.0,18.0));
#1177=VECTOR('',#1354,1.0);
#1178=CARTESIAN_POINT('',(110.0,20.0,18.0));
#1179=VECTOR('',#1355,1.0);
#1180=CARTESIAN_POINT('',(188.354676469805,37.4798362495556,18.0));
#1181=CARTESIAN_POINT('',(55.4823410397719,7.83787012762234,18.0));
#1182=VECTOR('',#1356,1.0);
#1183=CARTESIAN_POINT('',(188.354676469805,37.4798362495556,28.0));
#1184=VECTOR('',#1357,1.0);
#1185=CARTESIAN_POINT('',(188.354676469801,76.5201637504239,18.0));
#1186=AXIS2_PLACEMENT_3D('',#1358,#1359,#1360);
#1187=CARTESIAN_POINT('',(188.354676469805,76.5201637504444,28.0));
#1188=VECTOR('',#1361,1.0);
#1189=CARTESIAN_POINT('',(110.0,94.0,18.0));
#1190=CARTESIAN_POINT('',(67.5954107220867,103.459872852557,18.0));
#1191=VECTOR('',#1362,1.0);
#1192=CARTESIAN_POINT('',(110.0,94.0,18.0));
#1193=VECTOR('',#1363,1.0);
#1194=CARTESIAN_POINT('',(10.0,94.0,18.0));
#1195=VECTOR('',#1364,1.0);
#1196=DIRECTION('',(1.0,0.0,0.0));
#1197=CARTESIAN_POINT('',(146.0,57.0,60.0));
#1198=DIRECTION('',(-1.0,0.0,0.0));
#1199=DIRECTION('',(0.0,1.0,0.0));
#1200=DIRECTION('',(-1.0,-0.0,-0.0));
#1201=CARTESIAN_POINT('',(146.0,57.0,60.0));
#1202=DIRECTION('',(-1.0,0.0,0.0));
#1203=DIRECTION('',(0.0,1.0,0.0));
#1204=DIRECTION('',(-1.0,0.0,0.0));
#1205=DIRECTION('',(-0.0,0.0,1.0));
#1206=DIRECTION('',(-1.0,0.0,-0.0));
#1207=DIRECTION('',(0.0,-0.0,1.0));
#1208=CARTESIAN_POINT('',(146.0,57.0,60.0));
#1209=DIRECTION('',(-1.0,0.0,-0.0));
#1210=DIRECTION('',(0.0,1.0,-1.62321328254E-14));
#1211=DIRECTION('',(-1.0,0.0,-0.0));
#1212=CARTESIAN_POINT('',(0.0,92.0,108.0));
#1213=DIRECTION('',(1.0,0.0,0.0));
#1214=DIRECTION('',(0.0,1.0,-1.83690953073E-16));
#1215=DIRECTION('',(0.0,0.0,1.0));
#1216=CARTESIAN_POINT('',(0.0,92.0,22.0));
#1217=DIRECTION('',(1.0,0.0,0.0));
#1218=DIRECTION('',(0.0,-1.83690953073E-16,-1.0));
#1219=DIRECTION('',(-0.0,1.0,0.0));
#1220=CARTESIAN_POINT('',(0.0,22.0,22.0));
#1221=DIRECTION('',(1.0,0.0,0.0));
#1222=DIRECTION('',(0.0,-1.0,1.83690953073E-16));
#1223=DIRECTION('',(0.0,0.0,-1.0));
#1224=CARTESIAN_POINT('',(0.0,22.0,108.0));
#1225=DIRECTION('',(1.0,0.0,0.0));
#1226=DIRECTION('',(-0.0,1.83690953073E-16,1.0));
#1227=DIRECTION('',(0.0,-1.0,0.0));
#1228=CARTESIAN_POINT('',(0.0,92.0,108.0));
#1229=DIRECTION('',(1.0,0.0,0.0));
#1230=DIRECTION('',(-0.0,1.0,0.0));
#1231=CARTESIAN_POINT('',(0.0,92.0,108.0));
#1232=DIRECTION('',(1.0,0.0,0.0));
#1233=DIRECTION('',(-0.0,1.0,0.0));
#1234=CARTESIAN_POINT('',(0.0,22.0,108.0));
#1235=DIRECTION('',(1.0,0.0,0.0));
#1236=DIRECTION('',(-0.0,1.0,0.0));
#1237=CARTESIAN_POINT('',(0.0,22.0,108.0));
#1238=DIRECTION('',(1.0,0.0,0.0));
#1239=DIRECTION('',(-0.0,1.0,0.0));
#1240=DIRECTION('',(0.0,-1.0,0.0));
#1241=DIRECTION('',(0.0,0.0,1.0));
#1242=CARTESIAN_POINT('',(110.0,57.0,38.0));
#1243=DIRECTION('',(0.0,0.0,1.0));
#1244=DIRECTION('',(1.0,0.0,-0.0));
#1245=CARTESIAN_POINT('',(110.0,57.0,38.0));
#1246=DIRECTION('',(0.0,0.0,1.0));
#1247=DIRECTION('',(1.0,0.0,-0.0));
#1248=DIRECTION('',(0.0,0.0,1.0));
#1249=CARTESIAN_POINT('',(110.0,57.0,82.0));
#1250=DIRECTION('',(0.0,0.0,-1.0));
#1251=DIRECTION('',(1.0,0.0,0.0));
#1252=DIRECTION('',(-0.0,-0.0,-1.0));
#1253=DIRECTION('',(0.0,0.0,1.0));
#1254=CARTESIAN_POINT('',(110.0,57.0,82.0));
#1255=DIRECTION('',(0.0,0.0,-1.0));
#1256=DIRECTION('',(1.0,0.0,0.0));
#1257=CARTESIAN_POINT('',(110.0,57.0,82.0));
#1258=DIRECTION('',(0.0,0.0,1.0));
#1259=DIRECTION('',(1.0,0.0,-0.0));
#1260=CARTESIAN_POINT('',(110.0,57.0,82.0));
#1261=DIRECTION('',(0.0,0.0,1.0));
#1262=DIRECTION('',(1.0,0.0,-0.0));
#1263=DIRECTION('',(1.0,0.0,0.0));
#1264=DIRECTION('',(-0.0,0.0,-1.0));
#1265=CARTESIAN_POINT('',(110.0,57.0,38.0));
#1266=DIRECTION('',(0.0,0.0,-1.0));
#1267=DIRECTION('',(1.0,0.0,0.0));
#1268=DIRECTION('',(0.0,0.0,-1.0));
#1269=CARTESIAN_POINT('',(110.0,57.0,58.0000000000154));
#1270=DIRECTION('',(-0.62469504755418,-0.0,-0.780868809443226));
#1271=DIRECTION('',(0.780868809443225,0.0,-0.62469504755418));
#1272=DIRECTION('',(-0.0,-0.0,-1.0));
#1273=CARTESIAN_POINT('',(110.0,57.0,58.0000000000154));
#1274=DIRECTION('',(-0.62469504755418,-0.0,-0.780868809443226));
#1275=DIRECTION('',(0.780868809443225,0.0,-0.62469504755418));
#1276=DIRECTION('',(0.0,0.0,-1.0));
#1277=CARTESIAN_POINT('',(110.0,57.0,38.0));
#1278=DIRECTION('',(0.0,0.0,-1.0));
#1279=DIRECTION('',(1.0,0.0,0.0));
#1280=DIRECTION('',(-1.0,0.0,0.0));
#1281=DIRECTION('',(0.0,1.0,0.0));
#1282=DIRECTION('',(-1.0,0.0,0.0));
#1283=DIRECTION('',(0.976008187521194,0.217733823490043,-0.0));
#1284=CARTESIAN_POINT('',(184.0,57.0,38.0));
#1285=DIRECTION('',(0.0,0.0,1.0));
#1286=DIRECTION('',(0.217733823490043,-0.976008187521194,0.0));
#1287=DIRECTION('',(0.976008187521194,-0.217733823490043,0.0));
#1288=DIRECTION('',(1.0,0.0,-0.0));
#1289=DIRECTION('',(0.0,1.0,0.0));
#1290=DIRECTION('',(-1.0,0.0,0.0));
#1291=CARTESIAN_POINT('',(184.0,57.0,38.0));
#1292=DIRECTION('',(0.0,0.0,1.0));
#1293=DIRECTION('',(1.0,0.0,-0.0));
#1294=CARTESIAN_POINT('',(184.0,57.0,38.0));
#1295=DIRECTION('',(0.0,0.0,1.0));
#1296=DIRECTION('',(1.0,0.0,-0.0));
#1297=DIRECTION('',(0.780868809443225,0.0,-0.62469504755418));
#1298=DIRECTION('',(0.0,0.0,-1.0));
#1299=DIRECTION('',(0.0,-1.0,0.0));
#1300=DIRECTION('',(-1.0,-0.0,0.0));
#1301=DIRECTION('',(-1.0,0.0,0.0));
#1302=DIRECTION('',(-1.0,0.0,-0.0));
#1303=DIRECTION('',(0.0,0.0,-1.0));
#1304=DIRECTION('',(-1.0,0.0,-0.0));
#1305=DIRECTION('',(-1.0,-0.0,0.0));
#1306=DIRECTION('',(0.0,1.0,0.0));
#1307=DIRECTION('',(0.0,1.0,0.0));
#1308=DIRECTION('',(0.0,1.0,0.0));
#1309=DIRECTION('',(-1.0,0.0,-0.0));
#1310=DIRECTION('',(-0.0,0.0,1.0));
#1311=DIRECTION('',(-1.0,0.0,0.0));
#1312=DIRECTION('',(-1.0,0.0,0.0));
#1313=DIRECTION('',(-0.780868809443225,0.0,0.62469504755418));
#1314=DIRECTION('',(1.0,0.0,0.0));
#1315=CARTESIAN_POINT('',(20.0,22.0,108.0));
#1316=DIRECTION('',(-1.0,0.0,0.0));
#1317=DIRECTION('',(0.0,1.0,0.0));
#1318=DIRECTION('',(-1.0,-0.0,-0.0));
#1319=CARTESIAN_POINT('',(20.0,22.0,108.0));
#1320=DIRECTION('',(-1.0,0.0,0.0));
#1321=DIRECTION('',(0.0,1.0,0.0));
#1322=DIRECTION('',(1.0,0.0,0.0));
#1323=CARTESIAN_POINT('',(20.0,92.0,108.0));
#1324=DIRECTION('',(-1.0,0.0,0.0));
#1325=DIRECTION('',(0.0,1.0,0.0));
#1326=DIRECTION('',(-1.0,-0.0,-0.0));
#1327=CARTESIAN_POINT('',(20.0,92.0,108.0));
#1328=DIRECTION('',(-1.0,0.0,0.0));
#1329=DIRECTION('',(0.0,1.0,0.0));
#1330=CARTESIAN_POINT('',(20.0,22.0,22.0));
#1331=DIRECTION('',(-1.0,0.0,0.0));
#1332=DIRECTION('',(0.0,-1.0,1.83690953073E-16));
#1333=CARTESIAN_POINT('',(20.0,22.0,108.0));
#1334=DIRECTION('',(-1.0,0.0,0.0));
#1335=DIRECTION('',(0.0,1.83690953073E-16,1.0));
#1336=CARTESIAN_POINT('',(20.0,92.0,108.0));
#1337=DIRECTION('',(-1.0,0.0,-0.0));
#1338=DIRECTION('',(0.0,1.0,-1.83690953073E-16));
#1339=CARTESIAN_POINT('',(20.0,92.0,22.0));
#1340=DIRECTION('',(-1.0,-0.0,0.0));
#1341=DIRECTION('',(0.0,-1.83690953073E-16,-1.0));
#1342=DIRECTION('',(0.0,0.0,-1.0));
#1343=CARTESIAN_POINT('',(184.0,57.0,18.0));
#1344=DIRECTION('',(0.0,0.0,-1.0));
#1345=DIRECTION('',(1.0,0.0,0.0));
#1346=DIRECTION('',(0.0,0.0,1.0));
#1347=DIRECTION('',(-0.0,-0.0,-1.0));
#1348=CARTESIAN_POINT('',(184.0,57.0,18.0));
#1349=DIRECTION('',(0.0,0.0,-1.0));
#1350=DIRECTION('',(1.0,0.0,0.0));
#1351=DIRECTION('',(0.0,0.0,-1.0));
#1352=DIRECTION('',(0.0,-1.0,0.0));
#1353=DIRECTION('',(0.0,0.0,1.0));
#1354=DIRECTION('',(1.0,0.0,0.0));
#1355=DIRECTION('',(0.0,0.0,-1.0));
#1356=DIRECTION('',(-0.976008187521194,-0.217733823490043,0.0));
#1357=DIRECTION('',(0.0,0.0,-1.0));
#1358=CARTESIAN_POINT('',(184.0,57.0,18.0));
#1359=DIRECTION('',(0.0,-0.0,-1.0));
#1360=DIRECTION('',(0.217733823490043,-0.976008187521194,0.0));
#1361=DIRECTION('',(0.0,-0.0,-1.0));
#1362=DIRECTION('',(-0.976008187521194,0.217733823490043,0.0));
#1363=DIRECTION('',(0.0,0.0,1.0));
#1364=DIRECTION('',(-1.0,0.0,0.0));
ENDSEC;
END-ISO-10303-21;
