ISO-10303-21;
HEADER;
FILE_DESCRIPTION(('STEP AP214'),'1');
FILE_NAME('S47.step','2020-02-11T05:01:14',('Cubit 15.2'),(' '),'Spatial InterOp 3D',' ',' ');
FILE_SCHEMA(('automotive_design'));
ENDSEC;
DATA;
#1=PRODUCT_DEFINITION_CONTEXT('',#9,'design');
#2=APPLICATION_PROTOCOL_DEFINITION('INTERNATIONAL STANDARD','automotive_design',1994,#9);
#3=PRODUCT_CATEGORY_RELATIONSHIP('NONE','NONE',#10,#11);
#4=SHAPE_DEFINITION_REPRESENTATION(#12,#13);
#5= (GEOMETRIC_REPRESENTATION_CONTEXT(3)GLOBAL_UNCERTAINTY_ASSIGNED_CONTEXT((#16))GLOBAL_UNIT_ASSIGNED_CONTEXT((#18,#19,#20))REPRESENTATION_CONTEXT('NONE','WORKSPACE'));
#9=APPLICATION_CONTEXT(' ');
#10=PRODUCT_CATEGORY('part','NONE');
#11=PRODUCT_RELATED_PRODUCT_CATEGORY('detail',' ',(#22));
#12=PRODUCT_DEFINITION_SHAPE('NONE','NONE',#23);
#13=ADVANCED_BREP_SHAPE_REPRESENTATION('1',(#24,#25),#5);
#16=UNCERTAINTY_MEASURE_WITH_UNIT(LENGTH_MEASURE(1.0E-06),#18,'','');
#18= (CONVERSION_BASED_UNIT('MILLIMETRE',#28)LENGTH_UNIT()NAMED_UNIT(#31));
#19= (NAMED_UNIT(#33)PLANE_ANGLE_UNIT()SI_UNIT($,.RADIAN.));
#20= (NAMED_UNIT(#33)SOLID_ANGLE_UNIT()SI_UNIT($,.STERADIAN.));
#22=PRODUCT('1','1','PART-1-DESC',(#39));
#23=PRODUCT_DEFINITION('NONE','NONE',#40,#1);
#24=MANIFOLD_SOLID_BREP('1',#41);
#25=AXIS2_PLACEMENT_3D('',#42,#43,#44);
#28=LENGTH_MEASURE_WITH_UNIT(LENGTH_MEASURE(1.0),#45);
#31=DIMENSIONAL_EXPONENTS(1.0,0.0,0.0,0.0,0.0,0.0,0.0);
#33=DIMENSIONAL_EXPONENTS(0.0,0.0,0.0,0.0,0.0,0.0,0.0);
#39=PRODUCT_CONTEXT('',#9,'mechanical');
#40=PRODUCT_DEFINITION_FORMATION_WITH_SPECIFIED_SOURCE(' ','NONE',#22,.NOT_KNOWN.);
#41=CLOSED_SHELL('',(#46,#47,#48,#49,#50,#51,#52,#53,#54,#55,#56,#57,#58,#59,#60,#61,#62,#63));
#42=CARTESIAN_POINT('',(0.0,0.0,0.0));
#43=DIRECTION('',(0.0,0.0,1.0));
#44=DIRECTION('',(1.0,0.0,0.0));
#45= (NAMED_UNIT(#31)LENGTH_UNIT()SI_UNIT(.MILLI.,.METRE.));
#46=ADVANCED_FACE('',(#65),#66,.F.);
#47=ADVANCED_FACE('',(#67),#68,.T.);
#48=ADVANCED_FACE('',(#69),#70,.F.);
#49=ADVANCED_FACE('',(#71),#72,.F.);
#50=ADVANCED_FACE('',(#73),#74,.F.);
#51=ADVANCED_FACE('',(#75),#76,.F.);
#52=ADVANCED_FACE('',(#77),#78,.T.);
#53=ADVANCED_FACE('',(#79),#80,.T.);
#54=ADVANCED_FACE('',(#81),#82,.T.);
#55=ADVANCED_FACE('',(#83),#84,.T.);
#56=ADVANCED_FACE('',(#85),#86,.T.);
#57=ADVANCED_FACE('',(#87),#88,.F.);
#58=ADVANCED_FACE('',(#89),#90,.T.);
#59=ADVANCED_FACE('',(#91),#92,.T.);
#60=ADVANCED_FACE('',(#93),#94,.T.);
#61=ADVANCED_FACE('',(#95),#96,.T.);
#62=ADVANCED_FACE('',(#97),#98,.T.);
#63=ADVANCED_FACE('',(#99),#100,.T.);
#65=FACE_OUTER_BOUND('',#101,.T.);
#66=PLANE('',#102);
#67=FACE_OUTER_BOUND('',#103,.T.);
#68=PLANE('',#104);
#69=FACE_OUTER_BOUND('',#105,.T.);
#70=PLANE('',#106);
#71=FACE_OUTER_BOUND('',#107,.T.);
#72=PLANE('',#108);
#73=FACE_OUTER_BOUND('',#109,.T.);
#74=PLANE('',#110);
#75=FACE_OUTER_BOUND('',#111,.T.);
#76=PLANE('',#112);
#77=FACE_OUTER_BOUND('',#113,.T.);
#78=PLANE('',#114);
#79=FACE_OUTER_BOUND('',#115,.T.);
#80=PLANE('',#116);
#81=FACE_OUTER_BOUND('',#117,.T.);
#82=SPHERICAL_SURFACE('',#118,5.0);
#83=FACE_OUTER_BOUND('',#119,.T.);
#84=SPHERICAL_SURFACE('',#120,5.0);
#85=FACE_OUTER_BOUND('',#121,.T.);
#86=SPHERICAL_SURFACE('',#122,5.0);
#87=FACE_OUTER_BOUND('',#123,.T.);
#88=PLANE('',#124);
#89=FACE_OUTER_BOUND('',#125,.T.);
#90=PLANE('',#126);
#91=FACE_OUTER_BOUND('',#127,.T.);
#92=SPHERICAL_SURFACE('',#128,5.0);
#93=FACE_OUTER_BOUND('',#129,.T.);
#94=CYLINDRICAL_SURFACE('',#130,5.0);
#95=FACE_OUTER_BOUND('',#131,.T.);
#96=CYLINDRICAL_SURFACE('',#132,5.0);
#97=FACE_OUTER_BOUND('',#133,.T.);
#98=CYLINDRICAL_SURFACE('',#134,5.0);
#99=FACE_OUTER_BOUND('',#135,.T.);
#100=CYLINDRICAL_SURFACE('',#136,5.0);
#101=EDGE_LOOP('',(#137,#138,#139,#140));
#102=AXIS2_PLACEMENT_3D('',#141,#142,#143);
#103=EDGE_LOOP('',(#144,#145,#146,#147));
#104=AXIS2_PLACEMENT_3D('',#148,#149,#150);
#105=EDGE_LOOP('',(#151,#152,#153,#154));
#106=AXIS2_PLACEMENT_3D('',#155,#156,#157);
#107=EDGE_LOOP('',(#158,#159,#160,#161,#162,#163,#164,#165));
#108=AXIS2_PLACEMENT_3D('',#166,#167,#168);
#109=EDGE_LOOP('',(#169,#170,#171,#172,#173,#174,#175,#176,#177,#178,#179,#180));
#110=AXIS2_PLACEMENT_3D('',#181,#182,#183);
#111=EDGE_LOOP('',(#184,#185,#186,#187));
#112=AXIS2_PLACEMENT_3D('',#188,#189,#190);
#113=EDGE_LOOP('',(#191,#192,#193,#194));
#114=AXIS2_PLACEMENT_3D('',#195,#196,#197);
#115=EDGE_LOOP('',(#198,#199,#200,#201));
#116=AXIS2_PLACEMENT_3D('',#202,#203,#204);
#117=EDGE_LOOP('',(#205,#206,#207));
#118=AXIS2_PLACEMENT_3D('',#208,#209,#210);
#119=EDGE_LOOP('',(#211,#212,#213));
#120=AXIS2_PLACEMENT_3D('',#214,#215,#216);
#121=EDGE_LOOP('',(#217,#218,#219));
#122=AXIS2_PLACEMENT_3D('',#220,#221,#222);
#123=EDGE_LOOP('',(#223,#224,#225,#226));
#124=AXIS2_PLACEMENT_3D('',#227,#228,#229);
#125=EDGE_LOOP('',(#230,#231,#232,#233));
#126=AXIS2_PLACEMENT_3D('',#234,#235,#236);
#127=EDGE_LOOP('',(#237,#238,#239));
#128=AXIS2_PLACEMENT_3D('',#240,#241,#242);
#129=EDGE_LOOP('',(#243,#244,#245,#246));
#130=AXIS2_PLACEMENT_3D('',#247,#248,#249);
#131=EDGE_LOOP('',(#250,#251,#252,#253));
#132=AXIS2_PLACEMENT_3D('',#254,#255,#256);
#133=EDGE_LOOP('',(#257,#258,#259,#260));
#134=AXIS2_PLACEMENT_3D('',#261,#262,#263);
#135=EDGE_LOOP('',(#264,#265,#266,#267));
#136=AXIS2_PLACEMENT_3D('',#268,#269,#270);
#137=ORIENTED_EDGE('',*,*,#271,.T.);
#138=ORIENTED_EDGE('',*,*,#272,.F.);
#139=ORIENTED_EDGE('',*,*,#273,.F.);
#140=ORIENTED_EDGE('',*,*,#274,.T.);
#141=CARTESIAN_POINT('',(0.0,0.0,-1.0));
#142=DIRECTION('',(0.0,0.0,1.0));
#143=DIRECTION('',(1.0,0.0,0.0));
#144=ORIENTED_EDGE('',*,*,#275,.T.);
#145=ORIENTED_EDGE('',*,*,#276,.F.);
#146=ORIENTED_EDGE('',*,*,#277,.T.);
#147=ORIENTED_EDGE('',*,*,#278,.T.);
#148=CARTESIAN_POINT('',(1.0,0.0,6.12323399573676E-17));
#149=DIRECTION('',(1.0,0.0,6.12323399573676E-17));
#150=DIRECTION('',(6.12323399573676E-17,0.0,-1.0));
#151=ORIENTED_EDGE('',*,*,#279,.T.);
#152=ORIENTED_EDGE('',*,*,#280,.F.);
#153=ORIENTED_EDGE('',*,*,#281,.T.);
#154=ORIENTED_EDGE('',*,*,#282,.T.);
#155=CARTESIAN_POINT('',(-1.0,0.0,-6.12323399573676E-17));
#156=DIRECTION('',(1.0,0.0,6.12323399573676E-17));
#157=DIRECTION('',(6.12323399573676E-17,0.0,-1.0));
#158=ORIENTED_EDGE('',*,*,#283,.T.);
#159=ORIENTED_EDGE('',*,*,#284,.T.);
#160=ORIENTED_EDGE('',*,*,#285,.T.);
#161=ORIENTED_EDGE('',*,*,#286,.T.);
#162=ORIENTED_EDGE('',*,*,#287,.T.);
#163=ORIENTED_EDGE('',*,*,#288,.T.);
#164=ORIENTED_EDGE('',*,*,#289,.T.);
#165=ORIENTED_EDGE('',*,*,#290,.T.);
#166=CARTESIAN_POINT('',(0.0,3.5,0.0));
#167=DIRECTION('',(0.0,1.0,0.0));
#168=DIRECTION('',(0.0,0.0,1.0));
#169=ORIENTED_EDGE('',*,*,#291,.T.);
#170=ORIENTED_EDGE('',*,*,#274,.F.);
#171=ORIENTED_EDGE('',*,*,#292,.F.);
#172=ORIENTED_EDGE('',*,*,#293,.T.);
#173=ORIENTED_EDGE('',*,*,#282,.F.);
#174=ORIENTED_EDGE('',*,*,#294,.F.);
#175=ORIENTED_EDGE('',*,*,#295,.T.);
#176=ORIENTED_EDGE('',*,*,#296,.F.);
#177=ORIENTED_EDGE('',*,*,#297,.F.);
#178=ORIENTED_EDGE('',*,*,#298,.T.);
#179=ORIENTED_EDGE('',*,*,#278,.F.);
#180=ORIENTED_EDGE('',*,*,#299,.F.);
#181=CARTESIAN_POINT('',(0.0,10.0,0.0));
#182=DIRECTION('',(0.0,-1.0,-0.0));
#183=DIRECTION('',(-1.0,0.0,-6.12323399573676E-17));
#184=ORIENTED_EDGE('',*,*,#300,.T.);
#185=ORIENTED_EDGE('',*,*,#294,.T.);
#186=ORIENTED_EDGE('',*,*,#281,.F.);
#187=ORIENTED_EDGE('',*,*,#301,.F.);
#188=CARTESIAN_POINT('',(0.0,0.0,-1.0));
#189=DIRECTION('',(0.0,0.0,1.0));
#190=DIRECTION('',(1.0,0.0,0.0));
#191=ORIENTED_EDGE('',*,*,#302,.T.);
#192=ORIENTED_EDGE('',*,*,#303,.F.);
#193=ORIENTED_EDGE('',*,*,#304,.F.);
#194=ORIENTED_EDGE('',*,*,#296,.T.);
#195=CARTESIAN_POINT('',(0.0,0.0,1.0));
#196=DIRECTION('',(0.0,0.0,1.0));
#197=DIRECTION('',(1.0,0.0,0.0));
#198=ORIENTED_EDGE('',*,*,#305,.T.);
#199=ORIENTED_EDGE('',*,*,#299,.T.);
#200=ORIENTED_EDGE('',*,*,#277,.F.);
#201=ORIENTED_EDGE('',*,*,#306,.F.);
#202=CARTESIAN_POINT('',(0.0,0.0,1.0));
#203=DIRECTION('',(0.0,0.0,1.0));
#204=DIRECTION('',(1.0,0.0,0.0));
#205=ORIENTED_EDGE('',*,*,#306,.T.);
#206=ORIENTED_EDGE('',*,*,#276,.T.);
#207=ORIENTED_EDGE('',*,*,#284,.F.);
#208=CARTESIAN_POINT('',(0.0,3.5,0.0));
#209=DIRECTION('',(0.0,0.0,1.0));
#210=DIRECTION('',(1.0,0.0,0.0));
#211=ORIENTED_EDGE('',*,*,#303,.T.);
#212=ORIENTED_EDGE('',*,*,#286,.F.);
#213=ORIENTED_EDGE('',*,*,#307,.T.);
#214=CARTESIAN_POINT('',(0.0,3.5,0.0));
#215=DIRECTION('',(0.0,0.0,1.0));
#216=DIRECTION('',(1.0,0.0,0.0));
#217=ORIENTED_EDGE('',*,*,#301,.T.);
#218=ORIENTED_EDGE('',*,*,#280,.T.);
#219=ORIENTED_EDGE('',*,*,#288,.F.);
#220=CARTESIAN_POINT('',(0.0,3.5,0.0));
#221=DIRECTION('',(0.0,0.0,1.0));
#222=DIRECTION('',(1.0,0.0,0.0));
#223=ORIENTED_EDGE('',*,*,#308,.T.);
#224=ORIENTED_EDGE('',*,*,#297,.T.);
#225=ORIENTED_EDGE('',*,*,#304,.T.);
#226=ORIENTED_EDGE('',*,*,#307,.F.);
#227=CARTESIAN_POINT('',(-1.0,0.0,-6.12323399573676E-17));
#228=DIRECTION('',(1.0,0.0,6.12323399573676E-17));
#229=DIRECTION('',(6.12323399573676E-17,0.0,-1.0));
#230=ORIENTED_EDGE('',*,*,#309,.T.);
#231=ORIENTED_EDGE('',*,*,#292,.T.);
#232=ORIENTED_EDGE('',*,*,#273,.T.);
#233=ORIENTED_EDGE('',*,*,#310,.F.);
#234=CARTESIAN_POINT('',(1.0,0.0,6.12323399573676E-17));
#235=DIRECTION('',(1.0,0.0,6.12323399573676E-17));
#236=DIRECTION('',(6.12323399573676E-17,0.0,-1.0));
#237=ORIENTED_EDGE('',*,*,#272,.T.);
#238=ORIENTED_EDGE('',*,*,#290,.F.);
#239=ORIENTED_EDGE('',*,*,#310,.T.);
#240=CARTESIAN_POINT('',(0.0,3.5,0.0));
#241=DIRECTION('',(0.0,0.0,1.0));
#242=DIRECTION('',(1.0,0.0,0.0));
#243=ORIENTED_EDGE('',*,*,#275,.F.);
#244=ORIENTED_EDGE('',*,*,#298,.F.);
#245=ORIENTED_EDGE('',*,*,#308,.F.);
#246=ORIENTED_EDGE('',*,*,#285,.F.);
#247=CARTESIAN_POINT('',(0.0,8.0,0.0));
#248=DIRECTION('',(0.0,-1.0,6.12323399573676E-17));
#249=DIRECTION('',(1.0,0.0,0.0));
#250=ORIENTED_EDGE('',*,*,#271,.F.);
#251=ORIENTED_EDGE('',*,*,#291,.F.);
#252=ORIENTED_EDGE('',*,*,#305,.F.);
#253=ORIENTED_EDGE('',*,*,#283,.F.);
#254=CARTESIAN_POINT('',(0.0,8.0,0.0));
#255=DIRECTION('',(0.0,-1.0,6.12323399573676E-17));
#256=DIRECTION('',(1.0,0.0,0.0));
#257=ORIENTED_EDGE('',*,*,#279,.F.);
#258=ORIENTED_EDGE('',*,*,#293,.F.);
#259=ORIENTED_EDGE('',*,*,#309,.F.);
#260=ORIENTED_EDGE('',*,*,#289,.F.);
#261=CARTESIAN_POINT('',(0.0,8.0,0.0));
#262=DIRECTION('',(0.0,-1.0,6.12323399573676E-17));
#263=DIRECTION('',(1.0,0.0,0.0));
#264=ORIENTED_EDGE('',*,*,#295,.F.);
#265=ORIENTED_EDGE('',*,*,#300,.F.);
#266=ORIENTED_EDGE('',*,*,#287,.F.);
#267=ORIENTED_EDGE('',*,*,#302,.F.);
#268=CARTESIAN_POINT('',(0.0,8.0,0.0));
#269=DIRECTION('',(0.0,-1.0,6.12323399573676E-17));
#270=DIRECTION('',(1.0,0.0,0.0));
#271=EDGE_CURVE('',#311,#312,#313,.T.);
#272=EDGE_CURVE('',#314,#312,#315,.T.);
#273=EDGE_CURVE('',#316,#314,#317,.T.);
#274=EDGE_CURVE('',#316,#311,#318,.T.);
#275=EDGE_CURVE('',#319,#320,#321,.T.);
#276=EDGE_CURVE('',#322,#320,#323,.T.);
#277=EDGE_CURVE('',#322,#324,#325,.T.);
#278=EDGE_CURVE('',#324,#319,#326,.T.);
#279=EDGE_CURVE('',#327,#328,#329,.T.);
#280=EDGE_CURVE('',#330,#328,#331,.T.);
#281=EDGE_CURVE('',#330,#332,#333,.T.);
#282=EDGE_CURVE('',#332,#327,#334,.T.);
#283=EDGE_CURVE('',#312,#335,#336,.T.);
#284=EDGE_CURVE('',#335,#320,#337,.T.);
#285=EDGE_CURVE('',#320,#338,#339,.T.);
#286=EDGE_CURVE('',#338,#340,#341,.T.);
#287=EDGE_CURVE('',#340,#342,#343,.T.);
#288=EDGE_CURVE('',#342,#328,#344,.T.);
#289=EDGE_CURVE('',#328,#345,#346,.T.);
#290=EDGE_CURVE('',#345,#312,#347,.T.);
#291=EDGE_CURVE('',#348,#311,#349,.T.);
#292=EDGE_CURVE('',#350,#316,#351,.T.);
#293=EDGE_CURVE('',#350,#327,#352,.T.);
#294=EDGE_CURVE('',#353,#332,#354,.T.);
#295=EDGE_CURVE('',#353,#355,#356,.T.);
#296=EDGE_CURVE('',#357,#355,#358,.T.);
#297=EDGE_CURVE('',#359,#357,#360,.T.);
#298=EDGE_CURVE('',#359,#319,#361,.T.);
#299=EDGE_CURVE('',#348,#324,#362,.T.);
#300=EDGE_CURVE('',#342,#353,#363,.T.);
#301=EDGE_CURVE('',#342,#330,#364,.T.);
#302=EDGE_CURVE('',#355,#340,#365,.T.);
#303=EDGE_CURVE('',#366,#340,#367,.T.);
#304=EDGE_CURVE('',#357,#366,#368,.T.);
#305=EDGE_CURVE('',#335,#348,#369,.T.);
#306=EDGE_CURVE('',#335,#322,#370,.T.);
#307=EDGE_CURVE('',#338,#366,#371,.T.);
#308=EDGE_CURVE('',#338,#359,#372,.T.);
#309=EDGE_CURVE('',#345,#350,#373,.T.);
#310=EDGE_CURVE('',#345,#314,#374,.T.);
#311=VERTEX_POINT('',#375);
#312=VERTEX_POINT('',#376);
#313=LINE('',#377,#378);
#314=VERTEX_POINT('',#379);
#315=CIRCLE('',#380,4.89897948556636);
#316=VERTEX_POINT('',#381);
#317=LINE('',#382,#383);
#318=LINE('',#384,#385);
#319=VERTEX_POINT('',#386);
#320=VERTEX_POINT('',#387);
#321=LINE('',#388,#389);
#322=VERTEX_POINT('',#390);
#323=CIRCLE('',#391,4.89897948556636);
#324=VERTEX_POINT('',#392);
#325=LINE('',#393,#394);
#326=LINE('',#395,#396);
#327=VERTEX_POINT('',#397);
#328=VERTEX_POINT('',#398);
#329=LINE('',#399,#400);
#330=VERTEX_POINT('',#401);
#331=CIRCLE('',#402,4.89897948556636);
#332=VERTEX_POINT('',#403);
#333=LINE('',#404,#405);
#334=LINE('',#406,#407);
#335=VERTEX_POINT('',#408);
#336=CIRCLE('',#409,5.0);
#337=CIRCLE('',#410,5.0);
#338=VERTEX_POINT('',#411);
#339=CIRCLE('',#412,5.0);
#340=VERTEX_POINT('',#413);
#341=CIRCLE('',#414,5.0);
#342=VERTEX_POINT('',#415);
#343=CIRCLE('',#416,5.0);
#344=CIRCLE('',#417,5.0);
#345=VERTEX_POINT('',#418);
#346=CIRCLE('',#419,5.0);
#347=CIRCLE('',#420,5.0);
#348=VERTEX_POINT('',#421);
#349=CIRCLE('',#422,5.0);
#350=VERTEX_POINT('',#423);
#351=LINE('',#424,#425);
#352=CIRCLE('',#426,5.0);
#353=VERTEX_POINT('',#427);
#354=LINE('',#428,#429);
#355=VERTEX_POINT('',#430);
#356=CIRCLE('',#431,5.0);
#357=VERTEX_POINT('',#432);
#358=LINE('',#433,#434);
#359=VERTEX_POINT('',#435);
#360=LINE('',#436,#437);
#361=CIRCLE('',#438,5.0);
#362=LINE('',#439,#440);
#363=LINE('',#441,#442);
#364=CIRCLE('',#443,4.89897948556636);
#365=LINE('',#444,#445);
#366=VERTEX_POINT('',#446);
#367=CIRCLE('',#447,4.89897948556636);
#368=LINE('',#448,#449);
#369=LINE('',#450,#451);
#370=CIRCLE('',#452,4.89897948556636);
#371=CIRCLE('',#453,4.89897948556636);
#372=LINE('',#454,#455);
#373=LINE('',#456,#457);
#374=CIRCLE('',#458,4.89897948556636);
#375=CARTESIAN_POINT('',(4.89897948556636,10.0,-1.0));
#376=CARTESIAN_POINT('',(4.89897948556636,3.5,-1.0));
#377=CARTESIAN_POINT('',(4.89897948556636,6.75,-1.0));
#378=VECTOR('',#459,1.0);
#379=CARTESIAN_POINT('',(1.0,8.29583152331272,-1.0));
#380=AXIS2_PLACEMENT_3D('',#460,#461,#462);
#381=CARTESIAN_POINT('',(1.0,10.0,-1.0));
#382=CARTESIAN_POINT('',(1.0,0.0,-1.0));
#383=VECTOR('',#463,1.0);
#384=CARTESIAN_POINT('',(0.0,10.0,-1.0));
#385=VECTOR('',#464,1.0);
#386=CARTESIAN_POINT('',(1.0,10.0,4.89897948556636));
#387=CARTESIAN_POINT('',(1.0,3.5,4.89897948556636));
#388=CARTESIAN_POINT('',(1.0,6.75,4.89897948556636));
#389=VECTOR('',#465,1.0);
#390=CARTESIAN_POINT('',(1.0,8.29583152331272,1.0));
#391=AXIS2_PLACEMENT_3D('',#466,#467,#468);
#392=CARTESIAN_POINT('',(1.0,10.0,1.0));
#393=CARTESIAN_POINT('',(1.0,0.0,1.0));
#394=VECTOR('',#469,1.0);
#395=CARTESIAN_POINT('',(1.0,10.0,6.12323399573676E-17));
#396=VECTOR('',#470,1.0);
#397=CARTESIAN_POINT('',(-1.0,10.0,-4.89897948556636));
#398=CARTESIAN_POINT('',(-1.0,3.5,-4.89897948556636));
#399=CARTESIAN_POINT('',(-1.0,6.75,-4.89897948556636));
#400=VECTOR('',#471,1.0);
#401=CARTESIAN_POINT('',(-1.0,8.29583152331272,-1.0));
#402=AXIS2_PLACEMENT_3D('',#472,#473,#474);
#403=CARTESIAN_POINT('',(-1.0,10.0,-1.0));
#404=CARTESIAN_POINT('',(-1.0,0.0,-1.0));
#405=VECTOR('',#475,1.0);
#406=CARTESIAN_POINT('',(-1.0,10.0,-6.12323399573676E-17));
#407=VECTOR('',#476,1.0);
#408=CARTESIAN_POINT('',(4.89897948556636,3.5,1.0));
#409=AXIS2_PLACEMENT_3D('',#477,#478,#479);
#410=AXIS2_PLACEMENT_3D('',#480,#481,#482);
#411=CARTESIAN_POINT('',(-1.0,3.5,4.89897948556636));
#412=AXIS2_PLACEMENT_3D('',#483,#484,#485);
#413=CARTESIAN_POINT('',(-4.89897948556636,3.5,1.0));
#414=AXIS2_PLACEMENT_3D('',#486,#487,#488);
#415=CARTESIAN_POINT('',(-4.89897948556636,3.5,-1.0));
#416=AXIS2_PLACEMENT_3D('',#489,#490,#491);
#417=AXIS2_PLACEMENT_3D('',#492,#493,#494);
#418=CARTESIAN_POINT('',(1.0,3.5,-4.89897948556636));
#419=AXIS2_PLACEMENT_3D('',#495,#496,#497);
#420=AXIS2_PLACEMENT_3D('',#498,#499,#500);
#421=CARTESIAN_POINT('',(4.89897948556636,10.0,1.0));
#422=AXIS2_PLACEMENT_3D('',#501,#502,#503);
#423=CARTESIAN_POINT('',(1.0,10.0,-4.89897948556636));
#424=CARTESIAN_POINT('',(1.0,10.0,6.12323399573676E-17));
#425=VECTOR('',#504,1.0);
#426=AXIS2_PLACEMENT_3D('',#505,#506,#507);
#427=CARTESIAN_POINT('',(-4.89897948556636,10.0,-1.0));
#428=CARTESIAN_POINT('',(0.0,10.0,-1.0));
#429=VECTOR('',#508,1.0);
#430=CARTESIAN_POINT('',(-4.89897948556636,10.0,1.0));
#431=AXIS2_PLACEMENT_3D('',#509,#510,#511);
#432=CARTESIAN_POINT('',(-1.0,10.0,1.0));
#433=CARTESIAN_POINT('',(0.0,10.0,1.0));
#434=VECTOR('',#512,1.0);
#435=CARTESIAN_POINT('',(-1.0,10.0,4.89897948556636));
#436=CARTESIAN_POINT('',(-1.0,10.0,-6.12323399573676E-17));
#437=VECTOR('',#513,1.0);
#438=AXIS2_PLACEMENT_3D('',#514,#515,#516);
#439=CARTESIAN_POINT('',(0.0,10.0,1.0));
#440=VECTOR('',#517,1.0);
#441=CARTESIAN_POINT('',(-4.89897948556636,6.75,-1.0));
#442=VECTOR('',#518,1.0);
#443=AXIS2_PLACEMENT_3D('',#519,#520,#521);
#444=CARTESIAN_POINT('',(-4.89897948556636,6.75,1.0));
#445=VECTOR('',#522,1.0);
#446=CARTESIAN_POINT('',(-1.0,8.29583152331272,1.0));
#447=AXIS2_PLACEMENT_3D('',#523,#524,#525);
#448=CARTESIAN_POINT('',(-1.0,0.0,1.0));
#449=VECTOR('',#526,1.0);
#450=CARTESIAN_POINT('',(4.89897948556636,6.75,1.0));
#451=VECTOR('',#527,1.0);
#452=AXIS2_PLACEMENT_3D('',#528,#529,#530);
#453=AXIS2_PLACEMENT_3D('',#531,#532,#533);
#454=CARTESIAN_POINT('',(-1.0,6.75,4.89897948556636));
#455=VECTOR('',#534,1.0);
#456=CARTESIAN_POINT('',(1.0,6.75,-4.89897948556636));
#457=VECTOR('',#535,1.0);
#458=AXIS2_PLACEMENT_3D('',#536,#537,#538);
#459=DIRECTION('',(0.0,-1.0,6.12323399573676E-17));
#460=CARTESIAN_POINT('',(0.0,3.5,-1.0));
#461=DIRECTION('',(-0.0,-0.0,-1.0));
#462=DIRECTION('',(0.0,-1.0,0.0));
#463=DIRECTION('',(0.0,-1.0,0.0));
#464=DIRECTION('',(1.0,0.0,0.0));
#465=DIRECTION('',(0.0,-1.0,6.12323399573676E-17));
#466=CARTESIAN_POINT('',(1.0,3.5,6.12323399573676E-17));
#467=DIRECTION('',(1.0,0.0,6.12323399573676E-17));
#468=DIRECTION('',(-6.12323399573676E-17,0.0,1.0));
#469=DIRECTION('',(0.0,1.0,0.0));
#470=DIRECTION('',(-6.12323399573676E-17,0.0,1.0));
#471=DIRECTION('',(0.0,-1.0,6.12323399573676E-17));
#472=CARTESIAN_POINT('',(-1.0,3.5,-6.12323399573676E-17));
#473=DIRECTION('',(-1.0,-0.0,-6.12323399573676E-17));
#474=DIRECTION('',(6.12323399573676E-17,0.0,-1.0));
#475=DIRECTION('',(0.0,1.0,0.0));
#476=DIRECTION('',(6.12323399573676E-17,0.0,-1.0));
#477=CARTESIAN_POINT('',(0.0,3.5,2.75545529808154E-16));
#478=DIRECTION('',(0.0,-1.0,0.0));
#479=DIRECTION('',(1.0,0.0,0.0));
#480=CARTESIAN_POINT('',(0.0,3.5,2.75545529808154E-16));
#481=DIRECTION('',(0.0,-1.0,0.0));
#482=DIRECTION('',(1.0,0.0,0.0));
#483=CARTESIAN_POINT('',(0.0,3.5,2.75545529808154E-16));
#484=DIRECTION('',(0.0,-1.0,0.0));
#485=DIRECTION('',(1.0,0.0,0.0));
#486=CARTESIAN_POINT('',(0.0,3.5,2.75545529808154E-16));
#487=DIRECTION('',(0.0,-1.0,0.0));
#488=DIRECTION('',(1.0,0.0,0.0));
#489=CARTESIAN_POINT('',(0.0,3.5,2.75545529808154E-16));
#490=DIRECTION('',(0.0,-1.0,0.0));
#491=DIRECTION('',(1.0,0.0,0.0));
#492=CARTESIAN_POINT('',(0.0,3.5,2.75545529808154E-16));
#493=DIRECTION('',(0.0,-1.0,0.0));
#494=DIRECTION('',(1.0,0.0,0.0));
#495=CARTESIAN_POINT('',(0.0,3.5,2.75545529808154E-16));
#496=DIRECTION('',(0.0,-1.0,0.0));
#497=DIRECTION('',(1.0,0.0,0.0));
#498=CARTESIAN_POINT('',(0.0,3.5,2.75545529808154E-16));
#499=DIRECTION('',(0.0,-1.0,0.0));
#500=DIRECTION('',(1.0,0.0,0.0));
#501=CARTESIAN_POINT('',(0.0,10.0,-1.22464679914735E-16));
#502=DIRECTION('',(-0.0,1.0,0.0));
#503=DIRECTION('',(1.0,0.0,0.0));
#504=DIRECTION('',(-6.12323399573676E-17,0.0,1.0));
#505=CARTESIAN_POINT('',(0.0,10.0,-1.22464679914735E-16));
#506=DIRECTION('',(-0.0,1.0,0.0));
#507=DIRECTION('',(1.0,0.0,0.0));
#508=DIRECTION('',(1.0,0.0,0.0));
#509=CARTESIAN_POINT('',(0.0,10.0,-1.22464679914735E-16));
#510=DIRECTION('',(-0.0,1.0,0.0));
#511=DIRECTION('',(1.0,0.0,0.0));
#512=DIRECTION('',(-1.0,0.0,0.0));
#513=DIRECTION('',(6.12323399573676E-17,0.0,-1.0));
#514=CARTESIAN_POINT('',(0.0,10.0,-1.22464679914735E-16));
#515=DIRECTION('',(-0.0,1.0,0.0));
#516=DIRECTION('',(1.0,0.0,0.0));
#517=DIRECTION('',(-1.0,0.0,0.0));
#518=DIRECTION('',(-0.0,1.0,-6.12323399573676E-17));
#519=CARTESIAN_POINT('',(0.0,3.5,-1.0));
#520=DIRECTION('',(-0.0,-0.0,-1.0));
#521=DIRECTION('',(0.0,-1.0,0.0));
#522=DIRECTION('',(0.0,-1.0,6.12323399573676E-17));
#523=CARTESIAN_POINT('',(0.0,3.5,1.0));
#524=DIRECTION('',(0.0,-0.0,1.0));
#525=DIRECTION('',(0.0,1.0,0.0));
#526=DIRECTION('',(0.0,-1.0,0.0));
#527=DIRECTION('',(-0.0,1.0,-6.12323399573676E-17));
#528=CARTESIAN_POINT('',(0.0,3.5,1.0));
#529=DIRECTION('',(0.0,-0.0,1.0));
#530=DIRECTION('',(0.0,1.0,0.0));
#531=CARTESIAN_POINT('',(-1.0,3.5,-6.12323399573676E-17));
#532=DIRECTION('',(-1.0,-0.0,-6.12323399573676E-17));
#533=DIRECTION('',(6.12323399573676E-17,0.0,-1.0));
#534=DIRECTION('',(-0.0,1.0,-6.12323399573676E-17));
#535=DIRECTION('',(-0.0,1.0,-6.12323399573676E-17));
#536=CARTESIAN_POINT('',(1.0,3.5,6.12323399573676E-17));
#537=DIRECTION('',(1.0,0.0,6.12323399573676E-17));
#538=DIRECTION('',(-6.12323399573676E-17,0.0,1.0));
ENDSEC;
END-ISO-10303-21;
