ISO-10303-21;
HEADER;
FILE_DESCRIPTION(('STEP AP214'),'1');
FILE_NAME('B27.step','2023-05-04T15:02:00',('Mambo'),(' '),'Spatial InterOp 3D',' ',' ');
FILE_SCHEMA(('automotive_design'));
ENDSEC;
DATA;
#1=PRODUCT_DEFINITION_CONTEXT('',#9,'design');
#2=APPLICATION_PROTOCOL_DEFINITION('INTERNATIONAL STANDARD','automotive_design',1994,#9);
#3=PRODUCT_CATEGORY_RELATIONSHIP('NONE','NONE',#10,#11);
#4=SHAPE_DEFINITION_REPRESENTATION(#12,#13);
#5= (GEOMETRIC_REPRESENTATION_CONTEXT(3)GLOBAL_UNCERTAINTY_ASSIGNED_CONTEXT((#16))GLOBAL_UNIT_ASSIGNED_CONTEXT((#18,#19,#20))REPRESENTATION_CONTEXT('NONE','WORKSPACE'));
#9=APPLICATION_CONTEXT(' ');
#10=PRODUCT_CATEGORY('part','NONE');
#11=PRODUCT_RELATED_PRODUCT_CATEGORY('detail',' ',(#22));
#12=PRODUCT_DEFINITION_SHAPE('NONE','NONE',#23);
#13=ADVANCED_BREP_SHAPE_REPRESENTATION('1',(#24,#25),#5);
#16=UNCERTAINTY_MEASURE_WITH_UNIT(LENGTH_MEASURE(1.0E-06),#18,'','');
#18= (CONVERSION_BASED_UNIT('MILLIMETRE',#28)LENGTH_UNIT()NAMED_UNIT(#31));
#19= (NAMED_UNIT(#33)PLANE_ANGLE_UNIT()SI_UNIT($,.RADIAN.));
#20= (NAMED_UNIT(#33)SOLID_ANGLE_UNIT()SI_UNIT($,.STERADIAN.));
#22=PRODUCT('1','1','PART-1-DESC',(#39));
#23=PRODUCT_DEFINITION('NONE','NONE',#40,#1);
#24=MANIFOLD_SOLID_BREP('1',#41);
#25=AXIS2_PLACEMENT_3D('',#42,#43,#44);
#28=LENGTH_MEASURE_WITH_UNIT(LENGTH_MEASURE(1.0),#45);
#31=DIMENSIONAL_EXPONENTS(1.0,0.0,0.0,0.0,0.0,0.0,0.0);
#33=DIMENSIONAL_EXPONENTS(0.0,0.0,0.0,0.0,0.0,0.0,0.0);
#39=PRODUCT_CONTEXT('',#9,'mechanical');
#40=PRODUCT_DEFINITION_FORMATION_WITH_SPECIFIED_SOURCE(' ','NONE',#22,.NOT_KNOWN.);
#41=CLOSED_SHELL('',(#46,#47,#48,#49,#50,#51,#52));
#42=CARTESIAN_POINT('',(0.0,0.0,0.0));
#43=DIRECTION('',(0.0,0.0,1.0));
#44=DIRECTION('',(1.0,0.0,0.0));
#45= (NAMED_UNIT(#31)LENGTH_UNIT()SI_UNIT(.MILLI.,.METRE.));
#46=ADVANCED_FACE('',(#54),#55,.F.);
#47=ADVANCED_FACE('',(#56),#57,.F.);
#48=ADVANCED_FACE('',(#58,#59),#60,.T.);
#49=ADVANCED_FACE('',(#61),#62,.T.);
#50=ADVANCED_FACE('',(#63),#64,.F.);
#51=ADVANCED_FACE('',(#65),#66,.T.);
#52=ADVANCED_FACE('',(#67),#68,.T.);
#54=FACE_OUTER_BOUND('',#69,.T.);
#55=PLANE('',#70);
#56=FACE_OUTER_BOUND('',#71,.T.);
#57=PLANE('',#72);
#58=FACE_OUTER_BOUND('',#73,.T.);
#59=FACE_BOUND('',#74,.T.);
#60=PLANE('',#75);
#61=FACE_OUTER_BOUND('',#76,.T.);
#62=PLANE('',#77);
#63=FACE_OUTER_BOUND('',#78,.T.);
#64=PLANE('',#79);
#65=FACE_OUTER_BOUND('',#80,.T.);
#66=PLANE('',#81);
#67=FACE_OUTER_BOUND('',#82,.T.);
#68=SPHERICAL_SURFACE('',#83,0.35);
#69=EDGE_LOOP('',(#84,#85,#86,#87));
#70=AXIS2_PLACEMENT_3D('',#88,#89,#90);
#71=EDGE_LOOP('',(#91,#92,#93,#94));
#72=AXIS2_PLACEMENT_3D('',#95,#96,#97);
#73=EDGE_LOOP('',(#98,#99,#100,#101));
#74=EDGE_LOOP('',(#102));
#75=AXIS2_PLACEMENT_3D('',#103,#104,#105);
#76=EDGE_LOOP('',(#106,#107,#108,#109));
#77=AXIS2_PLACEMENT_3D('',#110,#111,#112);
#78=EDGE_LOOP('',(#113,#114,#115,#116));
#79=AXIS2_PLACEMENT_3D('',#117,#118,#119);
#80=EDGE_LOOP('',(#120,#121,#122,#123));
#81=AXIS2_PLACEMENT_3D('',#124,#125,#126);
#82=EDGE_LOOP('',(#127));
#83=AXIS2_PLACEMENT_3D('',#128,#129,#130);
#84=ORIENTED_EDGE('',*,*,#131,.T.);
#85=ORIENTED_EDGE('',*,*,#132,.F.);
#86=ORIENTED_EDGE('',*,*,#133,.F.);
#87=ORIENTED_EDGE('',*,*,#134,.T.);
#88=CARTESIAN_POINT('',(0.0,0.0,0.0));
#89=DIRECTION('',(1.0,-0.0,0.0));
#90=DIRECTION('',(0.0,1.0,-0.0));
#91=ORIENTED_EDGE('',*,*,#135,.T.);
#92=ORIENTED_EDGE('',*,*,#136,.F.);
#93=ORIENTED_EDGE('',*,*,#134,.F.);
#94=ORIENTED_EDGE('',*,*,#137,.T.);
#95=CARTESIAN_POINT('',(0.0,0.0,0.0));
#96=DIRECTION('',(-0.0,1.0,0.0));
#97=DIRECTION('',(1.0,0.0,0.0));
#98=ORIENTED_EDGE('',*,*,#131,.F.);
#99=ORIENTED_EDGE('',*,*,#136,.T.);
#100=ORIENTED_EDGE('',*,*,#138,.T.);
#101=ORIENTED_EDGE('',*,*,#139,.F.);
#102=ORIENTED_EDGE('',*,*,#140,.F.);
#103=CARTESIAN_POINT('',(0.0,0.0,0.75));
#104=DIRECTION('',(0.0,0.0,1.0));
#105=DIRECTION('',(1.0,-0.0,0.0));
#106=ORIENTED_EDGE('',*,*,#141,.F.);
#107=ORIENTED_EDGE('',*,*,#132,.T.);
#108=ORIENTED_EDGE('',*,*,#139,.T.);
#109=ORIENTED_EDGE('',*,*,#142,.F.);
#110=CARTESIAN_POINT('',(0.0,1.0,0.0));
#111=DIRECTION('',(-0.0,1.0,0.0));
#112=DIRECTION('',(1.0,0.0,0.0));
#113=ORIENTED_EDGE('',*,*,#141,.T.);
#114=ORIENTED_EDGE('',*,*,#143,.F.);
#115=ORIENTED_EDGE('',*,*,#137,.F.);
#116=ORIENTED_EDGE('',*,*,#133,.T.);
#117=CARTESIAN_POINT('',(0.0,0.0,0.0));
#118=DIRECTION('',(0.0,0.0,1.0));
#119=DIRECTION('',(1.0,-0.0,0.0));
#120=ORIENTED_EDGE('',*,*,#135,.F.);
#121=ORIENTED_EDGE('',*,*,#143,.T.);
#122=ORIENTED_EDGE('',*,*,#142,.T.);
#123=ORIENTED_EDGE('',*,*,#138,.F.);
#124=CARTESIAN_POINT('',(1.0,0.0,0.0));
#125=DIRECTION('',(1.0,-0.0,0.0));
#126=DIRECTION('',(0.0,1.0,-0.0));
#127=ORIENTED_EDGE('',*,*,#140,.T.);
#128=CARTESIAN_POINT('',(0.5,0.5,0.75));
#129=DIRECTION('',(0.0,0.0,1.0));
#130=DIRECTION('',(1.0,0.0,-0.0));
#131=EDGE_CURVE('',#144,#145,#146,.T.);
#132=EDGE_CURVE('',#147,#145,#148,.T.);
#133=EDGE_CURVE('',#149,#147,#150,.T.);
#134=EDGE_CURVE('',#149,#144,#151,.T.);
#135=EDGE_CURVE('',#152,#153,#154,.T.);
#136=EDGE_CURVE('',#144,#153,#155,.T.);
#137=EDGE_CURVE('',#149,#152,#156,.T.);
#138=EDGE_CURVE('',#153,#157,#158,.T.);
#139=EDGE_CURVE('',#145,#157,#159,.T.);
#140=EDGE_CURVE('',#160,#160,#161,.T.);
#141=EDGE_CURVE('',#147,#162,#163,.T.);
#142=EDGE_CURVE('',#162,#157,#164,.T.);
#143=EDGE_CURVE('',#152,#162,#165,.T.);
#144=VERTEX_POINT('',#166);
#145=VERTEX_POINT('',#167);
#146=LINE('',#168,#169);
#147=VERTEX_POINT('',#170);
#148=LINE('',#171,#172);
#149=VERTEX_POINT('',#173);
#150=LINE('',#174,#175);
#151=LINE('',#176,#177);
#152=VERTEX_POINT('',#178);
#153=VERTEX_POINT('',#179);
#154=LINE('',#180,#181);
#155=LINE('',#182,#183);
#156=LINE('',#184,#185);
#157=VERTEX_POINT('',#186);
#158=LINE('',#187,#188);
#159=LINE('',#189,#190);
#160=VERTEX_POINT('',#191);
#161=CIRCLE('',#192,0.35);
#162=VERTEX_POINT('',#193);
#163=LINE('',#194,#195);
#164=LINE('',#196,#197);
#165=LINE('',#198,#199);
#166=CARTESIAN_POINT('',(0.0,0.0,0.75));
#167=CARTESIAN_POINT('',(0.0,1.0,0.75));
#168=CARTESIAN_POINT('',(0.0,0.0,0.75));
#169=VECTOR('',#200,1.0);
#170=CARTESIAN_POINT('',(0.0,1.0,0.0));
#171=CARTESIAN_POINT('',(0.0,1.0,0.0));
#172=VECTOR('',#201,1.0);
#173=CARTESIAN_POINT('',(0.0,0.0,0.0));
#174=CARTESIAN_POINT('',(0.0,0.0,0.0));
#175=VECTOR('',#202,1.0);
#176=CARTESIAN_POINT('',(0.0,0.0,0.0));
#177=VECTOR('',#203,1.0);
#178=CARTESIAN_POINT('',(1.0,0.0,0.0));
#179=CARTESIAN_POINT('',(1.0,0.0,0.75));
#180=CARTESIAN_POINT('',(1.0,0.0,0.0));
#181=VECTOR('',#204,1.0);
#182=CARTESIAN_POINT('',(0.0,0.0,0.75));
#183=VECTOR('',#205,1.0);
#184=CARTESIAN_POINT('',(0.0,0.0,0.0));
#185=VECTOR('',#206,1.0);
#186=CARTESIAN_POINT('',(1.0,1.0,0.75));
#187=CARTESIAN_POINT('',(1.0,0.0,0.75));
#188=VECTOR('',#207,1.0);
#189=CARTESIAN_POINT('',(0.0,1.0,0.75));
#190=VECTOR('',#208,1.0);
#191=CARTESIAN_POINT('',(0.15,0.5,0.75));
#192=AXIS2_PLACEMENT_3D('',#209,#210,#211);
#193=CARTESIAN_POINT('',(1.0,1.0,0.0));
#194=CARTESIAN_POINT('',(0.0,1.0,0.0));
#195=VECTOR('',#212,1.0);
#196=CARTESIAN_POINT('',(1.0,1.0,0.0));
#197=VECTOR('',#213,1.0);
#198=CARTESIAN_POINT('',(1.0,0.0,0.0));
#199=VECTOR('',#214,1.0);
#200=DIRECTION('',(-0.0,1.0,0.0));
#201=DIRECTION('',(0.0,0.0,1.0));
#202=DIRECTION('',(-0.0,1.0,0.0));
#203=DIRECTION('',(0.0,0.0,1.0));
#204=DIRECTION('',(0.0,0.0,1.0));
#205=DIRECTION('',(1.0,0.0,-0.0));
#206=DIRECTION('',(1.0,0.0,-0.0));
#207=DIRECTION('',(0.0,1.0,0.0));
#208=DIRECTION('',(1.0,0.0,-0.0));
#209=CARTESIAN_POINT('',(0.5,0.5,0.75));
#210=DIRECTION('',(0.0,0.0,1.0));
#211=DIRECTION('',(1.0,0.0,-0.0));
#212=DIRECTION('',(1.0,0.0,-0.0));
#213=DIRECTION('',(0.0,0.0,1.0));
#214=DIRECTION('',(-0.0,1.0,0.0));
ENDSEC;
END-ISO-10303-21;
