ISO-10303-21;
HEADER;
FILE_DESCRIPTION(('STEP AP203'),'1');
FILE_NAME('curveCylinder.step','2013-09-07T07:06:35',(' '),(' '),'Spatial InterOp 3D',' ',' ');
FILE_SCHEMA(('CONFIG_CONTROL_DESIGN'));
ENDSEC;
DATA;
#1=DESIGN_CONTEXT('',#27,'design');
#2=APPLICATION_PROTOCOL_DEFINITION('INTERNATIONAL STANDARD','config_control_design',1994,#27);
#3=PRODUCT_CATEGORY_RELATIONSHIP('NONE','NONE',#28,#29);
#4=DATE_AND_TIME(#30,#31);
#5=DATE_TIME_ROLE('creation_date');
#6=DATE_TIME_ROLE('classification_date');
#7=PERSON_AND_ORGANIZATION_ROLE('creator');
#8=PERSON_AND_ORGANIZATION_ROLE('design_supplier');
#9=PERSON_AND_ORGANIZATION_ROLE('classification_officer');
#10=PERSON_AND_ORGANIZATION_ROLE('design_owner');
#11=APPROVAL_PERSON_ORGANIZATION(#32,#33,#34);
#12=APPROVAL_DATE_TIME(#4,#33);
#13=CC_DESIGN_APPROVAL(#33,(#35,#36,#37));
#14=CC_DESIGN_DATE_AND_TIME_ASSIGNMENT(#4,#5,(#37));
#15=CC_DESIGN_DATE_AND_TIME_ASSIGNMENT(#4,#6,(#35));
#16=CC_DESIGN_PERSON_AND_ORGANIZATION_ASSIGNMENT(#32,#10,(#38));
#17=CC_DESIGN_PERSON_AND_ORGANIZATION_ASSIGNMENT(#32,#7,(#37));
#18=CC_DESIGN_PERSON_AND_ORGANIZATION_ASSIGNMENT(#32,#7,(#36));
#19=CC_DESIGN_PERSON_AND_ORGANIZATION_ASSIGNMENT(#32,#8,(#36));
#20=CC_DESIGN_SECURITY_CLASSIFICATION(#35,(#36));
#21=CC_DESIGN_PERSON_AND_ORGANIZATION_ASSIGNMENT(#32,#9,(#35));
#22=SHAPE_DEFINITION_REPRESENTATION(#39,#40);
#23= (GEOMETRIC_REPRESENTATION_CONTEXT(3)GLOBAL_UNCERTAINTY_ASSIGNED_CONTEXT((#43))GLOBAL_UNIT_ASSIGNED_CONTEXT((#45,#46,#47))REPRESENTATION_CONTEXT('NONE','WORKSPACE'));
#27=APPLICATION_CONTEXT('CONFIGURATION CONTROLLED 3D DESIGNS OF MECHANICAL PARTS AND ASSEMBLIES');
#28=PRODUCT_CATEGORY('part','NONE');
#29=PRODUCT_RELATED_PRODUCT_CATEGORY('detail',' ',(#38));
#30=CALENDAR_DATE(2013,7,8);
#31=LOCAL_TIME(9,6,35.0,#49);
#32=PERSON_AND_ORGANIZATION(#50,#51);
#33=APPROVAL(#52,'SOLID MODEL');
#34=APPROVAL_ROLE('APPROVED');
#35=SECURITY_CLASSIFICATION('','',#53);
#36=PRODUCT_DEFINITION_FORMATION_WITH_SPECIFIED_SOURCE(' ','NONE',#38,.NOT_KNOWN.);
#37=PRODUCT_DEFINITION('NONE','NONE',#36,#1);
#38=PRODUCT('1','1','PART-1-DESC',(#54));
#39=PRODUCT_DEFINITION_SHAPE('NONE','NONE',#37);
#40=ADVANCED_BREP_SHAPE_REPRESENTATION('1',(#55,#56),#23);
#43=UNCERTAINTY_MEASURE_WITH_UNIT(LENGTH_MEASURE(1.0E-06),#45,'','');
#45= (CONVERSION_BASED_UNIT('MILLIMETRE',#59)LENGTH_UNIT()NAMED_UNIT(#62));
#46= (NAMED_UNIT(#64)PLANE_ANGLE_UNIT()SI_UNIT($,.RADIAN.));
#47= (NAMED_UNIT(#64)SOLID_ANGLE_UNIT()SI_UNIT($,.STERADIAN.));
#49=COORDINATED_UNIVERSAL_TIME_OFFSET(0,0,.AHEAD.);
#50=PERSON('','UNSPECIFIED',$,$,$,$);
#51=ORGANIZATION('UNSPECIFIED','UNSPECIFIED','UNSPECIFIED');
#52=APPROVAL_STATUS('approved');
#53=SECURITY_CLASSIFICATION_LEVEL('unclassified');
#54=MECHANICAL_CONTEXT('',#27,'mechanical');
#55=MANIFOLD_SOLID_BREP('1',#70);
#56=AXIS2_PLACEMENT_3D('',#71,#72,#73);
#59=LENGTH_MEASURE_WITH_UNIT(LENGTH_MEASURE(1.0),#74);
#62=DIMENSIONAL_EXPONENTS(1.0,0.0,0.0,0.0,0.0,0.0,0.0);
#64=DIMENSIONAL_EXPONENTS(0.0,0.0,0.0,0.0,0.0,0.0,0.0);
#70=CLOSED_SHELL('',(#75,#76,#77,#78));
#71=CARTESIAN_POINT('',(0.0,0.0,0.0));
#72=DIRECTION('',(0.0,0.0,1.0));
#73=DIRECTION('',(1.0,0.0,0.0));
#74= (NAMED_UNIT(#62)LENGTH_UNIT()SI_UNIT(.MILLI.,.METRE.));
#75=ADVANCED_FACE('',(#80),#81,.T.);
#76=ADVANCED_FACE('',(#82),#83,.T.);
#77=ADVANCED_FACE('',(#84),#85,.F.);
#78=ADVANCED_FACE('',(#86),#87,.T.);
#80=FACE_OUTER_BOUND('',#88,.T.);
#81=TOROIDAL_SURFACE('',#89,15.0,5.0);
#82=FACE_OUTER_BOUND('',#90,.T.);
#83=TOROIDAL_SURFACE('',#91,15.0,5.0);
#84=FACE_OUTER_BOUND('',#92,.T.);
#85=PLANE('',#93);
#86=FACE_OUTER_BOUND('',#94,.T.);
#87=PLANE('',#95);
#88=EDGE_LOOP('',(#96,#97,#98,#99));
#89=AXIS2_PLACEMENT_3D('',#100,#101,#102);
#90=EDGE_LOOP('',(#103,#104,#105,#106));
#91=AXIS2_PLACEMENT_3D('',#107,#108,#109);
#92=EDGE_LOOP('',(#110,#111));
#93=AXIS2_PLACEMENT_3D('',#112,#113,#114);
#94=EDGE_LOOP('',(#115,#116));
#95=AXIS2_PLACEMENT_3D('',#117,#118,#119);
#96=ORIENTED_EDGE('',*,*,#120,.F.);
#97=ORIENTED_EDGE('',*,*,#121,.F.);
#98=ORIENTED_EDGE('',*,*,#122,.T.);
#99=ORIENTED_EDGE('',*,*,#123,.T.);
#100=CARTESIAN_POINT('',(15.0,0.0,-5.0));
#101=DIRECTION('',(-0.0,1.0,0.0));
#102=DIRECTION('',(0.0,0.0,1.0));
#103=ORIENTED_EDGE('',*,*,#120,.T.);
#104=ORIENTED_EDGE('',*,*,#124,.T.);
#105=ORIENTED_EDGE('',*,*,#122,.F.);
#106=ORIENTED_EDGE('',*,*,#125,.F.);
#107=CARTESIAN_POINT('',(15.0,0.0,-5.0));
#108=DIRECTION('',(-0.0,1.0,0.0));
#109=DIRECTION('',(0.0,0.0,1.0));
#110=ORIENTED_EDGE('',*,*,#123,.F.);
#111=ORIENTED_EDGE('',*,*,#124,.F.);
#112=CARTESIAN_POINT('',(15.0,0.0,10.0));
#113=DIRECTION('',(-1.0,0.0,0.0));
#114=DIRECTION('',(0.0,0.0,1.0));
#115=ORIENTED_EDGE('',*,*,#121,.T.);
#116=ORIENTED_EDGE('',*,*,#125,.T.);
#117=CARTESIAN_POINT('',(0.0,0.0,-5.0));
#118=DIRECTION('',(0.0,0.0,-1.0));
#119=DIRECTION('',(-1.0,0.0,0.0));
#120=EDGE_CURVE('',#126,#127,#128,.T.);
#121=EDGE_CURVE('',#129,#126,#130,.T.);
#122=EDGE_CURVE('',#129,#131,#132,.T.);
#123=EDGE_CURVE('',#131,#127,#133,.T.);
#124=EDGE_CURVE('',#127,#131,#134,.T.);
#125=EDGE_CURVE('',#126,#129,#135,.T.);
#126=VERTEX_POINT('',#136);
#127=VERTEX_POINT('',#137);
#128=CIRCLE('',#138,20.0);
#129=VERTEX_POINT('',#139);
#130=CIRCLE('',#140,5.0);
#131=VERTEX_POINT('',#141);
#132=CIRCLE('',#142,10.0);
#133=CIRCLE('',#143,5.0);
#134=CIRCLE('',#144,5.0);
#135=CIRCLE('',#145,5.0);
#136=CARTESIAN_POINT('',(-5.0,6.12323399573677E-16,-5.0));
#137=CARTESIAN_POINT('',(15.0,6.12323399573677E-16,15.0));
#138=AXIS2_PLACEMENT_3D('',#146,#147,#148);
#139=CARTESIAN_POINT('',(5.0,0.0,-5.0));
#140=AXIS2_PLACEMENT_3D('',#149,#150,#151);
#141=CARTESIAN_POINT('',(15.0,0.0,5.0));
#142=AXIS2_PLACEMENT_3D('',#152,#153,#154);
#143=AXIS2_PLACEMENT_3D('',#155,#156,#157);
#144=AXIS2_PLACEMENT_3D('',#158,#159,#160);
#145=AXIS2_PLACEMENT_3D('',#161,#162,#163);
#146=CARTESIAN_POINT('',(15.0,6.12323399573677E-16,-5.0));
#147=DIRECTION('',(-0.0,1.0,0.0));
#148=DIRECTION('',(0.0,0.0,1.0));
#149=CARTESIAN_POINT('',(0.0,0.0,-5.0));
#150=DIRECTION('',(0.0,0.0,-1.0));
#151=DIRECTION('',(1.0,0.0,0.0));
#152=CARTESIAN_POINT('',(15.0,0.0,-5.0));
#153=DIRECTION('',(-0.0,1.0,0.0));
#154=DIRECTION('',(0.0,0.0,1.0));
#155=CARTESIAN_POINT('',(15.0,0.0,10.0));
#156=DIRECTION('',(-1.0,0.0,0.0));
#157=DIRECTION('',(0.0,0.0,-1.0));
#158=CARTESIAN_POINT('',(15.0,0.0,10.0));
#159=DIRECTION('',(-1.0,0.0,0.0));
#160=DIRECTION('',(0.0,0.0,-1.0));
#161=CARTESIAN_POINT('',(0.0,0.0,-5.0));
#162=DIRECTION('',(0.0,0.0,-1.0));
#163=DIRECTION('',(1.0,0.0,0.0));
ENDSEC;
END-ISO-10303-21;
Surface Loop(7) = {1, 2, 3, 4};
Volume(8) = {7};
Surface Loop(7) = {2, 1, 3, 4};
Volume(8) = {7};
Surface Loop(7) = {3, 1, 2, 4};
Volume(8) = {7};
Surface Loop(7) = {3, 1, 2, 4};
Volume(8) = {7};
Surface Loop(7) = {2, 1, 3, 4};
Volume(8) = {7};
Surface Loop(7) = {1, 2, 3, 4};
Volume(8) = {7};
Surface Loop(7) = {1, 2, 3, 4};
Volume(8) = {7};
Surface Loop(7) = {4, 1, 2, 3};
Volume(8) = {7};
