ISO-10303-21;
HEADER;
FILE_DESCRIPTION(('STEP AP214'),'1');
FILE_NAME('B18.step','2023-05-04T14:52:56',('Mambo'),(' '),'Spatial InterOp 3D',' ',' ');
FILE_SCHEMA(('automotive_design'));
ENDSEC;
DATA;
#1=PRODUCT_DEFINITION_CONTEXT('',#9,'design');
#2=APPLICATION_PROTOCOL_DEFINITION('INTERNATIONAL STANDARD','automotive_design',1994,#9);
#3=PRODUCT_CATEGORY_RELATIONSHIP('NONE','NONE',#10,#11);
#4=SHAPE_DEFINITION_REPRESENTATION(#12,#13);
#5= (GEOMETRIC_REPRESENTATION_CONTEXT(3)GLOBAL_UNCERTAINTY_ASSIGNED_CONTEXT((#16))GLOBAL_UNIT_ASSIGNED_CONTEXT((#18,#19,#20))REPRESENTATION_CONTEXT('NONE','WORKSPACE'));
#9=APPLICATION_CONTEXT(' ');
#10=PRODUCT_CATEGORY('part','NONE');
#11=PRODUCT_RELATED_PRODUCT_CATEGORY('detail',' ',(#22));
#12=PRODUCT_DEFINITION_SHAPE('NONE','NONE',#23);
#13=ADVANCED_BREP_SHAPE_REPRESENTATION('1',(#24,#25),#5);
#16=UNCERTAINTY_MEASURE_WITH_UNIT(LENGTH_MEASURE(1.0E-06),#18,'','');
#18= (CONVERSION_BASED_UNIT('MILLIMETRE',#28)LENGTH_UNIT()NAMED_UNIT(#31));
#19= (NAMED_UNIT(#33)PLANE_ANGLE_UNIT()SI_UNIT($,.RADIAN.));
#20= (NAMED_UNIT(#33)SOLID_ANGLE_UNIT()SI_UNIT($,.STERADIAN.));
#22=PRODUCT('1','1','PART-1-DESC',(#39));
#23=PRODUCT_DEFINITION('NONE','NONE',#40,#1);
#24=MANIFOLD_SOLID_BREP('1',#41);
#25=AXIS2_PLACEMENT_3D('',#42,#43,#44);
#28=LENGTH_MEASURE_WITH_UNIT(LENGTH_MEASURE(1.0),#45);
#31=DIMENSIONAL_EXPONENTS(1.0,0.0,0.0,0.0,0.0,0.0,0.0);
#33=DIMENSIONAL_EXPONENTS(0.0,0.0,0.0,0.0,0.0,0.0,0.0);
#39=PRODUCT_CONTEXT('',#9,'mechanical');
#40=PRODUCT_DEFINITION_FORMATION_WITH_SPECIFIED_SOURCE(' ','NONE',#22,.NOT_KNOWN.);
#41=CLOSED_SHELL('',(#46,#47,#48,#49,#50,#51,#52));
#42=CARTESIAN_POINT('',(0.0,0.0,0.0));
#43=DIRECTION('',(0.0,0.0,1.0));
#44=DIRECTION('',(1.0,0.0,0.0));
#45= (NAMED_UNIT(#31)LENGTH_UNIT()SI_UNIT(.MILLI.,.METRE.));
#46=ADVANCED_FACE('',(#54),#55,.T.);
#47=ADVANCED_FACE('',(#56),#57,.F.);
#48=ADVANCED_FACE('',(#58),#59,.T.);
#49=ADVANCED_FACE('',(#60),#61,.F.);
#50=ADVANCED_FACE('',(#62),#63,.T.);
#51=ADVANCED_FACE('',(#64),#65,.F.);
#52=ADVANCED_FACE('',(#66),#67,.T.);
#54=FACE_OUTER_BOUND('',#68,.T.);
#55=PLANE('',#69);
#56=FACE_OUTER_BOUND('',#70,.T.);
#57=PLANE('',#71);
#58=FACE_OUTER_BOUND('',#72,.T.);
#59=B_SPLINE_SURFACE_WITH_KNOTS('',8,8,((#73,#74,#75,#76,#77,#78,#79,#80,#81,#82,#83,#84,#85,#86,#87,#88),(#89,#90,#91,#92,#93,#94,#95,#96,#97,#98,#99,#100,#101,#102,#103,#104),(#105,#106,#107,#108,#109,#110,#111,#112,#113,#114,#115,#116,#117,#118,#119,#120),(#121,#122,#123,#124,#125,#126,#127,#128,#129,#130,#131,#132,#133,#134,#135,#136),(#137,#138,#139,#140,#141,#142,#143,#144,#145,#146,#147,#148,#149,#150,#151,#152),(#153,#154,#155,#156,#157,#158,#159,#160,#161,#162,#163,#164,#165,#166,#167,#168),(#169,#170,#171,#172,#173,#174,#175,#176,#177,#178,#179,#180,#181,#182,#183,#184),(#185,#186,#187,#188,#189,#190,#191,#192,#193,#194,#195,#196,#197,#198,#199,#200),(#201,#202,#203,#204,#205,#206,#207,#208,#209,#210,#211,#212,#213,#214,#215,#216),(#217,#218,#219,#220,#221,#222,#223,#224,#225,#226,#227,#228,#229,#230,#231,#232),(#233,#234,#235,#236,#237,#238,#239,#240,#241,#242,#243,#244,#245,#246,#247,#248),(#249,#250,#251,#252,#253,#254,#255,#256,#257,#258,#259,#260,#261,#262,#263,#264),(#265,#266,#267,#268,#269,#270,#271,#272,#273,#274,#275,#276,#277,#278,#279,#280),(#281,#282,#283,#284,#285,#286,#287,#288,#289,#290,#291,#292,#293,#294,#295,#296),(#297,#298,#299,#300,#301,#302,#303,#304,#305,#306,#307,#308,#309,#310,#311,#312),(#313,#314,#315,#316,#317,#318,#319,#320,#321,#322,#323,#324,#325,#326,#327,#328)),.UNSPECIFIED.,.F.,.F.,.F.,(9,7,9),(9,7,9),(-0.383017460885723,5.551115123126E-17,0.38301746088583),(-0.275,0.0,0.275),.UNSPECIFIED.);
#60=FACE_OUTER_BOUND('',#329,.T.);
#61=PLANE('',#330);
#62=FACE_OUTER_BOUND('',#331,.T.);
#63=PLANE('',#332);
#64=FACE_OUTER_BOUND('',#333,.T.);
#65=B_SPLINE_SURFACE_WITH_KNOTS('',8,8,((#334,#335,#336,#337,#338,#339,#340,#341,#342),(#343,#344,#345,#346,#347,#348,#349,#350,#351),(#352,#353,#354,#355,#356,#357,#358,#359,#360),(#361,#362,#363,#364,#365,#366,#367,#368,#369),(#370,#371,#372,#373,#374,#375,#376,#377,#378),(#379,#380,#381,#382,#383,#384,#385,#386,#387),(#388,#389,#390,#391,#392,#393,#394,#395,#396),(#397,#398,#399,#400,#401,#402,#403,#404,#405),(#406,#407,#408,#409,#410,#411,#412,#413,#414)),.UNSPECIFIED.,.F.,.F.,.F.,(9,9),(9,9),(-0.73751923576034,0.737519235758059),(-0.275,0.275),.UNSPECIFIED.);
#66=FACE_OUTER_BOUND('',#415,.T.);
#67=PLANE('',#416);
#68=EDGE_LOOP('',(#417,#418,#419,#420,#421));
#69=AXIS2_PLACEMENT_3D('',#422,#423,#424);
#70=EDGE_LOOP('',(#425,#426,#427));
#71=AXIS2_PLACEMENT_3D('',#428,#429,#430);
#72=EDGE_LOOP('',(#431,#432,#433,#434,#435));
#73=CARTESIAN_POINT('',(-0.498500212525074,-0.0431679516753684,-0.275));
#74=CARTESIAN_POINT('',(-0.498670546036349,-0.0429977567118217,-0.240625));
#75=CARTESIAN_POINT('',(-0.498646228923746,-0.0430219952690015,-0.20625));
#76=CARTESIAN_POINT('',(-0.499711124535487,-0.0419576146582732,-0.171875));
#77=CARTESIAN_POINT('',(-0.498615071246655,-0.0430524578457189,-0.1375));
#78=CARTESIAN_POINT('',(-0.499484658022001,-0.0421837207026013,-0.103125));
#79=CARTESIAN_POINT('',(-0.499127637308216,-0.0425402729243148,-0.0687499999999981));
#80=CARTESIAN_POINT('',(-0.499204641259513,-0.0424633363913236,-0.0343749999999999));
#81=CARTESIAN_POINT('',(-0.499204641259513,-0.0424633363907867,0.0343750000000001));
#82=CARTESIAN_POINT('',(-0.499127637308034,-0.0425402729239439,0.0687500000000018));
#83=CARTESIAN_POINT('',(-0.499484658026801,-0.0421837206993376,0.103125));
#84=CARTESIAN_POINT('',(-0.49861507124143,-0.0430524578471349,0.1375));
#85=CARTESIAN_POINT('',(-0.499711124540874,-0.0419576146556125,0.171875));
#86=CARTESIAN_POINT('',(-0.498646228923482,-0.0430219952680193,0.20625));
#87=CARTESIAN_POINT('',(-0.498670546037754,-0.04299775670957,0.240625));
#88=CARTESIAN_POINT('',(-0.498500212528467,-0.043167951671967,0.275));
#89=CARTESIAN_POINT('',(-0.503071316466507,0.0291109459184232,-0.275));
#90=CARTESIAN_POINT('',(-0.503284038721003,0.0293234025051208,-0.240625));
#91=CARTESIAN_POINT('',(-0.502998195270962,0.0290376910281985,-0.20625));
#92=CARTESIAN_POINT('',(-0.502657021675391,0.0286968295551086,-0.171875));
#93=CARTESIAN_POINT('',(-0.502620222280019,0.0286599189132976,-0.1375));
#94=CARTESIAN_POINT('',(-0.50258742171372,0.0286269895802762,-0.103125));
#95=CARTESIAN_POINT('',(-0.502507678485384,0.0285473391162489,-0.0687499999999866));
#96=CARTESIAN_POINT('',(-0.502502742826521,0.0285423647178345,-0.0343749999999991));
#97=CARTESIAN_POINT('',(-0.502502742826521,0.0285423647178006,0.0343750000000009));
#98=CARTESIAN_POINT('',(-0.502507678484148,0.0285473391152118,0.0687500000000125));
#99=CARTESIAN_POINT('',(-0.502587421715569,0.0286269895827555,0.103125));
#100=CARTESIAN_POINT('',(-0.502620222275535,0.0286599189082124,0.1375));
#101=CARTESIAN_POINT('',(-0.502657021673339,0.0286968295549952,0.171875));
#102=CARTESIAN_POINT('',(-0.502998195270046,0.0290376910264706,0.20625));
#103=CARTESIAN_POINT('',(-0.503284038717704,0.0293234025020856,0.240625));
#104=CARTESIAN_POINT('',(-0.503071316465001,0.0291109459165453,0.275));
#105=CARTESIAN_POINT('',(-0.499727167991751,0.0934759651699347,-0.275));
#106=CARTESIAN_POINT('',(-0.500261911169501,0.0940104610112525,-0.240625));
#107=CARTESIAN_POINT('',(-0.500253460864624,0.0940020055552572,-0.20625));
#108=CARTESIAN_POINT('',(-0.494238855164109,0.0879885032781757,-0.171875));
#109=CARTESIAN_POINT('',(-0.502252546793694,0.0959991036769448,-0.1375));
#110=CARTESIAN_POINT('',(-0.496105384068562,0.0898541083769209,-0.103125));
#111=CARTESIAN_POINT('',(-0.49882808580715,0.0925756671180089,-0.06875000000004));
#112=CARTESIAN_POINT('',(-0.498314426672399,0.0920621791397848,-0.0343749999999925));
#113=CARTESIAN_POINT('',(-0.498314426672399,0.0920621791395944,0.0343750000000083));
#114=CARTESIAN_POINT('',(-0.498828085811379,0.0925756671167114,0.0687499999999525));
#115=CARTESIAN_POINT('',(-0.496105384047739,0.0898541083779289,0.103125));
#116=CARTESIAN_POINT('',(-0.502252546828708,0.0959991036714463,0.1375));
#117=CARTESIAN_POINT('',(-0.494238855118473,0.0879885032745604,0.171875));
#118=CARTESIAN_POINT('',(-0.500253460886103,0.0940020055584721,0.20625));
#119=CARTESIAN_POINT('',(-0.500261911164497,0.0940104610075558,0.240625));
#120=CARTESIAN_POINT('',(-0.499727167986663,0.0934759651660599,0.275));
#121=CARTESIAN_POINT('',(-0.483193711457511,0.144657921641574,-0.275));
#122=CARTESIAN_POINT('',(-0.480155998983078,0.141623816653853,-0.240625));
#123=CARTESIAN_POINT('',(-0.479698769986879,0.14116721392288,-0.20625));
#124=CARTESIAN_POINT('',(-0.497216087408848,0.158658629747916,-0.171875));
#125=CARTESIAN_POINT('',(-0.474965480622495,0.136435677025502,-0.1375));
#126=CARTESIAN_POINT('',(-0.492407462085782,0.153857283249567,-0.103125));
#127=CARTESIAN_POINT('',(-0.485348958675807,0.14680682377392,-0.0687499999999407));
#128=CARTESIAN_POINT('',(-0.486916260038504,0.148372471739219,-0.0343750000000171));
#129=CARTESIAN_POINT('',(-0.486916260038504,0.148372471738364,0.0343749999999907));
#130=CARTESIAN_POINT('',(-0.4853489586533,0.146806823781212,0.0687500000000764));
#131=CARTESIAN_POINT('',(-0.492407462172883,0.153857283229912,0.103125));
#132=CARTESIAN_POINT('',(-0.474965480464525,0.136435677054025,0.1375));
#133=CARTESIAN_POINT('',(-0.497216087570321,0.158658629728134,0.171875));
#134=CARTESIAN_POINT('',(-0.479698769906775,0.14116721392158,0.20625));
#135=CARTESIAN_POINT('',(-0.480155998997781,0.141623816666842,0.240625));
#136=CARTESIAN_POINT('',(-0.483193711471286,0.144657921651133,0.275));
#137=CARTESIAN_POINT('',(-0.468631038996078,0.197791814730445,-0.275));
#138=CARTESIAN_POINT('',(-0.46947817428988,0.198634973249296,-0.240625));
#139=CARTESIAN_POINT('',(-0.469247573012945,0.19840297693896,-0.20625));
#140=CARTESIAN_POINT('',(-0.454381037052954,0.183567921800249,-0.171875));
#141=CARTESIAN_POINT('',(-0.479391544192628,0.208537150150767,-0.1375));
#142=CARTESIAN_POINT('',(-0.461923727662984,0.19109857620908,-0.103125));
#143=CARTESIAN_POINT('',(-0.470593153595059,0.199755616578109,-0.0687500000000713));
#144=CARTESIAN_POINT('',(-0.469327544616505,0.198492343623306,-0.0343749999999823));
#145=CARTESIAN_POINT('',(-0.469327544616505,0.198492343624248,0.034375));
#146=CARTESIAN_POINT('',(-0.470593153627433,0.199755616564575,0.0687499999999088));
#147=CARTESIAN_POINT('',(-0.461923727531443,0.191098576242448,0.103125));
#148=CARTESIAN_POINT('',(-0.479391544426105,0.208537150100335,0.1375));
#149=CARTESIAN_POINT('',(-0.454381036816947,0.183567921832137,0.171875));
#150=CARTESIAN_POINT('',(-0.469247573139187,0.198402976946031,0.20625));
#151=CARTESIAN_POINT('',(-0.469478174276345,0.198634973237526,0.240625));
#152=CARTESIAN_POINT('',(-0.468631038982483,0.197791814722207,0.275));
#153=CARTESIAN_POINT('',(-0.444172337099318,0.241047510558549,-0.275));
#154=CARTESIAN_POINT('',(-0.441662768634458,0.238539978537472,-0.240625));
#155=CARTESIAN_POINT('',(-0.441126529497865,0.238004499606372,-0.20625));
#156=CARTESIAN_POINT('',(-0.449970884981792,0.246831075027557,-0.171875));
#157=CARTESIAN_POINT('',(-0.438131898436091,0.235016859181411,-0.1375));
#158=CARTESIAN_POINT('',(-0.449170295390733,0.246037306898139,-0.103125));
#159=CARTESIAN_POINT('',(-0.445491381865727,0.242366223266069,-0.0687499999999349));
#160=CARTESIAN_POINT('',(-0.446733218786948,0.243606659662832,-0.0343750000000187));
#161=CARTESIAN_POINT('',(-0.446733218786948,0.243606659662876,0.0343749999999996));
#162=CARTESIAN_POINT('',(-0.445491381841243,0.242366223275578,0.0687500000000477));
#163=CARTESIAN_POINT('',(-0.449170295486068,0.246037306874479,0.103125));
#164=CARTESIAN_POINT('',(-0.438131898269086,0.235016859218447,0.1375));
#165=CARTESIAN_POINT('',(-0.449970885153664,0.246831075010452,0.171875));
#166=CARTESIAN_POINT('',(-0.44112652940822,0.238004499598996,0.20625));
#167=CARTESIAN_POINT('',(-0.441662768643923,0.238539978545026,0.240625));
#168=CARTESIAN_POINT('',(-0.444172337107783,0.241047510562281,0.275));
#169=CARTESIAN_POINT('',(-0.41862934053948,0.283210308582142,-0.275));
#170=CARTESIAN_POINT('',(-0.417313357326953,0.281893598197871,-0.240625));
#171=CARTESIAN_POINT('',(-0.416665536076434,0.281245570111133,-0.20625));
#172=CARTESIAN_POINT('',(-0.415094839282962,0.279679866925325,-0.171875));
#173=CARTESIAN_POINT('',(-0.419382569275908,0.283961153505137,-0.1375));
#174=CARTESIAN_POINT('',(-0.417930244365765,0.282513895691056,-0.103125));
#175=CARTESIAN_POINT('',(-0.419895692012441,0.284477391943893,-0.0687500000000385));
#176=CARTESIAN_POINT('',(-0.420080435094585,0.284662626394155,-0.0343749999999903));
#177=CARTESIAN_POINT('',(-0.420080435094585,0.284662626395155,0.0343749999999906));
#178=CARTESIAN_POINT('',(-0.419895692020201,0.284477391942953,0.0687499999999997));
#179=CARTESIAN_POINT('',(-0.417930244340607,0.282513895695935,0.103125));
#180=CARTESIAN_POINT('',(-0.419382569321525,0.283961153500347,0.1375));
#181=CARTESIAN_POINT('',(-0.415094839239375,0.279679866927295,0.171875));
#182=CARTESIAN_POINT('',(-0.416665536100713,0.281245570116983,0.20625));
#183=CARTESIAN_POINT('',(-0.417313357325043,0.281893598195932,0.240625));
#184=CARTESIAN_POINT('',(-0.41862934053657,0.283210308580172,0.275));
#185=CARTESIAN_POINT('',(-0.388389872041548,0.320680630811452,-0.275));
#186=CARTESIAN_POINT('',(-0.386731005536552,0.319021685379448,-0.240625));
#187=CARTESIAN_POINT('',(-0.386025509425652,0.318316192792348,-0.20625));
#188=CARTESIAN_POINT('',(-0.386383822078396,0.318674567695612,-0.171875));
#189=CARTESIAN_POINT('',(-0.3874000535613,0.319690896426707,-0.1375));
#190=CARTESIAN_POINT('',(-0.388545970239929,0.320836921632079,-0.103125));
#191=CARTESIAN_POINT('',(-0.389419650703805,0.321710698170203,-0.0687499999999902));
#192=CARTESIAN_POINT('',(-0.389848812961477,0.322139920328531,-0.0343749999999999));
#193=CARTESIAN_POINT('',(-0.389848812961477,0.322139920329531,0.0343750000000098));
#194=CARTESIAN_POINT('',(-0.389419650703805,0.321710698171203,0.0687499999999903));
#195=CARTESIAN_POINT('',(-0.388545970241929,0.320836921633079,0.103125));
#196=CARTESIAN_POINT('',(-0.3874000535623,0.3196908964287,0.1375));
#197=CARTESIAN_POINT('',(-0.386383822080388,0.318674567696612,0.171875));
#198=CARTESIAN_POINT('',(-0.386025509426652,0.318316192793348,0.20625));
#199=CARTESIAN_POINT('',(-0.386731005537544,0.319021685379456,0.240625));
#200=CARTESIAN_POINT('',(-0.388389872041548,0.32068063081046,0.275));
#201=CARTESIAN_POINT('',(-0.320680630811443,0.388389872041557,-0.275));
#202=CARTESIAN_POINT('',(-0.319021685379439,0.386731005536561,-0.240625));
#203=CARTESIAN_POINT('',(-0.318316192792339,0.386025509425661,-0.20625));
#204=CARTESIAN_POINT('',(-0.318674567695595,0.386383822079398,-0.171875));
#205=CARTESIAN_POINT('',(-0.31969089642769,0.387400053561302,-0.1375));
#206=CARTESIAN_POINT('',(-0.320836921632062,0.38854597024093,-0.103125));
#207=CARTESIAN_POINT('',(-0.321710698171186,0.389419650703807,-0.0687500000000098));
#208=CARTESIAN_POINT('',(-0.322139920329514,0.389848812961479,-0.0343749999999901));
#209=CARTESIAN_POINT('',(-0.322139920329514,0.389848812962479,0.0343749999999901));
#210=CARTESIAN_POINT('',(-0.321710698171186,0.389419650704807,0.0687500000000297));
#211=CARTESIAN_POINT('',(-0.320836921634062,0.38854597024193,0.103125));
#212=CARTESIAN_POINT('',(-0.31969089642869,0.38740005356231,0.1375));
#213=CARTESIAN_POINT('',(-0.318674567696602,0.386383822080398,0.171875));
#214=CARTESIAN_POINT('',(-0.318316192793339,0.386025509426661,0.20625));
#215=CARTESIAN_POINT('',(-0.319021685379446,0.386731005537554,0.240625));
#216=CARTESIAN_POINT('',(-0.320680630811443,0.38838987204155,0.275));
#217=CARTESIAN_POINT('',(-0.283210308585031,0.418629340538527,-0.275));
#218=CARTESIAN_POINT('',(-0.28189359820076,0.41731335732794,-0.240625));
#219=CARTESIAN_POINT('',(-0.281245570111112,0.41666553609682,-0.20625));
#220=CARTESIAN_POINT('',(-0.279679866926273,0.415094839225782,-0.171875));
#221=CARTESIAN_POINT('',(-0.283961153497387,0.419382569338001,-0.1375));
#222=CARTESIAN_POINT('',(-0.282513895700734,0.417930244329924,-0.103125));
#223=CARTESIAN_POINT('',(-0.284477391940992,0.419895692023127,-0.0687499999999518));
#224=CARTESIAN_POINT('',(-0.284662626395134,0.420080435095572,-0.0343750000000288));
#225=CARTESIAN_POINT('',(-0.284662626395134,0.420080435095602,0.0343750000000385));
#226=CARTESIAN_POINT('',(-0.284477391951661,0.419895692020248,0.068749999999836));
#227=CARTESIAN_POINT('',(-0.282513895675575,0.417930244351293,0.103125));
#228=CARTESIAN_POINT('',(-0.283961153522636,0.419382569301174,0.1375));
#229=CARTESIAN_POINT('',(-0.279679866920483,0.41509483925782,0.171875));
#230=CARTESIAN_POINT('',(-0.281245570109203,0.416665536092,0.20625));
#231=CARTESIAN_POINT('',(-0.281893598195911,0.41731335732312,0.240625));
#232=CARTESIAN_POINT('',(-0.283210308581151,0.418629340536587,0.275));
#233=CARTESIAN_POINT('',(-0.241047510550049,0.444172337102161,-0.275));
#234=CARTESIAN_POINT('',(-0.238539978526105,0.441662768631656,-0.240625));
#235=CARTESIAN_POINT('',(-0.238004499611112,0.441126529400422,-0.20625));
#236=CARTESIAN_POINT('',(-0.246831075009424,0.449970885234271,-0.171875));
#237=CARTESIAN_POINT('',(-0.235016859225915,0.438131898170505,-0.1375));
#238=CARTESIAN_POINT('',(-0.246037306859384,0.449170295545788,-0.103125));
#239=CARTESIAN_POINT('',(-0.242366223281186,0.445491381828023,-0.0687500000000933));
#240=CARTESIAN_POINT('',(-0.243606659664753,0.44673321878797,-0.0343749999999536));
#241=CARTESIAN_POINT('',(-0.243606659663797,0.44673321878797,0.0343749999999253));
#242=CARTESIAN_POINT('',(-0.242366223249193,0.445491381846041,0.0687500000002791));
#243=CARTESIAN_POINT('',(-0.246037306942301,0.449170295450279,0.103124999999045));
#244=CARTESIAN_POINT('',(-0.235016859154463,0.438131898347461,0.137500000000955));
#245=CARTESIAN_POINT('',(-0.246831075018713,0.449970885078111,0.171875));
#246=CARTESIAN_POINT('',(-0.238004499629174,0.441126529446053,0.20625));
#247=CARTESIAN_POINT('',(-0.238539978543079,0.441662768648631,0.240625));
#248=CARTESIAN_POINT('',(-0.24104751055847,0.444172337106849,0.275));
#249=CARTESIAN_POINT('',(-0.197791814740228,0.468631038991574,-0.275));
#250=CARTESIAN_POINT('',(-0.198634973262672,0.46947817429162,-0.240625));
#251=CARTESIAN_POINT('',(-0.198402976940146,0.469247573157566,-0.20625));
#252=CARTESIAN_POINT('',(-0.183567921820717,0.4543810366845,-0.171875));
#253=CARTESIAN_POINT('',(-0.208537150097001,0.479391544584789,-0.1375));
#254=CARTESIAN_POINT('',(-0.191098576264046,0.461923727446656,-0.103125));
#255=CARTESIAN_POINT('',(-0.19975561656299,0.470593153648292,-0.0687499999999116));
#256=CARTESIAN_POINT('',(-0.198492343626195,0.469327544618472,-0.0343750000000442));
#257=CARTESIAN_POINT('',(-0.198492343625196,0.469327544617531,0.0343750000000801));
#258=CARTESIAN_POINT('',(-0.199755616602431,0.470593153618343,0.0687499999996973));
#259=CARTESIAN_POINT('',(-0.19109857615339,0.461923727600771,0.103125000000883));
#260=CARTESIAN_POINT('',(-0.20853715018107,0.479391544288871,0.137499999999117));
#261=CARTESIAN_POINT('',(-0.183567921834459,0.45438103695158,0.171875));
#262=CARTESIAN_POINT('',(-0.198402976897967,0.469247573071905,0.20625));
#263=CARTESIAN_POINT('',(-0.19863497324207,0.469478174270077,0.240625));
#264=CARTESIAN_POINT('',(-0.197791814729454,0.468631038985275,0.275));
#265=CARTESIAN_POINT('',(-0.144657921636705,0.483193711461814,-0.275));
#266=CARTESIAN_POINT('',(-0.141623816650184,0.480155998986008,-0.240625));
#267=CARTESIAN_POINT('',(-0.141167213908058,0.479698769902638,-0.20625));
#268=CARTESIAN_POINT('',(-0.15865862976245,0.497216087637065,-0.171875));
#269=CARTESIAN_POINT('',(-0.136435677040685,0.474965480388742,-0.1375));
#270=CARTESIAN_POINT('',(-0.15385728322505,0.492407462210839,-0.103125));
#271=CARTESIAN_POINT('',(-0.146806823784715,0.485348958654002,-0.0687500000000487));
#272=CARTESIAN_POINT('',(-0.148372471741221,0.486916260040527,-0.0343749999999664));
#273=CARTESIAN_POINT('',(-0.148372471740221,0.486916260039529,0.0343749999999414));
#274=CARTESIAN_POINT('',(-0.146806823754421,0.485348958666517,0.0687500000002173));
#275=CARTESIAN_POINT('',(-0.153857283304497,0.492407462116182,0.103125000000069));
#276=CARTESIAN_POINT('',(-0.136435676977729,0.474965480573461,0.137500000000857));
#277=CARTESIAN_POINT('',(-0.158658629744939,0.497216087464937,0.171875));
#278=CARTESIAN_POINT('',(-0.141167213947442,0.479698769959048,0.20625));
#279=CARTESIAN_POINT('',(-0.141623816660629,0.480155998998235,0.240625));
#280=CARTESIAN_POINT('',(-0.144657921643282,0.483193711465959,0.275));
#281=CARTESIAN_POINT('',(-0.0934759651679369,0.499727167988534,-0.275));
#282=CARTESIAN_POINT('',(-0.0940104610079069,0.500261911165231,-0.240625));
#283=CARTESIAN_POINT('',(-0.0940020055680508,0.500253460872009,-0.20625));
#284=CARTESIAN_POINT('',(-0.0879885032561323,0.494238855139591,-0.171875));
#285=CARTESIAN_POINT('',(-0.0959991036954174,0.502252546815839,-0.1375));
#286=CARTESIAN_POINT('',(-0.0898541083741789,0.496105384067912,-0.103125));
#287=CARTESIAN_POINT('',(-0.0925756671207107,0.498828085804091,-0.0687499999999956));
#288=CARTESIAN_POINT('',(-0.0920621791414838,0.498314426674418,-0.034375000000015));
#289=CARTESIAN_POINT('',(-0.0920621791404929,0.498314426673419,0.0343750000000218));
#290=CARTESIAN_POINT('',(-0.0925756671260043,0.49882808580807,0.0687499999999022));
#291=CARTESIAN_POINT('',(-0.0898541083454057,0.496105384056946,0.103125000000003));
#292=CARTESIAN_POINT('',(-0.0959991037193304,0.502252546813584,0.137500000000081));
#293=CARTESIAN_POINT('',(-0.0879885032469478,0.494238855136703,0.171875));
#294=CARTESIAN_POINT('',(-0.094002005559075,0.500253460873784,0.20625));
#295=CARTESIAN_POINT('',(-0.0940104610101145,0.500261911165505,0.240625));
#296=CARTESIAN_POINT('',(-0.0934759651681618,0.49972716798802,0.275));
#297=CARTESIAN_POINT('',(-0.0291109459188198,0.503071316467946,-0.275));
#298=CARTESIAN_POINT('',(-0.029323402507264,0.503284038723234,-0.240625));
#299=CARTESIAN_POINT('',(-0.0290376910307657,0.502998195275765,-0.20625));
#300=CARTESIAN_POINT('',(-0.0286968295542716,0.502657021669866,-0.171875));
#301=CARTESIAN_POINT('',(-0.0286599189129307,0.502620222284437,-0.1375));
#302=CARTESIAN_POINT('',(-0.0286269895838749,0.502587421713933,-0.103125));
#303=CARTESIAN_POINT('',(-0.0285473391162038,0.502507678486075,-0.0687499999999993));
#304=CARTESIAN_POINT('',(-0.0285423647187715,0.50250274282763,-0.0343750000000018));
#305=CARTESIAN_POINT('',(-0.0285423647182847,0.50250274282663,0.0343749999999936));
#306=CARTESIAN_POINT('',(-0.0285473391152265,0.502507678484636,0.0687500000000245));
#307=CARTESIAN_POINT('',(-0.0286269895839232,0.50258742171684,0.103125));
#308=CARTESIAN_POINT('',(-0.0286599189076472,0.502620222274285,0.137500000000004));
#309=CARTESIAN_POINT('',(-0.0286968295563763,0.502657021675814,0.171875));
#310=CARTESIAN_POINT('',(-0.0290376910252605,0.50299819526938,0.20625));
#311=CARTESIAN_POINT('',(-0.0293234025017837,0.503284038716911,0.240625));
#312=CARTESIAN_POINT('',(-0.0291109459169594,0.503071316465175,0.275));
#313=CARTESIAN_POINT('',(0.0431679516780308,0.498500212523489,-0.275));
#314=CARTESIAN_POINT('',(0.0429977567125201,0.498670546035751,-0.240625));
#315=CARTESIAN_POINT('',(0.0430219952713024,0.498646228923369,-0.20625));
#316=CARTESIAN_POINT('',(0.04195761465618,0.499711124535013,-0.171875));
#317=CARTESIAN_POINT('',(0.0430524578520774,0.498615071241682,-0.1375));
#318=CARTESIAN_POINT('',(0.0421837206999251,0.499484658022933,-0.103125));
#319=CARTESIAN_POINT('',(0.0425402729264888,0.499127637307421,-0.06875));
#320=CARTESIAN_POINT('',(0.0424633363921083,0.499204641258742,-0.0343750000000001));
#321=CARTESIAN_POINT('',(0.0424633363916123,0.499204641258627,0.0343749999999991));
#322=CARTESIAN_POINT('',(0.0425402729260455,0.499127637307224,0.0687500000000036));
#323=CARTESIAN_POINT('',(0.0421837206951251,0.499484658025106,0.103125));
#324=CARTESIAN_POINT('',(0.0430524578536539,0.498615071242273,0.1375));
#325=CARTESIAN_POINT('',(0.0419576146522672,0.499711124539257,0.171875));
#326=CARTESIAN_POINT('',(0.0430219952691605,0.498646228924366,0.20625));
#327=CARTESIAN_POINT('',(0.0429977567101517,0.498670546037641,0.240625));
#328=CARTESIAN_POINT('',(0.0431679516716451,0.498500212529353,0.275));
#329=EDGE_LOOP('',(#436,#437,#438,#439,#440));
#330=AXIS2_PLACEMENT_3D('',#441,#442,#443);
#331=EDGE_LOOP('',(#444,#445,#446,#447));
#332=AXIS2_PLACEMENT_3D('',#448,#449,#450);
#333=EDGE_LOOP('',(#451,#452,#453,#454));
#334=CARTESIAN_POINT('',(-0.998717669077236,-0.0442911171779379,-0.275));
#335=CARTESIAN_POINT('',(-1.00011685008916,-0.042893391978517,-0.20625));
#336=CARTESIAN_POINT('',(-0.998641726051736,-0.044366490981177,-0.1375));
#337=CARTESIAN_POINT('',(-1.00285386049048,-0.0401571311754583,-0.0687499999999974));
#338=CARTESIAN_POINT('',(-0.995649365052502,-0.0473573172927327,3.66616438721331E-16));
#339=CARTESIAN_POINT('',(-1.0028538604789,-0.0401571311841395,0.068750000000005));
#340=CARTESIAN_POINT('',(-0.99864172607051,-0.0443664909635659,0.1375));
#341=CARTESIAN_POINT('',(-1.00011685008043,-0.0428933919872663,0.20625));
#342=CARTESIAN_POINT('',(-0.998717669092384,-0.0442911171639325,0.275));
#343=CARTESIAN_POINT('',(-1.00745740311565,0.22520101833222,-0.275));
#344=CARTESIAN_POINT('',(-1.00782920043781,0.225572512049279,-0.20625));
#345=CARTESIAN_POINT('',(-1.00236108660157,0.220105251440508,-0.1375));
#346=CARTESIAN_POINT('',(-1.00815464807355,0.225883284282604,-0.0687499999999911));
#347=CARTESIAN_POINT('',(-1.00159276706854,0.219346330067985,-1.00367763802372E-14));
#348=CARTESIAN_POINT('',(-1.00815464803143,0.225883284242973,0.0687500000000159));
#349=CARTESIAN_POINT('',(-1.00236108661512,0.220105251452371,0.1375));
#350=CARTESIAN_POINT('',(-1.00782920039912,0.225572512010338,0.20625));
#351=CARTESIAN_POINT('',(-1.00745740309193,0.225201018306954,0.275));
#352=CARTESIAN_POINT('',(-0.951300937675622,0.429811710176119,-0.275));
#353=CARTESIAN_POINT('',(-0.945698621914186,0.424218058358487,-0.20625));
#354=CARTESIAN_POINT('',(-0.956203763034478,0.43469016299583,-0.1375));
#355=CARTESIAN_POINT('',(-0.956615482756383,0.435089820323842,-0.0687500000000308));
#356=CARTESIAN_POINT('',(-0.954793235710465,0.433315261106064,6.58132696742316E-14));
#357=CARTESIAN_POINT('',(-0.956615482769844,0.435089820336505,0.0687499999999261));
#358=CARTESIAN_POINT('',(-0.956203762961391,0.434690162923095,0.1375));
#359=CARTESIAN_POINT('',(-0.945698621980056,0.424218058423331,0.20625));
#360=CARTESIAN_POINT('',(-0.951300937713848,0.429811710214616,0.275));
#361=CARTESIAN_POINT('',(-0.834033185694549,0.573253439780473,-0.275));
#362=CARTESIAN_POINT('',(-0.822424448042492,0.561631050321554,-0.20625));
#363=CARTESIAN_POINT('',(-0.830781990915794,0.570034703967443,-0.1375));
#364=CARTESIAN_POINT('',(-0.894339364731454,0.633622464122198,-0.0687499999999067));
#365=CARTESIAN_POINT('',(-0.823601229629558,0.562787935878653,-1.59605943552039E-13));
#366=CARTESIAN_POINT('',(-0.894339364788568,0.633622464168856,0.0687500000001665));
#367=CARTESIAN_POINT('',(-0.830781990866628,0.570034703925828,0.1375));
#368=CARTESIAN_POINT('',(-0.822424448045988,0.561631050328522,0.20625));
#369=CARTESIAN_POINT('',(-0.834033185688113,0.573253439771562,0.275));
#370=CARTESIAN_POINT('',(-0.760073477481061,0.760073477473658,-0.275));
#371=CARTESIAN_POINT('',(-0.761480100036292,0.761480100030923,-0.20625));
#372=CARTESIAN_POINT('',(-0.742159365836899,0.742159365847066,-0.1375));
#373=CARTESIAN_POINT('',(-0.67835111222614,0.678351112204147,-0.0687500000001727));
#374=CARTESIAN_POINT('',(-0.806293745366823,0.806293745393503,2.50364531071322E-13));
#375=CARTESIAN_POINT('',(-0.678351111986841,0.678351111972154,0.0687499999997475));
#376=CARTESIAN_POINT('',(-0.742159366165767,0.742159366171417,0.1375));
#377=CARTESIAN_POINT('',(-0.761480099872501,0.761480099864141,0.20625));
#378=CARTESIAN_POINT('',(-0.760073477432224,0.760073477429954,0.275));
#379=CARTESIAN_POINT('',(-0.573253439807304,0.834033185723652,-0.275));
#380=CARTESIAN_POINT('',(-0.561631050386166,0.822424448106028,-0.20625));
#381=CARTESIAN_POINT('',(-0.570034703931932,0.830781990867439,-0.1375));
#382=CARTESIAN_POINT('',(-0.633622464103074,0.894339364720988,-0.0687499999998462));
#383=CARTESIAN_POINT('',(-0.562787935965141,0.823601229677867,-2.3152800585725E-13));
#384=CARTESIAN_POINT('',(-0.633622464349839,0.89433936499392,0.0687500000002271));
#385=CARTESIAN_POINT('',(-0.570034703464298,0.830781990380176,0.1375));
#386=CARTESIAN_POINT('',(-0.561631050622833,0.822424448348544,0.20625));
#387=CARTESIAN_POINT('',(-0.573253439900507,0.834033185815069,0.275));
#388=CARTESIAN_POINT('',(-0.429811710145805,0.951300937640706,-0.275));
#389=CARTESIAN_POINT('',(-0.424218058311273,0.945698621863319,-0.20625));
#390=CARTESIAN_POINT('',(-0.43469016305305,0.956203763078019,-0.1375));
#391=CARTESIAN_POINT('',(-0.435089820441894,0.956615482898725,-0.0687500000000768));
#392=CARTESIAN_POINT('',(-0.433315261163677,0.954793235739845,1.18632265638639E-13));
#393=CARTESIAN_POINT('',(-0.435089820338284,0.956615482780142,0.0687499999998801));
#394=CARTESIAN_POINT('',(-0.434690163292136,0.956203763329229,0.1375));
#395=CARTESIAN_POINT('',(-0.424218058120529,0.945698621671207,0.20625));
#396=CARTESIAN_POINT('',(-0.429811710065404,0.951300937559201,0.275));
#397=CARTESIAN_POINT('',(-0.225201018346796,1.00745740312746,-0.275));
#398=CARTESIAN_POINT('',(-0.225572512070518,1.00782920045488,-0.20625));
#399=CARTESIAN_POINT('',(-0.220105251480271,1.00236108664036,-0.1375));
#400=CARTESIAN_POINT('',(-0.225883284404704,1.0081546481852,-0.0687499999999844));
#401=CARTESIAN_POINT('',(-0.219346330050802,1.00159276705441,-1.90490821617375E-14));
#402=CARTESIAN_POINT('',(-0.225883284467794,1.00815464825094,0.0687500000000226));
#403=CARTESIAN_POINT('',(-0.220105251470673,1.00236108663082,0.1375));
#404=CARTESIAN_POINT('',(-0.22557251213374,1.00782920051941,0.20625));
#405=CARTESIAN_POINT('',(-0.225201018395589,1.0074574031769,0.275));
#406=CARTESIAN_POINT('',(0.0442911171802638,0.998717669071815,-0.275));
#407=CARTESIAN_POINT('',(0.0428933919814692,1.00011685008198,-0.20625));
#408=CARTESIAN_POINT('',(0.0443664909872812,0.998641726043079,-0.1375));
#409=CARTESIAN_POINT('',(0.0401571311795543,1.00285386047933,-0.068749999999995));
#410=CARTESIAN_POINT('',(0.047357317324507,0.995649365015264,-3.5001247234687E-15));
#411=CARTESIAN_POINT('',(0.0401571311677695,1.00285386049838,0.0687500000000074));
#412=CARTESIAN_POINT('',(0.0443664910235789,0.998641726004116,0.1375));
#413=CARTESIAN_POINT('',(0.0428933919672108,1.00011685009816,0.20625));
#414=CARTESIAN_POINT('',(0.0442911172044627,0.998717669048581,0.275));
#415=EDGE_LOOP('',(#455,#456,#457,#458));
#416=AXIS2_PLACEMENT_3D('',#459,#460,#461);
#417=ORIENTED_EDGE('',*,*,#462,.T.);
#418=ORIENTED_EDGE('',*,*,#463,.T.);
#419=ORIENTED_EDGE('',*,*,#464,.F.);
#420=ORIENTED_EDGE('',*,*,#465,.F.);
#421=ORIENTED_EDGE('',*,*,#466,.T.);
#422=CARTESIAN_POINT('',(-0.475287100756,0.475287100756,0.25));
#423=DIRECTION('',(0.0,0.0,1.0));
#424=DIRECTION('',(1.0,-0.0,0.0));
#425=ORIENTED_EDGE('',*,*,#462,.F.);
#426=ORIENTED_EDGE('',*,*,#467,.F.);
#427=ORIENTED_EDGE('',*,*,#468,.T.);
#428=CARTESIAN_POINT('',(0.0,0.75,0.0));
#429=DIRECTION('',(-1.0,0.0,0.0));
#430=DIRECTION('',(0.0,0.0,1.0));
#431=ORIENTED_EDGE('',*,*,#466,.F.);
#432=ORIENTED_EDGE('',*,*,#469,.F.);
#433=ORIENTED_EDGE('',*,*,#470,.T.);
#434=ORIENTED_EDGE('',*,*,#471,.T.);
#435=ORIENTED_EDGE('',*,*,#467,.T.);
#436=ORIENTED_EDGE('',*,*,#472,.F.);
#437=ORIENTED_EDGE('',*,*,#463,.F.);
#438=ORIENTED_EDGE('',*,*,#468,.F.);
#439=ORIENTED_EDGE('',*,*,#471,.F.);
#440=ORIENTED_EDGE('',*,*,#473,.F.);
#441=CARTESIAN_POINT('',(0.0,0.75,0.0));
#442=DIRECTION('',(-1.0,0.0,0.0));
#443=DIRECTION('',(0.0,0.0,1.0));
#444=ORIENTED_EDGE('',*,*,#469,.T.);
#445=ORIENTED_EDGE('',*,*,#465,.T.);
#446=ORIENTED_EDGE('',*,*,#474,.F.);
#447=ORIENTED_EDGE('',*,*,#475,.T.);
#448=CARTESIAN_POINT('',(-0.75,0.0,0.0));
#449=DIRECTION('',(0.0,-1.0,0.0));
#450=DIRECTION('',(0.0,0.0,-1.0));
#451=ORIENTED_EDGE('',*,*,#472,.T.);
#452=ORIENTED_EDGE('',*,*,#476,.F.);
#453=ORIENTED_EDGE('',*,*,#474,.T.);
#454=ORIENTED_EDGE('',*,*,#464,.T.);
#455=ORIENTED_EDGE('',*,*,#473,.T.);
#456=ORIENTED_EDGE('',*,*,#470,.F.);
#457=ORIENTED_EDGE('',*,*,#475,.F.);
#458=ORIENTED_EDGE('',*,*,#476,.T.);
#459=CARTESIAN_POINT('',(-0.475287100756,0.475287100756,-0.25));
#460=DIRECTION('',(-0.0,-0.0,-1.0));
#461=DIRECTION('',(0.0,-1.0,0.0));
#462=EDGE_CURVE('',#477,#478,#479,.T.);
#463=EDGE_CURVE('',#478,#480,#481,.T.);
#464=EDGE_CURVE('',#482,#480,#483,.T.);
#465=EDGE_CURVE('',#484,#482,#485,.T.);
#466=EDGE_CURVE('',#484,#477,#486,.T.);
#467=EDGE_CURVE('',#487,#477,#488,.T.);
#468=EDGE_CURVE('',#487,#478,#489,.T.);
#469=EDGE_CURVE('',#490,#484,#491,.T.);
#470=EDGE_CURVE('',#490,#492,#493,.T.);
#471=EDGE_CURVE('',#492,#487,#494,.T.);
#472=EDGE_CURVE('',#480,#495,#496,.T.);
#473=EDGE_CURVE('',#495,#492,#497,.T.);
#474=EDGE_CURVE('',#498,#482,#499,.T.);
#475=EDGE_CURVE('',#498,#490,#500,.T.);
#476=EDGE_CURVE('',#498,#495,#501,.T.);
#477=VERTEX_POINT('',#502);
#478=VERTEX_POINT('',#503);
#479=LINE('',#504,#505);
#480=VERTEX_POINT('',#506);
#481=LINE('',#507,#508);
#482=VERTEX_POINT('',#509);
#483=CIRCLE('',#510,1.0);
#484=VERTEX_POINT('',#511);
#485=LINE('',#512,#513);
#486=CIRCLE('',#514,0.5);
#487=VERTEX_POINT('',#515);
#488=LINE('',#516,#517);
#489=CIRCLE('',#518,0.25);
#490=VERTEX_POINT('',#519);
#491=LINE('',#520,#521);
#492=VERTEX_POINT('',#522);
#493=CIRCLE('',#523,0.5);
#494=LINE('',#524,#525);
#495=VERTEX_POINT('',#526);
#496=LINE('',#527,#528);
#497=LINE('',#529,#530);
#498=VERTEX_POINT('',#531);
#499=LINE('',#532,#533);
#500=LINE('',#534,#535);
#501=CIRCLE('',#536,1.0);
#502=CARTESIAN_POINT('',(0.0,0.5,0.25));
#503=CARTESIAN_POINT('',(0.0,0.794948974278,0.25));
#504=CARTESIAN_POINT('',(0.0,0.5,0.25));
#505=VECTOR('',#537,1.0);
#506=CARTESIAN_POINT('',(0.0,1.0,0.25));
#507=CARTESIAN_POINT('',(0.0,0.5,0.25));
#508=VECTOR('',#538,1.0);
#509=CARTESIAN_POINT('',(-1.0,0.0,0.25));
#510=AXIS2_PLACEMENT_3D('',#539,#540,#541);
#511=CARTESIAN_POINT('',(-0.5,0.0,0.25));
#512=CARTESIAN_POINT('',(-0.5,0.0,0.25));
#513=VECTOR('',#542,1.0);
#514=AXIS2_PLACEMENT_3D('',#543,#544,#545);
#515=CARTESIAN_POINT('',(0.0,0.5,-0.04494897427832));
#516=CARTESIAN_POINT('',(0.0,0.5,-0.25));
#517=VECTOR('',#546,1.0);
#518=AXIS2_PLACEMENT_3D('',#547,#548,#549);
#519=CARTESIAN_POINT('',(-0.5,0.0,-0.25));
#520=CARTESIAN_POINT('',(-0.5,0.0,-0.25));
#521=VECTOR('',#550,1.0);
#522=CARTESIAN_POINT('',(0.0,0.5,-0.25));
#523=AXIS2_PLACEMENT_3D('',#551,#552,#553);
#524=CARTESIAN_POINT('',(0.0,0.5,-0.25));
#525=VECTOR('',#554,1.0);
#526=CARTESIAN_POINT('',(0.0,1.0,-0.25));
#527=CARTESIAN_POINT('',(0.0,1.0,0.25));
#528=VECTOR('',#555,1.0);
#529=CARTESIAN_POINT('',(0.0,1.0,-0.25));
#530=VECTOR('',#556,1.0);
#531=CARTESIAN_POINT('',(-1.0,0.0,-0.25));
#532=CARTESIAN_POINT('',(-1.0,0.0,-0.25));
#533=VECTOR('',#557,1.0);
#534=CARTESIAN_POINT('',(-1.0,0.0,-0.25));
#535=VECTOR('',#558,1.0);
#536=AXIS2_PLACEMENT_3D('',#559,#560,#561);
#537=DIRECTION('',(0.0,1.0,0.0));
#538=DIRECTION('',(0.0,1.0,0.0));
#539=CARTESIAN_POINT('',(0.0,0.0,0.25));
#540=DIRECTION('',(0.0,0.0,-1.0));
#541=DIRECTION('',(1.0,0.0,0.0));
#542=DIRECTION('',(-1.0,0.0,0.0));
#543=CARTESIAN_POINT('',(0.0,0.0,0.25));
#544=DIRECTION('',(0.0,0.0,-1.0));
#545=DIRECTION('',(1.0,0.0,0.0));
#546=DIRECTION('',(0.0,0.0,1.0));
#547=CARTESIAN_POINT('',(0.0,0.55,0.2));
#548=DIRECTION('',(1.0,0.0,0.0));
#549=DIRECTION('',(-0.0,0.0,1.0));
#550=DIRECTION('',(0.0,0.0,1.0));
#551=CARTESIAN_POINT('',(0.0,0.0,-0.25));
#552=DIRECTION('',(0.0,0.0,-1.0));
#553=DIRECTION('',(1.0,0.0,0.0));
#554=DIRECTION('',(0.0,0.0,1.0));
#555=DIRECTION('',(0.0,0.0,-1.0));
#556=DIRECTION('',(0.0,-1.0,0.0));
#557=DIRECTION('',(0.0,0.0,1.0));
#558=DIRECTION('',(1.0,0.0,0.0));
#559=CARTESIAN_POINT('',(0.0,0.0,-0.25));
#560=DIRECTION('',(0.0,0.0,-1.0));
#561=DIRECTION('',(1.0,0.0,0.0));
ENDSEC;
END-ISO-10303-21;
