ISO-10303-21;
HEADER;
FILE_DESCRIPTION(('STEP AP214'),'1');
FILE_NAME('B14.step','2023-05-04T14:49:57',('Mambo'),(' '),'Spatial InterOp 3D',' ',' ');
FILE_SCHEMA(('automotive_design'));
ENDSEC;
DATA;
#1=PRODUCT_DEFINITION_CONTEXT('',#9,'design');
#2=APPLICATION_PROTOCOL_DEFINITION('INTERNATIONAL STANDARD','automotive_design',1994,#9);
#3=PRODUCT_CATEGORY_RELATIONSHIP('NONE','NONE',#10,#11);
#4=SHAPE_DEFINITION_REPRESENTATION(#12,#13);
#5= (GEOMETRIC_REPRESENTATION_CONTEXT(3)GLOBAL_UNCERTAINTY_ASSIGNED_CONTEXT((#16))GLOBAL_UNIT_ASSIGNED_CONTEXT((#18,#19,#20))REPRESENTATION_CONTEXT('NONE','WORKSPACE'));
#9=APPLICATION_CONTEXT(' ');
#10=PRODUCT_CATEGORY('part','NONE');
#11=PRODUCT_RELATED_PRODUCT_CATEGORY('detail',' ',(#22));
#12=PRODUCT_DEFINITION_SHAPE('NONE','NONE',#23);
#13=ADVANCED_BREP_SHAPE_REPRESENTATION('1',(#24,#25),#5);
#16=UNCERTAINTY_MEASURE_WITH_UNIT(LENGTH_MEASURE(1.0E-06),#18,'','');
#18= (CONVERSION_BASED_UNIT('MILLIMETRE',#28)LENGTH_UNIT()NAMED_UNIT(#31));
#19= (NAMED_UNIT(#33)PLANE_ANGLE_UNIT()SI_UNIT($,.RADIAN.));
#20= (NAMED_UNIT(#33)SOLID_ANGLE_UNIT()SI_UNIT($,.STERADIAN.));
#22=PRODUCT('1','1','PART-1-DESC',(#39));
#23=PRODUCT_DEFINITION('NONE','NONE',#40,#1);
#24=MANIFOLD_SOLID_BREP('1',#41);
#25=AXIS2_PLACEMENT_3D('',#42,#43,#44);
#28=LENGTH_MEASURE_WITH_UNIT(LENGTH_MEASURE(1.0),#45);
#31=DIMENSIONAL_EXPONENTS(1.0,0.0,0.0,0.0,0.0,0.0,0.0);
#33=DIMENSIONAL_EXPONENTS(0.0,0.0,0.0,0.0,0.0,0.0,0.0);
#39=PRODUCT_CONTEXT('',#9,'mechanical');
#40=PRODUCT_DEFINITION_FORMATION_WITH_SPECIFIED_SOURCE(' ','NONE',#22,.NOT_KNOWN.);
#41=CLOSED_SHELL('',(#46,#47,#48));
#42=CARTESIAN_POINT('',(0.0,0.0,0.0));
#43=DIRECTION('',(0.0,0.0,1.0));
#44=DIRECTION('',(1.0,0.0,0.0));
#45= (NAMED_UNIT(#31)LENGTH_UNIT()SI_UNIT(.MILLI.,.METRE.));
#46=ADVANCED_FACE('',(#50,#51),#52,.T.);
#47=ADVANCED_FACE('',(#53),#54,.T.);
#48=ADVANCED_FACE('',(#55),#56,.F.);
#50=FACE_BOUND('',#57,.T.);
#51=FACE_BOUND('',#58,.T.);
#52=CYLINDRICAL_SURFACE('',#59,100.0);
#53=FACE_OUTER_BOUND('',#60,.T.);
#54=PLANE('',#61);
#55=FACE_OUTER_BOUND('',#62,.T.);
#56=PLANE('',#63);
#57=EDGE_LOOP('',(#64));
#58=EDGE_LOOP('',(#65));
#59=AXIS2_PLACEMENT_3D('',#66,#67,#68);
#60=EDGE_LOOP('',(#69));
#61=AXIS2_PLACEMENT_3D('',#70,#71,#72);
#62=EDGE_LOOP('',(#73));
#63=AXIS2_PLACEMENT_3D('',#74,#75,#76);
#64=ORIENTED_EDGE('',*,*,#77,.T.);
#65=ORIENTED_EDGE('',*,*,#78,.F.);
#66=CARTESIAN_POINT('',(1.1,1.4,0.2));
#67=DIRECTION('',(-1.0,-0.0,0.0));
#68=DIRECTION('',(0.0,0.0,1.0));
#69=ORIENTED_EDGE('',*,*,#78,.T.);
#70=CARTESIAN_POINT('',(2.1,1.4,0.2));
#71=DIRECTION('',(1.0,0.0,0.0));
#72=DIRECTION('',(0.0,1.0,-0.0));
#73=ORIENTED_EDGE('',*,*,#77,.F.);
#74=CARTESIAN_POINT('',(1.1,1.4,0.2));
#75=DIRECTION('',(1.0,0.0,0.0));
#76=DIRECTION('',(0.0,1.0,-0.0));
#77=EDGE_CURVE('',#79,#79,#80,.T.);
#78=EDGE_CURVE('',#81,#81,#82,.T.);
#79=VERTEX_POINT('',#83);
#80=CIRCLE('',#84,100.0);
#81=VERTEX_POINT('',#85);
#82=CIRCLE('',#86,100.0);
#83=CARTESIAN_POINT('',(1.1,1.39999999999999,-99.8));
#84=AXIS2_PLACEMENT_3D('',#87,#88,#89);
#85=CARTESIAN_POINT('',(2.1,1.39999999999999,-99.8));
#86=AXIS2_PLACEMENT_3D('',#90,#91,#92);
#87=CARTESIAN_POINT('',(1.1,1.4,0.2));
#88=DIRECTION('',(1.0,0.0,0.0));
#89=DIRECTION('',(-0.0,0.0,1.0));
#90=CARTESIAN_POINT('',(2.1,1.4,0.2));
#91=DIRECTION('',(1.0,0.0,0.0));
#92=DIRECTION('',(-0.0,0.0,1.0));
ENDSEC;
END-ISO-10303-21;
