ISO-10303-21;
HEADER;
FILE_DESCRIPTION(('STEP AP214'),'1');
FILE_NAME('M9.step','2021-10-14T07:45:12',('MGX'),(' '),'Spatial InterOp 3D',' ',' ');
FILE_SCHEMA(('automotive_design'));
ENDSEC;
DATA;
#1=PRODUCT_DEFINITION_CONTEXT('',#9,'design');
#2=APPLICATION_PROTOCOL_DEFINITION('INTERNATIONAL STANDARD','automotive_design',1994,#9);
#3=PRODUCT_CATEGORY_RELATIONSHIP('NONE','NONE',#10,#11);
#4=SHAPE_DEFINITION_REPRESENTATION(#12,#13);
#5= (GEOMETRIC_REPRESENTATION_CONTEXT(3)GLOBAL_UNCERTAINTY_ASSIGNED_CONTEXT((#16))GLOBAL_UNIT_ASSIGNED_CONTEXT((#18,#19,#20))REPRESENTATION_CONTEXT('NONE','WORKSPACE'));
#9=APPLICATION_CONTEXT(' ');
#10=PRODUCT_CATEGORY('part','NONE');
#11=PRODUCT_RELATED_PRODUCT_CATEGORY('detail',' ',(#22));
#12=PRODUCT_DEFINITION_SHAPE('NONE','NONE',#23);
#13=ADVANCED_BREP_SHAPE_REPRESENTATION('1',(#24,#25),#5);
#16=UNCERTAINTY_MEASURE_WITH_UNIT(LENGTH_MEASURE(1.0E-06),#18,'','');
#18= (CONVERSION_BASED_UNIT('MILLIMETRE',#28)LENGTH_UNIT()NAMED_UNIT(#31));
#19= (NAMED_UNIT(#33)PLANE_ANGLE_UNIT()SI_UNIT($,.RADIAN.));
#20= (NAMED_UNIT(#33)SOLID_ANGLE_UNIT()SI_UNIT($,.STERADIAN.));
#22=PRODUCT('1','1','PART-1-DESC',(#39));
#23=PRODUCT_DEFINITION('NONE','NONE',#40,#1);
#24=MANIFOLD_SOLID_BREP('1',#41);
#25=AXIS2_PLACEMENT_3D('',#42,#43,#44);
#28=LENGTH_MEASURE_WITH_UNIT(LENGTH_MEASURE(1.0),#45);
#31=DIMENSIONAL_EXPONENTS(1.0,0.0,0.0,0.0,0.0,0.0,0.0);
#33=DIMENSIONAL_EXPONENTS(0.0,0.0,0.0,0.0,0.0,0.0,0.0);
#39=PRODUCT_CONTEXT('',#9,'mechanical');
#40=PRODUCT_DEFINITION_FORMATION_WITH_SPECIFIED_SOURCE(' ','NONE',#22,.NOT_KNOWN.);
#41=CLOSED_SHELL('',(#46,#47,#48,#49,#50,#51,#52,#53,#54,#55,#56,#57,#58,#59,#60,#61,#62,#63,#64,#65,#66,#67,#68,#69,#70,#71,#72,#73,#74,#75,#76,#77,#78,#79,#80,#81,#82,#83,#84,#85));
#42=CARTESIAN_POINT('',(0.0,0.0,0.0));
#43=DIRECTION('',(0.0,0.0,1.0));
#44=DIRECTION('',(1.0,0.0,0.0));
#45= (NAMED_UNIT(#31)LENGTH_UNIT()SI_UNIT(.MILLI.,.METRE.));
#46=ADVANCED_FACE('',(#87),#88,.T.);
#47=ADVANCED_FACE('',(#89,#90),#91,.F.);
#48=ADVANCED_FACE('',(#92,#93),#94,.F.);
#49=ADVANCED_FACE('',(#95,#96,#97,#98),#99,.T.);
#50=ADVANCED_FACE('',(#100),#101,.F.);
#51=ADVANCED_FACE('',(#102),#103,.F.);
#52=ADVANCED_FACE('',(#104),#105,.F.);
#53=ADVANCED_FACE('',(#106),#107,.F.);
#54=ADVANCED_FACE('',(#108),#109,.T.);
#55=ADVANCED_FACE('',(#110,#111),#112,.F.);
#56=ADVANCED_FACE('',(#113,#114),#115,.F.);
#57=ADVANCED_FACE('',(#116),#117,.F.);
#58=ADVANCED_FACE('',(#118),#119,.F.);
#59=ADVANCED_FACE('',(#120),#121,.T.);
#60=ADVANCED_FACE('',(#122),#123,.T.);
#61=ADVANCED_FACE('',(#124,#125),#126,.F.);
#62=ADVANCED_FACE('',(#127,#128),#129,.F.);
#63=ADVANCED_FACE('',(#130,#131),#132,.T.);
#64=ADVANCED_FACE('',(#133,#134),#135,.F.);
#65=ADVANCED_FACE('',(#136,#137),#138,.T.);
#66=ADVANCED_FACE('',(#139,#140),#141,.F.);
#67=ADVANCED_FACE('',(#142,#143),#144,.F.);
#68=ADVANCED_FACE('',(#145),#146,.T.);
#69=ADVANCED_FACE('',(#147),#148,.T.);
#70=ADVANCED_FACE('',(#149),#150,.T.);
#71=ADVANCED_FACE('',(#151),#152,.T.);
#72=ADVANCED_FACE('',(#153),#154,.T.);
#73=ADVANCED_FACE('',(#155,#156),#157,.T.);
#74=ADVANCED_FACE('',(#158,#159),#160,.F.);
#75=ADVANCED_FACE('',(#161),#162,.T.);
#76=ADVANCED_FACE('',(#163),#164,.T.);
#77=ADVANCED_FACE('',(#165,#166),#167,.F.);
#78=ADVANCED_FACE('',(#168,#169),#170,.F.);
#79=ADVANCED_FACE('',(#171,#172),#173,.F.);
#80=ADVANCED_FACE('',(#174,#175),#176,.F.);
#81=ADVANCED_FACE('',(#177,#178,#179,#180),#181,.F.);
#82=ADVANCED_FACE('',(#182,#183),#184,.F.);
#83=ADVANCED_FACE('',(#185),#186,.T.);
#84=ADVANCED_FACE('',(#187),#188,.T.);
#85=ADVANCED_FACE('',(#189),#190,.T.);
#87=FACE_OUTER_BOUND('',#191,.T.);
#88=CYLINDRICAL_SURFACE('',#192,12.5);
#89=FACE_BOUND('',#193,.T.);
#90=FACE_BOUND('',#194,.T.);
#91=CYLINDRICAL_SURFACE('',#195,5.5);
#92=FACE_BOUND('',#196,.T.);
#93=FACE_BOUND('',#197,.T.);
#94=CYLINDRICAL_SURFACE('',#198,5.5);
#95=FACE_OUTER_BOUND('',#199,.T.);
#96=FACE_BOUND('',#200,.T.);
#97=FACE_BOUND('',#201,.T.);
#98=FACE_BOUND('',#202,.T.);
#99=PLANE('',#203);
#100=FACE_OUTER_BOUND('',#204,.T.);
#101=PLANE('',#205);
#102=FACE_OUTER_BOUND('',#206,.T.);
#103=PLANE('',#207);
#104=FACE_OUTER_BOUND('',#208,.T.);
#105=PLANE('',#209);
#106=FACE_OUTER_BOUND('',#210,.T.);
#107=PLANE('',#211);
#108=FACE_OUTER_BOUND('',#212,.T.);
#109=CYLINDRICAL_SURFACE('',#213,12.5);
#110=FACE_BOUND('',#214,.T.);
#111=FACE_BOUND('',#215,.T.);
#112=CONICAL_SURFACE('',#216,7.75,0.7853981634);
#113=FACE_BOUND('',#217,.T.);
#114=FACE_BOUND('',#218,.T.);
#115=CONICAL_SURFACE('',#219,7.75,0.7853981634);
#116=FACE_OUTER_BOUND('',#220,.T.);
#117=PLANE('',#221);
#118=FACE_OUTER_BOUND('',#222,.T.);
#119=PLANE('',#223);
#120=FACE_OUTER_BOUND('',#224,.T.);
#121=CYLINDRICAL_SURFACE('',#225,25.0);
#122=FACE_OUTER_BOUND('',#226,.T.);
#123=CYLINDRICAL_SURFACE('',#227,25.0);
#124=FACE_BOUND('',#228,.T.);
#125=FACE_BOUND('',#229,.T.);
#126=TOROIDAL_SURFACE('',#230,25.5,4.0);
#127=FACE_BOUND('',#231,.T.);
#128=FACE_BOUND('',#232,.T.);
#129=CONICAL_SURFACE('',#233,18.75,0.7853981634);
#130=FACE_BOUND('',#234,.T.);
#131=FACE_BOUND('',#235,.T.);
#132=CYLINDRICAL_SURFACE('',#236,21.5);
#133=FACE_BOUND('',#237,.T.);
#134=FACE_BOUND('',#238,.T.);
#135=CYLINDRICAL_SURFACE('',#239,17.5);
#136=FACE_BOUND('',#240,.T.);
#137=FACE_BOUND('',#241,.T.);
#138=TOROIDAL_SURFACE('',#242,65.0,21.5);
#139=FACE_BOUND('',#243,.T.);
#140=FACE_BOUND('',#244,.T.);
#141=TOROIDAL_SURFACE('',#245,65.0,17.5);
#142=FACE_BOUND('',#246,.T.);
#143=FACE_BOUND('',#247,.T.);
#144=CYLINDRICAL_SURFACE('',#248,17.5);
#145=FACE_OUTER_BOUND('',#249,.T.);
#146=CYLINDRICAL_SURFACE('',#250,25.0);
#147=FACE_OUTER_BOUND('',#251,.T.);
#148=PLANE('',#252);
#149=FACE_OUTER_BOUND('',#253,.T.);
#150=PLANE('',#254);
#151=FACE_OUTER_BOUND('',#255,.T.);
#152=PLANE('',#256);
#153=FACE_OUTER_BOUND('',#257,.T.);
#154=PLANE('',#258);
#155=FACE_BOUND('',#259,.T.);
#156=FACE_BOUND('',#260,.T.);
#157=CYLINDRICAL_SURFACE('',#261,21.5);
#158=FACE_BOUND('',#262,.T.);
#159=FACE_BOUND('',#263,.T.);
#160=CONICAL_SURFACE('',#264,18.75,0.7853981634);
#161=FACE_OUTER_BOUND('',#265,.T.);
#162=CYLINDRICAL_SURFACE('',#266,12.5);
#163=FACE_OUTER_BOUND('',#267,.T.);
#164=CYLINDRICAL_SURFACE('',#268,12.5);
#165=FACE_BOUND('',#269,.T.);
#166=FACE_BOUND('',#270,.T.);
#167=CONICAL_SURFACE('',#271,7.75,0.7853981634);
#168=FACE_BOUND('',#272,.T.);
#169=FACE_BOUND('',#273,.T.);
#170=CONICAL_SURFACE('',#274,7.75,0.7853981634);
#171=FACE_BOUND('',#275,.T.);
#172=FACE_BOUND('',#276,.T.);
#173=CYLINDRICAL_SURFACE('',#277,5.5);
#174=FACE_BOUND('',#278,.T.);
#175=FACE_BOUND('',#279,.T.);
#176=CYLINDRICAL_SURFACE('',#280,5.5);
#177=FACE_OUTER_BOUND('',#281,.T.);
#178=FACE_BOUND('',#282,.T.);
#179=FACE_BOUND('',#283,.T.);
#180=FACE_BOUND('',#284,.T.);
#181=PLANE('',#285);
#182=FACE_BOUND('',#286,.T.);
#183=FACE_BOUND('',#287,.T.);
#184=TOROIDAL_SURFACE('',#288,25.5,4.0);
#185=FACE_OUTER_BOUND('',#289,.T.);
#186=PLANE('',#290);
#187=FACE_OUTER_BOUND('',#291,.T.);
#188=PLANE('',#292);
#189=FACE_OUTER_BOUND('',#293,.T.);
#190=CYLINDRICAL_SURFACE('',#294,25.0);
#191=EDGE_LOOP('',(#295,#296,#297,#298));
#192=AXIS2_PLACEMENT_3D('',#299,#300,#301);
#193=EDGE_LOOP('',(#302));
#194=EDGE_LOOP('',(#303));
#195=AXIS2_PLACEMENT_3D('',#304,#305,#306);
#196=EDGE_LOOP('',(#307));
#197=EDGE_LOOP('',(#308));
#198=AXIS2_PLACEMENT_3D('',#309,#310,#311);
#199=EDGE_LOOP('',(#312,#313,#314,#315,#316,#317,#318,#319));
#200=EDGE_LOOP('',(#320));
#201=EDGE_LOOP('',(#321));
#202=EDGE_LOOP('',(#322));
#203=AXIS2_PLACEMENT_3D('',#323,#324,#325);
#204=EDGE_LOOP('',(#326,#327,#328,#329,#330));
#205=AXIS2_PLACEMENT_3D('',#331,#332,#333);
#206=EDGE_LOOP('',(#334,#335,#336,#337,#338));
#207=AXIS2_PLACEMENT_3D('',#339,#340,#341);
#208=EDGE_LOOP('',(#342,#343,#344,#345,#346,#347));
#209=AXIS2_PLACEMENT_3D('',#348,#349,#350);
#210=EDGE_LOOP('',(#351,#352,#353,#354,#355,#356));
#211=AXIS2_PLACEMENT_3D('',#357,#358,#359);
#212=EDGE_LOOP('',(#360,#361,#362,#363));
#213=AXIS2_PLACEMENT_3D('',#364,#365,#366);
#214=EDGE_LOOP('',(#367,#368));
#215=EDGE_LOOP('',(#369));
#216=AXIS2_PLACEMENT_3D('',#370,#371,#372);
#217=EDGE_LOOP('',(#373,#374));
#218=EDGE_LOOP('',(#375));
#219=AXIS2_PLACEMENT_3D('',#376,#377,#378);
#220=EDGE_LOOP('',(#379,#380,#381,#382,#383));
#221=AXIS2_PLACEMENT_3D('',#384,#385,#386);
#222=EDGE_LOOP('',(#387,#388,#389,#390,#391));
#223=AXIS2_PLACEMENT_3D('',#392,#393,#394);
#224=EDGE_LOOP('',(#395,#396,#397,#398));
#225=AXIS2_PLACEMENT_3D('',#399,#400,#401);
#226=EDGE_LOOP('',(#402,#403,#404,#405));
#227=AXIS2_PLACEMENT_3D('',#406,#407,#408);
#228=EDGE_LOOP('',(#409));
#229=EDGE_LOOP('',(#410,#411,#412,#413,#414,#415,#416,#417,#418,#419,#420,#421));
#230=AXIS2_PLACEMENT_3D('',#422,#423,#424);
#231=EDGE_LOOP('',(#425));
#232=EDGE_LOOP('',(#426));
#233=AXIS2_PLACEMENT_3D('',#427,#428,#429);
#234=EDGE_LOOP('',(#430));
#235=EDGE_LOOP('',(#431));
#236=AXIS2_PLACEMENT_3D('',#432,#433,#434);
#237=EDGE_LOOP('',(#435));
#238=EDGE_LOOP('',(#436));
#239=AXIS2_PLACEMENT_3D('',#437,#438,#439);
#240=EDGE_LOOP('',(#440));
#241=EDGE_LOOP('',(#441));
#242=AXIS2_PLACEMENT_3D('',#442,#443,#444);
#243=EDGE_LOOP('',(#445));
#244=EDGE_LOOP('',(#446));
#245=AXIS2_PLACEMENT_3D('',#447,#448,#449);
#246=EDGE_LOOP('',(#450));
#247=EDGE_LOOP('',(#451));
#248=AXIS2_PLACEMENT_3D('',#452,#453,#454);
#249=EDGE_LOOP('',(#455,#456,#457,#458));
#250=AXIS2_PLACEMENT_3D('',#459,#460,#461);
#251=EDGE_LOOP('',(#462,#463,#464,#465,#466));
#252=AXIS2_PLACEMENT_3D('',#467,#468,#469);
#253=EDGE_LOOP('',(#470,#471,#472,#473,#474));
#254=AXIS2_PLACEMENT_3D('',#475,#476,#477);
#255=EDGE_LOOP('',(#478,#479,#480,#481,#482,#483));
#256=AXIS2_PLACEMENT_3D('',#484,#485,#486);
#257=EDGE_LOOP('',(#487,#488,#489,#490,#491,#492));
#258=AXIS2_PLACEMENT_3D('',#493,#494,#495);
#259=EDGE_LOOP('',(#496));
#260=EDGE_LOOP('',(#497));
#261=AXIS2_PLACEMENT_3D('',#498,#499,#500);
#262=EDGE_LOOP('',(#501));
#263=EDGE_LOOP('',(#502));
#264=AXIS2_PLACEMENT_3D('',#503,#504,#505);
#265=EDGE_LOOP('',(#506,#507,#508,#509));
#266=AXIS2_PLACEMENT_3D('',#510,#511,#512);
#267=EDGE_LOOP('',(#513,#514,#515,#516));
#268=AXIS2_PLACEMENT_3D('',#517,#518,#519);
#269=EDGE_LOOP('',(#520,#521));
#270=EDGE_LOOP('',(#522));
#271=AXIS2_PLACEMENT_3D('',#523,#524,#525);
#272=EDGE_LOOP('',(#526,#527));
#273=EDGE_LOOP('',(#528));
#274=AXIS2_PLACEMENT_3D('',#529,#530,#531);
#275=EDGE_LOOP('',(#532));
#276=EDGE_LOOP('',(#533));
#277=AXIS2_PLACEMENT_3D('',#534,#535,#536);
#278=EDGE_LOOP('',(#537));
#279=EDGE_LOOP('',(#538));
#280=AXIS2_PLACEMENT_3D('',#539,#540,#541);
#281=EDGE_LOOP('',(#542,#543,#544,#545,#546,#547,#548,#549));
#282=EDGE_LOOP('',(#550));
#283=EDGE_LOOP('',(#551));
#284=EDGE_LOOP('',(#552));
#285=AXIS2_PLACEMENT_3D('',#553,#554,#555);
#286=EDGE_LOOP('',(#556));
#287=EDGE_LOOP('',(#557,#558,#559,#560,#561,#562,#563,#564,#565,#566,#567,#568));
#288=AXIS2_PLACEMENT_3D('',#569,#570,#571);
#289=EDGE_LOOP('',(#572,#573,#574,#575,#576));
#290=AXIS2_PLACEMENT_3D('',#577,#578,#579);
#291=EDGE_LOOP('',(#580,#581,#582,#583,#584));
#292=AXIS2_PLACEMENT_3D('',#585,#586,#587);
#293=EDGE_LOOP('',(#588,#589,#590,#591));
#294=AXIS2_PLACEMENT_3D('',#592,#593,#594);
#295=ORIENTED_EDGE('',*,*,#595,.T.);
#296=ORIENTED_EDGE('',*,*,#596,.T.);
#297=ORIENTED_EDGE('',*,*,#597,.T.);
#298=ORIENTED_EDGE('',*,*,#598,.T.);
#299=CARTESIAN_POINT('',(-1.285879139105E-14,-105.0,140.0));
#300=DIRECTION('',(-0.0,1.0,2.22044604925E-16));
#301=DIRECTION('',(1.0,0.0,0.0));
#302=ORIENTED_EDGE('',*,*,#599,.T.);
#303=ORIENTED_EDGE('',*,*,#600,.T.);
#304=CARTESIAN_POINT('',(-1.285879139105E-14,-244.5103519276,140.0));
#305=DIRECTION('',(-0.0,1.0,2.22044604925E-16));
#306=DIRECTION('',(1.0,0.0,0.0));
#307=ORIENTED_EDGE('',*,*,#601,.T.);
#308=ORIENTED_EDGE('',*,*,#602,.T.);
#309=CARTESIAN_POINT('',(-1.110223024625E-15,-244.5103519276,70.0));
#310=DIRECTION('',(-0.0,1.0,2.22044604925E-16));
#311=DIRECTION('',(1.0,0.0,0.0));
#312=ORIENTED_EDGE('',*,*,#603,.T.);
#313=ORIENTED_EDGE('',*,*,#604,.T.);
#314=ORIENTED_EDGE('',*,*,#605,.T.);
#315=ORIENTED_EDGE('',*,*,#606,.T.);
#316=ORIENTED_EDGE('',*,*,#607,.T.);
#317=ORIENTED_EDGE('',*,*,#608,.T.);
#318=ORIENTED_EDGE('',*,*,#609,.T.);
#319=ORIENTED_EDGE('',*,*,#597,.F.);
#320=ORIENTED_EDGE('',*,*,#599,.F.);
#321=ORIENTED_EDGE('',*,*,#601,.F.);
#322=ORIENTED_EDGE('',*,*,#610,.T.);
#323=CARTESIAN_POINT('',(-8.326672684689E-15,-105.0,130.79184641009));
#324=DIRECTION('',(0.0,-1.0,-2.22044604925E-16));
#325=DIRECTION('',(0.0,2.22044604925E-16,-1.0));
#326=ORIENTED_EDGE('',*,*,#611,.T.);
#327=ORIENTED_EDGE('',*,*,#612,.T.);
#328=ORIENTED_EDGE('',*,*,#605,.F.);
#329=ORIENTED_EDGE('',*,*,#613,.T.);
#330=ORIENTED_EDGE('',*,*,#614,.T.);
#331=CARTESIAN_POINT('',(-11.67562217019,-105.0,65.535714285714));
#332=DIRECTION('',(0.934049773615829,-7.93016446160655E-17,0.357142857142935));
#333=DIRECTION('',(0.0,-1.0,-2.22044604924935E-16));
#334=ORIENTED_EDGE('',*,*,#615,.T.);
#335=ORIENTED_EDGE('',*,*,#616,.T.);
#336=ORIENTED_EDGE('',*,*,#617,.T.);
#337=ORIENTED_EDGE('',*,*,#603,.F.);
#338=ORIENTED_EDGE('',*,*,#596,.F.);
#339=CARTESIAN_POINT('',(-23.35124434039,-105.0,113.92857142857));
#340=DIRECTION('',(0.934049773615829,7.93016446160655E-17,-0.357142857142935));
#341=DIRECTION('',(0.0,-1.0,-2.22044604924935E-16));
#342=ORIENTED_EDGE('',*,*,#618,.T.);
#343=ORIENTED_EDGE('',*,*,#615,.F.);
#344=ORIENTED_EDGE('',*,*,#595,.F.);
#345=ORIENTED_EDGE('',*,*,#619,.T.);
#346=ORIENTED_EDGE('',*,*,#620,.T.);
#347=ORIENTED_EDGE('',*,*,#621,.T.);
#348=CARTESIAN_POINT('',(-8.326672684689E-15,-97.0,130.79184641009));
#349=DIRECTION('',(0.0,-1.0,-2.22044604925E-16));
#350=DIRECTION('',(0.0,2.22044604925E-16,-1.0));
#351=ORIENTED_EDGE('',*,*,#622,.T.);
#352=ORIENTED_EDGE('',*,*,#623,.T.);
#353=ORIENTED_EDGE('',*,*,#624,.T.);
#354=ORIENTED_EDGE('',*,*,#625,.T.);
#355=ORIENTED_EDGE('',*,*,#626,.T.);
#356=ORIENTED_EDGE('',*,*,#611,.F.);
#357=CARTESIAN_POINT('',(-8.326672684689E-15,-97.0,130.79184641009));
#358=DIRECTION('',(0.0,-1.0,-2.22044604925E-16));
#359=DIRECTION('',(0.0,2.22044604925E-16,-1.0));
#360=ORIENTED_EDGE('',*,*,#627,.T.);
#361=ORIENTED_EDGE('',*,*,#606,.F.);
#362=ORIENTED_EDGE('',*,*,#612,.F.);
#363=ORIENTED_EDGE('',*,*,#626,.F.);
#364=CARTESIAN_POINT('',(0.0,-105.0,70.0));
#365=DIRECTION('',(-0.0,1.0,2.22044604925E-16));
#366=DIRECTION('',(1.0,0.0,0.0));
#367=ORIENTED_EDGE('',*,*,#621,.F.);
#368=ORIENTED_EDGE('',*,*,#628,.T.);
#369=ORIENTED_EDGE('',*,*,#600,.F.);
#370=CARTESIAN_POINT('',(-1.285879139105E-14,-99.25,140.0));
#371=DIRECTION('',(-0.0,1.0,2.22044604925E-16));
#372=DIRECTION('',(1.0,0.0,0.0));
#373=ORIENTED_EDGE('',*,*,#623,.F.);
#374=ORIENTED_EDGE('',*,*,#629,.T.);
#375=ORIENTED_EDGE('',*,*,#602,.F.);
#376=CARTESIAN_POINT('',(-1.110223024625E-15,-99.25,70.0));
#377=DIRECTION('',(-0.0,1.0,2.22044604925E-16));
#378=DIRECTION('',(1.0,0.0,0.0));
#379=ORIENTED_EDGE('',*,*,#619,.F.);
#380=ORIENTED_EDGE('',*,*,#598,.F.);
#381=ORIENTED_EDGE('',*,*,#609,.F.);
#382=ORIENTED_EDGE('',*,*,#630,.T.);
#383=ORIENTED_EDGE('',*,*,#631,.T.);
#384=CARTESIAN_POINT('',(11.675622170198,-105.0,144.46428571428));
#385=DIRECTION('',(-0.934049773615829,7.93016446160655E-17,-0.357142857142935));
#386=DIRECTION('',(-0.357142857142935,0.0,0.934049773615829));
#387=ORIENTED_EDGE('',*,*,#625,.F.);
#388=ORIENTED_EDGE('',*,*,#632,.T.);
#389=ORIENTED_EDGE('',*,*,#633,.T.);
#390=ORIENTED_EDGE('',*,*,#607,.F.);
#391=ORIENTED_EDGE('',*,*,#627,.F.);
#392=CARTESIAN_POINT('',(23.351244340397,-105.0,96.071428571428));
#393=DIRECTION('',(-0.934049773615829,-7.93016446160655E-17,0.357142857142935));
#394=DIRECTION('',(-8.49008766514427E-17,1.0,0.0));
#395=ORIENTED_EDGE('',*,*,#630,.F.);
#396=ORIENTED_EDGE('',*,*,#608,.F.);
#397=ORIENTED_EDGE('',*,*,#633,.F.);
#398=ORIENTED_EDGE('',*,*,#634,.T.);
#399=CARTESIAN_POINT('',(0.0,-105.0,105.0));
#400=DIRECTION('',(-0.0,1.0,2.22044604925E-16));
#401=DIRECTION('',(1.0,0.0,0.0));
#402=ORIENTED_EDGE('',*,*,#617,.F.);
#403=ORIENTED_EDGE('',*,*,#635,.T.);
#404=ORIENTED_EDGE('',*,*,#613,.F.);
#405=ORIENTED_EDGE('',*,*,#604,.F.);
#406=CARTESIAN_POINT('',(0.0,-105.0,105.0));
#407=DIRECTION('',(-0.0,1.0,2.22044604925E-16));
#408=DIRECTION('',(1.0,0.0,0.0));
#409=ORIENTED_EDGE('',*,*,#636,.T.);
#410=ORIENTED_EDGE('',*,*,#635,.F.);
#411=ORIENTED_EDGE('',*,*,#616,.F.);
#412=ORIENTED_EDGE('',*,*,#618,.F.);
#413=ORIENTED_EDGE('',*,*,#628,.F.);
#414=ORIENTED_EDGE('',*,*,#620,.F.);
#415=ORIENTED_EDGE('',*,*,#631,.F.);
#416=ORIENTED_EDGE('',*,*,#634,.F.);
#417=ORIENTED_EDGE('',*,*,#632,.F.);
#418=ORIENTED_EDGE('',*,*,#624,.F.);
#419=ORIENTED_EDGE('',*,*,#629,.F.);
#420=ORIENTED_EDGE('',*,*,#622,.F.);
#421=ORIENTED_EDGE('',*,*,#614,.F.);
#422=CARTESIAN_POINT('',(0.0,-93.0,105.0));
#423=DIRECTION('',(-0.0,-1.0,-2.22044604925E-16));
#424=DIRECTION('',(-1.0,0.0,0.0));
#425=ORIENTED_EDGE('',*,*,#637,.T.);
#426=ORIENTED_EDGE('',*,*,#610,.F.);
#427=CARTESIAN_POINT('',(0.0,-103.75,105.0));
#428=DIRECTION('',(-0.0,-1.0,-2.22044604925E-16));
#429=DIRECTION('',(-1.0,-0.0,0.0));
#430=ORIENTED_EDGE('',*,*,#638,.T.);
#431=ORIENTED_EDGE('',*,*,#636,.F.);
#432=CARTESIAN_POINT('',(0.0,-105.0,105.0));
#433=DIRECTION('',(0.0,1.0,2.22044604925E-16));
#434=DIRECTION('',(-1.0,-0.0,0.0));
#435=ORIENTED_EDGE('',*,*,#639,.T.);
#436=ORIENTED_EDGE('',*,*,#637,.F.);
#437=CARTESIAN_POINT('',(0.0,-105.0,105.0));
#438=DIRECTION('',(0.0,1.0,2.22044604925E-16));
#439=DIRECTION('',(-1.0,-0.0,0.0));
#440=ORIENTED_EDGE('',*,*,#638,.F.);
#441=ORIENTED_EDGE('',*,*,#640,.T.);
#442=CARTESIAN_POINT('',(0.0,-65.0,40.0));
#443=DIRECTION('',(1.0,0.0,0.0));
#444=DIRECTION('',(0.0,0.0,-1.0));
#445=ORIENTED_EDGE('',*,*,#639,.F.);
#446=ORIENTED_EDGE('',*,*,#641,.T.);
#447=CARTESIAN_POINT('',(0.0,-65.0,40.0));
#448=DIRECTION('',(1.0,0.0,0.0));
#449=DIRECTION('',(0.0,0.0,-1.0));
#450=ORIENTED_EDGE('',*,*,#641,.F.);
#451=ORIENTED_EDGE('',*,*,#642,.T.);
#452=CARTESIAN_POINT('',(0.0,0.0,0.0));
#453=DIRECTION('',(-0.0,0.0,-1.0));
#454=DIRECTION('',(-1.0,0.0,0.0));
#455=ORIENTED_EDGE('',*,*,#643,.T.);
#456=ORIENTED_EDGE('',*,*,#644,.T.);
#457=ORIENTED_EDGE('',*,*,#645,.T.);
#458=ORIENTED_EDGE('',*,*,#646,.T.);
#459=CARTESIAN_POINT('',(0.0,0.0,0.0));
#460=DIRECTION('',(0.0,0.0,-1.0));
#461=DIRECTION('',(1.0,0.0,0.0));
#462=ORIENTED_EDGE('',*,*,#647,.T.);
#463=ORIENTED_EDGE('',*,*,#648,.T.);
#464=ORIENTED_EDGE('',*,*,#645,.F.);
#465=ORIENTED_EDGE('',*,*,#649,.T.);
#466=ORIENTED_EDGE('',*,*,#650,.T.);
#467=CARTESIAN_POINT('',(-11.67562217019,-39.46428571428,0.0));
#468=DIRECTION('',(-0.934049773615829,-0.357142857142935,0.0));
#469=DIRECTION('',(-0.357142857142935,0.934049773615829,0.0));
#470=ORIENTED_EDGE('',*,*,#651,.T.);
#471=ORIENTED_EDGE('',*,*,#652,.T.);
#472=ORIENTED_EDGE('',*,*,#653,.T.);
#473=ORIENTED_EDGE('',*,*,#643,.F.);
#474=ORIENTED_EDGE('',*,*,#654,.T.);
#475=CARTESIAN_POINT('',(-23.35124434039,8.928571428571,0.0));
#476=DIRECTION('',(-0.934049773615829,0.357142857142935,0.0));
#477=DIRECTION('',(0.0,0.0,1.0));
#478=ORIENTED_EDGE('',*,*,#655,.T.);
#479=ORIENTED_EDGE('',*,*,#647,.F.);
#480=ORIENTED_EDGE('',*,*,#656,.T.);
#481=ORIENTED_EDGE('',*,*,#657,.T.);
#482=ORIENTED_EDGE('',*,*,#658,.T.);
#483=ORIENTED_EDGE('',*,*,#659,.T.);
#484=CARTESIAN_POINT('',(-8.326672684689E-15,25.791846410093,8.0));
#485=DIRECTION('',(0.0,0.0,1.0));
#486=DIRECTION('',(1.0,-0.0,0.0));
#487=ORIENTED_EDGE('',*,*,#660,.T.);
#488=ORIENTED_EDGE('',*,*,#661,.T.);
#489=ORIENTED_EDGE('',*,*,#662,.T.);
#490=ORIENTED_EDGE('',*,*,#663,.T.);
#491=ORIENTED_EDGE('',*,*,#664,.T.);
#492=ORIENTED_EDGE('',*,*,#651,.F.);
#493=CARTESIAN_POINT('',(-8.326672684689E-15,25.791846410093,8.0));
#494=DIRECTION('',(0.0,0.0,1.0));
#495=DIRECTION('',(1.0,-0.0,0.0));
#496=ORIENTED_EDGE('',*,*,#640,.F.);
#497=ORIENTED_EDGE('',*,*,#665,.T.);
#498=CARTESIAN_POINT('',(0.0,0.0,0.0));
#499=DIRECTION('',(-0.0,0.0,-1.0));
#500=DIRECTION('',(-1.0,0.0,0.0));
#501=ORIENTED_EDGE('',*,*,#642,.F.);
#502=ORIENTED_EDGE('',*,*,#666,.T.);
#503=CARTESIAN_POINT('',(0.0,0.0,1.25));
#504=DIRECTION('',(-0.0,-0.0,-1.0));
#505=DIRECTION('',(-1.0,0.0,0.0));
#506=ORIENTED_EDGE('',*,*,#667,.T.);
#507=ORIENTED_EDGE('',*,*,#656,.F.);
#508=ORIENTED_EDGE('',*,*,#650,.F.);
#509=ORIENTED_EDGE('',*,*,#668,.T.);
#510=CARTESIAN_POINT('',(0.0,-35.0,0.0));
#511=DIRECTION('',(0.0,0.0,-1.0));
#512=DIRECTION('',(1.0,0.0,0.0));
#513=ORIENTED_EDGE('',*,*,#664,.F.);
#514=ORIENTED_EDGE('',*,*,#669,.T.);
#515=ORIENTED_EDGE('',*,*,#670,.T.);
#516=ORIENTED_EDGE('',*,*,#652,.F.);
#517=CARTESIAN_POINT('',(-1.285879139105E-14,35.0,0.0));
#518=DIRECTION('',(0.0,0.0,-1.0));
#519=DIRECTION('',(1.0,0.0,0.0));
#520=ORIENTED_EDGE('',*,*,#661,.F.);
#521=ORIENTED_EDGE('',*,*,#671,.T.);
#522=ORIENTED_EDGE('',*,*,#672,.T.);
#523=CARTESIAN_POINT('',(-1.285879139105E-14,35.0,5.75));
#524=DIRECTION('',(-0.0,-0.0,1.0));
#525=DIRECTION('',(1.0,0.0,0.0));
#526=ORIENTED_EDGE('',*,*,#659,.F.);
#527=ORIENTED_EDGE('',*,*,#673,.T.);
#528=ORIENTED_EDGE('',*,*,#674,.T.);
#529=CARTESIAN_POINT('',(-1.110223024625E-15,-35.0,5.75));
#530=DIRECTION('',(-0.0,-0.0,1.0));
#531=DIRECTION('',(1.0,0.0,0.0));
#532=ORIENTED_EDGE('',*,*,#675,.T.);
#533=ORIENTED_EDGE('',*,*,#672,.F.);
#534=CARTESIAN_POINT('',(-1.285879139105E-14,35.0,-139.5103519276));
#535=DIRECTION('',(0.0,0.0,-1.0));
#536=DIRECTION('',(1.0,0.0,0.0));
#537=ORIENTED_EDGE('',*,*,#676,.T.);
#538=ORIENTED_EDGE('',*,*,#674,.F.);
#539=CARTESIAN_POINT('',(-1.110223024625E-15,-35.0,-139.5103519276));
#540=DIRECTION('',(0.0,0.0,-1.0));
#541=DIRECTION('',(1.0,0.0,0.0));
#542=ORIENTED_EDGE('',*,*,#653,.F.);
#543=ORIENTED_EDGE('',*,*,#670,.F.);
#544=ORIENTED_EDGE('',*,*,#677,.T.);
#545=ORIENTED_EDGE('',*,*,#678,.T.);
#546=ORIENTED_EDGE('',*,*,#679,.T.);
#547=ORIENTED_EDGE('',*,*,#668,.F.);
#548=ORIENTED_EDGE('',*,*,#649,.F.);
#549=ORIENTED_EDGE('',*,*,#644,.F.);
#550=ORIENTED_EDGE('',*,*,#675,.F.);
#551=ORIENTED_EDGE('',*,*,#676,.F.);
#552=ORIENTED_EDGE('',*,*,#666,.F.);
#553=CARTESIAN_POINT('',(-8.326672684689E-15,25.791846410093,0.0));
#554=DIRECTION('',(0.0,0.0,1.0));
#555=DIRECTION('',(1.0,-0.0,0.0));
#556=ORIENTED_EDGE('',*,*,#665,.F.);
#557=ORIENTED_EDGE('',*,*,#654,.F.);
#558=ORIENTED_EDGE('',*,*,#646,.F.);
#559=ORIENTED_EDGE('',*,*,#648,.F.);
#560=ORIENTED_EDGE('',*,*,#655,.F.);
#561=ORIENTED_EDGE('',*,*,#673,.F.);
#562=ORIENTED_EDGE('',*,*,#658,.F.);
#563=ORIENTED_EDGE('',*,*,#680,.T.);
#564=ORIENTED_EDGE('',*,*,#681,.T.);
#565=ORIENTED_EDGE('',*,*,#682,.T.);
#566=ORIENTED_EDGE('',*,*,#662,.F.);
#567=ORIENTED_EDGE('',*,*,#671,.F.);
#568=ORIENTED_EDGE('',*,*,#660,.F.);
#569=CARTESIAN_POINT('',(0.0,0.0,12.0));
#570=DIRECTION('',(0.0,0.0,-1.0));
#571=DIRECTION('',(-1.0,0.0,0.0));
#572=ORIENTED_EDGE('',*,*,#663,.F.);
#573=ORIENTED_EDGE('',*,*,#682,.F.);
#574=ORIENTED_EDGE('',*,*,#683,.T.);
#575=ORIENTED_EDGE('',*,*,#677,.F.);
#576=ORIENTED_EDGE('',*,*,#669,.F.);
#577=CARTESIAN_POINT('',(11.675622170198,39.464285714286,0.0));
#578=DIRECTION('',(0.934049773615829,0.357142857142935,0.0));
#579=DIRECTION('',(0.0,0.0,-1.0));
#580=ORIENTED_EDGE('',*,*,#657,.F.);
#581=ORIENTED_EDGE('',*,*,#667,.F.);
#582=ORIENTED_EDGE('',*,*,#679,.F.);
#583=ORIENTED_EDGE('',*,*,#684,.T.);
#584=ORIENTED_EDGE('',*,*,#680,.F.);
#585=CARTESIAN_POINT('',(23.351244340397,-8.928571428571,0.0));
#586=DIRECTION('',(0.934049773615829,-0.357142857142935,0.0));
#587=DIRECTION('',(0.0,0.0,-1.0));
#588=ORIENTED_EDGE('',*,*,#683,.F.);
#589=ORIENTED_EDGE('',*,*,#681,.F.);
#590=ORIENTED_EDGE('',*,*,#684,.F.);
#591=ORIENTED_EDGE('',*,*,#678,.F.);
#592=CARTESIAN_POINT('',(0.0,0.0,0.0));
#593=DIRECTION('',(0.0,0.0,-1.0));
#594=DIRECTION('',(1.0,0.0,0.0));
#595=EDGE_CURVE('',#685,#686,#687,.F.);
#596=EDGE_CURVE('',#686,#688,#689,.F.);
#597=EDGE_CURVE('',#688,#690,#691,.T.);
#598=EDGE_CURVE('',#690,#685,#692,.T.);
#599=EDGE_CURVE('',#693,#693,#694,.F.);
#600=EDGE_CURVE('',#695,#695,#696,.T.);
#601=EDGE_CURVE('',#697,#697,#698,.F.);
#602=EDGE_CURVE('',#699,#699,#700,.T.);
#603=EDGE_CURVE('',#688,#701,#702,.F.);
#604=EDGE_CURVE('',#701,#703,#704,.T.);
#605=EDGE_CURVE('',#703,#705,#706,.F.);
#606=EDGE_CURVE('',#705,#707,#708,.T.);
#607=EDGE_CURVE('',#707,#709,#710,.F.);
#608=EDGE_CURVE('',#709,#711,#712,.T.);
#609=EDGE_CURVE('',#711,#690,#713,.F.);
#610=EDGE_CURVE('',#714,#714,#715,.F.);
#611=EDGE_CURVE('',#716,#717,#718,.T.);
#612=EDGE_CURVE('',#717,#705,#719,.F.);
#613=EDGE_CURVE('',#703,#720,#721,.T.);
#614=EDGE_CURVE('',#720,#716,#722,.T.);
#615=EDGE_CURVE('',#686,#723,#724,.T.);
#616=EDGE_CURVE('',#723,#725,#726,.T.);
#617=EDGE_CURVE('',#725,#701,#727,.F.);
#618=EDGE_CURVE('',#728,#723,#729,.T.);
#619=EDGE_CURVE('',#685,#730,#731,.T.);
#620=EDGE_CURVE('',#730,#732,#733,.T.);
#621=EDGE_CURVE('',#732,#728,#734,.T.);
#622=EDGE_CURVE('',#716,#735,#736,.T.);
#623=EDGE_CURVE('',#735,#737,#738,.T.);
#624=EDGE_CURVE('',#737,#739,#740,.T.);
#625=EDGE_CURVE('',#739,#741,#742,.T.);
#626=EDGE_CURVE('',#741,#717,#743,.F.);
#627=EDGE_CURVE('',#741,#707,#744,.F.);
#628=EDGE_CURVE('',#732,#728,#745,.T.);
#629=EDGE_CURVE('',#735,#737,#746,.T.);
#630=EDGE_CURVE('',#711,#747,#748,.T.);
#631=EDGE_CURVE('',#747,#730,#749,.T.);
#632=EDGE_CURVE('',#739,#750,#751,.T.);
#633=EDGE_CURVE('',#750,#709,#752,.F.);
#634=EDGE_CURVE('',#750,#747,#753,.F.);
#635=EDGE_CURVE('',#725,#720,#754,.F.);
#636=EDGE_CURVE('',#755,#755,#756,.F.);
#637=EDGE_CURVE('',#757,#757,#758,.T.);
#638=EDGE_CURVE('',#759,#759,#760,.T.);
#639=EDGE_CURVE('',#761,#761,#762,.F.);
#640=EDGE_CURVE('',#763,#763,#764,.T.);
#641=EDGE_CURVE('',#765,#765,#766,.F.);
#642=EDGE_CURVE('',#767,#767,#768,.T.);
#643=EDGE_CURVE('',#769,#770,#771,.T.);
#644=EDGE_CURVE('',#770,#772,#773,.F.);
#645=EDGE_CURVE('',#772,#774,#775,.F.);
#646=EDGE_CURVE('',#774,#769,#776,.F.);
#647=EDGE_CURVE('',#777,#778,#779,.T.);
#648=EDGE_CURVE('',#778,#774,#780,.F.);
#649=EDGE_CURVE('',#772,#781,#782,.F.);
#650=EDGE_CURVE('',#781,#777,#783,.F.);
#651=EDGE_CURVE('',#784,#785,#786,.T.);
#652=EDGE_CURVE('',#785,#787,#788,.T.);
#653=EDGE_CURVE('',#787,#770,#789,.F.);
#654=EDGE_CURVE('',#769,#784,#790,.F.);
#655=EDGE_CURVE('',#791,#778,#792,.F.);
#656=EDGE_CURVE('',#777,#793,#794,.T.);
#657=EDGE_CURVE('',#793,#795,#796,.T.);
#658=EDGE_CURVE('',#795,#797,#798,.F.);
#659=EDGE_CURVE('',#797,#791,#799,.F.);
#660=EDGE_CURVE('',#784,#800,#801,.F.);
#661=EDGE_CURVE('',#800,#802,#803,.F.);
#662=EDGE_CURVE('',#802,#804,#805,.F.);
#663=EDGE_CURVE('',#804,#806,#807,.T.);
#664=EDGE_CURVE('',#806,#785,#808,.T.);
#665=EDGE_CURVE('',#809,#809,#810,.F.);
#666=EDGE_CURVE('',#811,#811,#812,.T.);
#667=EDGE_CURVE('',#813,#793,#814,.F.);
#668=EDGE_CURVE('',#781,#813,#815,.F.);
#669=EDGE_CURVE('',#806,#816,#817,.T.);
#670=EDGE_CURVE('',#816,#787,#818,.F.);
#671=EDGE_CURVE('',#800,#802,#819,.T.);
#672=EDGE_CURVE('',#820,#820,#821,.T.);
#673=EDGE_CURVE('',#797,#791,#822,.T.);
#674=EDGE_CURVE('',#823,#823,#824,.T.);
#675=EDGE_CURVE('',#825,#825,#826,.T.);
#676=EDGE_CURVE('',#827,#827,#828,.T.);
#677=EDGE_CURVE('',#816,#829,#830,.F.);
#678=EDGE_CURVE('',#829,#831,#832,.F.);
#679=EDGE_CURVE('',#831,#813,#833,.F.);
#680=EDGE_CURVE('',#795,#834,#835,.F.);
#681=EDGE_CURVE('',#834,#836,#837,.F.);
#682=EDGE_CURVE('',#836,#804,#838,.F.);
#683=EDGE_CURVE('',#836,#829,#839,.T.);
#684=EDGE_CURVE('',#831,#834,#840,.F.);
#685=VERTEX_POINT('',#841);
#686=VERTEX_POINT('',#842);
#687=CIRCLE('',#843,12.5);
#688=VERTEX_POINT('',#844);
#689=LINE('',#845,#846);
#690=VERTEX_POINT('',#847);
#691=CIRCLE('',#848,12.5);
#692=LINE('',#849,#850);
#693=VERTEX_POINT('',#851);
#694=CIRCLE('',#852,5.5);
#695=VERTEX_POINT('',#853);
#696=CIRCLE('',#854,5.5);
#697=VERTEX_POINT('',#855);
#698=CIRCLE('',#856,5.5);
#699=VERTEX_POINT('',#857);
#700=CIRCLE('',#858,5.5);
#701=VERTEX_POINT('',#859);
#702=LINE('',#860,#861);
#703=VERTEX_POINT('',#862);
#704=CIRCLE('',#863,25.0);
#705=VERTEX_POINT('',#864);
#706=LINE('',#865,#866);
#707=VERTEX_POINT('',#867);
#708=CIRCLE('',#868,12.5);
#709=VERTEX_POINT('',#869);
#710=LINE('',#870,#871);
#711=VERTEX_POINT('',#872);
#712=CIRCLE('',#873,25.0);
#713=LINE('',#874,#875);
#714=VERTEX_POINT('',#876);
#715=CIRCLE('',#877,20.0000000000064);
#716=VERTEX_POINT('',#878);
#717=VERTEX_POINT('',#879);
#718=LINE('',#880,#881);
#719=LINE('',#882,#883);
#720=VERTEX_POINT('',#884);
#721=LINE('',#885,#886);
#722=B_SPLINE_CURVE_WITH_KNOTS('',3,(#887,#888,#889,#890,#891,#892,#893,#894,#895,#896,#897,#898,#899,#900),.UNSPECIFIED.,.F.,.F.,(4,2,2,2,2,2,4),(31.1091234798671,32.5481068907669,33.9870903016668,35.4260737125666,36.6295800380814,38.3460163316558,39.2644274174288),.UNSPECIFIED.);
#723=VERTEX_POINT('',#901);
#724=LINE('',#902,#903);
#725=VERTEX_POINT('',#904);
#726=B_SPLINE_CURVE_WITH_KNOTS('',3,(#905,#906,#907,#908,#909,#910,#911,#912,#913,#914,#915,#916,#917,#918),.UNSPECIFIED.,.F.,.F.,(4,2,2,2,2,2,4),(25.8317863641072,26.7501974498782,28.4666337434542,29.67014006897,31.1091234798711,32.5481068907722,33.9870903016733),.UNSPECIFIED.);
#727=LINE('',#919,#920);
#728=VERTEX_POINT('',#921);
#729=CIRCLE('',#922,25.5);
#730=VERTEX_POINT('',#923);
#731=LINE('',#924,#925);
#732=VERTEX_POINT('',#926);
#733=CIRCLE('',#927,25.5);
#734=CIRCLE('',#928,10.0000000000115);
#735=VERTEX_POINT('',#929);
#736=CIRCLE('',#930,25.5);
#737=VERTEX_POINT('',#931);
#738=CIRCLE('',#932,10.0000000000115);
#739=VERTEX_POINT('',#933);
#740=CIRCLE('',#934,25.5);
#741=VERTEX_POINT('',#935);
#742=LINE('',#936,#937);
#743=CIRCLE('',#938,12.5);
#744=LINE('',#939,#940);
#745=B_SPLINE_CURVE_WITH_KNOTS('',3,(#941,#942,#943,#944,#945,#946,#947,#948,#949,#950),.UNSPECIFIED.,.F.,.F.,(4,2,2,2,4),(-9.25048372705322,-7.02148076921083,-5.24044809251383,-3.03495887181853,-0.0),.UNSPECIFIED.);
#746=B_SPLINE_CURVE_WITH_KNOTS('',3,(#951,#952,#953,#954,#955,#956,#957,#958,#959,#960),.UNSPECIFIED.,.F.,.F.,(4,2,2,2,4),(-9.25048372704969,-7.02148076920899,-5.24044809251361,-3.03495887181909,-0.0),.UNSPECIFIED.);
#747=VERTEX_POINT('',#961);
#748=LINE('',#962,#963);
#749=B_SPLINE_CURVE_WITH_KNOTS('',3,(#964,#965,#966,#967,#968,#969,#970,#971,#972,#973,#974,#975,#976,#977),.UNSPECIFIED.,.F.,.F.,(4,2,2,2,2,2,4),(31.1091234798538,32.5481068907499,33.987090301646,35.4260737125422,36.6295800380536,38.3460163316232,39.2644274174021),.UNSPECIFIED.);
#750=VERTEX_POINT('',#978);
#751=B_SPLINE_CURVE_WITH_KNOTS('',3,(#979,#980,#981,#982,#983,#984,#985,#986,#987,#988,#989,#990,#991,#992),.UNSPECIFIED.,.F.,.F.,(4,2,2,2,2,2,4),(25.8317863640974,26.7501974498767,28.466633743446,29.6701400689573,31.1091234798532,32.5481068907491,33.987090301645),.UNSPECIFIED.);
#752=LINE('',#993,#994);
#753=CIRCLE('',#995,25.0);
#754=CIRCLE('',#996,25.0);
#755=VERTEX_POINT('',#997);
#756=CIRCLE('',#998,21.5);
#757=VERTEX_POINT('',#999);
#758=CIRCLE('',#1000,17.5);
#759=VERTEX_POINT('',#1001);
#760=CIRCLE('',#1002,21.5);
#761=VERTEX_POINT('',#1003);
#762=CIRCLE('',#1004,17.5);
#763=VERTEX_POINT('',#1005);
#764=CIRCLE('',#1006,21.5);
#765=VERTEX_POINT('',#1007);
#766=CIRCLE('',#1008,17.5);
#767=VERTEX_POINT('',#1009);
#768=CIRCLE('',#1010,17.5);
#769=VERTEX_POINT('',#1011);
#770=VERTEX_POINT('',#1012);
#771=LINE('',#1013,#1014);
#772=VERTEX_POINT('',#1015);
#773=CIRCLE('',#1016,25.0);
#774=VERTEX_POINT('',#1017);
#775=LINE('',#1018,#1019);
#776=CIRCLE('',#1020,25.0);
#777=VERTEX_POINT('',#1021);
#778=VERTEX_POINT('',#1022);
#779=LINE('',#1023,#1024);
#780=B_SPLINE_CURVE_WITH_KNOTS('',3,(#1025,#1026,#1027,#1028,#1029,#1030,#1031,#1032,#1033,#1034,#1035,#1036,#1037,#1038),.UNSPECIFIED.,.F.,.F.,(4,2,2,2,2,2,4),(31.1091234798723,32.5481068907737,33.9870903016751,35.4260737125766,36.6295800380926,38.346016331669,39.2644274174395),.UNSPECIFIED.);
#781=VERTEX_POINT('',#1039);
#782=LINE('',#1040,#1041);
#783=LINE('',#1042,#1043);
#784=VERTEX_POINT('',#1044);
#785=VERTEX_POINT('',#1045);
#786=LINE('',#1046,#1047);
#787=VERTEX_POINT('',#1048);
#788=LINE('',#1049,#1050);
#789=LINE('',#1051,#1052);
#790=B_SPLINE_CURVE_WITH_KNOTS('',3,(#1053,#1054,#1055,#1056,#1057,#1058,#1059,#1060,#1061,#1062,#1063,#1064,#1065,#1066),.UNSPECIFIED.,.F.,.F.,(4,2,2,2,2,2,4),(25.8317863641068,26.7501974498782,28.4666337434539,29.6701400689694,31.1091234798702,32.5481068907711,33.9870903016719),.UNSPECIFIED.);
#791=VERTEX_POINT('',#1067);
#792=CIRCLE('',#1068,25.5);
#793=VERTEX_POINT('',#1069);
#794=CIRCLE('',#1070,12.5);
#795=VERTEX_POINT('',#1071);
#796=LINE('',#1072,#1073);
#797=VERTEX_POINT('',#1074);
#798=CIRCLE('',#1075,25.5);
#799=CIRCLE('',#1076,10.0000000000115);
#800=VERTEX_POINT('',#1077);
#801=CIRCLE('',#1078,25.5);
#802=VERTEX_POINT('',#1079);
#803=CIRCLE('',#1080,10.0000000000115);
#804=VERTEX_POINT('',#1081);
#805=CIRCLE('',#1082,25.5);
#806=VERTEX_POINT('',#1083);
#807=LINE('',#1084,#1085);
#808=CIRCLE('',#1086,12.5);
#809=VERTEX_POINT('',#1087);
#810=CIRCLE('',#1088,21.5);
#811=VERTEX_POINT('',#1089);
#812=CIRCLE('',#1090,20.0000000000064);
#813=VERTEX_POINT('',#1091);
#814=LINE('',#1092,#1093);
#815=CIRCLE('',#1094,12.5);
#816=VERTEX_POINT('',#1095);
#817=LINE('',#1096,#1097);
#818=CIRCLE('',#1098,12.5);
#819=B_SPLINE_CURVE_WITH_KNOTS('',3,(#1099,#1100,#1101,#1102,#1103,#1104,#1105,#1106,#1107,#1108),.UNSPECIFIED.,.F.,.F.,(4,2,2,2,4),(-9.25048372704984,-7.02148076920846,-5.24044809251208,-3.03495887181793,-0.0),.UNSPECIFIED.);
#820=VERTEX_POINT('',#1109);
#821=CIRCLE('',#1110,5.5);
#822=B_SPLINE_CURVE_WITH_KNOTS('',3,(#1111,#1112,#1113,#1114,#1115,#1116,#1117,#1118,#1119,#1120),.UNSPECIFIED.,.F.,.F.,(4,2,2,2,4),(-9.25048372705167,-7.02148076920978,-5.24044809251265,-3.03495887181824,-0.0),.UNSPECIFIED.);
#823=VERTEX_POINT('',#1121);
#824=CIRCLE('',#1122,5.5);
#825=VERTEX_POINT('',#1123);
#826=CIRCLE('',#1124,5.5);
#827=VERTEX_POINT('',#1125);
#828=CIRCLE('',#1126,5.5);
#829=VERTEX_POINT('',#1127);
#830=LINE('',#1128,#1129);
#831=VERTEX_POINT('',#1130);
#832=CIRCLE('',#1131,25.0);
#833=LINE('',#1132,#1133);
#834=VERTEX_POINT('',#1134);
#835=B_SPLINE_CURVE_WITH_KNOTS('',3,(#1135,#1136,#1137,#1138,#1139,#1140,#1141,#1142,#1143,#1144,#1145,#1146,#1147,#1148),.UNSPECIFIED.,.F.,.F.,(4,2,2,2,2,2,4),(31.1091234798541,32.5481068907502,33.9870903016463,35.4260737125425,36.629580038054,38.3460163316237,39.2644274174025),.UNSPECIFIED.);
#836=VERTEX_POINT('',#1149);
#837=CIRCLE('',#1150,25.0);
#838=B_SPLINE_CURVE_WITH_KNOTS('',3,(#1151,#1152,#1153,#1154,#1155,#1156,#1157,#1158,#1159,#1160,#1161,#1162,#1163,#1164),.UNSPECIFIED.,.F.,.F.,(4,2,2,2,2,2,4),(25.8317863640949,26.7501974498763,28.4666337434439,29.670140068954,31.1091234798485,32.5481068907431,33.9870903016376),.UNSPECIFIED.);
#839=LINE('',#1165,#1166);
#840=LINE('',#1167,#1168);
#841=CARTESIAN_POINT('',(11.6756221701978,-97.0,144.464285714287));
#842=CARTESIAN_POINT('',(-11.6756221701979,-97.0,144.464285714287));
#843=AXIS2_PLACEMENT_3D('',#1169,#1170,#1171);
#844=CARTESIAN_POINT('',(-11.6756221701979,-105.0,144.464285714287));
#845=CARTESIAN_POINT('',(-11.6756221701892,-105.0,144.464285714283));
#846=VECTOR('',#1172,1.0);
#847=CARTESIAN_POINT('',(11.6756221701978,-105.0,144.464285714287));
#848=AXIS2_PLACEMENT_3D('',#1173,#1174,#1175);
#849=CARTESIAN_POINT('',(11.6756221701958,-105.0,144.464285714286));
#850=VECTOR('',#1176,1.0);
#851=CARTESIAN_POINT('',(-5.50000000000001,-105.0,140.0));
#852=AXIS2_PLACEMENT_3D('',#1177,#1178,#1179);
#853=CARTESIAN_POINT('',(-5.50000000000001,-101.499999999989,140.0));
#854=AXIS2_PLACEMENT_3D('',#1180,#1181,#1182);
#855=CARTESIAN_POINT('',(-5.5,-105.0,70.0));
#856=AXIS2_PLACEMENT_3D('',#1183,#1184,#1185);
#857=CARTESIAN_POINT('',(-5.5,-101.499999999989,70.0000000000001));
#858=AXIS2_PLACEMENT_3D('',#1186,#1187,#1188);
#859=CARTESIAN_POINT('',(-23.3512443403896,-105.0,113.928571428571));
#860=CARTESIAN_POINT('',(-19.0493035724462,-105.0,125.179606469706));
#861=VECTOR('',#1189,1.0);
#862=CARTESIAN_POINT('',(-23.3512443403957,-105.0,96.0714285714266));
#863=AXIS2_PLACEMENT_3D('',#1190,#1191,#1192);
#864=CARTESIAN_POINT('',(-11.6756221701908,-105.0,65.535714285716));
#865=CARTESIAN_POINT('',(-21.8153740232342,-105.0,92.0546064697067));
#866=VECTOR('',#1193,1.0);
#867=CARTESIAN_POINT('',(11.6756221701979,-105.0,65.5357142857133));
#868=AXIS2_PLACEMENT_3D('',#1194,#1195,#1196);
#869=CARTESIAN_POINT('',(23.3512443403964,-105.0,96.0714285714264));
#870=CARTESIAN_POINT('',(27.6531851083403,-105.0,107.322463612563));
#871=VECTOR('',#1197,1.0);
#872=CARTESIAN_POINT('',(23.3512443403957,-105.0,113.928571428573));
#873=AXIS2_PLACEMENT_3D('',#1198,#1199,#1200);
#874=CARTESIAN_POINT('',(13.2114924873535,-105.0,140.447463612562));
#875=VECTOR('',#1201,1.0);
#876=CARTESIAN_POINT('',(-20.0000000000064,-105.0,105.0));
#877=AXIS2_PLACEMENT_3D('',#1202,#1203,#1204);
#878=CARTESIAN_POINT('',(-21.5566236937534,-97.0,91.3778865470181));
#879=CARTESIAN_POINT('',(-11.6756221701908,-97.0,65.535714285716));
#880=CARTESIAN_POINT('',(-21.8153740232342,-97.0,92.0546064697067));
#881=VECTOR('',#1205,1.0);
#882=CARTESIAN_POINT('',(-11.6756221701908,-105.0,65.535714285716));
#883=VECTOR('',#1206,1.0);
#884=CARTESIAN_POINT('',(-23.3512443403912,-96.9686269665963,96.0714285714284));
#885=CARTESIAN_POINT('',(-23.3512443403912,-105.0,96.0714285714284));
#886=VECTOR('',#1207,1.0);
#887=CARTESIAN_POINT('',(-23.8994200256066,-96.9742744780596,97.5050940205242));
#888=CARTESIAN_POINT('',(-23.7109876522295,-96.9705897606377,97.0122794165789));
#889=CARTESIAN_POINT('',(-23.5225518893079,-96.9686269665963,96.5194559478244));
#890=CARTESIAN_POINT('',(-23.1799367914745,-96.9686269665963,95.6234011950324));
#891=CARTESIAN_POINT('',(-22.9915010285528,-96.9705897606377,95.1305777262778));
#892=CARTESIAN_POINT('',(-22.6146362817986,-96.9779591954816,94.1449485183873));
#893=CARTESIAN_POINT('',(-22.4262069305041,-96.9832177663416,93.6521418182135));
#894=CARTESIAN_POINT('',(-22.1116391411329,-96.991622782489,92.8294402953566));
#895=CARTESIAN_POINT('',(-21.9397166233825,-96.9959535502144,92.3798045667608));
#896=CARTESIAN_POINT('',(-21.5921093100011,-97.0011231604031,91.470693476122));
#897=CARTESIAN_POINT('',(-21.3469041759033,-97.0006816555421,90.8293988361402));
#898=CARTESIAN_POINT('',(-21.0332683427567,-96.9872882905118,90.0091346950849));
#899=CARTESIAN_POINT('',(-20.9021034164713,-96.9786048258897,89.6660938999161));
#900=CARTESIAN_POINT('',(-20.7928361794604,-96.967855860542,89.3803229935339));
#901=CARTESIAN_POINT('',(-21.5566236937488,-97.0,118.622113452989));
#902=CARTESIAN_POINT('',(-19.0493035724462,-97.0,125.179606469706));
#903=VECTOR('',#1208,1.0);
#904=CARTESIAN_POINT('',(-23.3512443403896,-96.9686269665961,113.928571428571));
#905=CARTESIAN_POINT('',(-20.7928361794577,-96.9678558605421,120.619677006469));
#906=CARTESIAN_POINT('',(-20.9021034164683,-96.9786048258898,120.333906100087));
#907=CARTESIAN_POINT('',(-21.0332683427534,-96.9872882905118,119.990865304919));
#908=CARTESIAN_POINT('',(-21.3469041758999,-97.0006816555422,119.170601163864));
#909=CARTESIAN_POINT('',(-21.592109309998,-97.0011231604031,118.529306523881));
#910=CARTESIAN_POINT('',(-21.9397166233797,-96.9959535502143,117.620195433242));
#911=CARTESIAN_POINT('',(-22.1116391411303,-96.9916227824889,117.170559704646));
#912=CARTESIAN_POINT('',(-22.4262069305017,-96.9832177663415,116.347858181788));
#913=CARTESIAN_POINT('',(-22.6146362817964,-96.9779591954815,115.855051481614));
#914=CARTESIAN_POINT('',(-22.9915010285509,-96.9705897606375,114.869422273722));
#915=CARTESIAN_POINT('',(-23.1799367914728,-96.9686269665961,114.376598804967));
#916=CARTESIAN_POINT('',(-23.5225518893064,-96.9686269665961,113.480544052175));
#917=CARTESIAN_POINT('',(-23.7109876522283,-96.9705897606375,112.98772058342));
#918=CARTESIAN_POINT('',(-23.8994200256055,-96.9742744780595,112.494905979474));
#919=CARTESIAN_POINT('',(-23.3512443403896,-105.0,113.928571428571));
#920=VECTOR('',#1209,1.0);
#921=CARTESIAN_POINT('',(-2.66161058731996,-97.0,130.360714285711));
#922=AXIS2_PLACEMENT_3D('',#1210,#1211,#1212);
#923=CARTESIAN_POINT('',(21.556623693768,-97.0,118.622113452959));
#924=CARTESIAN_POINT('',(13.2114924873535,-97.0,140.447463612562));
#925=VECTOR('',#1213,1.0);
#926=CARTESIAN_POINT('',(2.66161058731991,-97.0,130.360714285711));
#927=AXIS2_PLACEMENT_3D('',#1214,#1215,#1216);
#928=AXIS2_PLACEMENT_3D('',#1217,#1218,#1219);
#929=CARTESIAN_POINT('',(-2.66161058732001,-97.0,79.639285714289));
#930=AXIS2_PLACEMENT_3D('',#1220,#1221,#1222);
#931=CARTESIAN_POINT('',(2.66161058731998,-97.0,79.639285714289));
#932=AXIS2_PLACEMENT_3D('',#1223,#1224,#1225);
#933=CARTESIAN_POINT('',(21.5566236937685,-97.0,91.3778865470421));
#934=AXIS2_PLACEMENT_3D('',#1226,#1227,#1228);
#935=CARTESIAN_POINT('',(11.675622170196,-97.0,65.535714285714));
#936=CARTESIAN_POINT('',(27.6531851083403,-97.0,107.322463612563));
#937=VECTOR('',#1229,1.0);
#938=AXIS2_PLACEMENT_3D('',#1230,#1231,#1232);
#939=CARTESIAN_POINT('',(11.675622170196,-105.0,65.535714285714));
#940=VECTOR('',#1233,1.0);
#941=CARTESIAN_POINT('',(4.27085139519892,-96.9322617781398,130.883027845591));
#942=CARTESIAN_POINT('',(3.60333243834759,-96.9969040459545,130.641711671701));
#943=CARTESIAN_POINT('',(2.93922241493043,-97.0055460200465,130.42182236871));
#944=CARTESIAN_POINT('',(1.71395711285126,-96.990930085475,130.122876644965));
#945=CARTESIAN_POINT('',(1.16275728225626,-96.9746349161959,130.026266677088));
#946=CARTESIAN_POINT('',(-0.0990895267690897,-96.959139130693,129.935265900075));
#947=CARTESIAN_POINT('',(-0.76652217820765,-96.968608443433,129.973917153116));
#948=CARTESIAN_POINT('',(-2.39228433299458,-97.0025392475039,130.246170998655));
#949=CARTESIAN_POINT('',(-3.32338022057309,-97.0240145063406,130.540505560067));
#950=CARTESIAN_POINT('',(-4.27085139519851,-96.9322617781398,130.883027845591));
#951=CARTESIAN_POINT('',(-4.27085139519859,-96.9322617781398,79.1169721544092));
#952=CARTESIAN_POINT('',(-3.60333243834739,-96.9969040459545,79.3582883282988));
#953=CARTESIAN_POINT('',(-2.93922241493033,-97.0055460200465,79.5781776312898));
#954=CARTESIAN_POINT('',(-1.71395711285129,-96.990930085475,79.8771233550351));
#955=CARTESIAN_POINT('',(-1.16275728225629,-96.9746349161959,79.9737333229123));
#956=CARTESIAN_POINT('',(0.0990895267694326,-96.9591391306929,80.0647340999249));
#957=CARTESIAN_POINT('',(0.766522178208462,-96.968608443433,80.026082846884));
#958=CARTESIAN_POINT('',(2.39228433299452,-97.0025392475039,79.7538290013453));
#959=CARTESIAN_POINT('',(3.32338022057297,-97.0240145063406,79.4594944399332));
#960=CARTESIAN_POINT('',(4.27085139519855,-96.9322617781398,79.1169721544092));
#961=CARTESIAN_POINT('',(23.3512443403961,-96.9686269665969,113.928571428574));
#962=CARTESIAN_POINT('',(23.3512443403961,-105.0,113.928571428574));
#963=VECTOR('',#1234,1.0);
#964=CARTESIAN_POINT('',(23.8994200256102,-96.9742744780602,112.494905979481));
#965=CARTESIAN_POINT('',(23.7109876522335,-96.9705897606383,112.987720583425));
#966=CARTESIAN_POINT('',(23.5225518893124,-96.9686269665969,113.480544052179));
#967=CARTESIAN_POINT('',(23.1799367914799,-96.9686269665969,114.376598804968));
#968=CARTESIAN_POINT('',(22.9915010285588,-96.9705897606383,114.869422273722));
#969=CARTESIAN_POINT('',(22.6146362818055,-96.9779591954821,115.85505148161));
#970=CARTESIAN_POINT('',(22.4262069305115,-96.9832177663421,116.347858181782));
#971=CARTESIAN_POINT('',(22.1116391411411,-96.9916227824892,117.170559704637));
#972=CARTESIAN_POINT('',(21.9397166233912,-96.9959535502145,117.620195433231));
#973=CARTESIAN_POINT('',(21.5921093100108,-97.0011231604031,118.529306523868));
#974=CARTESIAN_POINT('',(21.3469041759136,-97.0006816555421,119.170601163848));
#975=CARTESIAN_POINT('',(21.0332683427669,-96.9872882905117,119.990865304903));
#976=CARTESIAN_POINT('',(20.9021034164807,-96.9786048258895,120.333906100074));
#977=CARTESIAN_POINT('',(20.7928361794691,-96.9678558605417,120.619677006458));
#978=CARTESIAN_POINT('',(23.3512443403964,-96.968626966597,96.0714285714264));
#979=CARTESIAN_POINT('',(20.7928361794695,-96.9678558605417,89.3803229935421));
#980=CARTESIAN_POINT('',(20.9021034164812,-96.9786048258895,89.6660938999262));
#981=CARTESIAN_POINT('',(21.0332683427674,-96.9872882905117,90.0091346950973));
#982=CARTESIAN_POINT('',(21.3469041759141,-97.000681655542,90.829398836153));
#983=CARTESIAN_POINT('',(21.5921093100113,-97.0011231604031,91.4706934761329));
#984=CARTESIAN_POINT('',(21.9397166233916,-96.9959535502145,92.3798045667691));
#985=CARTESIAN_POINT('',(22.1116391411416,-96.9916227824892,92.8294402953636));
#986=CARTESIAN_POINT('',(22.4262069305118,-96.9832177663421,93.6521418182182));
#987=CARTESIAN_POINT('',(22.6146362818059,-96.9779591954822,94.1449485183906));
#988=CARTESIAN_POINT('',(22.991501028559,-96.9705897606383,95.1305777262785));
#989=CARTESIAN_POINT('',(23.1799367914802,-96.968626966597,95.6234011950316));
#990=CARTESIAN_POINT('',(23.5225518893126,-96.968626966597,96.5194559478211));
#991=CARTESIAN_POINT('',(23.7109876522337,-96.9705897606383,97.0122794165743));
#992=CARTESIAN_POINT('',(23.8994200256103,-96.9742744780603,97.5050940205182));
#993=CARTESIAN_POINT('',(23.3512443403964,-105.0,96.0714285714264));
#994=VECTOR('',#1235,1.0);
#995=AXIS2_PLACEMENT_3D('',#1236,#1237,#1238);
#996=AXIS2_PLACEMENT_3D('',#1239,#1240,#1241);
#997=CARTESIAN_POINT('',(21.5,-93.0,105.0));
#998=AXIS2_PLACEMENT_3D('',#1242,#1243,#1244);
#999=CARTESIAN_POINT('',(-17.5,-102.500000000006,105.0));
#1000=AXIS2_PLACEMENT_3D('',#1245,#1246,#1247);
#1001=CARTESIAN_POINT('',(-21.5,-65.0,105.0));
#1002=AXIS2_PLACEMENT_3D('',#1248,#1249,#1250);
#1003=CARTESIAN_POINT('',(-17.5,-65.0,105.0));
#1004=AXIS2_PLACEMENT_3D('',#1251,#1252,#1253);
#1005=CARTESIAN_POINT('',(-21.5,1.3164953090834E-15,40.0));
#1006=AXIS2_PLACEMENT_3D('',#1254,#1255,#1256);
#1007=CARTESIAN_POINT('',(-17.5,-2.81421463693411E-15,40.0));
#1008=AXIS2_PLACEMENT_3D('',#1257,#1258,#1259);
#1009=CARTESIAN_POINT('',(-17.5,0.0,2.49999999999362));
#1010=AXIS2_PLACEMENT_3D('',#1260,#1261,#1262);
#1011=CARTESIAN_POINT('',(-23.3512443403957,8.92857142857337,8.03137303340311));
#1012=CARTESIAN_POINT('',(-23.3512443403957,8.92857142857337,0.0));
#1013=CARTESIAN_POINT('',(-23.3512443403899,8.92857142857116,0.0));
#1014=VECTOR('',#1263,1.0);
#1015=CARTESIAN_POINT('',(-23.3512443403957,-8.92857142857336,0.0));
#1016=AXIS2_PLACEMENT_3D('',#1264,#1265,#1266);
#1017=CARTESIAN_POINT('',(-23.3512443403957,-8.92857142857336,8.03137303340311));
#1018=CARTESIAN_POINT('',(-23.3512443403892,-8.92857142857085,0.0));
#1019=VECTOR('',#1267,1.0);
#1020=AXIS2_PLACEMENT_3D('',#1268,#1269,#1270);
#1021=CARTESIAN_POINT('',(-11.6756221701888,-39.4642857142832,8.0));
#1022=CARTESIAN_POINT('',(-21.5566236937476,-13.622113452991,8.0));
#1023=CARTESIAN_POINT('',(-21.8153740232337,-12.9453935302886,8.0));
#1024=VECTOR('',#1271,1.0);
#1025=CARTESIAN_POINT('',(-23.8994200256052,-7.49490597947349,8.02572552194059));
#1026=CARTESIAN_POINT('',(-23.7109876522279,-7.98772058341931,8.0294102393626));
#1027=CARTESIAN_POINT('',(-23.5225518893061,-8.48054405217439,8.031373033404));
#1028=CARTESIAN_POINT('',(-23.1799367914723,-9.37659880496733,8.031373033404));
#1029=CARTESIAN_POINT('',(-22.9915010285504,-9.86942227372241,8.0294102393626));
#1030=CARTESIAN_POINT('',(-22.6146362817958,-10.855051481614,8.02204080451858));
#1031=CARTESIAN_POINT('',(-22.4262069305011,-11.3478581817883,8.01678223365855));
#1032=CARTESIAN_POINT('',(-22.1116391411296,-12.1705597046461,8.00837721751114));
#1033=CARTESIAN_POINT('',(-21.939716623379,-12.6201954332425,8.00404644978571));
#1034=CARTESIAN_POINT('',(-21.5921093099972,-13.5293065238823,7.99887683959691));
#1035=CARTESIAN_POINT('',(-21.346904175899,-14.1706011638648,7.99931834445783));
#1036=CARTESIAN_POINT('',(-21.0332683427525,-14.99086530492,8.01271170948817));
#1037=CARTESIAN_POINT('',(-20.9021034164675,-15.3339061000878,8.02139517411021));
#1038=CARTESIAN_POINT('',(-20.7928361794569,-15.6196770064692,8.0321441394579));
#1039=CARTESIAN_POINT('',(-11.6756221701888,-39.4642857142832,0.0));
#1040=CARTESIAN_POINT('',(-21.8153740232337,-12.9453935302886,0.0));
#1041=VECTOR('',#1272,1.0);
#1042=CARTESIAN_POINT('',(-11.6756221701888,-39.4642857142832,0.0));
#1043=VECTOR('',#1273,1.0);
#1044=CARTESIAN_POINT('',(-21.5566236937498,13.6221134529875,8.0));
#1045=CARTESIAN_POINT('',(-11.6756221701895,39.4642857142835,8.0));
#1046=CARTESIAN_POINT('',(-19.0493035724459,20.1796064697079,8.0));
#1047=VECTOR('',#1274,1.0);
#1048=CARTESIAN_POINT('',(-11.6756221701896,39.4642857142835,0.0));
#1049=CARTESIAN_POINT('',(-11.6756221701895,39.4642857142835,0.0));
#1050=VECTOR('',#1275,1.0);
#1051=CARTESIAN_POINT('',(-19.0493035724459,20.1796064697079,0.0));
#1052=VECTOR('',#1276,1.0);
#1053=CARTESIAN_POINT('',(-20.7928361794583,15.619677006468,8.03214413945795));
#1054=CARTESIAN_POINT('',(-20.902103416469,15.3339061000863,8.02139517411024));
#1055=CARTESIAN_POINT('',(-21.0332683427541,14.9908653049181,8.01271170948818));
#1056=CARTESIAN_POINT('',(-21.3469041759007,14.1706011638629,7.99931834445784));
#1057=CARTESIAN_POINT('',(-21.5921093099987,13.5293065238806,7.99887683959691));
#1058=CARTESIAN_POINT('',(-21.9397166233803,12.6201954332412,8.00404644978569));
#1059=CARTESIAN_POINT('',(-22.1116391411309,12.1705597046451,8.0083772175111));
#1060=CARTESIAN_POINT('',(-22.4262069305022,11.3478581817876,8.01678223365848));
#1061=CARTESIAN_POINT('',(-22.6146362817969,10.8550514816135,8.0220408045185));
#1062=CARTESIAN_POINT('',(-22.9915010285514,9.86942227372231,8.0294102393625));
#1063=CARTESIAN_POINT('',(-23.1799367914731,9.37659880496744,8.03137303340389));
#1064=CARTESIAN_POINT('',(-23.5225518893067,8.48054405217487,8.03137303340389));
#1065=CARTESIAN_POINT('',(-23.7109876522285,7.98772058341999,8.0294102393625));
#1066=CARTESIAN_POINT('',(-23.8994200256057,7.49490597947438,8.0257255219405));
#1067=CARTESIAN_POINT('',(-2.66161058731997,-25.360714285711,8.0));
#1068=AXIS2_PLACEMENT_3D('',#1277,#1278,#1279);
#1069=CARTESIAN_POINT('',(11.6756221701979,-39.4642857142867,8.0));
#1070=AXIS2_PLACEMENT_3D('',#1280,#1281,#1282);
#1071=CARTESIAN_POINT('',(21.5566236937675,-13.6221134529595,8.0));
#1072=CARTESIAN_POINT('',(27.6531851083406,2.32246361256455,8.0));
#1073=VECTOR('',#1283,1.0);
#1074=CARTESIAN_POINT('',(2.66161058731997,-25.360714285711,8.0));
#1075=AXIS2_PLACEMENT_3D('',#1284,#1285,#1286);
#1076=AXIS2_PLACEMENT_3D('',#1287,#1288,#1289);
#1077=CARTESIAN_POINT('',(-2.66161058731997,25.360714285711,8.0));
#1078=AXIS2_PLACEMENT_3D('',#1290,#1291,#1292);
#1079=CARTESIAN_POINT('',(2.66161058731997,25.360714285711,8.0));
#1080=AXIS2_PLACEMENT_3D('',#1293,#1294,#1295);
#1081=CARTESIAN_POINT('',(21.5566236937737,13.6221134529498,8.0));
#1082=AXIS2_PLACEMENT_3D('',#1296,#1297,#1298);
#1083=CARTESIAN_POINT('',(11.6756221701978,39.4642857142866,8.0));
#1084=CARTESIAN_POINT('',(13.211492487354,35.4474636125669,8.0));
#1085=VECTOR('',#1299,1.0);
#1086=AXIS2_PLACEMENT_3D('',#1300,#1301,#1302);
#1087=CARTESIAN_POINT('',(-20.082070132741,7.67857142857137,12.0));
#1088=AXIS2_PLACEMENT_3D('',#1303,#1304,#1305);
#1089=CARTESIAN_POINT('',(-20.0000000000064,-1.77635683940082E-14,0.0));
#1090=AXIS2_PLACEMENT_3D('',#1306,#1307,#1308);
#1091=CARTESIAN_POINT('',(11.6756221701979,-39.4642857142867,0.0));
#1092=CARTESIAN_POINT('',(11.6756221701957,-39.4642857142858,0.0));
#1093=VECTOR('',#1309,1.0);
#1094=AXIS2_PLACEMENT_3D('',#1310,#1311,#1312);
#1095=CARTESIAN_POINT('',(11.6756221701978,39.4642857142867,0.0));
#1096=CARTESIAN_POINT('',(11.6756221701978,39.4642857142866,0.0));
#1097=VECTOR('',#1313,1.0);
#1098=AXIS2_PLACEMENT_3D('',#1314,#1315,#1316);
#1099=CARTESIAN_POINT('',(-4.27085139519857,25.8830278455908,8.0677382218602));
#1100=CARTESIAN_POINT('',(-3.60333243834717,25.6417116717012,8.00309595404546));
#1101=CARTESIAN_POINT('',(-2.93922241492986,25.42182236871,7.99445397995348));
#1102=CARTESIAN_POINT('',(-1.71395711285003,25.1228766449646,8.00906991452503));
#1103=CARTESIAN_POINT('',(-1.16275728225499,25.0262666770876,8.02536508380415));
#1104=CARTESIAN_POINT('',(0.0990895267704286,24.9352659000752,8.04086086930704));
#1105=CARTESIAN_POINT('',(0.766522178209043,24.9739171531161,8.03139155656697));
#1106=CARTESIAN_POINT('',(2.39228433299513,25.2461709986549,7.99746075249613));
#1107=CARTESIAN_POINT('',(3.32338022057333,25.5405055600669,7.9759854936594));
#1108=CARTESIAN_POINT('',(4.27085139519856,25.8830278455908,8.0677382218602));
#1109=CARTESIAN_POINT('',(-5.50000000000001,35.0,3.50000000001148));
#1110=AXIS2_PLACEMENT_3D('',#1317,#1318,#1319);
#1111=CARTESIAN_POINT('',(4.27085139519891,-25.8830278455909,8.06773822186023));
#1112=CARTESIAN_POINT('',(3.60333243834739,-25.6417116717012,8.00309595404546));
#1113=CARTESIAN_POINT('',(2.93922241493001,-25.4218223687101,7.99445397995347));
#1114=CARTESIAN_POINT('',(1.71395711285004,-25.1228766449646,8.00906991452502));
#1115=CARTESIAN_POINT('',(1.16275728225499,-25.0262666770876,8.02536508380415));
#1116=CARTESIAN_POINT('',(-0.099089526770313,-24.9352659000752,8.04086086930703));
#1117=CARTESIAN_POINT('',(-0.766522178208755,-24.973917153116,8.03139155656698));
#1118=CARTESIAN_POINT('',(-2.39228433299491,-25.2461709986548,7.99746075249614));
#1119=CARTESIAN_POINT('',(-3.32338022057317,-25.5405055600668,7.97598549365939));
#1120=CARTESIAN_POINT('',(-4.2708513951985,-25.8830278455907,8.06773822186019));
#1121=CARTESIAN_POINT('',(-5.5,-35.0,3.50000000001148));
#1122=AXIS2_PLACEMENT_3D('',#1320,#1321,#1322);
#1123=CARTESIAN_POINT('',(-5.50000000000001,35.0,0.0));
#1124=AXIS2_PLACEMENT_3D('',#1323,#1324,#1325);
#1125=CARTESIAN_POINT('',(-5.5,-35.0,0.0));
#1126=AXIS2_PLACEMENT_3D('',#1326,#1327,#1328);
#1127=CARTESIAN_POINT('',(23.3512443403982,8.92857142857429,0.0));
#1128=CARTESIAN_POINT('',(13.211492487354,35.4474636125669,0.0));
#1129=VECTOR('',#1329,1.0);
#1130=CARTESIAN_POINT('',(23.3512443403957,-8.92857142857337,0.0));
#1131=AXIS2_PLACEMENT_3D('',#1330,#1331,#1332);
#1132=CARTESIAN_POINT('',(27.6531851083406,2.32246361256455,0.0));
#1133=VECTOR('',#1333,1.0);
#1134=CARTESIAN_POINT('',(23.351244340396,-8.92857142857349,8.03137303340307));
#1135=CARTESIAN_POINT('',(23.8994200256101,-7.49490597948139,8.02572552193979));
#1136=CARTESIAN_POINT('',(23.7109876522334,-7.9877205834254,8.02941023936172));
#1137=CARTESIAN_POINT('',(23.5225518893123,-8.48054405217867,8.03137303340307));
#1138=CARTESIAN_POINT('',(23.1799367914798,-9.37659880496831,8.03137303340307));
#1139=CARTESIAN_POINT('',(22.9915010285586,-9.86942227372158,8.02941023936172));
#1140=CARTESIAN_POINT('',(22.6146362818054,-10.8550514816096,8.02204080451786));
#1141=CARTESIAN_POINT('',(22.4262069305114,-11.3478581817821,8.01678223365796));
#1142=CARTESIAN_POINT('',(22.111639141141,-12.1705597046368,8.00837721751078));
#1143=CARTESIAN_POINT('',(21.939716623391,-12.6201954332315,8.00404644978548));
#1144=CARTESIAN_POINT('',(21.5921093100106,-13.5293065238678,7.9988768395969));
#1145=CARTESIAN_POINT('',(21.3469041759134,-14.1706011638478,7.99931834445794));
#1146=CARTESIAN_POINT('',(21.0332683427667,-14.9908653049034,8.01271170948832));
#1147=CARTESIAN_POINT('',(20.9021034164806,-15.3339061000744,8.02139517411046));
#1148=CARTESIAN_POINT('',(20.792836179469,-15.6196770064584,8.0321441394583));
#1149=CARTESIAN_POINT('',(23.3512443403957,8.92857142857336,8.03137303340311));
#1150=AXIS2_PLACEMENT_3D('',#1334,#1335,#1336);
#1151=CARTESIAN_POINT('',(20.7928361794726,15.6196770064551,8.03214413945842));
#1152=CARTESIAN_POINT('',(20.9021034164845,15.3339061000703,8.02139517411054));
#1153=CARTESIAN_POINT('',(21.0332683427711,14.9908653048984,8.01271170948836));
#1154=CARTESIAN_POINT('',(21.3469041759178,14.1706011638426,7.99931834445798));
#1155=CARTESIAN_POINT('',(21.5921093100147,13.5293065238633,7.9988768395969));
#1156=CARTESIAN_POINT('',(21.9397166233947,12.6201954332281,8.00404644978541));
#1157=CARTESIAN_POINT('',(22.1116391411445,12.170559704634,8.00837721751066));
#1158=CARTESIAN_POINT('',(22.4262069305145,11.3478581817802,8.01678223365778));
#1159=CARTESIAN_POINT('',(22.6146362818083,10.8550514816082,8.02204080451765));
#1160=CARTESIAN_POINT('',(22.9915010285611,9.86942227372134,8.02941023936145));
#1161=CARTESIAN_POINT('',(23.1799367914821,9.37659880496862,8.03137303340278));
#1162=CARTESIAN_POINT('',(23.5225518893142,8.48054405217997,8.03137303340278));
#1163=CARTESIAN_POINT('',(23.7109876522352,7.98772058342725,8.02941023936145));
#1164=CARTESIAN_POINT('',(23.8994200256116,7.49490597948379,8.02572552193955));
#1165=CARTESIAN_POINT('',(23.3512443403982,8.92857142857429,0.0));
#1166=VECTOR('',#1337,1.0);
#1167=CARTESIAN_POINT('',(23.3512443403961,-8.92857142857349,0.0));
#1168=VECTOR('',#1338,1.0);
#1169=CARTESIAN_POINT('',(-1.285879139105E-14,-97.0,140.0));
#1170=DIRECTION('',(-0.0,1.0,2.22044604925E-16));
#1171=DIRECTION('',(1.0,0.0,0.0));
#1172=DIRECTION('',(0.0,1.0,2.22044604925E-16));
#1173=CARTESIAN_POINT('',(-1.285879139105E-14,-105.0,140.0));
#1174=DIRECTION('',(-0.0,1.0,2.22044604925E-16));
#1175=DIRECTION('',(1.0,0.0,0.0));
#1176=DIRECTION('',(-0.0,1.0,2.22044604925E-16));
#1177=CARTESIAN_POINT('',(-1.285879139105E-14,-105.0,140.0));
#1178=DIRECTION('',(-0.0,1.0,2.22044604925E-16));
#1179=DIRECTION('',(1.0,0.0,0.0));
#1180=CARTESIAN_POINT('',(-1.285879139105E-14,-101.499999999989,140.0));
#1181=DIRECTION('',(-0.0,1.0,2.22044604925E-16));
#1182=DIRECTION('',(1.0,0.0,0.0));
#1183=CARTESIAN_POINT('',(-1.110223024625E-15,-105.0,70.0));
#1184=DIRECTION('',(-0.0,1.0,2.22044604925E-16));
#1185=DIRECTION('',(1.0,0.0,0.0));
#1186=CARTESIAN_POINT('',(-1.110223024625E-15,-101.499999999989,70.0));
#1187=DIRECTION('',(-0.0,1.0,2.22044604925E-16));
#1188=DIRECTION('',(1.0,0.0,0.0));
#1189=DIRECTION('',(0.357142857142935,-2.07400712962812E-16,0.934049773615829));
#1190=CARTESIAN_POINT('',(0.0,-105.0,105.0));
#1191=DIRECTION('',(0.0,-1.0,-2.22044604925E-16));
#1192=DIRECTION('',(1.0,0.0,0.0));
#1193=DIRECTION('',(-0.357142857142935,-2.07400712962812E-16,0.934049773615829));
#1194=CARTESIAN_POINT('',(0.0,-105.0,70.0));
#1195=DIRECTION('',(0.0,-1.0,-2.22044604925E-16));
#1196=DIRECTION('',(1.0,0.0,0.0));
#1197=DIRECTION('',(-0.357142857142935,2.07400712962812E-16,-0.934049773615829));
#1198=CARTESIAN_POINT('',(0.0,-105.0,105.0));
#1199=DIRECTION('',(0.0,-1.0,-2.22044604925E-16));
#1200=DIRECTION('',(1.0,0.0,0.0));
#1201=DIRECTION('',(0.357142857142935,2.07400712962812E-16,-0.934049773615829));
#1202=CARTESIAN_POINT('',(0.0,-105.0,105.0));
#1203=DIRECTION('',(-0.0,-1.0,-2.22044604925E-16));
#1204=DIRECTION('',(-1.0,0.0,0.0));
#1205=DIRECTION('',(0.357142857142935,2.07400712962812E-16,-0.934049773615829));
#1206=DIRECTION('',(0.0,1.0,2.22044604925E-16));
#1207=DIRECTION('',(0.0,1.0,2.22044604925E-16));
#1208=DIRECTION('',(-0.357142857142935,2.07400712962812E-16,-0.934049773615829));
#1209=DIRECTION('',(0.0,1.0,2.22044604925E-16));
#1210=CARTESIAN_POINT('',(0.0,-97.0,105.0));
#1211=DIRECTION('',(0.0,-1.0,-2.22044604925E-16));
#1212=DIRECTION('',(0.0,2.22044604925E-16,-1.0));
#1213=DIRECTION('',(0.357142857142935,2.07400712962812E-16,-0.934049773615829));
#1214=CARTESIAN_POINT('',(0.0,-97.0,105.0));
#1215=DIRECTION('',(0.0,-1.0,-2.22044604925E-16));
#1216=DIRECTION('',(0.0,2.22044604925E-16,-1.0));
#1217=CARTESIAN_POINT('',(-1.285879139105E-14,-97.0,140.0));
#1218=DIRECTION('',(0.0,-1.0,-2.22044604925E-16));
#1219=DIRECTION('',(1.0,0.0,0.0));
#1220=CARTESIAN_POINT('',(0.0,-97.0,105.0));
#1221=DIRECTION('',(0.0,-1.0,-2.22044604925E-16));
#1222=DIRECTION('',(0.0,2.22044604925E-16,-1.0));
#1223=CARTESIAN_POINT('',(-1.110223024625E-15,-97.0,70.0));
#1224=DIRECTION('',(0.0,-1.0,-2.22044604925E-16));
#1225=DIRECTION('',(1.0,0.0,0.0));
#1226=CARTESIAN_POINT('',(0.0,-97.0,105.0));
#1227=DIRECTION('',(0.0,-1.0,-2.22044604925E-16));
#1228=DIRECTION('',(0.0,2.22044604925E-16,-1.0));
#1229=DIRECTION('',(-0.357142857142935,2.07400712962812E-16,-0.934049773615829));
#1230=CARTESIAN_POINT('',(0.0,-97.0,70.0));
#1231=DIRECTION('',(0.0,-1.0,-2.22044604925E-16));
#1232=DIRECTION('',(1.0,0.0,0.0));
#1233=DIRECTION('',(-0.0,1.0,2.22044604925E-16));
#1234=DIRECTION('',(-0.0,1.0,2.22044604925E-16));
#1235=DIRECTION('',(-0.0,1.0,2.22044604925E-16));
#1236=CARTESIAN_POINT('',(0.0,-96.9686269665969,105.0));
#1237=DIRECTION('',(-0.0,1.0,2.22044604925E-16));
#1238=DIRECTION('',(1.0,0.0,0.0));
#1239=CARTESIAN_POINT('',(0.0,-96.9686269665969,105.0));
#1240=DIRECTION('',(-0.0,1.0,2.22044604925E-16));
#1241=DIRECTION('',(1.0,0.0,0.0));
#1242=CARTESIAN_POINT('',(0.0,-93.0,105.0));
#1243=DIRECTION('',(0.0,1.0,2.22044604925E-16));
#1244=DIRECTION('',(-1.0,-0.0,0.0));
#1245=CARTESIAN_POINT('',(0.0,-102.500000000006,105.0));
#1246=DIRECTION('',(0.0,1.0,2.22044604925E-16));
#1247=DIRECTION('',(-1.0,-0.0,0.0));
#1248=CARTESIAN_POINT('',(0.0,-65.0,105.0));
#1249=DIRECTION('',(0.0,-1.0,-2.18628534080031E-16));
#1250=DIRECTION('',(0.0,-2.18628534080031E-16,1.0));
#1251=CARTESIAN_POINT('',(0.0,-65.0,105.0));
#1252=DIRECTION('',(0.0,-1.0,-2.18628534080031E-16));
#1253=DIRECTION('',(0.0,-2.18628534080031E-16,1.0));
#1254=CARTESIAN_POINT('',(0.0,0.0,40.0));
#1255=DIRECTION('',(0.0,-0.0,1.0));
#1256=DIRECTION('',(0.0,1.0,0.0));
#1257=CARTESIAN_POINT('',(0.0,0.0,40.0));
#1258=DIRECTION('',(0.0,-0.0,1.0));
#1259=DIRECTION('',(0.0,1.0,0.0));
#1260=CARTESIAN_POINT('',(0.0,0.0,2.49999999999362));
#1261=DIRECTION('',(-0.0,0.0,-1.0));
#1262=DIRECTION('',(-1.0,0.0,0.0));
#1263=DIRECTION('',(0.0,0.0,-1.0));
#1264=CARTESIAN_POINT('',(0.0,0.0,0.0));
#1265=DIRECTION('',(0.0,0.0,-1.0));
#1266=DIRECTION('',(1.0,0.0,0.0));
#1267=DIRECTION('',(0.0,0.0,-1.0));
#1268=CARTESIAN_POINT('',(0.0,0.0,8.03137303340311));
#1269=DIRECTION('',(0.0,-0.0,1.0));
#1270=DIRECTION('',(1.0,0.0,-0.0));
#1271=DIRECTION('',(-0.357142857142935,0.934049773615829,0.0));
#1272=DIRECTION('',(-0.357142857142935,0.934049773615829,0.0));
#1273=DIRECTION('',(0.0,0.0,-1.0));
#1274=DIRECTION('',(0.357142857142935,0.934049773615829,-0.0));
#1275=DIRECTION('',(0.0,0.0,-1.0));
#1276=DIRECTION('',(0.357142857142935,0.934049773615829,-0.0));
#1277=CARTESIAN_POINT('',(0.0,0.0,8.0));
#1278=DIRECTION('',(0.0,0.0,1.0));
#1279=DIRECTION('',(1.0,0.0,0.0));
#1280=CARTESIAN_POINT('',(0.0,-35.0,8.0));
#1281=DIRECTION('',(0.0,0.0,1.0));
#1282=DIRECTION('',(1.0,0.0,-0.0));
#1283=DIRECTION('',(0.357142857142935,0.934049773615829,-0.0));
#1284=CARTESIAN_POINT('',(0.0,0.0,8.0));
#1285=DIRECTION('',(0.0,0.0,1.0));
#1286=DIRECTION('',(1.0,0.0,0.0));
#1287=CARTESIAN_POINT('',(-1.110223024625E-15,-35.0,8.0));
#1288=DIRECTION('',(0.0,0.0,1.0));
#1289=DIRECTION('',(1.0,0.0,-0.0));
#1290=CARTESIAN_POINT('',(0.0,0.0,8.0));
#1291=DIRECTION('',(0.0,0.0,1.0));
#1292=DIRECTION('',(1.0,0.0,0.0));
#1293=CARTESIAN_POINT('',(-1.285879139105E-14,35.0,8.0));
#1294=DIRECTION('',(0.0,0.0,1.0));
#1295=DIRECTION('',(1.0,0.0,-0.0));
#1296=CARTESIAN_POINT('',(0.0,0.0,8.0));
#1297=DIRECTION('',(0.0,0.0,1.0));
#1298=DIRECTION('',(1.0,0.0,0.0));
#1299=DIRECTION('',(-0.357142857142935,0.934049773615829,0.0));
#1300=CARTESIAN_POINT('',(-1.285879139105E-14,35.0,8.0));
#1301=DIRECTION('',(0.0,0.0,1.0));
#1302=DIRECTION('',(1.0,0.0,-0.0));
#1303=CARTESIAN_POINT('',(0.0,0.0,12.0));
#1304=DIRECTION('',(-0.0,0.0,-1.0));
#1305=DIRECTION('',(-1.0,0.0,0.0));
#1306=CARTESIAN_POINT('',(0.0,0.0,0.0));
#1307=DIRECTION('',(-0.0,0.0,-1.0));
#1308=DIRECTION('',(-1.0,0.0,0.0));
#1309=DIRECTION('',(-0.0,0.0,-1.0));
#1310=CARTESIAN_POINT('',(0.0,-35.0,0.0));
#1311=DIRECTION('',(0.0,0.0,-1.0));
#1312=DIRECTION('',(1.0,0.0,0.0));
#1313=DIRECTION('',(-0.0,0.0,-1.0));
#1314=CARTESIAN_POINT('',(-1.285879139105E-14,35.0,0.0));
#1315=DIRECTION('',(0.0,0.0,-1.0));
#1316=DIRECTION('',(1.0,0.0,0.0));
#1317=CARTESIAN_POINT('',(-1.285879139105E-14,35.0,3.50000000001148));
#1318=DIRECTION('',(0.0,0.0,-1.0));
#1319=DIRECTION('',(1.0,0.0,0.0));
#1320=CARTESIAN_POINT('',(-1.110223024625E-15,-35.0,3.50000000001148));
#1321=DIRECTION('',(0.0,0.0,-1.0));
#1322=DIRECTION('',(1.0,0.0,0.0));
#1323=CARTESIAN_POINT('',(-1.285879139105E-14,35.0,0.0));
#1324=DIRECTION('',(0.0,0.0,-1.0));
#1325=DIRECTION('',(1.0,0.0,0.0));
#1326=CARTESIAN_POINT('',(-1.110223024625E-15,-35.0,0.0));
#1327=DIRECTION('',(0.0,0.0,-1.0));
#1328=DIRECTION('',(1.0,0.0,0.0));
#1329=DIRECTION('',(-0.357142857142935,0.934049773615829,0.0));
#1330=CARTESIAN_POINT('',(0.0,0.0,0.0));
#1331=DIRECTION('',(0.0,0.0,1.0));
#1332=DIRECTION('',(1.0,0.0,-0.0));
#1333=DIRECTION('',(0.357142857142935,0.934049773615829,-0.0));
#1334=CARTESIAN_POINT('',(0.0,0.0,8.03137303340311));
#1335=DIRECTION('',(0.0,0.0,-1.0));
#1336=DIRECTION('',(1.0,0.0,0.0));
#1337=DIRECTION('',(-0.0,0.0,-1.0));
#1338=DIRECTION('',(-0.0,0.0,-1.0));
ENDSEC;
END-ISO-10303-21;
