ISO-10303-21;
HEADER;
FILE_DESCRIPTION(('STEP AP214'),'1');
FILE_NAME('model2.step','2020-02-06T17:48:24',('Cubit 15.2'),(' '),'Spatial InterOp 3D',' ',' ');
FILE_SCHEMA(('automotive_design'));
ENDSEC;
DATA;
#1=PRODUCT_DEFINITION_CONTEXT('',#9,'design');
#2=APPLICATION_PROTOCOL_DEFINITION('INTERNATIONAL STANDARD','automotive_design',1994,#9);
#3=PRODUCT_CATEGORY_RELATIONSHIP('NONE','NONE',#10,#11);
#4=SHAPE_DEFINITION_REPRESENTATION(#12,#13);
#5= (GEOMETRIC_REPRESENTATION_CONTEXT(3)GLOBAL_UNCERTAINTY_ASSIGNED_CONTEXT((#16))GLOBAL_UNIT_ASSIGNED_CONTEXT((#18,#19,#20))REPRESENTATION_CONTEXT('NONE','WORKSPACE'));
#9=APPLICATION_CONTEXT(' ');
#10=PRODUCT_CATEGORY('part','NONE');
#11=PRODUCT_RELATED_PRODUCT_CATEGORY('detail',' ',(#22));
#12=PRODUCT_DEFINITION_SHAPE('NONE','NONE',#23);
#13=ADVANCED_BREP_SHAPE_REPRESENTATION('1',(#24,#25),#5);
#16=UNCERTAINTY_MEASURE_WITH_UNIT(LENGTH_MEASURE(1.0E-06),#18,'','');
#18= (CONVERSION_BASED_UNIT('MILLIMETRE',#28)LENGTH_UNIT()NAMED_UNIT(#31));
#19= (NAMED_UNIT(#33)PLANE_ANGLE_UNIT()SI_UNIT($,.RADIAN.));
#20= (NAMED_UNIT(#33)SOLID_ANGLE_UNIT()SI_UNIT($,.STERADIAN.));
#22=PRODUCT('1','1','PART-1-DESC',(#39));
#23=PRODUCT_DEFINITION('NONE','NONE',#40,#1);
#24=MANIFOLD_SOLID_BREP('1',#41);
#25=AXIS2_PLACEMENT_3D('',#42,#43,#44);
#28=LENGTH_MEASURE_WITH_UNIT(LENGTH_MEASURE(1.0),#45);
#31=DIMENSIONAL_EXPONENTS(1.0,0.0,0.0,0.0,0.0,0.0,0.0);
#33=DIMENSIONAL_EXPONENTS(0.0,0.0,0.0,0.0,0.0,0.0,0.0);
#39=PRODUCT_CONTEXT('',#9,'mechanical');
#40=PRODUCT_DEFINITION_FORMATION_WITH_SPECIFIED_SOURCE(' ','NONE',#22,.NOT_KNOWN.);
#41=CLOSED_SHELL('',(#46,#47,#48,#49,#50,#51,#52,#53,#54,#55,#56));
#42=CARTESIAN_POINT('',(0.0,0.0,0.0));
#43=DIRECTION('',(0.0,0.0,1.0));
#44=DIRECTION('',(1.0,0.0,0.0));
#45= (NAMED_UNIT(#31)LENGTH_UNIT()SI_UNIT(.MILLI.,.METRE.));
#46=ADVANCED_FACE('',(#58),#59,.T.);
#47=ADVANCED_FACE('',(#60),#61,.F.);
#48=ADVANCED_FACE('',(#62),#63,.F.);
#49=ADVANCED_FACE('',(#64),#65,.T.);
#50=ADVANCED_FACE('',(#66,#67),#68,.T.);
#51=ADVANCED_FACE('',(#69,#70),#71,.T.);
#52=ADVANCED_FACE('',(#72),#73,.T.);
#53=ADVANCED_FACE('',(#74),#75,.F.);
#54=ADVANCED_FACE('',(#76),#77,.F.);
#55=ADVANCED_FACE('',(#78),#79,.F.);
#56=ADVANCED_FACE('',(#80),#81,.F.);
#58=FACE_OUTER_BOUND('',#82,.T.);
#59=CYLINDRICAL_SURFACE('',#83,3.0);
#60=FACE_OUTER_BOUND('',#84,.T.);
#61=CYLINDRICAL_SURFACE('',#85,1.5);
#62=FACE_OUTER_BOUND('',#86,.T.);
#63=CYLINDRICAL_SURFACE('',#87,1.5);
#64=FACE_OUTER_BOUND('',#88,.T.);
#65=CYLINDRICAL_SURFACE('',#89,3.0);
#66=FACE_BOUND('',#90,.T.);
#67=FACE_OUTER_BOUND('',#91,.T.);
#68=PLANE('',#92);
#69=FACE_BOUND('',#93,.T.);
#70=FACE_OUTER_BOUND('',#94,.T.);
#71=PLANE('',#95);
#72=FACE_OUTER_BOUND('',#96,.T.);
#73=PLANE('',#97);
#74=FACE_OUTER_BOUND('',#98,.T.);
#75=PLANE('',#99);
#76=FACE_OUTER_BOUND('',#100,.T.);
#77=PLANE('',#101);
#78=FACE_OUTER_BOUND('',#102,.T.);
#79=PLANE('',#103);
#80=FACE_OUTER_BOUND('',#104,.T.);
#81=PLANE('',#105);
#82=EDGE_LOOP('',(#106,#107,#108,#109,#110,#111,#112,#113));
#83=AXIS2_PLACEMENT_3D('',#114,#115,#116);
#84=EDGE_LOOP('',(#117,#118,#119,#120));
#85=AXIS2_PLACEMENT_3D('',#121,#122,#123);
#86=EDGE_LOOP('',(#124,#125,#126,#127));
#87=AXIS2_PLACEMENT_3D('',#128,#129,#130);
#88=EDGE_LOOP('',(#131,#132,#133,#134,#135,#136,#137,#138));
#89=AXIS2_PLACEMENT_3D('',#139,#140,#141);
#90=EDGE_LOOP('',(#142,#143));
#91=EDGE_LOOP('',(#144,#145));
#92=AXIS2_PLACEMENT_3D('',#146,#147,#148);
#93=EDGE_LOOP('',(#149,#150));
#94=EDGE_LOOP('',(#151,#152));
#95=AXIS2_PLACEMENT_3D('',#153,#154,#155);
#96=EDGE_LOOP('',(#156,#157,#158,#159,#160));
#97=AXIS2_PLACEMENT_3D('',#161,#162,#163);
#98=EDGE_LOOP('',(#164,#165,#166,#167,#168));
#99=AXIS2_PLACEMENT_3D('',#169,#170,#171);
#100=EDGE_LOOP('',(#172,#173,#174,#175));
#101=AXIS2_PLACEMENT_3D('',#176,#177,#178);
#102=EDGE_LOOP('',(#179,#180,#181,#182));
#103=AXIS2_PLACEMENT_3D('',#183,#184,#185);
#104=EDGE_LOOP('',(#186,#187,#188,#189));
#105=AXIS2_PLACEMENT_3D('',#190,#191,#192);
#106=ORIENTED_EDGE('',*,*,#193,.F.);
#107=ORIENTED_EDGE('',*,*,#194,.F.);
#108=ORIENTED_EDGE('',*,*,#195,.T.);
#109=ORIENTED_EDGE('',*,*,#196,.F.);
#110=ORIENTED_EDGE('',*,*,#197,.F.);
#111=ORIENTED_EDGE('',*,*,#198,.F.);
#112=ORIENTED_EDGE('',*,*,#199,.F.);
#113=ORIENTED_EDGE('',*,*,#200,.F.);
#114=CARTESIAN_POINT('',(0.0,0.0,0.0));
#115=DIRECTION('',(0.0,0.0,1.0));
#116=DIRECTION('',(1.0,0.0,0.0));
#117=ORIENTED_EDGE('',*,*,#201,.F.);
#118=ORIENTED_EDGE('',*,*,#202,.F.);
#119=ORIENTED_EDGE('',*,*,#203,.T.);
#120=ORIENTED_EDGE('',*,*,#204,.F.);
#121=CARTESIAN_POINT('',(0.0,0.0,0.0));
#122=DIRECTION('',(0.0,0.0,1.0));
#123=DIRECTION('',(1.0,0.0,0.0));
#124=ORIENTED_EDGE('',*,*,#201,.T.);
#125=ORIENTED_EDGE('',*,*,#205,.F.);
#126=ORIENTED_EDGE('',*,*,#203,.F.);
#127=ORIENTED_EDGE('',*,*,#206,.F.);
#128=CARTESIAN_POINT('',(0.0,0.0,0.0));
#129=DIRECTION('',(0.0,0.0,1.0));
#130=DIRECTION('',(1.0,0.0,0.0));
#131=ORIENTED_EDGE('',*,*,#193,.T.);
#132=ORIENTED_EDGE('',*,*,#207,.F.);
#133=ORIENTED_EDGE('',*,*,#208,.T.);
#134=ORIENTED_EDGE('',*,*,#209,.F.);
#135=ORIENTED_EDGE('',*,*,#197,.T.);
#136=ORIENTED_EDGE('',*,*,#210,.F.);
#137=ORIENTED_EDGE('',*,*,#195,.F.);
#138=ORIENTED_EDGE('',*,*,#211,.F.);
#139=CARTESIAN_POINT('',(0.0,0.0,0.0));
#140=DIRECTION('',(0.0,0.0,1.0));
#141=DIRECTION('',(1.0,0.0,0.0));
#142=ORIENTED_EDGE('',*,*,#206,.T.);
#143=ORIENTED_EDGE('',*,*,#202,.T.);
#144=ORIENTED_EDGE('',*,*,#196,.T.);
#145=ORIENTED_EDGE('',*,*,#210,.T.);
#146=CARTESIAN_POINT('',(0.0,0.0,-2.0));
#147=DIRECTION('',(0.0,0.0,-1.0));
#148=DIRECTION('',(-1.0,0.0,0.0));
#149=ORIENTED_EDGE('',*,*,#204,.T.);
#150=ORIENTED_EDGE('',*,*,#205,.T.);
#151=ORIENTED_EDGE('',*,*,#211,.T.);
#152=ORIENTED_EDGE('',*,*,#194,.T.);
#153=CARTESIAN_POINT('',(0.0,0.0,2.0));
#154=DIRECTION('',(0.0,0.0,1.0));
#155=DIRECTION('',(1.0,0.0,0.0));
#156=ORIENTED_EDGE('',*,*,#207,.T.);
#157=ORIENTED_EDGE('',*,*,#200,.T.);
#158=ORIENTED_EDGE('',*,*,#212,.T.);
#159=ORIENTED_EDGE('',*,*,#213,.T.);
#160=ORIENTED_EDGE('',*,*,#214,.T.);
#161=CARTESIAN_POINT('',(5.0,0.0,1.0));
#162=DIRECTION('',(0.0,0.0,1.0));
#163=DIRECTION('',(1.0,0.0,0.0));
#164=ORIENTED_EDGE('',*,*,#198,.T.);
#165=ORIENTED_EDGE('',*,*,#209,.T.);
#166=ORIENTED_EDGE('',*,*,#215,.T.);
#167=ORIENTED_EDGE('',*,*,#216,.T.);
#168=ORIENTED_EDGE('',*,*,#217,.T.);
#169=CARTESIAN_POINT('',(5.0,0.0,-1.0));
#170=DIRECTION('',(0.0,0.0,1.0));
#171=DIRECTION('',(1.0,0.0,0.0));
#172=ORIENTED_EDGE('',*,*,#199,.T.);
#173=ORIENTED_EDGE('',*,*,#217,.F.);
#174=ORIENTED_EDGE('',*,*,#218,.F.);
#175=ORIENTED_EDGE('',*,*,#212,.F.);
#176=CARTESIAN_POINT('',(5.0,-3.0,0.0));
#177=DIRECTION('',(0.0,1.0,0.0));
#178=DIRECTION('',(0.0,0.0,1.0));
#179=ORIENTED_EDGE('',*,*,#219,.T.);
#180=ORIENTED_EDGE('',*,*,#215,.F.);
#181=ORIENTED_EDGE('',*,*,#208,.F.);
#182=ORIENTED_EDGE('',*,*,#214,.F.);
#183=CARTESIAN_POINT('',(5.0,3.0,0.0));
#184=DIRECTION('',(0.0,-1.0,0.0));
#185=DIRECTION('',(0.0,0.0,-1.0));
#186=ORIENTED_EDGE('',*,*,#218,.T.);
#187=ORIENTED_EDGE('',*,*,#216,.F.);
#188=ORIENTED_EDGE('',*,*,#219,.F.);
#189=ORIENTED_EDGE('',*,*,#213,.F.);
#190=CARTESIAN_POINT('',(10.0,0.0,0.0));
#191=DIRECTION('',(-1.0,0.0,0.0));
#192=DIRECTION('',(0.0,0.0,1.0));
#193=EDGE_CURVE('',#220,#221,#222,.T.);
#194=EDGE_CURVE('',#223,#220,#224,.T.);
#195=EDGE_CURVE('',#223,#225,#226,.T.);
#196=EDGE_CURVE('',#227,#225,#228,.T.);
#197=EDGE_CURVE('',#229,#227,#230,.T.);
#198=EDGE_CURVE('',#231,#229,#232,.T.);
#199=EDGE_CURVE('',#233,#231,#234,.T.);
#200=EDGE_CURVE('',#221,#233,#235,.T.);
#201=EDGE_CURVE('',#236,#237,#238,.T.);
#202=EDGE_CURVE('',#239,#236,#240,.T.);
#203=EDGE_CURVE('',#239,#241,#242,.T.);
#204=EDGE_CURVE('',#237,#241,#243,.T.);
#205=EDGE_CURVE('',#241,#237,#244,.T.);
#206=EDGE_CURVE('',#236,#239,#245,.T.);
#207=EDGE_CURVE('',#246,#221,#247,.T.);
#208=EDGE_CURVE('',#246,#248,#249,.T.);
#209=EDGE_CURVE('',#229,#248,#250,.T.);
#210=EDGE_CURVE('',#225,#227,#251,.T.);
#211=EDGE_CURVE('',#220,#223,#252,.T.);
#212=EDGE_CURVE('',#233,#253,#254,.T.);
#213=EDGE_CURVE('',#253,#255,#256,.T.);
#214=EDGE_CURVE('',#255,#246,#257,.T.);
#215=EDGE_CURVE('',#248,#258,#259,.T.);
#216=EDGE_CURVE('',#258,#260,#261,.T.);
#217=EDGE_CURVE('',#260,#231,#262,.T.);
#218=EDGE_CURVE('',#253,#260,#263,.T.);
#219=EDGE_CURVE('',#255,#258,#264,.T.);
#220=VERTEX_POINT('',#265);
#221=VERTEX_POINT('',#266);
#222=LINE('',#267,#268);
#223=VERTEX_POINT('',#269);
#224=CIRCLE('',#270,3.0);
#225=VERTEX_POINT('',#271);
#226=LINE('',#272,#273);
#227=VERTEX_POINT('',#274);
#228=CIRCLE('',#275,3.0);
#229=VERTEX_POINT('',#276);
#230=LINE('',#277,#278);
#231=VERTEX_POINT('',#279);
#232=CIRCLE('',#280,3.0);
#233=VERTEX_POINT('',#281);
#234=LINE('',#282,#283);
#235=CIRCLE('',#284,3.0);
#236=VERTEX_POINT('',#285);
#237=VERTEX_POINT('',#286);
#238=LINE('',#287,#288);
#239=VERTEX_POINT('',#289);
#240=CIRCLE('',#290,1.5);
#241=VERTEX_POINT('',#291);
#242=LINE('',#292,#293);
#243=CIRCLE('',#294,1.5);
#244=CIRCLE('',#295,1.5);
#245=CIRCLE('',#296,1.5);
#246=VERTEX_POINT('',#297);
#247=CIRCLE('',#298,3.0);
#248=VERTEX_POINT('',#299);
#249=LINE('',#300,#301);
#250=CIRCLE('',#302,3.0);
#251=CIRCLE('',#303,3.0);
#252=CIRCLE('',#304,3.0);
#253=VERTEX_POINT('',#305);
#254=LINE('',#306,#307);
#255=VERTEX_POINT('',#308);
#256=LINE('',#309,#310);
#257=LINE('',#311,#312);
#258=VERTEX_POINT('',#313);
#259=LINE('',#314,#315);
#260=VERTEX_POINT('',#316);
#261=LINE('',#317,#318);
#262=LINE('',#319,#320);
#263=LINE('',#321,#322);
#264=LINE('',#323,#324);
#265=CARTESIAN_POINT('',(3.0,0.0,2.0));
#266=CARTESIAN_POINT('',(3.0,0.0,1.0));
#267=CARTESIAN_POINT('',(3.0,0.0,0.0));
#268=VECTOR('',#325,3.0);
#269=CARTESIAN_POINT('',(-3.0,-3.67394039744206E-16,2.0));
#270=AXIS2_PLACEMENT_3D('',#326,#327,#328);
#271=CARTESIAN_POINT('',(-3.0,-3.67394039744206E-16,-2.0));
#272=CARTESIAN_POINT('',(-3.0,-3.67394039744206E-16,0.0));
#273=VECTOR('',#329,3.0);
#274=CARTESIAN_POINT('',(3.0,0.0,-2.0));
#275=AXIS2_PLACEMENT_3D('',#330,#331,#332);
#276=CARTESIAN_POINT('',(3.0,0.0,-1.0));
#277=CARTESIAN_POINT('',(3.0,0.0,0.0));
#278=VECTOR('',#333,3.0);
#279=CARTESIAN_POINT('',(0.0,-3.0,-1.0));
#280=AXIS2_PLACEMENT_3D('',#334,#335,#336);
#281=CARTESIAN_POINT('',(0.0,-3.0,1.0));
#282=CARTESIAN_POINT('',(0.0,-3.0,0.0));
#283=VECTOR('',#337,1.0);
#284=AXIS2_PLACEMENT_3D('',#338,#339,#340);
#285=CARTESIAN_POINT('',(1.5,0.0,-2.0));
#286=CARTESIAN_POINT('',(1.5,0.0,2.0));
#287=CARTESIAN_POINT('',(1.5,0.0,0.0));
#288=VECTOR('',#341,1.5);
#289=CARTESIAN_POINT('',(-1.5,-1.83697019872103E-16,-2.0));
#290=AXIS2_PLACEMENT_3D('',#342,#343,#344);
#291=CARTESIAN_POINT('',(-1.5,-1.83697019872103E-16,2.0));
#292=CARTESIAN_POINT('',(-1.5,-1.83697019872103E-16,0.0));
#293=VECTOR('',#345,1.5);
#294=AXIS2_PLACEMENT_3D('',#346,#347,#348);
#295=AXIS2_PLACEMENT_3D('',#349,#350,#351);
#296=AXIS2_PLACEMENT_3D('',#352,#353,#354);
#297=CARTESIAN_POINT('',(0.0,3.0,1.0));
#298=AXIS2_PLACEMENT_3D('',#355,#356,#357);
#299=CARTESIAN_POINT('',(0.0,3.0,-1.0));
#300=CARTESIAN_POINT('',(0.0,3.0,0.0));
#301=VECTOR('',#358,1.0);
#302=AXIS2_PLACEMENT_3D('',#359,#360,#361);
#303=AXIS2_PLACEMENT_3D('',#362,#363,#364);
#304=AXIS2_PLACEMENT_3D('',#365,#366,#367);
#305=CARTESIAN_POINT('',(10.0,-3.0,1.0));
#306=CARTESIAN_POINT('',(5.0,-3.0,1.0));
#307=VECTOR('',#368,1.0);
#308=CARTESIAN_POINT('',(10.0,3.0,1.0));
#309=CARTESIAN_POINT('',(10.0,0.0,1.0));
#310=VECTOR('',#369,1.0);
#311=CARTESIAN_POINT('',(5.0,3.0,1.0));
#312=VECTOR('',#370,1.0);
#313=CARTESIAN_POINT('',(10.0,3.0,-1.0));
#314=CARTESIAN_POINT('',(5.0,3.0,-1.0));
#315=VECTOR('',#371,1.0);
#316=CARTESIAN_POINT('',(10.0,-3.0,-1.0));
#317=CARTESIAN_POINT('',(10.0,0.0,-1.0));
#318=VECTOR('',#372,1.0);
#319=CARTESIAN_POINT('',(5.0,-3.0,-1.0));
#320=VECTOR('',#373,1.0);
#321=CARTESIAN_POINT('',(10.0,-3.0,0.0));
#322=VECTOR('',#374,1.0);
#323=CARTESIAN_POINT('',(10.0,3.0,0.0));
#324=VECTOR('',#375,1.0);
#325=DIRECTION('',(-0.0,-0.0,-1.0));
#326=CARTESIAN_POINT('',(0.0,0.0,2.0));
#327=DIRECTION('',(0.0,0.0,1.0));
#328=DIRECTION('',(1.0,0.0,0.0));
#329=DIRECTION('',(-0.0,-0.0,-1.0));
#330=CARTESIAN_POINT('',(0.0,0.0,-2.0));
#331=DIRECTION('',(0.0,0.0,-1.0));
#332=DIRECTION('',(1.0,0.0,0.0));
#333=DIRECTION('',(-0.0,-0.0,-1.0));
#334=CARTESIAN_POINT('',(0.0,0.0,-1.0));
#335=DIRECTION('',(0.0,0.0,1.0));
#336=DIRECTION('',(1.0,0.0,0.0));
#337=DIRECTION('',(0.0,0.0,-1.0));
#338=CARTESIAN_POINT('',(0.0,0.0,1.0));
#339=DIRECTION('',(0.0,0.0,-1.0));
#340=DIRECTION('',(1.0,0.0,0.0));
#341=DIRECTION('',(0.0,0.0,1.0));
#342=CARTESIAN_POINT('',(0.0,0.0,-2.0));
#343=DIRECTION('',(0.0,-0.0,1.0));
#344=DIRECTION('',(1.0,0.0,0.0));
#345=DIRECTION('',(0.0,0.0,1.0));
#346=CARTESIAN_POINT('',(0.0,0.0,2.0));
#347=DIRECTION('',(0.0,0.0,-1.0));
#348=DIRECTION('',(1.0,0.0,0.0));
#349=CARTESIAN_POINT('',(0.0,0.0,2.0));
#350=DIRECTION('',(0.0,0.0,-1.0));
#351=DIRECTION('',(1.0,0.0,0.0));
#352=CARTESIAN_POINT('',(0.0,0.0,-2.0));
#353=DIRECTION('',(0.0,-0.0,1.0));
#354=DIRECTION('',(1.0,0.0,0.0));
#355=CARTESIAN_POINT('',(0.0,0.0,1.0));
#356=DIRECTION('',(0.0,0.0,-1.0));
#357=DIRECTION('',(1.0,0.0,0.0));
#358=DIRECTION('',(0.0,0.0,-1.0));
#359=CARTESIAN_POINT('',(0.0,0.0,-1.0));
#360=DIRECTION('',(0.0,0.0,1.0));
#361=DIRECTION('',(1.0,0.0,0.0));
#362=CARTESIAN_POINT('',(0.0,0.0,-2.0));
#363=DIRECTION('',(0.0,0.0,-1.0));
#364=DIRECTION('',(1.0,0.0,0.0));
#365=CARTESIAN_POINT('',(0.0,0.0,2.0));
#366=DIRECTION('',(0.0,0.0,1.0));
#367=DIRECTION('',(1.0,0.0,0.0));
#368=DIRECTION('',(1.0,0.0,0.0));
#369=DIRECTION('',(0.0,1.0,0.0));
#370=DIRECTION('',(-1.0,0.0,0.0));
#371=DIRECTION('',(1.0,0.0,0.0));
#372=DIRECTION('',(0.0,-1.0,0.0));
#373=DIRECTION('',(-1.0,0.0,0.0));
#374=DIRECTION('',(0.0,0.0,-1.0));
#375=DIRECTION('',(0.0,0.0,-1.0));
ENDSEC;
END-ISO-10303-21;
