ISO-10303-21;
HEADER;
FILE_DESCRIPTION(('STEP AP214'),'1');
FILE_NAME('B57.step','2020-02-12T15:06:33',('Cubit 15.2'),(' '),'Spatial InterOp 3D',' ',' ');
FILE_SCHEMA(('automotive_design'));
ENDSEC;
DATA;
#1=PRODUCT_DEFINITION_CONTEXT('',#9,'design');
#2=APPLICATION_PROTOCOL_DEFINITION('INTERNATIONAL STANDARD','automotive_design',1994,#9);
#3=PRODUCT_CATEGORY_RELATIONSHIP('NONE','NONE',#10,#11);
#4=SHAPE_DEFINITION_REPRESENTATION(#12,#13);
#5= (GEOMETRIC_REPRESENTATION_CONTEXT(3)GLOBAL_UNCERTAINTY_ASSIGNED_CONTEXT((#16))GLOBAL_UNIT_ASSIGNED_CONTEXT((#18,#19,#20))REPRESENTATION_CONTEXT('NONE','WORKSPACE'));
#9=APPLICATION_CONTEXT(' ');
#10=PRODUCT_CATEGORY('part','NONE');
#11=PRODUCT_RELATED_PRODUCT_CATEGORY('detail',' ',(#22));
#12=PRODUCT_DEFINITION_SHAPE('NONE','NONE',#23);
#13=ADVANCED_BREP_SHAPE_REPRESENTATION('1',(#24,#25),#5);
#16=UNCERTAINTY_MEASURE_WITH_UNIT(LENGTH_MEASURE(1.0E-06),#18,'','');
#18= (CONVERSION_BASED_UNIT('MILLIMETRE',#28)LENGTH_UNIT()NAMED_UNIT(#31));
#19= (NAMED_UNIT(#33)PLANE_ANGLE_UNIT()SI_UNIT($,.RADIAN.));
#20= (NAMED_UNIT(#33)SOLID_ANGLE_UNIT()SI_UNIT($,.STERADIAN.));
#22=PRODUCT('1','1','PART-1-DESC',(#39));
#23=PRODUCT_DEFINITION('NONE','NONE',#40,#1);
#24=MANIFOLD_SOLID_BREP('1',#41);
#25=AXIS2_PLACEMENT_3D('',#42,#43,#44);
#28=LENGTH_MEASURE_WITH_UNIT(LENGTH_MEASURE(1.0),#45);
#31=DIMENSIONAL_EXPONENTS(1.0,0.0,0.0,0.0,0.0,0.0,0.0);
#33=DIMENSIONAL_EXPONENTS(0.0,0.0,0.0,0.0,0.0,0.0,0.0);
#39=PRODUCT_CONTEXT('',#9,'mechanical');
#40=PRODUCT_DEFINITION_FORMATION_WITH_SPECIFIED_SOURCE(' ','NONE',#22,.NOT_KNOWN.);
#41=CLOSED_SHELL('',(#46,#47,#48,#49,#50,#51,#52,#53,#54,#55,#56,#57,#58,#59,#60,#61,#62,#63,#64,#65,#66));
#42=CARTESIAN_POINT('',(0.0,0.0,0.0));
#43=DIRECTION('',(0.0,0.0,1.0));
#44=DIRECTION('',(1.0,0.0,0.0));
#45= (NAMED_UNIT(#31)LENGTH_UNIT()SI_UNIT(.MILLI.,.METRE.));
#46=ADVANCED_FACE('',(#68),#69,.F.);
#47=ADVANCED_FACE('',(#70),#71,.T.);
#48=ADVANCED_FACE('',(#72),#73,.T.);
#49=ADVANCED_FACE('',(#74),#75,.F.);
#50=ADVANCED_FACE('',(#76),#77,.F.);
#51=ADVANCED_FACE('',(#78),#79,.F.);
#52=ADVANCED_FACE('',(#80),#81,.F.);
#53=ADVANCED_FACE('',(#82),#83,.F.);
#54=ADVANCED_FACE('',(#84),#85,.F.);
#55=ADVANCED_FACE('',(#86),#87,.T.);
#56=ADVANCED_FACE('',(#88),#89,.T.);
#57=ADVANCED_FACE('',(#90),#91,.T.);
#58=ADVANCED_FACE('',(#92),#93,.T.);
#59=ADVANCED_FACE('',(#94),#95,.F.);
#60=ADVANCED_FACE('',(#96),#97,.F.);
#61=ADVANCED_FACE('',(#98,#99,#100),#101,.T.);
#62=ADVANCED_FACE('',(#102,#103),#104,.F.);
#63=ADVANCED_FACE('',(#105,#106),#107,.F.);
#64=ADVANCED_FACE('',(#108),#109,.F.);
#65=ADVANCED_FACE('',(#110),#111,.F.);
#66=ADVANCED_FACE('',(#112,#113),#114,.F.);
#68=FACE_OUTER_BOUND('',#115,.T.);
#69=CYLINDRICAL_SURFACE('',#116,1.0);
#70=FACE_OUTER_BOUND('',#117,.T.);
#71=CYLINDRICAL_SURFACE('',#118,1.0);
#72=FACE_OUTER_BOUND('',#119,.T.);
#73=CYLINDRICAL_SURFACE('',#120,1.0);
#74=FACE_OUTER_BOUND('',#121,.T.);
#75=CYLINDRICAL_SURFACE('',#122,0.5);
#76=FACE_OUTER_BOUND('',#123,.T.);
#77=CYLINDRICAL_SURFACE('',#124,0.5);
#78=FACE_OUTER_BOUND('',#125,.T.);
#79=CYLINDRICAL_SURFACE('',#126,0.5);
#80=FACE_OUTER_BOUND('',#127,.T.);
#81=PLANE('',#128);
#82=FACE_OUTER_BOUND('',#129,.T.);
#83=CYLINDRICAL_SURFACE('',#130,0.5);
#84=FACE_OUTER_BOUND('',#131,.T.);
#85=PLANE('',#132);
#86=FACE_OUTER_BOUND('',#133,.T.);
#87=CYLINDRICAL_SURFACE('',#134,1.0);
#88=FACE_OUTER_BOUND('',#135,.T.);
#89=PLANE('',#136);
#90=FACE_OUTER_BOUND('',#137,.T.);
#91=CYLINDRICAL_SURFACE('',#138,1.0);
#92=FACE_OUTER_BOUND('',#139,.T.);
#93=PLANE('',#140);
#94=FACE_OUTER_BOUND('',#141,.T.);
#95=CYLINDRICAL_SURFACE('',#142,1.0);
#96=FACE_OUTER_BOUND('',#143,.T.);
#97=PLANE('',#144);
#98=FACE_BOUND('',#145,.T.);
#99=FACE_BOUND('',#146,.T.);
#100=FACE_OUTER_BOUND('',#147,.T.);
#101=PLANE('',#148);
#102=FACE_BOUND('',#149,.T.);
#103=FACE_OUTER_BOUND('',#150,.T.);
#104=PLANE('',#151);
#105=FACE_BOUND('',#152,.T.);
#106=FACE_OUTER_BOUND('',#153,.T.);
#107=PLANE('',#154);
#108=FACE_OUTER_BOUND('',#155,.T.);
#109=PLANE('',#156);
#110=FACE_OUTER_BOUND('',#157,.T.);
#111=PLANE('',#158);
#112=FACE_BOUND('',#159,.T.);
#113=FACE_OUTER_BOUND('',#160,.T.);
#114=PLANE('',#161);
#115=EDGE_LOOP('',(#162,#163,#164,#165,#166));
#116=AXIS2_PLACEMENT_3D('',#167,#168,#169);
#117=EDGE_LOOP('',(#170,#171,#172,#173));
#118=AXIS2_PLACEMENT_3D('',#174,#175,#176);
#119=EDGE_LOOP('',(#177,#178,#179,#180));
#120=AXIS2_PLACEMENT_3D('',#181,#182,#183);
#121=EDGE_LOOP('',(#184,#185,#186,#187));
#122=AXIS2_PLACEMENT_3D('',#188,#189,#190);
#123=EDGE_LOOP('',(#191,#192,#193,#194));
#124=AXIS2_PLACEMENT_3D('',#195,#196,#197);
#125=EDGE_LOOP('',(#198,#199,#200,#201));
#126=AXIS2_PLACEMENT_3D('',#202,#203,#204);
#127=EDGE_LOOP('',(#205,#206));
#128=AXIS2_PLACEMENT_3D('',#207,#208,#209);
#129=EDGE_LOOP('',(#210,#211,#212,#213));
#130=AXIS2_PLACEMENT_3D('',#214,#215,#216);
#131=EDGE_LOOP('',(#217,#218));
#132=AXIS2_PLACEMENT_3D('',#219,#220,#221);
#133=EDGE_LOOP('',(#222,#223,#224,#225));
#134=AXIS2_PLACEMENT_3D('',#226,#227,#228);
#135=EDGE_LOOP('',(#229,#230));
#136=AXIS2_PLACEMENT_3D('',#231,#232,#233);
#137=EDGE_LOOP('',(#234,#235,#236,#237));
#138=AXIS2_PLACEMENT_3D('',#238,#239,#240);
#139=EDGE_LOOP('',(#241,#242));
#140=AXIS2_PLACEMENT_3D('',#243,#244,#245);
#141=EDGE_LOOP('',(#246,#247,#248,#249));
#142=AXIS2_PLACEMENT_3D('',#250,#251,#252);
#143=EDGE_LOOP('',(#253,#254,#255));
#144=AXIS2_PLACEMENT_3D('',#256,#257,#258);
#145=EDGE_LOOP('',(#259,#260));
#146=EDGE_LOOP('',(#261,#262));
#147=EDGE_LOOP('',(#263,#264,#265,#266));
#148=AXIS2_PLACEMENT_3D('',#267,#268,#269);
#149=EDGE_LOOP('',(#270,#271));
#150=EDGE_LOOP('',(#272,#273,#274,#275));
#151=AXIS2_PLACEMENT_3D('',#276,#277,#278);
#152=EDGE_LOOP('',(#279,#280));
#153=EDGE_LOOP('',(#281,#282,#283,#284));
#154=AXIS2_PLACEMENT_3D('',#285,#286,#287);
#155=EDGE_LOOP('',(#288,#289,#290,#291));
#156=AXIS2_PLACEMENT_3D('',#292,#293,#294);
#157=EDGE_LOOP('',(#295,#296,#297,#298));
#158=AXIS2_PLACEMENT_3D('',#299,#300,#301);
#159=EDGE_LOOP('',(#302,#303));
#160=EDGE_LOOP('',(#304,#305,#306,#307));
#161=AXIS2_PLACEMENT_3D('',#308,#309,#310);
#162=ORIENTED_EDGE('',*,*,#311,.F.);
#163=ORIENTED_EDGE('',*,*,#312,.T.);
#164=ORIENTED_EDGE('',*,*,#313,.T.);
#165=ORIENTED_EDGE('',*,*,#314,.T.);
#166=ORIENTED_EDGE('',*,*,#315,.F.);
#167=CARTESIAN_POINT('',(-1.5,0.75,2.0));
#168=DIRECTION('',(0.0,0.0,1.0));
#169=DIRECTION('',(1.0,0.0,0.0));
#170=ORIENTED_EDGE('',*,*,#316,.F.);
#171=ORIENTED_EDGE('',*,*,#317,.F.);
#172=ORIENTED_EDGE('',*,*,#318,.T.);
#173=ORIENTED_EDGE('',*,*,#319,.F.);
#174=CARTESIAN_POINT('',(-2.0,0.0,-2.0));
#175=DIRECTION('',(0.0,0.0,1.0));
#176=DIRECTION('',(1.0,0.0,0.0));
#177=ORIENTED_EDGE('',*,*,#320,.F.);
#178=ORIENTED_EDGE('',*,*,#321,.F.);
#179=ORIENTED_EDGE('',*,*,#322,.T.);
#180=ORIENTED_EDGE('',*,*,#323,.F.);
#181=CARTESIAN_POINT('',(2.0,0.0,2.0));
#182=DIRECTION('',(0.0,0.0,1.0));
#183=DIRECTION('',(1.0,0.0,0.0));
#184=ORIENTED_EDGE('',*,*,#324,.F.);
#185=ORIENTED_EDGE('',*,*,#325,.T.);
#186=ORIENTED_EDGE('',*,*,#326,.T.);
#187=ORIENTED_EDGE('',*,*,#327,.F.);
#188=CARTESIAN_POINT('',(3.0,0.0,0.0));
#189=DIRECTION('',(1.0,0.0,6.12323399573676E-17));
#190=DIRECTION('',(6.12323399573676E-17,0.0,-1.0));
#191=ORIENTED_EDGE('',*,*,#328,.F.);
#192=ORIENTED_EDGE('',*,*,#329,.F.);
#193=ORIENTED_EDGE('',*,*,#330,.T.);
#194=ORIENTED_EDGE('',*,*,#331,.T.);
#195=CARTESIAN_POINT('',(-4.0,-1.0,0.0));
#196=DIRECTION('',(6.12323399573676E-17,1.0,6.12323399573676E-17));
#197=DIRECTION('',(3.74939945665464E-33,6.12323399573676E-17,-1.0));
#198=ORIENTED_EDGE('',*,*,#328,.T.);
#199=ORIENTED_EDGE('',*,*,#332,.T.);
#200=ORIENTED_EDGE('',*,*,#330,.F.);
#201=ORIENTED_EDGE('',*,*,#333,.F.);
#202=CARTESIAN_POINT('',(-4.0,-1.0,0.0));
#203=DIRECTION('',(6.12323399573676E-17,1.0,6.12323399573676E-17));
#204=DIRECTION('',(3.74939945665464E-33,6.12323399573676E-17,-1.0));
#205=ORIENTED_EDGE('',*,*,#332,.F.);
#206=ORIENTED_EDGE('',*,*,#331,.F.);
#207=CARTESIAN_POINT('',(-4.0,1.0,1.22464679914735E-16));
#208=DIRECTION('',(6.12323399573676E-17,1.0,6.12323399573676E-17));
#209=DIRECTION('',(3.74939945665464E-33,6.12323399573676E-17,-1.0));
#210=ORIENTED_EDGE('',*,*,#324,.T.);
#211=ORIENTED_EDGE('',*,*,#334,.F.);
#212=ORIENTED_EDGE('',*,*,#326,.F.);
#213=ORIENTED_EDGE('',*,*,#335,.T.);
#214=CARTESIAN_POINT('',(3.0,0.0,0.0));
#215=DIRECTION('',(1.0,0.0,6.12323399573676E-17));
#216=DIRECTION('',(6.12323399573676E-17,0.0,-1.0));
#217=ORIENTED_EDGE('',*,*,#325,.F.);
#218=ORIENTED_EDGE('',*,*,#335,.F.);
#219=CARTESIAN_POINT('',(1.0,0.0,-1.22464679914735E-16));
#220=DIRECTION('',(-1.0,0.0,-6.12323399573676E-17));
#221=DIRECTION('',(-6.12323399573676E-17,0.0,1.0));
#222=ORIENTED_EDGE('',*,*,#320,.T.);
#223=ORIENTED_EDGE('',*,*,#336,.F.);
#224=ORIENTED_EDGE('',*,*,#322,.F.);
#225=ORIENTED_EDGE('',*,*,#337,.F.);
#226=CARTESIAN_POINT('',(2.0,0.0,2.0));
#227=DIRECTION('',(0.0,0.0,1.0));
#228=DIRECTION('',(1.0,0.0,0.0));
#229=ORIENTED_EDGE('',*,*,#337,.T.);
#230=ORIENTED_EDGE('',*,*,#321,.T.);
#231=CARTESIAN_POINT('',(2.0,0.0,4.0));
#232=DIRECTION('',(0.0,0.0,1.0));
#233=DIRECTION('',(1.0,0.0,0.0));
#234=ORIENTED_EDGE('',*,*,#316,.T.);
#235=ORIENTED_EDGE('',*,*,#338,.F.);
#236=ORIENTED_EDGE('',*,*,#318,.F.);
#237=ORIENTED_EDGE('',*,*,#339,.F.);
#238=CARTESIAN_POINT('',(-2.0,0.0,-2.0));
#239=DIRECTION('',(0.0,0.0,1.0));
#240=DIRECTION('',(1.0,0.0,0.0));
#241=ORIENTED_EDGE('',*,*,#319,.T.);
#242=ORIENTED_EDGE('',*,*,#338,.T.);
#243=CARTESIAN_POINT('',(-2.0,0.0,-4.0));
#244=DIRECTION('',(0.0,0.0,-1.0));
#245=DIRECTION('',(-1.0,0.0,0.0));
#246=ORIENTED_EDGE('',*,*,#311,.T.);
#247=ORIENTED_EDGE('',*,*,#340,.F.);
#248=ORIENTED_EDGE('',*,*,#314,.F.);
#249=ORIENTED_EDGE('',*,*,#341,.T.);
#250=CARTESIAN_POINT('',(-1.5,0.75,2.0));
#251=DIRECTION('',(0.0,0.0,1.0));
#252=DIRECTION('',(1.0,0.0,0.0));
#253=ORIENTED_EDGE('',*,*,#313,.F.);
#254=ORIENTED_EDGE('',*,*,#312,.F.);
#255=ORIENTED_EDGE('',*,*,#341,.F.);
#256=CARTESIAN_POINT('',(-1.5,0.75,0.0));
#257=DIRECTION('',(0.0,0.0,-1.0));
#258=DIRECTION('',(-1.0,0.0,0.0));
#259=ORIENTED_EDGE('',*,*,#336,.T.);
#260=ORIENTED_EDGE('',*,*,#323,.T.);
#261=ORIENTED_EDGE('',*,*,#340,.T.);
#262=ORIENTED_EDGE('',*,*,#315,.T.);
#263=ORIENTED_EDGE('',*,*,#342,.T.);
#264=ORIENTED_EDGE('',*,*,#343,.T.);
#265=ORIENTED_EDGE('',*,*,#344,.T.);
#266=ORIENTED_EDGE('',*,*,#345,.T.);
#267=CARTESIAN_POINT('',(0.0,0.0,1.5));
#268=DIRECTION('',(0.0,0.0,1.0));
#269=DIRECTION('',(1.0,0.0,0.0));
#270=ORIENTED_EDGE('',*,*,#317,.T.);
#271=ORIENTED_EDGE('',*,*,#339,.T.);
#272=ORIENTED_EDGE('',*,*,#346,.T.);
#273=ORIENTED_EDGE('',*,*,#347,.T.);
#274=ORIENTED_EDGE('',*,*,#348,.T.);
#275=ORIENTED_EDGE('',*,*,#349,.T.);
#276=CARTESIAN_POINT('',(0.0,0.0,-1.5));
#277=DIRECTION('',(0.0,0.0,1.0));
#278=DIRECTION('',(1.0,0.0,0.0));
#279=ORIENTED_EDGE('',*,*,#329,.T.);
#280=ORIENTED_EDGE('',*,*,#333,.T.);
#281=ORIENTED_EDGE('',*,*,#350,.T.);
#282=ORIENTED_EDGE('',*,*,#347,.F.);
#283=ORIENTED_EDGE('',*,*,#351,.F.);
#284=ORIENTED_EDGE('',*,*,#345,.F.);
#285=CARTESIAN_POINT('',(0.0,-2.5,0.0));
#286=DIRECTION('',(0.0,1.0,-0.0));
#287=DIRECTION('',(-0.0,0.0,1.0));
#288=ORIENTED_EDGE('',*,*,#352,.T.);
#289=ORIENTED_EDGE('',*,*,#348,.F.);
#290=ORIENTED_EDGE('',*,*,#350,.F.);
#291=ORIENTED_EDGE('',*,*,#344,.F.);
#292=CARTESIAN_POINT('',(-5.0,0.0,0.0));
#293=DIRECTION('',(1.0,0.0,0.0));
#294=DIRECTION('',(0.0,0.0,-1.0));
#295=ORIENTED_EDGE('',*,*,#353,.T.);
#296=ORIENTED_EDGE('',*,*,#349,.F.);
#297=ORIENTED_EDGE('',*,*,#352,.F.);
#298=ORIENTED_EDGE('',*,*,#343,.F.);
#299=CARTESIAN_POINT('',(0.0,2.5,0.0));
#300=DIRECTION('',(0.0,-1.0,0.0));
#301=DIRECTION('',(0.0,0.0,-1.0));
#302=ORIENTED_EDGE('',*,*,#327,.T.);
#303=ORIENTED_EDGE('',*,*,#334,.T.);
#304=ORIENTED_EDGE('',*,*,#351,.T.);
#305=ORIENTED_EDGE('',*,*,#346,.F.);
#306=ORIENTED_EDGE('',*,*,#353,.F.);
#307=ORIENTED_EDGE('',*,*,#342,.F.);
#308=CARTESIAN_POINT('',(5.0,0.0,0.0));
#309=DIRECTION('',(-1.0,0.0,0.0));
#310=DIRECTION('',(0.0,-0.0,1.0));
#311=EDGE_CURVE('',#354,#355,#356,.T.);
#312=EDGE_CURVE('',#354,#357,#358,.T.);
#313=EDGE_CURVE('',#357,#359,#360,.T.);
#314=EDGE_CURVE('',#359,#361,#362,.T.);
#315=EDGE_CURVE('',#355,#361,#363,.T.);
#316=EDGE_CURVE('',#364,#365,#366,.T.);
#317=EDGE_CURVE('',#367,#364,#368,.T.);
#318=EDGE_CURVE('',#367,#369,#370,.T.);
#319=EDGE_CURVE('',#365,#369,#371,.T.);
#320=EDGE_CURVE('',#372,#373,#374,.T.);
#321=EDGE_CURVE('',#375,#372,#376,.T.);
#322=EDGE_CURVE('',#375,#377,#378,.T.);
#323=EDGE_CURVE('',#373,#377,#379,.T.);
#324=EDGE_CURVE('',#380,#381,#382,.T.);
#325=EDGE_CURVE('',#380,#383,#384,.T.);
#326=EDGE_CURVE('',#383,#385,#386,.T.);
#327=EDGE_CURVE('',#381,#385,#387,.T.);
#328=EDGE_CURVE('',#388,#389,#390,.T.);
#329=EDGE_CURVE('',#391,#388,#392,.T.);
#330=EDGE_CURVE('',#391,#393,#394,.T.);
#331=EDGE_CURVE('',#393,#389,#395,.T.);
#332=EDGE_CURVE('',#389,#393,#396,.T.);
#333=EDGE_CURVE('',#388,#391,#397,.T.);
#334=EDGE_CURVE('',#385,#381,#398,.T.);
#335=EDGE_CURVE('',#383,#380,#399,.T.);
#336=EDGE_CURVE('',#377,#373,#400,.T.);
#337=EDGE_CURVE('',#372,#375,#401,.T.);
#338=EDGE_CURVE('',#369,#365,#402,.T.);
#339=EDGE_CURVE('',#364,#367,#403,.T.);
#340=EDGE_CURVE('',#361,#355,#404,.T.);
#341=EDGE_CURVE('',#359,#354,#405,.T.);
#342=EDGE_CURVE('',#406,#407,#408,.T.);
#343=EDGE_CURVE('',#407,#409,#410,.T.);
#344=EDGE_CURVE('',#409,#411,#412,.T.);
#345=EDGE_CURVE('',#411,#406,#413,.T.);
#346=EDGE_CURVE('',#414,#415,#416,.T.);
#347=EDGE_CURVE('',#415,#417,#418,.T.);
#348=EDGE_CURVE('',#417,#419,#420,.T.);
#349=EDGE_CURVE('',#419,#414,#421,.T.);
#350=EDGE_CURVE('',#411,#417,#422,.T.);
#351=EDGE_CURVE('',#406,#415,#423,.T.);
#352=EDGE_CURVE('',#409,#419,#424,.T.);
#353=EDGE_CURVE('',#407,#414,#425,.T.);
#354=VERTEX_POINT('',#426);
#355=VERTEX_POINT('',#427);
#356=LINE('',#428,#429);
#357=VERTEX_POINT('',#430);
#358=CIRCLE('',#431,1.0);
#359=VERTEX_POINT('',#432);
#360=CIRCLE('',#433,1.0);
#361=VERTEX_POINT('',#434);
#362=LINE('',#435,#436);
#363=CIRCLE('',#437,1.0);
#364=VERTEX_POINT('',#438);
#365=VERTEX_POINT('',#439);
#366=LINE('',#440,#441);
#367=VERTEX_POINT('',#442);
#368=CIRCLE('',#443,1.0);
#369=VERTEX_POINT('',#444);
#370=LINE('',#445,#446);
#371=CIRCLE('',#447,1.0);
#372=VERTEX_POINT('',#448);
#373=VERTEX_POINT('',#449);
#374=LINE('',#450,#451);
#375=VERTEX_POINT('',#452);
#376=CIRCLE('',#453,1.0);
#377=VERTEX_POINT('',#454);
#378=LINE('',#455,#456);
#379=CIRCLE('',#457,1.0);
#380=VERTEX_POINT('',#458);
#381=VERTEX_POINT('',#459);
#382=LINE('',#460,#461);
#383=VERTEX_POINT('',#462);
#384=CIRCLE('',#463,0.5);
#385=VERTEX_POINT('',#464);
#386=LINE('',#465,#466);
#387=CIRCLE('',#467,0.5);
#388=VERTEX_POINT('',#468);
#389=VERTEX_POINT('',#469);
#390=LINE('',#470,#471);
#391=VERTEX_POINT('',#472);
#392=CIRCLE('',#473,0.5);
#393=VERTEX_POINT('',#474);
#394=LINE('',#475,#476);
#395=CIRCLE('',#477,0.5);
#396=CIRCLE('',#478,0.5);
#397=CIRCLE('',#479,0.5);
#398=CIRCLE('',#480,0.5);
#399=CIRCLE('',#481,0.5);
#400=CIRCLE('',#482,1.0);
#401=CIRCLE('',#483,1.0);
#402=CIRCLE('',#484,1.0);
#403=CIRCLE('',#485,1.0);
#404=CIRCLE('',#486,1.0);
#405=CIRCLE('',#487,1.0);
#406=VERTEX_POINT('',#488);
#407=VERTEX_POINT('',#489);
#408=LINE('',#490,#491);
#409=VERTEX_POINT('',#492);
#410=LINE('',#493,#494);
#411=VERTEX_POINT('',#495);
#412=LINE('',#496,#497);
#413=LINE('',#498,#499);
#414=VERTEX_POINT('',#500);
#415=VERTEX_POINT('',#501);
#416=LINE('',#502,#503);
#417=VERTEX_POINT('',#504);
#418=LINE('',#505,#506);
#419=VERTEX_POINT('',#507);
#420=LINE('',#508,#509);
#421=LINE('',#510,#511);
#422=LINE('',#512,#513);
#423=LINE('',#514,#515);
#424=LINE('',#516,#517);
#425=LINE('',#518,#519);
#426=CARTESIAN_POINT('',(-0.5,0.75,0.0));
#427=CARTESIAN_POINT('',(-0.5,0.75,1.5));
#428=CARTESIAN_POINT('',(-0.5,0.75,2.0));
#429=VECTOR('',#520,1.0);
#430=CARTESIAN_POINT('',(-1.00724654675478,-0.120168968830144,0.0));
#431=AXIS2_PLACEMENT_3D('',#521,#522,#523);
#432=CARTESIAN_POINT('',(-2.5,0.75,0.0));
#433=AXIS2_PLACEMENT_3D('',#524,#525,#526);
#434=CARTESIAN_POINT('',(-2.5,0.75,1.5));
#435=CARTESIAN_POINT('',(-2.5,0.75,2.0));
#436=VECTOR('',#527,1.0);
#437=AXIS2_PLACEMENT_3D('',#528,#529,#530);
#438=CARTESIAN_POINT('',(-1.0,0.0,-1.5));
#439=CARTESIAN_POINT('',(-1.0,0.0,-4.0));
#440=CARTESIAN_POINT('',(-1.0,0.0,-2.0));
#441=VECTOR('',#531,1.0);
#442=CARTESIAN_POINT('',(-3.0,-1.22464679914735E-16,-1.5));
#443=AXIS2_PLACEMENT_3D('',#532,#533,#534);
#444=CARTESIAN_POINT('',(-3.0,-1.22464679914735E-16,-4.0));
#445=CARTESIAN_POINT('',(-3.0,-1.22464679914735E-16,-2.0));
#446=VECTOR('',#535,1.0);
#447=AXIS2_PLACEMENT_3D('',#536,#537,#538);
#448=CARTESIAN_POINT('',(3.0,0.0,4.0));
#449=CARTESIAN_POINT('',(3.0,0.0,1.5));
#450=CARTESIAN_POINT('',(3.0,0.0,2.0));
#451=VECTOR('',#539,1.0);
#452=CARTESIAN_POINT('',(1.0,-1.22464679914735E-16,4.0));
#453=AXIS2_PLACEMENT_3D('',#540,#541,#542);
#454=CARTESIAN_POINT('',(1.0,1.22464679914735E-16,1.5));
#455=CARTESIAN_POINT('',(1.0,-1.22464679914735E-16,2.0));
#456=VECTOR('',#543,1.0);
#457=AXIS2_PLACEMENT_3D('',#544,#545,#546);
#458=CARTESIAN_POINT('',(1.0,0.0,-0.5));
#459=CARTESIAN_POINT('',(5.0,0.0,-0.5));
#460=CARTESIAN_POINT('',(3.0,0.0,-0.5));
#461=VECTOR('',#547,0.5);
#462=CARTESIAN_POINT('',(1.0,-6.12323399573676E-17,0.5));
#463=AXIS2_PLACEMENT_3D('',#548,#549,#550);
#464=CARTESIAN_POINT('',(5.0,-6.12323399573676E-17,0.5));
#465=CARTESIAN_POINT('',(3.0,-6.12323399573676E-17,0.5));
#466=VECTOR('',#551,0.5);
#467=AXIS2_PLACEMENT_3D('',#552,#553,#554);
#468=CARTESIAN_POINT('',(-4.0,-2.5,-0.5));
#469=CARTESIAN_POINT('',(-4.0,1.0,-0.5));
#470=CARTESIAN_POINT('',(-4.0,-1.0,-0.5));
#471=VECTOR('',#555,0.5);
#472=CARTESIAN_POINT('',(-4.0,-2.5,0.5));
#473=AXIS2_PLACEMENT_3D('',#556,#557,#558);
#474=CARTESIAN_POINT('',(-4.0,1.0,0.5));
#475=CARTESIAN_POINT('',(-4.0,-1.0,0.5));
#476=VECTOR('',#559,0.5);
#477=AXIS2_PLACEMENT_3D('',#560,#561,#562);
#478=AXIS2_PLACEMENT_3D('',#563,#564,#565);
#479=AXIS2_PLACEMENT_3D('',#566,#567,#568);
#480=AXIS2_PLACEMENT_3D('',#569,#570,#571);
#481=AXIS2_PLACEMENT_3D('',#572,#573,#574);
#482=AXIS2_PLACEMENT_3D('',#575,#576,#577);
#483=AXIS2_PLACEMENT_3D('',#578,#579,#580);
#484=AXIS2_PLACEMENT_3D('',#581,#582,#583);
#485=AXIS2_PLACEMENT_3D('',#584,#585,#586);
#486=AXIS2_PLACEMENT_3D('',#587,#588,#589);
#487=AXIS2_PLACEMENT_3D('',#590,#591,#592);
#488=CARTESIAN_POINT('',(5.0,-2.5,1.5));
#489=CARTESIAN_POINT('',(5.0,2.5,1.5));
#490=CARTESIAN_POINT('',(5.0,0.0,1.5));
#491=VECTOR('',#593,1.0);
#492=CARTESIAN_POINT('',(-5.0,2.5,1.5));
#493=CARTESIAN_POINT('',(0.0,2.5,1.5));
#494=VECTOR('',#594,1.0);
#495=CARTESIAN_POINT('',(-5.0,-2.5,1.5));
#496=CARTESIAN_POINT('',(-5.0,0.0,1.5));
#497=VECTOR('',#595,1.0);
#498=CARTESIAN_POINT('',(0.0,-2.5,1.5));
#499=VECTOR('',#596,1.0);
#500=CARTESIAN_POINT('',(5.0,2.5,-1.5));
#501=CARTESIAN_POINT('',(5.0,-2.5,-1.5));
#502=CARTESIAN_POINT('',(5.0,0.0,-1.5));
#503=VECTOR('',#597,1.0);
#504=CARTESIAN_POINT('',(-5.0,-2.5,-1.5));
#505=CARTESIAN_POINT('',(0.0,-2.5,-1.5));
#506=VECTOR('',#598,1.0);
#507=CARTESIAN_POINT('',(-5.0,2.5,-1.5));
#508=CARTESIAN_POINT('',(-5.0,0.0,-1.5));
#509=VECTOR('',#599,1.0);
#510=CARTESIAN_POINT('',(0.0,2.5,-1.5));
#511=VECTOR('',#600,1.0);
#512=CARTESIAN_POINT('',(-5.0,-2.5,0.0));
#513=VECTOR('',#601,1.0);
#514=CARTESIAN_POINT('',(5.0,-2.5,0.0));
#515=VECTOR('',#602,1.0);
#516=CARTESIAN_POINT('',(-5.0,2.5,0.0));
#517=VECTOR('',#603,1.0);
#518=CARTESIAN_POINT('',(5.0,2.5,0.0));
#519=VECTOR('',#604,1.0);
#520=DIRECTION('',(0.0,0.0,1.0));
#521=CARTESIAN_POINT('',(-1.5,0.75,0.0));
#522=DIRECTION('',(0.0,0.0,-1.0));
#523=DIRECTION('',(1.0,0.0,0.0));
#524=CARTESIAN_POINT('',(-1.5,0.75,0.0));
#525=DIRECTION('',(0.0,0.0,-1.0));
#526=DIRECTION('',(1.0,0.0,0.0));
#527=DIRECTION('',(0.0,0.0,1.0));
#528=CARTESIAN_POINT('',(-1.5,0.75,1.5));
#529=DIRECTION('',(0.0,0.0,-1.0));
#530=DIRECTION('',(1.0,0.0,0.0));
#531=DIRECTION('',(-0.0,-0.0,-1.0));
#532=CARTESIAN_POINT('',(-2.0,0.0,-1.5));
#533=DIRECTION('',(0.0,0.0,1.0));
#534=DIRECTION('',(1.0,0.0,0.0));
#535=DIRECTION('',(-0.0,-0.0,-1.0));
#536=CARTESIAN_POINT('',(-2.0,0.0,-4.0));
#537=DIRECTION('',(0.0,0.0,-1.0));
#538=DIRECTION('',(1.0,0.0,0.0));
#539=DIRECTION('',(-0.0,-0.0,-1.0));
#540=CARTESIAN_POINT('',(2.0,0.0,4.0));
#541=DIRECTION('',(0.0,0.0,1.0));
#542=DIRECTION('',(1.0,0.0,0.0));
#543=DIRECTION('',(-0.0,-0.0,-1.0));
#544=CARTESIAN_POINT('',(2.0,0.0,1.5));
#545=DIRECTION('',(0.0,0.0,-1.0));
#546=DIRECTION('',(1.0,0.0,0.0));
#547=DIRECTION('',(1.0,0.0,6.12323399573676E-17));
#548=CARTESIAN_POINT('',(1.0,0.0,-1.22464679914735E-16));
#549=DIRECTION('',(-1.0,0.0,-6.12323399573676E-17));
#550=DIRECTION('',(6.12323399573676E-17,0.0,-1.0));
#551=DIRECTION('',(1.0,0.0,6.12323399573676E-17));
#552=CARTESIAN_POINT('',(5.0,0.0,1.22464679914735E-16));
#553=DIRECTION('',(-1.0,0.0,0.0));
#554=DIRECTION('',(0.0,0.0,-1.0));
#555=DIRECTION('',(6.12323399573676E-17,1.0,6.12323399573676E-17));
#556=CARTESIAN_POINT('',(-4.0,-2.5,-9.18485099360515E-17));
#557=DIRECTION('',(0.0,1.0,0.0));
#558=DIRECTION('',(3.74939945665464E-33,0.0,-1.0));
#559=DIRECTION('',(6.12323399573676E-17,1.0,6.12323399573676E-17));
#560=CARTESIAN_POINT('',(-4.0,1.0,1.22464679914735E-16));
#561=DIRECTION('',(6.12323399573676E-17,1.0,6.12323399573676E-17));
#562=DIRECTION('',(3.74939945665464E-33,6.12323399573676E-17,-1.0));
#563=CARTESIAN_POINT('',(-4.0,1.0,1.22464679914735E-16));
#564=DIRECTION('',(6.12323399573676E-17,1.0,6.12323399573676E-17));
#565=DIRECTION('',(3.74939945665464E-33,6.12323399573676E-17,-1.0));
#566=CARTESIAN_POINT('',(-4.0,-2.5,-9.18485099360515E-17));
#567=DIRECTION('',(0.0,1.0,0.0));
#568=DIRECTION('',(3.74939945665464E-33,0.0,-1.0));
#569=CARTESIAN_POINT('',(5.0,0.0,1.22464679914735E-16));
#570=DIRECTION('',(-1.0,0.0,0.0));
#571=DIRECTION('',(0.0,0.0,-1.0));
#572=CARTESIAN_POINT('',(1.0,0.0,-1.22464679914735E-16));
#573=DIRECTION('',(-1.0,0.0,-6.12323399573676E-17));
#574=DIRECTION('',(6.12323399573676E-17,0.0,-1.0));
#575=CARTESIAN_POINT('',(2.0,0.0,1.5));
#576=DIRECTION('',(0.0,0.0,-1.0));
#577=DIRECTION('',(1.0,0.0,0.0));
#578=CARTESIAN_POINT('',(2.0,0.0,4.0));
#579=DIRECTION('',(0.0,0.0,1.0));
#580=DIRECTION('',(1.0,0.0,0.0));
#581=CARTESIAN_POINT('',(-2.0,0.0,-4.0));
#582=DIRECTION('',(0.0,0.0,-1.0));
#583=DIRECTION('',(1.0,0.0,0.0));
#584=CARTESIAN_POINT('',(-2.0,0.0,-1.5));
#585=DIRECTION('',(0.0,0.0,1.0));
#586=DIRECTION('',(1.0,0.0,0.0));
#587=CARTESIAN_POINT('',(-1.5,0.75,1.5));
#588=DIRECTION('',(0.0,0.0,-1.0));
#589=DIRECTION('',(1.0,0.0,0.0));
#590=CARTESIAN_POINT('',(-1.5,0.75,0.0));
#591=DIRECTION('',(0.0,0.0,-1.0));
#592=DIRECTION('',(1.0,0.0,0.0));
#593=DIRECTION('',(0.0,1.0,0.0));
#594=DIRECTION('',(-1.0,0.0,0.0));
#595=DIRECTION('',(0.0,-1.0,0.0));
#596=DIRECTION('',(1.0,0.0,0.0));
#597=DIRECTION('',(0.0,-1.0,0.0));
#598=DIRECTION('',(-1.0,0.0,0.0));
#599=DIRECTION('',(0.0,1.0,0.0));
#600=DIRECTION('',(1.0,0.0,0.0));
#601=DIRECTION('',(0.0,0.0,-1.0));
#602=DIRECTION('',(0.0,0.0,-1.0));
#603=DIRECTION('',(0.0,0.0,-1.0));
#604=DIRECTION('',(0.0,0.0,-1.0));
ENDSEC;
END-ISO-10303-21;
