488586	10.000000
999496737	10.000000
501106	10.000000
652725	10.000000
999799409	10.000000
999979382	10.000000
1000109546	10.000000
1000223426	10.000000
1000346909	10.000000
1000546968	10.000000
1999651926	10.000000
1999781983	10.000000
1999897596	10.000000
2000038174	10.000000
2000250557	10.000000
2000356846	10.000000
2999439139	10.000000
2000583516	10.000000
2000701738	10.000000
2999862423	10.000000
3000010794	10.000000
3999160464	10.000000
3000237970	10.000000
3999469383	10.000000
3000515735	10.000000
3999726710	10.000000
3999786627	10.000000
3999981158	10.000000
4000161715	10.000000
4999293696	10.000000
4999300665	10.000000
4999435743	10.000000
