Microsoft Windows [Versión 10.0.19042.1052]
(c) Microsoft Corporation. Todos los derechos reservados.

C:\Users\franc>cd Escritorio
El sistema no puede encontrar la ruta especificada.

C:\Users\franc>cd Desktop

C:\Users\franc\Desktop>git clone https://gitlab.com/francisco.zunigap/proyecto-intr-ing-grupo-8.git
Cloning into 'proyecto-intr-ing-grupo-8'...
remote: Enumerating objects: 7, done.
remote: Counting objects: 100% (7/7), done.
remote: Compressing objects: 100% (3/3), done.
remote: Total 7 (delta 0), reused 0 (delta 0), pack-reused 0
Receiving objects: 100% (7/7), done.

C:\Users\franc\Desktop>dir
 El volumen de la unidad C es Windows
 El número de serie del volumen es: C03C-A7C1

 Directorio de C:\Users\franc\Desktop

23-06-2021  18:11    <DIR>          .
23-06-2021  18:11    <DIR>          ..
23-06-2021  10:39    <DIR>          Personal
23-06-2021  18:11    <DIR>          proyecto-intr-ing-grupo-8
23-06-2021  10:39    <DIR>          U
               0 archivos              0 bytes
               5 dirs  11.771.408.384 bytes libres

C:\Users\franc\Desktop>cd proyecto-intr-ing-grupo-8

C:\Users\franc\Desktop\proyecto-intr-ing-grupo-8>dir
 El volumen de la unidad C es Windows
 El número de serie del volumen es: C03C-A7C1

 Directorio de C:\Users\franc\Desktop\proyecto-intr-ing-grupo-8

23-06-2021  18:11    <DIR>          .
23-06-2021  18:11    <DIR>          ..
23-06-2021  18:11           495.616 Nuevo Microsoft Access Database.accdb
23-06-2021  18:11                31 README.md
               2 archivos        495.647 bytes
               2 dirs  11.774.504.960 bytes libres

C:\Users\franc\Desktop\proyecto-intr-ing-grupo-8>git add "Nuevo Microsoft Access Database.accdb"

C:\Users\franc\Desktop\proyecto-intr-ing-grupo-8>git status
On branch master
Your branch is up to date with 'origin/master'.

Changes to be committed:
  (use "git restore --staged <file>..." to unstage)
        new file:   Nuevo Microsoft Access Database.accdb


C:\Users\franc\Desktop\proyecto-intr-ing-grupo-8>git commit -m "prueba"
[master 7669b9b] prueba
 1 file changed, 0 insertions(+), 0 deletions(-)
 create mode 100644 Nuevo Microsoft Access Database.accdb

C:\Users\franc\Desktop\proyecto-intr-ing-grupo-8>git branch
* master

C:\Users\franc\Desktop\proyecto-intr-ing-grupo-8>git push origin master
Enumerating objects: 4, done.
Counting objects: 100% (4/4), done.
Delta compression using up to 8 threads
Compressing objects: 100% (3/3), done.
Writing objects: 100% (3/3), 17.29 KiB | 1.23 MiB/s, done.
Total 3 (delta 0), reused 0 (delta 0), pack-reused 0
To https://gitlab.com/francisco.zunigap/proyecto-intr-ing-grupo-8.git
   6f4a110..7669b9b  master -> master

C:\Users\franc\Desktop\proyecto-intr-ing-grupo-8>