<?xml version="1.0" encoding="utf-8"?>
<!-- Generator: Adobe Illustrator 24.2.3, SVG Export Plug-In . SVG Version: 6.00 Build 0)  -->
<svg version="1.1" id="Capa_1" xmlns="http://www.w3.org/2000/svg" xmlns:xlink="http://www.w3.org/1999/xlink" x="0px" y="0px"
	 viewBox="0 0 300 300" style="enable-background:new 0 0 300 300;" xml:space="preserve">
<style type="text/css">
	.st0{fill:none;stroke:#1C233D;}
	.st1{fill-rule:evenodd;clip-rule:evenodd;fill:#FFFFFF;}
	.st2{fill-rule:evenodd;clip-rule:evenodd;fill:#1C233D;}
	.st3{fill-rule:evenodd;clip-rule:evenodd;fill:#FD667F;}
	.st4{fill-rule:evenodd;clip-rule:evenodd;fill:#39D7C4;}
</style>
<path class="st0" d="M162.7,235H67.2c-3.6,0-6.6-3-6.6-6.6v-156c0-3.7,3-6.6,6.6-6.6h95.5c-3.6,0-6.6,3-6.6,6.6v156
	C156.1,232,159,235,162.7,235z"/>
<path class="st1" d="M75.9,120.5l3.6-40.2c0.1-1.1,1.1-1.9,2.1-1.8l75.1,6.6v32.8"/>
<path class="st2" d="M78.8,80.2c0.1-1.5,1.4-2.5,2.9-2.4l0.1,0l75.1,6.6c0.4,0,0.6,0.3,0.7,0.7l0,0v32.8c0,0.4-0.3,0.7-0.7,0.7
	c-0.4,0-0.7-0.3-0.7-0.7l0,0V85.8l-74.5-6.6c-0.7-0.1-1.3,0.4-1.4,1.1l0,0.1l-3.6,40.2c0,0.4-0.4,0.7-0.8,0.6
	c-0.4,0-0.7-0.4-0.7-0.7l0,0L78.8,80.2z"/>
<path class="st2" d="M103.5,119.9c0.4,0,0.7,0.3,0.7,0.7c0,0.4-0.3,0.7-0.7,0.7l0,0H68.9c-0.4,0-0.7-0.3-0.7-0.7
	c0-0.4,0.3-0.7,0.7-0.7l0,0H103.5z"/>
<path class="st2" d="M68.9,122.3c0.9,0,1.7-0.7,1.7-1.7c0-0.9-0.7-1.7-1.7-1.7c-0.9,0-1.7,0.7-1.7,1.7
	C67.2,121.5,68,122.3,68.9,122.3z"/>
<path class="st2" d="M117.1,234.8h-9.1c-2.4,0-4.3-1.9-4.3-4.3V106.1c0-2.4,1.9-4.3,4.3-4.3h4.8c2.4,0,4.3,1.9,4.3,4.3V234.8z"/>
<path class="st3" d="M226.3,234.8H113c2.6,0,4.8-2.2,4.8-4.8V106.5c0-2.6-2.2-4.8-4.8-4.8h113.3c2.6,0,4.8,2.1,4.8,4.8V230
	C231.1,232.7,228.9,234.8,226.3,234.8z"/>
<path class="st2" d="M112.8,101.8c2.7,0,5,2.1,5,4.6v0.1v127.9c0,0.4-0.3,0.7-0.7,0.7c-0.4,0-0.7-0.3-0.7-0.7l0,0V106.5
	c0-1.8-1.6-3.3-3.6-3.3c-0.4,0-0.7-0.3-0.7-0.7C112.1,102.1,112.4,101.8,112.8,101.8z"/>
<path class="st2" d="M103.7,109.5c0.4,0,0.7,0.3,0.7,0.7c0,0.4-0.3,0.7-0.7,0.7l0,0h-6.9c-0.4,0-0.7-0.3-0.7-0.7
	c0-0.4,0.3-0.7,0.7-0.7l0,0H103.7z"/>
<path class="st2" d="M103.7,114.7c0.4,0,0.7,0.3,0.7,0.7c0,0.4-0.3,0.7-0.7,0.7l0,0h-6.9c-0.4,0-0.7-0.3-0.7-0.7
	c0-0.4,0.3-0.7,0.7-0.7l0,0H103.7z"/>
<path class="st2" d="M103.7,125c0.4,0,0.7,0.3,0.7,0.7c0,0.4-0.3,0.7-0.7,0.7l0,0h-6.9c-0.4,0-0.7-0.3-0.7-0.7
	c0-0.4,0.3-0.7,0.7-0.7l0,0H103.7z"/>
<path class="st2" d="M103.7,130.2c0.4,0,0.7,0.3,0.7,0.7c0,0.4-0.3,0.7-0.7,0.7l0,0h-6.9c-0.4,0-0.7-0.3-0.7-0.7
	c0-0.4,0.3-0.7,0.7-0.7l0,0H103.7z"/>
<path class="st2" d="M103.7,135.3c0.4,0,0.7,0.3,0.7,0.7c0,0.4-0.3,0.7-0.7,0.7l0,0h-6.9c-0.4,0-0.7-0.3-0.7-0.7
	c0-0.4,0.3-0.7,0.7-0.7l0,0H103.7z"/>
<path class="st2" d="M103.7,140.5c0.4,0,0.7,0.3,0.7,0.7c0,0.4-0.3,0.7-0.7,0.7l0,0h-6.9c-0.4,0-0.7-0.3-0.7-0.7
	c0-0.4,0.3-0.7,0.7-0.7l0,0H103.7z"/>
<path class="st2" d="M103.7,145.6c0.4,0,0.7,0.3,0.7,0.7c0,0.4-0.3,0.7-0.7,0.7l0,0h-6.9c-0.4,0-0.7-0.3-0.7-0.7
	c0-0.4,0.3-0.7,0.7-0.7l0,0H103.7z"/>
<path class="st2" d="M103.7,150.8c0.4,0,0.7,0.3,0.7,0.7c0,0.4-0.3,0.7-0.7,0.7l0,0h-6.9c-0.4,0-0.7-0.3-0.7-0.7
	c0-0.4,0.3-0.7,0.7-0.7l0,0H103.7z"/>
<path class="st2" d="M103.7,156c0.4,0,0.7,0.3,0.7,0.7c0,0.4-0.3,0.7-0.7,0.7l0,0h-6.9c-0.4,0-0.7-0.3-0.7-0.7
	c0-0.4,0.3-0.7,0.7-0.7l0,0H103.7z"/>
<path class="st2" d="M103.7,161.2c0.4,0,0.7,0.3,0.7,0.7c0,0.4-0.3,0.7-0.7,0.7l0,0h-6.9c-0.4,0-0.7-0.3-0.7-0.7
	c0-0.4,0.3-0.7,0.7-0.7l0,0H103.7z"/>
<path class="st2" d="M103.7,166.3c0.4,0,0.7,0.3,0.7,0.7c0,0.4-0.3,0.7-0.7,0.7l0,0h-6.9c-0.4,0-0.7-0.3-0.7-0.7
	c0-0.4,0.3-0.7,0.7-0.7l0,0H103.7z"/>
<path class="st2" d="M103.7,171.5c0.4,0,0.7,0.3,0.7,0.7c0,0.4-0.3,0.7-0.7,0.7l0,0h-6.9c-0.4,0-0.7-0.3-0.7-0.7
	c0-0.4,0.3-0.7,0.7-0.7l0,0H103.7z"/>
<path class="st2" d="M103.7,176.7c0.4,0,0.7,0.3,0.7,0.7c0,0.4-0.3,0.7-0.7,0.7l0,0h-6.9c-0.4,0-0.7-0.3-0.7-0.7
	c0-0.4,0.3-0.7,0.7-0.7l0,0H103.7z"/>
<path class="st2" d="M103.7,181.8c0.4,0,0.7,0.3,0.7,0.7c0,0.4-0.3,0.7-0.7,0.7l0,0h-6.9c-0.4,0-0.7-0.3-0.7-0.7
	c0-0.4,0.3-0.7,0.7-0.7l0,0H103.7z"/>
<path class="st2" d="M103.7,187c0.4,0,0.7,0.3,0.7,0.7c0,0.4-0.3,0.7-0.7,0.7l0,0h-6.9c-0.4,0-0.7-0.3-0.7-0.7
	c0-0.4,0.3-0.7,0.7-0.7l0,0H103.7z"/>
<path class="st2" d="M103.7,197.3c0.4,0,0.7,0.3,0.7,0.7c0,0.4-0.3,0.7-0.7,0.7l0,0h-6.9c-0.4,0-0.7-0.3-0.7-0.7
	c0-0.4,0.3-0.7,0.7-0.7l0,0H103.7z"/>
<path class="st2" d="M103.7,202.5c0.4,0,0.7,0.3,0.7,0.7c0,0.4-0.3,0.7-0.7,0.7l0,0h-6.9c-0.4,0-0.7-0.3-0.7-0.7
	c0-0.4,0.3-0.7,0.7-0.7l0,0H103.7z"/>
<path class="st2" d="M103.7,207.7c0.4,0,0.7,0.3,0.7,0.7c0,0.4-0.3,0.7-0.7,0.7l0,0h-6.9c-0.4,0-0.7-0.3-0.7-0.7
	c0-0.4,0.3-0.7,0.7-0.7l0,0H103.7z"/>
<path class="st2" d="M103.7,212.8c0.4,0,0.7,0.3,0.7,0.7c0,0.4-0.3,0.7-0.7,0.7l0,0h-6.9c-0.4,0-0.7-0.3-0.7-0.7
	c0-0.4,0.3-0.7,0.7-0.7l0,0H103.7z"/>
<path class="st2" d="M103.7,218c0.4,0,0.7,0.3,0.7,0.7c0,0.4-0.3,0.7-0.7,0.7l0,0h-6.9c-0.4,0-0.7-0.3-0.7-0.7
	c0-0.4,0.3-0.7,0.7-0.7l0,0H103.7z"/>
<path class="st2" d="M103.7,223.1c0.4,0,0.7,0.3,0.7,0.7c0,0.4-0.3,0.7-0.7,0.7l0,0h-6.9c-0.4,0-0.7-0.3-0.7-0.7
	c0-0.4,0.3-0.7,0.7-0.7l0,0H103.7z"/>
<path class="st1" d="M156.8,118.7H138c-2.5,0-4.5,1.7-4.5,3.8v15.2h23.2"/>
<path class="st2" d="M157.1,136.9c0.4,0,0.7,0.3,0.7,0.7c0,0.4-0.3,0.7-0.7,0.7l0,0h-29.2c-0.4,0-0.7-0.3-0.7-0.7
	c0-0.4,0.3-0.7,0.7-0.7l0,0H157.1z"/>
<path class="st2" d="M127.9,139.3c0.9,0,1.7-0.7,1.7-1.7c0-0.9-0.7-1.7-1.7-1.7c-0.9,0-1.7,0.7-1.7,1.7
	C126.2,138.5,127,139.3,127.9,139.3z"/>
<path class="st2" d="M245.9,234.8h-86c-2.6,0-4.8-2.2-4.8-4.8V70.5c0-2.6,2.2-4.8,4.8-4.8h86c2.6,0,4.8,2.1,4.8,4.8V230
	C250.6,232.6,248.5,234.8,245.9,234.8z"/>
<path class="st1" d="M235.5,211.1H181c-3.8,0-6.8-3.1-6.8-6.8V83.6c0-3.8,3.1-6.8,6.8-6.8h54.5c3.8,0,6.8,3.1,6.8,6.8v120.7
	C242.3,208.1,239.2,211.1,235.5,211.1z"/>
<path class="st1" d="M209.8,229.5c-3.8,0-6.9-3.1-6.9-6.9c0-3.8,3.1-6.9,6.9-6.9s6.9,3.1,6.9,6.9
	C216.7,226.4,213.6,229.5,209.8,229.5z M209.8,217.1c-3,0-5.5,2.5-5.5,5.5c0,3,2.5,5.5,5.5,5.5s5.5-2.5,5.5-5.5
	C215.3,219.6,212.8,217.1,209.8,217.1z"/>
<path class="st3" d="M196.2,73.6c0.9,0,1.7-0.7,1.7-1.7c0-0.9-0.7-1.7-1.7-1.7c-0.9,0-1.7,0.7-1.7,1.7
	C194.5,72.8,195.3,73.6,196.2,73.6z"/>
<path class="st1" d="M219.6,73.3h-17.4c-0.8,0-1.4-0.6-1.4-1.4s0.6-1.4,1.4-1.4h17.4c0.8,0,1.4,0.6,1.4,1.4S220.4,73.3,219.6,73.3z"
	/>
<path class="st1" d="M169.6,66.4c0.4,0,0.7,0.3,0.7,0.7s-0.3,0.7-0.7,0.7c-3.3,0-6,2.7-6.1,5.9l0,0.1V228c0,3.3,2.7,6,6.1,6
	c0.4,0,0.7,0.3,0.7,0.7c0,0.4-0.3,0.7-0.7,0.7c-4.1,0-7.5-3.3-7.5-7.4V228V73.9C162,69.7,165.4,66.4,169.6,66.4z"/>
<path class="st2" d="M158.5,167.2c-0.8,0-1.4-0.6-1.4-1.4V144c0-0.8,0.6-1.4,1.4-1.4c0.8,0,1.4,0.6,1.4,1.4v21.8
	C159.8,166.5,159.2,167.2,158.5,167.2z"/>
<path class="st4" d="M228.1,123.3c-1.1-0.7-2.5-0.3-3.1,0.7l-5.6,9c-3.3-2.7-7.5-4.3-12.1-4.3c-10.7,0-19.3,8.7-19.3,19.3
	c0,10.7,8.7,19.3,19.3,19.3c10.7,0,19.3-8.7,19.3-19.3c0-4.4-1.5-8.5-4-11.7l6.2-9.9C229.5,125.4,229.2,124,228.1,123.3z
	 M225.2,148.1c0,9.9-8,17.9-17.9,17.9s-17.9-8-17.9-17.9c0-9.9,8-17.9,17.9-17.9c4.3,0,8.3,1.5,11.4,4.1l-10.1,16.3l-5.9-7.8
	c-0.8-1-2.2-1.2-3.2-0.5c-1,0.8-1.2,2.2-0.5,3.2l7.9,10.4c0.4,0.6,1.1,0.9,1.8,0.9c0,0,0.1,0,0.1,0c0.7,0,1.4-0.4,1.8-1.1l11.2-18.1
	C224,140.7,225.2,144.2,225.2,148.1z"/>
<path class="st2" d="M103.5,143.8H60.6V70.5c0-2.6,3.7-4.8,6.3-4.8H48.8c-2.6,0-4.8,2.1-4.8,4.8V230c0,2.6,2.1,4.8,4.8,4.8h16.5
	c-2.6,0-4.8-2.2-4.8-4.8v-61.6h42.9c5.3,0,9.6-4.3,9.6-9.6v-5.4C113,148.1,108.8,143.8,103.5,143.8z"/>
<path class="st1" d="M101.6,161.7c-3.2,0-5.7-2.6-5.7-5.7s2.6-5.7,5.7-5.7c3.2,0,5.7,2.6,5.7,5.7S104.7,161.7,101.6,161.7z
	 M101.6,151.7c-2.4,0-4.3,1.9-4.3,4.3c0,2.4,1.9,4.3,4.3,4.3c2.4,0,4.3-1.9,4.3-4.3C105.9,153.6,104,151.7,101.6,151.7z"/>
<path class="st2" d="M66.8,65.5v1.4c-3.4,0-5.9,2.3-5.9,5.5l0,0.1v71.1h-1.4V72.5c0-4,3.1-7,7.2-7L66.8,65.5z"/>
<path class="st2" d="M60.9,168.4V228c0,3.3,2.7,6,6,6H67v1.4c-4.1,0-7.5-3.3-7.5-7.4l0-0.1v-59.7H60.9z"/>
</svg>
