<?xml version="1.0" encoding="utf-8"?>
<!-- Generator: Adobe Illustrator 24.2.3, SVG Export Plug-In . SVG Version: 6.00 Build 0)  -->
<svg version="1.1" id="Capa_1" xmlns="http://www.w3.org/2000/svg" xmlns:xlink="http://www.w3.org/1999/xlink" x="0px" y="0px"
	 viewBox="0 0 300 300" style="enable-background:new 0 0 300 300;" xml:space="preserve">
<style type="text/css">
	.st0{fill-rule:evenodd;clip-rule:evenodd;fill:#FFFFFF;}
	.st1{fill-rule:evenodd;clip-rule:evenodd;fill:#1C233D;}
	.st2{fill-rule:evenodd;clip-rule:evenodd;fill:#FD667F;}
</style>
<path class="st0" d="M227.7,201.4H111.1c-2.1,0-3.9-1.7-3.9-3.8v-69c0-2.1,1.7-3.8,3.9-3.8h116.6c2.1,0,3.9,1.7,3.9,3.8v69
	C231.6,199.7,229.9,201.4,227.7,201.4z"/>
<path class="st1" d="M227.7,124.1H111.1c-2.5,0-4.5,2-4.5,4.5v69c0,2.5,2,4.5,4.5,4.5h116.6c2.5,0,4.5-2,4.5-4.4v-69
	C232.3,126.1,230.2,124.1,227.7,124.1z M111.1,125.4h116.6c1.8,0,3.2,1.4,3.2,3.2v69c0,1.7-1.5,3.2-3.2,3.2H111.1
	c-1.8,0-3.2-1.4-3.2-3.2v-69C107.9,126.9,109.4,125.4,111.1,125.4z"/>
<path class="st1" d="M229.7,125.1c0.3-0.2,0.7-0.2,0.9,0.1c0.2,0.3,0.2,0.7-0.1,0.9l0,0L172.1,171c-1.6,1.2-3.7,1.2-5.3,0.1
	l-0.1-0.1l-58.4-44.9c-0.3-0.2-0.3-0.6-0.1-0.9c0.2-0.3,0.6-0.3,0.9-0.1l0,0l58.4,44.9c1.1,0.9,2.6,0.9,3.7,0l0.1,0L229.7,125.1z"/>
<path class="st0" d="M108.6,187.2l35.6-34.3L108.6,187.2z"/>
<path class="st1" d="M143.8,152.5c0.3-0.2,0.7-0.2,0.9,0c0.2,0.2,0.2,0.6,0,0.9l0,0l-35.6,34.3c-0.3,0.2-0.7,0.2-0.9,0
	c-0.2-0.2-0.2-0.6,0-0.9l0,0L143.8,152.5z"/>
<path class="st0" d="M194.9,152.9l36.3,34.9L194.9,152.9z"/>
<path class="st1" d="M194.5,152.5c0.2-0.2,0.6-0.3,0.9,0l0,0l36.3,34.9c0.3,0.2,0.3,0.7,0,0.9c-0.2,0.2-0.6,0.3-0.9,0l0,0
	l-36.3-34.9C194.2,153.1,194.2,152.7,194.5,152.5z"/>
<path class="st0" d="M75.1,151.4l13.9-2.6c0,0-6.3-15.7,5.3-34.3c11.6-18.6,32.1-12.1,44.2-3.7c0,0-14.4-23.1-32.5-18.2
	c-18.1,4.9-26.9,15.9-30.4,34.7S75.1,151.4,75.1,151.4z"/>
<path class="st1" d="M105.9,92C88,96.9,78.7,107.8,75,127.3c-2,10.8-2.2,18.1-1.2,22.5c0.1,0.6,0.3,1.1,0.4,1.4l0,0.1
	c0.1,0.2,0.1,0.3,0.2,0.4c0.1,0.2,0.4,0.4,0.7,0.3l13.9-2.6c0.4-0.1,0.6-0.5,0.5-0.9l0-0.1l0-0.1c0-0.1-0.1-0.3-0.2-0.5l0-0.1
	c-0.2-0.6-0.4-1.3-0.6-2.1c-0.8-3.6-1.1-7.8-0.6-12.3c0.7-6.1,2.8-12.4,6.7-18.5c5.2-8.4,12.6-12,21.4-11.7
	c7.2,0.3,15.2,3.4,21.9,8.1c0.6,0.4,1.3-0.2,0.9-0.8l0-0.1l-0.1-0.2l-0.1-0.1c-0.1-0.1-0.2-0.2-0.3-0.4l-0.1-0.1
	c-0.4-0.7-1-1.4-1.6-2.2c-1.7-2.2-3.6-4.5-5.8-6.6c-3.5-3.3-7.2-6-11-7.7c-4.7-2-9.4-2.5-14.1-1.3L105.9,92z M119.6,94.5
	c3.7,1.6,7.3,4.2,10.6,7.4c2.1,2,4,4.2,5.7,6.4l0.1,0.2l-0.2-0.1c-6.2-3.8-13.2-6.2-19.6-6.4c-9.2-0.4-17,3.5-22.5,12.3
	c-3.9,6.3-6.1,12.7-6.8,19.1c-0.5,4.7-0.2,9,0.6,12.7c0.2,0.8,0.4,1.5,0.6,2.1l0.1,0.2l-12.7,2.3l0-0.1c-0.1-0.3-0.2-0.7-0.3-1.1
	c-1-4.2-0.8-11.4,1.2-22c3.6-19,12.5-29.5,29.9-34.2C110.7,92.1,115.2,92.5,119.6,94.5z"/>
<path class="st0" d="M67.3,163.1c-0.6-5.8,2-11.4,12-14.6c10-3.2,20,3.7,20.5,5.8c0.6,2.1,14.6,39.5-0.9,43.2
	c-15.5,3.7-28.1-9.2-29.4-16.1C68.2,174.5,67.3,163.1,67.3,163.1z"/>
<path class="st1" d="M92.9,150c3.3,1.4,6.1,3.5,6.4,4.4l0,0.1c0.1,0.5,0.9,2.6,1.1,3.3c0.7,2.3,1.4,4.5,2.1,6.9
	c1.1,4,1.9,7.8,2.5,11.4c1.8,11.8,0.1,19.3-6.1,20.8c-6.9,1.6-13.7,0-19.5-4c-4.8-3.3-8.4-8.1-9.1-11.6c-0.3-1.8-0.7-4-1-6.5
	c-0.3-2.4-0.6-5-0.8-7.6l-0.1-1c-0.1-0.7-0.1-1.4-0.2-2l-0.1-1.2c-0.7-6.3,2.8-11.1,11.5-13.9C83.8,147.8,88.5,148.2,92.9,150z
	 M66.7,163l0,0.3l0.1,0.9l0.1,0.8c0.1,0.6,0.1,1.2,0.2,1.9c0.3,2.8,0.6,5.5,0.9,8.1l0.1,0.7c0.3,2.2,0.6,4.2,0.9,5.9
	c0.7,3.9,4.5,8.9,9.6,12.5c6.1,4.2,13.3,5.9,20.6,4.2c3.8-0.9,6.2-3.8,7.2-8.2c0.8-3.7,0.8-8.4-0.1-14c-0.6-3.6-1.4-7.5-2.5-11.5
	c-0.6-2.2-1.2-4.3-1.9-6.4l-0.3-0.9c-0.3-1-0.9-2.8-1-2.9c-0.4-1.5-3.5-3.8-7.1-5.3c-4.6-1.9-9.6-2.4-14.2-0.9
	C69.9,150.9,66,156.1,66.7,163z"/>
<path class="st1" d="M83.9,159.6c-2.6,2.3-3.1,8-1.4,13.1c1.9,5.7,5.8,9.1,10.8,8.3c4.5-0.8,6.2-3.8,5.7-8.2
	c-0.2-1.6-0.7-3.2-1.3-4.9c-0.3-0.8-0.6-1.5-1-2.2l-0.1-0.2c0-0.1-0.1-0.2-0.1-0.3l-0.1-0.2l-0.1-0.1l0,0.1c-0.6-1.6-2.4-4-4.4-5.4
	C89.2,157.6,86.4,157.4,83.9,159.6L83.9,159.6z M91.1,160.5c1.8,1.2,3.4,3.4,3.9,4.8c0,0,0,0,0,0.1l0.1,0.2l0.1,0.2
	c0.1,0.1,0.1,0.3,0.2,0.4c0.3,0.6,0.6,1.3,0.9,2.1c0.6,1.6,1.1,3.1,1.2,4.6c0.5,3.8-0.8,6.1-4.6,6.8c-4.2,0.7-7.6-2.2-9.3-7.4
	c-1.5-4.7-1.1-9.8,1-11.7C86.7,158.8,88.9,159,91.1,160.5z"/>
<path class="st0" d="M139.9,144.5c-5.3-3-17.3-6.8-24.1-4.2c-6.8,2.6-19.3,9.1-22.3,36.7c-3,27.6,30.2,23.2,30.2,23.2L139.9,144.5z"
	/>
<path class="st1" d="M115.6,139.7c-2.2,0.9-4.1,1.8-6.1,3c-2.5,1.6-4.8,3.6-6.8,6.1c-5.1,6.3-8.5,15.4-9.9,28.1
	c-0.7,6.9,0.7,12.3,4,16.2c2.7,3.3,6.7,5.5,11.5,6.8c4.6,1.2,9.5,1.4,13.8,1.1l0.2,0c0.3,0,0.6-0.1,0.9-0.1l0.3,0l0.1,0
	c0.3,0,0.5-0.2,0.5-0.5l16.3-55.7c0.1-0.3,0-0.6-0.3-0.7c-2.9-1.6-7.4-3.3-11.7-4.3C123.4,138.5,118.8,138.5,115.6,139.7z
	 M128.5,141c3.8,0.9,7.7,2.3,10.5,3.8l0.1,0.1l-16,54.8l-0.2,0c-0.2,0-0.4,0-0.7,0.1c-4.3,0.3-9.1,0.1-13.6-1.1
	c-4.6-1.2-8.3-3.3-10.8-6.3c-3-3.7-4.4-8.7-3.7-15.3c1.3-12.4,4.7-21.3,9.6-27.4c3.6-4.4,7.4-6.9,12.3-8.8c3-1.1,7.3-1.1,12.2,0
	L128.5,141z"/>
<path class="st1" d="M147.5,148.4c0.4-2.2,1.4-7.1,1.4-7.1c1.3-6.2,2.5-12,2.2-17.9c-0.5-12.1-8.3-22.9-16.9-27.4
	c-18.6-9.7-30.5-5.8-30.5-5.8c-39.8,13.3-32.6,56.6-31.7,61.1c-8,3.8-11.4,9.1-10.8,16.6c0.5,4.1-0.1,23.8,10.1,29.5
	c10.1,5.6,20.3,4,26.9,0.3c-15.1,3-26-10.7-27.3-17.6c-1.3-6.9-2.2-17.2-2.2-17.2c-0.5-4.6,1.6-9.5,8.6-13l0-0.3c0,0,0,0,0,0
	c0-0.1,0-0.2,0-0.2l0-0.4l0,0c-1-6.4-2.6-23.1,5.4-36.3c10.2-17,21.9-18,21.9-18c22.3-3.3,30.5,20.7,30,33.8
	c-0.5,11.7-7.1,14.5-8.5,15c-1.7-0.2-3.4,0.1-4.9,0.9c-4.9,0.9-12.8,11.6-17.6,22.3c0,0,0,0.1,0,0.1l-0.1,0.1
	c-2.2,5.1-3.7,10.1-3.8,14.1c-1,4.3,0.3,8.8,3.6,11.9l2.1-0.4c-0.2,0.6-0.5,1.1-0.8,1.5c0.5,0.4,1.1,0.8,1.8,1.1l10.8,5.3
	c4.8,2.3,10.5,0.4,12.8-4.4l0.3-0.6c5,0.6,11.6-4.3,15.6-12.2c4.2-8.3,4.2-16.8,0.2-20.1c0.3-2.4,0.2-6.1,0.8-11.1
	C147.1,150.7,147.3,149.6,147.5,148.4z"/>
<path class="st1" d="M128.4,190.4c-18.3,4.2-50.6,3.3-85.7-2.9l-0.2,0.6c-0.6-1.7-2.1-3.1-4-3.5l-9.4-2.1c-3-0.7-6,1.2-6.6,4.2
	l-0.1,0.5c-0.7,3,1.2,5.9,4.2,6.6l9.4,2.1c1.5,0.3,3,0,4.2-0.8l-0.1,0.3c0,0,34.3,10.2,84.1,5.9
	C124.1,201.2,128.5,190.9,128.4,190.4z"/>
<path class="st0" d="M125.4,186.8c4-0.7,5.9,1.4,6.2,5.1c0.1,1.2,0,2.5-0.2,3.7c0,0.3-0.1,0.5-0.1,0.7l0,0.2c0,0.1,0,0.2-0.1,0.2
	c-0.1,0.3-0.4,0.6-0.8,0.5c-0.3-0.1-0.5-0.4-0.5-0.7l0-0.2c0,0,0-0.1,0-0.1c0-0.2,0.1-0.5,0.1-0.8c0.2-1.1,0.2-2.3,0.2-3.4
	c-0.2-2.9-1.5-4.4-4.3-4l-0.1,0l0,0c-2.2,2.7-6.2,4.3-11.5,5l-0.2,0c-3.6,0.4-7.4,0.4-10.9,0.1l-0.3,0c-0.4,0-0.7-0.1-1.1-0.1
	l-0.4,0l-0.3,0c-0.4,0-0.6-0.4-0.6-0.7c0-0.3,0.4-0.6,0.7-0.6l0.4,0.1l0.1,0c0.4,0,0.9,0.1,1.5,0.1c3.5,0.3,7.2,0.3,10.7-0.1
	c5.2-0.6,9.1-2.1,11-4.7C125.1,187,125.3,186.9,125.4,186.8z"/>
<path class="st0" d="M137.7,162.4c2-1.2,3.8-1.3,5.2-1c0.3,0.1,0.4,0.1,0.6,0.2c0.3,0.2,0.5,0.5,0.3,0.9c-0.2,0.3-0.5,0.4-0.8,0.3
	l0,0c0,0-0.1-0.1-0.3-0.1c-1.1-0.3-2.6-0.1-4.2,0.8c-2.5,1.5-5,4.5-7.4,9.6c-1.8,3.8-3.4,8.6-4.9,14.5c-0.1,0.3-0.4,0.6-0.8,0.5
	c-0.3-0.1-0.6-0.4-0.5-0.8c1.5-6,3.1-10.8,4.9-14.7C132.3,167.3,135,164,137.7,162.4z"/>
<path class="st2" d="M271.9,197l-10.1,4.1l-108.9-0.3c-0.9,0-1.7-1.1-1.7-2.5l0-4.4c0-1.4,0.8-2.5,1.7-2.5l108.9,0.3l10.1,4.1
	C272.4,195.9,272.4,196.8,271.9,197z"/>
<path class="st1" d="M155.1,187.1l26.8,0.5c0.4,0,0.6,0.3,0.6,0.7c0,0.3-0.3,0.6-0.6,0.6l0,0l-26.1-0.5l0,12.8
	c0,0.3-0.3,0.6-0.6,0.6l0,0c-0.3,0-0.6-0.3-0.6-0.6l0,0l0-13.5C154.4,187.4,154.7,187.1,155.1,187.1L155.1,187.1z"/>
<path class="st2" d="M193,195.3c0.4,0,0.7,0.3,0.7,0.6c0,0.3-0.3,0.6-0.6,0.6l0,0h-24.6c-0.4,0-0.7-0.3-0.7-0.6
	c0-0.3,0.3-0.6,0.6-0.6l0,0H193z"/>
</svg>
