<svg width="482" height="43" viewBox="0 0 482 43" fill="none" xmlns="http://www.w3.org/2000/svg">
<rect width="482" height="43" fill="#E4E4E4"/>
<g clip-path="url(#clip0)">
<rect width="1440" height="7054" transform="translate(-655 -1528)" fill="white"/>
</g>
<path d="M28.096 3.756H21.848C22.024 4.9 22.156 6.308 22.288 8.2C22.332 9.168 22.376 10.224 22.42 11.368H7.856C6.36 11.368 4.248 11.236 2.972 11.06V16.912C4.512 16.824 6.404 16.736 7.988 16.736H20C16.48 21.752 9.22 27.956 0.64 32.004L4.688 36.58C11.64 32.884 18.768 26.768 22.64 21.708C22.728 26.24 22.728 30.64 22.728 33.588C22.728 34.864 22.288 35.436 21.188 35.436C19.692 35.436 17.316 35.26 15.336 34.908L15.82 40.628C18.328 40.804 20.792 40.892 23.476 40.892C26.82 40.892 28.448 39.264 28.404 36.448C28.316 30.508 28.14 23.16 28.008 16.736H33.684C34.872 16.736 36.544 16.824 37.952 16.868V11.016C36.896 11.192 34.828 11.368 33.376 11.368H27.876C27.876 10.224 27.832 9.168 27.832 8.2C27.832 6.836 27.92 5.12 28.096 3.756ZM52.604 5.56L48.468 9.96C51.68 12.204 57.18 17 59.468 19.464L63.956 14.888C61.404 12.204 55.684 7.628 52.604 5.56ZM47.104 34.864L50.8 40.672C57.004 39.616 62.68 37.152 67.124 34.468C74.208 30.2 80.06 24.128 83.404 18.188L79.972 11.984C77.2 17.924 71.48 24.656 63.956 29.1C59.688 31.652 53.968 33.896 47.104 34.864ZM95.812 5.252V10.928C97.088 10.84 98.98 10.796 100.388 10.796H117.24C118.824 10.796 120.892 10.84 122.08 10.928V5.252C120.848 5.428 118.692 5.472 117.328 5.472H100.388C98.892 5.472 97.044 5.428 95.812 5.252ZM125.776 18.012L121.86 15.592C121.244 15.856 120.056 16.032 118.648 16.032H96.868C95.504 16.032 93.612 15.9 91.764 15.768V21.488C93.612 21.312 95.812 21.268 96.868 21.268H118.12C117.328 23.732 115.964 26.46 113.588 28.88C110.244 32.312 104.964 35.216 98.364 36.58L102.72 41.552C108.352 39.968 113.984 36.976 118.428 32.048C121.728 28.396 123.62 24.128 124.94 19.86C125.116 19.376 125.468 18.584 125.776 18.012ZM132.728 21.884L135.5 27.428C140.912 25.844 146.5 23.468 151.032 21.092V35.172C151.032 37.108 150.9 39.88 150.724 40.936H157.676C157.368 39.836 157.28 37.108 157.28 35.172V17.396C161.548 14.58 165.772 11.148 169.116 7.848L164.364 3.316C161.504 6.792 156.488 11.192 151.956 14.008C147.072 17 140.604 19.86 132.728 21.884ZM184.604 5.56L180.468 9.96C183.68 12.204 189.18 17 191.468 19.464L195.956 14.888C193.404 12.204 187.684 7.628 184.604 5.56ZM179.104 34.864L182.8 40.672C189.004 39.616 194.68 37.152 199.124 34.468C206.208 30.2 212.06 24.128 215.404 18.188L211.972 11.984C209.2 17.924 203.48 24.656 195.956 29.1C191.688 31.652 185.968 33.896 179.104 34.864ZM231.816 34.776C231.816 36.536 231.64 39.176 231.376 40.936H238.24C238.064 39.132 237.844 36.052 237.844 34.776V22.324C242.596 23.952 249.196 26.504 253.728 28.88L256.236 22.808C252.188 20.828 243.74 17.704 237.844 15.988V9.476C237.844 7.672 238.064 5.736 238.24 4.196H231.376C231.684 5.736 231.816 7.936 231.816 9.476V34.776ZM270.58 37.24L274.76 40.848C275.772 40.188 276.74 39.88 277.356 39.66C287.74 36.272 296.848 31.036 302.876 23.82L299.752 18.848C294.12 25.712 284.308 31.344 277.136 33.412V10.532C277.136 8.816 277.312 7.232 277.576 5.516H270.668C270.932 6.792 271.152 8.86 271.152 10.532V34.38C271.152 35.392 271.108 36.14 270.58 37.24ZM310.048 18.628V25.536C311.676 25.404 314.624 25.316 317.132 25.316H340.76C342.608 25.316 344.852 25.492 345.908 25.536V18.628C344.764 18.716 342.828 18.892 340.76 18.892H317.132C314.844 18.892 311.632 18.76 310.048 18.628ZM357.48 9.124V15.504C358.976 15.416 361 15.328 362.672 15.328H380.844C382.384 15.328 384.452 15.46 385.728 15.504V9.124C384.496 9.256 382.604 9.388 380.844 9.388H362.628C361.132 9.388 359.064 9.3 357.48 9.124ZM353.784 30.64V37.372C355.412 37.24 357.568 37.108 359.284 37.108H384.54C385.86 37.108 387.84 37.196 389.38 37.372V30.64C387.884 30.816 386.036 30.904 384.54 30.904H359.284C357.568 30.904 355.5 30.772 353.784 30.64ZM404.604 5.56L400.468 9.96C403.68 12.204 409.18 17 411.468 19.464L415.956 14.888C413.404 12.204 407.684 7.628 404.604 5.56ZM399.104 34.864L402.8 40.672C409.004 39.616 414.68 37.152 419.124 34.468C426.208 30.2 432.06 24.128 435.404 18.188L431.972 11.984C429.2 17.924 423.48 24.656 415.956 29.1C411.688 31.652 405.968 33.896 399.104 34.864ZM472.276 2.964L468.8 4.372C469.9 5.956 471.132 8.288 472.012 10.048L471.704 9.872C470.736 10.18 469.24 10.4 467.876 10.4H459.076C459.12 10.312 459.164 10.268 459.208 10.18C459.692 9.212 460.836 7.232 461.892 5.692L455.424 3.58C455.028 5.076 454.104 7.1 453.444 8.156C451.288 11.94 447.416 17.66 439.716 22.324L444.644 26.02C449 23.072 452.828 19.2 455.776 15.372H468.14C467.436 18.628 464.884 23.952 461.892 27.34C458.02 31.74 453.136 35.568 444.16 38.252L449.352 42.916C457.624 39.616 462.904 35.612 467.084 30.464C471.088 25.58 473.596 19.728 474.784 15.812C475.136 14.712 475.752 13.48 476.236 12.644L472.496 10.356L475.752 8.992C474.96 7.364 473.376 4.548 472.276 2.964ZM477.468 0.983999L473.992 2.392C475.224 4.064 476.632 6.616 477.556 8.464L481.032 6.968C480.24 5.428 478.612 2.612 477.468 0.983999Z" fill="#FD667F"/>
<defs>
<clipPath id="clip0">
<rect width="1440" height="7054" fill="white" transform="translate(-655 -1528)"/>
</clipPath>
</defs>
</svg>
