<svg width="600" height="600" viewBox="0 0 600 600" fill="none" xmlns="http://www.w3.org/2000/svg">
<path d="M83.36 442.54L83.45 441.54H243.6L243.62 441.73L252.26 449.25L256.8 472.73V539.88V551.32L252.26 574.8L243.62 582.32H83.36L80.94 553.93V469.02L83.36 442.54Z" fill="#EAECEF"/>
<path d="M403.63 327.99H401.23V310.78L402.04 296.8L404.44 296.94L403.63 310.85V327.99Z" fill="#03229C"/>
<path d="M513.38 449.35C513.34 449.138 513.269 448.932 513.17 448.74L508.68 440.58C508.503 440.273 508.248 440.019 507.94 439.844C507.633 439.668 507.284 439.577 506.93 439.58H314.28L314.4 439.7L314.81 443.58L321.66 507.58L319 507.42V507.58L321.16 522.98L279.16 535.98V531.44L293.09 517.11L292.2 505.89V505.75L286.2 505.39L275.85 441.56L275.53 439.56H73.69V443.56H82.06L79.74 468.93V554L82 580.32H71.63V584.32H506.93C507.282 584.321 507.629 584.23 507.935 584.054C508.24 583.878 508.494 583.625 508.67 583.32L512.92 575.89C513.039 575.683 513.121 575.456 513.16 575.22C513.21 574.9 518.38 543.01 518.38 510.33C518.312 489.904 516.64 469.515 513.38 449.35ZM82.14 553.88V514.13H158.56V511.73H82.14V469.08L82.6 464.08H118.6V461.68H82.82L84.47 443.57H243.88L251.16 449.91L255.6 472.91V551.2L251.16 574.2L244.09 580.36H84.39L82.14 553.88Z" fill="#03229C"/>
<path d="M243.44 453.4H94.29V455.8H243.44V453.4Z" fill="#03229C"/>
<path d="M247.55 556.4H127.25V558.8H247.55V556.4Z" fill="#03229C"/>
<path d="M184.11 568.35H101.3V570.75H184.11V568.35Z" fill="#03229C"/>
<path d="M245.91 509.12H182.05V511.52H245.91V509.12Z" fill="#03229C"/>
<path d="M247.55 486.77H130.96V489.17H247.55V486.77Z" fill="#03229C"/>
<path d="M334.16 443.54H314.81L321.66 507.54L319 507.38V507.54L321.16 522.94L309.16 526.66C308.35 547.11 306.52 569.49 306.4 570.86L304.59 580.33H334.22L335.99 570.85C335.995 570.81 335.995 570.77 335.99 570.73C335.99 570.38 339.13 535.24 339.13 510.33C339.13 485.42 336.26 457.65 336.23 457.33L334.16 443.54Z" fill="#3950AD"/>
<path d="M470.89 455.92C470.894 455.887 470.894 455.853 470.89 455.82L468.81 443.54H439.16L441.3 456.17C441.43 457.68 444.19 491.17 444.19 512.02C444.19 533.27 441.11 568.65 441.09 568.91L439.19 580.32H468.84L470.66 569.67C470.665 569.637 470.665 569.603 470.66 569.57C470.66 569.21 473.78 532.57 473.78 512.02C473.78 491.47 470.92 456.28 470.89 455.92Z" fill="#3950AD"/>
<path d="M401.5 443.54H371.86L374 456.17C374.12 457.67 376.88 490.97 376.88 511.93C376.88 532.89 373.88 568.13 373.77 569.72L371.9 580.32H401.54L403.36 570C403.36 569.66 406.48 535.7 406.48 512C406.48 488.3 403.62 456.3 403.58 455.89L401.5 443.54Z" fill="#3950AD"/>
<path d="M410.53 348.9L407.81 315.68C407.8 315.6 407.8 315.52 407.81 315.44L410.81 289.44L407.26 261.54L397.75 244.72L380.81 239.56L363.06 241.89L356.22 252.09L356.8 272.79L354.4 272.86L353.81 251.77C353.807 251.521 353.881 251.277 354.02 251.07L361.37 240.07C361.464 239.927 361.587 239.807 361.732 239.717C361.878 239.627 362.041 239.57 362.21 239.55L380.75 237.12C380.918 237.08 381.092 237.08 381.26 237.12L398.91 242.49C399.205 242.584 399.454 242.783 399.61 243.05L409.46 260.5C409.539 260.631 409.59 260.778 409.61 260.93L413.21 289.22C413.22 289.313 413.22 289.407 413.21 289.5L410.21 315.5L412.93 348.6L410.53 348.9Z" fill="#03229C"/>
<path d="M228.87 442.74H179.06C178.835 442.746 178.614 442.689 178.42 442.576C178.226 442.462 178.068 442.296 177.964 442.097C177.86 441.898 177.814 441.674 177.831 441.45C177.847 441.226 177.927 441.011 178.06 440.83L182.57 434.73C182.72 434.532 182.925 434.382 183.16 434.3L205 427.1L206.71 419.28L209.05 419.79L207.2 428.28C207.154 428.483 207.056 428.671 206.916 428.825C206.775 428.979 206.598 429.095 206.4 429.16L184.31 436.46L181.44 440.34H227.92L231.14 426.77L233.47 427.32L230 441.82C229.939 442.076 229.795 442.305 229.591 442.471C229.386 442.637 229.133 442.732 228.87 442.74Z" fill="#03229C"/>
<path d="M275.06 330.3C274.891 330.302 274.724 330.268 274.57 330.2C274.415 330.131 274.277 330.03 274.163 329.905C274.05 329.779 273.963 329.631 273.91 329.47L258.71 282.32C258.623 282.054 258.632 281.766 258.737 281.506C258.841 281.247 259.033 281.032 259.28 280.9L270.34 274.9L270.09 271.49L272.48 271.32L272.79 275.5C272.806 275.729 272.756 275.958 272.646 276.16C272.536 276.362 272.371 276.529 272.17 276.64L261.3 282.55L275.78 327.47L296.59 317.84L297.59 320.02L275.59 330.21C275.424 330.283 275.241 330.314 275.06 330.3Z" fill="#03229C"/>
<path d="M275.07 359C274.878 358.999 274.689 358.951 274.52 358.86L251.6 347C251.33 346.853 251.123 346.61 251.02 346.32L229.48 284.2L207.7 276.7C207.404 276.597 207.16 276.383 207.02 276.103C206.879 275.822 206.854 275.498 206.95 275.2L208.29 271.02L210.58 271.75L209.58 274.81L230.8 282.14C230.97 282.201 231.125 282.299 231.253 282.427C231.381 282.555 231.479 282.71 231.54 282.88L253.11 345.1L275.11 356.49L307.26 341.93L308.26 344.12L275.58 358.92C275.418 358.984 275.244 359.012 275.07 359Z" fill="#03229C"/>
<path d="M473.82 439.64L471.43 439.45L471.81 434.9L450.81 428.08C450.517 427.988 450.272 427.783 450.13 427.51L419.2 370.51L421.31 369.36L452 426L473.48 432.95C473.736 433.036 473.956 433.204 474.107 433.428C474.257 433.653 474.328 433.921 474.31 434.19L473.82 439.64Z" fill="#03229C"/>
<path d="M429.07 440.35L425.78 437.29C425.672 437.195 425.584 437.079 425.52 436.95L398 382.24L400.15 381.17L427.53 435.68L430.66 438.6L429.07 440.35Z" fill="#03229C"/>
<path d="M304 78.34H273.07L294.94 56.47C295.052 56.3586 295.141 56.2261 295.201 56.0802C295.262 55.9344 295.293 55.778 295.293 55.62C295.293 55.4621 295.262 55.3057 295.201 55.1599C295.141 55.014 295.052 54.8815 294.94 54.77L265.32 25.15C265.09 24.9335 264.786 24.8129 264.47 24.8129C264.154 24.8129 263.85 24.9335 263.62 25.15L219.62 69.15L175.62 25.15C175.39 24.9335 175.086 24.8129 174.77 24.8129C174.454 24.8129 174.15 24.9335 173.92 25.15L144.27 54.77C144.047 54.9965 143.921 55.3019 143.921 55.62C143.921 55.9382 144.047 56.2436 144.27 56.47L166.15 78.34H135.21C134.892 78.34 134.587 78.4665 134.361 78.6915C134.136 78.9166 134.01 79.2218 134.01 79.54V121.43C134.01 121.748 134.136 122.054 134.361 122.279C134.587 122.504 134.892 122.63 135.21 122.63H166.15L144.27 144.5C144.047 144.726 143.921 145.032 143.921 145.35C143.921 145.668 144.047 145.974 144.27 146.2L173.89 175.82C174.118 176.041 174.422 176.167 174.74 176.17C174.898 176.17 175.054 176.14 175.2 176.08C175.346 176.02 175.478 175.931 175.59 175.82L219.59 131.82L263.59 175.82C263.82 176.037 264.124 176.157 264.44 176.157C264.756 176.157 265.06 176.037 265.29 175.82L294.91 146.2C295.022 146.089 295.111 145.956 295.171 145.81C295.232 145.664 295.263 145.508 295.263 145.35C295.263 145.192 295.232 145.036 295.171 144.89C295.111 144.744 295.022 144.612 294.91 144.5L273.04 122.63H304C304.318 122.63 304.624 122.504 304.849 122.279C305.074 122.054 305.2 121.748 305.2 121.43V79.54C305.2 79.2218 305.074 78.9166 304.849 78.6915C304.624 78.4665 304.318 78.34 304 78.34Z" fill="#39D7C4"/>
<path d="M287.1 264.93C286.988 264.77 286.838 264.64 286.663 264.551C286.489 264.462 286.296 264.417 286.1 264.42H265.4L248.9 220.29C248.816 220.061 248.663 219.863 248.463 219.724C248.263 219.584 248.024 219.509 247.78 219.51H173.64C173.445 219.505 173.252 219.548 173.078 219.635C172.903 219.722 172.753 219.851 172.64 220.01C172.53 220.163 172.457 220.339 172.427 220.525C172.398 220.711 172.412 220.901 172.47 221.08L189 271.76C189.08 271.999 189.233 272.207 189.438 272.354C189.642 272.501 189.888 272.58 190.14 272.58H284.08C284.326 272.579 284.567 272.503 284.769 272.362C284.97 272.221 285.125 272.021 285.21 271.79L287.27 266.02C287.33 265.838 287.346 265.644 287.316 265.455C287.287 265.265 287.213 265.085 287.1 264.93Z" fill="#03229C"/>
<path d="M236.463 228.339L206.387 246.878L207.647 248.921L237.722 230.382L236.463 228.339Z" fill="#8EEFDE"/>
<path d="M242.348 237.515L226.696 244.931L227.723 247.1L243.376 239.684L242.348 237.515Z" fill="#8EEFDE"/>
<g opacity="0.4">
<path opacity="0.4" d="M297.773 151.16L269.758 240.176L272.047 240.896L300.062 151.881L297.773 151.16Z" fill="#39D7C4"/>
<path opacity="0.4" d="M235.392 179.818L233.469 207.522L235.864 207.688L237.786 179.985L235.392 179.818Z" fill="#39D7C4"/>
<path opacity="0.4" d="M205.892 145.768L203.507 146.029L208.108 187.978L210.494 187.716L205.892 145.768Z" fill="#39D7C4"/>
<path opacity="0.4" d="M153.002 160.7L150.818 161.695L186.425 239.791L188.609 238.795L153.002 160.7Z" fill="#39D7C4"/>
<path opacity="0.4" d="M144.601 186.571L142.699 188.035L162.593 213.887L164.495 212.423L144.601 186.571Z" fill="#39D7C4"/>
<path opacity="0.4" d="M298.066 211.42L287.735 228.825L289.799 230.05L300.129 212.645L298.066 211.42Z" fill="#39D7C4"/>
<path opacity="0.4" d="M133.105 155.514L131.179 156.947L134.164 160.958L136.09 159.526L133.105 155.514Z" fill="#39D7C4"/>
</g>
<path d="M244.23 583.22L242.65 581.41L250.98 574.16L255.42 551.16V472.84L250.98 449.84L242.65 442.59L244.23 440.78L252.87 448.3C253.07 448.479 253.207 448.717 253.26 448.98L257.79 472.46C257.8 472.536 257.8 472.614 257.79 472.69V551.27C257.8 551.346 257.8 551.424 257.79 551.5L253.26 575C253.209 575.261 253.072 575.497 252.87 575.67L244.23 583.22Z" fill="#03229C"/>
<path d="M422.09 369L401.09 322L396.76 312.43C396.69 312.266 396.584 312.12 396.448 312.004C396.313 311.888 396.153 311.804 395.98 311.76L378.68 307.13C378.397 307.051 378.094 307.079 377.83 307.21L368 312.15L357.11 310.51L353.31 304.28C353.212 304.117 353.077 303.98 352.915 303.881C352.753 303.782 352.569 303.723 352.38 303.71L324.65 301.55C324.43 301.529 324.208 301.571 324.01 301.67L296 315.89C295.748 316.015 295.549 316.225 295.437 316.483C295.325 316.742 295.309 317.031 295.39 317.3L300.92 335.84C300.955 335.979 301.02 336.108 301.11 336.22L308.83 346.42C308.995 346.633 309.226 346.785 309.486 346.852C309.747 346.919 310.023 346.897 310.27 346.79L319.92 342.62L317.86 380.54C317.848 380.776 317.905 381.01 318.024 381.214C318.143 381.419 318.319 381.584 318.53 381.69L345.65 395L385.77 419.38C385.956 419.495 386.171 419.554 386.39 419.55C386.596 419.55 386.799 419.499 386.98 419.4C387.166 419.295 387.32 419.142 387.428 418.958C387.535 418.773 387.591 418.563 387.59 418.35L387.31 363.27L396.11 383.27C396.175 383.424 396.272 383.562 396.395 383.676C396.517 383.789 396.662 383.876 396.82 383.93C396.984 383.987 397.157 384.008 397.33 383.993C397.502 383.977 397.669 383.925 397.82 383.84L421.61 370.55C421.87 370.399 422.063 370.155 422.152 369.868C422.241 369.581 422.219 369.272 422.09 369Z" fill="#8996C7"/>
<path d="M318.903 329.565L317.977 342.643L320.371 342.812L321.297 329.735L318.903 329.565Z" fill="#03229C"/>
<path d="M442.49 434.42H437.55V436.82H442.49V434.42Z" fill="#03229C"/>
<path d="M380.75 442.44H314.4V440H380L383.32 433.75V417.31H385.72V434.09C385.718 434.285 385.67 434.477 385.58 434.65L381.79 441.8C381.691 441.991 381.541 442.151 381.358 442.264C381.175 442.376 380.965 442.437 380.75 442.44Z" fill="#03229C"/>
<path d="M237.49 431.22C237.358 431.22 237.226 431.199 237.1 431.16L201.92 419C201.764 418.946 201.622 418.861 201.501 418.749C201.381 418.637 201.285 418.501 201.22 418.35C201.156 418.2 201.123 418.038 201.123 417.875C201.123 417.712 201.156 417.55 201.22 417.4L231 347.42C231.128 347.123 231.369 346.889 231.67 346.77L245.36 341.52C245.521 341.458 245.693 341.431 245.865 341.44C246.037 341.448 246.206 341.493 246.36 341.57L319.62 379.57L318.52 381.7L245.69 344L233 348.83L203.93 417.11L236.81 428.51L252.41 388.68L254.64 389.55L238.64 430.46C238.55 430.69 238.391 430.886 238.185 431.022C237.979 431.158 237.737 431.227 237.49 431.22Z" fill="#03229C"/>
<path d="M255.89 392.17C255.727 392.171 255.566 392.139 255.417 392.075C255.267 392.011 255.132 391.918 255.02 391.8L248.53 385L250.26 383.34L255.48 388.8L257.56 383.72L259.78 384.62L257 391.42C256.923 391.606 256.802 391.769 256.647 391.897C256.491 392.024 256.307 392.111 256.11 392.15L255.89 392.17Z" fill="#03229C"/>
<path d="M258.782 387.742L257.51 389.782L287.421 408.432L288.693 406.392L258.782 387.742Z" fill="#03229C"/>
<path d="M279.15 537.16C278.893 537.16 278.644 537.076 278.44 536.92C278.284 536.805 278.157 536.655 278.072 536.48C277.987 536.306 277.945 536.114 277.95 535.92V531.38C277.955 531.068 278.076 530.768 278.29 530.54L291.84 516.61L291 506L293.4 505.81L294.28 517.03C294.295 517.2 294.273 517.37 294.216 517.531C294.159 517.691 294.068 517.838 293.95 517.96L280.36 531.96V534.39L319.87 522.14L317.87 507.76L320.25 507.42L322.41 522.82C322.447 523.102 322.385 523.389 322.233 523.63C322.082 523.871 321.851 524.052 321.58 524.14L279.58 537.14C279.439 537.174 279.293 537.181 279.15 537.16Z" fill="#03229C"/>
<path d="M321.66 508.73H321.58L286.11 506.57C285.84 506.552 285.583 506.443 285.382 506.262C285.181 506.08 285.046 505.837 285 505.57L271.7 423.5C271.669 423.298 271.69 423.092 271.76 422.9L277.08 408.07C277.145 407.886 277.253 407.721 277.396 407.589C277.539 407.456 277.712 407.361 277.9 407.31L328 394.12L328.61 396.45L279.12 409.45L274.12 423.4L287.22 504.21L320.31 506.21L313.25 440.16L309.25 436.16L310.95 434.47L315.28 438.81C315.471 439.005 315.59 439.259 315.62 439.53L322.88 507.4C322.905 507.581 322.889 507.765 322.832 507.938C322.774 508.112 322.678 508.27 322.55 508.4C322.433 508.514 322.293 508.602 322.14 508.659C321.987 508.716 321.823 508.74 321.66 508.73Z" fill="#03229C"/>
<path d="M361.828 264.787L360.374 269.945L362.683 270.597L364.138 265.438L361.828 264.787Z" fill="#03229C"/>
<path d="M374.827 269.054L373.372 274.213L375.682 274.864L377.137 269.705L374.827 269.054Z" fill="#03229C"/>
<path d="M368.6 268C368.346 267.916 368.072 267.921 367.821 268.014C367.57 268.106 367.358 268.281 367.22 268.51L363.61 274.3C363.515 274.46 363.458 274.639 363.44 274.824C363.423 275.009 363.447 275.195 363.51 275.37C363.578 275.544 363.686 275.7 363.825 275.825C363.964 275.95 364.13 276.041 364.31 276.09L367.58 277.01C367.689 277.028 367.801 277.028 367.91 277.01C368.217 277.008 368.513 276.889 368.735 276.677C368.958 276.466 369.092 276.177 369.11 275.87L369.44 269.15C369.441 268.894 369.36 268.644 369.209 268.437C369.058 268.23 368.844 268.077 368.6 268Z" fill="#F492A7"/>
<path d="M369.34 296.78L353 291.53C352.759 291.449 352.55 291.294 352.401 291.088C352.252 290.882 352.171 290.634 352.17 290.38V278.64C352.171 278.493 352.199 278.348 352.25 278.21L361.6 254.11L363.84 254.97L354.57 278.87V289.51L370.11 294.51L369.34 296.78Z" fill="#03229C"/>
<path d="M356.383 291.371L352.201 304.554L354.489 305.279L358.67 292.097L356.383 291.371Z" fill="#03229C"/>
<path d="M379.51 308.65L377.21 307.96L385.55 280.15C385.624 279.903 385.776 279.686 385.983 279.533C386.191 279.38 386.442 279.298 386.7 279.3H392L393.62 273.3L389.38 270.65L386.66 273.34L384.38 275.86C384.241 276.009 384.067 276.121 383.873 276.184C383.679 276.247 383.472 276.26 383.272 276.221C383.072 276.181 382.885 276.092 382.729 275.961C382.573 275.829 382.453 275.661 382.38 275.47L374.56 255C374.47 254.748 374.47 254.472 374.56 254.22L375.81 250.22L370.58 255.44C370.356 255.662 370.055 255.787 369.74 255.79H359.16V253.39H369.16L377.46 245.09C377.651 244.901 377.898 244.781 378.164 244.749C378.43 244.716 378.7 244.773 378.93 244.91C379.159 245.048 379.335 245.259 379.43 245.51C379.524 245.76 379.531 246.035 379.45 246.29L377 254.5L383.93 272.83L384.93 271.72L388.38 268.32C388.572 268.131 388.823 268.011 389.091 267.98C389.359 267.949 389.63 268.009 389.86 268.15L395.66 271.78C395.879 271.916 396.048 272.119 396.142 272.358C396.235 272.598 396.249 272.862 396.18 273.11L394.09 280.81C394.02 281.065 393.869 281.289 393.66 281.45C393.45 281.611 393.194 281.699 392.93 281.7H387.64L379.51 308.65Z" fill="#03229C"/>
<path d="M396.661 283.483L396.079 300.583L398.478 300.665L399.06 283.565L396.661 283.483Z" fill="#03229C"/>
<path d="M286.12 262.42H193.42V264.82H286.12V262.42Z" fill="#8996C7"/>
<path d="M201.82 532.37H98V534.77H201.82V532.37Z" fill="#03229C"/>
<path d="M137.25 513.93V546.06L126.44 541.08L115.81 546.06V513.93H137.25Z" fill="#FD667F"/>
</svg>
