<svg width="24" height="24" viewBox="0 0 24 24" fill="none" xmlns="http://www.w3.org/2000/svg">
<path fill-rule="evenodd" clip-rule="evenodd" d="M16.9794 7.51888L21.6044 11.2189C21.8414 11.4089 21.9794 11.6959 21.9794 11.9999V15.9999C21.9794 16.5529 21.5324 16.9999 20.9794 16.9999H20.7944C20.9074 17.3139 20.9794 17.6469 20.9794 17.9999C20.9794 19.6539 19.6334 20.9999 17.9794 20.9999C16.3254 20.9999 14.9794 19.6539 14.9794 17.9999C14.9794 17.6469 15.0514 17.3139 15.1644 16.9999H11.9794H8.7944C8.9074 17.3139 8.9794 17.6469 8.9794 17.9999C8.9794 19.6539 7.6334 20.9999 5.9794 20.9999C4.3254 20.9999 2.9794 19.6539 2.9794 17.9999C2.9794 17.6039 3.0604 17.2279 3.2004 16.8819C2.4924 16.6089 1.9794 15.8729 1.9794 14.9999V4.99988C1.9794 3.89688 2.7924 2.99988 3.7914 2.99988H15.1664C16.1664 2.99988 16.9794 3.89688 16.9794 4.99988V7.51888ZM19.9794 12.4799V14.9999H16.9794V10.0809L19.9794 12.4799ZM5.9794 18.9999C6.5314 18.9999 6.9794 18.5519 6.9794 17.9999C6.9794 17.4479 6.5314 16.9999 5.9794 16.9999C5.4274 16.9999 4.9794 17.4479 4.9794 17.9999C4.9794 18.5519 5.4274 18.9999 5.9794 18.9999ZM17.9794 18.9999C18.5314 18.9999 18.9794 18.5519 18.9794 17.9999C18.9794 17.4479 18.5314 16.9999 17.9794 16.9999C17.4274 16.9999 16.9794 17.4479 16.9794 17.9999C16.9794 18.5519 17.4274 18.9999 17.9794 18.9999Z" fill="#0D1C2E"/>
<mask id="mask0" mask-type="alpha" maskUnits="userSpaceOnUse" x="1" y="2" width="21" height="19">
<path fill-rule="evenodd" clip-rule="evenodd" d="M16.9794 7.51888L21.6044 11.2189C21.8414 11.4089 21.9794 11.6959 21.9794 11.9999V15.9999C21.9794 16.5529 21.5324 16.9999 20.9794 16.9999H20.7944C20.9074 17.3139 20.9794 17.6469 20.9794 17.9999C20.9794 19.6539 19.6334 20.9999 17.9794 20.9999C16.3254 20.9999 14.9794 19.6539 14.9794 17.9999C14.9794 17.6469 15.0514 17.3139 15.1644 16.9999H11.9794H8.7944C8.9074 17.3139 8.9794 17.6469 8.9794 17.9999C8.9794 19.6539 7.6334 20.9999 5.9794 20.9999C4.3254 20.9999 2.9794 19.6539 2.9794 17.9999C2.9794 17.6039 3.0604 17.2279 3.2004 16.8819C2.4924 16.6089 1.9794 15.8729 1.9794 14.9999V4.99988C1.9794 3.89688 2.7924 2.99988 3.7914 2.99988H15.1664C16.1664 2.99988 16.9794 3.89688 16.9794 4.99988V7.51888ZM19.9794 12.4799V14.9999H16.9794V10.0809L19.9794 12.4799ZM5.9794 18.9999C6.5314 18.9999 6.9794 18.5519 6.9794 17.9999C6.9794 17.4479 6.5314 16.9999 5.9794 16.9999C5.4274 16.9999 4.9794 17.4479 4.9794 17.9999C4.9794 18.5519 5.4274 18.9999 5.9794 18.9999ZM17.9794 18.9999C18.5314 18.9999 18.9794 18.5519 18.9794 17.9999C18.9794 17.4479 18.5314 16.9999 17.9794 16.9999C17.4274 16.9999 16.9794 17.4479 16.9794 17.9999C16.9794 18.5519 17.4274 18.9999 17.9794 18.9999Z" fill="white"/>
</mask>
<g mask="url(#mask0)">
</g>
</svg>
