<svg width="24" height="24" viewBox="0 0 24 24" fill="none" xmlns="http://www.w3.org/2000/svg">
<path d="M16 14.5C15.744 14.5 15.488 14.402 15.293 14.207L11.988 10.902L8.69502 14.082C8.29702 14.466 7.66502 14.456 7.28102 14.057C6.89702 13.66 6.90802 13.026 7.30502 12.643L11.305 8.78103C11.698 8.40203 12.322 8.40703 12.707 8.79303L16.707 12.793C17.098 13.184 17.098 13.816 16.707 14.207C16.512 14.402 16.256 14.5 16 14.5Z" fill="#1C233D"/>
<mask id="mask0" mask-type="alpha" maskUnits="userSpaceOnUse" x="7" y="8" width="11" height="7">
<path d="M16 14.5C15.744 14.5 15.488 14.402 15.293 14.207L11.988 10.902L8.69502 14.082C8.29702 14.466 7.66502 14.456 7.28102 14.057C6.89702 13.66 6.90802 13.026 7.30502 12.643L11.305 8.78103C11.698 8.40203 12.322 8.40703 12.707 8.79303L16.707 12.793C17.098 13.184 17.098 13.816 16.707 14.207C16.512 14.402 16.256 14.5 16 14.5Z" fill="white"/>
</mask>
<g mask="url(#mask0)">
</g>
</svg>
