<svg width="535" height="1146" viewBox="0 0 535 1146" fill="none" xmlns="http://www.w3.org/2000/svg">
<path d="M-225.986 235.592L87.4688 573.012L-226.011 910.463L2.06561 1146L534.368 572.987L2.03809 0L-225.986 235.592Z" fill="#39D7C4"/>
</svg>
