<svg width="24" height="24" viewBox="0 0 24 24" fill="none" xmlns="http://www.w3.org/2000/svg">
<path d="M19 13H5C4.448 13 4 12.553 4 12C4 11.447 4.448 11 5 11H19C19.553 11 20 11.447 20 12C20 12.553 19.553 13 19 13Z" fill="#1C233D"/>
<mask id="mask0" mask-type="alpha" maskUnits="userSpaceOnUse" x="4" y="11" width="16" height="2">
<path d="M19 13H5C4.448 13 4 12.553 4 12C4 11.447 4.448 11 5 11H19C19.553 11 20 11.447 20 12C20 12.553 19.553 13 19 13Z" fill="white"/>
</mask>
<g mask="url(#mask0)">
</g>
</svg>
