<svg width="26" height="24" viewBox="0 0 26 24" fill="none" xmlns="http://www.w3.org/2000/svg">
<path d="M23.9784 9.30195C22.9492 7.24353 21.327 5.78882 19.5281 5.31097C18.3067 4.98688 17.0847 5.16097 16.0756 5.80194C14.0733 6.56286 11.8582 6.59854 9.81882 5.89879C8.81593 5.27015 7.65123 5.10515 6.44387 5.42361C4.67978 5.88833 3.07563 7.31971 2.04269 9.3507C0.253149 12.8695 0.820851 16.9307 3.33321 18.5955C4.32513 19.2569 5.54481 19.4471 6.76773 19.1319C8.45425 18.6964 9.99456 17.3866 11.0299 15.5119C12.2421 15.0446 13.6158 15.0582 14.8127 15.5393C15.8574 17.4523 17.4294 18.7975 19.1522 19.2451C19.5477 19.3478 19.9429 19.3985 20.3303 19.3985C21.1642 19.3985 21.9629 19.1638 22.6529 18.7063C25.1573 17.0673 25.7518 12.8489 23.9784 9.30195ZM21.7679 17.362C21.1301 17.7843 20.366 17.8964 19.5573 17.6868C18.2381 17.344 16.9602 16.1919 16.1448 14.6162C15.9978 14.32 15.744 14.1941 15.6485 14.1466C15.6364 14.1407 15.6243 14.1351 15.612 14.1295C14.7457 13.7514 13.8112 13.5618 12.8788 13.5618C12.0441 13.5618 11.2108 13.7141 10.4298 14.0187L10.374 14.0327C10.316 14.0469 10.2594 14.0681 10.2063 14.0946C10.103 14.1467 9.86073 14.2682 9.71959 14.551C8.91282 16.1098 7.65906 17.2397 6.36611 17.5734C5.58133 17.7757 4.84164 17.666 4.2251 17.2549C2.44305 16.0739 2.10096 12.7886 3.47814 10.0806C4.2911 8.48206 5.55316 7.32327 6.85445 6.98038C7.64298 6.77272 8.39317 6.88353 9.02364 7.30128C9.08265 7.34019 9.1465 7.3716 9.21357 7.39386L9.286 7.418C11.7082 8.25402 14.3542 8.2025 16.7367 7.27283C16.7906 7.25164 16.8421 7.22478 16.8904 7.19263C17.5335 6.76386 18.303 6.65174 19.1152 6.86718C20.4483 7.22132 21.7281 8.4005 22.5387 10.0221C23.9346 12.814 23.5837 16.1739 21.7679 17.362Z" fill="#1C233D"/>
<path d="M13.0095 3.33044C12.565 3.33044 12.2046 3.69077 12.2046 4.13533V7.08663C12.2046 7.53119 12.565 7.89152 13.0095 7.89152C13.4539 7.89152 13.8142 7.53119 13.8144 7.08663V4.13533C13.8144 3.69077 13.4541 3.33044 13.0095 3.33044Z" fill="#1C233D"/>
<path d="M7.24124 8.96474C5.83589 8.96474 4.69242 10.1082 4.69242 11.5136C4.69242 12.9189 5.83593 14.0624 7.24124 14.0624C8.64655 14.0624 9.79011 12.9189 9.79011 11.5136C9.79011 10.1082 8.6466 8.96474 7.24124 8.96474ZM7.24124 12.4527C6.72342 12.4527 6.3022 12.0314 6.3022 11.5136C6.3022 10.9958 6.72342 10.5746 7.24124 10.5746C7.75879 10.5746 8.18029 10.9958 8.18029 11.5136C8.18034 12.0314 7.75907 12.4527 7.24124 12.4527Z" fill="#1C233D"/>
<path d="M19.1802 8.96474C18.7356 8.96474 18.3753 9.32506 18.3753 9.76962V13.5258C18.3753 13.9704 18.7356 14.3307 19.1802 14.3307C19.6248 14.3307 19.9851 13.9706 19.9851 13.5258V9.76962C19.9851 9.32506 19.6248 8.96474 19.1802 8.96474Z" fill="#1C233D"/>
<path d="M21.0583 10.8428H17.3021C16.8576 10.8428 16.4973 11.2031 16.4973 11.6477C16.4973 12.0922 16.8576 12.4526 17.3021 12.4526H21.0583C21.5029 12.4526 21.8632 12.0925 21.8632 11.6477C21.8633 11.2031 21.5029 10.8428 21.0583 10.8428Z" fill="#1C233D"/>
<path d="M23.9784 9.30195C22.9492 7.24353 21.327 5.78882 19.5281 5.31097C18.3067 4.98688 17.0847 5.16097 16.0756 5.80194C14.0733 6.56286 11.8582 6.59854 9.81882 5.89879C8.81593 5.27015 7.65123 5.10515 6.44387 5.42361C4.67978 5.88833 3.07563 7.31971 2.04269 9.3507C0.253149 12.8695 0.820851 16.9307 3.33321 18.5955C4.32513 19.2569 5.54481 19.4471 6.76773 19.1319C8.45425 18.6964 9.99456 17.3866 11.0299 15.5119C12.2421 15.0446 13.6158 15.0582 14.8127 15.5393C15.8574 17.4523 17.4294 18.7975 19.1522 19.2451C19.5477 19.3478 19.9429 19.3985 20.3303 19.3985C21.1642 19.3985 21.9629 19.1638 22.6529 18.7063C25.1573 17.0673 25.7518 12.8489 23.9784 9.30195ZM21.7679 17.362C21.1301 17.7843 20.366 17.8964 19.5573 17.6868C18.2381 17.344 16.9602 16.1919 16.1448 14.6162C15.9978 14.32 15.744 14.1941 15.6485 14.1466C15.6364 14.1407 15.6243 14.1351 15.612 14.1295C14.7457 13.7514 13.8112 13.5618 12.8788 13.5618C12.0441 13.5618 11.2108 13.7141 10.4298 14.0187L10.374 14.0327C10.316 14.0469 10.2594 14.0681 10.2063 14.0946C10.103 14.1467 9.86073 14.2682 9.71959 14.551C8.91282 16.1098 7.65906 17.2397 6.36611 17.5734C5.58133 17.7757 4.84164 17.666 4.2251 17.2549C2.44305 16.0739 2.10096 12.7886 3.47814 10.0806C4.2911 8.48206 5.55316 7.32327 6.85445 6.98038C7.64298 6.77272 8.39317 6.88353 9.02364 7.30128C9.08265 7.34019 9.1465 7.3716 9.21357 7.39386L9.286 7.418C11.7082 8.25402 14.3542 8.2025 16.7367 7.27283C16.7906 7.25164 16.8421 7.22478 16.8904 7.19263C17.5335 6.76386 18.303 6.65174 19.1152 6.86718C20.4483 7.22132 21.7281 8.4005 22.5387 10.0221C23.9346 12.814 23.5837 16.1739 21.7679 17.362Z" stroke="#1C233D" stroke-width="0.321362"/>
<path d="M13.0095 3.33044C12.565 3.33044 12.2046 3.69077 12.2046 4.13533V7.08663C12.2046 7.53119 12.565 7.89152 13.0095 7.89152C13.4539 7.89152 13.8142 7.53119 13.8144 7.08663V4.13533C13.8144 3.69077 13.4541 3.33044 13.0095 3.33044Z" stroke="#1C233D" stroke-width="0.321362"/>
<path d="M7.24124 8.96474C5.83589 8.96474 4.69242 10.1082 4.69242 11.5136C4.69242 12.9189 5.83593 14.0624 7.24124 14.0624C8.64655 14.0624 9.79011 12.9189 9.79011 11.5136C9.79011 10.1082 8.6466 8.96474 7.24124 8.96474ZM7.24124 12.4527C6.72342 12.4527 6.3022 12.0314 6.3022 11.5136C6.3022 10.9958 6.72342 10.5746 7.24124 10.5746C7.75879 10.5746 8.18029 10.9958 8.18029 11.5136C8.18034 12.0314 7.75907 12.4527 7.24124 12.4527Z" stroke="#1C233D" stroke-width="0.321362"/>
<path d="M19.1802 8.96474C18.7356 8.96474 18.3753 9.32506 18.3753 9.76962V13.5258C18.3753 13.9704 18.7356 14.3307 19.1802 14.3307C19.6248 14.3307 19.9851 13.9706 19.9851 13.5258V9.76962C19.9851 9.32506 19.6248 8.96474 19.1802 8.96474Z" stroke="#1C233D" stroke-width="0.321362"/>
<path d="M21.0583 10.8428H17.3021C16.8576 10.8428 16.4973 11.2031 16.4973 11.6477C16.4973 12.0922 16.8576 12.4526 17.3021 12.4526H21.0583C21.5029 12.4526 21.8632 12.0925 21.8632 11.6477C21.8633 11.2031 21.5029 10.8428 21.0583 10.8428Z" stroke="#1C233D" stroke-width="0.321362"/>
</svg>
