<svg width="12" height="12" viewBox="0 0 12 12" fill="none" xmlns="http://www.w3.org/2000/svg">
<path fill-rule="evenodd" clip-rule="evenodd" d="M8.32986 5.886L9.48436 10.3755C9.53436 10.569 9.46386 10.7735 9.30636 10.8955C9.21636 10.965 9.10836 11 8.99986 11C8.91686 11 8.83336 10.9795 8.75786 10.9375L5.91786 9.3665L3.25286 10.931C3.07936 11.032 2.86036 11.021 2.69936 10.8995C2.53786 10.778 2.46536 10.5715 2.51586 10.3755L3.66986 5.886C3.25186 5.37 2.99986 4.7145 2.99986 4C2.99986 2.3455 4.34586 1 5.99986 1C7.65436 1 8.99986 2.3455 8.99986 4C8.99986 4.7145 8.74786 5.37 8.32986 5.886ZM5.99987 2C7.10287 2 7.99987 2.897 7.99987 4C7.99987 5.103 7.10287 6 5.99987 6C4.89687 6 3.99987 5.103 3.99987 4C3.99987 2.897 4.89687 2 5.99987 2ZM6.15287 8.35352C5.99737 8.26802 5.80937 8.26952 5.65787 8.36002L3.78387 9.46002L4.51787 6.60502C4.95537 6.85502 5.46087 7.00002 5.99987 7.00002C6.53887 7.00002 7.04437 6.85502 7.48237 6.60502L8.22687 9.50102L6.15287 8.35352Z" fill="white"/>
<mask id="mask0" mask-type="alpha" maskUnits="userSpaceOnUse" x="2" y="1" width="8" height="10">
<path fill-rule="evenodd" clip-rule="evenodd" d="M8.32986 5.886L9.48436 10.3755C9.53436 10.569 9.46386 10.7735 9.30636 10.8955C9.21636 10.965 9.10836 11 8.99986 11C8.91686 11 8.83336 10.9795 8.75786 10.9375L5.91786 9.3665L3.25286 10.931C3.07936 11.032 2.86036 11.021 2.69936 10.8995C2.53786 10.778 2.46536 10.5715 2.51586 10.3755L3.66986 5.886C3.25186 5.37 2.99986 4.7145 2.99986 4C2.99986 2.3455 4.34586 1 5.99986 1C7.65436 1 8.99986 2.3455 8.99986 4C8.99986 4.7145 8.74786 5.37 8.32986 5.886ZM5.99987 2C7.10287 2 7.99987 2.897 7.99987 4C7.99987 5.103 7.10287 6 5.99987 6C4.89687 6 3.99987 5.103 3.99987 4C3.99987 2.897 4.89687 2 5.99987 2ZM6.15287 8.35352C5.99737 8.26802 5.80937 8.26952 5.65787 8.36002L3.78387 9.46002L4.51787 6.60502C4.95537 6.85502 5.46087 7.00002 5.99987 7.00002C6.53887 7.00002 7.04437 6.85502 7.48237 6.60502L8.22687 9.50102L6.15287 8.35352Z" fill="white"/>
</mask>
<g mask="url(#mask0)">
</g>
</svg>
