<?xml version="1.0" encoding="utf-8"?>
<!-- Generator: Adobe Illustrator 24.2.3, SVG Export Plug-In . SVG Version: 6.00 Build 0)  -->
<svg version="1.1" id="Capa_1" xmlns="http://www.w3.org/2000/svg" xmlns:xlink="http://www.w3.org/1999/xlink" x="0px" y="0px"
	 viewBox="0 0 300 300" style="enable-background:new 0 0 300 300;" xml:space="preserve">
<style type="text/css">
	.st0{fill-rule:evenodd;clip-rule:evenodd;fill:#1C233D;}
	.st1{fill:#1C233D;}
	.st2{fill-rule:evenodd;clip-rule:evenodd;fill:#FD667F;}
	.st3{fill-rule:evenodd;clip-rule:evenodd;fill:#39D7C4;}
</style>
<path class="st0" d="M223.4,36.5h-80.2c-9.6,0-17.3,7.5-17.3,16.7v56.6h6.3V53.2c0-4.9,4.2-8.8,9.4-8.8h18v3.7
	c0,1.2,1.1,2.2,2.3,2.2H195c1.3,0,2.3-1,2.3-2.2v-3.7h18c5.2,0,9.4,3.9,9.4,8.8v61.2h6.2V52c0-7.1-6.2-12.9-13.8-12.9
	c-0.6,0-1.1-0.4-1.1-1c0-0.6,0.5-1,1.1-1c8.8,0,16,6.7,16,14.9v62.4h7.7V53.1C240.7,43.9,233,36.5,223.4,36.5z"/>
<rect x="125.9" y="157.5" class="st1" width="6.3" height="67.5"/>
<path class="st0" d="M224.7,134.1v45.8l6.2,1.1v-46.9H224.7z"/>
<path class="st0" d="M231,241.4L231,241.4v-51.5l-6.2-0.9v55.2c0,4.9-4.2,8.8-9.4,8.8h-73.7c-5,0-9.1-3.6-9.4-8.2h-6.3
	c0.5,8.8,8.3,16.3,17.5,16.3l74.9-0.6c0-0.5,0.3-0.9,0.8-1c5.1-1.2,8.6-4.5,10.5-10C231.1,245.3,231,241.4,231,241.4z"/>
<path class="st0" d="M233.1,134.1v47.8l3.8,3.7l-3.8,2.4v53.3c0,0.4,0.1,4.4-1.4,8.7c-1.7,5-4.8,8.5-9,10.4h0.7
	c9.6,0,17.3-7.5,17.3-16.7V134.1H233.1z"/>
<path class="st0" d="M202.3,101.8c0.3-0.5,1-0.6,1.4-0.3c6.1,3.6,13,5.5,21.9,5.7c0.6,0,1,0.5,1,1c0,0.6-0.5,1-1.1,1
	c-9.3-0.1-16.5-2.1-22.9-6C202.1,102.9,201.9,102.3,202.3,101.8z"/>
<path class="st0" d="M136.4,65c4.6-0.7,8.5-1,12.6-0.8c5.4,0.2,10.6,1.2,15.4,3.2c4.4,1.8,8.5,4.4,12.2,7.9c1.9,1.8,3.8,3.8,5.9,5.9
	c0.4,0.4,0.4,1.1-0.1,1.4c-0.4,0.4-1.1,0.3-1.5-0.1c-2-2.1-3.9-4-5.8-5.8c-3.5-3.3-7.4-5.8-11.5-7.5c-4.6-1.9-9.5-2.9-14.7-3.1
	c-3.8-0.1-7.4,0.1-11.8,0.7l-0.4,0.1c-0.3,0-4,0.6-5.2,0.7l-0.1,0c-0.6,0.1-1.1-0.3-1.2-0.9c-0.1-0.6,0.4-1.1,0.9-1.1l0.3,0
	C132.8,65.6,136.7,65,136.4,65z"/>
<path class="st0" d="M131.2,195.4c4-0.4,8.5-0.5,13.4,0c0.6,0.1,1,0.6,0.9,1.1c-0.1,0.6-0.6,1-1.2,0.9c-4.7-0.5-9.1-0.4-12.9,0
	c-0.6,0.1-1.1-0.3-1.2-0.9C130.2,195.9,130.6,195.4,131.2,195.4z"/>
<path class="st0" d="M170.9,206.2c0.4-0.4,1-0.5,1.5-0.2c1.5,1.1,2.9,2.3,4.2,3.6l0.8,0.8c8.9,8.3,13.9,12,19.9,14.4
	c6.5,2.6,14.3,3.7,28.2,3.8c0.6,0,1,0.5,1,1c0,0.6-0.5,1-1.1,1c-14-0.2-22-1.2-28.8-3.9l-0.2-0.1c-6.5-2.6-11.8-6.6-21.4-15.6
	c-1.3-1.2-2.6-2.3-4.1-3.4C170.7,207.3,170.6,206.6,170.9,206.2z"/>
<path class="st2" d="M202.4,80.7h-46c-0.7,0-1.2,0.5-1.2,1.2v44.3c0,0.7,0.5,1.2,1.2,1.2h46c0.7,0,1.2-0.5,1.2-1.2V81.9
	C203.7,81.2,203.1,80.7,202.4,80.7z M201.2,83.1v42h-43.6v-42H201.2z"/>
<path class="st2" d="M169.1,128.8h-11.9c-0.7,0-1.2,0.5-1.2,1.2v11.4c0,0.7,0.5,1.2,1.2,1.2h11.9c0.7,0,1.2-0.5,1.2-1.2V130
	C170.3,129.4,169.7,128.8,169.1,128.8z M167.8,131.2v9h-9.4v-9H167.8z"/>
<path class="st2" d="M168.2,129.2c0.5-0.5,1.3-0.5,1.7,0c0.5,0.4,0.5,1.2,0,1.6l0,0.1l-11.9,11.4c-0.5,0.5-1.3,0.5-1.7,0
	c-0.5-0.4-0.5-1.2,0-1.6l0-0.1L168.2,129.2z"/>
<path class="st2" d="M185.2,128.8h-11.9c-0.7,0-1.2,0.5-1.2,1.2v11.4c0,0.7,0.5,1.2,1.2,1.2h11.9c0.7,0,1.2-0.5,1.2-1.2V130
	C186.5,129.4,185.9,128.8,185.2,128.8z M184,131.2v9h-9.4v-9H184z"/>
<path class="st2" d="M184.4,129.2c0.5-0.5,1.3-0.5,1.7,0c0.5,0.4,0.5,1.2,0,1.6l0,0.1l-11.9,11.4c-0.5,0.5-1.3,0.5-1.7,0
	c-0.5-0.4-0.5-1.2,0-1.6l0-0.1L184.4,129.2z"/>
<path class="st2" d="M201.4,128.8h-11.9c-0.7,0-1.2,0.5-1.2,1.2v11.4c0,0.7,0.5,1.2,1.2,1.2h11.9c0.7,0,1.2-0.5,1.2-1.2V130
	C202.7,129.4,202.1,128.8,201.4,128.8z M200.2,131.2v9h-9.4v-9H200.2z"/>
<path class="st2" d="M200.6,129.2c0.5-0.5,1.3-0.5,1.7,0c0.5,0.4,0.5,1.2,0,1.6l0,0.1l-11.9,11.4c-0.5,0.5-1.3,0.5-1.7,0
	c-0.5-0.4-0.5-1.2,0-1.6l0-0.1L200.6,129.2z"/>
<path class="st2" d="M206.2,153.6h-51.7c-5.8,0-10.4,4.5-10.4,10v5.7c0,5.5,4.7,10,10.4,10h51.7c5.8,0,10.4-4.5,10.4-10v-5.7
	C216.6,158.1,211.9,153.6,206.2,153.6z M154.5,156h51.7c4.4,0,8,3.4,8,7.7v5.7c0,4.2-3.6,7.7-8,7.7h-51.7c-4.4,0-8-3.4-8-7.7v-5.7
	C146.5,159.4,150.1,156,154.5,156z"/>
<path class="st2" d="M205.8,181.7h-51.7c-5.8,0-10.4,4.5-10.4,10v5.7c0,5.5,4.7,10,10.4,10h51.7c5.8,0,10.4-4.5,10.4-10v-5.7
	C216.2,186.2,211.6,181.7,205.8,181.7z M154.1,184h51.7c4.4,0,8,3.4,8,7.7v5.7c0,4.2-3.6,7.7-8,7.7h-51.7c-4.4,0-8-3.4-8-7.7v-5.7
	C146.2,187.5,149.7,184,154.1,184z"/>
<path class="st2" d="M200.8,81.4c0.5-0.5,1.3-0.5,1.7,0c0.5,0.4,0.5,1.2,0.1,1.6l0,0.1l-45.2,44c-0.5,0.5-1.3,0.5-1.7,0
	c-0.5-0.4-0.5-1.2-0.1-1.6l0-0.1L200.8,81.4z"/>
<path class="st0" d="M140.2,108.7H69.1c-4.8,0-8.7,3.8-8.7,8.4v32.9c0,4.6,3.9,8.4,8.7,8.4h71.1c4.8,0,8.7-3.8,8.7-8.4v-33
	C148.9,112.5,145,108.7,140.2,108.7z M69.1,110.8h71.1c3.7,0,6.6,2.9,6.6,6.4v33c0,3.5-3,6.3-6.6,6.3H69.1c-3.7,0-6.6-2.9-6.6-6.4
	v-32.9C62.5,113.6,65.4,110.8,69.1,110.8z"/>
<path class="st3" d="M95,131.5h-0.2c-0.7,0-1.3-0.6-1.3-1.2V129c0-0.7,0.6-1.2,1.3-1.2H95c0.7,0,1.3,0.6,1.3,1.2v1.2
	C96.3,130.9,95.7,131.5,95,131.5z"/>
<path class="st0" d="M90.6,131.5H74.5c-1,0-1.8-0.7-1.8-1.7v-0.4c0-0.9,0.8-1.7,1.8-1.7h16.1c1,0,1.8,0.7,1.8,1.7v0.4
	C92.3,130.7,91.6,131.5,90.6,131.5z"/>
<path class="st0" d="M92.4,148.9H74.5c-1,0-1.8-0.7-1.8-1.7v-0.4c0-0.9,0.8-1.7,1.8-1.7h17.9c1,0,1.8,0.7,1.8,1.7v0.4
	C94.1,148.2,93.3,148.9,92.4,148.9z"/>
<path class="st3" d="M109.6,143.1H79.9c-1,0-1.8-0.7-1.8-1.7v-0.4c0-0.9,0.8-1.7,1.8-1.7h29.6c1,0,1.8,0.7,1.8,1.7v0.4
	C111.3,142.4,110.5,143.1,109.6,143.1z"/>
<path class="st3" d="M129.3,143.1h-14.4c-1,0-1.8-0.7-1.8-1.7v-0.4c0-0.9,0.8-1.7,1.8-1.7h14.4c1,0,1.8,0.7,1.8,1.7v0.4
	C131.1,142.4,130.3,143.1,129.3,143.1z"/>
<path class="st0" d="M135.8,137.3h-0.2c-0.7,0-1.3-0.6-1.3-1.2v-1.2c0-0.7,0.6-1.2,1.3-1.2h0.2c0.7,0,1.3,0.6,1.3,1.2v1.2
	C137.1,136.8,136.6,137.3,135.8,137.3z"/>
<path class="st0" d="M105.3,137.3H74.5c-1,0-1.8-0.7-1.8-1.7v-0.4c0-0.9,0.8-1.7,1.8-1.7h30.8c1,0,1.8,0.7,1.8,1.7v0.4
	C107,136.6,106.2,137.3,105.3,137.3z"/>
<path class="st0" d="M115.4,131.5H99.3c-1,0-1.8-0.7-1.8-1.7v-0.4c0-0.9,0.8-1.7,1.8-1.7h16.1c1,0,1.8,0.7,1.8,1.7v0.4
	C117.2,130.7,116.4,131.5,115.4,131.5z"/>
<path class="st3" d="M131,137.3h-20.7c-1,0-1.8-0.7-1.8-1.7v-0.4c0-0.9,0.8-1.7,1.8-1.7H131c1,0,1.8,0.7,1.8,1.7v0.4
	C132.7,136.6,132,137.3,131,137.3z"/>
<path class="st0" d="M76.4,119.6l5-2.9c0.1,0,0.2-0.1,0.2-0.1c0.1,0,0.2,0,0.4,0.1c0.1,0.1,0.1,0.2,0.1,0.3c0,0.2-0.1,0.3-0.2,0.4
	l-4.3,2.5l4.3,2.5c0.2,0.1,0.2,0.2,0.2,0.4c0,0.1,0,0.2-0.1,0.3c-0.1,0.1-0.2,0.1-0.4,0.1c-0.1,0-0.2,0-0.2-0.1l-5-2.9
	c-0.2-0.1-0.3-0.3-0.3-0.4C76.2,119.8,76.3,119.7,76.4,119.6z"/>
<path class="st0" d="M87.5,114.8c0.1-0.1,0.2-0.1,0.4-0.1c0.1,0,0.2,0,0.4,0.1c0.1,0.1,0.1,0.2,0.1,0.3c0,0.1,0,0.1,0,0.2l-4.1,9.8
	c0,0-0.1,0.1-0.1,0.1c-0.1,0.1-0.2,0.1-0.4,0.1c-0.1,0-0.2,0-0.4-0.1c-0.1-0.1-0.1-0.2-0.1-0.3c0-0.1,0-0.1,0-0.2l4.1-9.8
	C87.4,114.8,87.4,114.8,87.5,114.8z"/>
<path class="st0" d="M95.5,120c0,0.2-0.1,0.3-0.3,0.4l-5,2.9c-0.1,0-0.2,0.1-0.2,0.1c-0.1,0-0.2,0-0.4-0.1c-0.1-0.1-0.1-0.2-0.1-0.3
	c0-0.2,0.1-0.3,0.2-0.4L94,120l-4.3-2.5c-0.2-0.1-0.2-0.2-0.2-0.4c0-0.1,0-0.2,0.1-0.3c0.1-0.1,0.2-0.1,0.4-0.1c0.1,0,0.2,0,0.2,0.1
	l5,2.9C95.4,119.7,95.5,119.8,95.5,120z"/>
<path class="st0" d="M279.3,113.4h-63.7c-4.8,0-8.7,3.8-8.7,8.4v4.9c0,4.6,3.9,8.4,8.7,8.4h63.7c4.8,0,8.7-3.8,8.7-8.4v-4.9
	C288,117.2,284.1,113.4,279.3,113.4z M215.6,115.4h63.7c3.7,0,6.6,2.9,6.6,6.4v4.9c0,3.5-3,6.4-6.6,6.4h-63.7
	c-3.7,0-6.6-2.9-6.6-6.4v-4.9C208.9,118.3,211.9,115.4,215.6,115.4z"/>
<path class="st0" d="M277.3,121.2c0.6,0,1.1,0.5,1.1,1c0,0.5-0.4,1-1,1l-0.1,0H218c-0.6,0-1.1-0.5-1.1-1c0-0.5,0.4-1,1-1l0.1,0
	H277.3z"/>
<path class="st0" d="M246.2,126.1c0.6,0,1.1,0.5,1.1,1c0,0.5-0.4,1-1,1l-0.1,0H218c-0.6,0-1.1-0.5-1.1-1c0-0.5,0.4-1,1-1l0.1,0
	H246.2z"/>
<path class="st0" d="M177.2,224h-63.7c-4.8,0-8.7,3.8-8.7,8.4v4.9c0,4.6,3.9,8.4,8.7,8.4h63.7c4.8,0,8.7-3.8,8.7-8.4v-4.9
	C185.9,227.8,182,224,177.2,224z M113.4,226h63.7c3.7,0,6.6,2.9,6.6,6.4v4.9c0,3.5-3,6.4-6.6,6.4h-63.7c-3.7,0-6.6-2.9-6.6-6.4v-4.9
	C106.8,228.9,109.8,226,113.4,226z"/>
<path class="st0" d="M175.2,231.8c0.6,0,1.1,0.5,1.1,1c0,0.5-0.4,1-1,1l-0.1,0h-59.3c-0.6,0-1.1-0.5-1.1-1c0-0.5,0.4-1,1-1l0.1,0
	H175.2z"/>
<path class="st0" d="M144.1,236.7c0.6,0,1.1,0.5,1.1,1c0,0.5-0.4,1-1,1l-0.1,0h-28.1c-0.6,0-1.1-0.5-1.1-1c0-0.5,0.4-1,1-1l0.1,0
	H144.1z"/>
<path class="st0" d="M85.8,71.7H22.1c-4.8,0-8.7,3.8-8.7,8.4v4.9c0,4.6,3.9,8.4,8.7,8.4h63.7c4.8,0,8.7-3.8,8.7-8.4v-4.9
	C94.6,75.4,90.7,71.7,85.8,71.7z M22.1,73.7h63.7c3.7,0,6.6,2.9,6.6,6.4v4.9c0,3.5-3,6.4-6.6,6.4H22.1c-3.7,0-6.6-2.9-6.6-6.4v-4.9
	C15.5,76.6,18.4,73.7,22.1,73.7z"/>
<path class="st0" d="M83.9,79.5c0.6,0,1.1,0.5,1.1,1c0,0.5-0.4,1-1,1l-0.1,0H24.6c-0.6,0-1.1-0.5-1.1-1c0-0.5,0.4-1,1-1l0.1,0H83.9z
	"/>
<path class="st0" d="M52.7,84.3c0.6,0,1.1,0.5,1.1,1c0,0.5-0.4,1-1,1l-0.1,0H24.6c-0.6,0-1.1-0.5-1.1-1c0-0.5,0.4-1,1-1l0.1,0H52.7z
	"/>
</svg>
