<svg width="24" height="24" viewBox="0 0 24 24" fill="none" xmlns="http://www.w3.org/2000/svg">
<path fill-rule="evenodd" clip-rule="evenodd" d="M3.2407 7.28712L11.7617 11.9231C11.9087 12.0031 12.0907 12.0031 12.2387 11.9231L20.7597 7.28712C21.1027 7.10012 21.0727 6.62212 20.7077 6.47512L12.1877 3.03612C12.0677 2.98812 11.9317 2.98812 11.8117 3.03612L3.2917 6.47512C2.9277 6.62212 2.8977 7.10012 3.2407 7.28712ZM20.708 10.6563L18.878 9.87632L12.239 13.4883C12.091 13.5683 11.909 13.5683 11.761 13.4883L5.122 9.87632L3.292 10.6563C2.927 10.8113 2.897 11.3173 3.241 11.5143L11.761 16.4113C11.909 16.4963 12.091 16.4963 12.239 16.4113L20.759 11.5143C21.103 11.3173 21.073 10.8113 20.708 10.6563ZM19.151 14.4227L20.708 15.0967C21.073 15.2547 21.103 15.7677 20.759 15.9677L12.239 20.9357C12.091 21.0217 11.909 21.0217 11.761 20.9357L3.241 15.9677C2.897 15.7677 2.927 15.2547 3.292 15.0967L4.849 14.4227L11.761 18.1837C11.909 18.2637 12.091 18.2637 12.239 18.1837L19.151 14.4227Z" fill="#0D1C2E"/>
<mask id="mask0" mask-type="alpha" maskUnits="userSpaceOnUse" x="2" y="3" width="20" height="19">
<path fill-rule="evenodd" clip-rule="evenodd" d="M3.2407 7.28712L11.7617 11.9231C11.9087 12.0031 12.0907 12.0031 12.2387 11.9231L20.7597 7.28712C21.1027 7.10012 21.0727 6.62212 20.7077 6.47512L12.1877 3.03612C12.0677 2.98812 11.9317 2.98812 11.8117 3.03612L3.2917 6.47512C2.9277 6.62212 2.8977 7.10012 3.2407 7.28712ZM20.708 10.6563L18.878 9.87632L12.239 13.4883C12.091 13.5683 11.909 13.5683 11.761 13.4883L5.122 9.87632L3.292 10.6563C2.927 10.8113 2.897 11.3173 3.241 11.5143L11.761 16.4113C11.909 16.4963 12.091 16.4963 12.239 16.4113L20.759 11.5143C21.103 11.3173 21.073 10.8113 20.708 10.6563ZM19.151 14.4227L20.708 15.0967C21.073 15.2547 21.103 15.7677 20.759 15.9677L12.239 20.9357C12.091 21.0217 11.909 21.0217 11.761 20.9357L3.241 15.9677C2.897 15.7677 2.927 15.2547 3.292 15.0967L4.849 14.4227L11.761 18.1837C11.909 18.2637 12.091 18.2637 12.239 18.1837L19.151 14.4227Z" fill="white"/>
</mask>
<g mask="url(#mask0)">
</g>
</svg>
