<svg width="16" height="16" viewBox="0 0 16 16" fill="none" xmlns="http://www.w3.org/2000/svg">
<path fill-rule="evenodd" clip-rule="evenodd" d="M1.33301 4.4C1.33301 10.0613 5.93834 14.6667 11.5997 14.6667C13.2903 14.6667 14.6663 13.2913 14.6663 11.6C14.6663 11.428 14.6517 11.2573 14.6237 11.0927C14.5963 10.9253 14.555 10.7627 14.5003 10.6053C14.4257 10.3887 14.2437 10.226 14.0203 10.1747L10.0437 9.262C9.82634 9.214 9.59567 9.27467 9.43301 9.43067C9.33834 9.52134 9.33568 9.524 8.90234 10.3513C7.48234 9.70467 6.31901 8.54534 5.64967 7.096C6.47634 6.66334 6.47834 6.66134 6.56901 6.56667C6.72501 6.404 6.78834 6.17467 6.73767 5.956L5.82501 1.98C5.77367 1.756 5.61034 1.574 5.39367 1.49867C5.23501 1.444 5.07234 1.40267 4.91034 1.37667C4.74434 1.348 4.57301 1.33334 4.39967 1.33334C2.70834 1.33334 1.33301 2.70867 1.33301 4.4ZM2.66634 4.4C2.66634 3.444 3.44367 2.66667 4.39967 2.66667C4.47234 2.66667 4.54434 2.67134 4.61834 2.68067L5.32501 5.76134C5.20967 5.82134 5.08367 5.88734 4.96701 5.94867C4.39234 6.24867 3.93901 6.486 4.17701 7.00934C4.96034 9.24 6.75967 11.04 8.96367 11.8133C9.52432 12.0391 9.74447 11.619 10.0479 11.0401L10.049 11.038C10.0894 10.9598 10.1325 10.8778 10.1747 10.7974C10.1965 10.7558 10.2181 10.7147 10.239 10.6747L13.319 11.3813C13.3283 11.4533 13.333 11.526 13.333 11.6C13.333 12.556 12.555 13.3333 11.5997 13.3333C6.67367 13.3333 2.66634 9.32534 2.66634 4.4Z" fill="#1C233D"/>
<mask id="mask0" mask-type="alpha" maskUnits="userSpaceOnUse" x="1" y="1" width="14" height="14">
<path fill-rule="evenodd" clip-rule="evenodd" d="M1.33301 4.4C1.33301 10.0613 5.93834 14.6667 11.5997 14.6667C13.2903 14.6667 14.6663 13.2913 14.6663 11.6C14.6663 11.428 14.6517 11.2573 14.6237 11.0927C14.5963 10.9253 14.555 10.7627 14.5003 10.6053C14.4257 10.3887 14.2437 10.226 14.0203 10.1747L10.0437 9.262C9.82634 9.214 9.59567 9.27467 9.43301 9.43067C9.33834 9.52134 9.33568 9.524 8.90234 10.3513C7.48234 9.70467 6.31901 8.54534 5.64967 7.096C6.47634 6.66334 6.47834 6.66134 6.56901 6.56667C6.72501 6.404 6.78834 6.17467 6.73767 5.956L5.82501 1.98C5.77367 1.756 5.61034 1.574 5.39367 1.49867C5.23501 1.444 5.07234 1.40267 4.91034 1.37667C4.74434 1.348 4.57301 1.33334 4.39967 1.33334C2.70834 1.33334 1.33301 2.70867 1.33301 4.4ZM2.66634 4.4C2.66634 3.444 3.44367 2.66667 4.39967 2.66667C4.47234 2.66667 4.54434 2.67134 4.61834 2.68067L5.32501 5.76134C5.20967 5.82134 5.08367 5.88734 4.96701 5.94867C4.39234 6.24867 3.93901 6.486 4.17701 7.00934C4.96034 9.24 6.75967 11.04 8.96367 11.8133C9.52432 12.0391 9.74447 11.619 10.0479 11.0401L10.049 11.038C10.0894 10.9598 10.1325 10.8778 10.1747 10.7974C10.1965 10.7558 10.2181 10.7147 10.239 10.6747L13.319 11.3813C13.3283 11.4533 13.333 11.526 13.333 11.6C13.333 12.556 12.555 13.3333 11.5997 13.3333C6.67367 13.3333 2.66634 9.32534 2.66634 4.4Z" fill="white"/>
</mask>
<g mask="url(#mask0)">
</g>
</svg>
