<svg width="24" height="24" viewBox="0 0 24 24" fill="none" xmlns="http://www.w3.org/2000/svg">
<path fill-rule="evenodd" clip-rule="evenodd" d="M14.2963 2.328L19.7403 8.328C19.9073 8.512 20.0003 8.751 20.0003 9V19.5C20.0003 20.878 18.8533 22 17.4443 22H6.55531C5.14631 22 4.00031 20.878 4.00031 19.5V4.5C4.00031 3.122 5.14631 2 6.55531 2H13.5553C13.8383 2 14.1063 2.119 14.2963 2.328ZM6.55531 20H17.4443C17.7513 20 18.0003 19.776 18.0003 19.5V10H14.7143C13.2173 10 12.0003 8.722 12.0003 7.15V4H6.55531C6.24931 4 6.00031 4.224 6.00031 4.5V19.5C6.00031 19.776 6.24931 20 6.55531 20ZM9.00001 14H12C12.552 14 13 13.552 13 13C13 12.448 12.552 12 12 12H9.00001C8.44801 12 8.00001 12.448 8.00001 13C8.00001 13.552 8.44801 14 9.00001 14ZM9.00001 16C8.44801 16 8.00001 16.448 8.00001 17C8.00001 17.552 8.44801 18 9.00001 18H15C15.553 18 16 17.552 16 17C16 16.448 15.553 16 15 16H9.00001ZM14.0003 4.978L16.7423 8H14.7143C14.3203 8 14.0003 7.619 14.0003 7.15V4.978Z" fill="#1C233D"/>
<mask id="mask0" mask-type="alpha" maskUnits="userSpaceOnUse" x="4" y="2" width="17" height="20">
<path fill-rule="evenodd" clip-rule="evenodd" d="M14.2963 2.328L19.7403 8.328C19.9073 8.512 20.0003 8.751 20.0003 9V19.5C20.0003 20.878 18.8533 22 17.4443 22H6.55531C5.14631 22 4.00031 20.878 4.00031 19.5V4.5C4.00031 3.122 5.14631 2 6.55531 2H13.5553C13.8383 2 14.1063 2.119 14.2963 2.328ZM6.55531 20H17.4443C17.7513 20 18.0003 19.776 18.0003 19.5V10H14.7143C13.2173 10 12.0003 8.722 12.0003 7.15V4H6.55531C6.24931 4 6.00031 4.224 6.00031 4.5V19.5C6.00031 19.776 6.24931 20 6.55531 20ZM9.00001 14H12C12.552 14 13 13.552 13 13C13 12.448 12.552 12 12 12H9.00001C8.44801 12 8.00001 12.448 8.00001 13C8.00001 13.552 8.44801 14 9.00001 14ZM9.00001 16C8.44801 16 8.00001 16.448 8.00001 17C8.00001 17.552 8.44801 18 9.00001 18H15C15.553 18 16 17.552 16 17C16 16.448 15.553 16 15 16H9.00001ZM14.0003 4.978L16.7423 8H14.7143C14.3203 8 14.0003 7.619 14.0003 7.15V4.978Z" fill="white"/>
</mask>
<g mask="url(#mask0)">
</g>
</svg>
