<svg width="24" height="24" viewBox="0 0 24 24" fill="none" xmlns="http://www.w3.org/2000/svg">
<path fill-rule="evenodd" clip-rule="evenodd" d="M4.9056 4.95282C7.01859 2.82482 9.95359 1.76182 12.9546 2.04382C18.0276 2.51682 21.9996 6.98782 21.9996 12.2248V12.8998C21.9996 13.9188 21.5946 14.8678 20.8576 15.5728C20.1206 16.2778 19.1466 16.6498 18.1336 16.5958C16.9736 16.5448 15.9506 15.9008 15.3056 14.9608C14.3806 16.2448 12.8816 17.0908 11.1816 17.0908C8.37459 17.0908 6.0906 14.8068 6.0906 11.9998C6.0906 9.19382 8.37459 6.90882 11.1816 6.90882C12.5126 6.90882 13.7166 7.43482 14.6246 8.27482C14.6886 7.78282 15.0906 7.39982 15.5996 7.39982C16.1526 7.39982 16.5996 7.84682 16.5996 8.39982V12.7238C16.5996 13.7178 17.3276 14.5588 18.2216 14.5978C18.6886 14.6178 19.1366 14.4518 19.4746 14.1278C19.8136 13.8038 19.9996 13.3678 19.9996 12.8998V12.2248C19.9996 8.00982 16.8246 4.41282 12.7696 4.03582C10.3666 3.80782 8.0146 4.65982 6.32459 6.36182C4.63259 8.06482 3.8006 10.4208 4.0406 12.8258C4.3226 15.6388 6.16159 18.1828 8.7296 19.3088C11.4296 20.4908 14.5456 20.1268 16.8636 18.3518C17.3026 18.0168 17.9296 18.0998 18.2656 18.5368C18.6016 18.9758 18.5186 19.6038 18.0796 19.9398C16.3086 21.2958 14.1636 21.9948 11.9956 21.9948C10.6196 21.9948 9.2336 21.7138 7.9266 21.1408C4.6596 19.7078 2.4086 16.5978 2.0506 13.0258C1.7506 10.0228 2.79159 7.07982 4.9056 4.95282ZM8.0906 11.9998C8.0906 13.7038 9.4776 15.0908 11.1816 15.0908C12.8856 15.0908 14.2726 13.7038 14.2726 11.9998C14.2726 10.2958 12.8856 8.90882 11.1816 8.90882C9.4776 8.90882 8.0906 10.2958 8.0906 11.9998Z" fill="#1C233D"/>
<mask id="mask0" mask-type="alpha" maskUnits="userSpaceOnUse" x="1" y="1" width="21" height="21">
<path fill-rule="evenodd" clip-rule="evenodd" d="M4.9056 4.95282C7.01859 2.82482 9.95359 1.76182 12.9546 2.04382C18.0276 2.51682 21.9996 6.98782 21.9996 12.2248V12.8998C21.9996 13.9188 21.5946 14.8678 20.8576 15.5728C20.1206 16.2778 19.1466 16.6498 18.1336 16.5958C16.9736 16.5448 15.9506 15.9008 15.3056 14.9608C14.3806 16.2448 12.8816 17.0908 11.1816 17.0908C8.37459 17.0908 6.0906 14.8068 6.0906 11.9998C6.0906 9.19382 8.37459 6.90882 11.1816 6.90882C12.5126 6.90882 13.7166 7.43482 14.6246 8.27482C14.6886 7.78282 15.0906 7.39982 15.5996 7.39982C16.1526 7.39982 16.5996 7.84682 16.5996 8.39982V12.7238C16.5996 13.7178 17.3276 14.5588 18.2216 14.5978C18.6886 14.6178 19.1366 14.4518 19.4746 14.1278C19.8136 13.8038 19.9996 13.3678 19.9996 12.8998V12.2248C19.9996 8.00982 16.8246 4.41282 12.7696 4.03582C10.3666 3.80782 8.0146 4.65982 6.32459 6.36182C4.63259 8.06482 3.8006 10.4208 4.0406 12.8258C4.3226 15.6388 6.16159 18.1828 8.7296 19.3088C11.4296 20.4908 14.5456 20.1268 16.8636 18.3518C17.3026 18.0168 17.9296 18.0998 18.2656 18.5368C18.6016 18.9758 18.5186 19.6038 18.0796 19.9398C16.3086 21.2958 14.1636 21.9948 11.9956 21.9948C10.6196 21.9948 9.2336 21.7138 7.9266 21.1408C4.6596 19.7078 2.4086 16.5978 2.0506 13.0258C1.7506 10.0228 2.79159 7.07982 4.9056 4.95282ZM8.0906 11.9998C8.0906 13.7038 9.4776 15.0908 11.1816 15.0908C12.8856 15.0908 14.2726 13.7038 14.2726 11.9998C14.2726 10.2958 12.8856 8.90882 11.1816 8.90882C9.4776 8.90882 8.0906 10.2958 8.0906 11.9998Z" fill="white"/>
</mask>
<g mask="url(#mask0)">
</g>
</svg>
