<svg width="24" height="24" viewBox="0 0 24 24" fill="none" xmlns="http://www.w3.org/2000/svg">
<path fill-rule="evenodd" clip-rule="evenodd" d="M19.4026 7.33667L19.4036 7.33767C20.1686 8.10367 20.1996 9.32167 19.4716 10.0517L10.4746 19.0487C10.1496 19.3737 9.71859 19.5747 9.26059 19.6167L5.09059 19.9957C5.06059 19.9987 5.03059 19.9997 4.99959 19.9997C4.73659 19.9997 4.48159 19.8957 4.29259 19.7067C4.08259 19.4967 3.97759 19.2047 4.00359 18.9097L4.38259 14.7397C4.42459 14.2827 4.62659 13.8507 4.95259 13.5257L13.9486 4.52967C14.6506 3.82467 15.9236 3.85967 16.6646 4.59867L19.4026 7.33667ZM16.0186 10.6787L13.3236 7.98367L15.2716 6.03467L17.9656 8.72867L16.0186 10.6787ZM9.07959 17.6247L6.10259 17.8957L6.36659 14.9397L11.9836 9.32267L14.6796 12.0187L9.07959 17.6247Z" fill="#1C233D"/>
<mask id="mask0" mask-type="alpha" maskUnits="userSpaceOnUse" x="3" y="4" width="17" height="16">
<path fill-rule="evenodd" clip-rule="evenodd" d="M19.4026 7.33667L19.4036 7.33767C20.1686 8.10367 20.1996 9.32167 19.4716 10.0517L10.4746 19.0487C10.1496 19.3737 9.71859 19.5747 9.26059 19.6167L5.09059 19.9957C5.06059 19.9987 5.03059 19.9997 4.99959 19.9997C4.73659 19.9997 4.48159 19.8957 4.29259 19.7067C4.08259 19.4967 3.97759 19.2047 4.00359 18.9097L4.38259 14.7397C4.42459 14.2827 4.62659 13.8507 4.95259 13.5257L13.9486 4.52967C14.6506 3.82467 15.9236 3.85967 16.6646 4.59867L19.4026 7.33667ZM16.0186 10.6787L13.3236 7.98367L15.2716 6.03467L17.9656 8.72867L16.0186 10.6787ZM9.07959 17.6247L6.10259 17.8957L6.36659 14.9397L11.9836 9.32267L14.6796 12.0187L9.07959 17.6247Z" fill="white"/>
</mask>
<g mask="url(#mask0)">
</g>
</svg>
