<?xml version="1.0" encoding="utf-8"?>
<!-- Generator: Adobe Illustrator 24.2.3, SVG Export Plug-In . SVG Version: 6.00 Build 0)  -->
<svg version="1.1" id="Capa_1" xmlns="http://www.w3.org/2000/svg" xmlns:xlink="http://www.w3.org/1999/xlink" x="0px" y="0px"
	 viewBox="0 0 300 300" style="enable-background:new 0 0 300 300;" xml:space="preserve">
<style type="text/css">
	.st0{fill:none;stroke:#1C233D;}
	.st1{fill-rule:evenodd;clip-rule:evenodd;fill:#FD667F;}
	.st2{fill-rule:evenodd;clip-rule:evenodd;fill:#1C233D;}
	.st3{fill-rule:evenodd;clip-rule:evenodd;fill:#39D7C4;}
</style>
<path class="st0" d="M261.6,80.4h-16.4l0,0H38.3c-6.1,0-11,5-11,11v119.2c0,6.1,4.9,11,11,11h207h5.8h10.6c5.7,0,10.2-4.6,10.2-10.3
	V90.6C271.8,85,267.3,80.4,261.6,80.4z"/>
<path class="st1" d="M40.8,90.6c1.7,0,3.1-1.4,3.1-3.1s-1.4-3.1-3.1-3.1s-3.1,1.4-3.1,3.1S39.1,90.6,40.8,90.6z"/>
<path class="st2" d="M53.1,90.6c1.7,0,3.1-1.4,3.1-3.1s-1.4-3.1-3.1-3.1c-1.7,0-3.1,1.4-3.1,3.1S51.4,90.6,53.1,90.6z"/>
<path class="st2" d="M65.4,90.6c1.7,0,3.1-1.4,3.1-3.1s-1.4-3.1-3.1-3.1c-1.7,0-3.1,1.4-3.1,3.1S63.6,90.6,65.4,90.6z"/>
<path class="st2" d="M187.2,94.7l1.3,0L188.4,222l-1.3,0L187.2,94.7z"/>
<path class="st2" d="M262.1,94.1c0.4,0,0.7,0.3,0.7,0.7c0,0.3-0.3,0.6-0.6,0.7l0,0H27.3c-0.4,0-0.7-0.3-0.7-0.7
	c0-0.3,0.3-0.6,0.6-0.7l0,0H262.1z"/>
<path class="st3" d="M214.6,128.2h-0.5c-0.5,0-1-0.4-1-1v-1.4c0-0.5,0.4-1,1-1h0.5c0.5,0,1,0.4,1,1v1.4
	C215.6,127.7,215.1,128.2,214.6,128.2z"/>
<path class="st2" d="M211.1,128.2h-14.5c-0.6,0-1.1-0.5-1.1-1.1v-1.2c0-0.6,0.5-1.1,1.1-1.1h14.5c0.6,0,1.1,0.5,1.1,1.1v1.2
	C212.2,127.7,211.7,128.2,211.1,128.2z"/>
<path class="st2" d="M212.6,143.7h-16.1c-0.6,0-1.1-0.5-1.1-1.1v-1.2c0-0.6,0.5-1.1,1.1-1.1h16.1c0.6,0,1.1,0.5,1.1,1.1v1.2
	C213.7,143.2,213.2,143.7,212.6,143.7z"/>
<path class="st3" d="M227.3,138.5h-26.1c-0.6,0-1.1-0.5-1.1-1.1v-1.2c0-0.6,0.5-1.1,1.1-1.1h26.1c0.6,0,1.1,0.5,1.1,1.1v1.2
	C228.4,138,227.9,138.5,227.3,138.5z"/>
<path class="st2" d="M222.7,120.4h-26.1c-0.6,0-1.1-0.5-1.1-1.1v-1.2c0-0.6,0.5-1.1,1.1-1.1h26.1c0.6,0,1.1,0.5,1.1,1.1v1.2
	C223.8,119.9,223.3,120.4,222.7,120.4z"/>
<path class="st2" d="M222.7,160.2h-26.1c-0.6,0-1.1-0.5-1.1-1.1v-1.2c0-0.6,0.5-1.1,1.1-1.1h26.1c0.6,0,1.1,0.5,1.1,1.1v1.2
	C223.8,159.7,223.3,160.2,222.7,160.2z"/>
<path class="st2" d="M244.1,138.5H231c-0.6,0-1.1-0.5-1.1-1.1v-1.2c0-0.6,0.5-1.1,1.1-1.1h13.1c0.6,0,1.1,0.5,1.1,1.1v1.2
	C245.2,138,244.7,138.5,244.1,138.5z"/>
<path class="st2" d="M249.4,133.3h-0.5c-0.5,0-1-0.4-1-1V131c0-0.5,0.4-1,1-1h0.5c0.5,0,1,0.4,1,1v1.4
	C250.4,132.9,250,133.3,249.4,133.3z"/>
<path class="st2" d="M223.6,133.3h-27.1c-0.6,0-1.1-0.5-1.1-1.1v-1.2c0-0.6,0.5-1.1,1.1-1.1h27.1c0.6,0,1.1,0.5,1.1,1.1v1.2
	C224.7,132.8,224.2,133.3,223.6,133.3z"/>
<path class="st2" d="M232.3,128.2h-14.5c-0.6,0-1.1-0.5-1.1-1.1v-1.2c0-0.6,0.5-1.1,1.1-1.1h14.5c0.6,0,1.1,0.5,1.1,1.1v1.2
	C233.4,127.7,232.9,128.2,232.3,128.2z"/>
<path class="st3" d="M245.6,133.3h-18.5c-0.6,0-1.1-0.5-1.1-1.1v-1.2c0-0.6,0.5-1.1,1.1-1.1h18.5c0.6,0,1.1,0.5,1.1,1.1v1.2
	C246.6,132.9,246.2,133.3,245.6,133.3z"/>
<path class="st2" d="M211.1,173.3h-14.5c-0.6,0-1.1-0.5-1.1-1.1V171c0-0.6,0.5-1.1,1.1-1.1h14.5c0.6,0,1.1,0.5,1.1,1.1v1.2
	C212.2,172.8,211.7,173.3,211.1,173.3z"/>
<path class="st2" d="M212.6,188.8h-16.1c-0.6,0-1.1-0.5-1.1-1.1v-1.2c0-0.6,0.5-1.1,1.1-1.1h16.1c0.6,0,1.1,0.5,1.1,1.1v1.2
	C213.7,188.3,213.2,188.8,212.6,188.8z"/>
<path class="st1" d="M227.3,183.6h-26.1c-0.6,0-1.1-0.5-1.1-1.1v-1.2c0-0.6,0.5-1.1,1.1-1.1h26.1c0.6,0,1.1,0.5,1.1,1.1v1.2
	C228.4,183.2,227.9,183.6,227.3,183.6z"/>
<path class="st2" d="M244.1,183.6H231c-0.6,0-1.1-0.5-1.1-1.1v-1.2c0-0.6,0.5-1.1,1.1-1.1h13.1c0.6,0,1.1,0.5,1.1,1.1v1.2
	C245.2,183.2,244.7,183.6,244.1,183.6z"/>
<path class="st2" d="M249.4,178.5h-0.5c-0.5,0-1-0.4-1-1v-1.4c0-0.5,0.4-1,1-1h0.5c0.5,0,1,0.4,1,1v1.4
	C250.4,178.1,250,178.5,249.4,178.5z"/>
<path class="st2" d="M253.7,173.3h-0.5c-0.5,0-1-0.4-1-1v-1.4c0-0.5,0.4-1,1-1h0.5c0.5,0,1,0.4,1,1v1.4
	C254.6,172.9,254.2,173.3,253.7,173.3z"/>
<path class="st2" d="M223.6,178.5h-27.1c-0.6,0-1.1-0.5-1.1-1.1v-1.2c0-0.6,0.5-1.1,1.1-1.1h27.1c0.6,0,1.1,0.5,1.1,1.1v1.2
	C224.7,178,224.2,178.5,223.6,178.5z"/>
<path class="st1" d="M232.3,173.3h-18.1c-0.6,0-1.1-0.5-1.1-1.1V171c0-0.6,0.5-1.1,1.1-1.1h18.1c0.6,0,1.1,0.5,1.1,1.1v1.2
	C233.4,172.8,232.9,173.3,232.3,173.3z"/>
<path class="st1" d="M250.3,173.3h-14.5c-0.6,0-1.1-0.5-1.1-1.1V171c0-0.6,0.5-1.1,1.1-1.1h14.5c0.6,0,1.1,0.5,1.1,1.1v1.2
	C251.3,172.8,250.9,173.3,250.3,173.3z"/>
<path class="st1" d="M214.6,168.3h-0.5c-0.5,0-1-0.4-1-1v-1.4c0-0.5,0.4-1,1-1h0.5c0.5,0,1,0.4,1,1v1.4
	C215.6,167.9,215.1,168.3,214.6,168.3z"/>
<path class="st2" d="M211.1,168.3h-14.5c-0.6,0-1.1-0.5-1.1-1.1V166c0-0.6,0.5-1.1,1.1-1.1h14.5c0.6,0,1.1,0.5,1.1,1.1v1.2
	C212.2,167.8,211.7,168.3,211.1,168.3z"/>
<path class="st2" d="M232.3,168.3h-14.5c-0.6,0-1.1-0.5-1.1-1.1V166c0-0.6,0.5-1.1,1.1-1.1h14.5c0.6,0,1.1,0.5,1.1,1.1v1.2
	C233.4,167.8,232.9,168.3,232.3,168.3z"/>
<path class="st1" d="M245.6,178.5h-18.5c-0.6,0-1.1-0.5-1.1-1.1v-1.2c0-0.6,0.5-1.1,1.1-1.1h18.5c0.6,0,1.1,0.5,1.1,1.1v1.2
	C246.6,178,246.2,178.5,245.6,178.5z"/>
<path class="st2" d="M154.9,179h-25.4c-1.8,0-3.3,1.5-3.3,3.3v26c0,1.8,1.5,3.3,3.3,3.3h25.4c1.8,0,3.3-1.5,3.3-3.3v-26
	C158.3,180.5,156.8,179,154.9,179z M129.6,180.3h25.4c1.1,0,2,0.9,2,2v26c0,1.1-0.9,2-2,2h-25.4c-1.1,0-2-0.9-2-2v-26
	C127.6,181.2,128.5,180.3,129.6,180.3z"/>
<path class="st2" d="M119.8,183.3c0.4,0,0.7,0.3,0.7,0.7c0,0.3-0.3,0.6-0.6,0.7l0,0H99.9c-0.4,0-0.7-0.3-0.7-0.7
	c0-0.3,0.3-0.6,0.6-0.7l0,0H119.8z"/>
<path class="st2" d="M119.9,192.1c0.4,0,0.6,0.3,0.6,0.7c0,0.3-0.3,0.6-0.6,0.7l0,0H62c-0.4,0-0.7-0.3-0.7-0.7
	c0-0.3,0.3-0.6,0.6-0.7l0,0H119.9z"/>
<path class="st2" d="M119.9,197.3c0.4,0,0.6,0.3,0.6,0.7c0,0.3-0.3,0.6-0.6,0.7l0,0H62c-0.4,0-0.7-0.3-0.7-0.7
	c0-0.3,0.3-0.6,0.6-0.7l0,0H119.9z"/>
<path class="st2" d="M119.9,202.5c0.4,0,0.6,0.3,0.6,0.7c0,0.3-0.3,0.6-0.6,0.7l0,0H62c-0.4,0-0.7-0.3-0.7-0.7
	c0-0.3,0.3-0.6,0.6-0.7l0,0H119.9z"/>
<path class="st2" d="M119.9,207.8c0.4,0,0.6,0.3,0.6,0.7c0,0.3-0.3,0.6-0.6,0.7l0,0H62c-0.4,0-0.7-0.3-0.7-0.7
	c0-0.3,0.3-0.6,0.6-0.7l0,0H119.9z"/>
<path class="st2" d="M156.5,179.9c0.3-0.3,0.7-0.3,0.9,0c0.2,0.2,0.3,0.6,0,0.9l0,0l-29.3,29.7c-0.3,0.3-0.7,0.3-0.9,0
	c-0.2-0.2-0.3-0.6,0-0.9l0,0L156.5,179.9z"/>
<path class="st2" d="M90,137.8H64.6c-1.8,0-3.3,1.5-3.3,3.3v26c0,1.8,1.5,3.3,3.3,3.3H90c1.8,0,3.3-1.5,3.3-3.3v-26.1
	C93.3,139.3,91.8,137.8,90,137.8z M64.6,139.1H90c1.1,0,2,0.9,2,2v26c0,1.1-0.9,2-2,2H64.6c-1.1,0-2-0.9-2-2v-26
	C62.6,140,63.5,139.1,64.6,139.1z"/>
<path class="st2" d="M119.7,142.1c0.4,0,0.7,0.3,0.7,0.7c0,0.3-0.3,0.6-0.6,0.7l0,0H99.8c-0.4,0-0.6-0.3-0.6-0.7
	c0-0.3,0.3-0.6,0.6-0.7l0,0H119.7z"/>
<path class="st2" d="M157.7,150.8c0.4,0,0.7,0.3,0.7,0.7c0,0.3-0.3,0.6-0.6,0.7l0,0h-58c-0.4,0-0.6-0.3-0.6-0.7
	c0-0.3,0.3-0.6,0.6-0.7l0,0H157.7z"/>
<path class="st2" d="M157.7,156.1c0.4,0,0.7,0.3,0.7,0.7c0,0.3-0.3,0.6-0.6,0.7l0,0h-58c-0.4,0-0.6-0.3-0.6-0.7
	c0-0.3,0.3-0.6,0.6-0.7l0,0H157.7z"/>
<path class="st2" d="M157.7,161.3c0.4,0,0.7,0.3,0.7,0.7c0,0.3-0.3,0.6-0.6,0.7l0,0h-58c-0.4,0-0.6-0.3-0.6-0.7
	c0-0.3,0.3-0.6,0.6-0.7l0,0H157.7z"/>
<path class="st2" d="M157.7,166.5c0.4,0,0.7,0.3,0.7,0.7c0,0.3-0.3,0.6-0.6,0.7l0,0h-58c-0.4,0-0.6-0.3-0.6-0.7
	c0-0.3,0.3-0.6,0.6-0.7l0,0H157.7z"/>
<path class="st2" d="M91.5,138.7c0.3-0.3,0.7-0.3,0.9,0c0.2,0.2,0.3,0.6,0,0.9l0,0l-29.3,29.7c-0.3,0.3-0.7,0.3-0.9,0
	c-0.2-0.2-0.3-0.6,0-0.9l0,0L91.5,138.7z"/>
<path class="st2" d="M176.1,104.2H37.4c-1.8,0-3.2,1.4-3.2,3.2v21.7c0,1.8,1.4,3.2,3.2,3.2h138.7c1.8,0,3.2-1.4,3.2-3.2v-21.7
	C179.3,105.7,177.9,104.2,176.1,104.2z"/>
<path class="st2" d="M251.2,80.1c6.6,0,11.5,5.1,11.6,11.9l0,0.2v129c0,0.4-0.3,0.7-0.7,0.7c-0.4,0-0.7-0.3-0.7-0.7l0,0v-129
	c0-6.2-4.8-11.2-10.7-11.2c-0.4,0-0.7-0.3-0.7-0.7C250,79.9,250.8,80.1,251.2,80.1z"/>
</svg>
