<svg width="24" height="24" viewBox="0 0 24 24" fill="none" xmlns="http://www.w3.org/2000/svg">
<path fill-rule="evenodd" clip-rule="evenodd" d="M11.9997 2.00037C17.5137 2.00037 21.9997 6.48537 21.9997 12.0004C21.9997 17.5144 17.5137 22.0004 11.9997 22.0004C6.48569 22.0004 1.99969 17.5144 1.99969 12.0004C1.99969 6.48537 6.48569 2.00037 11.9997 2.00037ZM7.27669 12.6904L10.1387 15.6904C10.5197 16.0894 11.1527 16.1054 11.5527 15.7234C11.9527 15.3414 11.9667 14.7094 11.5857 14.3094L10.3367 13.0004H15.9997C16.5527 13.0004 16.9997 12.5524 16.9997 12.0004C16.9997 11.4474 16.5527 11.0004 15.9997 11.0004H10.4137L11.7067 9.70737C12.0977 9.31637 12.0977 8.68337 11.7067 8.29337C11.3167 7.90237 10.6837 7.90237 10.2927 8.29337L7.29369 11.2924C7.2007 11.3844 7.12769 11.4954 7.07669 11.6174C7.02669 11.7394 6.99969 11.8694 6.99969 12.0004C6.99969 12.1284 7.02669 12.2564 7.0757 12.3774C7.09324 12.4195 7.11964 12.4557 7.14626 12.4922C7.15759 12.5077 7.16895 12.5233 7.17969 12.5394C7.19134 12.557 7.20149 12.5754 7.21165 12.5938C7.23026 12.6275 7.24887 12.6612 7.27669 12.6904Z" fill="#0D1C2E"/>
<mask id="mask0" mask-type="alpha" maskUnits="userSpaceOnUse" x="1" y="2" width="21" height="21">
<path fill-rule="evenodd" clip-rule="evenodd" d="M11.9997 2.00037C17.5137 2.00037 21.9997 6.48537 21.9997 12.0004C21.9997 17.5144 17.5137 22.0004 11.9997 22.0004C6.48569 22.0004 1.99969 17.5144 1.99969 12.0004C1.99969 6.48537 6.48569 2.00037 11.9997 2.00037ZM7.27669 12.6904L10.1387 15.6904C10.5197 16.0894 11.1527 16.1054 11.5527 15.7234C11.9527 15.3414 11.9667 14.7094 11.5857 14.3094L10.3367 13.0004H15.9997C16.5527 13.0004 16.9997 12.5524 16.9997 12.0004C16.9997 11.4474 16.5527 11.0004 15.9997 11.0004H10.4137L11.7067 9.70737C12.0977 9.31637 12.0977 8.68337 11.7067 8.29337C11.3167 7.90237 10.6837 7.90237 10.2927 8.29337L7.29369 11.2924C7.2007 11.3844 7.12769 11.4954 7.07669 11.6174C7.02669 11.7394 6.99969 11.8694 6.99969 12.0004C6.99969 12.1284 7.02669 12.2564 7.0757 12.3774C7.09324 12.4195 7.11964 12.4557 7.14626 12.4922C7.15759 12.5077 7.16895 12.5233 7.17969 12.5394C7.19134 12.557 7.20149 12.5754 7.21165 12.5938C7.23026 12.6275 7.24887 12.6612 7.27669 12.6904Z" fill="white"/>
</mask>
<g mask="url(#mask0)">
</g>
</svg>
