<svg width="45" height="44" viewBox="0 0 45 44" fill="none" xmlns="http://www.w3.org/2000/svg">
<path d="M43.5 14.6957C43.5 11.0314 41.1296 7.87235 37.6722 6.82779C36.6277 3.37044 33.4686 1 29.8043 1C26.6279 1 23.8678 2.81048 22.5 5.45465C21.1322 2.81048 18.3721 1 15.1957 1C11.5323 1 8.37324 3.37044 7.32779 6.82779C3.86954 7.87235 1.5 11.0314 1.5 14.6957C1.5 17.8721 3.31137 20.6322 5.95465 22C3.31137 23.3678 1.5 26.1279 1.5 29.3043C1.5 32.9686 3.86954 36.1277 7.32779 37.1722C8.37324 40.6296 11.5323 43 15.1957 43C18.3721 43 21.1322 41.1895 22.5 38.5453C23.8678 41.1895 26.6279 43 29.8043 43C33.4686 43 36.6277 40.6296 37.6722 37.1722C41.1296 36.1277 43.5 32.9686 43.5 29.3043C43.5 26.1279 41.6895 23.3678 39.0453 22C41.6895 20.6322 43.5 17.8721 43.5 14.6957ZM15.1957 41.1739C12.2011 41.1739 9.63982 39.1387 8.96484 36.2244C8.85829 35.7514 8.80435 35.2654 8.80435 34.7826C8.80435 31.2593 11.6714 28.3913 15.1957 28.3913C15.6994 28.3913 16.1087 27.9834 16.1087 27.4783C16.1087 26.9731 15.6994 26.5652 15.1957 26.5652C10.6652 26.5652 6.97826 30.2513 6.97826 34.7826C6.97826 34.8802 6.99119 34.9779 6.99476 35.0755C4.78705 34.0403 3.32609 31.8335 3.32609 29.3043C3.32609 25.781 6.19317 22.913 9.71739 22.913H15.1957C15.6994 22.913 16.1087 22.5051 16.1087 22C16.1087 21.4949 15.6994 21.087 15.1957 21.087H9.71739C6.19317 21.087 3.32609 18.219 3.32609 14.6957C3.32609 12.1665 4.78705 9.95969 6.99476 8.92449C6.99119 9.02212 6.97826 9.11976 6.97826 9.21739C6.97826 13.7487 10.6652 17.4348 15.1957 17.4348C15.6994 17.4348 16.1087 17.0269 16.1087 16.5217C16.1087 16.0166 15.6994 15.6087 15.1957 15.6087C11.6714 15.6087 8.80435 12.7407 8.80435 9.21739C8.80435 8.73457 8.85829 8.24862 8.96484 7.7756C9.63982 4.86126 12.2011 2.82609 15.1957 2.82609C18.7199 2.82609 21.587 5.69406 21.587 9.21739V34.7826C21.587 38.3059 18.7199 41.1739 15.1957 41.1739ZM35.2826 21.087H29.8043C29.2992 21.087 28.8913 21.4949 28.8913 22C28.8913 22.5051 29.2992 22.913 29.8043 22.913H35.2826C38.8059 22.913 41.6739 25.781 41.6739 29.3043C41.6739 31.8335 40.213 34.0403 38.0052 35.0755C38.0088 34.9779 38.0217 34.8802 38.0217 34.7826C38.0217 30.2513 34.3357 26.5652 29.8043 26.5652C29.2992 26.5652 28.8913 26.9731 28.8913 27.4783C28.8913 27.9834 29.2992 28.3913 29.8043 28.3913C33.3277 28.3913 36.1957 31.2593 36.1957 34.7826C36.1957 35.2619 36.1417 35.7469 36.036 36.2208C35.3629 39.1378 32.7998 41.1739 29.8043 41.1739C26.281 41.1739 23.413 38.3059 23.413 34.7826V9.21739C23.413 5.69406 26.281 2.82609 29.8043 2.82609C32.7998 2.82609 35.3629 4.86216 36.036 7.77917C36.1417 8.25308 36.1957 8.73813 36.1957 9.21739C36.1957 12.7407 33.3277 15.6087 29.8043 15.6087C29.2992 15.6087 28.8913 16.0166 28.8913 16.5217C28.8913 17.0269 29.2992 17.4348 29.8043 17.4348C34.3357 17.4348 38.0217 13.7487 38.0217 9.21739C38.0217 9.11976 38.0088 9.02212 38.0052 8.92449C40.213 9.95969 41.6739 12.1665 41.6739 14.6957C41.6739 18.219 38.8059 21.087 35.2826 21.087Z" fill="#04219C" stroke="#04219C" stroke-width="1.5"/>
</svg>
