<svg width="169" height="139" viewBox="0 0 169 139" fill="none" xmlns="http://www.w3.org/2000/svg">
<path fill-rule="evenodd" clip-rule="evenodd" d="M128.639 0.76123H79.5242C73.6614 0.76123 68.9153 5.33052 68.9153 10.9749V45.6478H72.7809V11.037C72.7809 8.05968 75.358 5.64065 78.5578 5.64065H89.5534V7.89428C89.5534 8.61792 90.1976 9.21751 90.9707 9.21751H111.287C112.081 9.21751 112.704 8.61792 112.704 7.89428V5.64065H123.7C126.899 5.64065 129.477 8.05968 129.477 11.037V48.501H133.278V10.2513C133.278 5.88876 129.477 2.35324 124.795 2.35324C124.43 2.35324 124.151 2.08446 124.151 1.73298C124.151 1.3815 124.43 1.11271 124.795 1.11271C130.185 1.11271 134.566 5.20646 134.566 10.2513V48.501H139.269V10.9749C139.269 5.33052 134.502 0.76123 128.639 0.76123Z" fill="#1C233D"/>
<rect x="68.9153" y="74.8828" width="3.8656" height="41.3716" fill="#1C233D"/>
<path fill-rule="evenodd" clip-rule="evenodd" d="M129.477 60.5339V88.6111L133.278 89.2727V60.5339H129.477Z" fill="#1C233D"/>
<path fill-rule="evenodd" clip-rule="evenodd" d="M133.278 126.261V126.241V94.7105L129.476 94.1316V127.915C129.476 130.893 126.899 133.312 123.699 133.312H78.5576C75.5081 133.312 72.9954 131.099 72.8021 128.287H68.9365C69.2372 133.663 74.0263 138.294 79.6743 138.294L125.568 137.943C125.568 137.653 125.761 137.405 126.062 137.343C129.176 136.62 131.345 134.573 132.483 131.244C133.363 128.66 133.278 126.282 133.278 126.261Z" fill="#1C233D"/>
<path fill-rule="evenodd" clip-rule="evenodd" d="M134.566 60.5339V89.8312L136.907 92.1055L134.566 93.5941V126.22C134.566 126.448 134.631 128.887 133.729 131.575C132.698 134.635 130.787 136.806 128.188 137.943H128.639C134.502 137.943 139.248 133.374 139.248 127.729V60.5339H134.566Z" fill="#1C233D"/>
<path fill-rule="evenodd" clip-rule="evenodd" d="M115.701 40.7914C115.889 40.5008 116.287 40.4123 116.589 40.5937C120.305 42.8269 124.538 43.9795 129.98 44.0557C130.335 44.0607 130.62 44.3424 130.615 44.6849C130.609 45.0274 130.317 45.3011 129.961 45.2961C124.289 45.2167 119.826 44.0014 115.906 41.646C115.604 41.4646 115.512 41.082 115.701 40.7914Z" fill="#1C233D"/>
<path fill-rule="evenodd" clip-rule="evenodd" d="M75.3944 18.2482C78.2331 17.8391 80.5895 17.6554 83.1074 17.7453C86.43 17.8639 89.575 18.4811 92.5544 19.718C95.2399 20.8329 97.7333 22.4323 100.013 24.5714C101.2 25.6955 102.37 26.8724 103.602 28.1726C103.842 28.4257 103.823 28.818 103.56 29.0489C103.297 29.2798 102.89 29.2618 102.65 29.0087C101.433 27.7242 100.279 26.5633 99.1113 25.4579C96.9473 23.427 94.586 21.9124 92.0442 20.8571C89.2205 19.6849 86.231 19.0982 83.0597 18.985C80.7128 18.9012 78.4991 19.0651 75.8514 19.4372L75.5828 19.4757C75.3878 19.5064 73.1037 19.8513 72.4276 19.9338L72.3373 19.9443C71.9837 19.9825 71.6648 19.7375 71.6252 19.3971C71.5855 19.0566 71.84 18.7497 72.1936 18.7115L72.3502 18.6926C73.1381 18.5917 75.5583 18.2245 75.3944 18.2482Z" fill="#1C233D"/>
<path fill-rule="evenodd" clip-rule="evenodd" d="M72.1916 98.0847C74.6231 97.8146 77.4043 97.7621 80.386 98.0634C80.7399 98.0991 80.9966 98.4043 80.9595 98.745C80.9224 99.0857 80.6054 99.3329 80.2515 99.2972C77.3706 99.0061 74.6824 99.0568 72.3393 99.3171C71.9858 99.3564 71.6662 99.1124 71.6254 98.772C71.5846 98.4317 71.8381 98.124 72.1916 98.0847Z" fill="#1C233D"/>
<path fill-rule="evenodd" clip-rule="evenodd" d="M96.5238 104.723C96.7461 104.455 97.1515 104.412 97.4293 104.626C98.3424 105.329 99.1892 106.046 100.011 106.816L100.522 107.295C105.96 112.363 109.027 114.628 112.72 116.122C116.72 117.739 121.451 118.359 129.979 118.467C130.335 118.471 130.619 118.752 130.615 119.095C130.61 119.437 130.318 119.711 129.962 119.707C121.368 119.598 116.508 118.972 112.347 117.316L112.221 117.265C108.225 115.649 104.98 113.212 99.1114 107.705C98.3208 106.963 97.5055 106.273 96.6244 105.595C96.3465 105.381 96.3015 104.99 96.5238 104.723Z" fill="#1C233D"/>
<path fill-rule="evenodd" clip-rule="evenodd" d="M115.818 27.8667H87.6205C87.2054 27.8667 86.8689 28.1907 86.8689 28.5903V55.7373C86.8689 56.137 87.2054 56.4609 87.6205 56.4609H115.818C116.233 56.4609 116.57 56.137 116.57 55.7373V28.5903C116.57 28.1907 116.233 27.8667 115.818 27.8667ZM115.066 29.314V55.0137H88.3722V29.314H115.066Z" fill="#FD667F"/>
<path fill-rule="evenodd" clip-rule="evenodd" d="M95.3732 57.3293H88.1144C87.6993 57.3293 87.3628 57.6533 87.3628 58.053V65.041C87.3628 65.4407 87.6993 65.7646 88.1144 65.7646H95.3732C95.7883 65.7646 96.1248 65.4407 96.1248 65.041V58.053C96.1248 57.6533 95.7883 57.3293 95.3732 57.3293ZM94.6213 58.7764V64.3174H88.8659V58.7764H94.6213Z" fill="#FD667F"/>
<path fill-rule="evenodd" clip-rule="evenodd" d="M94.8417 57.5413C95.1352 57.2587 95.6112 57.2587 95.9047 57.5413C96.1877 57.8138 96.1979 58.2495 95.935 58.5337L95.9047 58.5646L88.6459 65.5527C88.3524 65.8353 87.8765 65.8353 87.5829 65.5527C87.2999 65.2802 87.2898 64.8445 87.5526 64.5603L87.5829 64.5294L94.8417 57.5413Z" fill="#FD667F"/>
<path fill-rule="evenodd" clip-rule="evenodd" d="M105.274 57.3293H98.0148C97.5997 57.3293 97.2632 57.6533 97.2632 58.053V65.041C97.2632 65.4407 97.5997 65.7646 98.0148 65.7646H105.274C105.689 65.7646 106.025 65.4407 106.025 65.041V58.053C106.025 57.6533 105.689 57.3293 105.274 57.3293ZM104.522 58.7766V64.3176H98.7662V58.7766H104.522Z" fill="#FD667F"/>
<path fill-rule="evenodd" clip-rule="evenodd" d="M104.742 57.5413C105.036 57.2587 105.512 57.2587 105.805 57.5413C106.088 57.8138 106.098 58.2495 105.835 58.5337L105.805 58.5646L98.5463 65.5527C98.2528 65.8353 97.7769 65.8353 97.4833 65.5527C97.2003 65.2802 97.1902 64.8445 97.453 64.5603L97.4833 64.5294L104.742 57.5413Z" fill="#FD667F"/>
<path fill-rule="evenodd" clip-rule="evenodd" d="M115.195 57.3293H107.936C107.521 57.3293 107.185 57.6533 107.185 58.053V65.041C107.185 65.4407 107.521 65.7646 107.936 65.7646H115.195C115.61 65.7646 115.947 65.4407 115.947 65.041V58.053C115.947 57.6533 115.61 57.3293 115.195 57.3293ZM114.443 58.7766V64.3176H108.688V58.7766H114.443Z" fill="#FD667F"/>
<path fill-rule="evenodd" clip-rule="evenodd" d="M114.664 57.5413C114.957 57.2587 115.433 57.2587 115.727 57.5413C116.01 57.8138 116.02 58.2495 115.757 58.5337L115.727 58.5646L108.468 65.5527C108.174 65.8353 107.699 65.8353 107.405 65.5527C107.122 65.2802 107.112 64.8445 107.375 64.5603L107.405 64.5294L114.664 57.5413Z" fill="#FD667F"/>
<path fill-rule="evenodd" clip-rule="evenodd" d="M118.095 72.5054H86.4395C82.9105 72.5054 80.0613 75.2483 80.0613 78.6459V82.14C80.0613 85.5375 82.9105 88.2805 86.4395 88.2805H118.095C121.617 88.2805 124.473 85.5236 124.473 82.14V78.6459C124.473 75.2483 121.624 72.5054 118.095 72.5054ZM86.4395 73.9524H118.095C120.793 73.9524 122.97 76.0474 122.97 78.6457V82.1399C122.97 84.7251 120.786 86.8333 118.095 86.8333H86.4395C83.7407 86.8333 81.5646 84.7382 81.5646 82.1399V78.6457C81.5646 76.0474 83.7407 73.9524 86.4395 73.9524Z" fill="#FD667F"/>
<path fill-rule="evenodd" clip-rule="evenodd" d="M117.88 89.707H86.2247C82.6956 89.707 79.8464 92.45 79.8464 95.8476V99.3417C79.8464 102.739 82.6956 105.482 86.2247 105.482H117.88C121.402 105.482 124.258 102.725 124.258 99.3417V95.8476C124.258 92.45 121.409 89.707 117.88 89.707ZM86.2247 91.1541H117.88C120.579 91.1541 122.755 93.2491 122.755 95.8475V99.3417C122.755 101.927 120.571 104.035 117.88 104.035H86.2247C83.5259 104.035 81.3497 101.94 81.3497 99.3417V95.8475C81.3497 93.2491 83.5259 91.1541 86.2247 91.1541Z" fill="#FD667F"/>
<path fill-rule="evenodd" clip-rule="evenodd" d="M114.79 28.288C115.082 28.004 115.558 28.0017 115.853 28.2829C116.137 28.554 116.15 28.9897 115.888 29.2752L115.858 29.3062L88.1547 56.2464C87.8626 56.5304 87.3867 56.5327 87.0917 56.2515C86.8073 55.9804 86.7949 55.5447 87.0562 55.2593L87.0864 55.2282L114.79 28.288Z" fill="#FD667F"/>
<path fill-rule="evenodd" clip-rule="evenodd" d="M77.6774 45.0273H34.1463C31.1919 45.0273 28.7988 47.3313 28.7988 50.1756V70.355C28.7988 73.1993 31.1919 75.5032 34.1463 75.5032H77.6774C80.6279 75.5032 83.0248 73.2029 83.0248 70.3756V50.1756C83.0248 47.3313 80.6317 45.0273 77.6774 45.0273ZM34.1463 46.2681H77.6773C79.9201 46.2681 81.7362 48.0165 81.7362 50.1757V70.3755C81.7362 72.5167 79.9172 74.2625 77.6773 74.2625H34.1463C31.9035 74.2625 30.0874 72.514 30.0874 70.3548V50.1757C30.0874 48.0165 31.9035 46.2681 34.1463 46.2681Z" fill="#1C233D"/>
<path fill-rule="evenodd" clip-rule="evenodd" d="M50.0167 58.9626H49.8664C49.4154 58.9626 49.0718 58.6112 49.0718 58.1977V57.4327C49.0718 56.9985 49.4369 56.6677 49.8664 56.6677H50.0167C50.4677 56.6677 50.8113 57.0192 50.8113 57.4327V58.1977C50.8113 58.6112 50.4462 58.9626 50.0167 58.9626Z" fill="#39D7C4"/>
<path fill-rule="evenodd" clip-rule="evenodd" d="M47.3108 58.9626H37.4534C36.8521 58.9626 36.3796 58.5078 36.3796 57.9289V57.7015C36.3796 57.1226 36.8521 56.6677 37.4534 56.6677H47.3108C47.9121 56.6677 48.3846 57.1226 48.3846 57.7015V57.9289C48.3846 58.5078 47.9121 58.9626 47.3108 58.9626Z" fill="#1C233D"/>
<path fill-rule="evenodd" clip-rule="evenodd" d="M48.406 69.6519H37.4534C36.8521 69.6519 36.3796 69.197 36.3796 68.6181V68.3907C36.3796 67.8118 36.8521 67.3569 37.4534 67.3569H48.406C49.0073 67.3569 49.4798 67.8118 49.4798 68.3907V68.6181C49.4798 69.197 48.9858 69.6519 48.406 69.6519Z" fill="#1C233D"/>
<path fill-rule="evenodd" clip-rule="evenodd" d="M58.9289 66.0957H40.782C40.1807 66.0957 39.7083 65.6408 39.7083 65.0618V64.8344C39.7083 64.2554 40.1807 63.8005 40.782 63.8005H58.9289C59.5302 63.8005 60.0027 64.2554 60.0027 64.8344V65.0618C60.0027 65.6408 59.5088 66.0957 58.9289 66.0957Z" fill="#39D7C4"/>
<path fill-rule="evenodd" clip-rule="evenodd" d="M71.02 66.0957H62.1934C61.5921 66.0957 61.1196 65.6408 61.1196 65.0618V64.8344C61.1196 64.2554 61.5921 63.8005 62.1934 63.8005H71.02C71.6213 63.8005 72.0938 64.2554 72.0938 64.8344V65.0618C72.0938 65.6408 71.6213 66.0957 71.02 66.0957Z" fill="#39D7C4"/>
<path fill-rule="evenodd" clip-rule="evenodd" d="M75.0143 62.5393H74.864C74.413 62.5393 74.0693 62.1878 74.0693 61.7743V61.0094C74.0693 60.5752 74.4344 60.2444 74.864 60.2444H75.0143C75.4653 60.2444 75.8089 60.5959 75.8089 61.0094V61.7743C75.8089 62.1878 75.4653 62.5393 75.0143 62.5393Z" fill="#1C233D"/>
<path fill-rule="evenodd" clip-rule="evenodd" d="M56.309 62.5393H37.4534C36.8521 62.5393 36.3796 62.0845 36.3796 61.5056V61.2781C36.3796 60.6992 36.8521 60.2444 37.4534 60.2444H56.309C56.9103 60.2444 57.3828 60.6992 57.3828 61.2781V61.5056C57.3828 62.0638 56.8889 62.5393 56.309 62.5393Z" fill="#1C233D"/>
<path fill-rule="evenodd" clip-rule="evenodd" d="M62.5153 58.9626H52.658C52.0567 58.9626 51.5842 58.5078 51.5842 57.9289V57.7015C51.5842 57.1226 52.0567 56.6677 52.658 56.6677H62.5153C63.1166 56.6677 63.5891 57.1226 63.5891 57.7015V57.9289C63.5891 58.5078 63.0951 58.9626 62.5153 58.9626Z" fill="#1C233D"/>
<path fill-rule="evenodd" clip-rule="evenodd" d="M72.0506 62.5396H59.3799C58.7786 62.5396 58.3062 62.0847 58.3062 61.5058V61.2577C58.3062 60.6787 58.7786 60.2239 59.3799 60.2239H72.0506C72.6519 60.2239 73.1244 60.6787 73.1244 61.2577V61.5058C73.1244 62.064 72.6519 62.5396 72.0506 62.5396Z" fill="#39D7C4"/>
<path fill-rule="evenodd" clip-rule="evenodd" d="M38.6347 51.6641L41.7272 49.8653C41.7702 49.8447 41.8346 49.824 41.8775 49.824C41.9634 49.824 42.0279 49.8447 42.0923 49.9067C42.1567 49.9687 42.1782 50.0307 42.1782 50.1134C42.1782 50.2168 42.1352 50.2995 42.0279 50.3822L39.3649 51.9122L42.0279 53.4422C42.1352 53.5043 42.1782 53.587 42.1782 53.711C42.1782 53.7937 42.1567 53.8558 42.0923 53.9178C42.0279 53.9798 41.9634 54.0005 41.8775 54.0005C41.8131 54.0005 41.7702 53.9798 41.7272 53.9591L38.6347 52.1603C38.5273 52.0983 38.4629 51.9949 38.4629 51.8916C38.4629 51.8295 38.5273 51.7261 38.6347 51.6641Z" fill="#1C233D"/>
<path fill-rule="evenodd" clip-rule="evenodd" d="M45.3996 48.7282C45.464 48.6662 45.5284 48.6455 45.6143 48.6455C45.7002 48.6455 45.7646 48.6662 45.8291 48.7282C45.8935 48.7902 45.915 48.8523 45.915 48.935C45.915 48.9763 45.915 49.0177 45.8935 49.059L43.4023 55.0548C43.3809 55.0755 43.3594 55.1168 43.3379 55.1375C43.2735 55.1995 43.2091 55.2202 43.1232 55.2202C43.0373 55.2202 42.9728 55.1995 42.9084 55.1375C42.844 55.0755 42.8225 55.0135 42.8225 54.9308C42.8225 54.8894 42.8225 54.8481 42.844 54.8067L45.3351 48.8109C45.3566 48.7696 45.3781 48.7489 45.3996 48.7282Z" fill="#1C233D"/>
<path fill-rule="evenodd" clip-rule="evenodd" d="M50.2959 51.9332C50.2959 52.0366 50.2314 52.1399 50.1241 52.202L47.0316 54.0006C46.9886 54.0213 46.9242 54.042 46.8812 54.042C46.7953 54.042 46.7309 54.0213 46.6665 53.9593C46.602 53.8973 46.5806 53.8352 46.5806 53.7525C46.5806 53.6492 46.6235 53.5665 46.7309 53.4838L49.3939 51.9539L46.7309 50.4239C46.6235 50.3619 46.5806 50.2792 46.5806 50.1552C46.5806 50.0725 46.602 50.0104 46.6665 49.9484C46.7309 49.8864 46.7953 49.8657 46.8812 49.8657C46.9457 49.8657 46.9886 49.8864 47.0316 49.9071L50.1241 51.7058C50.2314 51.7264 50.2959 51.8298 50.2959 51.9332Z" fill="#1C233D"/>
<path fill-rule="evenodd" clip-rule="evenodd" d="M162.893 47.8806H123.85C120.896 47.8806 118.502 50.1845 118.502 53.0288V56.0061C118.502 58.8504 120.896 61.1543 123.85 61.1543H162.893C165.825 61.1543 168.216 58.8524 168.24 56.0112L168.24 53.0288C168.24 50.1845 165.847 47.8806 162.893 47.8806ZM123.85 49.1211H162.893C165.135 49.1211 166.952 50.8696 166.952 53.0287V56.006C166.933 58.1631 165.115 59.9136 162.893 59.9136H123.85C121.607 59.9136 119.791 58.1651 119.791 56.006V53.0287C119.791 50.8696 121.607 49.1211 123.85 49.1211Z" fill="#1C233D"/>
<path fill-rule="evenodd" clip-rule="evenodd" d="M161.69 52.6565C162.046 52.6565 162.334 52.9342 162.334 53.2769C162.334 53.6072 162.066 53.8773 161.728 53.8962L161.69 53.8972H125.375C125.019 53.8972 124.73 53.6195 124.73 53.2769C124.73 52.9465 124.999 52.6764 125.337 52.6575L125.375 52.6565H161.69Z" fill="#1C233D"/>
<path fill-rule="evenodd" clip-rule="evenodd" d="M142.598 55.6338C142.954 55.6338 143.242 55.9115 143.242 56.254C143.242 56.5843 142.974 56.8543 142.636 56.8732L142.598 56.8743H125.375C125.019 56.8743 124.73 56.5966 124.73 56.254C124.73 55.9237 124.999 55.6537 125.337 55.6348L125.375 55.6338H142.598Z" fill="#1C233D"/>
<path fill-rule="evenodd" clip-rule="evenodd" d="M100.334 115.634H61.2915C58.3372 115.634 55.9441 117.938 55.9441 120.782V123.76C55.9441 126.604 58.3372 128.908 61.2915 128.908H100.334C103.289 128.908 105.682 126.604 105.682 123.76V120.782C105.682 117.938 103.289 115.634 100.334 115.634ZM61.2915 116.875H100.334C102.577 116.875 104.393 118.623 104.393 120.782V123.76C104.393 125.919 102.577 127.667 100.334 127.667H61.2915C59.0488 127.667 57.2326 125.919 57.2326 123.76V120.782C57.2326 118.623 59.0488 116.875 61.2915 116.875Z" fill="#1C233D"/>
<path fill-rule="evenodd" clip-rule="evenodd" d="M99.1315 120.41C99.4873 120.41 99.7757 120.688 99.7757 121.03C99.7757 121.361 99.5075 121.631 99.1693 121.65L99.1315 121.651H62.8376C62.4818 121.651 62.1934 121.373 62.1934 121.03C62.1934 120.7 62.4616 120.43 62.7998 120.411L62.8376 120.41H99.1315Z" fill="#1C233D"/>
<path fill-rule="evenodd" clip-rule="evenodd" d="M80.0611 123.387C80.4169 123.387 80.7054 123.665 80.7054 124.008C80.7054 124.338 80.4371 124.608 80.0989 124.627L80.0611 124.628H62.8376C62.4818 124.628 62.1934 124.35 62.1934 124.008C62.1934 123.677 62.4616 123.407 62.7998 123.388L62.8376 123.387H80.0611Z" fill="#1C233D"/>
<path fill-rule="evenodd" clip-rule="evenodd" d="M44.3901 22.3259H5.34743C2.39306 22.3259 0 24.6298 0 27.474V30.4513C0 33.2955 2.39306 35.5994 5.34743 35.5994H44.3901C47.3222 35.5994 49.7132 33.2975 49.7376 30.4564L49.7376 27.474C49.7376 24.6298 47.3445 22.3259 44.3901 22.3259ZM5.34743 23.5664H44.3901C46.6328 23.5664 48.449 25.3149 48.449 27.474V30.4513C48.4304 32.6084 46.6122 34.3589 44.3901 34.3589H5.34743C3.1047 34.3589 1.28854 32.6104 1.28854 30.4513V27.474C1.28854 25.3149 3.1047 23.5664 5.34743 23.5664Z" fill="#1C233D"/>
<path fill-rule="evenodd" clip-rule="evenodd" d="M43.1875 27.1018C43.5434 27.1018 43.8318 27.3795 43.8318 27.722C43.8318 28.0524 43.5636 28.3224 43.2254 28.3412L43.1875 28.3423H6.8723C6.51648 28.3423 6.22803 28.0646 6.22803 27.722C6.22803 27.3917 6.49624 27.1217 6.83444 27.1029L6.8723 27.1018H43.1875Z" fill="#1C233D"/>
<path fill-rule="evenodd" clip-rule="evenodd" d="M24.0958 30.0791C24.4516 30.0791 24.74 30.3568 24.74 30.6993C24.74 31.0297 24.4718 31.2997 24.1336 31.3185L24.0958 31.3196H6.8723C6.51648 31.3196 6.22803 31.0419 6.22803 30.6993C6.22803 30.369 6.49624 30.099 6.83444 30.0802L6.8723 30.0791H24.0958Z" fill="#1C233D"/>
</svg>
