<svg width="727" height="596" viewBox="0 0 727 596" fill="none" xmlns="http://www.w3.org/2000/svg">
<path d="M0.0238647 3.22215L299.719 300.011L0 596.826L218.064 804L727 299.989L218.038 -204L0.0238647 3.22215Z" fill="#39D7C4"/>
</svg>
