<svg width="24" height="24" viewBox="0 0 24 24" fill="none" xmlns="http://www.w3.org/2000/svg">
<path fill-rule="evenodd" clip-rule="evenodd" d="M20.654 7.24778C20.6545 7.25157 20.655 7.25534 20.6564 7.25891C20.8684 7.62191 20.9994 8.02891 21.0004 8.45691V15.5399C20.9994 16.4879 20.4224 17.3659 19.5304 17.7779L13.1334 20.7499C12.7724 20.9179 12.3844 21.0019 11.9964 21.0019C11.6074 21.0019 11.2194 20.9179 10.8574 20.7489L4.45839 17.7769C3.56439 17.3589 2.99239 16.4749 3.00039 15.5249V8.45791C3.00039 8.02991 3.13139 7.62291 3.34239 7.26091C3.34439 7.25641 3.34514 7.25191 3.34589 7.24741C3.34664 7.24291 3.34739 7.23841 3.34939 7.23391C3.35141 7.22986 3.35446 7.22633 3.35763 7.22266C3.36072 7.21907 3.36392 7.21536 3.36639 7.21091C3.40377 7.14975 3.44764 7.09363 3.49188 7.03705C3.49972 7.02703 3.50756 7.017 3.51539 7.00691C3.52685 6.99407 3.53758 6.98061 3.54827 6.96723C3.56835 6.94207 3.58824 6.91715 3.61239 6.89691C3.84739 6.62091 4.12539 6.37891 4.46939 6.21991L10.8664 3.24791C11.5874 2.91591 12.4124 2.91491 13.1314 3.24691C13.1314 3.24791 13.1324 3.24791 13.1334 3.24791L19.5334 6.22091C19.8774 6.37991 20.1544 6.62291 20.3894 6.89891C20.4111 6.91742 20.4291 6.93959 20.4474 6.96205C20.4577 6.97478 20.4682 6.98761 20.4794 6.99991C20.492 7.01663 20.5049 7.03318 20.5177 7.04972C20.5586 7.10243 20.5994 7.15507 20.6344 7.21291C20.6365 7.21633 20.6392 7.21919 20.6418 7.22198C20.6453 7.22572 20.6487 7.22933 20.6504 7.23391C20.6526 7.23834 20.6533 7.24308 20.654 7.24778ZM11.7074 5.06391C11.7984 5.02091 11.8994 4.99991 12.0004 4.99991C12.1004 4.99991 12.2014 5.02091 12.2924 5.06391L17.6214 7.53791L12.0004 10.1499L6.37839 7.53791L11.7074 5.06391ZM5.00039 15.5319C4.99839 15.7139 5.11439 15.8759 5.30339 15.9639L11.0004 18.6089V11.8909L5.00039 9.10391V15.5319ZM13.0004 18.6069L18.6904 15.9629C18.8824 15.8749 19.0004 15.7129 19.0004 15.5389V9.10391L13.0004 11.8909V18.6069Z" fill="#1C233D"/>
<mask id="mask0" mask-type="alpha" maskUnits="userSpaceOnUse" x="3" y="2" width="19" height="20">
<path fill-rule="evenodd" clip-rule="evenodd" d="M20.654 7.24778C20.6545 7.25157 20.655 7.25534 20.6564 7.25891C20.8684 7.62191 20.9994 8.02891 21.0004 8.45691V15.5399C20.9994 16.4879 20.4224 17.3659 19.5304 17.7779L13.1334 20.7499C12.7724 20.9179 12.3844 21.0019 11.9964 21.0019C11.6074 21.0019 11.2194 20.9179 10.8574 20.7489L4.45839 17.7769C3.56439 17.3589 2.99239 16.4749 3.00039 15.5249V8.45791C3.00039 8.02991 3.13139 7.62291 3.34239 7.26091C3.34439 7.25641 3.34514 7.25191 3.34589 7.24741C3.34664 7.24291 3.34739 7.23841 3.34939 7.23391C3.35141 7.22986 3.35446 7.22633 3.35763 7.22266C3.36072 7.21907 3.36392 7.21536 3.36639 7.21091C3.40377 7.14975 3.44764 7.09363 3.49188 7.03705C3.49972 7.02703 3.50756 7.017 3.51539 7.00691C3.52685 6.99407 3.53758 6.98061 3.54827 6.96723C3.56835 6.94207 3.58824 6.91715 3.61239 6.89691C3.84739 6.62091 4.12539 6.37891 4.46939 6.21991L10.8664 3.24791C11.5874 2.91591 12.4124 2.91491 13.1314 3.24691C13.1314 3.24791 13.1324 3.24791 13.1334 3.24791L19.5334 6.22091C19.8774 6.37991 20.1544 6.62291 20.3894 6.89891C20.4111 6.91742 20.4291 6.93959 20.4474 6.96205C20.4577 6.97478 20.4682 6.98761 20.4794 6.99991C20.492 7.01663 20.5049 7.03318 20.5177 7.04972C20.5586 7.10243 20.5994 7.15507 20.6344 7.21291C20.6365 7.21633 20.6392 7.21919 20.6418 7.22198C20.6453 7.22572 20.6487 7.22933 20.6504 7.23391C20.6526 7.23834 20.6533 7.24308 20.654 7.24778ZM11.7074 5.06391C11.7984 5.02091 11.8994 4.99991 12.0004 4.99991C12.1004 4.99991 12.2014 5.02091 12.2924 5.06391L17.6214 7.53791L12.0004 10.1499L6.37839 7.53791L11.7074 5.06391ZM5.00039 15.5319C4.99839 15.7139 5.11439 15.8759 5.30339 15.9639L11.0004 18.6089V11.8909L5.00039 9.10391V15.5319ZM13.0004 18.6069L18.6904 15.9629C18.8824 15.8749 19.0004 15.7129 19.0004 15.5389V9.10391L13.0004 11.8909V18.6069Z" fill="white"/>
</mask>
<g mask="url(#mask0)">
</g>
</svg>
