<svg width="393" height="91" viewBox="0 0 393 91" fill="none" xmlns="http://www.w3.org/2000/svg">
<path d="M35.176 67.464C35.176 74.224 32.784 77.24 26.128 77.24C18.952 77.24 13.752 75.368 13.752 70.272C13.752 65.904 18.536 63.2 26.544 63.2C29.456 63.2 32.368 63.512 35.072 63.928C35.176 65.28 35.176 66.528 35.176 67.464ZM79.688 72.248C72.616 65.592 61.488 58.52 48.384 54.568C47.864 46.976 47.448 38.864 47.24 32.624C55.56 32.416 67.832 32 76.464 31.168L75.944 18.896C67.416 19.832 55.352 20.248 47.24 20.456C47.24 17.856 47.24 15.256 47.24 12.968C47.448 8.91199 47.76 3.92 48.176 0.903997H32.68C33.304 3.50399 33.616 7.87199 33.72 12.968C33.824 17.336 33.928 23.472 33.928 29.712C33.928 35.12 34.344 43.96 34.656 51.968C32.68 51.76 30.6 51.656 28.52 51.656C9.592 51.656 0.440001 60.184 0.440001 70.896C0.440001 84.936 12.504 89.72 27.168 89.72C44.432 89.72 49.112 80.984 49.112 71.936C49.112 70.896 49.112 69.752 49.008 68.4C58.16 72.56 65.96 78.696 71.784 84.52L79.688 72.248ZM163.928 49.784C163.928 65.904 147.6 74.224 122.016 77.136L129.504 90.032C158.104 86.08 178.488 72.352 178.488 50.304C178.488 34.184 167.048 24.928 150.72 24.928C138.76 24.928 127.216 27.944 119.624 29.608C116.296 30.336 111.824 31.064 108.392 31.376L112.24 46.04C115.256 45 119.208 43.44 122.224 42.504C127.528 40.944 137.72 37.512 149.056 37.512C158.728 37.408 163.928 43.024 163.928 49.784ZM123.576 0.279993L121.496 12.76C133.352 14.84 155.712 16.816 167.776 17.648L169.856 4.95999C158.936 4.95999 135.536 2.88 123.576 0.279993ZM219.88 22.328C228.304 22.952 237.248 23.472 248.064 23.472C257.84 23.472 270.632 22.744 277.808 22.224V8.39199C269.904 9.224 258.152 9.84799 247.96 9.84799C237.144 9.84799 227.576 9.432 219.88 8.6V22.328ZM215.096 51.032C214.264 54.88 213.016 59.872 213.016 65.904C213.016 80.048 224.872 87.952 248.48 87.952C262.936 87.952 275.312 86.6 284.256 84.416L284.152 69.96C275 72.456 261.896 74.016 247.96 74.016C233.088 74.016 226.848 69.232 226.848 62.68C226.848 59.248 227.68 56.024 228.616 52.28L215.096 51.032ZM326.792 4.648L327.416 17.856C330.64 17.544 334.072 17.128 336.672 16.92C340.832 16.504 353.52 15.88 357.68 15.568C351.336 21.288 337.92 32.936 328.664 38.968C323.36 39.592 316.184 40.528 310.672 41.048L311.92 53.528C322.216 51.76 333.76 50.2 343.12 49.472C339.376 53.008 335.632 59.352 335.632 65.696C335.632 82.856 351.024 90.76 377.44 89.616L380.144 76.096C376.296 76.408 370.16 76.512 364.44 75.888C355.184 74.744 348.84 71.624 348.84 63.512C348.84 55.088 356.744 48.432 366.208 47.08C372.448 46.248 382.744 46.248 392.624 46.872V34.704C380.04 34.704 363.088 35.744 349.256 37.2C356.224 31.688 366.416 23.16 373.8 17.336C375.88 15.568 379.728 13.072 381.808 11.616L373.696 2.15199C372.24 2.56799 369.848 3.08799 366.52 3.4C360.28 4.128 340.936 5.06399 336.568 5.06399C333.032 5.06399 330.016 4.95999 326.792 4.648Z" fill="#1C233D"/>
</svg>
