[2021-12-01 14:03:12,369] {taskinstance.py:1035} INFO - Dependencies all met for <TaskInstance: raspberry_monitor_operator.check_db scheduled__2021-12-01T17:02:00+00:00 [queued]>
[2021-12-01 14:03:12,373] {taskinstance.py:1035} INFO - Dependencies all met for <TaskInstance: raspberry_monitor_operator.check_db scheduled__2021-12-01T17:02:00+00:00 [queued]>
[2021-12-01 14:03:12,373] {taskinstance.py:1241} INFO - 
--------------------------------------------------------------------------------
[2021-12-01 14:03:12,373] {taskinstance.py:1242} INFO - Starting attempt 1 of 1
[2021-12-01 14:03:12,373] {taskinstance.py:1243} INFO - 
--------------------------------------------------------------------------------
[2021-12-01 14:03:12,395] {taskinstance.py:1262} INFO - Executing <Task(BashOperator): check_db> on 2021-12-01 17:02:00+00:00
[2021-12-01 14:03:12,397] {standard_task_runner.py:52} INFO - Started process 58428 to run task
[2021-12-01 14:03:12,398] {standard_task_runner.py:76} INFO - Running: ['airflow', 'tasks', 'run', 'raspberry_monitor_operator', 'check_db', 'scheduled__2021-12-01T17:02:00+00:00', '--job-id', '457', '--raw', '--subdir', '/home/fran/Documents/track-basico/ejercicio_final/airflow_home/dags/ansible_monitor.py', '--cfg-path', '/tmp/tmpozfyt4n_', '--error-file', '/tmp/tmppm4w13rl']
[2021-12-01 14:03:12,399] {standard_task_runner.py:77} INFO - Job 457: Subtask check_db
[2021-12-01 14:03:12,415] {logging_mixin.py:109} INFO - Running <TaskInstance: raspberry_monitor_operator.check_db scheduled__2021-12-01T17:02:00+00:00 [running]> on host Weebo2110
[2021-12-01 14:03:12,436] {taskinstance.py:1427} INFO - Exporting the following env vars:
AIRFLOW_CTX_DAG_OWNER=airflow
AIRFLOW_CTX_DAG_ID=raspberry_monitor_operator
AIRFLOW_CTX_TASK_ID=check_db
AIRFLOW_CTX_EXECUTION_DATE=2021-12-01T17:02:00+00:00
AIRFLOW_CTX_DAG_RUN_ID=scheduled__2021-12-01T17:02:00+00:00
[2021-12-01 14:03:12,436] {subprocess.py:62} INFO - Tmp dir root location: 
 /tmp
[2021-12-01 14:03:12,436] {subprocess.py:74} INFO - Running command: ['bash', '-c', 'ansible-playbook ~/Documents/track-basico/ejercicio_final/playbooks/confirm_db.yml']
[2021-12-01 14:03:12,440] {subprocess.py:85} INFO - Output:
[2021-12-01 14:03:12,932] {subprocess.py:89} INFO - 
[2021-12-01 14:03:12,932] {subprocess.py:89} INFO - PLAY [Get Host data for monitoring] ********************************************
[2021-12-01 14:03:13,005] {subprocess.py:89} INFO - 
[2021-12-01 14:03:13,006] {subprocess.py:89} INFO - TASK [Create Database] *********************************************************
[2021-12-01 14:03:13,286] {subprocess.py:89} INFO - ok: [192.168.1.10 -> localhost]
[2021-12-01 14:03:13,290] {subprocess.py:89} INFO - 
[2021-12-01 14:03:13,290] {subprocess.py:89} INFO - PLAY RECAP *********************************************************************
[2021-12-01 14:03:13,290] {subprocess.py:89} INFO - 192.168.1.10               : ok=1    changed=0    unreachable=0    failed=0    skipped=0    rescued=0    ignored=0
[2021-12-01 14:03:13,290] {subprocess.py:89} INFO - 
[2021-12-01 14:03:13,332] {subprocess.py:93} INFO - Command exited with return code 0
[2021-12-01 14:03:13,346] {taskinstance.py:1270} INFO - Marking task as SUCCESS. dag_id=raspberry_monitor_operator, task_id=check_db, execution_date=20211201T170200, start_date=20211201T170312, end_date=20211201T170313
[2021-12-01 14:03:13,396] {local_task_job.py:154} INFO - Task exited with return code 0
[2021-12-01 14:03:13,409] {local_task_job.py:264} INFO - 1 downstream tasks scheduled from follow-on schedule check
