[2021-12-01 15:03:14,029] {taskinstance.py:1035} INFO - Dependencies all met for <TaskInstance: raspberry_monitor_operator.log_to_db scheduled__2021-12-01T18:02:00+00:00 [queued]>
[2021-12-01 15:03:14,033] {taskinstance.py:1035} INFO - Dependencies all met for <TaskInstance: raspberry_monitor_operator.log_to_db scheduled__2021-12-01T18:02:00+00:00 [queued]>
[2021-12-01 15:03:14,034] {taskinstance.py:1241} INFO - 
--------------------------------------------------------------------------------
[2021-12-01 15:03:14,034] {taskinstance.py:1242} INFO - Starting attempt 1 of 1
[2021-12-01 15:03:14,034] {taskinstance.py:1243} INFO - 
--------------------------------------------------------------------------------
[2021-12-01 15:03:14,041] {taskinstance.py:1262} INFO - Executing <Task(BashOperator): log_to_db> on 2021-12-01 18:02:00+00:00
[2021-12-01 15:03:14,042] {standard_task_runner.py:52} INFO - Started process 80487 to run task
[2021-12-01 15:03:14,044] {standard_task_runner.py:76} INFO - Running: ['airflow', 'tasks', 'run', 'raspberry_monitor_operator', 'log_to_db', 'scheduled__2021-12-01T18:02:00+00:00', '--job-id', '638', '--raw', '--subdir', '/home/fran/Documents/track-basico/ejercicio_final/airflow_home/dags/ansible_monitor.py', '--cfg-path', '/tmp/tmpifblgwgg', '--error-file', '/tmp/tmptrsihxxx']
[2021-12-01 15:03:14,044] {standard_task_runner.py:77} INFO - Job 638: Subtask log_to_db
[2021-12-01 15:03:14,059] {logging_mixin.py:109} INFO - Running <TaskInstance: raspberry_monitor_operator.log_to_db scheduled__2021-12-01T18:02:00+00:00 [running]> on host Weebo2110
[2021-12-01 15:03:14,084] {taskinstance.py:1427} INFO - Exporting the following env vars:
AIRFLOW_CTX_DAG_OWNER=airflow
AIRFLOW_CTX_DAG_ID=raspberry_monitor_operator
AIRFLOW_CTX_TASK_ID=log_to_db
AIRFLOW_CTX_EXECUTION_DATE=2021-12-01T18:02:00+00:00
AIRFLOW_CTX_DAG_RUN_ID=scheduled__2021-12-01T18:02:00+00:00
[2021-12-01 15:03:14,084] {subprocess.py:62} INFO - Tmp dir root location: 
 /tmp
[2021-12-01 15:03:14,084] {subprocess.py:74} INFO - Running command: ['bash', '-c', 'ansible-playbook ~/Documents/track-basico/ejercicio_final/playbooks/log2db.yml']
[2021-12-01 15:03:14,087] {subprocess.py:85} INFO - Output:
[2021-12-01 15:03:14,640] {subprocess.py:89} INFO - 
[2021-12-01 15:03:14,640] {subprocess.py:89} INFO - PLAY [Log2DB] ******************************************************************
[2021-12-01 15:03:14,657] {subprocess.py:89} INFO - 
[2021-12-01 15:03:14,657] {subprocess.py:89} INFO - TASK [Gathering Facts] *********************************************************
[2021-12-01 15:03:15,262] {subprocess.py:89} INFO - ok: [localhost]
[2021-12-01 15:03:15,277] {subprocess.py:89} INFO - 
[2021-12-01 15:03:15,277] {subprocess.py:89} INFO - TASK [extract raw text] ********************************************************
[2021-12-01 15:03:15,478] {subprocess.py:89} INFO - changed: [localhost]
[2021-12-01 15:03:15,486] {subprocess.py:89} INFO - 
[2021-12-01 15:03:15,486] {subprocess.py:89} INFO - TASK [show current directory] **************************************************
[2021-12-01 15:03:15,594] {subprocess.py:89} INFO - changed: [localhost]
[2021-12-01 15:03:15,618] {subprocess.py:89} INFO - 
[2021-12-01 15:03:15,618] {subprocess.py:89} INFO - TASK [FSM parsing] *************************************************************
[2021-12-01 15:03:15,649] {subprocess.py:89} INFO - ok: [localhost -> localhost] => {
[2021-12-01 15:03:15,649] {subprocess.py:89} INFO -     "msg": [
[2021-12-01 15:03:15,649] {subprocess.py:89} INFO -         {
[2021-12-01 15:03:15,649] {subprocess.py:89} INFO -             "FreeMemory": "225",
[2021-12-01 15:03:15,649] {subprocess.py:89} INFO -             "Host": "rasputin",
[2021-12-01 15:03:15,649] {subprocess.py:89} INFO -             "OperatingSys": "Debian buster",
[2021-12-01 15:03:15,649] {subprocess.py:89} INFO -             "TotalMemory": "923",
[2021-12-01 15:03:15,649] {subprocess.py:89} INFO -             "ipv4": "192.168.1.10",
[2021-12-01 15:03:15,649] {subprocess.py:89} INFO -             "ipv6": "2800:40:1a:8e9:5f90:7147:bb9f:5e64"
[2021-12-01 15:03:15,649] {subprocess.py:89} INFO -         }
[2021-12-01 15:03:15,649] {subprocess.py:89} INFO -     ]
[2021-12-01 15:03:15,650] {subprocess.py:89} INFO - }
[2021-12-01 15:03:15,663] {subprocess.py:89} INFO - 
[2021-12-01 15:03:15,663] {subprocess.py:89} INFO - TASK [log_to_InfluxDB] *********************************************************
[2021-12-01 15:03:15,935] {subprocess.py:89} INFO - changed: [localhost -> localhost]
[2021-12-01 15:03:15,950] {subprocess.py:89} INFO - 
[2021-12-01 15:03:15,950] {subprocess.py:89} INFO - PLAY RECAP *********************************************************************
[2021-12-01 15:03:15,950] {subprocess.py:89} INFO - localhost                  : ok=5    changed=3    unreachable=0    failed=0    skipped=0    rescued=0    ignored=0
[2021-12-01 15:03:15,950] {subprocess.py:89} INFO - 
[2021-12-01 15:03:15,988] {subprocess.py:93} INFO - Command exited with return code 0
[2021-12-01 15:03:15,997] {taskinstance.py:1270} INFO - Marking task as SUCCESS. dag_id=raspberry_monitor_operator, task_id=log_to_db, execution_date=20211201T180200, start_date=20211201T180314, end_date=20211201T180315
[2021-12-01 15:03:16,057] {local_task_job.py:154} INFO - Task exited with return code 0
[2021-12-01 15:03:16,066] {local_task_job.py:264} INFO - 0 downstream tasks scheduled from follow-on schedule check
