[2021-12-01 12:55:14,734] {taskinstance.py:1035} INFO - Dependencies all met for <TaskInstance: raspberry_monitor_operator.log_to_db scheduled__2021-12-01T15:54:00+00:00 [queued]>
[2021-12-01 12:55:14,739] {taskinstance.py:1035} INFO - Dependencies all met for <TaskInstance: raspberry_monitor_operator.log_to_db scheduled__2021-12-01T15:54:00+00:00 [queued]>
[2021-12-01 12:55:14,739] {taskinstance.py:1241} INFO - 
--------------------------------------------------------------------------------
[2021-12-01 12:55:14,739] {taskinstance.py:1242} INFO - Starting attempt 1 of 1
[2021-12-01 12:55:14,739] {taskinstance.py:1243} INFO - 
--------------------------------------------------------------------------------
[2021-12-01 12:55:14,746] {taskinstance.py:1262} INFO - Executing <Task(BashOperator): log_to_db> on 2021-12-01 15:54:00+00:00
[2021-12-01 12:55:14,747] {standard_task_runner.py:52} INFO - Started process 14627 to run task
[2021-12-01 12:55:14,748] {standard_task_runner.py:76} INFO - Running: ['airflow', 'tasks', 'run', 'raspberry_monitor_operator', 'log_to_db', 'scheduled__2021-12-01T15:54:00+00:00', '--job-id', '251', '--raw', '--subdir', '/home/fran/Documents/track-basico/ejercicio_final/airflow_home/dags/ansible_monitor.py', '--cfg-path', '/tmp/tmpkdby_kof', '--error-file', '/tmp/tmp5_8l5ktg']
[2021-12-01 12:55:14,748] {standard_task_runner.py:77} INFO - Job 251: Subtask log_to_db
[2021-12-01 12:55:14,763] {logging_mixin.py:109} INFO - Running <TaskInstance: raspberry_monitor_operator.log_to_db scheduled__2021-12-01T15:54:00+00:00 [running]> on host Weebo2110
[2021-12-01 12:55:14,783] {taskinstance.py:1427} INFO - Exporting the following env vars:
AIRFLOW_CTX_DAG_OWNER=airflow
AIRFLOW_CTX_DAG_ID=raspberry_monitor_operator
AIRFLOW_CTX_TASK_ID=log_to_db
AIRFLOW_CTX_EXECUTION_DATE=2021-12-01T15:54:00+00:00
AIRFLOW_CTX_DAG_RUN_ID=scheduled__2021-12-01T15:54:00+00:00
[2021-12-01 12:55:14,783] {subprocess.py:62} INFO - Tmp dir root location: 
 /tmp
[2021-12-01 12:55:14,783] {subprocess.py:74} INFO - Running command: ['bash', '-c', 'ansible-playbook ~/Documents/track-basico/ejercicio_final/playbooks/log2db.yml']
[2021-12-01 12:55:14,786] {subprocess.py:85} INFO - Output:
[2021-12-01 12:55:15,393] {subprocess.py:89} INFO - 
[2021-12-01 12:55:15,393] {subprocess.py:89} INFO - PLAY [Log2DB] ******************************************************************
[2021-12-01 12:55:15,410] {subprocess.py:89} INFO - 
[2021-12-01 12:55:15,410] {subprocess.py:89} INFO - TASK [Gathering Facts] *********************************************************
[2021-12-01 12:55:16,023] {subprocess.py:89} INFO - ok: [localhost]
[2021-12-01 12:55:16,039] {subprocess.py:89} INFO - 
[2021-12-01 12:55:16,039] {subprocess.py:89} INFO - TASK [extract raw text] ********************************************************
[2021-12-01 12:55:16,243] {subprocess.py:89} INFO - changed: [localhost]
[2021-12-01 12:55:16,251] {subprocess.py:89} INFO - 
[2021-12-01 12:55:16,251] {subprocess.py:89} INFO - TASK [show current directory] **************************************************
[2021-12-01 12:55:16,366] {subprocess.py:89} INFO - changed: [localhost]
[2021-12-01 12:55:16,382] {subprocess.py:89} INFO - 
[2021-12-01 12:55:16,382] {subprocess.py:89} INFO - TASK [FSM parsing] *************************************************************
[2021-12-01 12:55:16,416] {subprocess.py:89} INFO - ok: [localhost -> localhost] => {
[2021-12-01 12:55:16,416] {subprocess.py:89} INFO -     "msg": [
[2021-12-01 12:55:16,416] {subprocess.py:89} INFO -         {
[2021-12-01 12:55:16,416] {subprocess.py:89} INFO -             "FreeMemory": "546",
[2021-12-01 12:55:16,416] {subprocess.py:89} INFO -             "Host": "rasputin",
[2021-12-01 12:55:16,416] {subprocess.py:89} INFO -             "OperatingSys": "Debian buster",
[2021-12-01 12:55:16,416] {subprocess.py:89} INFO -             "TotalMemory": "923",
[2021-12-01 12:55:16,416] {subprocess.py:89} INFO -             "ipv4": "192.168.1.10",
[2021-12-01 12:55:16,417] {subprocess.py:89} INFO -             "ipv6": "2800:40:1a:8e9:5f90:7147:bb9f:5e64"
[2021-12-01 12:55:16,417] {subprocess.py:89} INFO -         }
[2021-12-01 12:55:16,417] {subprocess.py:89} INFO -     ]
[2021-12-01 12:55:16,417] {subprocess.py:89} INFO - }
[2021-12-01 12:55:16,432] {subprocess.py:89} INFO - 
[2021-12-01 12:55:16,432] {subprocess.py:89} INFO - TASK [log_to_InfluxDB] *********************************************************
[2021-12-01 12:55:16,733] {subprocess.py:89} INFO - changed: [localhost -> localhost]
[2021-12-01 12:55:16,748] {subprocess.py:89} INFO - 
[2021-12-01 12:55:16,748] {subprocess.py:89} INFO - PLAY RECAP *********************************************************************
[2021-12-01 12:55:16,749] {subprocess.py:89} INFO - localhost                  : ok=5    changed=3    unreachable=0    failed=0    skipped=0    rescued=0    ignored=0
[2021-12-01 12:55:16,749] {subprocess.py:89} INFO - 
[2021-12-01 12:55:16,791] {subprocess.py:93} INFO - Command exited with return code 0
[2021-12-01 12:55:16,801] {taskinstance.py:1270} INFO - Marking task as SUCCESS. dag_id=raspberry_monitor_operator, task_id=log_to_db, execution_date=20211201T155400, start_date=20211201T155514, end_date=20211201T155516
[2021-12-01 12:55:16,847] {local_task_job.py:154} INFO - Task exited with return code 0
[2021-12-01 12:55:16,857] {local_task_job.py:264} INFO - 0 downstream tasks scheduled from follow-on schedule check
