<?xml version="1.0" encoding="UTF-8"?>
<kml xmlns="http://www.opengis.net/kml/2.2" xmlns:gx="http://www.google.com/kml/ext/2.2" xmlns:kml="http://www.opengis.net/kml/2.2" xmlns:atom="http://www.w3.org/2005/Atom">
<Document>
	<name>CoberturaMarcatel.kml</name>
	<StyleMap id="msn_ylw-pushpin">
		<Pair>
			<key>normal</key>
			<styleUrl>#sn_ylw-pushpin</styleUrl>
		</Pair>
		<Pair>
			<key>highlight</key>
			<styleUrl>#sh_ylw-pushpin0</styleUrl>
		</Pair>
	</StyleMap>
	<Style id="s_ylw-pushpin">
		<IconStyle>
			<scale>1.1</scale>
			<Icon>
				<href>http://maps.google.com/mapfiles/kml/pushpin/ylw-pushpin.png</href>
			</Icon>
			<hotSpot x="20" y="2" xunits="pixels" yunits="pixels"/>
		</IconStyle>
		<LabelStyle>
			<color>ff7f55aa</color>
		</LabelStyle>
	</Style>
	<Style id="s_ylw-pushpin_hl">
		<IconStyle>
			<scale>1.3</scale>
			<Icon>
				<href>http://maps.google.com/mapfiles/kml/pushpin/ylw-pushpin.png</href>
			</Icon>
			<hotSpot x="20" y="2" xunits="pixels" yunits="pixels"/>
		</IconStyle>
		<LabelStyle>
			<color>ff7f55aa</color>
		</LabelStyle>
	</Style>
	<Style id="sn_ylw-pushpin">
		<IconStyle>
			<scale>1.1</scale>
			<Icon>
				<href>http://maps.google.com/mapfiles/kml/pushpin/ylw-pushpin.png</href>
			</Icon>
			<hotSpot x="20" y="2" xunits="pixels" yunits="pixels"/>
		</IconStyle>
		<BalloonStyle>
		</BalloonStyle>
		<LineStyle>
			<color>9900ffff</color>
			<width>2.8</width>
		</LineStyle>
	</Style>
	<StyleMap id="msn_ylw-pushpin0">
		<Pair>
			<key>normal</key>
			<styleUrl>#sn_ylw-pushpin1</styleUrl>
		</Pair>
		<Pair>
			<key>highlight</key>
			<styleUrl>#sh_ylw-pushpin</styleUrl>
		</Pair>
	</StyleMap>
	<Style id="sh_ylw-pushpin">
		<IconStyle>
			<scale>1.3</scale>
			<Icon>
				<href>http://maps.google.com/mapfiles/kml/pushpin/ylw-pushpin.png</href>
			</Icon>
			<hotSpot x="20" y="2" xunits="pixels" yunits="pixels"/>
		</IconStyle>
		<BalloonStyle>
		</BalloonStyle>
		<LineStyle>
			<color>ff0055aa</color>
		</LineStyle>
		<PolyStyle>
			<color>997f55aa</color>
		</PolyStyle>
	</Style>
	<Style id="sh_ylw-pushpin0">
		<IconStyle>
			<scale>1.3</scale>
			<Icon>
				<href>http://maps.google.com/mapfiles/kml/pushpin/ylw-pushpin.png</href>
			</Icon>
			<hotSpot x="20" y="2" xunits="pixels" yunits="pixels"/>
		</IconStyle>
		<BalloonStyle>
		</BalloonStyle>
		<LineStyle>
			<color>9900ffff</color>
			<width>2.8</width>
		</LineStyle>
	</Style>
	<Style id="sn_ylw-pushpin0">
		<IconStyle>
			<scale>1.1</scale>
			<Icon>
				<href>http://maps.google.com/mapfiles/kml/pushpin/ylw-pushpin.png</href>
			</Icon>
			<hotSpot x="20" y="2" xunits="pixels" yunits="pixels"/>
		</IconStyle>
		<BalloonStyle>
		</BalloonStyle>
		<LineStyle>
			<color>ff0055aa</color>
		</LineStyle>
		<PolyStyle>
			<color>99ffaaaa</color>
		</PolyStyle>
	</Style>
	<StyleMap id="msn_ylw-pushpin1">
		<Pair>
			<key>normal</key>
			<styleUrl>#sn_ylw-pushpin0</styleUrl>
		</Pair>
		<Pair>
			<key>highlight</key>
			<styleUrl>#sh_ylw-pushpin1</styleUrl>
		</Pair>
	</StyleMap>
	<Style id="sn_ylw-pushpin1">
		<IconStyle>
			<scale>1.1</scale>
			<Icon>
				<href>http://maps.google.com/mapfiles/kml/pushpin/ylw-pushpin.png</href>
			</Icon>
			<hotSpot x="20" y="2" xunits="pixels" yunits="pixels"/>
		</IconStyle>
		<BalloonStyle>
		</BalloonStyle>
		<LineStyle>
			<color>ff0055aa</color>
		</LineStyle>
		<PolyStyle>
			<color>997f55aa</color>
		</PolyStyle>
	</Style>
	<Style id="sh_ylw-pushpin1">
		<IconStyle>
			<scale>1.3</scale>
			<Icon>
				<href>http://maps.google.com/mapfiles/kml/pushpin/ylw-pushpin.png</href>
			</Icon>
			<hotSpot x="20" y="2" xunits="pixels" yunits="pixels"/>
		</IconStyle>
		<BalloonStyle>
		</BalloonStyle>
		<LineStyle>
			<color>ff0055aa</color>
		</LineStyle>
		<PolyStyle>
			<color>99ffaaaa</color>
		</PolyStyle>
	</Style>
	<StyleMap id="m_ylw-pushpin">
		<Pair>
			<key>normal</key>
			<styleUrl>#s_ylw-pushpin</styleUrl>
		</Pair>
		<Pair>
			<key>highlight</key>
			<styleUrl>#s_ylw-pushpin_hl</styleUrl>
		</Pair>
	</StyleMap>
	<Folder>
		<name>CoberturaMarcatel</name>
		<open>1</open>
		<Placemark>
			<name>Ruta FibraOptica GPE A</name>
			<description>Diseño de la ruta de la fibra optica en Guadalupe sector A</description>
			<styleUrl>#msn_ylw-pushpin</styleUrl>
			<LineString>
				<tessellate>1</tessellate>
				<coordinates>
					-100.2585427370712,25.66212121952844,0 -100.2584600216426,25.66224799454455,0 -100.2583457103276,25.66233786983458,0 -100.258263057152,25.66246474752269,0 -100.2581010404245,25.66265226632888,0 -100.2580174178778,25.66277944803671,0 -100.2578892428878,25.66300373888701,0 -100.257802120475,25.66316459897854,0 -100.2576700927232,25.66338967694098,0 -100.2575380182293,25.66361483124061,0 -100.257492044171,25.66371222348387,0 -100.2572869614547,25.66396434862352,0 -100.2570819762383,25.66424989464989,0 -100.2569929065964,25.66441144963353,0 -100.2567453956305,25.66466147605377,0 -100.2567011882753,25.66475893711615,0 -100.2564946155996,25.66497855503376,0 -100.2564513684817,25.66504264633459,0 -100.2563312181907,25.66513415088024,0 -100.2562414875715,25.66529597800327,0 -100.256072915968,25.66551883416028,0 -100.2559862314013,25.66564713910514,0 -100.2558128012972,25.66590381720764,0 -100.2557625180179,25.66603526734094,0 -100.2557590588325,25.66606890471257,0 -100.2556660799172,25.66633189103577,0 -100.2555655603736,25.66652756331658,0 -100.2554237177618,25.66675365696246,0 -100.2552983993383,25.66687887432693,0 -100.2551707235766,25.66703796703893,0 -100.2550387651872,25.66723056229699,0 -100.2549542083583,25.66732530445978,0 -100.2548263873223,25.6674843525687,0 -100.2547426408609,25.66757921131926,0 -100.254667737894,25.66760696526816,0 -100.2545442751624,25.66773252797046,0 -100.2543412266812,25.66791944915884,0 -100.2543366726709,25.66795299452875,0 -100.2541353324928,25.66814028612228,0 -100.2540470997636,25.66826882704095,0 -100.254037699812,25.66833582330763,0 -100.2537701405971,25.66875513336074,0 -100.2535465822583,25.6690758998215,0 -100.2533759293847,25.66929972412074,0 -100.253217579877,25.66945748138271,0 -100.2531311885326,25.66958645064783,0 -100.2530436376861,25.6697152949368,0 -100.2529922124435,25.66984697031393,0 -100.2528235851966,25.67007161651038,0 -100.2526462115873,25.67036341198253,0 -100.2525899828199,25.67056305322505,0 -100.2524654068591,25.67068905348664,0 -100.2523467476958,25.67074736851765,0 -100.2521054042814,25.67089753030531,0 -100.2520216151704,25.67099294384994,0 -100.2518604104372,25.6711162345398,0 -100.2517770550864,25.67121186260454,0 -100.2516157676729,25.67133521983785,0 -100.2515296127467,25.67146489449834,0 -100.2514434474154,25.67159461779831,0 -100.2512073278444,25.67171201695748,0 -100.2511239677467,25.67180785627501,0 -100.2509995156322,25.67193432412745,0 -100.25082963171,25.67212472876384,0 -100.2506758281949,25.67218131248287,0 -100.250589673769,25.67234676922386,0 -100.2504375165491,25.67236880650835,0 -100.2503153634783,25.67246122644082,0 -100.2501629825151,25.67248317145568,0 -100.249972058165,25.67250152974192,0 -100.2498185006786,25.67252290554339,0 -100.249622483985,25.67257414863786,0 -100.2493499464298,25.67261832641099,0 -100.2492699150042,25.67264501297234,0 -100.2490065974954,25.67265859205838,0 -100.2488179711525,25.67267824798732,0 -100.2486702419589,25.67266723652735,0 -100.2484481111466,25.67265046097355,0 -100.2483369157581,25.67264201449401,0 -100.2481395984196,25.67272833057266,0 -100.2479445930633,25.67278013989085,0 -100.2477119106123,25.67282872944322,0 -100.2475630319109,25.67281718242677,0 -100.2474126835296,25.67284080797059,0 -100.2472652546152,25.67283033196274,0 -100.2470417992922,25.672813069589,0 -100.2468885947288,25.67283484754146,0 -100.2467358574511,25.67285698363461,0 -100.2465888763864,25.67284706168368,0 -100.2465475748182,25.6728775922248,0 -100.2462526348526,25.6728572501144,0 -100.2460679209443,25.67284438015283,0 -100.2458090771692,25.6728263459216,0 -100.2455529810011,25.67277402536337,0 -100.2454038020505,25.67276284178795,0 -100.245252967137,25.67275024738462,0 -100.2449518998359,25.67268854702986,0 -100.2447303614738,25.67259973272108,0 -100.2445058036237,25.67254510635177,0 -100.244357690554,25.67249776462868,0 -100.2301178280846,25.66978259218868,0 -100.2302847805284,25.66928303603668,0 -100.2296032388916,25.67101087476717,0 -100.2296966212604,25.67084706606865,0 -100.2295961290759,25.67107880539582,0 -100.2293413876144,25.67167646499876,0 -100.2292257833389,25.67201339662445,0 -100.229176029643,25.67211330252082,0 -100.2290647365984,25.67244756982763,0 -100.2290550472681,25.67254897913789,0 -100.228996580059,25.67274963093913,0 -100.2289889286249,25.67281810243044,0 -100.2289283578592,25.67302040436984,0 -100.2289245278404,25.67305465925322,0 -100.2288222447461,25.67328839076341,0 -100.2287684651504,25.67342298763643,0 -100.2286529862446,25.67376115301671,0 -100.2286484993536,25.6737960241994,0 -100.2285842027276,25.67400186988818,0 -100.2284780113754,25.67423940315339,0 -100.2284601529527,25.67434801428042,0 -100.2283678590348,25.67451160679558,0 -100.2283429019248,25.67471987670798,0 -100.2284461910996,25.67476934867511,0 -100.2286242767018,25.67485738417845,0 -100.2285288602477,25.67499315834363,0 -100.2286042295497,25.67499979125425,0 -100.2287603609692,25.67500801516811,0 -100.2289754760769,25.67513105501094,0 -100.2290804775334,25.67524101376664,0 -100.2293110756513,25.67528674212342,0 -100.2294598769727,25.6753324368887,0 -100.2296086344908,25.67537814116376,0 -100.2297971541564,25.67539460701193,0 -100.2299102939871,25.67540448687323,0 -100.2301766932486,25.67539471196216,0 -100.230254275191,25.67536878896887,0 -100.2304747569114,25.67548535316352,0 -100.2310742680159,25.67600956050494,0 -100.2311429297709,25.67608409250483,0 -100.2313862377918,25.67634030677394,0 -100.2314535200369,25.67644551813219,0 -100.2315915511522,25.67659318770272,0 -100.2319505808129,25.67679773108608,0 -100.2325243672764,25.67715447435812,0 -100.2327117639692,25.67717366766319,0 -100.2328606296637,25.67719155399007,0 -100.2330096427841,25.67720945747789,0 -100.2331960812391,25.6772319521179,0 -100.2335352674,25.67726476101798,0 -100.2336506416853,25.67726970244526,0 -100.2339205712035,25.67722956441956,0 -100.234114732674,25.67720764421041,0 -100.2342805110603,25.67708258298121,0 -100.2344811529425,25.67699329615869,0 -100.2345227051067,25.67696162102774,0 -100.234768355294,25.67680610323574,0 -100.2351348399839,25.67658992262486,0 -100.2352970019334,25.67649858129635,0 -100.2354623533393,25.67637411302515,0 -100.2356244959717,25.67628258762971,0 -100.2357898787387,25.67615764432812,0 -100.2359964567144,25.67600217046058,0 -100.2361723555815,25.67577395311114,0 -100.2365098080729,25.67545597882409,0 -100.2365476099932,25.67545917038741,0 -100.2369019524623,25.67534912245451,0 -100.2373766101455,25.67517713387349,0 -100.2377786411784,25.67497220006706,0 -100.23833529633,25.67474147945709,0 -100.2388877859731,25.67454129693285,0 -100.2396257612466,25.67439538423074,0 -100.2402059307951,25.6743059410316,0 -100.2405116046776,25.67429727722537,0 -100.240895457391,25.67425870193597,0 -100.2412121069516,25.67414945705017,0 -100.2416407345713,25.67404648980469,0 -100.241989580821,25.67396998118226,0 -100.2421889159517,25.67388398763865,0 -100.2424654855675,25.6737278177204,0 -100.2427816798402,25.67361790110854,0 -100.2429777121663,25.67356629638111,0 -100.243097860028,25.67350779115154,0 -100.2431794605531,25.67344506163494,0 -100.243420622911,25.67329086103706,0 -100.2436179710072,25.67320272618041,0 -100.2438440354007,25.67322128729624,0 -100.2438847903654,25.67319000929725,0 -100.2440046855964,25.67264200192132,0 -100.2440478725157,25.67257597520376,0 -100.2441746126384,25.67241263541508,0 -100.2442826478748,25.67207875612823,0 -100.2441208855339,25.67216690427769,0 -100.2439291019289,25.67218483077712,0 -100.2437314915143,25.6722714948236,0 -100.2435747800363,25.67232732204431,0 -100.2433395596165,25.67241096507425,0 -100.2430637947832,25.67252602757291,0 -100.2427106659108,25.67267064325515,0 -100.2424384420461,25.672752538071,0 -100.2422785628223,25.67284319963386,0 -100.2420873667116,25.67286220834464,0 -100.2418921223074,25.67291420250487,0 -100.2417760558608,25.67293925740137,0 -100.2414686700684,25.67298330775116,0 -100.2411523211816,25.67313212663304,0 -100.2410362013972,25.6731574102114,0 -100.2408414504299,25.67321082014247,0 -100.2407251920007,25.67323592501599,0 -100.2405271825281,25.67332403190577,0 -100.2404203731402,25.67324506596208,0 -100.2401653669126,25.67311675745268,0 -100.2400171333342,25.67306706627976,0 -100.2397149313794,25.67303808480219,0 -100.2395262426466,25.67301998827898,0 -100.2392255194513,25.67299519436343,0 -100.2391093373666,25.67301991694604,0 -100.2389555415861,25.67304143636438,0 -100.238726569325,25.67305692071112,0 -100.2385762227224,25.67304477550501,0 -100.2383130896256,25.67302351779413,0 -100.2380875201763,25.67300529472993,0 -100.2378995261372,25.67299010594427,0 -100.2378619239659,25.67298706931613,0 -100.2375815967803,25.67313274685364,0 -100.2374173472215,25.67325830201045,0 -100.237106196688,25.67333520001183,0 -100.2369661502308,25.67322059148974,0 -100.2370517532507,25.67312473344698,0 -100.2372191714865,25.67296962180946,0 -100.2373047155117,25.6728735852174,0 -100.2374417131069,25.67264371090888,0 -100.2375786200032,25.6724142013143,0 -100.2377188875468,25.67215040586421,0 -100.2377805014488,25.67191619876413,0 -100.2378762309052,25.67171849517535,0 -100.237889958279,25.67158261470759,0 -100.2379515123533,25.67134768683806,0 -100.2379618059166,25.67124602720936,0 -100.237992655408,25.67094038142486,0 -100.238006353023,25.67080436480074,0 -100.2380234638282,25.67063434981823,0 -100.2380474347266,25.67039659007477,0 -100.2380986675515,25.67026445467435,0 -100.238102098677,25.67023068169014,0 -100.2379724151967,25.67039068707683,0 -100.2378461260327,25.67051756308356,0 -100.2378051676964,25.67054859547036,0 -100.2372898011402,25.67077936498529,0 -100.2368524447388,25.67098431398383,0 -100.2365824231827,25.67103151959441,0 -100.236302212774,25.67117946632323,0 -100.2360285024218,25.67126063341675,0 -100.2358306611188,25.67134586519274,0 -100.2355497273426,25.67149527515929,0 -100.235264781634,25.67167947063222,0 -100.2351788821181,25.67177572185321,0 -100.2350178124178,25.6718656750471,0 -100.2349590645101,25.67206692839964,0 -100.2348862298772,25.6724044432621,0 -100.2348173481674,25.67270709126601,0 -100.2347964779846,25.67291104608915,0 -100.2346797251029,25.67293653209121,0 -100.2344160089711,25.67291532191625,0 -100.2342280741212,25.67289931700516,0 -100.234001270161,25.67288238896315,0 -100.2337373745944,25.67286126587177,0 -100.2334736965695,25.67283974784485,0 -100.2333642214394,25.67279645075088,0 -100.2330631092557,25.67277147288621,0 -100.233025472507,25.67276835074554,0 -100.232837226734,25.67275278869363,0 -100.2325357243709,25.67272831340767,0 -100.2323849590812,25.67271607472345,0 -100.232001559614,25.67275287698205,0 -100.2318882815021,25.6727439194805,0 -100.231736178336,25.67273304594201,0 -100.231396040172,25.67267580004896,0 -100.2312844338925,25.67263449112534,0 -100.2310959338558,25.67261892939419,0 -100.2308331348704,25.67259613075879,0 -100.2306037650915,25.67261121461731,0 -100.2302591267832,25.67261882760656,0 -100.2301458482533,25.67260963305875,0 -100.2299570405644,25.67259430612432,0 -100.2296928748056,25.67257271129911,0 -100.2294670967275,25.67255378312612,0 -100.2293136317445,25.67254324041228,0 -100.2291678914318,25.67252701313202,0 -100.2289833123725,25.67250873564518,0 -100.2288391031119,25.6724286063916,0 -100.2286544973015,25.67237891659913,0 -100.2284348960108,25.67229269918501,0 -100.2283971065602,25.67228963120391,0 -100.2276282588022,25.67239603047772,0 -100.2272462207801,25.67236804048667,0 -100.2270308253916,25.67227919352395,0 -100.2268102456911,25.67216138282025,0 -100.2265852720745,25.67210990375205,0 -100.2264339853175,25.67209770625977,0 -100.2261396975037,25.67200464938035,0 -100.2257687968015,25.67190602034555,0 -100.2252811816468,25.67183198585356,0 -100.2247259034257,25.6717158974231,0 -100.2246508085353,25.67170955419531,0 -100.2241956120271,25.67170594693141,0 -100.2236994288895,25.67166789034953,0 -100.2233534209593,25.67164236539974,0 -100.2228288682641,25.67159755327197,0 -100.2226395864896,25.67158210119105,0 -100.2226019232853,25.67157896427682,0 -100.2224473455904,25.67156782998428,0 -100.2221799357407,25.67154716014254,0 -100.2219539562934,25.67152832207443,0 -100.2215773488104,25.6714969329713,0 -100.2211289373092,25.67145816540894,0 -100.2209012653334,25.67143987440665,0 -100.2205242906811,25.67140865933017,0 -100.2202566076444,25.67138791289609,0 -100.2200215981107,25.6714048258328,0 -100.219869386231,25.67142564985613,0 -100.2197178747837,25.6714133464145,0 -100.2195663519499,25.67140103939096,0 -100.2190389264047,25.67132405756064,0 -100.2185847949156,25.671286983407,0 -100.218247369551,25.67122518629917,0 -100.2180315197491,25.67117066291522,0 -100.2175468068233,25.67109560463337,0 -100.2174968614046,25.67116177518741,0 -100.2173746537437,25.67122093101232,0 -100.2170859050343,25.67143726161236,0 -100.2170071228182,25.67146499958364,0 -100.2167258342444,25.67161318820149,0 -100.2165113109471,25.67176992124271,0 -100.2162323395134,25.67181811049419,0 -100.2161808134931,25.67191799664929,0 -100.2160450564541,25.67208024607091,0 -100.215956005191,25.67217701008401,0 -100.215821430382,25.67233906881752,0 -100.2158135782986,25.67240743416218,0 -100.223082989359,25.67103299965889,0 -100.2231181351635,25.67075890056552,0 -100.2231497187873,25.67048613682742,0 -100.2232522601793,25.67022086724693,0 -100.2233055638948,25.66977759163409,0 -100.2233306679625,25.66957295093825,0 -100.2233910341046,25.66937208431522,0 -100.2234613050431,25.66910290297528,0 -100.2234915996069,25.66883123191348,0 -100.2235191556531,25.66859339790287,0 -100.2235534141938,25.66832134183245,0 -100.2235721677283,25.66818517232969,0 -100.2235583489557,25.66797855296894,0 -100.2235870068704,25.66774114430832,0 -100.2236115578807,25.66753777252138,0 -100.2236232345248,25.66740258607296,0 -100.2236253749112,25.66736885494405,0 -100.2204027445809,25.67081298072955,0 -100.2204236926324,25.67064223281902,0 -100.2204122183883,25.67040075472124,0 -100.2204081210561,25.67009135921597,0 -100.2203921819607,25.6699174678252,0 -100.2204106408629,25.66978069719534,0 -100.2204468507852,25.66950756503904,0 -100.2204721504426,25.66930316857672,0 -100.2205363383182,25.66910178265577,0 -100.2205666944534,25.66886349303038,0 -100.2206248922188,25.66869664041959,0 -100.2207341607593,25.66839747544456,0 -100.2207981862337,25.6681631446799,0 -100.2208993042992,25.66793203071543,0 -100.2210419849437,25.66767015064607,0 -100.2210874460083,25.66760541502255,0 -100.2211630654757,25.66730329024409,0 -100.2212256723436,25.66710304154981,0 -100.2212994164665,25.66680143185782,0 -100.221321086058,25.66666584128347,0 -100.2213442673637,25.66653036701678,0 -100.2213489488935,25.66649655167349,0 -100.2300804495521,25.66977940831488,0 -100.2299905455028,25.66990908436607,0 -100.2299265471338,25.67014412095475,0 -100.2299227328847,25.67017817211852,0 -100.2442236638855,25.67227809099036,0 -100.2441244143535,25.67213313548507,0 -100.2440901571749,25.67209607632901,0 -100.2440699345083,25.6718868982402,0 -100.2440114599223,25.67171105060452,0 -100.2439829122353,25.67160532192456,0 -100.2439606247998,25.67143147166645,0 -100.243973162128,25.67129522002072,0 -100.2439919593183,25.67109094025863,0 -100.2440138753172,25.67085276143629,0 -100.2440360498729,25.67061493687363,0 -100.2440489389096,25.67047925114931,0 -100.2582594492752,25.66199562237389,0 -100.2580322805105,25.66187996452127,0 -100.2579521100589,25.66177703408256,0 -100.2578286069456,25.66169387031042,0 -100.2577574059739,25.66162171242232,0 -100.2575686127502,25.66154190647619,0 -100.2573059127718,25.66142348026521,0 -100.2572674489239,25.66142076794139,0 -100.2570795335561,25.66137359277886,0 -100.2567079538097,25.66127833512852,0 -100.2564186876071,25.6612520490996,0 -100.2559926745786,25.66115870761948,0 -100.2554372727169,25.66111309578336,0 -100.2553612215335,25.66110762749014,0 -100.2551413646649,25.66105632858353,0 -100.2552277512563,25.6608970847894,0 -100.2552673655922,25.66086702650173,0 -100.2550811997984,25.66085217874998,0 -100.2547906479258,25.66076161949356,0 -100.2545378975435,25.66067386780258,0 -100.2543831939859,25.66072835049274,0 -100.25403727105,25.66080189045534,0 -100.2536888260963,25.66087631937335,0 -100.2534921111852,25.66096162577302,0 -100.2534084137964,25.66105533272827,0 -100.2532166117987,25.66113901199845,0 -100.2530256745818,25.66125467915483,0 -100.2528708065269,25.66134136783674,0 -100.2528243077733,25.6614381548648,0 -100.2526682030444,25.66152534823357,0 -100.2524745240828,25.661609683455,0 -100.2523183342235,25.66169692220648,0 -100.2520086347991,25.66187058426649,0 -100.2519254966195,25.66199662129124,0 -100.2517358031937,25.66207982878097,0 -100.2516909779408,25.66217625505188,0 -100.2514213171845,25.66228755924724,0 -100.2512610635014,25.66244097718081,0 -100.2511795875506,25.66253431707013,0 -100.2509454498771,25.66268167538636,0 -100.250791767207,25.66273591740591,0 -100.2506409601738,25.66275685897644,0 -100.2504840563325,25.66284450509026,0 -100.2503331933426,25.66286546064137,0 -100.2501748531092,25.66295349608357,0 -100.2500581542333,25.66301084647407,0 -100.2498985680327,25.66313180272188,0 -100.2497014069466,25.66324984186289,0 -100.2495412838119,25.66337098903348,0 -100.2494612021303,25.66343157921069,0 -100.2493068800093,25.66348604266603,0 -100.2489088348041,25.6636904463432,0 -100.2486781187885,25.66377195463037,0 -100.248477972722,25.66389076074487,0 -100.2482428308149,25.66403881569257,0 -100.2480841459063,25.66415979520815,0 -100.2479310727686,25.66421406687708,0 -100.2478177900411,25.66423804281841,0 -100.2295651072369,25.65971902599004,0 -100.2472614497023,25.66422455412409,0 -100.2470414254142,25.66417266223604,0 -100.2468583428023,25.66412392233752,0 -100.2467130948335,25.66407807114109,0 -100.2466080591859,25.66400185607372,0 -100.2463910168755,25.66391657795042,0 -100.2461325886256,25.66386197021935,0 -100.2459148638922,25.66377693404376,0 -100.2456603464239,25.66368875491289,0 -100.2452967088017,25.6635582574551,0 -100.2448939915496,25.66345775331515,0 -100.244856914406,25.66345464001963,0 -100.2446031085937,25.66336633993381,0 -100.2443795876276,25.66334815842089,0 -100.2439691988944,25.66331515349987,0 -100.2438204663204,25.66330293469505,0 -100.2434492447825,25.66327208029698,0 -100.2433374468597,25.66326304795161,0 -100.2430382387782,25.66323961130992,0 -100.2430010301528,25.66323657997262,0 -100.2428179828651,25.66318819854498,0 -100.2425978809699,25.66313674363546,0 -100.2424184165141,25.66305486278398,0 -100.2423070968407,25.66304561009876,0 -100.2420906275621,25.66296062093669,0 -100.2419082188857,25.66291195747883,0 -100.2416576266015,25.66279086402135,0 -100.2415462525381,25.66278167357928,0 -100.2413263645363,25.6627303615273,0 -100.2411466908419,25.66264905815567,0 -100.2409640944814,25.66260080437397,0 -100.2408965423941,25.66252794917323,0 -100.2404847655457,25.66252801625396,0 -100.2401543716477,25.66246679223638,0 -100.2398980329806,25.66241189936288,0 -100.2397192174067,25.6623298424879,0 -100.2393920192452,25.66223548203855,0 -100.2392164875876,25.66212039609885,0 -100.2389970978414,25.66206924073863,0 -100.2387777246257,25.66201819217774,0 -100.2385921868868,25.66200337088915,0 -100.2383697184751,25.66198463898517,0 -100.2383326395373,25.66198149969809,0 -100.2381168857778,25.66189618245309,0 -100.2379011342872,25.6618107843013,0 -100.2377561458511,25.66176469450498,0 -100.2376077244034,25.6617517482467,0 -100.23753692861,25.66171250017289,0 -100.2373245851639,25.66159484599974,0 -100.2370683232715,25.66153986321853,0 -100.2369199005944,25.6615273425882,0 -100.2366972573801,25.66150859584263,0 -100.2365151238244,25.66145977330601,0 -100.2362927926712,25.66144225031372,0 -100.2361480706531,25.66139741381977,0 -100.2360369422449,25.66138862917692,0 -100.2358142482627,25.66136986209182,0 -100.2355584565851,25.66131595223697,0 -100.2353770926907,25.66126857204618,0 -100.2350874110558,25.66117751624198,0 -100.2349428885493,25.66113242401732,0 -100.2348314229008,25.66112288318736,0 -100.2345386839342,25.66106573353787,0 -100.2343195946994,25.66101379394965,0 -100.2343622943694,25.66131917399244,0 -100.2343387917731,25.66151534411903,0 -100.2342734771929,25.66177843103096,0 -100.2342925043226,25.66194733733786,0 -100.2342783281854,25.662080529991,0 -100.2342646500778,25.66221436566357,0 -100.2342724931819,25.66248282473159,0 -100.2342687340907,25.6625159295841,0 -100.2342398510698,25.66278221389938,0 -100.2341846043962,25.66294572603885,0 -100.2341261853687,25.66314306868349,0 -100.2341157308674,25.66324343155196,0 -100.2341052723608,25.66334380576498,0 -100.2340003759525,25.66360366035777,0 -100.233990791014,25.66370476993169,0 -100.233927689832,25.6639352376596,0 -100.2339098305358,25.66410270517634,0 -100.2339063306652,25.66413622072802,0 -100.2338044192606,25.66436340047802,0 -100.2337517496841,25.66449407157208,0 -100.2337409605047,25.66459472024446,0 -100.2336015751029,25.6648544908454,0 -100.2335201011179,25.66491553479833,0 -100.2334943777221,25.66515034946065,0 -100.2334350610388,25.66534887308953,0 -100.2333127451478,25.66577987402053,0 -100.2332765545233,25.66611658597942,0 -100.2332512104382,25.66635250093954,0 -100.2332399627377,25.6664536500938,0 -100.2332147409861,25.6666897223461,0 -100.2331954866216,25.66685858471171,0 -100.2331361678221,25.66705815533814,0 -100.2331104826686,25.66729473847067,0 -100.2330853375074,25.6675313263883,0 -100.2330645678189,25.6677339699624,0 -100.2329858524058,25.66776166424648,0 -100.2328974972694,25.66789045814148,0 -100.2327868051539,25.66819008545425,0 -100.2327692573441,25.6683592351886,0 -100.2327132234443,25.66852580007742,0 -100.2327008588877,25.66862818924268,0 -100.2327604600671,25.66877054042447,0 -100.2327790165999,25.66894381255787,0 -100.2327755229007,25.66897769187475,0 -100.2340978027515,25.66099630915066,0 -100.233956354018,25.66091731762346,0 -100.2337777995034,25.66083522892298,0 -100.2335694128587,25.66068382763048,0 -100.2333922452718,25.66060343876446,0 -100.2331381319128,25.66055085529898,0 -100.232856016245,25.66039365198048,0 -100.2327079225696,25.6603814505132,0 -100.2326338771039,25.66037534848031,0 -100.2323428134714,25.6603193547208,0 -100.2323054522115,25.66031592535412,0 -100.232008178553,25.6602903889783,0 -100.2318971050998,25.66028122737527,0 -100.2317493710837,25.66026935603316,0 -100.2314597778576,25.66017806808783,0 -100.2312751253126,25.66016320466324,0 -100.2311331402146,25.6600836474003,0 -100.2310256677371,25.66004141185065,0 -100.230773463953,25.65995341514125,0 -100.2304807290175,25.65989566373093,0 -100.2302956313451,25.65988039928838,0 -100.2301841691772,25.65987090419794,0 -100.2299986305079,25.65985525456411,0 -100.2297874115472,25.65973748055818,0 -100.2286770019511,25.65934767562502,0 -100.2289819561702,25.65960522596172,0 -100.2288329503013,25.65959234666423,0 -100.2285413211847,25.65953534497872,0 -100.2283564905599,25.65952022369521,0 -100.2282511604513,25.65947932919165,0 -100.2279585185776,25.65942155228446,0 -100.2278931368556,25.65935004385424,0 -100.22767601083,25.65929942780453,0 -100.2273854661454,25.65924300302908,0 -100.2272382644599,25.65923125608992,0 -100.227164538928,25.6592253257149,0 -100.2269052504207,25.65920371635202,0 -100.226572708324,25.65917642994315,0 -100.2263879672837,25.65916126948059,0 -100.2260554486431,25.65913398259627,0 -100.2258345098254,25.65911622242096,0 -100.2256885596939,25.65910513513799,0 -100.2255763285356,25.659095241265,0 -100.2255456101202,25.65935957081561,0 -100.2255443686176,25.65965853516494,0 -100.2255320217499,25.65975743604542,0 -100.2254928316874,25.66005327289214,0 -100.2254712948585,25.66021795046517,0 -100.2254341235302,25.66048038824745,0 -100.2254148046088,25.66064642446394,0 -100.2253948408457,25.66081219496591,0 -100.2253741621749,25.66097780784978,0 -100.2253165404442,25.66114056791258,0 -100.2253080468069,25.66120676943488,0 -100.2252705164858,25.66147050933836,0 -100.2252567031477,25.66160433563085,0 -100.2252295754582,25.66180290638365,0 -100.225194743677,25.66206838718429,0 -100.225177881108,25.6622014423852,0 -100.2251280670887,25.66229822546632,0 -100.2250985080792,25.66253132574224,0 -100.2249739609818,25.66292544960022,0 -100.2249455654322,25.6631594121745,0 -100.2249127773065,25.66342688219108,0 -100.2248384072034,25.66372503074999,0 -100.2247353686664,25.66422396856506,0 -100.2246157073929,25.66458712676075,0 -100.2245912969991,25.66478878476247,0 -100.2245607531892,25.66502393415189,0 -100.2245126682893,25.66539401230819,0 -100.224493056467,25.66556254340382,0 -100.2244617882094,25.66583235112834,0 -100.2244383820148,25.66603474960345,0 -100.2244305777688,25.66610223572581,0 -100.2244104233009,25.66627100952932,0 -100.2243709292029,25.6665750921032,0 -100.2243477010671,25.66674427102614,0 -100.2242485946203,25.66697460497065,0 -100.2242078752241,25.66724596265153,0 -100.2241965562515,25.6673139991224,0 -100.2241236647704,25.66761595953409,0 -100.225913068627,25.65879095456085,0 -100.2255509748599,25.65872952451583,0 -100.2254065737008,25.65868397102541,0 -100.2251098753137,25.65865911679224,0 -100.2249647079963,25.65861301548663,0 -100.2246690238391,25.65858865953796,0 -100.2243764381393,25.65853066207488,0 -100.2240569968883,25.65836978260864,0 -100.223806826235,25.65831799563506,0 -100.2235438989249,25.6582590669577,0 -100.2233945484534,25.65824604719672,0 -100.2232487491009,25.65823495403467,0 -100.2228840193257,25.65820700732824,0 -100.2227732434159,25.65819799265167,0 -100.2225211199591,25.65814511008516,0 -100.2223012048842,25.65812746363595,0 -100.2222281673946,25.65812179572569,0 -100.2219497275232,25.65796616989415,0 -100.2216693335903,25.65791448585611,0 -100.2213164189547,25.6578222217541,0 -100.2210937107021,25.65776832569641,0 -100.2207681815559,25.65770919226243,0 -100.2205546263335,25.65765984256497,0 -100.220331986473,25.65764079281782,0 -100.2199886410807,25.65760784095499,0 -100.2199203024679,25.65756950477849,0 -100.2196686341872,25.65751646818841,0 -100.2194888728965,25.65746861655826,0 -100.2193137609688,25.65738813716782,0 -100.2191422911601,25.65727461965872,0 -100.2189631373605,25.65722697909744,0 -100.2188249835475,25.65714958800308,0 -100.2187151867728,25.65714082305749,0 -100.2218404887687,25.66626329582256,0 -100.2218979388271,25.66609760095863,0 -100.2219478580244,25.66599945789046,0 -100.2220594602944,25.66573590209482,0 -100.2221247439583,25.66553690899335,0 -100.2222294860197,25.66530743451779,0 -100.2223611581702,25.66487656469041,0 -100.2224525532389,25.66444288107579,0 -100.2225102426536,25.6642780688852,0 -100.222576002086,25.66408022391189,0 -100.2226052750154,25.66384561474471,0 -100.2226293335927,25.66364464862074,0 -100.222649334637,25.66347718192615,0 -100.2226354477248,25.66327316161556,0 -100.222648229776,25.66317269407542,0 -100.2226649002394,25.66303905304121,0 -100.2226915019791,25.66283874495004,0 -100.2227089439743,25.6624018526702,0 -100.2227271279905,25.66223446229275,0 -100.2227657994361,25.66196922216503,0 -100.2227987561641,25.66173724760516,0 -100.2228156485685,25.66160426396085,0 -100.2228434707724,25.66140571089798,0 -100.2228584934052,25.66127241798561,0 -100.2228900814655,25.66104068588939,0 -100.2229203664943,25.66080879673432,0 -100.2229387262526,25.66067679216131,0 -100.2230576290335,25.66001699159288,0 -100.2231225481665,25.65978805085814,0 -100.2232101731887,25.65942999130065,0 -100.2232686229205,25.65923342477025,0 -100.2233835466789,25.65894449900732,0 -100.223405976659,25.65874542618024,0 -100.2234689686986,25.65855149666083,0 -100.2234915248962,25.65838818924555,0 -100.2235271780642,25.65809146107121,0 -100.2235541681656,25.65789558470936,0 -100.2234529105249,25.65782150647745,0 -100.2234291862955,25.65798398031579,0 -100.2234085291054,25.658148296905,0 -100.2233852257608,25.65831124436694,0 -100.2233945484534,25.65824604719672,0 -100.2234172477034,25.65808278631524,0 -100.2234250325511,25.65801678258703,0 -100.2440675726498,25.67323702074638,0 -100.2295906456096,25.65982121488544,0 -100.229579636148,25.65992065799915,0 -100.2294150934749,25.66003973972291,0 -100.2293036070221,25.66003031110313,0 -100.2292914876174,25.66012905663034,0 -100.2291891041511,25.66035359430828,0 -100.2290987524589,25.66047937267949,0 -100.2290010431952,25.66067174153846,0 -100.2289461632668,25.66083532429336,0 -100.2289315995727,25.66096846141937,0 -100.2288752224362,25.66113133209864,0 -100.2288480569224,25.66136357727594,0 -100.2288320310749,25.66149612765258,0 -100.2287372493929,25.66165557694519,0 -100.2285608908631,25.66187584687828,0 -100.2284243821254,25.66206552615147,0 -100.2282137021873,25.66224950818586,0 -100.2280458544602,25.66240402414171,0 -100.2280319286247,25.66250320990213,0 -100.2279302291144,25.6626959162985,0 -100.227801489717,25.66281983909501,0 -100.2276697761447,25.66297758385103,0 -100.2275097869263,25.6630658674039,0 -100.2273824075921,25.66319044899004,0 -100.2272184118741,25.66331219956864,0 -100.2270820408785,25.66350354938153,0 -100.2269911311091,25.66363123621667,0 -100.2269459304626,25.66369515576905,0 -100.2267358328342,25.66388085093052,0 -100.226646101591,25.66400900238284,0 -100.2264774291011,25.66416448354728,0 -100.2264300607986,25.66426243315694,0 -100.2264208488841,25.66436340149223,0 -100.2263325729146,25.66445773604526,0 -100.226098954144,25.66481132605094,0 -100.225930695069,25.66496720342205,0 -100.2258077878037,25.66505896359313,0 -100.2254366506198,25.66526621924504,0 -100.2251933466003,25.66541618306511,0 -100.2250736313222,25.6654743454673,0 -100.2248622395187,25.66566099927879,0 -100.2248088005067,25.66579274504764,0 -100.224664035598,25.66605323902433,0 -100.2246480170176,25.66618824310429,0 -100.2245809491554,25.66642153032722,0 -100.2245636445768,25.66655669372157,0 -100.224546327906,25.66669193372417,0 -100.2244913585878,25.66682422764565,0 -100.224468717407,25.66702706355743,0 -100.2244472733077,25.66719637188178,0 -100.224404801949,25.66746830816889,0 -100.2243538124263,25.66760057600873,0 -100.2243511068981,25.66763434973645,0 -100.247502881073,25.66444688173327,0 -100.2473427488018,25.66456846415155,0 -100.2470621891414,25.66474820386308,0 -100.2469405860977,25.6648396029864,0 -100.2467816024417,25.66492796122318,0 -100.2465387615333,25.66511072795043,0 -100.2464209790203,25.66516855132173,0 -100.2462690804332,25.66518977865353,0 -100.2461076726607,25.66531161372898,0 -100.2460673411719,25.6653420740172,0 -100.2458623731957,25.66552796964778,0 -100.2457412147475,25.66561941250609,0 -100.2456200304839,25.66571087501612,0 -100.2454961871755,25.6658358997786,0 -100.2453415760542,25.66589073227211,0 -100.2451806635682,25.66601275893882,0 -100.2449888083605,25.66606456863022,0 -100.2449057507743,25.66615922553151,0 -100.2447486064674,25.6662477821427,0 -100.2445931850992,25.66630274270958,0 -100.2444316453261,25.66642499661396,0 -100.2442359520983,25.66651057891413,0 -100.2441985824902,25.66650750155327,0 -100.2440777539949,25.66659928126724,0 -100.243844834677,25.66668187132688,0 -100.2436840899658,25.66680441860321,0 -100.2435658554086,25.6668625962431,0 -100.2433633442197,25.66701576851079,0 -100.2432447953997,25.66707396089263,0 -100.2431225540692,25.66716580030215,0 -100.2429188009821,25.66731887866291,0 -100.2428372618923,25.66738009657659,0 -100.2426333699401,25.66753317036726,0 -100.242466881935,25.6676893314408,0 -100.2422323166219,25.66777192229738,0 -100.2420691850874,25.6678943904663,0 -100.2419876991511,25.6679556613379,0 -100.2418205710901,25.66811156186101,0 -100.2417334234457,25.668240815728,0 -100.2416455024905,25.66836975155397,0 -100.2415233559204,25.66846180442723,0 -100.2414011884519,25.66855387493545,0 -100.2412041128765,25.66863975285734,0 -100.241081865738,25.66873182805478,0 -100.2409596036305,25.66882391520038,0 -100.2408345874472,25.66895035631068,0 -100.2407157831084,25.66900886938721,0 -100.2405969533417,25.66906739477797,0 -100.2403592127859,25.66918448487087,0 -100.2400839347496,25.6692985764038,0 -100.2399308657262,25.66932023929028,0 -100.2397744052605,25.66937574679376,0 -100.2396962044037,25.66940357621538,0 -100.2394989460045,25.66949005582984,0 -100.2393051801162,25.66954316740196,0 -100.2391178041624,25.66952784065949,0 -100.2389270665691,25.6695464594816,0 -100.2387737464887,25.66956827527236,0 -100.2385488176284,25.669549723877,0 -100.2383988251831,25.66953721205276,0 -100.2382146480903,25.66948680445931,0 -100.2380646893522,25.66947407062886,0 -100.2378398398257,25.66945531520143,0 -100.2376524763918,25.66944044746933,0 -100.2374276039212,25.66942201959276,0 -100.2372741476763,25.66944411327794,0 -100.2371138366002,25.66953349153252,0 -100.2368032688223,25.66961128515094,0 -100.2367622851465,25.66964213888143,0 -100.2365372401141,25.66962356690483,0 -100.2361621294741,25.66959269407168,0 -100.2360531497487,25.66954953557056,0 -100.23579752236,25.6694601740653,0 -100.2355418081413,25.66937105719644,0 -100.2352553878333,25.66921123405166,0 -100.2351016102099,25.66923301347567,0 -100.2349515134774,25.66922075718076,0 -100.2344993332584,25.66918542166029,0 -100.2340485192134,25.66914860900021,0 -100.2337852602284,25.66912731340068,0 -100.2337028527055,25.66918906561983,0 -100.2335964539363,25.66911254582051,0 -100.2333047776219,25.6689873000195,0 -100.2330828331633,25.66893481927855,0 -100.2328951002652,25.66891925315705,0 -100.232588626972,25.66896171919994,0 -100.232204518228,25.66903138973257,0 -100.2319428386636,25.6690091704302,0 -100.2319054623247,25.66900599785314,0 -100.2316808387488,25.66898715636875,0 -100.2314890618941,25.66900577601366,0 -100.2312995479837,25.668991076613,0 -100.2311099274154,25.6689763686302,0 -100.2309975636117,25.66896694370228,0 -100.230809277488,25.66895167218448,0 -100.2305884929842,25.66889882069852,0 -100.2302980311,25.66880529485523,0 -100.2301487632224,25.66879260790856,0 -100.2299207644747,25.66880764411962,0 -100.2296962106615,25.66878886918254,0 -100.2293591454887,25.66876081688998,0 -100.2291704052789,25.66874565231818,0 -100.228904202443,25.66872497236571,0 -100.2287871425217,25.66874982003612,0 -100.228641705774,25.66870323637609,0 -100.2283957628762,25.66854544840403,0 -100.2282150261574,25.66846236255391,0 -100.2280329193788,25.66834648535487,0 -100.2278450980562,25.66829782661922,0 -100.2276936138532,25.6682856956751,0 -100.2274002742017,25.66819314630706,0 -100.2270665862567,25.66816452850406,0 -100.2268460281579,25.66811186413192,0 -100.226733325065,25.66810252454477,0 -100.2264684554315,25.66808118500058,0 -100.226392760326,25.66807508808883,0 -100.2261277644428,25.66805373613524,0 -100.225828520777,25.66799543860595,0 -100.2256412720902,25.66797986327859,0 -100.2254270687804,25.66789297035075,0 -100.2251368827242,25.66783347901132,0 -100.224952780968,25.66775074430503,0 -100.2247251930997,25.66773242723488,0 -100.224497526475,25.66771410271451,0 -100.2243863636115,25.66767117531821,0 -100.2242345055755,25.66765894805792,0 -100.2240106428484,25.66760669115021,0 -100.2238641923242,25.66759400092702,0 -100.2237548063254,25.66758437271497,0 -100.2236560499346,25.6674731668578,0 -100.2232579005776,25.66723651154983,0 -100.2231505820184,25.66719327095456,0 -100.2230757235684,25.66718705722451,0 -100.2227848130881,25.66709430909355,0 -100.2225984661243,25.66707885699235,0 -100.2224133302567,25.66702970467076,0 -100.2223383994152,25.6670234168458,0 -100.2221499290032,25.66700793729569,0 -100.2219619352275,25.66699245622681,0 -100.2217741475424,25.66697694437427,0 -100.2216230638674,25.66696471657052,0 -100.2214832247057,25.66685084047818,0 -100.2212398070564,25.6666935482573,0 -100.2210679508784,25.66657643781947,0 -100.2207556885865,25.66661942065841,0 -100.220259839376,25.66664681234522,0 -100.2197763355365,25.66660642612856,0 -100.2197391276761,25.66660333283077,0 -100.2194378051076,25.66657857294889,0 -100.2192125884282,25.66656007607493,0 -100.2189902735299,25.66654136585846,0 -100.2187255196295,25.6665197180784,0 -100.2185382885442,25.66650421535905,0 -100.218275622117,25.66648255501861,0 -100.2181596997092,25.66647330336522,0 -100.2179664048052,25.6664578776102,0 -100.2175189306722,25.66635301994934,0 -100.217367009196,25.66634060785231,0 -100.2171848449542,25.66622360599296,0 -100.2169730783994,25.66606960420956,0 -100.216897634186,25.66606339801992,0 
				</coordinates>
			</LineString>
		</Placemark>
		<Placemark>
			<name>PMarcatel - 1</name>
			<description>Marcatel
Precio:$30.00
</description>
			<styleUrl>#msn_ylw-pushpin1</styleUrl>
			<Polygon>
				<tessellate>1</tessellate>
				<outerBoundaryIs>
					<LinearRing>
						<coordinates>
							-100.2599570068072,25.66258120248426,0 -100.2596358497465,25.6623313038796,0 -100.2595080206645,25.66213194995823,0 -100.2594022396855,25.66188441620024,0 -100.259234416947,25.6616887936356,0 -100.2590432220488,25.66153993237824,0 -100.2588097988077,25.66129260958475,0 -100.2586236084074,25.66114857779291,0 -100.2584396088552,25.66100657947976,0 -100.2581360152758,25.66070183230527,0 -100.2579182291623,25.66049676486338,0 -100.2576342408967,25.66014269505376,0 -100.2574839890104,25.65999185218819,0 -100.2572496611476,25.65974303858213,0 -100.2570392185326,25.65954533466468,0 -100.2569341899846,25.6593995070659,0 -100.2568118154422,25.65930366462394,0 -100.2565548636271,25.65891229975016,0 -100.2564384397695,25.65884797253815,0 -100.2561833126007,25.65857718512655,0 -100.2560238990449,25.65848299221193,0 -100.2557094963346,25.65821559507777,0 -100.2554098254322,25.65807053062592,0 -100.2551019673646,25.65795753079615,0 -100.2548501702652,25.65788739404489,0 -100.2546236083659,25.65777712916865,0 -100.2544043413851,25.65767445442791,0 -100.2542692094715,25.65760368355113,0 -100.2540044992075,25.65749253047293,0 -100.2538208163665,25.65740977942995,0 -100.2535626740313,25.65723627266562,0 -100.2532636846437,25.6572207601217,0 -100.2529242026174,25.65727337299158,0 -100.2526954166278,25.65727572010767,0 -100.2524455531541,25.65725218634463,0 -100.2523626614672,25.65724467185998,0 -100.2521193720491,25.65722843570408,0 -100.2519447444218,25.65717711360578,0 -100.2516880886595,25.65699616591971,0 -100.2515358703332,25.65677759509445,0 -100.2514505871876,25.6565244386524,0 -100.2513629679507,25.65636524271213,0 -100.2512073296464,25.65623893292044,0 -100.2510961409012,25.65636036688576,0 -100.2510244514512,25.65660716365204,0 -100.2509919769119,25.65676067046302,0 -100.251003187942,25.65692296685734,0 -100.2510841602184,25.65717754553168,0 -100.2509843876184,25.65727117557887,0 -100.2509550755429,25.65748303625448,0 -100.2509402723597,25.65758941186233,0 -100.2509132695239,25.65778254498916,0 -100.2508753699921,25.65793711984696,0 -100.2508992398804,25.65815058093278,0 -100.2507654104442,25.65828179759767,0 -100.2506984854594,25.65834774349968,0 -100.2506090068803,25.65846355831173,0 -100.2505038709523,25.65877595944907,0 -100.2504973243848,25.65898769292241,0 -100.2504122696144,25.65920356801504,0 -100.2503313618942,25.65940450041811,0 -100.2502360579326,25.65967719624582,0 -100.2500334855947,25.659675973761,0 -100.2498295888891,25.6596725124397,0 -100.2495836672794,25.65966603852629,0 -100.2493776921023,25.65965866123861,0 -100.249197882426,25.65972304537523,0 -100.2490593567105,25.65979030436346,0 -100.2489103780938,25.65981385773697,0 -100.2487727921711,25.65988497415196,0 -100.2485683883759,25.6598825338737,0 -100.2483292254667,25.65973589640124,0 -100.248121193776,25.65954374365813,0 -100.2480328589236,25.6593484455517,0 -100.2479213456684,25.65921128865138,0 -100.2477032856519,25.65897060975762,0 -100.2474924518757,25.65874206933092,0 -100.2472844498185,25.65869674501987,0 -100.2470754703687,25.65864869180736,0 -100.2469159256619,25.65864559973791,0 -100.2468764604891,25.65864568656308,0 -100.2464429393047,25.65864792820972,0 -100.2460508679972,25.65851502400374,0 -100.2457684118645,25.65847351678731,0 -100.2454585485762,25.65845976521156,0 -100.2452921719644,25.65838740215726,0 -100.2451442709766,25.65841066135613,0 -100.244845214503,25.65845151972718,0 -100.2447770127634,25.65850473845843,0 -100.2445064865638,25.658520630462,0 -100.2443091557284,25.6585211953111,0 -100.2441253180613,25.65861134883095,0 -100.2440335274497,25.65879234554124,0 -100.2439288228217,25.65888699681441,0 -100.2438760313136,25.65907129956911,0 -100.2437628853076,25.65939871592968,0 -100.2437484491383,25.65958456362535,0 -100.2436717030492,25.65991231201511,0 -100.2436150732179,25.66009955425978,0 -100.243564325837,25.66033608104539,0 -100.2435257570072,25.66067193549699,0 -100.2434384131554,25.66096218760282,0 -100.2434637155956,25.66115970748092,0 -100.2434046125561,25.6613560997909,0 -100.2433806849467,25.66150321850561,0 -100.2434052344492,25.6617021490212,0 -100.2433263969665,25.66210145702671,0 -100.2432152815865,25.66260919439762,0 -100.2431395653069,25.66307551470014,0 -100.2430444278954,25.66338989167466,0 -100.2430042861214,25.66381741022777,0 -100.2428958630664,25.66403467161079,0 -100.2428086419454,25.66446894118345,0 -100.2427812081936,25.66463388065618,0 -100.2427087311065,25.6647993929229,0 -100.2426527790831,25.66513454521814,0 -100.2426360171896,25.66541801441772,0 -100.2425333090398,25.6657604637161,0 -100.2425211292468,25.66610764896089,0 -100.2424972857758,25.66634011381017,0 -100.2424436167605,25.66675230306481,0 -100.2423662416913,25.6669255552535,0 -100.2423771546206,25.66704491062194,0 -100.2422696018679,25.66740715898198,0 -100.2422024737834,25.66771239142371,0 -100.2421606652941,25.66777406451076,0 -100.2421556810493,25.66826800695029,0 -100.242177087994,25.66851823093059,0 -100.2421610828977,25.66889570614692,0 -100.2420961033389,25.6692761056773,0 -100.2420250563884,25.66959672154746,0 -100.2418334015976,25.67026198833842,0 -100.2416924519346,25.67101207178504,0 -100.2415228173178,25.67142976579373,0 -100.2415422774211,25.67170612597696,0 -100.2414601752958,25.67198201712289,0 -100.2414400320569,25.67241911304519,0 -100.2414462420495,25.67250121373985,0 -100.241333631294,25.67310158211238,0 -100.2412972230325,25.67332910708703,0 -100.2412135729096,25.67363536524541,0 -100.2412437761263,25.67409934546793,0 -100.2412113587903,25.67447891971218,0 -100.2412249059693,25.67473470044057,0 -100.2412512476944,25.67517469410748,0 -100.2414254438901,25.67540242825775,0 -100.2414945074082,25.67563915605029,0 -100.2417846262977,25.67595528355858,0 -100.2419574203984,25.67611194228783,0 -100.2422449628993,25.67634630128309,0 -100.2424677059993,25.67642376789858,0 -100.2426302752488,25.67642246022429,0 -100.242901670466,25.67642343053885,0 -100.2431660640239,25.6763454067381,0 -100.2434373214622,25.67634727728606,0 -100.2436543468035,25.67634877331248,0 -100.2443055257541,25.67635325440761,0 -100.2451911558465,25.67650979441842,0 -100.2454718131028,25.67658592528602,0 -100.2459263266708,25.67674029475313,0 -100.2463065217638,25.67673463460721,0 -100.246740892767,25.67672816913937,0 -100.247066679479,25.67672371060103,0 -100.247389339059,25.6767078363579,0 -100.2476632741703,25.67671378581048,0 -100.2479219270523,25.67663040798531,0 -100.2479790475325,25.67631057487962,0 -100.2485153648346,25.67629356378598,0 -100.2492554901387,25.67620436384552,0 -100.24996219091,25.67595475451775,0 -100.250001061823,25.67587678698622,0 -100.2504539566622,25.67572120009465,0 -100.250759909692,25.67564349107352,0 -100.2511023140672,25.67548851254037,0 -100.2513161524939,25.6754885625458,0 -100.2515299879375,25.67548861021857,0 -100.251797278513,25.67548867961249,0 -100.2520645437302,25.67548876636997,0 -100.2523318246111,25.67548882738004,0 -100.2525811039463,25.67541164135862,0 -100.2529898054151,25.67533467539826,0 -100.2532535555181,25.67510458733705,0 -100.2533756082379,25.67495210901459,0 -100.2535497872956,25.67480036982073,0 -100.2537231707756,25.67464932289765,0 -100.2538622810985,25.67457407588889,0 -100.2541726173221,25.67434933465223,0 -100.2543237510397,25.67412610360386,0 -100.2545639091271,25.67404846189266,0 -100.2546777840771,25.67389471240913,0 -100.2549456398124,25.67373860926179,0 -100.2554642314176,25.67320650331252,0 -100.255838297954,25.67290836864755,0 -100.2560526200675,25.67276588690991,0 -100.2561936034704,25.67255332841487,0 -100.2564648469163,25.67227213945583,0 -100.2566830688586,25.67199342255567,0 -100.2570220032622,25.67178603126538,0 -100.2571512786222,25.67171720633161,0 -100.257314436557,25.67144341591672,0 -100.2575206019886,25.67130740702007,0 -100.2576259796254,25.67117197781051,0 -100.2578353297394,25.67090287061332,0 -100.2579393413809,25.67076919801613,0 -100.2580697843122,25.67056976820362,0 -100.2581993866155,25.67037163097849,0 -100.2585311897485,25.669914196945,0 -100.2586837717062,25.66965591141678,0 -100.2588376016759,25.66927254202064,0 -100.2589413776355,25.66889400515064,0 -100.2590167327426,25.66870652750694,0 -100.2591432009143,25.66827363371652,0 -100.2592906744232,25.66790755901675,0 -100.2594615979466,25.6673668856513,0 -100.2596279324078,25.66707104983139,0 -100.2597039478317,25.66678357539184,0 -100.2597500937132,25.66678326832695,0 -100.2599033608056,25.66633603774526,0 -100.2599282104489,25.66628073923076,0 -100.2600328821717,25.66595386438125,0 -100.2600197946531,25.66579589422398,0 -100.2601195614033,25.66535887875428,0 -100.2601871937939,25.66497362193745,0 -100.2602065177644,25.66480671180341,0 -100.2602659885488,25.66442119223002,0 -100.2602404728591,25.66425763480411,0 -100.2601918137685,25.66383062093401,0 -100.2601686849017,25.66367267419063,0 -100.260206161799,25.66335519204401,0 -100.2602020707841,25.66314580767491,0 -100.2601343437883,25.66299023199993,0 -100.2600228074213,25.6627334363133,0 -100.2599788961288,25.66263185054422,0 -100.2599570068072,25.66258120248426,0 
						</coordinates>
					</LinearRing>
				</outerBoundaryIs>
			</Polygon>
		</Placemark>
		<Placemark>
			<name>Pmarcatel - 2</name>
			<description>Marcatel
Precio: $ 25.00</description>
			<styleUrl>#msn_ylw-pushpin1</styleUrl>
			<Polygon>
				<tessellate>1</tessellate>
				<outerBoundaryIs>
					<LinearRing>
						<coordinates>
							-100.2413187876234,25.67540415567398,0 -100.2431780720038,25.66265983650308,0 -100.2430305131375,25.66250141766921,0 -100.2428465559644,25.66239411309541,0 -100.2426688964727,25.66233839715839,0 -100.2424863504688,25.6622318095659,0 -100.2423422350368,25.66207610235867,0 -100.2421196207272,25.66197381634404,0 -100.2419453519489,25.66192410379828,0 -100.2417574804085,25.66172264820334,0 -100.2416550487281,25.66152212919892,0 -100.2415535417496,25.66132377273764,0 -100.2412902241899,25.66117680714705,0 -100.2411194619999,25.66112847505569,0 -100.2409906560426,25.66108000220921,0 -100.2407825070568,25.66108116135192,0 -100.2404877625974,25.66103370391651,0 -100.2400247054833,25.66094011836166,0 -100.2399001875142,25.66094135071263,0 -100.2396048251601,25.66084720813723,0 -100.2393490244073,25.66069700236407,0 -100.23909922391,25.66065107247664,0 -100.2387675282418,25.66060799179043,0 -100.2386438133724,25.66060998956314,0 -100.2384788257609,25.66061265198157,0 -100.2382312594015,25.66061652492162,0 -100.2379423247337,25.66062094751278,0 -100.2377358731913,25.66062410798023,0 -100.237529361712,25.66062726889941,0 -100.2372814716352,25.6606310627639,0 -100.2370337875556,25.66053753468116,0 -100.2368690687167,25.66049152626044,0 -100.2367453960185,25.66049340621375,0 -100.2364170343884,25.66040152451348,0 -100.2361320015162,25.66026107865781,0 -100.2355997085622,25.66022054365662,0 -100.2350703252859,25.66013115430054,0 -100.2346655615904,25.66004008460217,0 -100.2345051256822,25.65998999335255,0 -100.2343481636789,25.65989037783899,0 -100.2341853486044,25.65988992659756,0 -100.2340225398949,25.65988947583901,0 -100.2338190379882,25.6598889110478,0 -100.2336970625065,25.65988780988069,0 -100.2335383662701,25.65983739288438,0 -100.2333800753127,25.65978687899574,0 -100.2330567898578,25.65977817680854,0 -100.2328188252004,25.65972464189632,0 -100.2326557843759,25.65972855790964,0 -100.2324518981175,25.65973345272366,0 -100.2322887220386,25.65973737177983,0 -100.232003020984,25.65974423063132,0 -100.2318396802091,25.65974815313187,0 -100.2317579876293,25.65975011450971,0 -100.2316242202629,25.65984799188508,0 -100.2315437124601,25.66018320461078,0 -100.2313977255525,25.6603751728041,0 -100.2313806725045,25.66051878964637,0 -100.2312570651205,25.66085845717638,0 -100.2311797098248,25.66115294593512,0 -100.2310896039673,25.66154942445652,0 -100.2309557298148,25.66195173462538,0 -100.2307833166167,25.66230918275978,0 -100.2306017898524,25.66272375609091,0 -100.2305951224279,25.66277588994993,0 -100.2304622262908,25.66313976028381,0 -100.2304119853707,25.66319224601747,0 -100.2303337062298,25.66345794629363,0 -100.2302085833689,25.6637339917454,0 -100.2301284977787,25.66400515486283,0 -100.2300626059291,25.66416805294337,0 -100.2299441585314,25.66438790493523,0 -100.2298626874673,25.66466223473251,0 -100.2296308183878,25.66504834712911,0 -100.2295468406745,25.66532907075508,0 -100.2294781912044,25.66549775178364,0 -100.2294375833164,25.66578598740145,0 -100.2293263889797,25.66625083212431,0 -100.2292849097117,25.66654536325395,0 -100.2292058893718,25.66677971450284,0 -100.2291976975029,25.66683849428224,0 -100.2291398766013,25.66725334908876,0 -100.2290896482171,25.66761374901967,0 -100.2290168520548,25.66779611227777,0 -100.2289263024507,25.66810230051498,0 -100.2288259757861,25.66847390943567,0 -100.2286600329323,25.66896963237657,0 -100.2286327454599,25.6691600329672,0 -100.2285503747111,25.66973661705225,0 -100.2284087566645,25.67038594578874,0 -100.2283132605223,25.67101977685326,0 -100.2282052438528,25.67177125783212,0 -100.228194213593,25.6718444938923,0 -100.2281535554411,25.6721256298654,0 -100.2280754907037,25.67267823136187,0 -100.228003307113,25.67282189399976,0 -100.2279004343774,25.67317837484534,0 -100.2278571354647,25.67347284867936,0 -100.2277504388373,25.67384394586974,0 -100.2277180075332,25.67406591726102,0 -100.227642101014,25.67458760202809,0 -100.2276100436586,25.67514876728791,0 -100.2275222617299,25.67603766311477,0 -100.2276553787584,25.67625729056289,0 -100.2277253357367,25.67655112007983,0 -100.2280312069809,25.67714809708923,0 -100.2281668676294,25.67737902609803,0 -100.2281905550533,25.67762138952438,0 -100.228437012188,25.67786280489202,0 -100.2287510374494,25.67802264394166,0 -100.2290567326331,25.67826654493486,0 -100.2295047132973,25.67825909797933,0 -100.2297196729459,25.67833887971941,0 -100.230046979104,25.67841879800021,0 -100.230439747334,25.67841170282595,0 -100.230775719242,25.67840852203435,0 -100.2310002328391,25.67840303815641,0 -100.2313364681391,25.67839771405745,0 -100.2315044409214,25.67839586086355,0 -100.2319090116648,25.6782244617418,0 -100.2322440292187,25.67822077617636,0 -100.2325286624072,25.67813503201032,0 -100.2327066196064,25.67796761382996,0 -100.2329289985558,25.67796578935312,0 -100.2332624199772,25.67796362900122,0 -100.2339278052725,25.67797719897278,0 -100.2342613562217,25.67797482242165,0 -100.2345422425363,25.67789319579043,0 -100.2348246548862,25.67774060320076,0 -100.2352694345519,25.67766894946382,0 -100.2353263612329,25.6775998053586,0 -100.2356077016099,25.67737119321486,0 -100.23583148798,25.67720394857037,0 -100.2359966291801,25.67719591110519,0 -100.2363267094703,25.6771798434246,0 -100.236657084913,25.67708665288199,0 -100.2369316697004,25.67699894166361,0 -100.2370412329529,25.67699497213369,0 -100.2372601090059,25.67683211695587,0 -100.2374779304072,25.67667004745871,0 -100.237859221903,25.67665674108412,0 -100.2383490759734,25.6766401208025,0 -100.2386210515808,25.67663156349223,0 -100.238893017201,25.67662520607787,0 -100.2392175224865,25.67655164833868,0 -100.2395402671112,25.67645800991839,0 -100.2398112413139,25.67645036331057,0 -100.2398621694913,25.67636876669113,0 -100.2401817055108,25.67622676790455,0 -100.2406019812821,25.67598433796941,0 -100.2409059081896,25.67565137485967,0 -100.2411588633785,25.67540742620117,0 -100.2413187876234,25.67540415567398,0 
						</coordinates>
					</LinearRing>
				</outerBoundaryIs>
			</Polygon>
		</Placemark>
		<Placemark>
			<name>PMarcatel - 3</name>
			<description>Marcatel
Precio:$20.00</description>
			<styleUrl>#msn_ylw-pushpin1</styleUrl>
			<Polygon>
				<tessellate>1</tessellate>
				<outerBoundaryIs>
					<LinearRing>
						<coordinates>
							-100.2317844659826,25.65882543779332,0 -100.2316750659508,25.65873772862155,0 -100.231572710781,25.65860110519953,0 -100.2313424790364,25.65852502063836,0 -100.2312241632362,25.65852373216987,0 -100.231072359662,25.65847737182038,0 -100.2308469437983,25.65839009365772,0 -100.2307337485345,25.65834905740845,0 -100.2306207347977,25.65830808768996,0 -100.230434303871,25.65822708609353,0 -100.2301992881641,25.65819934514618,0 -100.2299689557137,25.65815902860865,0 -100.229780953696,25.65811155077887,0 -100.2295859944868,25.65810830331043,0 -100.2293141276487,25.65810137458654,0 -100.2290879102339,25.65805427881283,0 -100.2288695845654,25.65796499127668,0 -100.2286516538093,25.65787709311735,0 -100.2284746487334,25.65778703408416,0 -100.228202740784,25.65778554551907,0 -100.2279814543788,25.65770999722988,0 -100.2277086559734,25.65771119327518,0 -100.2274636859344,25.65758309201934,0 -100.2269490066557,25.65745637982085,0 -100.2261562849237,25.65737363924463,0 -100.2259247026255,25.65737355690465,0 -100.2258480834257,25.65737255807263,0 -100.2256669756346,25.65732838190944,0 -100.2253961807318,25.65732977564592,0 -100.2253177394678,25.65733180735204,0 -100.2251047299572,25.65725394077253,0 -100.2249480883108,25.65725787954021,0 -100.22475334026,25.65726113044459,0 -100.2245208762832,25.65726304387654,0 -100.2242867012921,25.65726738405299,0 -100.2241327436487,25.65726709973812,0 -100.2236668431951,25.65727184522068,0 -100.2233905958265,25.65728057768645,0 -100.2233511133312,25.65728182563315,0 -100.2231962067301,25.65728262953552,0 -100.2228773584854,25.65719629685138,0 -100.2223612264132,25.65702124085828,0 -100.2218493450707,25.65684754039498,0 -100.2215998312489,25.65680231211438,0 -100.2214621121351,25.65676070116553,0 -100.2213488987991,25.65675943061666,0 -100.2211978303025,25.65675788976124,0 -100.2209326931943,25.65675614103581,0 -100.2206805461947,25.65671578959511,0 -100.2204679459725,25.65667434184248,0 -100.2203515376618,25.6566768599165,0 -100.2201726715743,25.65664053438429,0 -100.2200324591764,25.65660381475072,0 -100.2197576632439,25.65652523577013,0 -100.2195837347133,25.65648501428911,0 -100.2195076394991,25.65648535019956,0 -100.2191437217494,25.65644631006897,0 -100.2188411724253,25.6564460568814,0 -100.2185746281832,25.65644759295913,0 -100.2184194602495,25.65653594647754,0 -100.2181919847889,25.65670554724617,0 -100.2180045648923,25.65695866531796,0 -100.2179316856197,25.65712711375247,0 -100.2177441090585,25.65746922653662,0 -100.2176507876939,25.6575969006576,0 -100.2175613774358,25.65780900580555,0 -100.2174146102641,25.65815449459415,0 -100.2173556773111,25.65828871466243,0 -100.2172355809212,25.65856074899089,0 -100.217141477821,25.65878278538866,0 -100.2169616990566,25.65919611639762,0 -100.2168769429727,25.65938618677551,0 -100.2167334356261,25.65962177909079,0 -100.2165577691776,25.65994380658927,0 -100.2162861418014,25.66069354730708,0 -100.2158128439084,25.66181978082911,0 -100.215724199044,25.66202545625336,0 -100.215807677832,25.66233328519368,0 -100.2158928769115,25.66243689630723,0 -100.2158707871459,25.6628011746138,0 -100.2158053456734,25.66306430214049,0 -100.215651554231,25.66343689939993,0 -100.215517973632,25.66376056085749,0 -100.2154529372095,25.6639211111886,0 -100.2153436107663,25.66419097561415,0 -100.2152060185047,25.66452410806917,0 -100.2151778784362,25.66480746682554,0 -100.2150830928605,25.66503614215427,0 -100.215054011757,25.66532504013666,0 -100.2150357920682,25.66571767530628,0 -100.2150166324529,25.66600080919635,0 -100.2149257612254,25.66623138525864,0 -100.2148115761106,25.66663924900664,0 -100.2146265985098,25.66711129088354,0 -100.2145088620339,25.66741099666792,0 -100.2143659469222,25.66777480006382,0 -100.2142212171709,25.66814321619511,0 -100.2140253605902,25.66864176895624,0 -100.2137780176079,25.66927419345114,0 -100.2136429495235,25.66963903882016,0 -100.2134843251545,25.67003755916283,0 -100.2131636540196,25.6708464133173,0 -100.2129326864917,25.67168122376661,0 -100.2128713368174,25.67196446319018,0 -100.2127532350197,25.67239345358336,0 -100.2127152997354,25.67302981933507,0 -100.2127163370316,25.67373014229906,0 -100.2126262152496,25.67424676907652,0 -100.2127043254313,25.67432010582828,0 -100.2129141319686,25.67461297254088,0 -100.2130471444627,25.67468540578638,0 -100.2134479344737,25.67490345651187,0 -100.2136349223554,25.67497710987772,0 -100.2138560973286,25.67511545632934,0 -100.214235373197,25.67525899052455,0 -100.214344777847,25.67525487989571,0 -100.2149078558314,25.6753297663457,0 -100.2151766681435,25.67532737602031,0 -100.2155532448292,25.67532335425795,0 -100.2160550174901,25.67509266819384,0 -100.2167388696839,25.67494546951882,0 -100.2172737311103,25.67493906432664,0 -100.2176992410609,25.67493855069546,0 -100.2180728513532,25.67493606767842,0 -100.2187205778037,25.67509069472255,0 -100.2192417757386,25.67511299924174,0 -100.2196506225633,25.67514997228107,0 -100.2199646406415,25.67516305740629,0 -100.2202230664555,25.67499813061652,0 -100.2204936073243,25.67480460804888,0 -100.2212286796738,25.67463416899386,0 -100.2217209676874,25.67456269898356,0 -100.2218789730794,25.67456391831007,0 -100.2223551714749,25.67456260375835,0 -100.2225853724572,25.67448257275059,0 -100.2230604057389,25.67448223407336,0 -100.2233256400182,25.6744788298122,0 -100.2236081322435,25.67439596844341,0 -100.2238367108792,25.6743145342946,0 -100.2244361303036,25.6742235904244,0 -100.2249585468849,25.67423240082205,0 -100.2252847776784,25.67416623008477,0 -100.2256647942539,25.67409418236967,0 -100.2258366129526,25.6740154104948,0 -100.2262697993214,25.67393668773149,0 -100.2265319446785,25.67393435050073,0 -100.2267945825844,25.67393074630967,0 -100.2269521450582,25.67392858210377,0 -100.2272147017072,25.67392497905299,0 -100.2273609779352,25.67399681898184,0 -100.2276127925736,25.67406736996998,0 -100.2317844659826,25.65882543779332,0 
						</coordinates>
					</LinearRing>
				</outerBoundaryIs>
			</Polygon>
		</Placemark>
		<Placemark>
			<name>Proveedir Telmex</name>
			<description>Proveedir Telmex
precio:$32.00</description>
			<LookAt>
				<longitude>-100.2371781613754</longitude>
				<latitude>25.66763833331516</latitude>
				<altitude>0</altitude>
				<heading>-4.924872646527915e-09</heading>
				<tilt>45.00043307056378</tilt>
				<range>4599.291221930754</range>
				<gx:altitudeMode>relativeToSeaFloor</gx:altitudeMode>
			</LookAt>
			<styleUrl>#m_ylw-pushpin</styleUrl>
			<Point>
				<gx:drawOrder>1</gx:drawOrder>
				<coordinates>-100.2226109889512,25.68352034398701,0</coordinates>
			</Point>
		</Placemark>
		<Placemark>
			<name>Proveedor Axtel</name>
			<description>Axtel
Precio:$35.00</description>
			<styleUrl>#msn_ylw-pushpin0</styleUrl>
			<Polygon>
				<tessellate>1</tessellate>
				<outerBoundaryIs>
					<LinearRing>
						<coordinates>
							-100.2598799625829,25.6673626045697,0 -100.2598571018518,25.66730364535841,0 -100.2596907740636,25.66736037175159,0 -100.2596192124873,25.66753943537219,0 -100.2595231205353,25.66777991378339,0 -100.2594274738722,25.66790089078049,0 -100.2592366485514,25.66802236344687,0 -100.2591153128448,25.66820553139607,0 -100.2589478638715,25.6682668257347,0 -100.2587547587439,25.66838977306643,0 -100.2586761578693,25.66869957548626,0 -100.2586733114019,25.66882440493217,0 -100.2586193644552,25.66907564645434,0 -100.2585422826268,25.6692654681473,0 -100.2583936222885,25.66939267382505,0 -100.2582629502956,25.66971309061599,0 -100.2581878407028,25.66977758017453,0 -100.2581533891818,25.67010216026247,0 -100.2580509904941,25.67023294851731,0 -100.2579930436071,25.67049623835583,0 -100.2578896322932,25.67062872742053,0 -100.2577088458268,25.67082853229414,0 -100.2576042528464,25.67096246206068,0 -100.2574493652053,25.67109698850741,0 -100.2571719136759,25.67116439926394,0 -100.2570438278333,25.67123201571938,0 -100.2569520219726,25.67157238785034,0 -100.2568086591939,25.67191651375589,0 -100.2567725885831,25.67212483233446,0 -100.2567362724639,25.67233453722909,0 -100.2565759647817,25.67247510185205,0 -100.2564149451554,25.67261629412302,0 -100.2562531923221,25.67275811336618,0 -100.2560092001857,25.67297204095421,0 -100.255840845038,25.67321897175909,0 -100.2559282270123,25.67309495231882,0 -100.2555181091962,25.67303648705817,0 -100.2553700597393,25.67323252069303,0 -100.2551104614478,25.67336397908736,0 -100.2548850841614,25.67335082131174,0 -100.2552969106579,25.67425357594147,0 -100.2550373397968,25.67425889761735,0 -100.2548506239659,25.67433922836129,0 -100.2546415050152,25.67434124662284,0 -100.2543788601804,25.67434119592453,0 -100.2542274405973,25.67456591978398,0 -100.2540220833057,25.67479219759747,0 -100.2539020531344,25.67494391917774,0 -100.2537136466821,25.67524954923426,0 -100.2536979481769,25.67540144597033,0 -100.2535209504452,25.67555237584791,0 -100.2532541608531,25.67555398475825,0 -100.2530047914675,25.6756306560599,0 -100.2526842332136,25.67563256801312,0 -100.2437380126227,25.67347068883085,0 -100.2518244830465,25.6754770476437,0 -100.2519479125682,25.67593944670002,0 -100.2517516995415,25.67602287452342,0 -100.2514783043909,25.67554452073913,0 -100.2511025199259,25.67568002214217,0 -100.2507609790499,25.67618320664106,0 -100.2504909280733,25.67618320110746,0 -100.2502594329055,25.67610427421043,0 -100.2500426441719,25.67610129619249,0 -100.249575123063,25.67619031293745,0 -100.2494139174944,25.67619292689249,0 -100.2493215174852,25.67627609076749,0 -100.2490119219427,25.67635850926592,0 -100.2488100790872,25.67644136814647,0 -100.2484320286555,25.67644662064202,0 -100.2482833475098,25.67652928934364,0 -100.2479607320545,25.67654059092399,0 -100.2477156350451,25.67670611321102,0 -100.2475091407841,25.67678289813484,0 -100.2472623164123,25.67695075215471,0 -100.2468821125551,25.67696028036037,0 -100.2466097569024,25.67696435957795,0 -100.2463373425597,25.67696843852954,0 -100.2461193726102,25.67697170472205,0 -100.2459013629768,25.67697497072858,0 -100.2456285936882,25.67697808588024,0 -100.2453363855309,25.67682028951578,0 -100.2449911882997,25.67666379483717,0 -100.2446561072274,25.67658623710786,0 -100.2444384387379,25.67658556505386,0 -100.244220624454,25.67658411391169,0 -100.2439946524322,25.67650232415299,0 -100.2437613662238,25.67634084676351,0 -100.2435443822133,25.67633935156716,0 -100.2433274144856,25.67633785516003,0 -100.2430019977596,25.67633561277199,0 -100.2427850726598,25.67633411894986,0 -100.2425685192718,25.67633511256859,0 -100.242352057228,25.67633684693113,0 -100.2421355745215,25.67633858582098,0 -100.2419190727289,25.67634032155571,0 -100.2416919327711,25.67618420816675,0 -100.2415090447835,25.67586740745178,0 -100.2413324747773,25.67562887183575,0 -100.2411093173959,25.67547818099987,0 -100.2409050851118,25.67564308027325,0 -100.2407004511094,25.67581616200206,0 -100.240443481067,25.67605614247147,0 -100.240343355725,25.6762181814544,0 -100.2400761074777,25.67629562593891,0 -100.2398616278415,25.67636104303917,0 -100.2395970061431,25.67653175661435,0 -100.2393291297953,25.67663573464787,0 -100.2391128648539,25.67670110125675,0 -100.23889646531,25.6767710609077,0 -100.2386801292578,25.67685356179335,0 -100.2384632565527,25.67693638169202,0 -100.2380807673899,25.67694946342855,0 -100.2378620837694,25.67695694275221,0 -100.2376438400198,25.67704242497975,0 -100.2373703837823,25.67720826274494,0 -100.2371506275361,25.67737290980284,0 -100.2369303498865,25.67738096851911,0 -100.2366542913833,25.67746968683526,0 -100.236321192983,25.67764232175706,0 -100.2360987329705,25.67772529288501,0 -100.2358218962257,25.67772700289124,0 -100.2354863148372,25.67787789665346,0 -100.2352643562339,25.67787947665061,0 -100.2350955440969,25.67796027367202,0 -100.2350300768355,25.67828554793318,0 -100.2349635984468,25.67862156538812,0 -100.2349500863966,25.67904638550215,0 -100.2348801385536,25.679468239538,0 -100.2348692671358,25.67980781601524,0 -100.23479078328,25.68043954744824,0 -100.2346464887845,25.68126344991687,0 -100.2345086124773,25.68183565780719,0 -100.2344425166111,25.68202871527545,0 -100.2344065754021,25.68298162021889,0 -100.2344936903098,25.68386530400739,0 -100.2344693003323,25.6845499532963,0 -100.2345164955681,25.68494406302311,0 -100.234495684045,25.68554333328214,0 -100.2345369984848,25.68614733176825,0 -100.2345593882052,25.68732395161616,0 -100.2345793871655,25.6886376723107,0 -100.2345609827095,25.68919886758738,0 -100.2345574096918,25.68930997867175,0 -100.2345955506987,25.69012990726059,0 -100.2346435519333,25.69060460782806,0 -100.2346241684954,25.6911812051747,0 -100.234603149406,25.69191507078834,0 -100.2346517417587,25.6926003125649,0 -100.2346369567017,25.69309441323044,0 -100.2346135153902,25.693858787823,0 -100.2347328375711,25.69447138569403,0 -100.2349967559714,25.69495473855791,0 -100.2353345063846,25.69534716934961,0 -100.2358133322199,25.69586839402283,0 -100.2360233618893,25.69586562623424,0 -100.2363733644181,25.69586100675715,0 -100.2366525296952,25.69598896115922,0 -100.2372132873051,25.69623411384124,0 -100.2379169036738,25.69635007311813,0 -100.2384115479959,25.69649528692315,0 -100.2391198029804,25.69664155455878,0 -100.2395436369136,25.69664855490121,0 -100.2399672614747,25.69664531124887,0 -100.2407424318465,25.69662038873086,0 -100.2410242918957,25.69661390932731,0 -100.241229637036,25.69647799032388,0 -100.241574779919,25.69633927138469,0 -100.2418484887991,25.6961992312616,0 -100.2423308299458,25.69605078754408,0 -100.2428198133584,25.69603286748427,0 -100.2429594644741,25.69602775006144,0 -100.2432910771673,25.69576245207791,0 -100.243639730161,25.69575661343666,0 -100.2442568837558,25.69561884500967,0 -100.2448157805311,25.69562617448082,0 -100.2450944216143,25.69562361034771,0 -100.2456392170532,25.69549023871809,0 -100.2459865080455,25.69548436102581,0 -100.2461948540343,25.69548083255437,0 -100.246598096743,25.69534883635955,0 -100.2468478585757,25.69509438100421,0 -100.2474024122942,25.69509444512278,0 -100.2476658024675,25.69497549213313,0 -100.2480121950852,25.69497685138477,0 -100.2485285179045,25.69470281857349,0 -100.2488539149839,25.69456466481405,0 -100.2492302200579,25.69430545555458,0 -100.2500027900114,25.69395120063409,0 -100.250885485406,25.69351976302598,0 -100.2514479001022,25.69324182192773,0 -100.2516776672854,25.69338495098117,0 -100.252001860995,25.69366712854292,0 -100.2524506910613,25.69389894551147,0 -100.2526701592902,25.69399415196338,0 -100.2529644360186,25.69411039126367,0 -100.2533100656859,25.69412145254607,0 -100.253703157596,25.69437990982255,0 -100.2539986297372,25.69449234966262,0 -100.2543244727853,25.69474624918056,0 -100.2548183793428,25.69513484565613,0 -100.2551501623167,25.69539593981999,0 -100.2553864593454,25.69552708633419,0 -100.2557902918814,25.69578716392173,0 -100.2562578025545,25.69602235668187,0 -100.2567706392418,25.69643052704316,0 -100.2569438738338,25.69657095497022,0 -100.2574670158111,25.69699501628995,0 -100.2578586479901,25.69719195696331,0 -100.2582134216735,25.69719206612391,0 -100.2583861933525,25.69703617932672,0 -100.2588327480797,25.69676822668059,0 -100.2591730001393,25.69645722377079,0 -100.2597023678579,25.69605692505162,0 -100.2600526260123,25.69579218040498,0 -100.2606080537679,25.69526734960224,0 -100.2610217456462,25.69500719937236,0 -100.2613274483371,25.69462016285661,0 -100.2617359564957,25.69436425158386,0 -100.2620734202154,25.69410969564281,0 -100.2624088872163,25.69385672660515,0 -100.2625379945685,25.69360510908687,0 -100.2628785087526,25.69360532858289,0 -100.2631509036961,25.69360535635518,0 -100.2635595378758,25.69360558871275,0 -100.2639001691642,25.69360588869518,0 -100.2642685458464,25.69348098600852,0 -100.2643365635832,25.69348103428551,0 -100.2646085957463,25.69348118868074,0 -100.265016661147,25.69348145738753,0 -100.2654214493283,25.69347519265263,0 -100.265675304524,25.69322329721325,0 -100.2658348259414,25.69309663210294,0 -100.2661593742704,25.69307065019727,0 -100.2664006688358,25.69280427844321,0 -100.2667650710864,25.69268786134961,0 -100.267000990516,25.6924198463763,0 -100.2673197509333,25.69202341468209,0 -100.2676422213538,25.6914848770415,0 -100.2678183842837,25.69124697032467,0 -100.2678831873876,25.69089268599476,0 -100.2679704211721,25.69077526115113,0 -100.2681625463302,25.69007760413326,0 -100.2682663782248,25.68950525034039,0 -100.2684126374369,25.68905329552621,0 -100.2683821419956,25.68816420940911,0 -100.2685253361962,25.68772719082785,0 -100.2685647891027,25.6875104730634,0 -100.2686192076954,25.68686719186919,0 -100.2687111104846,25.68602607380854,0 -100.268697607525,25.6851015587171,0 -100.2687915159108,25.68459755787865,0 -100.2685938866104,25.6841168590054,0 -100.2682870564537,25.68365430610713,0 -100.2678215797228,25.68309656324064,0 -100.267544003023,25.68271381721298,0 -100.2671827733152,25.68202165002315,0 -100.2666367240031,25.68099047679192,0 -100.2661574021245,25.68005358651757,0 -100.2660131798865,25.679701724496,0 -100.2657290280166,25.67900840152379,0 -100.2654849438556,25.6784128751043,0 -100.2651771795093,25.67766200362478,0 -100.2651096993481,25.67749735224564,0 -100.2648214345261,25.67692721001418,0 -100.264602949776,25.67652574920161,0 -100.2644732474412,25.67620802552119,0 -100.2642592564052,25.67581502678368,0 -100.2639536693125,25.67519582175102,0 -100.2638295639633,25.67489059463856,0 -100.2635707739399,25.67451297989253,0 -100.2633896182181,25.67406557809614,0 -100.2632405518148,25.67369741283079,0 -100.2630931689218,25.67333339564734,0 -100.2629474695107,25.67297344908387,0 -100.2628320348607,25.67268840842662,0 -100.2626042981456,25.67212594160126,0 -100.2624083185475,25.67164190569237,0 -100.2621381137618,25.67109778512649,0 -100.2619261504981,25.67069585977481,0 -100.2617926895826,25.67036490400081,0 -100.2616641673046,25.67016802824077,0 -100.2614325054317,25.66971356603897,0 -100.2612089207101,25.66939574405406,0 -100.260935797418,25.66895321031722,0 -100.2605216122347,25.66827103504893,0 -100.2603054642731,25.66796511917369,0 -100.259811525722,25.66718609101328,0 -100.2598799625829,25.6673626045697,0 
						</coordinates>
					</LinearRing>
				</outerBoundaryIs>
			</Polygon>
		</Placemark>
	</Folder>
</Document>
</kml>
