{
	"info": {
		"_postman_id": "5ef77d4d-9fbc-4ded-b192-2e52f4fa74ee",
		"name": "Crud alumno integration test",
		"schema": "https://schema.getpostman.com/json/collection/v2.1.0/collection.json"
	},
	"item": [
		{
			"name": "Crear alumno test",
			"event": [
				{
					"listen": "test",
					"script": {
						"id": "7eeccbfb-3659-4a02-91ac-8a7b38499f4b",
						"type": "text/javascript",
						"exec": [
							"console.log(\"############################## RESPONSE ###################################\");",
							"console.log(\"Respuesta del servicio: \" + responseBody);",
							"",
							"tests[\"Código de respuesta: \"+responseCode.code+\" cuando se esperaba: \"+data.expectedResponseCode+\" Test: \"+data.testCase] = responseCode.code === data.expectedResponseCode;",
							"",
							"if (responseCode.code === data.expectedResponseCode) {",
							"",
							"    var jsonData = JSON.parse(responseBody);",
							"",
							"    switch(responseCode.code) {",
							"        ",
							"        case 200:",
							"            ",
							"            tests[\"Test  Id no es nulo\"] = jsonData.id !== null;",
							"            ",
							"            var bodyRequest = postman.getEnvironmentVariable(\"body\");",
							"            var requestObject = JSON.parse(bodyRequest);",
							"            var requestFields = Object.keys(requestObject);",
							"    ",
							"            for (var i=0; i<requestFields.length; i++) {",
							"               ",
							"                var requestField = requestFields[i];",
							"                var requestFieldData = requestObject[requestField];",
							"                var responseField = jsonData[requestField];",
							"                validateObject(requestFieldData , responseField);",
							"            }",
							"            ",
							"            break;",
							"            ",
							"        case 400:",
							"        ",
							"            if (data.expectedMessage!==null && data.expectedMessage!==''){",
							"               var defaultError = _.map(jsonData.errors, 'defaultMessage');",
							"               console.log(defaultError);",
							"                tests[\"Mensaje de error esperado:\"+data.expectedMessage] = defaultError[0] === data.expectedMessage;",
							"            }",
							"    ",
							"            break;",
							"    ",
							"        default:",
							"            console.log(\"Código de respuesta inesperado \"+responseCode.code);",
							"            tests[\"Código de respuesta inesperado \"+responseCode.code] = false;",
							"        ",
							"    }",
							"    ",
							"}",
							"",
							"",
							"// Funciones de validación",
							"function validateObject(request, response){",
							"",
							"",
							"    if(typeof request === 'string'){",
							"        ",
							"        validateField(request, response);",
							"        ",
							"    }else{",
							"    ",
							"        var requestFields = Object.keys(request);",
							"    ",
							"        for (var i=0; i<requestFields.length; i++) {",
							"    ",
							"                var requestField = requestFields[i];",
							"                var requestFieldData = request[requestField];",
							"                var responseField = response[requestField];",
							"                validateField(requestFieldData , responseField);",
							"",
							"            }",
							"        }",
							"}",
							"",
							"function validateField(requestFieldData, responseField){",
							"",
							"    tests[\"Validar campo \" + requestFieldData] = requestFieldData == responseField;",
							"",
							"}",
							"",
							"",
							"function checkMessages(messages, expectedMessage) {",
							"    var foundMessage = false;",
							"    var i = 0;",
							"    ",
							"    while(!foundMessage && i < messages.length) {",
							"        if (messages[i].message === expectedMessage) {",
							"            foundMessage = true;",
							"        }",
							"        i++;",
							"    }",
							"    ",
							"    return foundMessage;",
							"}"
						]
					}
				},
				{
					"listen": "prerequest",
					"script": {
						"id": "7aed2d4e-0f5b-4a57-9f45-d3f281e36d7d",
						"type": "text/javascript",
						"exec": [
							"var bodyRequest = getBodyRequest();",
							"",
							"if (data.expectedResponseCode !== 200) {",
							" ",
							"    bodyRequest = createBadRequest(bodyRequest, data.replaceKey, data.replaceKeyValue);",
							"    console.log(\"Bad request: \" + bodyRequest);",
							"}",
							"",
							"postman.setEnvironmentVariable(\"body\", bodyRequest);",
							"",
							"// Funciones",
							"function getBodyRequest(){",
							"    return '{\"nombre\": \"Francisco Javier\",\"primerApellido\": \"Lobo\",\"segundoApellido\": \"González\",\"dni\": \"' + rand_dni() + '\",\"modulo\": {\"centro\": \"IES Cristobal de Monroy\", \"fechaInscripcion\": \"2015-09-15T00:00:00.000+0000\"}}';",
							"}",
							"",
							"function createBadRequest(bodyString, replaceKey, replaceValue){",
							"    var json = JSON.parse(bodyString);",
							"    json = _.set(json, replaceKey, null);",
							"    return JSON.stringify(json);",
							"}",
							"",
							"// Generador DNI aleatorio",
							"function formatNumberLength(num, length) {",
							"  var r = \"\" + num;",
							"  while ( r.length < length ) {",
							"    r = \"0\" + r;",
							"  }",
							"  return r;",
							"}",
							"",
							"function charDNI(dni) {",
							"  var chain = \"TRWAGMYFPDXBNJZSQVHLCKET\";",
							"  var pos = dni % 23;",
							"  var letter = chain.substring( pos, pos + 1 );",
							"  return letter;",
							"}",
							"",
							"function rand_dni() {",
							"  num = Math.floor( ( Math.random() * 100000000 ) );",
							"  sNum = formatNumberLength( num, 8 );",
							"  return sNum + charDNI( sNum );",
							"}"
						]
					}
				}
			],
			"request": {
				"method": "POST",
				"header": [
					{
						"key": "Content-Type",
						"value": "application/json"
					}
				],
				"body": {
					"mode": "raw",
					"raw": "{{body}}"
				},
				"url": {
					"raw": "localhost:8080/alumno",
					"host": [
						"localhost"
					],
					"port": "8080",
					"path": [
						"alumno"
					]
				}
			},
			"response": []
		}
	]
}