{
    "type": "mysql",
    "host": "localhost",
    "port": 3306,
    "username": "test",
    "password": "test",
    "database": "test",
    "synchronize": true,
    "logging": false,
    "entities": [
       "src/model/*.ts"
    ],
    "migrations": [
       "src/migration/**/*.ts"
    ],
    "subscribers": [
       "src/subscriber/**/*.ts"
    ]
}