277632 894902
885924 699334
837239 140376
980896 975217
263942 382642
527648 151239
997685 276826
450162 712203
480899 202083
469101 897094
863322 109286
976559 965984
593751 727702
529531 55460
569705 539053
608342 20076
95669 509714
622568 978592
956472 909906
603345 737174
24050 933342
514928 255387
948696 529675
268230 401421
320535 563526
527800 958171
402983 448495
325647 967012
52990 219559
4824 680755
710585 90976
170703 76023
30304 950243
983971 432059
847470 288160
778832 458070
347777 903164
519282 139616
120738 715454
654662 412935
654213 660943
134748 608314
523110 521436
669439 680191
686180 312225
411851 355506
675084 855850
302864 341259
97882 8949
969840 399049
195039 194051
820498 992806
487028 976339
840722 792713
270969 984628
86989 865616
290254 384523
874979 775617
994976 909876
370408 738602
777087 601886
659285 614624
986600 866262
200228 721655
217864 875773
166117 192781
92680 310031
52007 453941
812767 13591
76748 904081
227520 137697
71933 414598
786297 344848
204309 90499
336057 40828
603802 727709
259985 689151
978667 568072
766022 768749
341692 969224
408943 396172
505005 119075
689819 16532
991921 400440
485227 459297
620508 527220
362520 270723
134417 227663
452271 649287
482079 153578
443654 795409
92490 565335
424529 46407
157853 484507
162878 867468
617412 648917
171038 25953
595781 785393
779822 795639
364645 480612
725730 382998
949550 589295
307061 267825
211793 527304
2860 120758
507667 82977
720762 125610
324920 307423
467784 933725
754532 926376
682835 486613
487601 923967
743779 504614
63946 126563
151152 699257
743796 409489
250426 316036
612903 457020
564287 394483
284618 59246
228082 383796
182455 525474
743105 301414
794852 211325
372959 46098
816318 280155
278640 180363
270509 299179
569858 990499
479562 808438
700174 135813
765045 383697
183346 687689
268584 106057
921080 285559
391857 299788
123097 972479
304270 232733
733712 755831
171109 692393
986436 759330
96086 60171
30415 958816
839176 427342
271507 842757
638594 144312
138389 518984
343663 384443
774131 161131
784229 37777
419658 309312
623899 512894
609147 411764
10626 911352
36042 75347
663270 136354
450054 606527
517394 992313
730194 580806
299781 422248
908620 112314
659705 509254
700687 363833
352840 153923
106791 738258
727941 745258
877778 301114
602848 867599
411613 694733
177958 316041
34701 267404
912312 476940
516775 916278
920015 234606
896012 846432
738860 660612
172217 889341
765816 297729
766926 130530
839391 641324
779060 785956
336295 264498
434365 767094
105035 94237
489387 31460
144982 132180
104786 937551
532057 592490
503281 496512
757415 118871
836532 22643
848574 252177
685992 564816
887234 178891
179029 823554
922797 107232
116888 836748
569132 156403
956812 697899
292408 3664
135286 537797
116640 520951
542895 813695
56413 753431
50791 843027
971527 90899
969595 50118
675132 319125
638658 760644
170258 890217
962389 815547
127619 480139
556478 943002
315546 114264
895579 816111
149451 76844
301580 8230
701978 107316
963633 304783
141951 893014
44514 117094
518781 121654
923071 510141
843698 296494
434679 486455
731771 238818
686459 388952
34790 84442
756719 738155
173017 140595
313101 609147
804819 864040
794509 790341
851037 584575
84060 556880
534574 681080
584563 794344
62370 805161
667482 197882
87412 553537
833920 761131
477649 353210
