985149 719338
188182 593173
970007 656240
193330 38891
327536 933444
787964 512944
870885 725143
654414 894803
514342 294857
285761 364080
431777 484295
558473 806737
343549 128435
692653 911939
922423 681541
397384 719587
564628 503337
905199 273114
302501 508196
105043 821844
52514 385504
922054 533172
116145 82680
808509 84239
62723 740250
38232 45292
422236 269100
340008 103886
274737 25812
510061 62822
94424 144915
431984 890702
753346 261289
295254 481613
96530 41914
103078 390870
994616 297322
16109 806505
813589 808272
398887 55369
775643 445609
573366 153282
595866 54273
188201 718493
972564 565796
604188 631642
131094 944831
791949 64031
251921 747151
702841 429889
844790 26517
455603 999654
274368 609051
124978 29043
31329 213672
153297 477360
731001 682696
810519 804742
760749 363725
675963 259615
999866 579549
913457 204272
994739 100378
31256 798294
220810 657357
16823 440793
771132 851974
586643 379095
542816 930026
62412 992538
277993 70753
633926 493769
795767 691106
189212 493555
969105 489948
486668 707174
988070 321582
997619 672069
389700 255996
626764 55214
234894 82286
511355 908084
209947 906818
495208 981490
75704 248674
169159 205578
578186 437899
929180 222508
261478 551450
328311 985493
427901 99007
790454 808806
871166 879880
544040 744925
914633 337731
385262 221604
645093 943333
605186 203431
236596 947115
341820 815184
239319 264943
683480 623772
861937 393298
395074 786539
905673 593100
148380 717948
350726 431010
352326 923885
854914 654369
101666 709266
368452 533070
809710 391298
594361 996582
511635 192175
398967 627889
326156 754846
276623 468690
624861 685193
752318 160906
644361 187391
626533 340222
482551 554222
946884 878359
746595 97795
841654 737251
545963 614015
664341 657553
840279 220796
693055 471752
488623 693317
443909 414811
492618 286562
808755 702137
134303 285211
346292 877900
418212 564796
360772 589387
624180 580863
443638 990367
917724 442430
601904 200390
445594 321625
153376 231388
863460 509232
968038 992054
851805 453823
527132 898920
804423 365113
285771 435566
718238 936678
4613 977513
564795 84470
502396 42081
319932 519297
685637 768940
802057 283351
995776 36973
854639 769530
30428 444339
231036 963707
957428 44691
431017 387255
74200 930817
622517 502866
738490 716280
286584 883661
180287 357245
175345 388914
880887 797731
596903 113591
526611 106007
652848 775436
205992 535784
350833 912741
888322 436482
470278 224820
268125 996186
321795 47088
933970 46396
18509 472639
932450 874834
715781 669416
72210 718263
38667 161271
876054 24528
876074 557210
290902 475708
347316 779973
686154 35841
507838 47975
999026 839144
809380 338095
550881 916070
932500 18854
460588 683169
962989 810869
971200 853898
614719 477874
826189 700014
674550 281873
320494 877691
317499 900826
10582 552317
269858 386189
626088 634185
217930 139149
831816 120521
465155 507662
218179 856956
376873 512743
926517 213274
165529 279714
850517 404919
45164 267469
191631 934445
671383 661612
695386 77632
433888 420821
522438 422381
138042 647163
48528 767531
446041 460281
638730 184303
792852 655528
121040 126143
592576 911390
174634 148795
356358 68260
716933 188682
119375 171077
49040 587010
39662 66198
130747 601449
43220 455842
228672 32884
268729 470475
846755 482472
235860 536896
672191 731983
88762 680649
40919 735667
