{
  "$schema": "https://developer.microsoft.com/json-schemas/spfx/client-side-web-part-manifest.schema.json",
  "id": "65e503ca-01df-4008-bb63-1deeba8c0f18",
  "alias": "WebpartTabelaPadraoWebPart",
  "componentType": "WebPart",
  "version": "*",
  "manifestVersion": 2,
  "requiresCustomScript": false,
  "supportedHosts": [
    "SharePointWebPart",
    "TeamsPersonalApp",
    "TeamsTab",
    "SharePointFullPage"
  ],
  "supportsThemeVariants": true,

  "preconfiguredEntries": [
    {
      "groupId": "5c03119e-3074-46fd-976b-c60198311f70",
      "group": { "default": "Advanced" },
      "title": { "default": "Tabela_Padrão" },
      "description": { "default": "webpartTabelaPadrao description" },
      "officeFabricIconFontName": "Page",
      "properties": {
        "description": "webpartTabelaPadrao"
      }
    }
  ]
}
