{
  "$schema": "https://developer.microsoft.com/json-schemas/spfx-build/package-solution.schema.json",
  "solution": {
    "name": "webpart-comunicados-form-client-side-solution",
    "id": "60413675-07d0-43f9-a2df-fc5dd1450f2f",
    "version": "1.0.0.0",
    "includeClientSideAssets": true,
    "skipFeatureDeployment": true,
    "isDomainIsolated": false,
    "developer": {
      "name": "",
      "websiteUrl": "",
      "privacyUrl": "",
      "termsOfUseUrl": "",
      "mpnId": "Undefined-1.17.4"
    },
    "metadata": {
      "shortDescription": {
        "default": "webpartComunicadosForm description"
      },
      "longDescription": {
        "default": "webpartComunicadosForm description"
      },
      "screenshotPaths": [],
      "videoUrl": "",
      "categories": []
    },
    "features": [
      {
        "title": "webpart-comunicados-form Feature",
        "description": "The feature that activates elements of the webpart-comunicados-form solution.",
        "id": "f7d3324e-9300-4b44-91ed-33838fd919a5",
        "version": "1.0.0.0"
      }
    ]
  },
  "paths": {
    "zippedPackage": "solution/webpart-comunicados-form.sppkg"
  }
}
