{
  "$schema": "https://developer.microsoft.com/json-schemas/spfx-build/package-solution.schema.json",
  "solution": {
    "name": "webpart-gest-funcionarios-client-side-solution",
    "id": "8961e8c8-7a7b-4ac9-aafb-d5e32f4c85db",
    "version": "1.0.0.0",
    "includeClientSideAssets": true,
    "skipFeatureDeployment": true,
    "isDomainIsolated": false,
    "developer": {
      "name": "",
      "websiteUrl": "",
      "privacyUrl": "",
      "termsOfUseUrl": "",
      "mpnId": "Undefined-1.17.4"
    },
    "metadata": {
      "shortDescription": {
        "default": "webpartGestFuncionarios description"
      },
      "longDescription": {
        "default": "webpartGestFuncionarios description"
      },
      "screenshotPaths": [],
      "videoUrl": "",
      "categories": []
    },
    "features": [
      {
        "title": "webpart-gest-funcionarios Feature",
        "description": "The feature that activates elements of the webpart-gest-funcionarios solution.",
        "id": "79478e52-99b8-4159-a1d4-a566dd1f5928",
        "version": "1.0.0.0"
      }
    ]
  },
  "paths": {
    "zippedPackage": "solution/webpart-gest-funcionarios.sppkg"
  }
}
