{
  "$schema": "https://developer.microsoft.com/json-schemas/spfx-build/package-solution.schema.json",
  "solution": {
    "name": "webpart-eventos-client-side-solution",
    "id": "abdea93f-0c56-46fe-ab4d-16d949282cce",
    "version": "1.0.0.0",
    "includeClientSideAssets": true,
    "skipFeatureDeployment": true,
    "isDomainIsolated": false,
    "developer": {
      "name": "",
      "websiteUrl": "",
      "privacyUrl": "",
      "termsOfUseUrl": "",
      "mpnId": "Undefined-1.17.4"
    },
    "metadata": {
      "shortDescription": {
        "default": "webpartEventos description"
      },
      "longDescription": {
        "default": "webpartEventos description"
      },
      "screenshotPaths": [],
      "videoUrl": "",
      "categories": []
    },
    "features": [
      {
        "title": "webpart-eventos Feature",
        "description": "The feature that activates elements of the webpart-eventos solution.",
        "id": "c9a66415-e9aa-460d-9f72-46992b92d81a",
        "version": "1.0.0.0"
      }
    ]
  },
  "paths": {
    "zippedPackage": "solution/webpart-eventos.sppkg"
  }
}
