{
  "$schema": "https://developer.microsoft.com/json-schemas/spfx-build/config.2.0.schema.json",
  "version": "2.0",
  "bundles": {
    "webpart-chapter-web-part": {
      "components": [
        {
          "entrypoint": "./lib/webparts/webpartChapter/WebpartChapterWebPart.js",
          "manifest": "./src/webparts/webpartChapter/WebpartChapterWebPart.manifest.json"
        }
      ]
    }
  },
  "externals": {},
  "localizedResources": {
    "WebpartChapterWebPartStrings": "lib/webparts/webpartChapter/loc/{locale}.js"
  }
}
