{
  "$schema": "https://developer.microsoft.com/json-schemas/spfx-build/config.2.0.schema.json",
  "version": "2.0",
  "bundles": {
    "webpart-arquitetura-da-informacao-templates-web-part": {
      "components": [
        {
          "entrypoint": "./lib/webparts/webpartArquiteturaDaInformacaoTemplates/WebpartArquiteturaDaInformacaoTemplatesWebPart.js",
          "manifest": "./src/webparts/webpartArquiteturaDaInformacaoTemplates/WebpartArquiteturaDaInformacaoTemplatesWebPart.manifest.json"
        }
      ]
    }
  },
  "externals": {},
  "localizedResources": {
    "WebpartArquiteturaDaInformacaoTemplatesWebPartStrings": "lib/webparts/webpartArquiteturaDaInformacaoTemplates/loc/{locale}.js"
  }
}
