{
  "$schema": "https://developer.microsoft.com/json-schemas/spfx-build/deploy-azure-storage.schema.json",
  "workingDir": "./release/assets/",
  "account": "<!-- STORAGE ACCOUNT NAME -->",
  "container": "webpart-trilhas-do-conhecimento",
  "accessKey": "<!-- ACCESS KEY -->"
}