{
  "$schema": "https://developer.microsoft.com/json-schemas/spfx/client-side-web-part-manifest.schema.json",
  "id": "8baaf1e8-dda7-4a24-963d-346aee4fe204",
  "alias": "WebpartGraficoPadraoWebPart",
  "componentType": "WebPart",
  "version": "*",
  "manifestVersion": 2,
  "requiresCustomScript": false,
  "supportedHosts": [
    "SharePointWebPart",
    "TeamsPersonalApp",
    "TeamsTab",
    "SharePointFullPage"
  ],
  "supportsThemeVariants": true,
  "preconfiguredEntries": [
    {
      "groupId": "5c03119e-3074-46fd-976b-c60198311f70",
      "group": { "default": "Advanced" },
      "title": { "default": "Gráfico_Padrão" },
      "description": { "default": "Grafico Padrão a partir de um excel" },
      "officeFabricIconFontName": "Page",
      "properties": {
        "description": "webpartGraficoPadrao"
      }
    }
  ]
}
