{
  "$schema": "https://developer.microsoft.com/json-schemas/spfx-build/config.2.0.schema.json",
  "version": "2.0",
  "bundles": {
    "webpart-arquitetura-geral-2023-web-part": {
      "components": [
        {
          "entrypoint": "./lib/webparts/webpartArquiteturaGeral2023/WebpartArquiteturaGeral2023WebPart.js",
          "manifest": "./src/webparts/webpartArquiteturaGeral2023/WebpartArquiteturaGeral2023WebPart.manifest.json"
        }
      ]
    }
  },
  "externals": {},
  "localizedResources": {
    "WebpartArquiteturaGeral2023WebPartStrings": "lib/webparts/webpartArquiteturaGeral2023/loc/{locale}.js"
  }
}
