{
    "@context": {
        "type": "@type",
        "id": "@id",
        "ngsi-ld": "https://uri.etsi.org/ngsi-ld/",
        "fiware": "https://uri.fiware.org/ns/data-models#",
        "schema": "https://schema.org/",
        "rdfs": "http://www.w3.org/2000/01/rdf-schema#",
        "xsd": "http://www.w3.org/2001/XMLSchema#",
        "TrafficFlowObserved": "fiware:TrafficFlowObserved",
        "areaServed": {
            "@id": "fiware:areaServed",
            "@type": "xsd:string"
        },
        "averageVehicleSpeed": {
            "@id": "fiware:averageVehicleSpeed",
            "@type": "xsd:number"
        },
        "congested": {
            "@id": "fiware:congested",
            "@type": "xsd:boolean"
        },
        "dateCreated": {
            "@id": "fiware:dateCreated",
            "@type": "xs:dateTime"
        },
        "dateModified": {
            "@id": "fiware:dateModified",
            "@type": "xs:dateTime"
        },
        "dateObserved": {
            "@id": "fiware:dateObserved",
            "@type": "xsd:string"
        },
        "dateObservedFrom": {
            "@id": "fiware:dateObservedFrom",
            "@type": "xs:dateTime"
        },
        "dateObservedTo": {
            "@id": "fiware:dateObservedTo",
            "@type": "xs:dateTime"
        },
        "intensity": {
            "@id": "fiware:intensity",
            "@type": "xsd:number"
        },
        "levelOfService": {
            "@id": "fiware:levelOfService",
            "@type": "xsd:string"
        },
        "name": {
            "@id": "fiware:name",
            "@type": "xsd:string"
        },
        "occupancy": {
            "@id": "fiware:occupancy",
            "@type": "xsd:number"
        },
        "roadLoad": {
            "@id": "fiware:roadLoad",
            "@type": "xsd:number"
        },
        "saturationFlow": {
            "@id": "fiware:saturationFlow",
            "@type": "xsd:number"
        }
    },
    "@graph": [
        {
            "@id": "fiware:TrafficFlowObserved",
            "@type": "rdfs:Class",
            "rdfs:comment": [
                {
                    "@language": "en",
                    "@value": ""
                }
            ],
            "rdfs:label": [
                {
                    "@language": "en",
                    "@value": "TrafficFlowObserved"
                }
            ],
            "rdfs:subClassOf": {
                "@id": "schema:Thing"
            }
        }
    ]
}
