{
    "KPlugin": {
        "Category": "Appearance",
        "Description": "Sliding animation for Plasma popups",
        "EnabledByDefault": true,
        "Id": "slidingpopups",
        "License": "GPL",
        "Name": "Sliding popups"
    },
    "org.kde.kwin.effect": {
        "video": "https://files.kde.org/plasma/kwin/effect-videos/sliding_popups.mp4"
    }
}
