<?xml version="1.0" encoding="UTF-8"?>
<!DOCTYPE svg PUBLIC "-//W3C//DTD SVG 1.1//EN" "http://www.w3.org/Graphics/SVG/1.1/DTD/svg11.dtd">
<!-- Creator: CorelDRAW X7 -->
<svg xmlns="http://www.w3.org/2000/svg" xml:space="preserve" width="494.747mm" height="200.636mm" version="1.1" style="shape-rendering:geometricPrecision; text-rendering:geometricPrecision; image-rendering:optimizeQuality; fill-rule:evenodd; clip-rule:evenodd"
viewBox="0 0 12210 4952"
 xmlns:xlink="http://www.w3.org/1999/xlink">
 <defs>
  <style type="text/css">
   <![CDATA[
    .str4 {stroke:#373435;stroke-width:43.5291}
    .str0 {stroke:black;stroke-width:1.88055;stroke-linecap:round;stroke-linejoin:round}
    .str1 {stroke:#363636;stroke-width:130.602}
    .str2 {stroke:#373435;stroke-width:65.301;stroke-linecap:round;stroke-linejoin:round}
    .str3 {stroke:#373536;stroke-width:65.301;stroke-linecap:round;stroke-linejoin:round}
    .fil1 {fill:none}
    .fil5 {fill:#D2D3D5}
    .fil3 {fill:black}
    .fil0 {fill:#373536}
    .fil2 {fill:#57A9E2}
    .fil4 {fill:#E05757}
    .fil6 {fill:#373435;fill-rule:nonzero}
   ]]>
  </style>
 </defs>
 <g id="Layer_x0020_1">
  <metadata id="CorelCorpID_0Corel-Layer"/>
  <g id="drawing.emf">
   <line class="fil0 str0" x1="8833" y1="2159" x2="8833" y2= "2798" />
   <line class="fil1 str1" x1="8833" y1="2159" x2="8833" y2= "2798" />
   <line class="fil0" x1="6095" y1="2146" x2="6095" y2= "2786" />
   <line class="fil1 str1" x1="6095" y1="2146" x2="6095" y2= "2786" />
   <line class="fil0" x1="3367" y1="2146" x2="3367" y2= "2786" />
   <line class="fil1 str1" x1="3367" y1="2146" x2="3367" y2= "2786" />
   <polyline class="fil1 str2" points="1287,1435 1578,1435 1578,1785 1861,1086 1861,1785 2143,1086 2143,1785 2418,1086 2418,1435 2708,1435 "/>
   <path class="fil2 str3" d="M33 2064l0 -1257c0,-51 41,-93 93,-93l1051 0c51,0 93,42 93,93l0 1257c0,52 -42,93 -93,93l-1051 0c-52,0 -93,-41 -93,-93l0 0z"/>
   <path class="fil3" d="M592 1323l0 3c0,2 0,3 0,4 15,-21 29,-36 44,-46 15,-10 30,-15 45,-15 17,0 29,4 37,13 8,10 13,23 13,41 0,10 -2,24 -5,39l-22 91c-3,12 -4,22 -4,29 0,5 1,9 2,12 2,3 5,5 8,7 4,1 10,2 18,3l-2 13 -81 0 33 -130c2,-9 4,-19 6,-28 2,-10 3,-19 3,-27 0,-12 -2,-20 -7,-26 -4,-5 -11,-8 -20,-8 -7,0 -14,3 -22,9 -8,5 -17,13 -26,25 -9,11 -17,22 -22,33 -6,11 -10,24 -14,40l-23 112 -44 0 29 -130c4,-16 6,-27 7,-35 2,-8 2,-14 2,-20 0,-12 -2,-20 -6,-26 -4,-5 -11,-8 -20,-8 -7,0 -15,4 -23,9 -8,6 -17,14 -26,25 -9,12 -17,23 -22,35 -6,11 -10,24 -13,39l-23 111 -44 0 38 -175c1,-3 2,-9 4,-17 1,-8 2,-14 2,-19 0,-5 -1,-9 -2,-11 -2,-3 -4,-5 -8,-6 -3,-1 -9,-2 -17,-3l3 -13 58 -3 14 0 -17 67 3 1c16,-24 32,-41 47,-52 16,-12 31,-17 47,-17 16,0 29,4 37,14 9,9 13,22 13,40l0 0z"/>
   <path class="fil3" d="M880 1578c0,6 1,11 1,15 1,3 2,5 4,7 2,3 4,4 8,5 3,1 7,2 13,3 5,0 12,1 21,1l0 12 -123 0 0 -12c12,-1 21,-1 26,-2 5,-1 9,-2 12,-4 3,-3 5,-5 6,-8 1,-4 2,-9 2,-17l0 -135c0,-4 -1,-7 -2,-9 -2,-2 -4,-3 -7,-3 -4,0 -9,1 -15,5 -7,4 -15,9 -24,15l-8 -12 78 -47 9 0c0,11 -1,26 -1,44l0 142z"/>
   <path class="fil3" d="M1871 2173l8 0c6,0 11,-1 18,-3 5,-2 12,-5 19,-9 7,-5 17,-11 28,-21 9,-7 15,-13 20,-18 4,-5 7,-10 8,-13 2,-4 3,-8 3,-11 0,-9 -6,-13 -18,-14l3 -12 83 0 5 12c-14,13 -29,25 -45,37l-65 51 39 97c3,8 6,15 10,19 4,5 8,8 12,11 5,2 11,4 18,4l-2 12 -69 0 -37 -104c-2,-7 -4,-12 -6,-14 -2,-3 -4,-4 -6,-5 -2,-1 -6,-2 -10,-2l-20 0 -26 125 -44 0 66 -291c1,-9 3,-15 3,-19 1,-3 2,-7 2,-10 0,-4 0,-6 0,-9 0,-7 -2,-12 -6,-15 -4,-3 -12,-4 -23,-5l3 -13 65 -3 14 0 -50 223z"/>
   <path class="fil3" d="M2152 2377c0,6 1,11 1,14 1,4 2,6 4,8 2,2 4,4 8,5 3,1 8,2 13,3 5,0 12,1 21,1l0 12 -123 0 0 -12c12,-1 21,-1 26,-3 6,-1 9,-2 12,-4 3,-2 5,-4 6,-8 2,-3 2,-9 2,-16l0 -135c0,-4 -1,-7 -2,-9 -2,-3 -4,-4 -7,-4 -3,0 -8,2 -15,6 -7,3 -14,9 -24,15l-8 -13 78 -46 9 0c0,10 -1,25 -1,44l0 142z"/>
   <polyline class="fil1 str2" points="4003,1435 4293,1435 4293,1785 4576,1086 4576,1785 4859,1086 4859,1785 5134,1086 5134,1435 5424,1435 "/>
   <path class="fil2 str3" d="M2748 2064l0 -1257c0,-51 41,-93 93,-93l1051 0c52,0 94,42 94,93l0 1257c0,52 -42,93 -94,93l-1051 0c-52,0 -93,-41 -93,-93l0 0z"/>
   <path class="fil3" d="M3308 1323l0 3c0,2 -1,3 -1,4 15,-21 30,-36 45,-46 14,-10 29,-15 44,-15 17,0 29,4 38,13 8,10 12,23 12,41 0,10 -1,24 -5,39l-22 91c-2,12 -4,22 -4,29 0,5 1,9 3,12 1,3 4,5 8,7 3,1 9,2 18,3l-3 13 -80 0 32 -130c2,-9 5,-19 6,-28 2,-10 3,-19 3,-27 0,-12 -2,-20 -6,-26 -5,-5 -11,-8 -20,-8 -7,0 -15,3 -23,9 -8,5 -17,13 -25,25 -10,11 -17,22 -23,33 -6,11 -10,24 -14,40l-22 112 -45 0 30 -130c3,-16 6,-27 7,-35 1,-8 2,-14 2,-20 0,-12 -2,-20 -7,-26 -4,-5 -11,-8 -20,-8 -7,0 -15,4 -23,9 -8,6 -17,14 -25,25 -10,12 -17,23 -23,35 -5,11 -9,24 -12,39l-24 111 -44 0 39 -175c1,-3 2,-9 3,-17 1,-8 3,-14 3,-19 0,-5 -2,-9 -3,-11 -1,-3 -4,-5 -7,-6 -4,-1 -10,-2 -18,-3l3 -13 58 -3 15 0 -17 67 3 1c16,-24 31,-41 47,-52 15,-12 31,-17 47,-17 16,0 28,4 37,14 8,9 13,22 13,40l0 0z"/>
   <path class="fil3" d="M3597 1595c5,0 10,-1 13,-1 3,-1 5,-2 7,-3 3,-2 4,-4 5,-7 1,-2 3,-6 5,-11l14 0 -3 48 -137 0 0 -8c5,-12 11,-24 20,-36 8,-12 19,-26 34,-42 13,-14 22,-25 28,-33 6,-8 10,-14 14,-20 3,-6 5,-12 6,-16 1,-6 2,-11 2,-16 0,-8 -1,-16 -4,-22 -2,-6 -7,-11 -12,-15 -5,-4 -12,-5 -21,-5 -21,0 -34,11 -41,34l-20 0 0 -32c13,-6 25,-11 37,-13 12,-3 22,-5 32,-5 20,0 36,5 46,14 11,8 16,22 16,39 0,6 -1,11 -2,16 -1,5 -3,10 -5,15 -3,4 -6,10 -10,15 -5,5 -9,11 -14,17 -5,6 -14,15 -27,28 -21,23 -36,42 -46,59l63 0z"/>
   <path class="fil3" d="M4587 2173l8 0c5,0 11,-1 17,-3 6,-2 13,-5 19,-9 7,-5 17,-11 29,-21 9,-7 15,-13 19,-18 4,-5 7,-10 9,-13 1,-4 2,-8 2,-11 0,-9 -6,-13 -17,-14l3 -12 82 0 5 12c-14,13 -29,25 -45,37l-64 51 38 97c3,8 7,15 11,19 3,5 7,8 12,11 4,2 11,4 18,4l-3 12 -68 0 -37 -104c-3,-7 -5,-12 -7,-14 -1,-3 -3,-4 -5,-5 -2,-1 -6,-2 -11,-2l-19 0 -27 125 -44 0 66 -291c2,-9 3,-15 4,-19 0,-3 1,-7 1,-10 1,-4 1,-6 1,-9 0,-7 -2,-12 -6,-15 -5,-3 -12,-4 -24,-5l3 -13 65 -3 15 0 -50 223z"/>
   <path class="fil3" d="M4869 2393c5,0 10,0 13,-1 3,-1 6,-2 8,-3 2,-2 3,-3 4,-6 2,-3 3,-6 5,-11l14 0 -3 48 -136 0 0 -8c5,-12 11,-24 19,-36 8,-12 20,-26 34,-43 13,-14 22,-25 28,-32 6,-8 11,-15 14,-20 3,-6 5,-12 6,-17 2,-5 3,-10 3,-15 0,-9 -2,-16 -5,-22 -2,-7 -6,-12 -12,-15 -5,-4 -12,-6 -21,-6 -20,0 -34,11 -41,34l-20 0 0 -31c13,-7 25,-11 37,-14 12,-3 22,-4 32,-4 20,0 36,4 46,13 11,9 16,22 16,40 0,5 -1,11 -2,16 -1,4 -3,10 -5,14 -2,5 -6,10 -10,16 -4,5 -9,11 -14,17 -5,6 -14,15 -27,28 -20,22 -36,42 -46,58l63 0z"/>
   <polyline class="fil1 str2" points="6730,1435 7020,1435 7020,1785 7303,1086 7303,1785 7585,1086 7585,1785 7860,1086 7860,1435 8150,1435 "/>
   <path class="fil2 str3" d="M5475 2064l0 -1257c0,-51 41,-93 93,-93l1051 0c52,0 93,42 93,93l0 1257c0,52 -41,93 -93,93l-1051 0c-52,0 -93,-41 -93,-93l0 0z"/>
   <path class="fil3" d="M6034 1323l0 3c0,2 0,3 0,4 15,-21 29,-36 44,-46 15,-10 30,-15 46,-15 16,0 28,4 36,13 9,10 13,23 13,41 0,10 -2,24 -5,39l-22 91c-3,12 -4,22 -4,29 0,5 1,9 2,12 2,3 5,5 9,7 3,1 9,2 17,3l-2 13 -80 0 32 -130c2,-9 5,-19 6,-28 2,-10 3,-19 3,-27 0,-12 -2,-20 -7,-26 -4,-5 -11,-8 -20,-8 -6,0 -14,3 -22,9 -8,5 -17,13 -26,25 -9,11 -16,22 -22,33 -6,11 -10,24 -13,40l-24 112 -44 0 29 -130c4,-16 6,-27 8,-35 1,-8 2,-14 2,-20 0,-12 -3,-20 -7,-26 -4,-5 -11,-8 -20,-8 -7,0 -15,4 -23,9 -8,6 -17,14 -26,25 -9,12 -17,23 -22,35 -6,11 -10,24 -13,39l-23 111 -44 0 38 -175c1,-3 2,-9 4,-17 2,-8 2,-14 2,-19 0,-5 0,-9 -2,-11 -2,-3 -4,-5 -7,-6 -4,-1 -10,-2 -18,-3l3 -13 58 -3 14 0 -17 67 4 1c15,-24 31,-41 46,-52 16,-12 31,-17 47,-17 17,0 29,4 38,14 8,9 12,22 12,40l0 0z"/>
   <path class="fil3" d="M6233 1442l0 -32c13,-6 25,-10 36,-13 11,-3 22,-5 33,-5 12,0 23,2 33,6 9,4 16,10 21,16 5,8 7,17 7,27 0,9 -1,17 -5,25 -4,6 -9,13 -16,18 -7,5 -16,10 -27,16l0 1c7,1 14,3 20,6 6,3 12,7 17,11 5,5 8,11 11,18 3,6 4,13 4,22 0,12 -2,24 -8,34 -5,9 -14,17 -25,23 -12,6 -26,9 -42,9 -10,0 -20,-1 -31,-3 -11,-3 -21,-5 -30,-9l0 -35 19 0c5,11 10,20 16,25 6,5 15,8 26,8 14,0 25,-4 33,-12 7,-8 11,-19 11,-35 0,-16 -5,-28 -15,-37 -10,-9 -24,-13 -43,-13l-14 0 0 -14c14,-1 27,-4 37,-9 10,-4 18,-11 23,-19 5,-7 7,-16 7,-25 0,-13 -3,-22 -9,-28 -7,-7 -17,-10 -29,-10 -11,0 -19,2 -25,8 -7,6 -12,14 -15,26l-20 0z"/>
   <path class="fil3" d="M7314 2173l7 0c6,0 11,-1 18,-3 6,-2 12,-5 19,-9 7,-5 17,-11 28,-21 9,-7 16,-13 20,-18 4,-5 7,-10 8,-13 2,-4 3,-8 3,-11 0,-9 -6,-13 -17,-14l2 -12 83 0 5 12c-14,13 -29,25 -45,37l-65 51 39 97c3,8 6,15 10,19 4,5 8,8 13,11 4,2 10,4 17,4l-2 12 -68 0 -38 -104c-2,-7 -4,-12 -6,-14 -2,-3 -3,-4 -6,-5 -2,-1 -6,-2 -10,-2l-19 0 -27 125 -44 0 66 -291c2,-9 3,-15 3,-19 1,-3 2,-7 2,-10 0,-4 1,-6 1,-9 0,-7 -3,-12 -7,-15 -4,-3 -12,-4 -23,-5l3 -13 65 -3 14 0 -49 223z"/>
   <path class="fil3" d="M7505 2240l0 -31c13,-6 25,-11 36,-14 12,-3 22,-4 33,-4 12,0 23,2 33,6 9,4 16,9 21,16 5,8 8,16 8,26 0,10 -2,18 -6,25 -3,7 -9,14 -16,19 -7,5 -15,10 -26,15l0 2c7,1 13,3 19,6 6,3 12,7 17,11 5,5 9,11 11,17 4,7 5,14 5,22 0,13 -3,24 -8,34 -6,10 -14,18 -26,24 -11,6 -25,8 -42,8 -10,0 -20,-1 -31,-3 -11,-2 -21,-5 -30,-8l0 -35 20 0c4,11 9,20 15,25 6,5 15,8 26,8 14,0 25,-5 33,-12 7,-8 11,-20 11,-35 0,-17 -5,-29 -15,-37 -9,-9 -24,-13 -43,-13l-14 0 0 -15c14,-1 27,-3 37,-8 11,-5 18,-11 23,-19 5,-8 8,-16 8,-25 0,-13 -4,-22 -10,-29 -7,-6 -16,-10 -29,-10 -10,0 -18,3 -25,8 -6,6 -12,15 -15,26l-20 0z"/>
   <path class="fil2 str3" d="M8192 2064l0 -1257c0,-51 42,-93 93,-93l1051 0c52,0 93,42 93,93l0 1257c0,52 -41,93 -93,93l-1051 0c-51,0 -93,-41 -93,-93l0 0z"/>
   <path class="fil3" d="M8751 1323l0 3c0,2 0,3 0,4 15,-21 30,-36 44,-46 15,-10 30,-15 46,-15 16,0 28,4 36,13 9,10 13,23 13,41 0,10 -2,24 -5,39l-21 91c-4,12 -5,22 -5,29 0,5 1,9 3,12 2,3 4,5 8,7 3,1 9,2 17,3l-2 13 -80 0 32 -130c3,-9 5,-19 6,-28 2,-10 3,-19 3,-27 0,-12 -2,-20 -6,-26 -5,-5 -11,-8 -21,-8 -6,0 -14,3 -22,9 -8,5 -17,13 -26,25 -9,11 -16,22 -22,33 -6,11 -10,24 -13,40l-24 112 -44 0 29 -130c4,-16 6,-27 8,-35 1,-8 2,-14 2,-20 0,-12 -3,-20 -7,-26 -4,-5 -11,-8 -20,-8 -7,0 -14,4 -23,9 -8,6 -16,14 -26,25 -9,12 -17,23 -22,35 -6,11 -10,24 -13,39l-23 111 -44 0 39 -175c0,-3 1,-9 3,-17 2,-8 2,-14 2,-19 0,-5 0,-9 -2,-11 -2,-3 -4,-5 -7,-6 -4,-1 -10,-2 -18,-3l3 -13 58 -3 15 0 -18 67 4 1c15,-24 31,-41 47,-52 15,-12 30,-17 46,-17 17,0 29,4 38,14 8,9 12,22 12,40l0 0z"/>
   <path class="fil3" d="M9009 1613c8,-2 12,-4 14,-6 3,-2 4,-5 5,-9 1,-4 1,-10 1,-18l0 -28 -92 0 0 -12 97 -146 23 0 0 142 4 0c6,0 11,0 14,-1 2,-1 5,-2 6,-5 3,-2 4,-6 6,-12l12 0 -2 34 -40 0 0 28c0,7 1,13 1,16 0,3 1,6 3,8 1,2 3,4 5,5 2,1 6,3 11,4l0 8 -68 0 0 -8zm-45 -77l65 0 0 -41c0,-10 0,-22 1,-35 0,-13 0,-23 1,-29l-2 0 -65 103 0 2z"/>
   <polyline class="fil1 str2" points="4035,3516 4326,3516 4326,3866 4608,3167 4608,3866 4891,3167 4891,3866 5166,3167 5166,3516 5456,3516 "/>
   <path class="fil4 str3" d="M2781 4145l0 -1257c0,-52 41,-93 93,-93l1051 0c51,0 93,41 93,93l0 1257c0,51 -42,93 -93,93l-1051 0c-52,0 -93,-42 -93,-93l0 0z"/>
   <path class="fil3" d="M3340 3404l0 3c0,2 0,3 0,4 15,-21 29,-36 44,-46 15,-10 30,-15 45,-15 17,0 29,4 37,14 8,8 13,22 13,40 0,11 -2,24 -5,39l-22 91c-3,12 -4,22 -4,29 0,5 1,9 2,12 2,3 4,5 8,6 4,2 10,3 18,4l-2 13 -81 0 33 -130c2,-9 4,-19 6,-28 2,-10 3,-19 3,-27 0,-12 -2,-21 -7,-25 -4,-6 -11,-9 -20,-9 -7,0 -14,3 -22,9 -8,5 -17,13 -26,25 -9,11 -17,22 -23,33 -5,11 -9,24 -13,40l-23 112 -44 0 29 -130c4,-16 6,-28 7,-35 2,-8 2,-14 2,-20 0,-12 -2,-21 -6,-25 -5,-6 -11,-9 -20,-9 -7,0 -15,3 -23,9 -8,5 -17,14 -26,25 -9,12 -17,23 -23,35 -5,11 -9,24 -12,39l-24 111 -43 0 38 -175c1,-3 2,-9 4,-17 1,-7 2,-14 2,-19 0,-5 -1,-9 -2,-11 -2,-3 -4,-5 -8,-6 -3,-1 -9,-2 -17,-3l3 -13 58 -2 14 0 -17 65 3 1c16,-23 32,-40 47,-51 16,-12 31,-17 47,-17 16,0 29,4 37,14 9,9 13,22 13,40l0 0z"/>
   <path class="fil3" d="M3538 3693l0 -35 19 0c4,11 9,20 16,25 6,5 15,8 26,8 14,0 25,-5 33,-13 7,-9 11,-23 11,-40 0,-12 -2,-22 -6,-29 -4,-8 -9,-13 -16,-17 -7,-3 -14,-5 -23,-5 -8,0 -14,0 -20,1 -5,1 -11,3 -17,4l-14 -7 0 -109 92 0c4,0 6,-1 8,-1 2,-1 3,-2 4,-3 1,-1 2,-4 4,-7l12 0 -2 38 -96 0 0 73c6,-2 12,-4 19,-6 7,-1 14,-1 21,-1 13,0 24,3 35,8 10,5 17,13 23,23 5,10 8,21 8,34 0,15 -3,27 -9,38 -6,11 -15,19 -27,24 -12,6 -26,9 -41,9 -20,0 -40,-4 -60,-12l0 0z"/>
   <path class="fil3" d="M4619 4254l8 0c6,0 11,-1 18,-3 5,-2 12,-5 19,-9 7,-5 16,-12 28,-21 9,-7 15,-13 19,-18 5,-5 8,-10 9,-13 2,-4 2,-8 2,-11 0,-8 -5,-13 -17,-14l3 -13 83 0 5 13c-15,13 -30,25 -45,38l-65 50 38 96c4,9 7,16 11,20 4,5 8,9 12,11 5,2 11,3 18,4l-2 12 -69 0 -37 -105c-3,-6 -4,-11 -6,-13 -2,-2 -4,-4 -6,-5 -2,-1 -6,-2 -10,-2l-20 0 -26 125 -44 0 66 -291c1,-9 3,-15 3,-19 1,-4 2,-7 2,-10 0,-3 0,-7 0,-9 0,-7 -2,-12 -6,-15 -4,-3 -12,-5 -23,-5l3 -13 64 -3 15 0 -50 223z"/>
   <path class="fil3" d="M4870 4493c8,-2 12,-4 14,-6 2,-2 4,-5 5,-10 1,-3 1,-10 1,-18l0 -27 -92 0 0 -13 97 -146 23 0 0 143 4 0c6,0 11,0 14,-1 2,-1 5,-3 6,-6 2,-2 4,-6 6,-11l12 0 -2 34 -40 0 0 27c0,8 1,13 1,16 0,4 1,7 2,9 1,2 4,3 6,5 2,1 6,3 11,4l0 8 -68 0 0 -8zm-45 -77l65 0 0 -42c0,-9 0,-21 0,-34 1,-13 1,-23 2,-29l-2 0 -65 103 0 2z"/>
   <polyline class="fil1 str2" points="6751,3516 7041,3516 7041,3866 7324,3167 7324,3866 7607,3167 7607,3866 7881,3167 7881,3516 8172,3516 "/>
   <path class="fil4 str3" d="M5496 4145l0 -1257c0,-52 41,-93 93,-93l1051 0c52,0 94,41 94,93l0 1257c0,51 -42,93 -94,93l-1051 0c-52,0 -93,-42 -93,-93l0 0z"/>
   <path class="fil3" d="M6055 3404l0 3c0,2 0,3 0,4 15,-21 29,-36 44,-46 15,-10 30,-15 45,-15 17,0 29,4 37,14 9,8 13,22 13,40 0,11 -2,24 -5,39l-22 91c-2,12 -4,22 -4,29 0,5 1,9 3,12 1,3 4,5 8,6 3,2 9,3 17,4l-2 13 -80 0 32 -130c2,-9 4,-19 6,-28 2,-10 3,-19 3,-27 0,-12 -2,-21 -7,-25 -4,-6 -11,-9 -19,-9 -7,0 -15,3 -23,9 -8,5 -17,13 -26,25 -9,11 -16,22 -22,33 -6,11 -10,24 -14,40l-23 112 -44 0 29 -130c4,-16 7,-28 8,-35 1,-8 2,-14 2,-20 0,-12 -2,-21 -7,-25 -4,-6 -11,-9 -20,-9 -7,0 -15,3 -23,9 -8,5 -17,14 -26,25 -9,12 -16,23 -22,35 -5,11 -10,24 -13,39l-23 111 -44 0 39 -175c1,-3 2,-9 3,-17 1,-7 2,-14 2,-19 0,-5 -1,-9 -2,-11 -1,-3 -4,-5 -7,-6 -4,-1 -10,-2 -18,-3l3 -13 58 -2 15 0 -17 65 3 1c16,-23 31,-40 46,-51 16,-12 32,-17 47,-17 17,0 29,4 38,14 8,9 12,22 12,40l0 0z"/>
   <path class="fil3" d="M6379 3482l0 9c-17,0 -32,3 -45,11 -14,7 -25,17 -33,31 -9,14 -14,31 -18,51l1 1c10,-7 19,-12 28,-15 9,-3 18,-5 29,-5 12,0 23,3 32,9 9,5 15,13 20,23 4,10 6,21 6,34 0,15 -2,27 -8,38 -5,11 -14,20 -26,26 -11,7 -25,10 -42,10 -24,0 -43,-8 -55,-23 -12,-15 -19,-37 -19,-66 0,-20 4,-38 10,-55 6,-18 15,-33 26,-45 11,-13 25,-23 40,-31 15,-7 30,-11 47,-12l7 9zm-49 100c-6,0 -11,2 -16,3 -5,1 -10,3 -14,5 -5,2 -9,5 -13,9 -2,1 -3,2 -3,3 -1,2 -2,5 -2,8 -1,3 -1,9 -1,16 0,21 4,37 11,48 7,11 17,17 32,17 8,0 15,-2 21,-5 6,-3 10,-6 14,-12 3,-5 5,-11 7,-17 1,-7 3,-14 3,-22 0,-17 -4,-30 -11,-38 -7,-10 -16,-15 -28,-15l0 0z"/>
   <path class="fil3" d="M7334 4254l9 0c5,0 11,-1 17,-3 6,-2 13,-5 19,-9 7,-5 17,-12 29,-21 8,-7 15,-13 19,-18 4,-5 7,-10 9,-13 1,-4 2,-8 2,-11 0,-8 -6,-13 -17,-14l2 -13 83 0 5 13c-14,13 -29,25 -45,38l-65 50 39 96c3,9 7,16 10,20 4,5 8,9 12,11 5,2 11,3 19,4l-3 12 -68 0 -37 -105c-3,-6 -5,-11 -7,-13 -1,-2 -3,-4 -5,-5 -2,-1 -6,-2 -11,-2l-19 0 -27 125 -44 0 66 -291c2,-9 3,-15 4,-19 0,-4 1,-7 1,-10 1,-3 1,-7 1,-9 0,-7 -2,-12 -7,-15 -4,-3 -12,-5 -23,-5l3 -13 64 -3 16 0 -51 223z"/>
   <path class="fil3" d="M7525 4492l0 -35 20 0c4,11 8,19 15,25 7,5 15,7 26,7 15,0 26,-4 34,-13 7,-9 11,-22 11,-39 0,-12 -2,-22 -6,-30 -4,-7 -9,-13 -16,-16 -7,-4 -15,-6 -24,-6 -8,0 -14,1 -19,2 -6,1 -12,2 -18,4l-13 -8 0 -109 92 0c3,0 6,0 7,0 2,-1 3,-2 5,-3 1,-2 2,-4 3,-8l13 0 -2 39 -96 0 0 72c6,-2 12,-4 19,-5 7,-1 13,-2 20,-2 13,0 25,3 35,9 10,5 18,13 24,23 5,9 8,21 8,34 0,15 -3,27 -9,38 -7,11 -15,18 -27,24 -12,5 -26,9 -42,9 -19,0 -39,-5 -60,-12l0 0z"/>
   <polyline class="fil1 str2" points="9477,3516 9768,3516 9768,3866 10051,3167 10051,3866 10333,3167 10333,3866 10608,3167 10608,3516 10898,3516 "/>
   <path class="fil4 str3" d="M8223 4145l0 -1257c0,-52 41,-93 93,-93l1051 0c52,0 93,41 93,93l0 1257c0,51 -41,93 -93,93l-1051 0c-52,0 -93,-42 -93,-93l0 0z"/>
   <path class="fil3" d="M8782 3404l0 3c0,2 0,3 0,4 15,-21 29,-36 44,-46 15,-10 30,-15 45,-15 17,0 29,4 37,14 8,8 13,22 13,40 0,11 -2,24 -5,39l-22 91c-3,12 -4,22 -4,29 0,5 1,9 2,12 2,3 5,5 8,6 4,2 10,3 18,4l-2 13 -81 0 33 -130c2,-9 4,-19 6,-28 2,-10 3,-19 3,-27 0,-12 -2,-21 -7,-25 -4,-6 -11,-9 -20,-9 -6,0 -14,3 -22,9 -8,5 -17,13 -26,25 -9,11 -16,22 -22,33 -6,11 -10,24 -14,40l-23 112 -44 0 29 -130c4,-16 6,-28 8,-35 1,-8 1,-14 1,-20 0,-12 -2,-21 -6,-25 -4,-6 -11,-9 -20,-9 -7,0 -15,3 -23,9 -8,5 -17,14 -26,25 -9,12 -17,23 -23,35 -5,11 -9,24 -12,39l-23 111 -44 0 38 -175c1,-3 2,-9 4,-17 1,-7 2,-14 2,-19 0,-5 -1,-9 -2,-11 -2,-3 -4,-5 -7,-6 -4,-1 -10,-2 -18,-3l3 -13 58 -2 14 0 -17 65 3 1c16,-23 32,-40 47,-51 16,-12 31,-17 47,-17 16,0 29,4 38,14 8,9 12,22 12,40l0 0z"/>
   <path class="fil3" d="M9125 3484l-97 219 -24 0 0 -8 89 -189 0 -2 -72 0c-5,0 -9,0 -11,1 -3,1 -5,2 -7,3 -2,2 -3,4 -5,7 -1,2 -2,7 -4,15l-15 0 4 -54 142 0 0 8z"/>
   <path class="fil3" d="M10061 4254l8 0c6,0 11,-1 18,-3 5,-2 12,-5 19,-9 7,-5 17,-12 28,-21 9,-7 16,-13 20,-18 4,-5 7,-10 8,-13 2,-4 3,-8 3,-11 0,-8 -6,-13 -18,-14l3 -13 83 0 5 13c-15,13 -29,25 -45,38l-65 50 38 96c4,9 7,16 11,20 4,5 8,9 12,11 5,2 11,3 18,4l-2 12 -69 0 -37 -105c-2,-6 -4,-11 -6,-13 -2,-2 -4,-4 -6,-5 -2,-1 -6,-2 -10,-2l-19 0 -27 125 -44 0 66 -291c1,-9 3,-15 3,-19 1,-4 2,-7 2,-10 0,-3 1,-7 1,-9 0,-7 -3,-12 -7,-15 -4,-3 -12,-5 -23,-5l3 -13 64 -3 15 0 -50 223z"/>
   <path class="fil3" d="M10378 4281l0 8c-17,0 -32,3 -45,11 -13,7 -24,18 -33,32 -9,14 -15,31 -18,50l2 1c9,-6 18,-11 27,-14 9,-3 18,-5 29,-5 12,0 23,3 32,8 9,6 15,13 20,23 4,10 6,22 6,35 0,14 -2,27 -8,38 -5,11 -14,20 -26,26 -11,6 -25,10 -42,10 -24,0 -43,-8 -55,-23 -12,-15 -18,-38 -18,-67 0,-19 3,-38 9,-55 6,-17 15,-32 26,-45 12,-13 25,-23 40,-30 15,-7 31,-11 47,-12l7 9zm-50 100c-5,0 -10,1 -15,2 -5,1 -10,3 -14,6 -5,2 -9,5 -13,8 -1,2 -2,3 -3,4 -1,2 -2,5 -2,8 -1,3 -1,8 -1,16 0,21 4,37 11,48 7,11 18,16 32,16 8,0 15,-1 21,-4 5,-3 10,-7 14,-12 3,-5 5,-11 7,-18 2,-6 2,-14 2,-22 0,-16 -3,-29 -10,-38 -7,-9 -16,-14 -29,-14l0 0z"/>
   <path class="fil4 str3" d="M10940 4145l0 -1257c0,-52 41,-93 93,-93l1051 0c52,0 93,41 93,93l0 1257c0,51 -41,93 -93,93l-1051 0c-52,0 -93,-42 -93,-93l0 0z"/>
   <path class="fil3" d="M11499 3404l0 3c0,2 0,3 0,4 15,-21 29,-36 44,-46 15,-10 30,-15 46,-15 16,0 28,4 36,14 8,8 13,22 13,40 0,11 -2,24 -5,39l-22 91c-3,12 -4,22 -4,29 0,5 1,9 2,12 2,3 5,5 9,6 3,2 9,3 17,4l-2 13 -80 0 32 -130c2,-9 5,-19 6,-28 2,-10 3,-19 3,-27 0,-12 -2,-21 -7,-25 -4,-6 -11,-9 -20,-9 -6,0 -14,3 -22,9 -8,5 -17,13 -26,25 -9,11 -16,22 -22,33 -6,11 -10,24 -13,40l-24 112 -44 0 29 -130c4,-16 6,-28 8,-35 1,-8 2,-14 2,-20 0,-12 -3,-21 -7,-25 -4,-6 -11,-9 -20,-9 -7,0 -14,3 -23,9 -8,5 -17,14 -26,25 -9,12 -17,23 -22,35 -6,11 -10,24 -13,39l-23 111 -44 0 38 -175c1,-3 2,-9 4,-17 2,-7 2,-14 2,-19 0,-5 0,-9 -2,-11 -2,-3 -4,-5 -7,-6 -4,-1 -10,-2 -18,-3l3 -13 58 -2 14 0 -17 65 4 1c15,-23 31,-40 46,-51 16,-12 31,-17 47,-17 17,0 29,4 38,14 8,9 12,22 12,40l0 0z"/>
   <path class="fil3" d="M11803 3582l1 3c12,4 22,12 28,21 6,9 9,20 9,34 0,13 -3,24 -9,34 -6,10 -15,17 -27,23 -12,5 -25,8 -41,8 -15,0 -28,-3 -39,-8 -11,-5 -19,-12 -26,-21 -5,-9 -9,-21 -9,-33 0,-10 2,-19 5,-26 4,-7 8,-13 13,-17 5,-4 12,-9 21,-13l-1 -2c-24,-10 -36,-28 -36,-53 0,-11 4,-21 10,-30 6,-9 15,-16 27,-21 11,-6 24,-8 38,-8 16,0 29,2 40,7 11,4 19,11 24,19 6,9 9,19 9,31 0,12 -3,22 -9,31 -6,9 -15,16 -28,21l0 0zm-79 -51c0,7 0,12 2,18 1,6 4,11 8,15 3,4 8,8 13,10 6,3 12,4 20,4 9,0 17,-2 23,-5 6,-4 11,-9 14,-16 3,-7 4,-15 4,-24 0,-10 -1,-18 -5,-25 -3,-8 -8,-13 -14,-16 -7,-3 -14,-5 -22,-5 -14,0 -25,4 -32,11 -8,8 -11,19 -11,33l0 0zm-2 108c0,8 1,15 2,21 2,6 5,11 8,16 4,4 9,8 14,10 6,3 13,5 21,5 9,0 16,-2 23,-6 6,-4 11,-9 15,-16 3,-8 5,-16 5,-26 0,-11 -2,-20 -6,-28 -3,-7 -9,-13 -15,-17 -7,-5 -15,-6 -23,-6 -8,0 -15,1 -21,4 -6,2 -10,5 -13,9 -4,5 -6,10 -8,16 -1,6 -2,12 -2,18l0 0z"/>
  </g>
  <circle class="fil5 str4" cx="651" cy="270" r="248"/>
  <circle class="fil5 str4" cx="3411" cy="4682" r="248"/>
  <circle class="fil5 str4" cx="3367" cy="270" r="248"/>
  <circle class="fil5 str4" cx="6126" cy="4682" r="248"/>
  <circle class="fil5 str4" cx="6082" cy="270" r="248"/>
  <circle class="fil5 str4" cx="8841" cy="4682" r="248"/>
  <circle class="fil5 str4" cx="8797" cy="270" r="248"/>
  <circle class="fil5 str4" cx="11557" cy="4682" r="248"/>
  <path class="fil6" d="M720 409l0 -13 -13 0c-38,0 -39,-4 -39,-20l0 -234c0,-10 0,-11 -9,-11 -26,26 -63,26 -77,26l0 13c9,0 34,0 55,-10l0 216c0,15 -1,20 -39,20l-13 0 0 13c15,-1 51,-1 68,-1 16,0 53,0 67,1z"/>
  <path class="fil6" d="M3492 4737c0,-50 -34,-92 -79,-92 -20,0 -38,7 -53,22l0 -82c8,3 22,6 35,6 52,0 81,-39 81,-44 0,-2 -1,-5 -4,-5 0,0 -1,0 -3,2 -9,3 -29,12 -57,12 -17,0 -36,-3 -56,-12 -3,-1 -5,-1 -5,-1 -4,0 -4,3 -4,10l0 124c0,7 0,10 6,10 3,0 4,-1 5,-3 5,-7 20,-30 54,-30 22,0 32,20 36,27 6,16 7,32 7,53 0,14 0,40 -10,57 -10,16 -25,27 -45,27 -30,0 -54,-22 -61,-47 1,1 2,1 7,1 14,0 21,-10 21,-20 0,-10 -7,-21 -21,-21 -6,0 -20,3 -20,23 0,35 28,76 75,76 49,0 91,-40 91,-93l0 0z"/>
  <path class="fil6" d="M3448 336l-10 0c-2,13 -5,31 -9,38 -3,3 -31,3 -40,3l-75 0 44 -43c65,-58 90,-80 90,-122 0,-48 -37,-81 -88,-81 -48,0 -79,38 -79,75 0,24 21,24 23,24 7,0 21,-5 21,-22 0,-11 -7,-22 -22,-22 -3,0 -4,0 -5,0 9,-27 32,-42 56,-42 38,0 56,34 56,68 0,33 -21,66 -44,92l-80 90c-5,4 -5,5 -5,15l155 0 12 -73z"/>
  <path class="fil6" d="M6211 4736c0,-54 -37,-94 -84,-94 -28,0 -44,22 -52,42l0 -10c0,-106 52,-121 73,-121 10,0 28,2 37,17 -6,0 -23,0 -23,18 0,13 10,20 19,20 7,0 20,-4 20,-20 0,-25 -19,-46 -54,-46 -53,0 -109,54 -109,147 0,111 48,141 87,141 46,0 86,-39 86,-94zm-38 -1c0,20 0,41 -7,56 -12,25 -32,27 -41,27 -26,0 -39,-25 -42,-31 -7,-20 -7,-53 -7,-61 0,-32 13,-74 51,-74 7,0 26,0 39,26 7,15 7,37 7,57z"/>
  <path class="fil6" d="M6167 338c0,-35 -27,-67 -70,-76 34,-11 59,-41 59,-74 0,-34 -37,-57 -77,-57 -43,0 -74,25 -74,57 0,13 9,21 21,21 13,0 21,-9 21,-21 0,-21 -19,-21 -26,-21 13,-20 41,-26 56,-26 17,0 40,9 40,47 0,5 -1,29 -12,48 -12,20 -26,21 -37,21 -3,1 -13,2 -16,2 -3,0 -6,0 -6,5 0,4 3,4 10,4l18 0c34,0 50,29 50,70 0,56 -29,69 -47,69 -18,0 -50,-8 -64,-32 14,2 27,-7 27,-23 0,-15 -11,-24 -23,-24 -10,0 -24,6 -24,25 0,38 39,65 85,65 51,0 89,-38 89,-80z"/>
  <path class="fil6" d="M8938 4552l-102 0c-51,0 -51,-6 -53,-14l-11 0 -13 86 10 0c1,-6 5,-33 11,-38 2,-2 35,-2 40,-2l87 0 -47 66c-37,56 -51,114 -51,157 0,4 0,23 19,23 19,0 19,-19 19,-23l0 -21c0,-23 1,-46 5,-69 1,-9 7,-45 26,-71l56 -80c4,-5 4,-6 4,-14z"/>
  <path class="fil6" d="M8888 340l0 -13 -42 0 0 -190c0,-8 0,-11 -7,-11 -3,0 -5,0 -8,5l-128 196 0 13 111 0 0 36c0,16 -1,20 -32,20l-9 0 0 13c18,-1 39,-1 57,-1 17,0 40,0 57,1l0 -13 -9 0c-31,0 -32,-4 -32,-20l0 -36 42 0zm-72 -13l-102 0 102 -156 0 156z"/>
  <path class="fil6" d="M11641 4751c0,-15 -4,-34 -20,-52 -8,-9 -15,-13 -41,-29 30,-16 50,-38 50,-65 0,-39 -37,-63 -75,-63 -42,0 -76,31 -76,70 0,8 1,27 19,46 4,5 20,16 30,23 -24,12 -60,35 -60,77 0,44 43,72 87,72 47,0 86,-35 86,-79zm-29 -146c0,24 -16,44 -42,58l-51 -33c-20,-13 -21,-27 -21,-34 0,-26 27,-43 57,-43 30,0 57,22 57,52zm9 161c0,31 -32,52 -66,52 -36,0 -66,-26 -66,-60 0,-25 13,-51 49,-71l51 33c12,8 32,20 32,46z"/>
 </g>
</svg>
