<?xml version="1.0" encoding="UTF-8"?>
<!DOCTYPE svg PUBLIC "-//W3C//DTD SVG 1.0//EN" "http://www.w3.org/TR/2001/REC-SVG-20010904/DTD/svg10.dtd">
<!-- Creator: CorelDRAW X7 -->
<svg xmlns="http://www.w3.org/2000/svg" xml:space="preserve" width="100%" height="100%" version="1.0" style="shape-rendering:geometricPrecision; text-rendering:geometricPrecision; image-rendering:optimizeQuality; fill-rule:evenodd; clip-rule:evenodd"
viewBox="0 0 9329 3020"
 xmlns:xlink="http://www.w3.org/1999/xlink">
 <defs>
  <style type="text/css">
   <![CDATA[
    .str0 {stroke:#373435;stroke-width:20}
    .fil12 {fill:none}
    .fil11 {fill:#FCDEDF}
    .fil13 {fill:#FFF2C1}
    .fil3 {fill:#373435;fill-rule:nonzero}
    .fil7 {fill:url(#id0)}
    .fil6 {fill:url(#id1)}
    .fil0 {fill:url(#id2)}
    .fil8 {fill:url(#id3)}
    .fil5 {fill:url(#id4)}
    .fil4 {fill:url(#id5)}
    .fil9 {fill:url(#id6)}
    .fil1 {fill:url(#id7)}
    .fil10 {fill:url(#id8)}
    .fil2 {fill:url(#id9)}
   ]]>
  </style>
  <linearGradient id="id0" gradientUnits="userSpaceOnUse" x1="1085" y1="85" x2="1435" y2="435">
   <stop offset="0" style="stop-opacity:1; stop-color:#F1F1F2"/>
   <stop offset="0.701961" style="stop-opacity:1; stop-color:#E9F0E0"/>
   <stop offset="1" style="stop-opacity:1; stop-color:#E1EECD"/>
  </linearGradient>
  <linearGradient id="id1" gradientUnits="userSpaceOnUse" xlink:href="#id0" x1="585" y1="85" x2="935" y2="435">
  </linearGradient>
  <linearGradient id="id2" gradientUnits="userSpaceOnUse" x1="7318.63" y1="725.12" x2="7818.63" y2="725.12">
   <stop offset="0" style="stop-opacity:1; stop-color:#F1F1F2"/>
   <stop offset="0.701961" style="stop-opacity:1; stop-color:#F6E8E9"/>
   <stop offset="0.501961" style="stop-opacity:1; stop-color:#E1EECB"/>
   <stop offset="1" style="stop-opacity:1; stop-color:#FCDEDF"/>
  </linearGradient>
  <linearGradient id="id3" gradientUnits="objectBoundingBox" xlink:href="#id0" x1="15.0009%" y1="15.0009%" x2="84.9991%" y2="84.9991%">
  </linearGradient>
  <linearGradient id="id4" gradientUnits="objectBoundingBox" xlink:href="#id0" x1="15.0009%" y1="15.0009%" x2="84.9991%" y2="84.9991%">
  </linearGradient>
  <linearGradient id="id5" gradientUnits="userSpaceOnUse" xlink:href="#id0" x1="10" y1="260" x2="510" y2="260">
  </linearGradient>
  <linearGradient id="id6" gradientUnits="userSpaceOnUse" xlink:href="#id0" x1="1585" y1="85" x2="1935" y2="435">
  </linearGradient>
  <linearGradient id="id7" gradientUnits="objectBoundingBox" xlink:href="#id2" x1="15.0009%" y1="15.0009%" x2="84.9991%" y2="84.9991%">
  </linearGradient>
  <linearGradient id="id8" gradientUnits="objectBoundingBox" xlink:href="#id0" x1="15.0009%" y1="15.0009%" x2="84.9991%" y2="84.9991%">
  </linearGradient>
  <linearGradient id="id9" gradientUnits="objectBoundingBox" xlink:href="#id2" x1="15.0009%" y1="15.0009%" x2="84.9991%" y2="84.9991%">
  </linearGradient>
 </defs>
 <g id="Layer_x0020_1">
  <metadata id="CorelCorpID_0Corel-Layer"/>
  <rect class="fil0 str0" x="7319" y="475" width="500" height="500"/>
  <rect class="fil1 str0" x="7319" y="975" width="500" height="500"/>
  <rect class="fil1 str0" x="7319" y="1475" width="500" height="500"/>
  <rect class="fil1 str0" x="7319" y="1975" width="500" height="500"/>
  <rect class="fil1 str0" x="7819" y="475" width="500" height="500"/>
  <rect class="fil1 str0" x="7819" y="975" width="500" height="500"/>
  <rect class="fil1 str0" x="7819" y="1475" width="500" height="500"/>
  <rect class="fil1 str0" x="7819" y="1975" width="500" height="500"/>
  <rect class="fil1 str0" x="8319" y="475" width="500" height="500"/>
  <rect class="fil1 str0" x="8319" y="975" width="500" height="500"/>
  <rect class="fil1 str0" x="8319" y="1475" width="500" height="500"/>
  <rect class="fil1 str0" x="8319" y="1975" width="500" height="500"/>
  <rect class="fil2 str0" x="8819" y="475" width="500" height="500"/>
  <rect class="fil2 str0" x="8819" y="975" width="500" height="500"/>
  <rect class="fil2 str0" x="8819" y="1475" width="500" height="500"/>
  <rect class="fil2 str0" x="8819" y="1975" width="500" height="500"/>
  <path class="fil3" d="M7375 799c0,3 3,3 4,3 11,0 23,0 34,0 11,0 22,0 33,0 2,0 6,0 6,-5 0,-3 -2,-3 -8,-3 -16,0 -16,-3 -16,-5 0,-1 0,-2 1,-6l19 -76 77 0 -18 75c-3,9 -4,12 -24,12 -4,0 -7,0 -7,5 0,3 3,3 4,3 10,0 22,0 33,0 11,0 23,0 34,0 2,0 5,0 5,-5 0,-3 -2,-3 -7,-3 -17,0 -17,-3 -17,-5 0,0 0,-2 1,-7l38 -152c3,-9 5,-12 23,-12 6,0 8,0 8,-5 0,-3 -2,-3 -4,-3 -10,0 -22,1 -33,1 -11,0 -23,-1 -34,-1 -2,0 -5,0 -5,5 0,3 2,3 7,3 9,0 17,0 17,5 0,1 0,2 -1,6l-18 69 -77 0 17 -68c2,-9 5,-12 22,-12 6,0 9,0 9,-5 0,-3 -2,-3 -4,-3 -11,0 -22,1 -33,1 -12,0 -23,-1 -34,-1 -2,0 -6,0 -6,5 0,3 3,3 8,3 9,0 16,0 16,5 0,1 0,2 -1,6l-38 153c-2,9 -4,12 -23,12 -5,0 -8,0 -8,5z"/>
  <path id="1" class="fil3" d="M7586 720c5,0 17,0 28,-6l0 110c0,7 -1,10 -20,10l-6 0 0 7c7,-1 25,-1 34,-1 8,0 27,0 34,1l0 -7 -7 0c-19,0 -19,-2 -19,-10l0 -119c0,-5 0,-5 -5,-5 -13,13 -32,13 -39,13l0 7z"/>
  <path id="2" class="fil3" d="M7692 720c4,0 17,0 28,-6l0 110c0,7 -1,10 -20,10l-7 0 0 7c8,-1 26,-1 35,-1 8,0 27,0 34,1l0 -7 -7 0c-19,0 -19,-2 -19,-10l0 -119c0,-5 0,-5 -5,-5 -13,13 -32,13 -39,13l0 7z"/>
  <path class="fil3" d="M7375 1299c0,3 3,3 4,3 11,0 23,0 34,0 11,0 22,0 33,0 2,0 6,0 6,-5 0,-3 -2,-3 -8,-3 -16,0 -16,-3 -16,-5 0,-1 0,-2 1,-6l19 -76 77 0 -18 75c-3,9 -4,12 -24,12 -4,0 -7,0 -7,5 0,3 3,3 4,3 10,0 22,0 33,0 11,0 23,0 34,0 2,0 5,0 5,-5 0,-3 -2,-3 -7,-3 -17,0 -17,-3 -17,-5 0,0 0,-2 1,-7l38 -152c3,-9 5,-12 23,-12 6,0 8,0 8,-5 0,-3 -2,-3 -4,-3 -10,0 -22,1 -33,1 -11,0 -23,-1 -34,-1 -2,0 -5,0 -5,5 0,3 2,3 7,3 9,0 17,0 17,5 0,1 0,2 -1,6l-18 69 -77 0 17 -68c2,-9 5,-12 22,-12 6,0 9,0 9,-5 0,-3 -2,-3 -4,-3 -11,0 -22,1 -33,1 -12,0 -23,-1 -34,-1 -2,0 -6,0 -6,5 0,3 3,3 8,3 9,0 16,0 16,5 0,1 0,2 -1,6l-38 153c-2,9 -4,12 -23,12 -5,0 -8,0 -8,5z"/>
  <path id="1" class="fil3" d="M7578 1341l79 0 6 -37 -6 0c-1,6 -2,15 -4,19 -2,1 -16,1 -21,1l-38 0 23 -22c33,-29 46,-40 46,-61 0,-24 -20,-41 -45,-41 -24,0 -40,19 -40,38 0,12 11,12 11,12 4,0 11,-3 11,-11 0,-6 -4,-11 -11,-11 -2,0 -2,0 -3,0 5,-14 17,-22 29,-22 19,0 28,17 28,35 0,17 -10,33 -22,46l-41 46c-2,2 -2,2 -2,8z"/>
  <path id="2" class="fil3" d="M7692 1220c4,0 17,0 28,-6l0 110c0,7 -1,10 -20,10l-7 0 0 7c8,-1 26,-1 35,-1 8,0 27,0 34,1l0 -7 -7 0c-19,0 -19,-2 -19,-10l0 -119c0,-5 0,-5 -5,-5 -13,13 -32,13 -39,13l0 7z"/>
  <path class="fil3" d="M7375 1797c0,3 3,3 4,3 11,0 23,-1 34,-1 11,0 22,1 33,1 2,0 6,0 6,-5 0,-4 -2,-4 -8,-4 -16,0 -16,-2 -16,-4 0,-2 0,-2 1,-6l19 -77 77 0 -18 76c-3,9 -4,11 -24,11 -4,0 -7,0 -7,6 0,3 3,3 4,3 10,0 22,-1 33,-1 11,0 23,1 34,1 2,0 5,0 5,-5 0,-4 -2,-4 -7,-4 -17,0 -17,-2 -17,-4 0,-1 0,-3 1,-7l38 -153c3,-9 5,-11 23,-11 6,0 8,0 8,-5 0,-3 -2,-4 -4,-4 -10,0 -22,1 -33,1 -11,0 -23,-1 -34,-1 -2,0 -5,0 -5,6 0,3 2,3 7,3 9,0 17,0 17,5 0,1 0,1 -1,5l-18 69 -77 0 17 -68c2,-9 5,-11 22,-11 6,0 9,0 9,-5 0,-3 -2,-4 -4,-4 -11,0 -22,1 -33,1 -12,0 -23,-1 -34,-1 -2,0 -6,0 -6,6 0,3 3,3 8,3 9,0 16,0 16,5 0,1 0,1 -1,5l-38 154c-2,9 -4,11 -23,11 -5,0 -8,0 -8,6z"/>
  <path id="1" class="fil3" d="M7576 1810c0,19 20,33 43,33 26,0 45,-19 45,-41 0,-17 -13,-34 -35,-38 17,-6 29,-21 29,-38 0,-17 -18,-29 -38,-29 -22,0 -38,13 -38,29 0,7 5,11 11,11 6,0 11,-5 11,-11 0,-10 -10,-10 -13,-10 6,-11 20,-13 28,-13 8,0 20,4 20,23 0,3 0,15 -6,24 -6,11 -13,11 -19,11 -1,1 -7,1 -8,1 -2,0 -3,0 -3,3 0,2 1,2 5,2l9 0c18,0 25,14 25,35 0,29 -14,35 -24,35 -9,0 -24,-4 -32,-16 8,1 14,-4 14,-12 0,-7 -6,-12 -12,-12 -5,0 -12,3 -12,13z"/>
  <path id="2" class="fil3" d="M7692 1717c4,0 17,0 28,-5l0 110c0,7 -1,10 -20,10l-7 0 0 6c8,0 26,0 35,0 8,0 27,0 34,0l0 -6 -7 0c-19,0 -19,-3 -19,-10l0 -119c0,-5 0,-6 -5,-6 -13,14 -32,14 -39,14l0 6z"/>
  <path class="fil3" d="M7375 2299c0,3 3,3 4,3 11,0 23,0 34,0 11,0 22,0 33,0 2,0 6,0 6,-5 0,-3 -2,-3 -8,-3 -16,0 -16,-3 -16,-5 0,-1 0,-2 1,-6l19 -76 77 0 -18 75c-3,9 -4,12 -24,12 -4,0 -7,0 -7,5 0,3 3,3 4,3 10,0 22,0 33,0 11,0 23,0 34,0 2,0 5,0 5,-5 0,-3 -2,-3 -7,-3 -17,0 -17,-3 -17,-5 0,0 0,-2 1,-7l38 -152c3,-9 5,-12 23,-12 6,0 8,0 8,-5 0,-3 -2,-3 -4,-3 -10,0 -22,1 -33,1 -11,0 -23,-1 -34,-1 -2,0 -5,0 -5,5 0,3 2,3 7,3 9,0 17,0 17,5 0,1 0,2 -1,6l-18 69 -77 0 17 -68c2,-9 5,-12 22,-12 6,0 9,0 9,-5 0,-3 -2,-3 -4,-3 -11,0 -22,1 -33,1 -12,0 -23,-1 -34,-1 -2,0 -6,0 -6,5 0,3 3,3 8,3 9,0 16,0 16,5 0,1 0,2 -1,6l-38 153c-2,9 -4,12 -23,12 -5,0 -8,0 -8,5z"/>
  <path id="1" class="fil3" d="M7573 2306l57 0 0 18c0,8 -1,10 -16,10l-5 0 0 7c9,-1 20,-1 29,-1 9,0 20,0 29,1l0 -7 -5 0c-16,0 -16,-2 -16,-10l0 -18 21 0 0 -7 -21 0 0 -96c0,-4 0,-6 -3,-6 -2,0 -3,0 -5,3l-65 99 0 7zm6 -7l52 -79 0 79 -52 0z"/>
  <path id="2" class="fil3" d="M7692 2220c4,0 17,0 28,-6l0 110c0,7 -1,10 -20,10l-7 0 0 7c8,-1 26,-1 35,-1 8,0 27,0 34,1l0 -7 -7 0c-19,0 -19,-2 -19,-10l0 -119c0,-5 0,-5 -5,-5 -13,13 -32,13 -39,13l0 7z"/>
  <path class="fil3" d="M7872 799c0,3 3,3 4,3 11,0 22,0 33,0 12,0 23,0 34,0 2,0 6,0 6,-5 0,-3 -2,-3 -8,-3 -16,0 -16,-3 -16,-5 0,-1 0,-2 1,-6l19 -76 77 0 -19 75c-2,9 -4,12 -23,12 -4,0 -7,0 -7,5 0,3 3,3 4,3 10,0 22,0 33,0 11,0 23,0 34,0 2,0 5,0 5,-5 0,-3 -2,-3 -8,-3 -16,0 -16,-3 -16,-5 0,0 0,-2 1,-7l38 -152c3,-9 5,-12 23,-12 6,0 8,0 8,-5 0,-3 -2,-3 -4,-3 -11,0 -22,1 -33,1 -11,0 -23,-1 -34,-1 -2,0 -5,0 -5,5 0,3 2,3 7,3 9,0 17,0 17,5 0,1 0,2 -2,6l-17 69 -77 0 17 -68c2,-9 4,-12 22,-12 6,0 9,0 9,-5 0,-3 -2,-3 -4,-3 -11,0 -23,1 -34,1 -11,0 -23,-1 -34,-1 -1,0 -5,0 -5,5 0,3 2,3 8,3 8,0 16,0 16,5 0,1 0,2 -1,6l-38 153c-2,9 -4,12 -23,12 -5,0 -8,0 -8,5z"/>
  <path id="1" class="fil3" d="M8083 720c4,0 17,0 28,-6l0 110c0,7 -1,10 -20,10l-7 0 0 7c8,-1 26,-1 35,-1 8,0 27,0 34,1l0 -7 -7 0c-19,0 -19,-2 -19,-10l0 -119c0,-5 0,-5 -5,-5 -13,13 -32,13 -39,13l0 7z"/>
  <path id="2" class="fil3" d="M8181 841l78 0 6 -37 -5 0c-1,6 -3,15 -5,19 -1,1 -15,1 -20,1l-38 0 22 -22c33,-29 46,-40 46,-61 0,-24 -19,-41 -45,-41 -24,0 -39,19 -39,38 0,12 10,12 11,12 4,0 11,-3 11,-11 0,-6 -4,-11 -11,-11 -2,0 -2,0 -3,0 5,-14 16,-22 29,-22 19,0 28,17 28,35 0,17 -11,33 -22,46l-41 46c-2,2 -2,2 -2,8z"/>
  <path class="fil3" d="M7872 1299c0,3 3,3 4,3 11,0 22,0 33,0 12,0 23,0 34,0 2,0 6,0 6,-5 0,-3 -2,-3 -8,-3 -16,0 -16,-3 -16,-5 0,-1 0,-2 1,-6l19 -76 77 0 -19 75c-2,9 -4,12 -23,12 -4,0 -7,0 -7,5 0,3 3,3 4,3 10,0 22,0 33,0 11,0 23,0 34,0 2,0 5,0 5,-5 0,-3 -2,-3 -8,-3 -16,0 -16,-3 -16,-5 0,0 0,-2 1,-7l38 -152c3,-9 5,-12 23,-12 6,0 8,0 8,-5 0,-3 -2,-3 -4,-3 -11,0 -22,1 -33,1 -11,0 -23,-1 -34,-1 -2,0 -5,0 -5,5 0,3 2,3 7,3 9,0 17,0 17,5 0,1 0,2 -2,6l-17 69 -77 0 17 -68c2,-9 4,-12 22,-12 6,0 9,0 9,-5 0,-3 -2,-3 -4,-3 -11,0 -23,1 -34,1 -11,0 -23,-1 -34,-1 -1,0 -5,0 -5,5 0,3 2,3 8,3 8,0 16,0 16,5 0,1 0,2 -1,6l-38 153c-2,9 -4,12 -23,12 -5,0 -8,0 -8,5z"/>
  <path id="1" class="fil3" d="M8075 1341l78 0 6 -37 -5 0c-1,6 -2,15 -5,19 -1,1 -15,1 -20,1l-38 0 23 -22c33,-29 45,-40 45,-61 0,-24 -19,-41 -45,-41 -23,0 -39,19 -39,38 0,12 10,12 11,12 4,0 11,-3 11,-11 0,-6 -4,-11 -11,-11 -2,0 -2,0 -3,0 5,-14 16,-22 29,-22 19,0 28,17 28,35 0,17 -11,33 -22,46l-41 46c-2,2 -2,2 -2,8z"/>
  <path id="2" class="fil3" d="M8181 1341l78 0 6 -37 -5 0c-1,6 -3,15 -5,19 -1,1 -15,1 -20,1l-38 0 22 -22c33,-29 46,-40 46,-61 0,-24 -19,-41 -45,-41 -24,0 -39,19 -39,38 0,12 10,12 11,12 4,0 11,-3 11,-11 0,-6 -4,-11 -11,-11 -2,0 -2,0 -3,0 5,-14 16,-22 29,-22 19,0 28,17 28,35 0,17 -11,33 -22,46l-41 46c-2,2 -2,2 -2,8z"/>
  <path class="fil3" d="M7872 1797c0,3 3,3 4,3 11,0 22,-1 33,-1 12,0 23,1 34,1 2,0 6,0 6,-5 0,-4 -2,-4 -8,-4 -16,0 -16,-2 -16,-4 0,-2 0,-2 1,-6l19 -77 77 0 -19 76c-2,9 -4,11 -23,11 -4,0 -7,0 -7,6 0,3 3,3 4,3 10,0 22,-1 33,-1 11,0 23,1 34,1 2,0 5,0 5,-5 0,-4 -2,-4 -8,-4 -16,0 -16,-2 -16,-4 0,-1 0,-3 1,-7l38 -153c3,-9 5,-11 23,-11 6,0 8,0 8,-5 0,-3 -2,-4 -4,-4 -11,0 -22,1 -33,1 -11,0 -23,-1 -34,-1 -2,0 -5,0 -5,6 0,3 2,3 7,3 9,0 17,0 17,5 0,1 0,1 -2,5l-17 69 -77 0 17 -68c2,-9 4,-11 22,-11 6,0 9,0 9,-5 0,-3 -2,-4 -4,-4 -11,0 -23,1 -34,1 -11,0 -23,-1 -34,-1 -1,0 -5,0 -5,6 0,3 2,3 8,3 8,0 16,0 16,5 0,1 0,1 -1,5l-38 154c-2,9 -4,11 -23,11 -5,0 -8,0 -8,6z"/>
  <path id="1" class="fil3" d="M8073 1810c0,19 20,33 43,33 26,0 45,-19 45,-41 0,-17 -13,-34 -35,-38 17,-6 29,-21 29,-38 0,-17 -18,-29 -39,-29 -21,0 -37,13 -37,29 0,7 5,11 11,11 6,0 10,-5 10,-11 0,-10 -9,-10 -13,-10 7,-11 21,-13 29,-13 8,0 20,4 20,23 0,3 -1,15 -6,24 -6,11 -14,11 -19,11 -2,1 -7,1 -8,1 -2,0 -3,0 -3,3 0,2 1,2 5,2l9 0c17,0 25,14 25,35 0,29 -14,35 -24,35 -9,0 -25,-4 -32,-16 7,1 14,-4 14,-12 0,-7 -6,-12 -12,-12 -5,0 -12,3 -12,13z"/>
  <path id="2" class="fil3" d="M8181 1838l78 0 6 -37 -5 0c-1,7 -3,16 -5,19 -1,2 -15,2 -20,2l-38 0 22 -22c33,-29 46,-41 46,-62 0,-24 -19,-41 -45,-41 -24,0 -39,20 -39,39 0,11 10,11 11,11 4,0 11,-2 11,-11 0,-5 -4,-11 -11,-11 -2,0 -2,0 -3,0 5,-13 16,-21 29,-21 19,0 28,17 28,34 0,17 -11,34 -22,47l-41 45c-2,3 -2,3 -2,8z"/>
  <path class="fil3" d="M7872 2299c0,3 3,3 4,3 11,0 22,0 33,0 12,0 23,0 34,0 2,0 6,0 6,-5 0,-3 -2,-3 -8,-3 -16,0 -16,-3 -16,-5 0,-1 0,-2 1,-6l19 -76 77 0 -19 75c-2,9 -4,12 -23,12 -4,0 -7,0 -7,5 0,3 3,3 4,3 10,0 22,0 33,0 11,0 23,0 34,0 2,0 5,0 5,-5 0,-3 -2,-3 -8,-3 -16,0 -16,-3 -16,-5 0,0 0,-2 1,-7l38 -152c3,-9 5,-12 23,-12 6,0 8,0 8,-5 0,-3 -2,-3 -4,-3 -11,0 -22,1 -33,1 -11,0 -23,-1 -34,-1 -2,0 -5,0 -5,5 0,3 2,3 7,3 9,0 17,0 17,5 0,1 0,2 -2,6l-17 69 -77 0 17 -68c2,-9 4,-12 22,-12 6,0 9,0 9,-5 0,-3 -2,-3 -4,-3 -11,0 -23,1 -34,1 -11,0 -23,-1 -34,-1 -1,0 -5,0 -5,5 0,3 2,3 8,3 8,0 16,0 16,5 0,1 0,2 -1,6l-38 153c-2,9 -4,12 -23,12 -5,0 -8,0 -8,5z"/>
  <path id="1" class="fil3" d="M8070 2306l57 0 0 18c0,8 -1,10 -17,10l-4 0 0 7c9,-1 20,-1 29,-1 8,0 20,0 28,1l0 -7 -4 0c-16,0 -16,-2 -16,-10l0 -18 21 0 0 -7 -21 0 0 -96c0,-4 0,-6 -4,-6 -1,0 -2,0 -4,3l-65 99 0 7zm6 -7l52 -79 0 79 -52 0z"/>
  <path id="2" class="fil3" d="M8181 2341l78 0 6 -37 -5 0c-1,6 -3,15 -5,19 -1,1 -15,1 -20,1l-38 0 22 -22c33,-29 46,-40 46,-61 0,-24 -19,-41 -45,-41 -24,0 -39,19 -39,38 0,12 10,12 11,12 4,0 11,-3 11,-11 0,-6 -4,-11 -11,-11 -2,0 -2,0 -3,0 5,-14 16,-22 29,-22 19,0 28,17 28,35 0,17 -11,33 -22,46l-41 46c-2,2 -2,2 -2,8z"/>
  <path class="fil3" d="M8371 797c0,3 3,3 4,3 11,0 22,-1 34,-1 11,0 22,1 33,1 2,0 6,0 6,-5 0,-4 -2,-4 -8,-4 -16,0 -16,-2 -16,-4 0,-2 0,-2 1,-6l19 -77 77 0 -19 76c-2,9 -3,11 -23,11 -4,0 -7,0 -7,6 0,3 3,3 4,3 10,0 22,-1 33,-1 11,0 23,1 34,1 2,0 5,0 5,-5 0,-4 -2,-4 -7,-4 -17,0 -17,-2 -17,-4 0,-1 0,-3 1,-7l38 -153c3,-9 5,-11 23,-11 6,0 8,0 8,-5 0,-3 -2,-4 -4,-4 -10,0 -22,1 -33,1 -11,0 -23,-1 -34,-1 -2,0 -5,0 -5,6 0,3 2,3 7,3 9,0 17,0 17,5 0,1 0,1 -1,5l-18 69 -77 0 17 -68c2,-9 4,-11 22,-11 6,0 9,0 9,-5 0,-3 -2,-4 -4,-4 -11,0 -23,1 -34,1 -11,0 -22,-1 -33,-1 -2,0 -6,0 -6,6 0,3 3,3 8,3 9,0 16,0 16,5 0,1 0,1 -1,5l-38 154c-2,9 -4,11 -23,11 -5,0 -8,0 -8,6z"/>
  <path id="1" class="fil3" d="M8582 717c5,0 17,0 28,-5l0 110c0,7 -1,10 -20,10l-6 0 0 6c7,0 25,0 34,0 8,0 27,0 34,0l0 -6 -7 0c-19,0 -19,-3 -19,-10l0 -119c0,-5 0,-6 -5,-6 -13,14 -32,14 -39,14l0 6z"/>
  <path id="2" class="fil3" d="M8678 810c0,19 20,33 43,33 26,0 45,-19 45,-41 0,-17 -13,-34 -35,-38 17,-6 29,-21 29,-38 0,-17 -18,-29 -39,-29 -21,0 -37,13 -37,29 0,7 5,11 11,11 6,0 10,-5 10,-11 0,-10 -9,-10 -13,-10 7,-11 21,-13 28,-13 9,0 21,4 21,23 0,3 -1,15 -6,24 -6,11 -14,11 -19,11 -2,1 -7,1 -8,1 -2,0 -3,0 -3,3 0,2 1,2 5,2l9 0c17,0 25,14 25,35 0,29 -14,35 -24,35 -9,0 -25,-4 -32,-16 7,1 14,-4 14,-12 0,-7 -6,-12 -12,-12 -5,0 -12,3 -12,13z"/>
  <path class="fil3" d="M8371 1297c0,3 3,3 4,3 11,0 22,-1 34,-1 11,0 22,1 33,1 2,0 6,0 6,-5 0,-4 -2,-4 -8,-4 -16,0 -16,-2 -16,-4 0,-2 0,-2 1,-6l19 -77 77 0 -19 76c-2,9 -3,11 -23,11 -4,0 -7,0 -7,6 0,3 3,3 4,3 10,0 22,-1 33,-1 11,0 23,1 34,1 2,0 5,0 5,-5 0,-4 -2,-4 -7,-4 -17,0 -17,-2 -17,-4 0,-1 0,-3 1,-7l38 -153c3,-9 5,-11 23,-11 6,0 8,0 8,-5 0,-3 -2,-4 -4,-4 -10,0 -22,1 -33,1 -11,0 -23,-1 -34,-1 -2,0 -5,0 -5,6 0,3 2,3 7,3 9,0 17,0 17,5 0,1 0,1 -1,5l-18 69 -77 0 17 -68c2,-9 4,-11 22,-11 6,0 9,0 9,-5 0,-3 -2,-4 -4,-4 -11,0 -23,1 -34,1 -11,0 -22,-1 -33,-1 -2,0 -6,0 -6,6 0,3 3,3 8,3 9,0 16,0 16,5 0,1 0,1 -1,5l-38 154c-2,9 -4,11 -23,11 -5,0 -8,0 -8,6z"/>
  <path id="1" class="fil3" d="M8574 1338l79 0 5 -37 -5 0c-1,7 -2,16 -4,19 -2,2 -16,2 -21,2l-38 0 23 -22c33,-29 45,-41 45,-62 0,-24 -19,-41 -44,-41 -24,0 -40,20 -40,39 0,11 11,11 11,11 4,0 11,-2 11,-11 0,-5 -4,-11 -11,-11 -2,0 -2,0 -3,0 5,-13 17,-21 29,-21 19,0 28,17 28,34 0,17 -10,34 -22,47l-41 45c-2,3 -2,3 -2,8z"/>
  <path id="2" class="fil3" d="M8678 1310c0,19 20,33 43,33 26,0 45,-19 45,-41 0,-17 -13,-34 -35,-38 17,-6 29,-21 29,-38 0,-17 -18,-29 -39,-29 -21,0 -37,13 -37,29 0,7 5,11 11,11 6,0 10,-5 10,-11 0,-10 -9,-10 -13,-10 7,-11 21,-13 28,-13 9,0 21,4 21,23 0,3 -1,15 -6,24 -6,11 -14,11 -19,11 -2,1 -7,1 -8,1 -2,0 -3,0 -3,3 0,2 1,2 5,2l9 0c17,0 25,14 25,35 0,29 -14,35 -24,35 -9,0 -25,-4 -32,-16 7,1 14,-4 14,-12 0,-7 -6,-12 -12,-12 -5,0 -12,3 -12,13z"/>
  <path class="fil3" d="M8371 1797c0,3 3,3 4,3 11,0 22,-1 34,-1 11,0 22,1 33,1 2,0 6,0 6,-5 0,-4 -2,-4 -8,-4 -16,0 -16,-2 -16,-4 0,-2 0,-2 1,-6l19 -77 77 0 -19 76c-2,9 -3,11 -23,11 -4,0 -7,0 -7,6 0,3 3,3 4,3 10,0 22,-1 33,-1 11,0 23,1 34,1 2,0 5,0 5,-5 0,-4 -2,-4 -7,-4 -17,0 -17,-2 -17,-4 0,-1 0,-3 1,-7l38 -153c3,-9 5,-11 23,-11 6,0 8,0 8,-5 0,-3 -2,-4 -4,-4 -10,0 -22,1 -33,1 -11,0 -23,-1 -34,-1 -2,0 -5,0 -5,6 0,3 2,3 7,3 9,0 17,0 17,5 0,1 0,1 -1,5l-18 69 -77 0 17 -68c2,-9 4,-11 22,-11 6,0 9,0 9,-5 0,-3 -2,-4 -4,-4 -11,0 -23,1 -34,1 -11,0 -22,-1 -33,-1 -2,0 -6,0 -6,6 0,3 3,3 8,3 9,0 16,0 16,5 0,1 0,1 -1,5l-38 154c-2,9 -4,11 -23,11 -5,0 -8,0 -8,6z"/>
  <path id="1" class="fil3" d="M8572 1810c0,19 20,33 43,33 26,0 45,-19 45,-41 0,-17 -13,-34 -35,-38 17,-6 29,-21 29,-38 0,-17 -18,-29 -38,-29 -22,0 -38,13 -38,29 0,7 5,11 11,11 6,0 11,-5 11,-11 0,-10 -10,-10 -13,-10 6,-11 20,-13 28,-13 8,0 20,4 20,23 0,3 0,15 -6,24 -6,11 -13,11 -19,11 -1,1 -7,1 -8,1 -2,0 -3,0 -3,3 0,2 1,2 5,2l9 0c18,0 25,14 25,35 0,29 -14,35 -24,35 -9,0 -25,-4 -32,-16 7,1 14,-4 14,-12 0,-7 -6,-12 -12,-12 -5,0 -12,3 -12,13z"/>
  <path id="2" class="fil3" d="M8678 1810c0,19 20,33 43,33 26,0 45,-19 45,-41 0,-17 -13,-34 -35,-38 17,-6 29,-21 29,-38 0,-17 -18,-29 -39,-29 -21,0 -37,13 -37,29 0,7 5,11 11,11 6,0 10,-5 10,-11 0,-10 -9,-10 -13,-10 7,-11 21,-13 28,-13 9,0 21,4 21,23 0,3 -1,15 -6,24 -6,11 -14,11 -19,11 -2,1 -7,1 -8,1 -2,0 -3,0 -3,3 0,2 1,2 5,2l9 0c17,0 25,14 25,35 0,29 -14,35 -24,35 -9,0 -25,-4 -32,-16 7,1 14,-4 14,-12 0,-7 -6,-12 -12,-12 -5,0 -12,3 -12,13z"/>
  <path class="fil3" d="M8371 2297c0,3 3,3 4,3 11,0 22,-1 34,-1 11,0 22,1 33,1 2,0 6,0 6,-5 0,-4 -2,-4 -8,-4 -16,0 -16,-2 -16,-4 0,-2 0,-2 1,-6l19 -77 77 0 -19 76c-2,9 -3,11 -23,11 -4,0 -7,0 -7,6 0,3 3,3 4,3 10,0 22,-1 33,-1 11,0 23,1 34,1 2,0 5,0 5,-5 0,-4 -2,-4 -7,-4 -17,0 -17,-2 -17,-4 0,-1 0,-3 1,-7l38 -153c3,-9 5,-11 23,-11 6,0 8,0 8,-5 0,-3 -2,-4 -4,-4 -10,0 -22,1 -33,1 -11,0 -23,-1 -34,-1 -2,0 -5,0 -5,6 0,3 2,3 7,3 9,0 17,0 17,5 0,1 0,1 -1,5l-18 69 -77 0 17 -68c2,-9 4,-11 22,-11 6,0 9,0 9,-5 0,-3 -2,-4 -4,-4 -11,0 -23,1 -34,1 -11,0 -22,-1 -33,-1 -2,0 -6,0 -6,6 0,3 3,3 8,3 9,0 16,0 16,5 0,1 0,1 -1,5l-38 154c-2,9 -4,11 -23,11 -5,0 -8,0 -8,6z"/>
  <path id="1" class="fil3" d="M8569 2303l57 0 0 19c0,7 -1,10 -16,10l-5 0 0 6c9,0 20,0 29,0 9,0 20,0 29,0l0 -6 -5 0c-16,0 -16,-3 -16,-10l0 -19 21 0 0 -6 -21 0 0 -97c0,-4 0,-5 -3,-5 -2,0 -3,0 -5,2l-65 100 0 6zm6 -6l52 -79 0 79 -52 0z"/>
  <path id="2" class="fil3" d="M8678 2310c0,19 20,33 43,33 26,0 45,-19 45,-41 0,-17 -13,-34 -35,-38 17,-6 29,-21 29,-38 0,-17 -18,-29 -39,-29 -21,0 -37,13 -37,29 0,7 5,11 11,11 6,0 10,-5 10,-11 0,-10 -9,-10 -13,-10 7,-11 21,-13 28,-13 9,0 21,4 21,23 0,3 -1,15 -6,24 -6,11 -14,11 -19,11 -2,1 -7,1 -8,1 -2,0 -3,0 -3,3 0,2 1,2 5,2l9 0c17,0 25,14 25,35 0,29 -14,35 -24,35 -9,0 -25,-4 -32,-16 7,1 14,-4 14,-12 0,-7 -6,-12 -12,-12 -5,0 -12,3 -12,13z"/>
  <path class="fil3" d="M8870 799c0,3 3,3 4,3 10,0 22,0 33,0 11,0 23,0 34,0 2,0 5,0 5,-5 0,-3 -2,-3 -7,-3 -17,0 -17,-3 -17,-5 0,-1 0,-2 1,-6l19 -76 78 0 -19 75c-2,9 -4,12 -23,12 -5,0 -8,0 -8,5 0,3 3,3 4,3 11,0 22,0 33,0 12,0 23,0 34,0 2,0 6,0 6,-5 0,-3 -2,-3 -8,-3 -16,0 -16,-3 -16,-5 0,0 0,-2 1,-7l38 -152c2,-9 4,-12 22,-12 6,0 9,0 9,-5 0,-3 -2,-3 -4,-3 -11,0 -23,1 -34,1 -11,0 -22,-1 -33,-1 -2,0 -6,0 -6,5 0,3 3,3 8,3 9,0 16,0 16,5 0,1 0,2 -1,6l-17 69 -77 0 16 -68c3,-9 5,-12 23,-12 6,0 8,0 8,-5 0,-3 -2,-3 -4,-3 -10,0 -22,1 -33,1 -11,0 -23,-1 -34,-1 -2,0 -5,0 -5,5 0,3 2,3 7,3 9,0 17,0 17,5 0,1 0,2 -1,6l-38 153c-3,9 -4,12 -24,12 -4,0 -7,0 -7,5z"/>
  <path id="1" class="fil3" d="M9081 720c4,0 17,0 28,-6l0 110c0,7 -1,10 -20,10l-7 0 0 7c7,-1 26,-1 34,-1 9,0 27,0 35,1l0 -7 -7 0c-19,0 -20,-2 -20,-10l0 -119c0,-5 0,-5 -5,-5 -13,13 -31,13 -38,13l0 7z"/>
  <path id="2" class="fil3" d="M9174 806l56 0 0 18c0,8 0,10 -16,10l-5 0 0 7c9,-1 20,-1 29,-1 9,0 20,0 29,1l0 -7 -5 0c-15,0 -16,-2 -16,-10l0 -18 21 0 0 -7 -21 0 0 -96c0,-4 0,-6 -3,-6 -2,0 -3,0 -4,3l-65 99 0 7zm6 -7l51 -79 0 79 -51 0z"/>
  <path class="fil3" d="M8870 1299c0,3 3,3 4,3 10,0 22,0 33,0 11,0 23,0 34,0 2,0 5,0 5,-5 0,-3 -2,-3 -7,-3 -17,0 -17,-3 -17,-5 0,-1 0,-2 1,-6l19 -76 78 0 -19 75c-2,9 -4,12 -23,12 -5,0 -8,0 -8,5 0,3 3,3 4,3 11,0 22,0 33,0 12,0 23,0 34,0 2,0 6,0 6,-5 0,-3 -2,-3 -8,-3 -16,0 -16,-3 -16,-5 0,0 0,-2 1,-7l38 -152c2,-9 4,-12 22,-12 6,0 9,0 9,-5 0,-3 -2,-3 -4,-3 -11,0 -23,1 -34,1 -11,0 -22,-1 -33,-1 -2,0 -6,0 -6,5 0,3 3,3 8,3 9,0 16,0 16,5 0,1 0,2 -1,6l-17 69 -77 0 16 -68c3,-9 5,-12 23,-12 6,0 8,0 8,-5 0,-3 -2,-3 -4,-3 -10,0 -22,1 -33,1 -11,0 -23,-1 -34,-1 -2,0 -5,0 -5,5 0,3 2,3 7,3 9,0 17,0 17,5 0,1 0,2 -1,6l-38 153c-3,9 -4,12 -24,12 -4,0 -7,0 -7,5z"/>
  <path id="1" class="fil3" d="M9073 1341l78 0 6 -37 -5 0c-1,6 -3,15 -5,19 -1,1 -15,1 -20,1l-38 0 22 -22c33,-29 46,-40 46,-61 0,-24 -19,-41 -45,-41 -24,0 -39,19 -39,38 0,12 10,12 11,12 3,0 11,-3 11,-11 0,-6 -4,-11 -11,-11 -2,0 -3,0 -3,0 5,-14 16,-22 28,-22 20,0 29,17 29,35 0,17 -11,33 -22,46l-41 46c-2,2 -2,2 -2,8z"/>
  <path id="2" class="fil3" d="M9174 1306l56 0 0 18c0,8 0,10 -16,10l-5 0 0 7c9,-1 20,-1 29,-1 9,0 20,0 29,1l0 -7 -5 0c-15,0 -16,-2 -16,-10l0 -18 21 0 0 -7 -21 0 0 -96c0,-4 0,-6 -3,-6 -2,0 -3,0 -4,3l-65 99 0 7zm6 -7l51 -79 0 79 -51 0z"/>
  <path class="fil3" d="M8870 1797c0,3 3,3 4,3 10,0 22,-1 33,-1 11,0 23,1 34,1 2,0 5,0 5,-5 0,-4 -2,-4 -7,-4 -17,0 -17,-2 -17,-4 0,-2 0,-2 1,-6l19 -77 78 0 -19 76c-2,9 -4,11 -23,11 -5,0 -8,0 -8,6 0,3 3,3 4,3 11,0 22,-1 33,-1 12,0 23,1 34,1 2,0 6,0 6,-5 0,-4 -2,-4 -8,-4 -16,0 -16,-2 -16,-4 0,-1 0,-3 1,-7l38 -153c2,-9 4,-11 22,-11 6,0 9,0 9,-5 0,-3 -2,-4 -4,-4 -11,0 -23,1 -34,1 -11,0 -22,-1 -33,-1 -2,0 -6,0 -6,6 0,3 3,3 8,3 9,0 16,0 16,5 0,1 0,1 -1,5l-17 69 -77 0 16 -68c3,-9 5,-11 23,-11 6,0 8,0 8,-5 0,-3 -2,-4 -4,-4 -10,0 -22,1 -33,1 -11,0 -23,-1 -34,-1 -2,0 -5,0 -5,6 0,3 2,3 7,3 9,0 17,0 17,5 0,1 0,1 -1,5l-38 154c-3,9 -4,11 -24,11 -4,0 -7,0 -7,6z"/>
  <path id="1" class="fil3" d="M9071 1810c0,19 20,33 43,33 25,0 45,-19 45,-41 0,-17 -14,-34 -36,-38 18,-6 30,-21 30,-38 0,-17 -19,-29 -39,-29 -21,0 -37,13 -37,29 0,7 4,11 10,11 7,0 11,-5 11,-11 0,-10 -10,-10 -13,-10 7,-11 21,-13 28,-13 9,0 21,4 21,23 0,3 -1,15 -6,24 -7,11 -14,11 -19,11 -2,1 -7,1 -9,1 -1,0 -3,0 -3,3 0,2 2,2 5,2l10 0c17,0 25,14 25,35 0,29 -15,35 -24,35 -9,0 -25,-4 -32,-16 7,1 14,-4 14,-12 0,-7 -6,-12 -12,-12 -5,0 -12,3 -12,13z"/>
  <path id="2" class="fil3" d="M9174 1803l56 0 0 19c0,7 0,10 -16,10l-5 0 0 6c9,0 20,0 29,0 9,0 20,0 29,0l0 -6 -5 0c-15,0 -16,-3 -16,-10l0 -19 21 0 0 -6 -21 0 0 -97c0,-4 0,-5 -3,-5 -2,0 -3,0 -4,2l-65 100 0 6zm6 -6l51 -79 0 79 -51 0z"/>
  <path class="fil3" d="M8870 2299c0,3 3,3 4,3 10,0 22,0 33,0 11,0 23,0 34,0 2,0 5,0 5,-5 0,-3 -2,-3 -7,-3 -17,0 -17,-3 -17,-5 0,-1 0,-2 1,-6l19 -76 78 0 -19 75c-2,9 -4,12 -23,12 -5,0 -8,0 -8,5 0,3 3,3 4,3 11,0 22,0 33,0 12,0 23,0 34,0 2,0 6,0 6,-5 0,-3 -2,-3 -8,-3 -16,0 -16,-3 -16,-5 0,0 0,-2 1,-7l38 -152c2,-9 4,-12 22,-12 6,0 9,0 9,-5 0,-3 -2,-3 -4,-3 -11,0 -23,1 -34,1 -11,0 -22,-1 -33,-1 -2,0 -6,0 -6,5 0,3 3,3 8,3 9,0 16,0 16,5 0,1 0,2 -1,6l-17 69 -77 0 16 -68c3,-9 5,-12 23,-12 6,0 8,0 8,-5 0,-3 -2,-3 -4,-3 -10,0 -22,1 -33,1 -11,0 -23,-1 -34,-1 -2,0 -5,0 -5,5 0,3 2,3 7,3 9,0 17,0 17,5 0,1 0,2 -1,6l-38 153c-3,9 -4,12 -24,12 -4,0 -7,0 -7,5z"/>
  <path id="1" class="fil3" d="M9068 2306l56 0 0 18c0,8 0,10 -16,10l-4 0 0 7c8,-1 19,-1 28,-1 9,0 20,0 29,1l0 -7 -4 0c-16,0 -17,-2 -17,-10l0 -18 22 0 0 -7 -22 0 0 -96c0,-4 0,-6 -3,-6 -2,0 -2,0 -4,3l-65 99 0 7zm6 -7l51 -79 0 79 -51 0z"/>
  <path id="2" class="fil3" d="M9174 2306l56 0 0 18c0,8 0,10 -16,10l-5 0 0 7c9,-1 20,-1 29,-1 9,0 20,0 29,1l0 -7 -5 0c-15,0 -16,-2 -16,-10l0 -18 21 0 0 -7 -21 0 0 -96c0,-4 0,-6 -3,-6 -2,0 -3,0 -4,3l-65 99 0 7zm6 -7l51 -79 0 79 -51 0z"/>
  <g id="_1649213107408">
   <rect class="fil4 str0" x="10" y="10" width="500" height="500"/>
   <rect class="fil5 str0" x="10" y="510" width="500" height="500"/>
   <rect class="fil5 str0" x="10" y="1010" width="500" height="500"/>
   <rect class="fil5 str0" x="10" y="1510" width="500" height="500"/>
   <rect class="fil6 str0" x="510" y="10" width="500" height="500"/>
   <rect class="fil5 str0" x="510" y="510" width="500" height="500"/>
   <rect class="fil5 str0" x="510" y="1010" width="500" height="500"/>
   <rect class="fil5 str0" x="510" y="1510" width="500" height="500"/>
   <rect class="fil7 str0" x="1010" y="10" width="500" height="500"/>
   <rect class="fil8 str0" x="1010" y="510" width="500" height="500"/>
   <rect class="fil8 str0" x="1010" y="1010" width="500" height="500"/>
   <rect class="fil8 str0" x="1010" y="1510" width="500" height="500"/>
   <rect class="fil9 str0" x="1510" y="10" width="500" height="500"/>
   <rect class="fil10 str0" x="1510" y="510" width="500" height="500"/>
   <rect class="fil10 str0" x="1510" y="1010" width="500" height="500"/>
   <rect class="fil10 str0" x="1510" y="1510" width="500" height="500"/>
   <path class="fil3" d="M67 334c0,3 3,3 4,3 10,0 22,-1 33,-1 11,0 23,1 34,1 2,0 5,0 5,-5 0,-3 -2,-3 -7,-3 -17,0 -17,-3 -17,-5 0,-1 0,-2 1,-6l19 -77 78 0 -19 76c-2,9 -4,12 -23,12 -5,0 -8,0 -8,5 0,3 3,3 4,3 11,0 22,-1 33,-1 12,0 23,1 34,1 2,0 6,0 6,-5 0,-3 -2,-3 -8,-3 -16,0 -16,-3 -16,-5 0,0 0,-2 1,-7l38 -152c2,-9 4,-12 22,-12 6,0 9,0 9,-5 0,-3 -2,-3 -4,-3 -11,0 -23,0 -34,0 -11,0 -23,0 -34,0 -1,0 -5,0 -5,5 0,3 2,3 8,3 8,0 16,0 16,5 0,1 0,2 -1,5l-17 70 -78 0 17 -68c3,-9 5,-12 23,-12 6,0 8,0 8,-5 0,-3 -2,-3 -4,-3 -11,0 -22,0 -33,0 -11,0 -23,0 -34,0 -2,0 -5,0 -5,5 0,3 2,3 7,3 9,0 17,0 17,5 0,1 0,2 -1,5l-39 154c-2,9 -4,12 -23,12 -4,0 -7,0 -7,5z"/>
   <path id="1" class="fil3" d="M278 255c4,0 16,0 27,-6l0 110c0,7 0,10 -19,10l-7 0 0 6c7,0 26,0 34,0 9,0 27,0 35,0l0 -6 -7 0c-19,0 -20,-2 -20,-10l0 -119c0,-5 0,-6 -5,-6 -13,14 -32,14 -38,14l0 7z"/>
   <path id="2" class="fil3" d="M384 255c4,0 16,0 27,-6l0 110c0,7 0,10 -19,10l-7 0 0 6c7,0 26,0 34,0 9,0 27,0 34,0l0 -6 -6 0c-19,0 -20,-2 -20,-10l0 -119c0,-5 0,-6 -5,-6 -13,14 -32,14 -38,14l0 7z"/>
   <path class="fil3" d="M67 834c0,3 3,3 4,3 10,0 22,-1 33,-1 11,0 23,1 34,1 2,0 5,0 5,-5 0,-3 -2,-3 -7,-3 -17,0 -17,-3 -17,-5 0,-1 0,-2 1,-6l19 -77 78 0 -19 76c-2,9 -4,12 -23,12 -5,0 -8,0 -8,5 0,3 3,3 4,3 11,0 22,-1 33,-1 12,0 23,1 34,1 2,0 6,0 6,-5 0,-3 -2,-3 -8,-3 -16,0 -16,-3 -16,-5 0,0 0,-2 1,-7l38 -152c2,-9 4,-12 22,-12 6,0 9,0 9,-5 0,-3 -2,-3 -4,-3 -11,0 -23,0 -34,0 -11,0 -23,0 -34,0 -1,0 -5,0 -5,5 0,3 2,3 8,3 8,0 16,0 16,5 0,1 0,2 -1,5l-17 70 -78 0 17 -68c3,-9 5,-12 23,-12 6,0 8,0 8,-5 0,-3 -2,-3 -4,-3 -11,0 -22,0 -33,0 -11,0 -23,0 -34,0 -2,0 -5,0 -5,5 0,3 2,3 7,3 9,0 17,0 17,5 0,1 0,2 -1,5l-39 154c-2,9 -4,12 -23,12 -4,0 -7,0 -7,5z"/>
   <path id="1" class="fil3" d="M269 875l79 0 6 -36 -5 0c-1,6 -3,15 -5,18 -2,2 -16,2 -20,2l-38 0 22 -22c33,-29 46,-40 46,-61 0,-25 -19,-42 -45,-42 -24,0 -40,20 -40,39 0,12 11,12 12,12 3,0 11,-3 11,-12 0,-5 -4,-11 -12,-11 -1,0 -2,0 -2,1 5,-14 16,-22 28,-22 20,0 29,17 29,35 0,16 -11,33 -23,46l-40 46c-3,2 -3,2 -3,7z"/>
   <path id="2" class="fil3" d="M384 755c4,0 16,0 27,-6l0 110c0,7 0,10 -19,10l-7 0 0 6c7,0 26,0 34,0 9,0 27,0 34,0l0 -6 -6 0c-19,0 -20,-2 -20,-10l0 -119c0,-5 0,-6 -5,-6 -13,14 -32,14 -38,14l0 7z"/>
   <path class="fil3" d="M67 1332c0,3 3,3 4,3 10,0 22,-1 33,-1 11,0 23,1 34,1 2,0 5,0 5,-5 0,-4 -2,-4 -7,-4 -17,0 -17,-2 -17,-5 0,-1 0,-1 1,-5l19 -77 78 0 -19 75c-2,10 -4,12 -23,12 -5,0 -8,0 -8,6 0,3 3,3 4,3 11,0 22,-1 33,-1 12,0 23,1 34,1 2,0 6,0 6,-5 0,-4 -2,-4 -8,-4 -16,0 -16,-2 -16,-5 0,0 0,-2 1,-6l38 -153c2,-9 4,-11 22,-11 6,0 9,0 9,-5 0,-3 -2,-4 -4,-4 -11,0 -23,1 -34,1 -11,0 -23,-1 -34,-1 -1,0 -5,0 -5,6 0,3 2,3 8,3 8,0 16,0 16,5 0,1 0,1 -1,5l-17 69 -78 0 17 -68c3,-9 5,-11 23,-11 6,0 8,0 8,-5 0,-3 -2,-4 -4,-4 -11,0 -22,1 -33,1 -11,0 -23,-1 -34,-1 -2,0 -5,0 -5,6 0,3 2,3 7,3 9,0 17,0 17,5 0,1 0,1 -1,5l-39 153c-2,10 -4,12 -23,12 -4,0 -7,0 -7,6z"/>
   <path id="1" class="fil3" d="M268 1345c0,19 19,33 42,33 26,0 46,-20 46,-41 0,-17 -14,-34 -36,-38 18,-6 30,-21 30,-38 0,-17 -19,-29 -39,-29 -21,0 -38,13 -38,29 0,7 5,11 11,11 7,0 11,-5 11,-11 0,-10 -10,-10 -13,-10 6,-11 20,-14 28,-14 9,0 20,5 20,24 0,3 0,15 -6,24 -6,10 -13,11 -18,11 -2,0 -7,1 -9,1 -1,0 -3,0 -3,2 0,3 2,3 5,3l10 0c17,0 25,14 25,35 0,29 -15,35 -24,35 -9,0 -25,-4 -33,-16 8,1 14,-4 14,-12 0,-8 -5,-12 -11,-12 -6,0 -12,3 -12,13z"/>
   <path id="2" class="fil3" d="M384 1252c4,0 16,0 27,-5l0 109c0,8 0,11 -19,11l-7 0 0 6c7,-1 26,-1 34,-1 9,0 27,0 34,1l0 -6 -6 0c-19,0 -20,-3 -20,-11l0 -118c0,-5 0,-6 -5,-6 -13,14 -32,14 -38,14l0 6z"/>
   <path class="fil3" d="M67 1834c0,3 3,3 4,3 10,0 22,-1 33,-1 11,0 23,1 34,1 2,0 5,0 5,-5 0,-3 -2,-3 -7,-3 -17,0 -17,-3 -17,-5 0,-1 0,-2 1,-6l19 -77 78 0 -19 76c-2,9 -4,12 -23,12 -5,0 -8,0 -8,5 0,3 3,3 4,3 11,0 22,-1 33,-1 12,0 23,1 34,1 2,0 6,0 6,-5 0,-3 -2,-3 -8,-3 -16,0 -16,-3 -16,-5 0,0 0,-2 1,-7l38 -152c2,-9 4,-12 22,-12 6,0 9,0 9,-5 0,-3 -2,-3 -4,-3 -11,0 -23,0 -34,0 -11,0 -23,0 -34,0 -1,0 -5,0 -5,5 0,3 2,3 8,3 8,0 16,0 16,5 0,1 0,2 -1,5l-17 70 -78 0 17 -68c3,-9 5,-12 23,-12 6,0 8,0 8,-5 0,-3 -2,-3 -4,-3 -11,0 -22,0 -33,0 -11,0 -23,0 -34,0 -2,0 -5,0 -5,5 0,3 2,3 7,3 9,0 17,0 17,5 0,1 0,2 -1,5l-39 154c-2,9 -4,12 -23,12 -4,0 -7,0 -7,5z"/>
   <path id="1" class="fil3" d="M265 1841l56 0 0 18c0,8 0,10 -16,10l-4 0 0 6c8,0 19,0 28,0 9,0 20,0 29,0l0 -6 -5 0c-15,0 -16,-2 -16,-10l0 -18 22 0 0 -7 -22 0 0 -96c0,-5 0,-6 -3,-6 -2,0 -3,0 -4,3l-65 99 0 7zm6 -7l51 -79 0 79 -51 0z"/>
   <path id="2" class="fil3" d="M384 1755c4,0 16,0 27,-6l0 110c0,7 0,10 -19,10l-7 0 0 6c7,0 26,0 34,0 9,0 27,0 34,0l0 -6 -6 0c-19,0 -20,-2 -20,-10l0 -119c0,-5 0,-6 -5,-6 -13,14 -32,14 -38,14l0 7z"/>
   <path class="fil3" d="M563 334c0,3 4,3 4,3 11,0 23,-1 34,-1 11,0 23,1 34,1 2,0 5,0 5,-5 0,-3 -2,-3 -8,-3 -16,0 -16,-3 -16,-5 0,-1 0,-2 1,-6l19 -77 77 0 -18 76c-3,9 -4,12 -23,12 -5,0 -8,0 -8,5 0,3 3,3 4,3 11,0 22,-1 33,-1 11,0 23,1 34,1 2,0 5,0 5,-5 0,-3 -2,-3 -7,-3 -17,0 -17,-3 -17,-5 0,0 0,-2 2,-7l38 -152c2,-9 4,-12 22,-12 6,0 8,0 8,-5 0,-3 -2,-3 -4,-3 -10,0 -22,0 -33,0 -11,0 -23,0 -34,0 -1,0 -5,0 -5,5 0,3 2,3 8,3 8,0 16,0 16,5 0,1 0,2 -1,5l-17 70 -78 0 17 -68c2,-9 5,-12 22,-12 6,0 9,0 9,-5 0,-3 -2,-3 -4,-3 -11,0 -22,0 -33,0 -12,0 -23,0 -34,0 -2,0 -6,0 -6,5 0,3 3,3 8,3 9,0 16,0 16,5 0,1 0,2 -1,5l-38 154c-2,9 -4,12 -23,12 -4,0 -8,0 -8,5z"/>
   <path id="1" class="fil3" d="M775 255c4,0 16,0 27,-6l0 110c0,7 0,10 -19,10l-7 0 0 6c7,0 26,0 34,0 9,0 27,0 34,0l0 -6 -6 0c-19,0 -20,-2 -20,-10l0 -119c0,-5 0,-6 -5,-6 -13,14 -32,14 -38,14l0 7z"/>
   <path id="2" class="fil3" d="M872 375l79 0 6 -36 -6 0c-1,6 -2,15 -4,18 -2,2 -16,2 -21,2l-38 0 23 -22c33,-29 46,-40 46,-61 0,-25 -20,-42 -45,-42 -24,0 -40,20 -40,39 0,12 11,12 11,12 4,0 11,-3 11,-12 0,-5 -4,-11 -11,-11 -2,0 -2,0 -3,1 5,-14 17,-22 29,-22 19,0 28,17 28,35 0,16 -10,33 -22,46l-41 46c-2,2 -2,2 -2,7z"/>
   <path class="fil3" d="M563 834c0,3 4,3 4,3 11,0 23,-1 34,-1 11,0 23,1 34,1 2,0 5,0 5,-5 0,-3 -2,-3 -8,-3 -16,0 -16,-3 -16,-5 0,-1 0,-2 1,-6l19 -77 77 0 -18 76c-3,9 -4,12 -23,12 -5,0 -8,0 -8,5 0,3 3,3 4,3 11,0 22,-1 33,-1 11,0 23,1 34,1 2,0 5,0 5,-5 0,-3 -2,-3 -7,-3 -17,0 -17,-3 -17,-5 0,0 0,-2 2,-7l38 -152c2,-9 4,-12 22,-12 6,0 8,0 8,-5 0,-3 -2,-3 -4,-3 -10,0 -22,0 -33,0 -11,0 -23,0 -34,0 -1,0 -5,0 -5,5 0,3 2,3 8,3 8,0 16,0 16,5 0,1 0,2 -1,5l-17 70 -78 0 17 -68c2,-9 5,-12 22,-12 6,0 9,0 9,-5 0,-3 -2,-3 -4,-3 -11,0 -22,0 -33,0 -12,0 -23,0 -34,0 -2,0 -6,0 -6,5 0,3 3,3 8,3 9,0 16,0 16,5 0,1 0,2 -1,5l-38 154c-2,9 -4,12 -23,12 -4,0 -8,0 -8,5z"/>
   <path id="1" class="fil3" d="M766 875l79 0 6 -36 -6 0c-1,6 -2,15 -4,18 -2,2 -16,2 -20,2l-38 0 22 -22c33,-29 46,-40 46,-61 0,-25 -19,-42 -45,-42 -24,0 -40,20 -40,39 0,12 11,12 11,12 4,0 11,-3 11,-12 0,-5 -3,-11 -11,-11 -1,0 -2,0 -2,1 4,-14 16,-22 28,-22 19,0 28,17 28,35 0,16 -10,33 -22,46l-40 46c-3,2 -3,2 -3,7z"/>
   <path id="2" class="fil3" d="M872 875l79 0 6 -36 -6 0c-1,6 -2,15 -4,18 -2,2 -16,2 -21,2l-38 0 23 -22c33,-29 46,-40 46,-61 0,-25 -20,-42 -45,-42 -24,0 -40,20 -40,39 0,12 11,12 11,12 4,0 11,-3 11,-12 0,-5 -4,-11 -11,-11 -2,0 -2,0 -3,1 5,-14 17,-22 29,-22 19,0 28,17 28,35 0,16 -10,33 -22,46l-41 46c-2,2 -2,2 -2,7z"/>
   <path class="fil3" d="M563 1332c0,3 4,3 4,3 11,0 23,-1 34,-1 11,0 23,1 34,1 2,0 5,0 5,-5 0,-4 -2,-4 -8,-4 -16,0 -16,-2 -16,-5 0,-1 0,-1 1,-5l19 -77 77 0 -18 75c-3,10 -4,12 -23,12 -5,0 -8,0 -8,6 0,3 3,3 4,3 11,0 22,-1 33,-1 11,0 23,1 34,1 2,0 5,0 5,-5 0,-4 -2,-4 -7,-4 -17,0 -17,-2 -17,-5 0,0 0,-2 2,-6l38 -153c2,-9 4,-11 22,-11 6,0 8,0 8,-5 0,-3 -2,-4 -4,-4 -10,0 -22,1 -33,1 -11,0 -23,-1 -34,-1 -1,0 -5,0 -5,6 0,3 2,3 8,3 8,0 16,0 16,5 0,1 0,1 -1,5l-17 69 -78 0 17 -68c2,-9 5,-11 22,-11 6,0 9,0 9,-5 0,-3 -2,-4 -4,-4 -11,0 -22,1 -33,1 -12,0 -23,-1 -34,-1 -2,0 -6,0 -6,6 0,3 3,3 8,3 9,0 16,0 16,5 0,1 0,1 -1,5l-38 153c-2,10 -4,12 -23,12 -4,0 -8,0 -8,6z"/>
   <path id="1" class="fil3" d="M765 1345c0,19 19,33 42,33 26,0 45,-20 45,-41 0,-17 -13,-34 -35,-38 17,-6 30,-21 30,-38 0,-17 -19,-29 -39,-29 -22,0 -38,13 -38,29 0,7 5,11 11,11 7,0 11,-5 11,-11 0,-10 -10,-10 -13,-10 6,-11 20,-14 28,-14 9,0 20,5 20,24 0,3 0,15 -6,24 -6,10 -13,11 -19,11 -1,0 -6,1 -8,1 -2,0 -3,0 -3,2 0,3 1,3 5,3l9 0c18,0 26,14 26,35 0,29 -15,35 -24,35 -9,0 -25,-4 -33,-16 8,1 14,-4 14,-12 0,-8 -5,-12 -12,-12 -5,0 -11,3 -11,13z"/>
   <path id="2" class="fil3" d="M872 1373l79 0 6 -37 -6 0c-1,7 -2,16 -4,19 -2,2 -16,2 -21,2l-38 0 23 -22c33,-29 46,-41 46,-62 0,-24 -20,-41 -45,-41 -24,0 -40,20 -40,38 0,12 11,12 11,12 4,0 11,-2 11,-11 0,-5 -4,-11 -11,-11 -2,0 -2,0 -3,0 5,-13 17,-21 29,-21 19,0 28,17 28,34 0,17 -10,34 -22,47l-41 45c-2,3 -2,3 -2,8z"/>
   <path class="fil3" d="M563 1834c0,3 4,3 4,3 11,0 23,-1 34,-1 11,0 23,1 34,1 2,0 5,0 5,-5 0,-3 -2,-3 -8,-3 -16,0 -16,-3 -16,-5 0,-1 0,-2 1,-6l19 -77 77 0 -18 76c-3,9 -4,12 -23,12 -5,0 -8,0 -8,5 0,3 3,3 4,3 11,0 22,-1 33,-1 11,0 23,1 34,1 2,0 5,0 5,-5 0,-3 -2,-3 -7,-3 -17,0 -17,-3 -17,-5 0,0 0,-2 2,-7l38 -152c2,-9 4,-12 22,-12 6,0 8,0 8,-5 0,-3 -2,-3 -4,-3 -10,0 -22,0 -33,0 -11,0 -23,0 -34,0 -1,0 -5,0 -5,5 0,3 2,3 8,3 8,0 16,0 16,5 0,1 0,2 -1,5l-17 70 -78 0 17 -68c2,-9 5,-12 22,-12 6,0 9,0 9,-5 0,-3 -2,-3 -4,-3 -11,0 -22,0 -33,0 -12,0 -23,0 -34,0 -2,0 -6,0 -6,5 0,3 3,3 8,3 9,0 16,0 16,5 0,1 0,2 -1,5l-38 154c-2,9 -4,12 -23,12 -4,0 -8,0 -8,5z"/>
   <path id="1" class="fil3" d="M762 1841l56 0 0 18c0,8 -1,10 -16,10l-5 0 0 6c9,0 20,0 29,0 9,0 20,0 29,0l0 -6 -5 0c-15,0 -16,-2 -16,-10l0 -18 21 0 0 -7 -21 0 0 -96c0,-5 0,-6 -3,-6 -2,0 -3,0 -4,3l-65 99 0 7zm6 -7l51 -79 0 79 -51 0z"/>
   <path id="2" class="fil3" d="M872 1875l79 0 6 -36 -6 0c-1,6 -2,15 -4,18 -2,2 -16,2 -21,2l-38 0 23 -22c33,-29 46,-40 46,-61 0,-25 -20,-42 -45,-42 -24,0 -40,20 -40,39 0,12 11,12 11,12 4,0 11,-3 11,-12 0,-5 -4,-11 -11,-11 -2,0 -2,0 -3,1 5,-14 17,-22 29,-22 19,0 28,17 28,35 0,16 -10,33 -22,46l-41 46c-2,2 -2,2 -2,7z"/>
   <path class="fil3" d="M1063 332c0,3 3,3 4,3 10,0 22,-1 33,-1 11,0 23,1 34,1 2,0 5,0 5,-5 0,-4 -2,-4 -8,-4 -16,0 -16,-2 -16,-5 0,-1 0,-1 1,-5l19 -77 77 0 -18 75c-2,10 -4,12 -23,12 -5,0 -8,0 -8,6 0,3 3,3 4,3 11,0 22,-1 33,-1 12,0 23,1 34,1 2,0 6,0 6,-5 0,-4 -2,-4 -8,-4 -16,0 -16,-2 -16,-5 0,0 0,-2 1,-6l38 -153c2,-9 4,-11 22,-11 6,0 9,0 9,-5 0,-3 -2,-4 -4,-4 -11,0 -23,1 -34,1 -11,0 -23,-1 -34,-1 -1,0 -5,0 -5,6 0,3 2,3 8,3 8,0 16,0 16,5 0,1 0,1 -1,5l-17 69 -78 0 17 -68c3,-9 5,-11 23,-11 6,0 8,0 8,-5 0,-3 -2,-4 -4,-4 -11,0 -22,1 -33,1 -11,0 -23,-1 -34,-1 -2,0 -5,0 -5,6 0,3 2,3 7,3 9,0 17,0 17,5 0,1 0,1 -2,5l-38 153c-2,10 -4,12 -23,12 -4,0 -7,0 -7,6z"/>
   <path id="1" class="fil3" d="M1274 252c4,0 16,0 27,-5l0 109c0,8 0,11 -19,11l-7 0 0 6c7,-1 26,-1 34,-1 9,0 27,0 35,1l0 -6 -7 0c-19,0 -20,-3 -20,-11l0 -118c0,-5 0,-6 -5,-6 -13,14 -32,14 -38,14l0 6z"/>
   <path id="2" class="fil3" d="M1370 345c0,19 19,33 42,33 26,0 45,-20 45,-41 0,-17 -13,-34 -35,-38 17,-6 30,-21 30,-38 0,-17 -19,-29 -39,-29 -22,0 -38,13 -38,29 0,7 5,11 11,11 7,0 11,-5 11,-11 0,-10 -10,-10 -13,-10 6,-11 20,-14 28,-14 9,0 20,5 20,24 0,3 0,15 -6,24 -6,10 -13,11 -19,11 -1,0 -6,1 -8,1 -2,0 -3,0 -3,2 0,3 1,3 5,3l9 0c18,0 26,14 26,35 0,29 -15,35 -24,35 -9,0 -25,-4 -33,-16 8,1 14,-4 14,-12 0,-8 -5,-12 -12,-12 -5,0 -11,3 -11,13z"/>
   <path class="fil3" d="M1063 832c0,3 3,3 4,3 10,0 22,-1 33,-1 11,0 23,1 34,1 2,0 5,0 5,-5 0,-4 -2,-4 -8,-4 -16,0 -16,-2 -16,-5 0,-1 0,-1 1,-5l19 -77 77 0 -18 75c-2,10 -4,12 -23,12 -5,0 -8,0 -8,6 0,3 3,3 4,3 11,0 22,-1 33,-1 12,0 23,1 34,1 2,0 6,0 6,-5 0,-4 -2,-4 -8,-4 -16,0 -16,-2 -16,-5 0,0 0,-2 1,-6l38 -153c2,-9 4,-11 22,-11 6,0 9,0 9,-5 0,-3 -2,-4 -4,-4 -11,0 -23,1 -34,1 -11,0 -23,-1 -34,-1 -1,0 -5,0 -5,6 0,3 2,3 8,3 8,0 16,0 16,5 0,1 0,1 -1,5l-17 69 -78 0 17 -68c3,-9 5,-11 23,-11 6,0 8,0 8,-5 0,-3 -2,-4 -4,-4 -11,0 -22,1 -33,1 -11,0 -23,-1 -34,-1 -2,0 -5,0 -5,6 0,3 2,3 7,3 9,0 17,0 17,5 0,1 0,1 -2,5l-38 153c-2,10 -4,12 -23,12 -4,0 -7,0 -7,6z"/>
   <path id="1" class="fil3" d="M1265 873l79 0 6 -37 -5 0c-1,7 -3,16 -5,19 -2,2 -16,2 -20,2l-38 0 22 -22c33,-29 46,-41 46,-62 0,-24 -19,-41 -45,-41 -24,0 -40,20 -40,38 0,12 11,12 12,12 3,0 11,-2 11,-11 0,-5 -4,-11 -12,-11 -1,0 -2,0 -2,0 5,-13 16,-21 28,-21 19,0 29,17 29,34 0,17 -11,34 -23,47l-40 45c-3,3 -3,3 -3,8z"/>
   <path id="2" class="fil3" d="M1370 845c0,19 19,33 42,33 26,0 45,-20 45,-41 0,-17 -13,-34 -35,-38 17,-6 30,-21 30,-38 0,-17 -19,-29 -39,-29 -22,0 -38,13 -38,29 0,7 5,11 11,11 7,0 11,-5 11,-11 0,-10 -10,-10 -13,-10 6,-11 20,-14 28,-14 9,0 20,5 20,24 0,3 0,15 -6,24 -6,10 -13,11 -19,11 -1,0 -6,1 -8,1 -2,0 -3,0 -3,2 0,3 1,3 5,3l9 0c18,0 26,14 26,35 0,29 -15,35 -24,35 -9,0 -25,-4 -33,-16 8,1 14,-4 14,-12 0,-8 -5,-12 -12,-12 -5,0 -11,3 -11,13z"/>
   <path class="fil3" d="M1063 1332c0,3 3,3 4,3 10,0 22,-1 33,-1 11,0 23,1 34,1 2,0 5,0 5,-5 0,-4 -2,-4 -8,-4 -16,0 -16,-2 -16,-5 0,-1 0,-1 1,-5l19 -77 77 0 -18 75c-2,10 -4,12 -23,12 -5,0 -8,0 -8,6 0,3 3,3 4,3 11,0 22,-1 33,-1 12,0 23,1 34,1 2,0 6,0 6,-5 0,-4 -2,-4 -8,-4 -16,0 -16,-2 -16,-5 0,0 0,-2 1,-6l38 -153c2,-9 4,-11 22,-11 6,0 9,0 9,-5 0,-3 -2,-4 -4,-4 -11,0 -23,1 -34,1 -11,0 -23,-1 -34,-1 -1,0 -5,0 -5,6 0,3 2,3 8,3 8,0 16,0 16,5 0,1 0,1 -1,5l-17 69 -78 0 17 -68c3,-9 5,-11 23,-11 6,0 8,0 8,-5 0,-3 -2,-4 -4,-4 -11,0 -22,1 -33,1 -11,0 -23,-1 -34,-1 -2,0 -5,0 -5,6 0,3 2,3 7,3 9,0 17,0 17,5 0,1 0,1 -2,5l-38 153c-2,10 -4,12 -23,12 -4,0 -7,0 -7,6z"/>
   <path id="1" class="fil3" d="M1264 1345c0,19 19,33 42,33 26,0 46,-20 46,-41 0,-17 -14,-34 -36,-38 18,-6 30,-21 30,-38 0,-17 -19,-29 -39,-29 -21,0 -38,13 -38,29 0,7 5,11 11,11 7,0 11,-5 11,-11 0,-10 -10,-10 -13,-10 6,-11 20,-14 28,-14 9,0 20,5 20,24 0,3 0,15 -6,24 -6,10 -13,11 -18,11 -2,0 -7,1 -9,1 -1,0 -3,0 -3,2 0,3 2,3 5,3l10 0c17,0 25,14 25,35 0,29 -15,35 -24,35 -9,0 -25,-4 -33,-16 8,1 14,-4 14,-12 0,-8 -5,-12 -11,-12 -6,0 -12,3 -12,13z"/>
   <path id="2" class="fil3" d="M1370 1345c0,19 19,33 42,33 26,0 45,-20 45,-41 0,-17 -13,-34 -35,-38 17,-6 30,-21 30,-38 0,-17 -19,-29 -39,-29 -22,0 -38,13 -38,29 0,7 5,11 11,11 7,0 11,-5 11,-11 0,-10 -10,-10 -13,-10 6,-11 20,-14 28,-14 9,0 20,5 20,24 0,3 0,15 -6,24 -6,10 -13,11 -19,11 -1,0 -6,1 -8,1 -2,0 -3,0 -3,2 0,3 1,3 5,3l9 0c18,0 26,14 26,35 0,29 -15,35 -24,35 -9,0 -25,-4 -33,-16 8,1 14,-4 14,-12 0,-8 -5,-12 -12,-12 -5,0 -11,3 -11,13z"/>
   <path class="fil3" d="M1063 1832c0,3 3,3 4,3 10,0 22,-1 33,-1 11,0 23,1 34,1 2,0 5,0 5,-5 0,-4 -2,-4 -8,-4 -16,0 -16,-2 -16,-5 0,-1 0,-1 1,-5l19 -77 77 0 -18 75c-2,10 -4,12 -23,12 -5,0 -8,0 -8,6 0,3 3,3 4,3 11,0 22,-1 33,-1 12,0 23,1 34,1 2,0 6,0 6,-5 0,-4 -2,-4 -8,-4 -16,0 -16,-2 -16,-5 0,0 0,-2 1,-6l38 -153c2,-9 4,-11 22,-11 6,0 9,0 9,-5 0,-3 -2,-4 -4,-4 -11,0 -23,1 -34,1 -11,0 -23,-1 -34,-1 -1,0 -5,0 -5,6 0,3 2,3 8,3 8,0 16,0 16,5 0,1 0,1 -1,5l-17 69 -78 0 17 -68c3,-9 5,-11 23,-11 6,0 8,0 8,-5 0,-3 -2,-4 -4,-4 -11,0 -22,1 -33,1 -11,0 -23,-1 -34,-1 -2,0 -5,0 -5,6 0,3 2,3 7,3 9,0 17,0 17,5 0,1 0,1 -2,5l-38 153c-2,10 -4,12 -23,12 -4,0 -7,0 -7,6z"/>
   <path id="1" class="fil3" d="M1261 1838l56 0 0 19c0,7 0,10 -16,10l-4 0 0 6c8,-1 19,-1 28,-1 9,0 20,0 29,1l0 -6 -5 0c-15,0 -16,-3 -16,-10l0 -19 22 0 0 -6 -22 0 0 -97c0,-4 0,-5 -3,-5 -2,0 -3,0 -4,2l-65 100 0 6zm6 -6l51 -79 0 79 -51 0z"/>
   <path id="2" class="fil3" d="M1370 1845c0,19 19,33 42,33 26,0 45,-20 45,-41 0,-17 -13,-34 -35,-38 17,-6 30,-21 30,-38 0,-17 -19,-29 -39,-29 -22,0 -38,13 -38,29 0,7 5,11 11,11 7,0 11,-5 11,-11 0,-10 -10,-10 -13,-10 6,-11 20,-14 28,-14 9,0 20,5 20,24 0,3 0,15 -6,24 -6,10 -13,11 -19,11 -1,0 -6,1 -8,1 -2,0 -3,0 -3,2 0,3 1,3 5,3l9 0c18,0 26,14 26,35 0,29 -15,35 -24,35 -9,0 -25,-4 -33,-16 8,1 14,-4 14,-12 0,-8 -5,-12 -12,-12 -5,0 -11,3 -11,13z"/>
   <path class="fil3" d="M1561 334c0,3 3,3 4,3 11,0 22,-1 33,-1 12,0 23,1 34,1 2,0 6,0 6,-5 0,-3 -2,-3 -8,-3 -16,0 -16,-3 -16,-5 0,-1 0,-2 1,-6l19 -77 77 0 -19 76c-2,9 -4,12 -23,12 -4,0 -7,0 -7,5 0,3 3,3 4,3 10,0 22,-1 33,-1 11,0 23,1 34,1 2,0 5,0 5,-5 0,-3 -2,-3 -8,-3 -16,0 -16,-3 -16,-5 0,0 0,-2 1,-7l38 -152c3,-9 5,-12 23,-12 6,0 8,0 8,-5 0,-3 -2,-3 -4,-3 -11,0 -22,0 -33,0 -11,0 -23,0 -34,0 -2,0 -5,0 -5,5 0,3 2,3 7,3 9,0 17,0 17,5 0,1 0,2 -2,5l-17 70 -77 0 17 -68c2,-9 4,-12 22,-12 6,0 9,0 9,-5 0,-3 -2,-3 -4,-3 -11,0 -23,0 -34,0 -11,0 -22,0 -33,0 -2,0 -6,0 -6,5 0,3 2,3 8,3 9,0 16,0 16,5 0,1 0,2 -1,5l-38 154c-2,9 -4,12 -23,12 -5,0 -8,0 -8,5z"/>
   <path id="1" class="fil3" d="M1772 255c4,0 17,0 28,-6l0 110c0,7 -1,10 -20,10l-7 0 0 6c8,0 26,0 35,0 8,0 27,0 34,0l0 -6 -7 0c-19,0 -19,-2 -19,-10l0 -119c0,-5 0,-6 -5,-6 -13,14 -32,14 -39,14l0 7z"/>
   <path id="2" class="fil3" d="M1865 341l56 0 0 18c0,8 0,10 -16,10l-4 0 0 6c9,0 20,0 28,0 9,0 21,0 29,0l0 -6 -4 0c-16,0 -16,-2 -16,-10l0 -18 21 0 0 -7 -21 0 0 -96c0,-5 0,-6 -4,-6 -2,0 -2,0 -4,3l-65 99 0 7zm6 -7l52 -79 0 79 -52 0z"/>
   <path class="fil3" d="M1561 834c0,3 3,3 4,3 11,0 22,-1 33,-1 12,0 23,1 34,1 2,0 6,0 6,-5 0,-3 -2,-3 -8,-3 -16,0 -16,-3 -16,-5 0,-1 0,-2 1,-6l19 -77 77 0 -19 76c-2,9 -4,12 -23,12 -4,0 -7,0 -7,5 0,3 3,3 4,3 10,0 22,-1 33,-1 11,0 23,1 34,1 2,0 5,0 5,-5 0,-3 -2,-3 -8,-3 -16,0 -16,-3 -16,-5 0,0 0,-2 1,-7l38 -152c3,-9 5,-12 23,-12 6,0 8,0 8,-5 0,-3 -2,-3 -4,-3 -11,0 -22,0 -33,0 -11,0 -23,0 -34,0 -2,0 -5,0 -5,5 0,3 2,3 7,3 9,0 17,0 17,5 0,1 0,2 -2,5l-17 70 -77 0 17 -68c2,-9 4,-12 22,-12 6,0 9,0 9,-5 0,-3 -2,-3 -4,-3 -11,0 -23,0 -34,0 -11,0 -22,0 -33,0 -2,0 -6,0 -6,5 0,3 2,3 8,3 9,0 16,0 16,5 0,1 0,2 -1,5l-38 154c-2,9 -4,12 -23,12 -5,0 -8,0 -8,5z"/>
   <path id="1" class="fil3" d="M1764 875l78 0 6 -36 -5 0c-1,6 -2,15 -5,18 -1,2 -15,2 -20,2l-38 0 23 -22c33,-29 45,-40 45,-61 0,-25 -19,-42 -44,-42 -24,0 -40,20 -40,39 0,12 11,12 11,12 4,0 11,-3 11,-12 0,-5 -4,-11 -11,-11 -2,0 -2,0 -3,1 5,-14 16,-22 29,-22 19,0 28,17 28,35 0,16 -10,33 -22,46l-41 46c-2,2 -2,2 -2,7z"/>
   <path id="2" class="fil3" d="M1865 841l56 0 0 18c0,8 0,10 -16,10l-4 0 0 6c9,0 20,0 28,0 9,0 21,0 29,0l0 -6 -4 0c-16,0 -16,-2 -16,-10l0 -18 21 0 0 -7 -21 0 0 -96c0,-5 0,-6 -4,-6 -2,0 -2,0 -4,3l-65 99 0 7zm6 -7l52 -79 0 79 -52 0z"/>
   <path class="fil3" d="M1561 1332c0,3 3,3 4,3 11,0 22,-1 33,-1 12,0 23,1 34,1 2,0 6,0 6,-5 0,-4 -2,-4 -8,-4 -16,0 -16,-2 -16,-5 0,-1 0,-1 1,-5l19 -77 77 0 -19 75c-2,10 -4,12 -23,12 -4,0 -7,0 -7,6 0,3 3,3 4,3 10,0 22,-1 33,-1 11,0 23,1 34,1 2,0 5,0 5,-5 0,-4 -2,-4 -8,-4 -16,0 -16,-2 -16,-5 0,0 0,-2 1,-6l38 -153c3,-9 5,-11 23,-11 6,0 8,0 8,-5 0,-3 -2,-4 -4,-4 -11,0 -22,1 -33,1 -11,0 -23,-1 -34,-1 -2,0 -5,0 -5,6 0,3 2,3 7,3 9,0 17,0 17,5 0,1 0,1 -2,5l-17 69 -77 0 17 -68c2,-9 4,-11 22,-11 6,0 9,0 9,-5 0,-3 -2,-4 -4,-4 -11,0 -23,1 -34,1 -11,0 -22,-1 -33,-1 -2,0 -6,0 -6,6 0,3 2,3 8,3 9,0 16,0 16,5 0,1 0,1 -1,5l-38 153c-2,10 -4,12 -23,12 -5,0 -8,0 -8,6z"/>
   <path id="1" class="fil3" d="M1762 1345c0,19 20,33 43,33 26,0 45,-20 45,-41 0,-17 -13,-34 -35,-38 17,-6 29,-21 29,-38 0,-17 -18,-29 -39,-29 -21,0 -37,13 -37,29 0,7 5,11 11,11 6,0 11,-5 11,-11 0,-10 -10,-10 -14,-10 7,-11 21,-14 29,-14 8,0 20,5 20,24 0,3 -1,15 -6,24 -6,10 -14,11 -19,11 -2,0 -7,1 -8,1 -2,0 -3,0 -3,2 0,3 1,3 5,3l9 0c17,0 25,14 25,35 0,29 -14,35 -24,35 -9,0 -25,-4 -32,-16 7,1 14,-4 14,-12 0,-8 -6,-12 -12,-12 -5,0 -12,3 -12,13z"/>
   <path id="2" class="fil3" d="M1865 1338l56 0 0 19c0,7 0,10 -16,10l-4 0 0 6c9,-1 20,-1 28,-1 9,0 21,0 29,1l0 -6 -4 0c-16,0 -16,-3 -16,-10l0 -19 21 0 0 -6 -21 0 0 -97c0,-4 0,-5 -4,-5 -2,0 -2,0 -4,2l-65 100 0 6zm6 -6l52 -79 0 79 -52 0z"/>
   <path class="fil3" d="M1561 1834c0,3 3,3 4,3 11,0 22,-1 33,-1 12,0 23,1 34,1 2,0 6,0 6,-5 0,-3 -2,-3 -8,-3 -16,0 -16,-3 -16,-5 0,-1 0,-2 1,-6l19 -77 77 0 -19 76c-2,9 -4,12 -23,12 -4,0 -7,0 -7,5 0,3 3,3 4,3 10,0 22,-1 33,-1 11,0 23,1 34,1 2,0 5,0 5,-5 0,-3 -2,-3 -8,-3 -16,0 -16,-3 -16,-5 0,0 0,-2 1,-7l38 -152c3,-9 5,-12 23,-12 6,0 8,0 8,-5 0,-3 -2,-3 -4,-3 -11,0 -22,0 -33,0 -11,0 -23,0 -34,0 -2,0 -5,0 -5,5 0,3 2,3 7,3 9,0 17,0 17,5 0,1 0,2 -2,5l-17 70 -77 0 17 -68c2,-9 4,-12 22,-12 6,0 9,0 9,-5 0,-3 -2,-3 -4,-3 -11,0 -23,0 -34,0 -11,0 -22,0 -33,0 -2,0 -6,0 -6,5 0,3 2,3 8,3 9,0 16,0 16,5 0,1 0,2 -1,5l-38 154c-2,9 -4,12 -23,12 -5,0 -8,0 -8,5z"/>
   <path id="1" class="fil3" d="M1759 1841l57 0 0 18c0,8 -1,10 -17,10l-4 0 0 6c9,0 20,0 29,0 8,0 20,0 28,0l0 -6 -4 0c-16,0 -16,-2 -16,-10l0 -18 21 0 0 -7 -21 0 0 -96c0,-5 0,-6 -4,-6 -1,0 -2,0 -4,3l-65 99 0 7zm6 -7l52 -79 0 79 -52 0z"/>
   <path id="2" class="fil3" d="M1865 1841l56 0 0 18c0,8 0,10 -16,10l-4 0 0 6c9,0 20,0 28,0 9,0 21,0 29,0l0 -6 -4 0c-16,0 -16,-2 -16,-10l0 -18 21 0 0 -7 -21 0 0 -96c0,-5 0,-6 -4,-6 -2,0 -2,0 -4,3l-65 99 0 7zm6 -7l52 -79 0 79 -52 0z"/>
  </g>
  <g>
   <path class="fil3" d="M3592 1500l-210 0 0 -50 210 0 0 50zm290 -25l-306 153 0 -306 306 153z"/>
  </g>
  <g>
   <path class="fil3" d="M6878 1500l-210 0 0 -50 210 0 0 50zm290 -25l-306 153 0 -306 306 153z"/>
  </g>
  <rect class="fil11 str0" x="2010" y="2010" width="500" height="500"/>
  <rect class="fil11 str0" x="2010" y="2510" width="500" height="500"/>
  <rect class="fil12 str0" x="10" y="2010" width="500" height="500"/>
  <rect class="fil12 str0" transform="matrix(1.99384E-014 -0.752831 0.752831 1.99384E-014 2010 2010)" width="664" height="664"/>
  <rect class="fil12 str0" x="10" y="2510" width="500" height="500"/>
  <rect class="fil12 str0" transform="matrix(1.99384E-014 -0.752831 0.752831 1.99384E-014 2510 2010)" width="664" height="664"/>
  <rect class="fil11 str0" x="2510" y="2010" width="500" height="500"/>
  <rect class="fil11 str0" x="2510" y="2510" width="500" height="500"/>
  <rect class="fil12 str0" x="510" y="2010" width="500" height="500"/>
  <rect class="fil12 str0" transform="matrix(1.99384E-014 -0.752831 0.752831 1.99384E-014 2010 1510)" width="664" height="664"/>
  <rect class="fil12 str0" x="510" y="2510" width="500" height="500"/>
  <rect class="fil12 str0" transform="matrix(1.99384E-014 -0.752831 0.752831 1.99384E-014 2510 1510)" width="664" height="664"/>
  <rect class="fil12 str0" x="1010" y="2010" width="500" height="500"/>
  <rect class="fil12 str0" transform="matrix(1.99384E-014 -0.752831 0.752831 1.99384E-014 2010 1010)" width="664" height="664"/>
  <rect class="fil12 str0" x="1010" y="2510" width="500" height="500"/>
  <rect class="fil12 str0" transform="matrix(1.99384E-014 -0.752831 0.752831 1.99384E-014 2510 1010)" width="664" height="664"/>
  <rect class="fil12 str0" x="1510" y="2010" width="500" height="500"/>
  <rect class="fil12 str0" transform="matrix(1.99384E-014 -0.752831 0.752831 1.99384E-014 2010 510)" width="664" height="664"/>
  <rect class="fil12 str0" x="1510" y="2510" width="500" height="500"/>
  <rect class="fil12 str0" transform="matrix(1.99384E-014 -0.752831 0.752831 1.99384E-014 2510 510)" width="664" height="664"/>
  <path class="fil3" d="M201 2261c0,21 1,46 12,68 12,22 33,28 47,28 15,0 37,-6 49,-33 9,-19 10,-41 10,-63 0,-23 -1,-46 -11,-66 -13,-28 -36,-32 -48,-32 -17,0 -37,7 -49,34 -9,19 -10,41 -10,64zm23 -4c0,-18 0,-37 2,-52 6,-33 27,-36 34,-36 9,0 28,5 33,33 3,16 3,37 3,55 0,21 0,41 -3,59 -4,26 -20,35 -33,35 -11,0 -28,-7 -33,-34 -3,-17 -3,-43 -3,-60z"/>
  <path class="fil3" d="M201 2761c0,21 1,46 12,68 12,22 33,28 47,28 15,0 37,-6 49,-33 9,-19 10,-41 10,-63 0,-23 -1,-46 -11,-66 -13,-28 -36,-32 -48,-32 -17,0 -37,7 -49,34 -9,19 -10,41 -10,64zm23 -4c0,-18 0,-37 2,-52 6,-33 27,-36 34,-36 9,0 28,5 33,33 3,16 3,37 3,55 0,21 0,41 -3,59 -4,26 -20,35 -33,35 -11,0 -28,-7 -33,-34 -3,-17 -3,-43 -3,-60z"/>
  <path class="fil3" d="M701 2261c0,21 1,46 12,68 12,22 33,28 47,28 15,0 37,-6 49,-33 9,-19 10,-41 10,-63 0,-23 -1,-46 -11,-66 -13,-28 -36,-32 -48,-32 -17,0 -37,7 -49,34 -9,19 -10,41 -10,64zm23 -4c0,-18 0,-37 2,-52 6,-33 27,-36 34,-36 9,0 28,5 33,33 3,16 3,37 3,55 0,21 0,41 -3,59 -4,26 -20,35 -33,35 -11,0 -28,-7 -33,-34 -3,-17 -3,-43 -3,-60z"/>
  <path class="fil3" d="M701 2761c0,21 1,46 12,68 12,22 33,28 47,28 15,0 37,-6 49,-33 9,-19 10,-41 10,-63 0,-23 -1,-46 -11,-66 -13,-28 -36,-32 -48,-32 -17,0 -37,7 -49,34 -9,19 -10,41 -10,64zm23 -4c0,-18 0,-37 2,-52 6,-33 27,-36 34,-36 9,0 28,5 33,33 3,16 3,37 3,55 0,21 0,41 -3,59 -4,26 -20,35 -33,35 -11,0 -28,-7 -33,-34 -3,-17 -3,-43 -3,-60z"/>
  <path class="fil3" d="M1201 2261c0,21 1,46 12,68 12,22 33,28 47,28 15,0 37,-6 49,-33 9,-19 10,-41 10,-63 0,-23 -1,-46 -11,-66 -13,-28 -36,-32 -48,-32 -17,0 -37,7 -49,34 -9,19 -10,41 -10,64zm23 -4c0,-18 0,-37 2,-52 6,-33 27,-36 34,-36 9,0 28,5 33,33 3,16 3,37 3,55 0,21 0,41 -3,59 -4,26 -20,35 -33,35 -11,0 -28,-7 -33,-34 -3,-17 -3,-43 -3,-60z"/>
  <path class="fil3" d="M1201 2761c0,21 1,46 12,68 12,22 33,28 47,28 15,0 37,-6 49,-33 9,-19 10,-41 10,-63 0,-23 -1,-46 -11,-66 -13,-28 -36,-32 -48,-32 -17,0 -37,7 -49,34 -9,19 -10,41 -10,64zm23 -4c0,-18 0,-37 2,-52 6,-33 27,-36 34,-36 9,0 28,5 33,33 3,16 3,37 3,55 0,21 0,41 -3,59 -4,26 -20,35 -33,35 -11,0 -28,-7 -33,-34 -3,-17 -3,-43 -3,-60z"/>
  <path class="fil3" d="M1701 2261c0,21 1,46 12,68 12,22 33,28 47,28 15,0 37,-6 49,-33 9,-19 10,-41 10,-63 0,-23 -1,-46 -11,-66 -13,-28 -36,-32 -48,-32 -17,0 -37,7 -49,34 -9,19 -10,41 -10,64zm23 -4c0,-18 0,-37 2,-52 6,-33 27,-36 34,-36 9,0 28,5 33,33 3,16 3,37 3,55 0,21 0,41 -3,59 -4,26 -20,35 -33,35 -11,0 -28,-7 -33,-34 -3,-17 -3,-43 -3,-60z"/>
  <path class="fil3" d="M1701 2761c0,21 1,46 12,68 12,22 33,28 47,28 15,0 37,-6 49,-33 9,-19 10,-41 10,-63 0,-23 -1,-46 -11,-66 -13,-28 -36,-32 -48,-32 -17,0 -37,7 -49,34 -9,19 -10,41 -10,64zm23 -4c0,-18 0,-37 2,-52 6,-33 27,-36 34,-36 9,0 28,5 33,33 3,16 3,37 3,55 0,21 0,41 -3,59 -4,26 -20,35 -33,35 -11,0 -28,-7 -33,-34 -3,-17 -3,-43 -3,-60z"/>
  <path class="fil3" d="M2201 261c0,21 1,46 12,68 12,22 33,28 47,28 15,0 37,-6 49,-33 9,-19 10,-41 10,-63 0,-23 -1,-46 -11,-66 -13,-28 -36,-32 -48,-32 -17,0 -37,7 -49,34 -9,19 -10,41 -10,64zm23 -4c0,-18 0,-37 2,-52 6,-33 27,-36 34,-36 9,0 28,5 33,33 3,16 3,37 3,55 0,21 0,41 -3,59 -4,26 -20,35 -33,35 -11,0 -28,-7 -33,-34 -3,-17 -3,-43 -3,-60z"/>
  <path class="fil3" d="M2201 761c0,21 1,46 12,68 12,22 33,28 47,28 15,0 37,-6 49,-33 9,-19 10,-41 10,-63 0,-23 -1,-46 -11,-66 -13,-28 -36,-32 -48,-32 -17,0 -37,7 -49,34 -9,19 -10,41 -10,64zm23 -4c0,-18 0,-37 2,-52 6,-33 27,-36 34,-36 9,0 28,5 33,33 3,16 3,37 3,55 0,21 0,41 -3,59 -4,26 -20,35 -33,35 -11,0 -28,-7 -33,-34 -3,-17 -3,-43 -3,-60z"/>
  <path class="fil3" d="M2201 1261c0,21 1,46 12,68 12,22 33,28 47,28 15,0 37,-6 49,-33 9,-19 10,-41 10,-63 0,-23 -1,-46 -11,-66 -13,-28 -36,-32 -48,-32 -17,0 -37,7 -49,34 -9,19 -10,41 -10,64zm23 -4c0,-18 0,-37 2,-52 6,-33 27,-36 34,-36 9,0 28,5 33,33 3,16 3,37 3,55 0,21 0,41 -3,59 -4,26 -20,35 -33,35 -11,0 -28,-7 -33,-34 -3,-17 -3,-43 -3,-60z"/>
  <path class="fil3" d="M2201 1761c0,21 1,46 12,68 12,22 33,28 47,28 15,0 37,-6 49,-33 9,-19 10,-41 10,-63 0,-23 -1,-46 -11,-66 -13,-28 -36,-32 -48,-32 -17,0 -37,7 -49,34 -9,19 -10,41 -10,64zm23 -4c0,-18 0,-37 2,-52 6,-33 27,-36 34,-36 9,0 28,5 33,33 3,16 3,37 3,55 0,21 0,41 -3,59 -4,26 -20,35 -33,35 -11,0 -28,-7 -33,-34 -3,-17 -3,-43 -3,-60z"/>
  <path class="fil3" d="M2701 261c0,21 1,46 12,68 12,22 33,28 47,28 15,0 37,-6 49,-33 9,-19 10,-41 10,-63 0,-23 -1,-46 -11,-66 -13,-28 -36,-32 -48,-32 -17,0 -37,7 -49,34 -9,19 -10,41 -10,64zm23 -4c0,-18 0,-37 2,-52 6,-33 27,-36 34,-36 9,0 28,5 33,33 3,16 3,37 3,55 0,21 0,41 -3,59 -4,26 -20,35 -33,35 -11,0 -28,-7 -33,-34 -3,-17 -3,-43 -3,-60z"/>
  <path class="fil3" d="M2701 761c0,21 1,46 12,68 12,22 33,28 47,28 15,0 37,-6 49,-33 9,-19 10,-41 10,-63 0,-23 -1,-46 -11,-66 -13,-28 -36,-32 -48,-32 -17,0 -37,7 -49,34 -9,19 -10,41 -10,64zm23 -4c0,-18 0,-37 2,-52 6,-33 27,-36 34,-36 9,0 28,5 33,33 3,16 3,37 3,55 0,21 0,41 -3,59 -4,26 -20,35 -33,35 -11,0 -28,-7 -33,-34 -3,-17 -3,-43 -3,-60z"/>
  <path class="fil3" d="M2701 1261c0,21 1,46 12,68 12,22 33,28 47,28 15,0 37,-6 49,-33 9,-19 10,-41 10,-63 0,-23 -1,-46 -11,-66 -13,-28 -36,-32 -48,-32 -17,0 -37,7 -49,34 -9,19 -10,41 -10,64zm23 -4c0,-18 0,-37 2,-52 6,-33 27,-36 34,-36 9,0 28,5 33,33 3,16 3,37 3,55 0,21 0,41 -3,59 -4,26 -20,35 -33,35 -11,0 -28,-7 -33,-34 -3,-17 -3,-43 -3,-60z"/>
  <path class="fil3" d="M2701 1761c0,21 1,46 12,68 12,22 33,28 47,28 15,0 37,-6 49,-33 9,-19 10,-41 10,-63 0,-23 -1,-46 -11,-66 -13,-28 -36,-32 -48,-32 -17,0 -37,7 -49,34 -9,19 -10,41 -10,64zm23 -4c0,-18 0,-37 2,-52 6,-33 27,-36 34,-36 9,0 28,5 33,33 3,16 3,37 3,55 0,21 0,41 -3,59 -4,26 -20,35 -33,35 -11,0 -28,-7 -33,-34 -3,-17 -3,-43 -3,-60z"/>
  <rect class="fil13 str0" x="4017" y="725" width="2500" height="1500"/>
  <path class="fil3" d="M4037 1046l147 0 8 -73 -7 0c-4,29 -7,64 -57,64l-23 0c-14,0 -14,-2 -14,-11l0 -151c0,-9 0,-13 27,-13l9 0 0 -9c-10,1 -36,1 -47,1 -11,0 -33,0 -43,-1l0 9 6 0c22,0 23,3 23,13l0 149c0,10 -1,13 -23,13l-6 0 0 9z"/>
  <path id="1" class="fil3" d="M4214 1046c10,-1 24,-1 33,-1 10,0 23,0 33,1l0 -9c-29,0 -29,-13 -29,-21l0 -152 0 0 68 175c2,4 3,7 6,7 3,0 4,-3 5,-6l70 -178 0 0 0 162c0,10 -1,13 -22,13l-7 0 0 9c10,-1 29,-1 40,-1 11,0 30,0 41,1l0 -9 -7 0c-22,0 -22,-3 -22,-13l0 -149c0,-10 0,-13 22,-13l7 0 0 -9 -48 0c-7,0 -7,0 -9,5l-62 159 -61 -158c-3,-6 -4,-6 -10,-6l-48 0 0 9 7 0c22,0 22,3 22,13l0 141c0,8 0,21 -29,21l0 9z"/>
  <path id="2" class="fil3" d="M4566 1046c9,-1 31,-1 42,-1 12,0 38,0 48,1l0 -9 -9 0c-27,0 -27,-4 -27,-14l0 -69 24 0c27,0 30,9 30,33l7 0 0 -75 -7 0c0,24 -3,33 -30,33l-24 0 0 -71c0,-10 0,-12 14,-12l33 0c43,0 50,16 54,55l7 0 -7 -63 -155 0 0 8 6 0c22,0 23,4 23,14l0 148c0,10 -1,13 -23,13l-6 0 0 9z"/>
  <path id="3" class="fil3" d="M4750 1046l111 0c38,0 63,-26 63,-52 0,-25 -23,-46 -54,-49 27,-6 46,-24 46,-44 0,-25 -26,-48 -62,-48l-104 0 0 9 7 0c22,0 22,3 22,13l0 149c0,10 0,13 -22,13l-7 0 0 9zm53 -20l0 -78 53 0c28,0 40,27 40,46 0,20 -15,43 -44,43l-35 0c-14,0 -14,-2 -14,-11zm0 -84l0 -69c0,-9 0,-11 14,-11l35 0c27,0 37,24 37,39 0,18 -14,41 -45,41l-41 0z"/>
  <path id="4" class="fil3" d="M4956 1045c0,5 0,7 3,7 2,0 2,-1 4,-4 0,0 1,-1 10,-16 9,10 27,20 52,20 33,0 56,-28 56,-59 0,-28 -19,-51 -42,-57l-37 -9c-17,-4 -28,-19 -28,-36 0,-19 15,-36 37,-36 47,0 54,46 55,58 1,2 1,4 4,4 3,0 3,-2 3,-7l0 -57c0,-4 0,-6 -3,-6 -2,0 -2,0 -4,3l-10 16c-8,-8 -20,-19 -45,-19 -31,0 -55,24 -55,54 0,24 15,44 37,52 3,1 17,5 37,9 8,2 16,4 24,15 6,7 9,16 9,26 0,20 -14,40 -38,40 -8,0 -30,-1 -45,-15 -16,-15 -17,-34 -17,-44 0,-2 -3,-2 -3,-2 -4,0 -4,1 -4,7l0 56z"/>
  <path id="5" class="fil3" d="M5200 985c0,36 28,64 60,64 18,0 31,-10 38,-19l0 19 41 -3 0 -9c-19,0 -22,-2 -22,-16l0 -171 -40 3 0 9c20,0 22,2 22,15l0 61c-8,-10 -21,-17 -36,-17 -33,0 -63,27 -63,64l0 0zm24 0c0,-10 0,-27 8,-40 6,-9 17,-18 32,-18 10,0 22,4 31,17 3,5 3,5 3,10l0 58c0,5 0,6 -3,11 -9,13 -21,19 -33,19 -13,0 -23,-7 -30,-18 -7,-11 -8,-27 -8,-39l0 0z"/>
  <path id="6" class="fil3" d="M5355 983c0,38 30,66 62,66 35,0 47,-32 47,-37 0,-3 -2,-3 -3,-3 -3,0 -3,1 -4,4 -10,29 -35,29 -38,29 -14,0 -25,-9 -32,-19 -8,-14 -8,-32 -8,-43l78 0c7,0 7,0 7,-6 0,-27 -15,-55 -50,-55 -33,0 -59,29 -59,64zm24 -9c2,-42 25,-49 35,-49 29,0 32,38 32,49l-67 0z"/>
  <path id="7" class="fil3" d="M5482 985c0,36 28,64 61,64 38,0 47,-34 47,-37 0,-3 -3,-3 -4,-3 -2,0 -3,1 -4,3 -8,26 -26,30 -37,30 -15,0 -39,-13 -39,-58 0,-46 23,-58 38,-58 2,0 20,0 30,11 -12,0 -13,9 -13,13 0,7 5,13 13,13 7,0 13,-5 13,-14 0,-19 -22,-30 -44,-30 -35,0 -61,31 -61,66z"/>
  <path id="8" class="fil3" d="M5606 985c0,37 29,64 62,64 34,0 63,-28 63,-64 0,-36 -28,-66 -63,-66 -35,0 -62,31 -62,66zm23 -2c0,-11 0,-26 7,-39 8,-13 21,-19 32,-19 13,0 25,7 32,19 7,12 7,28 7,39 0,10 0,25 -6,38 -6,12 -18,21 -33,21 -12,0 -24,-6 -32,-19 -7,-13 -7,-30 -7,-40z"/>
  <path id="9" class="fil3" d="M5748 933c22,0 22,1 22,26l0 42c0,22 0,48 43,48 16,0 28,-8 36,-26l0 26 41 -3 0 -9c-20,0 -22,-2 -22,-16l0 -100 -41 3 0 9c19,0 22,2 22,16l0 50c0,24 -14,43 -35,43 -23,0 -24,-13 -24,-27l0 -94 -42 3 0 9z"/>
  <path id="10" class="fil3" d="M5904 1092l0 8c9,0 24,-1 31,-1 8,0 22,1 32,1l0 -8c-19,0 -22,0 -22,-13l0 -48 0 -2c1,4 13,20 35,20 33,0 63,-28 63,-64 0,-36 -28,-64 -59,-64 -22,0 -34,12 -40,18l0 -18 -40 3 0 9c20,0 22,2 22,14l0 132c0,13 -4,13 -22,13zm41 -79l0 -62c8,-15 22,-23 36,-23 21,0 38,25 38,57 0,34 -19,57 -40,57 -12,0 -22,-5 -30,-17 -4,-6 -4,-6 -4,-12l0 0z"/>
  <path id="11" class="fil3" d="M6062 1046c9,-1 24,-1 31,-1 7,0 21,0 31,1l0 -9c-19,0 -22,0 -22,-13l0 -174 -40 3 0 9c19,0 22,2 22,15l0 147c0,13 -3,13 -22,13l0 9z"/>
  <path id="12" class="fil3" d="M6152 872c0,7 6,15 15,15 8,0 15,-6 15,-15 0,-9 -7,-15 -15,-15 -9,0 -15,7 -15,15zm-12 174c9,-1 24,-1 31,-1 10,0 20,0 29,1l0 -9c-18,0 -20,-2 -20,-13l0 -103 -39 3 0 9c18,0 21,2 21,15l0 76c0,13 -3,13 -22,13l0 9z"/>
  <path id="13" class="fil3" d="M6218 1046c10,-1 24,-1 32,-1 7,0 22,0 31,1l0 -9c-19,0 -22,0 -22,-13l0 -52c0,-29 20,-45 38,-45 18,0 21,15 21,31l0 66c0,13 -3,13 -22,13l0 9c10,-1 24,-1 32,-1 7,0 22,0 32,1l0 -9c-15,0 -22,0 -22,-9l0 -54c0,-24 0,-33 -9,-43 -4,-5 -13,-10 -30,-10 -20,0 -34,12 -42,29l0 -29 -39 3 0 9c19,0 22,2 22,16l0 75c0,13 -3,13 -22,13l0 9z"/>
  <path id="14" class="fil3" d="M6373 1068c0,20 28,36 63,36 33,0 62,-15 62,-37 0,-10 -4,-24 -18,-32 -15,-8 -31,-8 -49,-8 -7,0 -19,0 -21,0 -9,-1 -15,-10 -15,-19 0,-1 0,-8 5,-13 11,8 23,9 28,9 26,0 46,-20 46,-42 0,-10 -5,-21 -12,-27 10,-10 20,-11 25,-11 1,0 2,0 3,0 -3,1 -4,4 -4,8 0,5 3,8 8,8 3,0 8,-2 8,-8 0,-5 -3,-14 -14,-14 -6,0 -18,1 -30,13 -12,-9 -24,-10 -30,-10 -26,0 -46,19 -46,41 0,12 6,23 13,29 -3,4 -8,14 -8,24 0,8 3,19 12,25 -17,4 -26,17 -26,28zm15 0c0,-13 11,-24 23,-24l17 0c24,0 56,0 56,24 0,15 -21,29 -48,29 -29,0 -48,-14 -48,-29zm15 -106c0,-7 1,-16 5,-23 2,-4 9,-12 20,-12 24,0 24,29 24,35 0,8 0,17 -4,24 -2,3 -9,11 -20,11 -25,0 -25,-28 -25,-35z"/>
  <path id="15" class="fil3" d="M5173 1309c0,3 4,4 7,4 1,0 3,0 4,0l79 0 0 79c0,1 0,3 0,4 0,3 1,7 4,7 2,0 3,-4 3,-7l0 -83 80 0c0,0 2,0 3,0 4,0 7,-1 7,-4 0,-2 -3,-3 -6,-3 -2,0 -4,0 -4,0l-80 0 0 -83c0,-3 -1,-7 -3,-7 -3,0 -4,4 -4,7 0,1 0,3 0,3l0 80 -79 0c-7,0 -11,0 -11,3z"/>
  <path id="16" class="fil3" d="M4186 1602l24 0 0 77c0,35 26,39 36,39 20,0 28,-20 28,-39l0 -16 -7 0 0 16c0,21 -8,32 -19,32 -19,0 -19,-26 -19,-31l0 -78 41 0 0 -9 -41 0 0 -52 -7 0c0,23 -8,53 -36,54l0 7z"/>
  <path id="17" class="fil3" d="M4298 1714c11,0 24,0 32,0 11,0 25,0 36,0l0 -8 -6 0c-21,0 -21,-3 -21,-14l0 -43c0,-28 12,-53 33,-53 2,0 3,0 3,0 -1,0 -6,4 -6,11 0,8 6,12 12,12 5,0 12,-3 12,-12 0,-9 -9,-17 -21,-17 -21,0 -31,19 -35,31l0 -31 -39 3 0 9c20,0 22,2 22,16l0 75c0,13 -3,13 -22,13l0 8z"/>
  <path id="18" class="fil3" d="M4412 1688c0,23 28,30 45,30 19,0 32,-12 37,-25 2,11 9,23 22,23 6,0 24,-4 24,-27l0 -15 -7 0 0 15c0,17 -8,18 -11,18 -9,0 -10,-12 -10,-14l0 -56c0,-12 0,-23 -10,-33 -11,-11 -25,-16 -39,-16 -23,0 -42,13 -42,32 0,8 5,13 12,13 8,0 13,-5 13,-13 0,-3 -1,-13 -14,-13 8,-10 22,-13 31,-13 13,0 29,11 29,36l0 11c-14,1 -34,1 -51,10 -22,10 -29,24 -29,37l0 0zm22 -1c0,-15 12,-39 58,-40l0 28c0,27 -20,36 -33,36 -13,0 -25,-10 -25,-24z"/>
  <path id="19" class="fil3" d="M4551 1714c9,0 24,0 32,0 7,0 22,0 31,0l0 -8c-19,0 -22,0 -22,-13l0 -52c0,-29 20,-45 38,-45 18,0 21,15 21,31l0 66c0,13 -3,13 -22,13l0 8c10,0 24,0 32,0 7,0 22,0 32,0l0 -8c-15,0 -22,0 -22,-9l0 -54c0,-24 0,-33 -9,-43 -4,-5 -13,-10 -30,-10 -20,0 -34,12 -42,29l0 -29 -39 3 0 9c19,0 22,2 22,16l0 75c0,13 -3,13 -22,13l0 8z"/>
  <path id="20" class="fil3" d="M4708 1711c0,5 0,7 3,7 1,0 1,-1 7,-6 0,-1 0,-1 5,-7 13,12 25,13 31,13 33,0 46,-19 46,-40 0,-15 -9,-23 -12,-26 -9,-10 -20,-12 -32,-14 -16,-3 -35,-7 -35,-23 0,-10 7,-22 32,-22 31,0 32,26 33,35 0,2 3,2 3,2 4,0 4,-1 4,-7l0 -28c0,-5 0,-7 -3,-7 -2,0 -2,0 -6,3 -1,2 -4,4 -5,5 -11,-8 -22,-8 -26,-8 -35,0 -45,19 -45,35 0,10 4,18 12,24 9,7 17,9 37,13 6,1 29,5 29,26 0,14 -10,25 -32,25 -23,0 -33,-16 -39,-40 -1,-3 -1,-5 -4,-5 -3,0 -3,2 -3,8l0 37z"/>
  <path id="21" class="fil3" d="M4819 1602l22 0 0 91c0,13 -3,13 -22,13l0 8c11,0 24,0 32,0 11,0 25,0 36,0l0 -8 -6 0c-21,0 -21,-3 -21,-14l0 -90 32 0 0 -9 -33 0 0 -33c0,-25 13,-38 26,-38 1,0 5,0 9,2 -3,1 -8,4 -8,12 0,6 4,12 12,12 8,0 12,-6 12,-13 0,-10 -10,-20 -25,-20 -20,0 -44,15 -44,46l0 32 -22 0 0 9z"/>
  <path id="22" class="fil3" d="M4903 1654c0,36 30,64 63,64 34,0 62,-28 62,-64 0,-36 -28,-66 -62,-66 -35,0 -63,31 -63,66zm24 -2c0,-11 0,-26 7,-39 7,-13 20,-19 32,-19 12,0 24,6 32,19 7,12 7,28 7,39 0,10 0,25 -6,38 -6,12 -19,21 -33,21 -12,0 -25,-6 -32,-19 -7,-13 -7,-30 -7,-40z"/>
  <path id="23" class="fil3" d="M5044 1714c12,0 25,0 33,0 11,0 24,0 36,0l0 -8 -6 0c-21,0 -22,-3 -22,-14l0 -43c0,-28 12,-53 33,-53 2,0 3,0 4,0 -1,0 -7,4 -7,11 0,8 6,12 12,12 5,0 12,-3 12,-12 0,-9 -8,-17 -21,-17 -20,0 -30,19 -34,31l0 -31 -40 3 0 9c20,0 23,2 23,16l0 75c0,13 -4,13 -23,13l0 8z"/>
  <path id="24" class="fil3" d="M5156 1714c10,0 24,0 32,0 7,0 22,0 31,0l0 -8c-18,0 -22,0 -22,-13l0 -52c0,-29 21,-45 39,-45 17,0 20,15 20,31l0 66c0,13 -3,13 -22,13l0 8c10,0 25,0 32,0 8,0 22,0 32,0l0 -8c-19,0 -22,0 -22,-13l0 -52c0,-29 20,-45 38,-45 18,0 21,15 21,31l0 66c0,13 -3,13 -22,13l0 8c10,0 24,0 32,0 7,0 22,0 31,0l0 -8c-14,0 -21,0 -22,-9l0 -54c0,-24 0,-33 -8,-43 -4,-5 -14,-10 -30,-10 -24,0 -36,17 -41,27 -4,-24 -25,-27 -37,-27 -21,0 -34,12 -42,29l0 -29 -40 3 0 9c20,0 22,2 22,16l0 75c0,13 -3,13 -22,13l0 8z"/>
  <path id="25" class="fil3" d="M5394 1688c0,23 27,30 45,30 19,0 32,-12 37,-25 1,11 9,23 22,23 6,0 23,-4 23,-27l0 -15 -7 0 0 15c0,17 -7,18 -10,18 -9,0 -10,-12 -10,-14l0 -56c0,-12 0,-23 -11,-33 -11,-11 -25,-16 -38,-16 -23,0 -43,13 -43,32 0,8 6,13 13,13 8,0 13,-5 13,-13 0,-3 -1,-13 -14,-13 7,-10 21,-13 30,-13 14,0 30,11 30,36l0 11c-14,1 -34,1 -52,10 -21,10 -28,24 -28,37l0 0zm22 -1c0,-15 11,-39 58,-40l0 28c0,27 -20,36 -33,36 -14,0 -25,-10 -25,-24z"/>
  <path id="26" class="fil3" d="M5529 1602l23 0 0 77c0,35 27,39 37,39 20,0 28,-20 28,-39l0 -16 -7 0 0 16c0,21 -9,32 -19,32 -19,0 -19,-26 -19,-31l0 -78 40 0 0 -9 -40 0 0 -52 -7 0c0,23 -9,53 -36,54l0 7z"/>
  <path id="27" class="fil3" d="M5654 1541c0,7 6,15 15,15 8,0 15,-6 15,-15 0,-9 -7,-15 -15,-15 -9,0 -15,7 -15,15zm-12 173c9,0 24,0 31,0 10,0 20,0 29,0l0 -8c-18,0 -19,-2 -19,-13l0 -103 -40 3 0 9c18,0 21,2 21,15l0 76c0,13 -3,13 -22,13l0 8z"/>
  <path id="28" class="fil3" d="M5719 1654c0,36 29,64 62,64 34,0 63,-28 63,-64 0,-36 -28,-66 -63,-66 -35,0 -62,31 -62,66zm23 -2c0,-11 0,-26 7,-39 8,-13 21,-19 32,-19 13,0 25,6 32,19 7,12 7,28 7,39 0,10 0,25 -6,38 -6,12 -19,21 -33,21 -12,0 -24,-6 -32,-19 -7,-13 -7,-30 -7,-40z"/>
  <path id="29" class="fil3" d="M5861 1714c10,0 24,0 32,0 7,0 22,0 31,0l0 -8c-18,0 -22,0 -22,-13l0 -52c0,-29 20,-45 39,-45 17,0 20,15 20,31l0 66c0,13 -3,13 -22,13l0 8c10,0 25,0 32,0 8,0 22,0 32,0l0 -8c-15,0 -22,0 -22,-9l0 -54c0,-24 0,-33 -9,-43 -4,-5 -13,-10 -29,-10 -21,0 -34,12 -42,29l0 -29 -40 3 0 9c20,0 22,2 22,16l0 75c0,13 -3,13 -22,13l0 8z"/>
  <path id="30" class="fil3" d="M6108 1602l24 0 0 77c0,35 26,39 36,39 20,0 28,-20 28,-39l0 -16 -7 0 0 16c0,21 -8,32 -19,32 -19,0 -19,-26 -19,-31l0 -78 41 0 0 -9 -41 0 0 -52 -7 0c0,23 -8,53 -36,54l0 7z"/>
  <path id="31" class="fil3" d="M6220 1654c0,36 29,64 62,64 34,0 63,-28 63,-64 0,-36 -28,-66 -62,-66 -36,0 -63,31 -63,66zm23 -2c0,-11 0,-26 7,-39 8,-13 21,-19 32,-19 13,0 25,6 32,19 8,12 8,28 8,39 0,10 0,25 -7,38 -6,12 -18,21 -32,21 -13,0 -25,-6 -33,-19 -7,-13 -7,-30 -7,-40z"/>
  <path id="32" class="fil3" d="M4128 1936l24 0 0 78c0,35 27,38 37,38 20,0 28,-20 28,-38l0 -16 -7 0 0 15c0,21 -9,32 -19,32 -19,0 -19,-26 -19,-31l0 -78 40 0 0 -8 -40 0 0 -52 -7 0c0,22 -9,53 -37,54l0 6z"/>
  <path id="33" class="fil3" d="M4242 2049c9,0 24,-1 31,-1 8,0 22,1 32,1l0 -9c-19,0 -22,0 -22,-13l0 -51c0,-30 20,-46 38,-46 18,0 21,16 21,32l0 65c0,13 -3,13 -22,13l0 9c10,0 24,-1 32,-1 7,0 22,1 32,1l0 -9c-15,0 -22,0 -22,-8l0 -54c0,-24 0,-33 -9,-43 -4,-5 -13,-11 -30,-11 -24,0 -36,17 -40,27l-1 0 0 -98 -40 3 0 9c19,0 22,2 22,16l0 146c0,13 -4,13 -22,13l0 9z"/>
  <path id="34" class="fil3" d="M4397 1987c0,38 30,65 62,65 35,0 47,-31 47,-37 0,-3 -2,-3 -3,-3 -3,0 -3,2 -4,4 -10,29 -35,29 -38,29 -14,0 -26,-9 -32,-19 -8,-14 -8,-32 -8,-42l78 0c6,0 7,0 7,-6 0,-28 -15,-56 -50,-56 -33,0 -59,30 -59,65zm24 -9c1,-42 25,-49 35,-49 29,0 32,38 32,49l-67 0z"/>
  <path id="35" class="fil3" d="M4616 2095l0 9c10,-1 25,-1 32,-1 8,0 22,0 32,1l0 -9c-19,0 -22,0 -22,-13l0 -47 0 -3c1,5 13,20 35,20 33,0 63,-28 63,-64 0,-36 -28,-64 -59,-64 -22,0 -34,13 -40,19l0 -19 -41 4 0 8c20,0 22,2 22,14l0 132c0,13 -3,13 -22,13zm42 -78l0 -63c8,-15 22,-23 36,-23 21,0 38,25 38,57 0,34 -20,58 -41,58 -11,0 -22,-6 -29,-17 -4,-6 -4,-7 -4,-12l0 0z"/>
  <path id="36" class="fil3" d="M4773 2049c11,0 24,-1 32,-1 11,0 25,0 36,1l0 -9 -6 0c-21,0 -21,-3 -21,-13l0 -44c0,-28 12,-53 33,-53 2,0 2,0 3,1 -1,0 -6,3 -6,11 0,8 5,12 12,12 5,0 12,-4 12,-13 0,-9 -9,-17 -21,-17 -21,0 -31,19 -35,31l0 -31 -39 4 0 8c20,0 22,2 22,16l0 75c0,13 -3,13 -22,13l0 9z"/>
  <path id="37" class="fil3" d="M4897 1875c0,8 6,15 15,15 7,0 15,-6 15,-15 0,-9 -8,-15 -15,-15 -9,0 -15,8 -15,15zm-12 174c9,0 24,-1 31,-1 10,0 20,1 29,1l0 -9c-18,0 -20,-1 -20,-12l0 -104 -39 4 0 8c18,0 21,2 21,16l0 75c0,13 -3,13 -22,13l0 9z"/>
  <path id="38" class="fil3" d="M4963 2049c10,0 24,-1 32,-1 7,0 22,1 31,1l0 -9c-19,0 -22,0 -22,-13l0 -51c0,-30 20,-46 38,-46 18,0 21,16 21,32l0 65c0,13 -3,13 -22,13l0 9c10,0 24,-1 32,-1 7,0 22,1 32,1l0 -9c-19,0 -22,0 -22,-13l0 -51c0,-30 20,-46 38,-46 17,0 21,16 21,32l0 65c0,13 -4,13 -22,13l0 9c9,0 24,-1 31,-1 8,0 22,1 32,1l0 -9c-15,0 -22,0 -22,-8l0 -54c0,-24 0,-33 -9,-43 -4,-5 -13,-11 -29,-11 -24,0 -36,17 -41,28 -4,-25 -25,-28 -38,-28 -20,0 -34,12 -42,30l0 -30 -39 4 0 8c19,0 22,2 22,16l0 75c0,13 -3,13 -22,13l0 9z"/>
  <path id="39" class="fil3" d="M5201 2022c0,23 27,30 45,30 18,0 31,-11 37,-25 1,12 8,24 22,24 6,0 23,-4 23,-27l0 -16 -7 0 0 16c0,16 -7,18 -10,18 -10,0 -11,-13 -11,-14l0 -57c0,-12 0,-23 -10,-33 -11,-11 -25,-16 -39,-16 -23,0 -42,14 -42,32 0,9 5,14 13,14 8,0 13,-6 13,-13 0,-4 -2,-13 -15,-13 8,-10 22,-13 31,-13 14,0 30,11 30,36l0 10c-15,1 -34,2 -52,10 -21,10 -28,25 -28,37l0 0zm21 0c0,-16 12,-39 59,-41l0 28c0,27 -21,37 -33,37 -14,0 -26,-10 -26,-24z"/>
  <path id="40" class="fil3" d="M5339 2049c9,0 24,-1 31,-1 8,0 21,1 32,1l0 -9c-19,0 -22,0 -22,-13l0 -174 -41 3 0 9c20,0 22,2 22,16l0 146c0,13 -3,13 -22,13l0 9z"/>
  <path id="41" class="fil3" d="M5512 1988c0,36 27,64 59,64 18,0 31,-10 38,-19l0 19 42 -3 0 -9c-20,0 -22,-2 -22,-16l0 -171 -41 3 0 9c20,0 22,2 22,16l0 61c-8,-11 -20,-18 -35,-18 -34,0 -63,28 -63,64l0 0zm23 0c0,-10 1,-27 9,-40 6,-8 16,-18 32,-18 10,0 21,5 30,17 3,5 3,6 3,11l0 58c0,5 0,5 -3,10 -8,14 -21,20 -33,20 -13,0 -23,-8 -30,-18 -7,-12 -8,-28 -8,-40l0 0z"/>
  <path id="42" class="fil3" d="M5667 1988c0,37 29,64 62,64 34,0 63,-28 63,-64 0,-36 -29,-66 -63,-66 -35,0 -62,31 -62,66zm23 -2c0,-11 0,-26 7,-38 7,-13 21,-19 32,-19 12,0 24,6 32,18 7,12 7,29 7,39 0,10 0,26 -6,38 -6,13 -19,21 -33,21 -12,0 -24,-6 -32,-19 -7,-12 -7,-30 -7,-40z"/>
  <path id="43" class="fil3" d="M5809 2049c10,0 24,-1 32,-1 7,0 22,1 31,1l0 -9c-19,0 -22,0 -22,-13l0 -51c0,-30 20,-46 38,-46 18,0 21,16 21,32l0 65c0,13 -3,13 -22,13l0 9c10,0 24,-1 32,-1 7,0 22,1 32,1l0 -9c-19,0 -22,0 -22,-13l0 -51c0,-30 20,-46 38,-46 18,0 21,16 21,32l0 65c0,13 -3,13 -22,13l0 9c10,0 24,-1 32,-1 7,0 22,1 31,1l0 -9c-15,0 -22,0 -22,-8l0 -54c0,-24 0,-33 -9,-43 -4,-5 -13,-11 -29,-11 -24,0 -36,17 -41,28 -4,-25 -25,-28 -38,-28 -20,0 -34,12 -41,30l0 -30 -40 4 0 8c20,0 22,2 22,16l0 75c0,13 -3,13 -22,13l0 9z"/>
  <path id="44" class="fil3" d="M6047 2022c0,23 27,30 45,30 18,0 31,-11 37,-25 1,12 9,24 22,24 6,0 23,-4 23,-27l0 -16 -7 0 0 16c0,16 -7,18 -10,18 -10,0 -11,-13 -11,-14l0 -57c0,-12 0,-23 -10,-33 -11,-11 -25,-16 -39,-16 -23,0 -42,14 -42,32 0,9 5,14 13,14 8,0 13,-6 13,-13 0,-4 -2,-13 -15,-13 8,-10 22,-13 31,-13 14,0 30,11 30,36l0 10c-15,1 -34,2 -52,10 -21,10 -28,25 -28,37l0 0zm21 0c0,-16 12,-39 59,-41l0 28c0,27 -21,37 -33,37 -14,0 -26,-10 -26,-24z"/>
  <path id="45" class="fil3" d="M6197 1875c0,8 6,15 15,15 8,0 15,-6 15,-15 0,-9 -7,-15 -15,-15 -9,0 -15,8 -15,15zm-12 174c9,0 24,-1 31,-1 10,0 20,1 30,1l0 -9c-19,0 -20,-1 -20,-12l0 -104 -40 4 0 8c19,0 21,2 21,16l0 75c0,13 -3,13 -22,13l0 9z"/>
  <path id="46" class="fil3" d="M6263 2049c10,0 24,-1 32,-1 7,0 22,1 32,1l0 -9c-19,0 -22,0 -22,-13l0 -51c0,-30 20,-46 38,-46 17,0 21,16 21,32l0 65c0,13 -4,13 -22,13l0 9c9,0 24,-1 31,-1 8,0 22,1 32,1l0 -9c-15,0 -22,0 -22,-8l0 -54c0,-24 0,-33 -9,-43 -4,-5 -13,-11 -29,-11 -21,0 -34,12 -42,30l0 -30 -40 4 0 8c20,0 22,2 22,16l0 75c0,13 -3,13 -22,13l0 9z"/>
  <g>
   <path class="fil3" d="M2115 2348c0,3 3,3 4,3 11,0 22,-1 33,-1 12,0 23,1 34,1 2,0 6,0 6,-5 0,-4 -2,-4 -8,-4 -16,0 -16,-2 -16,-4 0,-1 0,-2 1,-6l19 -77 77 0 -19 76c-2,9 -4,11 -23,11 -4,0 -7,0 -7,6 0,3 3,3 4,3 10,0 22,-1 33,-1 11,0 23,1 34,1 2,0 5,0 5,-5 0,-4 -2,-4 -7,-4 -17,0 -17,-2 -17,-4 0,-1 0,-3 1,-7l38 -153c3,-9 5,-11 23,-11 6,0 8,0 8,-5 0,-3 -2,-4 -4,-4 -11,0 -22,1 -33,1 -11,0 -23,-1 -34,-1 -2,0 -5,0 -5,6 0,3 2,3 7,3 9,0 17,0 17,5 0,1 0,1 -1,5l-18 70 -77 0 17 -69c2,-9 4,-11 22,-11 6,0 9,0 9,-5 0,-3 -2,-4 -4,-4 -11,0 -23,1 -34,1 -11,0 -22,-1 -33,-1 -2,0 -6,0 -6,6 0,3 2,3 8,3 9,0 16,0 16,5 0,1 0,1 -1,5l-38 154c-2,9 -4,11 -23,11 -5,0 -8,0 -8,6z"/>
   <path class="fil3" d="M2324 2368c3,0 11,0 19,-4l0 73c0,5 -1,7 -13,7l-5 0 0 4c5,0 17,0 23,0 6,0 18,0 23,0l0 -4 -5 0c-12,0 -13,-1 -13,-7l0 -79c0,-3 0,-4 -3,-4 -9,10 -21,10 -26,10l0 4z"/>
   <path id="1" class="fil3" d="M2395 2368c3,0 11,0 18,-4l0 73c0,5 0,7 -13,7l-4 0 0 4c5,0 17,0 22,0 6,0 18,0 23,0l0 -4 -4 0c-13,0 -13,-1 -13,-7l0 -79c0,-3 0,-4 -4,-4 -8,10 -21,10 -25,10l0 4z"/>
   <path class="fil3" d="M2324 2228c3,0 11,0 19,-4l0 73c0,5 -1,7 -13,7l-5 0 0 4c5,0 17,0 23,0 6,0 18,0 23,0l0 -4 -5 0c-12,0 -13,-2 -13,-7l0 -79c0,-3 0,-4 -3,-4 -9,9 -21,9 -26,9l0 5z"/>
   <path id="1" class="fil3" d="M2395 2228c3,0 11,0 18,-4l0 73c0,5 0,7 -13,7l-4 0 0 4c5,0 17,0 22,0 6,0 18,0 23,0l0 -4 -4 0c-13,0 -13,-2 -13,-7l0 -79c0,-3 0,-4 -4,-4 -8,9 -21,9 -25,9l0 5z"/>
   <path class="fil3" d="M2089 2258c0,3 2,3 4,3l43 0c1,0 2,0 3,-1 2,-1 3,-8 3,-8 0,-3 -2,-3 -5,-3l-42 0c-1,0 -2,0 -3,0 -3,1 -3,8 -3,9z"/>
  </g>
  <g>
   <path class="fil3" d="M2610 2348c0,3 3,3 4,3 11,0 22,-1 33,-1 12,0 23,1 34,1 2,0 6,0 6,-5 0,-4 -2,-4 -8,-4 -16,0 -16,-2 -16,-4 0,-1 0,-2 1,-6l19 -77 77 0 -19 76c-2,9 -4,11 -23,11 -4,0 -7,0 -7,6 0,3 3,3 4,3 10,0 22,-1 33,-1 11,0 23,1 34,1 2,0 5,0 5,-5 0,-4 -2,-4 -7,-4 -17,0 -17,-2 -17,-4 0,-1 0,-3 1,-7l38 -153c3,-9 5,-11 23,-11 6,0 8,0 8,-5 0,-3 -2,-4 -4,-4 -11,0 -22,1 -33,1 -11,0 -23,-1 -34,-1 -2,0 -5,0 -5,6 0,3 2,3 7,3 9,0 17,0 17,5 0,1 0,1 -1,5l-18 70 -77 0 17 -69c2,-9 4,-11 22,-11 6,0 9,0 9,-5 0,-3 -2,-4 -4,-4 -11,0 -23,1 -34,1 -11,0 -22,-1 -33,-1 -2,0 -6,0 -6,6 0,3 2,3 8,3 9,0 16,0 16,5 0,1 0,1 -1,5l-38 154c-2,9 -4,11 -23,11 -5,0 -8,0 -8,6z"/>
   <path class="fil3" d="M2819 2368c3,0 11,0 19,-4l0 73c0,5 -1,7 -13,7l-5 0 0 4c5,0 17,0 23,0 6,0 18,0 23,0l0 -4 -5 0c-12,0 -13,-1 -13,-7l0 -79c0,-3 0,-4 -3,-4 -9,10 -21,10 -26,10l0 4z"/>
   <path id="1" class="fil3" d="M2884 2448l53 0 4 -24 -4 0c-1,4 -2,10 -3,12 -1,2 -10,2 -13,2l-26 0 15 -15c22,-19 31,-27 31,-41 0,-16 -13,-28 -30,-28 -16,0 -27,13 -27,26 0,8 7,8 8,8 2,0 7,-2 7,-8 0,-3 -2,-7 -7,-7 -2,0 -2,0 -2,0 3,-9 11,-14 19,-14 13,0 19,11 19,23 0,11 -7,22 -15,31l-27 30c-2,2 -2,2 -2,5z"/>
   <path class="fil3" d="M2819 2228c3,0 11,0 19,-4l0 73c0,5 -1,7 -13,7l-5 0 0 4c5,0 17,0 23,0 6,0 18,0 23,0l0 -4 -5 0c-12,0 -13,-2 -13,-7l0 -79c0,-3 0,-4 -3,-4 -9,9 -21,9 -26,9l0 5z"/>
   <path id="1" class="fil3" d="M2890 2228c3,0 11,0 18,-4l0 73c0,5 0,7 -13,7l-4 0 0 4c5,0 17,0 22,0 6,0 18,0 23,0l0 -4 -4 0c-13,0 -13,-2 -13,-7l0 -79c0,-3 0,-4 -4,-4 -8,9 -21,9 -25,9l0 5z"/>
   <path class="fil3" d="M2584 2258c0,3 2,3 4,3l43 0c1,0 2,0 3,-1 2,-1 3,-8 3,-8 0,-3 -2,-3 -5,-3l-42 0c-1,0 -2,0 -3,0 -3,1 -3,8 -3,9z"/>
  </g>
  <g>
   <path class="fil3" d="M2110 2852c0,4 3,4 4,4 11,0 22,-1 33,-1 12,0 23,1 34,1 2,0 6,0 6,-5 0,-4 -2,-4 -8,-4 -16,0 -16,-2 -16,-5 0,-1 0,-2 1,-6l19 -76 77 0 -19 75c-2,10 -4,12 -23,12 -4,0 -7,0 -7,5 0,4 3,4 4,4 10,0 22,-1 33,-1 11,0 23,1 34,1 2,0 5,0 5,-5 0,-4 -2,-4 -7,-4 -17,0 -17,-2 -17,-5 0,0 0,-2 1,-6l38 -153c3,-9 5,-11 23,-11 6,0 8,0 8,-5 0,-4 -2,-4 -4,-4 -11,0 -22,1 -33,1 -11,0 -23,-1 -34,-1 -2,0 -5,0 -5,5 0,4 2,4 7,4 9,0 17,0 17,4 0,1 0,2 -1,6l-18 69 -77 0 17 -68c2,-9 4,-11 22,-11 6,0 9,0 9,-5 0,-4 -2,-4 -4,-4 -11,0 -23,1 -34,1 -11,0 -22,-1 -33,-1 -2,0 -6,0 -6,5 0,4 2,4 8,4 9,0 16,0 16,4 0,1 0,2 -1,6l-38 153c-2,10 -4,12 -23,12 -5,0 -8,0 -8,5z"/>
   <path class="fil3" d="M2319 2872c3,0 11,0 19,-3l0 73c0,5 -1,7 -13,7l-5 0 0 4c5,0 17,0 23,0 6,0 18,0 23,0l0 -4 -5 0c-12,0 -13,-2 -13,-7l0 -79c0,-4 0,-4 -3,-4 -9,9 -21,9 -26,9l0 4z"/>
   <path id="1" class="fil3" d="M2390 2872c3,0 11,0 18,-3l0 73c0,5 0,7 -13,7l-4 0 0 4c5,0 17,0 22,0 6,0 18,0 23,0l0 -4 -4 0c-13,0 -13,-2 -13,-7l0 -79c0,-4 0,-4 -4,-4 -8,9 -21,9 -25,9l0 4z"/>
   <path class="fil3" d="M2319 2732c3,0 11,0 19,-3l0 73c0,5 -1,6 -13,6l-5 0 0 5c5,-1 17,-1 23,-1 6,0 18,0 23,1l0 -5 -5 0c-12,0 -13,-1 -13,-6l0 -79c0,-4 0,-4 -3,-4 -9,9 -21,9 -26,9l0 4z"/>
   <path id="1" class="fil3" d="M2384 2813l53 0 4 -25 -4 0c-1,5 -2,11 -3,13 -1,1 -10,1 -13,1l-26 0 15 -15c22,-19 31,-27 31,-41 0,-16 -13,-27 -30,-27 -16,0 -27,13 -27,25 0,8 7,8 8,8 2,0 7,-1 7,-7 0,-4 -2,-8 -7,-8 -2,0 -2,0 -2,1 3,-10 11,-15 19,-15 13,0 19,12 19,23 0,12 -7,23 -15,31l-27 31c-2,1 -2,1 -2,5z"/>
   <path class="fil3" d="M2084 2762c0,3 2,3 4,3l43 0c1,0 2,0 3,0 2,-2 3,-8 3,-9 0,-2 -2,-3 -5,-3l-42 0c-1,0 -2,0 -3,1 -3,1 -3,8 -3,8z"/>
  </g>
  <g>
   <path class="fil3" d="M2610 2852c0,4 3,4 4,4 11,0 22,-1 33,-1 12,0 23,1 34,1 2,0 6,0 6,-5 0,-4 -2,-4 -8,-4 -16,0 -16,-2 -16,-5 0,-1 0,-2 1,-6l19 -76 77 0 -19 75c-2,10 -4,12 -23,12 -4,0 -7,0 -7,5 0,4 3,4 4,4 10,0 22,-1 33,-1 11,0 23,1 34,1 2,0 5,0 5,-5 0,-4 -2,-4 -7,-4 -17,0 -17,-2 -17,-5 0,0 0,-2 1,-6l38 -153c3,-9 5,-11 23,-11 6,0 8,0 8,-5 0,-4 -2,-4 -4,-4 -11,0 -22,1 -33,1 -11,0 -23,-1 -34,-1 -2,0 -5,0 -5,5 0,4 2,4 7,4 9,0 17,0 17,4 0,1 0,2 -1,6l-18 69 -77 0 17 -68c2,-9 4,-11 22,-11 6,0 9,0 9,-5 0,-4 -2,-4 -4,-4 -11,0 -23,1 -34,1 -11,0 -22,-1 -33,-1 -2,0 -6,0 -6,5 0,4 2,4 8,4 9,0 16,0 16,4 0,1 0,2 -1,6l-38 153c-2,10 -4,12 -23,12 -5,0 -8,0 -8,5z"/>
   <path class="fil3" d="M2819 2872c3,0 11,0 19,-3l0 73c0,5 -1,7 -13,7l-5 0 0 4c5,0 17,0 23,0 6,0 18,0 23,0l0 -4 -5 0c-12,0 -13,-2 -13,-7l0 -79c0,-4 0,-4 -3,-4 -9,9 -21,9 -26,9l0 4z"/>
   <path id="1" class="fil3" d="M2884 2953l53 0 4 -25 -4 0c-1,5 -2,11 -3,13 -1,1 -10,1 -13,1l-26 0 15 -14c22,-20 31,-28 31,-42 0,-16 -13,-27 -30,-27 -16,0 -27,13 -27,25 0,8 7,8 8,8 2,0 7,-1 7,-7 0,-4 -2,-7 -7,-7 -2,0 -2,0 -2,0 3,-9 11,-15 19,-15 13,0 19,12 19,23 0,12 -7,23 -15,32l-27 30c-2,1 -2,2 -2,5z"/>
   <path class="fil3" d="M2819 2732c3,0 11,0 19,-3l0 73c0,5 -1,6 -13,6l-5 0 0 5c5,-1 17,-1 23,-1 6,0 18,0 23,1l0 -5 -5 0c-12,0 -13,-1 -13,-6l0 -79c0,-4 0,-4 -3,-4 -9,9 -21,9 -26,9l0 4z"/>
   <path id="1" class="fil3" d="M2884 2813l53 0 4 -25 -4 0c-1,5 -2,11 -3,13 -1,1 -10,1 -13,1l-26 0 15 -15c22,-19 31,-27 31,-41 0,-16 -13,-27 -30,-27 -16,0 -27,13 -27,25 0,8 7,8 8,8 2,0 7,-1 7,-7 0,-4 -2,-8 -7,-8 -2,0 -2,0 -2,1 3,-10 11,-15 19,-15 13,0 19,12 19,23 0,12 -7,23 -15,31l-27 31c-2,1 -2,1 -2,5z"/>
   <path class="fil3" d="M2584 2762c0,3 2,3 4,3l43 0c1,0 2,0 3,0 2,-2 3,-8 3,-9 0,-2 -2,-3 -5,-3l-42 0c-1,0 -2,0 -3,1 -3,1 -3,8 -3,8z"/>
  </g>
 </g>
</svg>
