<?xml version="1.0" encoding="UTF-8"?>
<!DOCTYPE svg PUBLIC "-//W3C//DTD SVG 1.1//EN" "http://www.w3.org/Graphics/SVG/1.1/DTD/svg11.dtd">
<!-- Creator: CorelDRAW X7 -->
<svg xmlns="http://www.w3.org/2000/svg" xml:space="preserve" width="492.587mm" height="118.574mm" version="1.1" style="shape-rendering:geometricPrecision; text-rendering:geometricPrecision; image-rendering:optimizeQuality; fill-rule:evenodd; clip-rule:evenodd"
viewBox="0 0 28262 6803"
 xmlns:xlink="http://www.w3.org/1999/xlink">
 <defs>
  <style type="text/css">
   <![CDATA[
    .str5 {stroke:#ED3237;stroke-width:80.96}
    .str4 {stroke:#373435;stroke-width:101.196}
    .str2 {stroke:#373435;stroke-width:273.259;stroke-linecap:round;stroke-linejoin:round}
    .str0 {stroke:#373435;stroke-width:151.811;stroke-linecap:round;stroke-linejoin:round}
    .str1 {stroke:#373536;stroke-width:151.811;stroke-linecap:round;stroke-linejoin:round}
    .str3 {stroke:#373536;stroke-width:183.389;stroke-linecap:round;stroke-linejoin:round}
    .fil0 {fill:none}
    .fil3 {fill:#D2D3D5}
    .fil2 {fill:black}
    .fil1 {fill:#FFCC29}
    .fil4 {fill:#373435;fill-rule:nonzero}
    .fil5 {fill:#ED3237;fill-rule:nonzero}
   ]]>
  </style>
 </defs>
 <g id="Layer_x0020_1">
  <metadata id="CorelCorpID_0Corel-Layer"/>
  <g id="_2996429176912">
   <polyline class="fil0 str0" points="2993,3456 3668,3456 3668,4270 4325,2644 4325,4270 4983,2644 4983,4270 5621,2644 5621,3456 6297,3456 "/>
   <path class="fil1 str1" d="M76 4918l0 -2921c0,-121 97,-218 217,-218l2444 0c120,0 216,97 216,218l0 2921c0,120 -96,217 -216,217l-2444 0c-120,0 -217,-97 -217,-217l0 0z"/>
   <path class="fil2" d="M1377 3195l0 9c0,2 0,5 0,8 34,-48 68,-85 102,-108 34,-23 69,-35 105,-35 38,0 66,11 85,33 21,20 31,52 31,93 0,26 -5,56 -12,91l-50 212c-8,28 -10,51 -10,68 0,11 1,20 5,26 5,8 11,13 19,16 8,4 22,6 40,9l-4 29 -186 0 74 -301c6,-22 11,-44 14,-66 4,-23 6,-44 6,-62 0,-28 -4,-48 -14,-59 -10,-12 -26,-20 -47,-20 -15,0 -33,8 -53,20 -18,13 -39,31 -59,58 -21,26 -38,52 -51,78 -14,25 -25,56 -32,93l-54 259 -102 0 68 -301c8,-37 13,-65 17,-82 2,-18 4,-32 4,-46 0,-28 -6,-48 -15,-59 -10,-12 -26,-20 -48,-20 -16,0 -33,8 -52,21 -19,12 -39,31 -61,58 -22,28 -39,54 -51,80 -13,26 -23,56 -30,93l-54 256 -103 0 90 -406c3,-8 5,-22 9,-40 3,-17 4,-33 4,-44 0,-10 -1,-19 -4,-25 -4,-7 -10,-11 -17,-15 -9,-2 -22,-4 -42,-6l8 -31 134 -5 33 0 -39 153 8 2c36,-53 73,-93 108,-120 36,-27 73,-40 109,-40 39,0 67,11 87,33 20,22 30,52 30,93l0 0z"/>
   <path class="fil2" d="M2046 3788c0,15 1,27 2,34 3,7 5,13 9,18 5,5 11,9 19,11 7,4 17,5 29,7 12,2 28,2 49,3l0 28 -285 0 0 -28c29,-1 48,-4 60,-5 12,-2 22,-6 28,-11 7,-4 12,-10 15,-18 2,-7 5,-21 5,-39l0 -312c0,-11 -3,-18 -6,-23 -4,-5 -9,-7 -16,-7 -9,0 -20,4 -35,13 -15,8 -34,19 -56,35l-17 -30 181 -107 20 0c-1,24 -2,58 -2,102l0 329z"/>
   <path class="fil2" d="M4351 5173l18 0c12,0 26,-3 40,-8 15,-5 29,-12 45,-22 17,-11 39,-26 66,-48 20,-16 36,-31 46,-41 10,-13 16,-24 19,-32 4,-9 6,-17 6,-24 0,-20 -13,-31 -40,-33l6 -29 192 0 11 29c-33,29 -67,58 -104,87l-150 117 89 225c9,19 16,35 24,46 9,11 19,19 30,24 10,5 24,9 41,10l-6 29 -158 0 -88 -244c-4,-16 -9,-26 -13,-32 -5,-5 -8,-9 -15,-12 -4,-2 -13,-4 -24,-4l-44 0 -61 292 -104 0 153 -678c5,-20 8,-34 9,-44 2,-8 3,-17 5,-24 0,-7 1,-14 1,-20 0,-16 -6,-28 -16,-34 -10,-8 -28,-11 -53,-13l6 -30 150 -6 34 0 -115 519z"/>
   <path class="fil2" d="M5003 5645c0,15 1,26 3,34 2,7 4,13 9,18 4,5 10,9 19,11 7,3 18,5 30,6 12,1 28,3 47,4l0 28 -285 0 0 -28c29,-3 50,-4 62,-6 12,-1 22,-5 28,-10 6,-4 11,-11 13,-18 4,-9 5,-21 5,-39l0 -313c0,-10 -1,-17 -5,-22 -4,-5 -10,-7 -16,-7 -8,0 -20,4 -35,13 -16,8 -34,19 -57,34l-17 -29 181 -108 21 0c-2,25 -3,59 -3,103l0 329z"/>
   <polyline class="fil0 str2" points="9306,4280 9981,4280 9981,5092 10638,3466 10638,5092 11296,3466 11296,5092 11934,3466 11934,4280 12610,4280 "/>
   <path class="fil1 str3" d="M6405 6496l0 -4548c0,-119 96,-215 215,-215l2415 0c119,0 215,96 215,215l0 4548c0,119 -96,215 -215,215l-2415 0c-119,0 -215,-96 -215,-215l0 0z"/>
   <path class="fil2" d="M9870 6029l18 0c12,0 25,-3 40,-7 15,-5 29,-13 46,-22 16,-11 38,-27 65,-49 20,-16 36,-30 46,-41 9,-12 17,-23 20,-32 4,-8 5,-17 5,-24 0,-20 -13,-30 -40,-33l6 -29 192 0 12 29c-33,29 -68,58 -104,88l-151 116 89 225c8,19 17,35 24,46 9,11 18,19 29,24 11,5 26,9 43,10l-8 29 -157 0 -88 -244c-5,-16 -10,-25 -13,-32 -4,-4 -9,-9 -14,-12 -6,-2 -14,-3 -25,-3l-44 0 -62 291 -102 0 152 -678c5,-20 7,-34 9,-43 2,-9 3,-17 4,-25 2,-7 2,-14 2,-20 0,-16 -5,-28 -16,-35 -10,-7 -28,-10 -54,-11l8 -31 149 -6 34 0 -115 519z"/>
   <path class="fil2" d="M10526 6540c12,0 23,-1 30,-2 7,-2 13,-4 18,-8 5,-3 9,-8 11,-14 2,-6 6,-15 11,-27l33 0 -8 113 -317 0 0 -19c11,-27 26,-55 45,-83 19,-28 45,-61 81,-100 29,-32 51,-58 64,-75 13,-18 24,-34 32,-47 7,-14 12,-27 15,-38 3,-12 4,-24 4,-36 0,-20 -2,-37 -9,-51 -6,-15 -15,-27 -29,-36 -12,-8 -28,-12 -47,-12 -49,0 -80,27 -97,80l-46 0 0 -74c30,-14 59,-25 86,-31 28,-7 52,-11 74,-11 47,0 84,11 108,31 24,22 36,51 36,92 0,13 -1,26 -4,37 -3,12 -6,23 -13,34 -6,11 -13,23 -23,37 -9,12 -20,25 -32,38 -11,14 -32,36 -61,66 -49,52 -85,97 -108,136l146 0z"/>
   <path class="fil2" d="M11546 6029l19 0c12,0 26,-3 39,-7 15,-5 30,-13 46,-22 16,-11 38,-27 66,-49 20,-16 35,-30 45,-41 9,-12 17,-23 20,-32 4,-8 5,-17 5,-24 0,-20 -13,-30 -40,-33l6 -29 193 0 11 29c-33,29 -68,58 -104,88l-151 116 90 225c7,19 16,35 24,46 8,11 17,19 28,24 11,5 26,9 43,10l-8 29 -157 0 -87 -244c-6,-16 -11,-25 -14,-32 -4,-4 -9,-9 -14,-12 -4,-2 -13,-3 -25,-3l-44 0 -62 291 -102 0 152 -678c5,-20 7,-34 10,-43 1,-9 2,-17 3,-25 2,-7 2,-14 2,-20 0,-16 -5,-28 -16,-35 -10,-7 -28,-10 -54,-11l8 -31 149 -6 35 0 -116 519z"/>
   <path class="fil2" d="M12130 6583c16,-4 27,-9 31,-14 7,-5 10,-12 11,-22 2,-8 3,-23 3,-42l0 -63 -214 0 0 -29 225 -340 56 0 0 331 7 0c16,0 27,0 33,-2 6,-3 11,-6 15,-12 4,-5 9,-15 13,-27l29 0 -5 79 -92 0 0 63c0,17 0,30 1,38 1,8 3,14 6,19 2,5 6,8 12,11 5,4 13,7 26,10l0 19 -157 0 0 -19zm-106 -179l151 0 0 -96c0,-23 1,-51 1,-80 1,-30 2,-53 2,-68l-3 0 -151 239 0 5z"/>
   <path class="fil2" d="M7698 2960l0 8c0,3 0,6 0,9 34,-49 68,-84 102,-108 34,-23 69,-34 106,-34 37,0 67,9 85,31 20,21 30,52 30,94 0,25 -3,56 -12,91l-50 211c-6,29 -9,51 -9,68 0,12 1,21 6,28 3,6 9,12 18,15 8,3 22,7 41,8l-6 29 -186 0 74 -301c6,-22 11,-44 15,-65 5,-24 6,-43 6,-61 0,-29 -5,-49 -15,-61 -9,-12 -25,-18 -46,-18 -16,0 -33,6 -52,18 -19,13 -39,33 -61,58 -20,27 -37,53 -51,78 -13,26 -23,57 -31,94l-54 258 -103 0 68 -301c9,-36 15,-63 17,-81 4,-17 5,-33 5,-45 0,-29 -5,-49 -16,-61 -10,-12 -25,-18 -46,-18 -16,0 -34,6 -53,19 -20,12 -39,33 -61,60 -21,27 -38,53 -51,79 -14,25 -23,56 -31,92l-53 256 -103 0 91 -404c1,-10 3,-23 7,-41 4,-17 5,-32 5,-44 0,-11 -1,-20 -5,-26 -4,-6 -8,-11 -17,-13 -8,-4 -22,-6 -41,-7l7 -32 135 -5 34 0 -39 153 6 3c37,-54 73,-94 109,-120 36,-27 72,-39 110,-39 37,0 67,11 86,31 19,22 29,54 29,94l0 0z"/>
   <path class="fil2" d="M8371 3591c12,0 22,0 30,-1 8,-2 14,-5 19,-8 4,-4 8,-9 10,-14 3,-6 7,-16 10,-27l33 0 -6 112 -317 0 0 -18c11,-27 25,-55 45,-83 18,-29 45,-62 79,-99 30,-34 52,-58 64,-75 15,-19 26,-34 33,-48 7,-14 12,-27 15,-39 3,-12 4,-24 4,-36 0,-20 -2,-35 -8,-51 -7,-15 -16,-26 -29,-34 -12,-9 -28,-14 -48,-14 -48,0 -81,27 -97,81l-47 0 0 -74c31,-15 61,-26 87,-32 27,-6 53,-10 73,-10 49,0 84,11 109,32 25,20 37,51 37,91 0,13 -1,25 -5,38 -2,11 -6,23 -12,34 -6,11 -13,23 -23,35 -10,13 -21,27 -33,40 -12,13 -33,35 -61,65 -49,53 -85,98 -108,135l146 0z"/>
   <path class="fil2" d="M7696 5024l0 9c0,4 0,6 0,10 34,-49 68,-85 102,-108 34,-24 69,-36 105,-36 38,0 67,11 87,32 19,22 29,52 29,93 0,26 -4,56 -12,93l-50 210c-6,29 -10,51 -10,68 0,12 3,22 6,28 4,7 10,12 18,16 9,3 22,6 42,8l-6 29 -186 0 74 -302c6,-21 11,-43 14,-66 5,-22 8,-42 8,-61 0,-27 -6,-48 -16,-60 -10,-12 -26,-18 -46,-18 -16,0 -33,6 -52,19 -20,12 -39,32 -61,58 -21,26 -38,51 -51,77 -14,25 -23,57 -32,93l-53 260 -103 0 68 -302c8,-37 14,-63 17,-80 3,-19 4,-34 4,-47 0,-27 -4,-48 -15,-60 -10,-12 -26,-18 -46,-18 -16,0 -34,6 -54,19 -18,13 -39,33 -61,59 -20,27 -37,54 -51,79 -13,27 -23,58 -30,93l-53 257 -102 0 89 -405c2,-9 5,-24 8,-41 3,-18 6,-32 6,-44 0,-11 -3,-20 -6,-26 -3,-6 -9,-11 -17,-13 -9,-4 -22,-5 -42,-6l8 -32 135 -6 34 0 -39 154 6 3c36,-55 73,-95 109,-121 35,-26 72,-40 109,-40 38,0 67,11 87,33 19,21 29,52 29,92l0 0z"/>
   <path class="fil2" d="M8156 5697l0 -81 46 0c7,25 20,45 35,57 15,13 36,19 60,19 34,0 61,-11 78,-31 18,-21 26,-51 26,-93 0,-26 -5,-49 -14,-66 -9,-19 -22,-32 -37,-39 -15,-9 -34,-12 -56,-12 -17,0 -31,1 -44,3 -13,2 -26,5 -41,10l-30 -18 0 -254 211 0c10,0 16,0 20,-1 3,-3 7,-4 10,-7 2,-3 4,-9 7,-18l30 0 -6 90 -221 0 0 169c13,-5 28,-10 44,-12 16,-2 30,-5 46,-5 32,0 58,7 81,20 25,12 43,30 55,53 13,23 19,49 19,79 0,35 -7,64 -20,89 -15,25 -35,43 -63,57 -27,12 -60,19 -98,19 -43,0 -89,-10 -138,-28l0 0z"/>
   <polygon class="fil2" points="7871,4319 7871,4543 7783,4543 7783,4319 7565,4319 7565,4236 7783,4236 7783,4013 7871,4013 7871,4236 8090,4236 8090,4319 "/>
   <polygon class="fil2" points="11022,6097 11022,6321 10936,6321 10936,6097 10716,6097 10716,6014 10936,6014 10936,5791 11022,5791 11022,6014 11242,6014 11242,6097 "/>
   <polyline class="fil0 str0" points="21909,5021 22584,5021 22584,5834 23241,4208 23241,5834 23898,4208 23898,5834 24537,4208 24537,5021 25213,5021 "/>
   <path class="fil2" d="M23266 3427l19 0c12,0 26,-2 40,-7 14,-5 29,-12 45,-22 17,-11 38,-27 66,-48 20,-16 35,-31 46,-42 10,-12 16,-23 19,-31 4,-9 6,-17 6,-25 0,-19 -14,-30 -41,-32l7 -30 192 0 11 30c-33,29 -67,58 -104,87l-150 117 89 224c7,21 16,36 24,48 9,9 19,18 28,23 12,5 26,8 43,10l-6 29 -159 0 -87 -244c-6,-16 -9,-26 -14,-32 -4,-5 -9,-10 -14,-12 -4,-1 -13,-3 -24,-3l-45 0 -61 291 -103 0 153 -678c4,-21 8,-34 9,-43 2,-9 3,-18 3,-25 2,-7 2,-15 2,-21 0,-15 -5,-28 -15,-34 -10,-7 -28,-11 -55,-12l8 -30 150 -5 34 0 -116 517z"/>
   <path class="fil2" d="M24003 3489l0 18c-40,0 -75,9 -106,26 -30,17 -56,42 -76,75 -20,33 -34,72 -43,117l5 2c21,-15 43,-26 63,-34 21,-7 44,-11 68,-11 29,0 54,6 74,20 21,12 37,30 46,53 11,23 16,50 16,80 0,34 -6,64 -19,89 -14,26 -33,46 -60,61 -26,14 -59,22 -99,22 -56,0 -99,-19 -128,-53 -28,-35 -42,-86 -42,-155 0,-45 7,-87 22,-128 14,-40 34,-75 60,-104 27,-29 57,-53 93,-70 35,-17 71,-27 110,-30l16 22zm-115 233c-13,0 -25,2 -37,5 -11,3 -22,6 -33,12 -9,5 -20,13 -30,21 -3,3 -5,6 -6,9 -3,4 -5,11 -6,18 0,7 0,19 0,36 0,49 7,86 24,112 16,25 41,39 74,39 20,0 37,-4 49,-10 13,-7 24,-16 31,-28 9,-12 15,-25 19,-41 3,-16 4,-33 4,-51 0,-39 -7,-68 -23,-89 -15,-22 -37,-33 -66,-33l0 0z"/>
   <path class="fil1 str1" d="M25308 6482l0 -2921c0,-120 98,-217 217,-217l2444 0c119,0 217,97 217,217l0 2921c0,120 -98,217 -217,217l-2444 0c-119,0 -217,-97 -217,-217l0 0z"/>
   <path class="fil2" d="M26609 4760l0 8c0,3 0,5 -1,9 35,-49 69,-85 103,-108 34,-24 69,-36 106,-36 38,0 65,11 85,33 19,21 29,52 29,94 0,25 -4,56 -11,91l-50 211c-7,28 -11,51 -11,68 0,11 3,21 6,28 5,6 11,11 19,15 8,3 22,6 41,8l-5 29 -187 0 75 -301c5,-22 10,-44 15,-66 4,-23 6,-43 6,-62 0,-27 -5,-48 -15,-59 -9,-12 -25,-18 -47,-18 -14,0 -33,6 -52,18 -18,13 -39,33 -60,58 -20,26 -37,53 -52,78 -12,26 -23,56 -30,94l-55 258 -102 0 68 -301c9,-36 13,-64 16,-81 4,-19 5,-33 5,-47 0,-27 -5,-48 -15,-59 -10,-12 -25,-18 -47,-18 -16,0 -33,6 -52,19 -20,12 -40,32 -61,58 -22,28 -39,54 -52,81 -12,25 -22,56 -29,92l-54 256 -103 0 90 -404c2,-10 5,-23 8,-42 4,-17 5,-32 5,-43 0,-11 -1,-20 -5,-26 -3,-7 -9,-11 -18,-14 -7,-3 -21,-5 -40,-6l7 -32 135 -5 33 0 -39 153 7 3c37,-54 73,-94 108,-121 37,-26 73,-40 110,-40 37,0 66,11 86,33 21,22 30,52 30,94l0 0z"/>
   <path class="fil2" d="M27316 5175l0 5c29,12 51,28 67,50 14,22 22,48 22,79 0,29 -8,55 -22,79 -15,23 -35,40 -62,53 -28,12 -60,18 -96,18 -34,0 -64,-6 -90,-17 -27,-11 -46,-28 -61,-50 -14,-21 -20,-48 -20,-77 0,-23 3,-43 11,-59 8,-17 18,-30 30,-40 12,-11 28,-20 47,-30l-1 -5c-54,-23 -82,-64 -82,-123 0,-26 7,-49 21,-70 15,-22 36,-38 62,-50 27,-11 57,-17 90,-17 37,0 68,5 93,16 25,10 45,25 57,45 13,19 19,42 19,70 0,28 -7,53 -21,73 -14,21 -35,38 -64,50l0 0zm-185 -120c0,16 2,29 5,42 4,14 10,26 17,35 9,10 20,17 32,24 12,6 28,8 47,8 21,0 39,-4 54,-12 14,-9 25,-21 31,-37 8,-15 11,-35 11,-55 0,-23 -3,-43 -12,-59 -8,-17 -19,-28 -34,-36 -16,-7 -32,-11 -51,-11 -33,0 -57,8 -74,27 -17,17 -26,41 -26,74l0 0zm-4 252c0,17 2,33 6,48 3,14 9,26 18,37 8,11 19,19 33,25 12,7 29,9 47,9 21,0 39,-3 53,-12 16,-9 27,-22 36,-39 7,-17 11,-37 11,-60 0,-25 -4,-45 -13,-63 -8,-19 -20,-32 -36,-42 -15,-8 -33,-13 -53,-13 -19,0 -36,2 -48,8 -13,6 -24,14 -31,25 -9,9 -15,22 -19,35 -2,13 -4,28 -4,42l0 0z"/>
   <polyline class="fil0 str2" points="15606,4223 16281,4223 16281,5035 16938,3409 16938,5035 17595,3409 17595,5035 18234,3409 18234,4223 18909,4223 "/>
   <path class="fil1 str3" d="M12704 6496l0 -4548c0,-119 96,-215 215,-215l2417 0c118,0 214,96 214,215l0 4548c0,119 -96,215 -214,215l-2417 0c-119,0 -215,-96 -215,-215l0 0z"/>
   <path class="fil2" d="M16169 5972l20 0c12,0 25,-3 39,-8 14,-4 30,-12 46,-21 16,-11 37,-27 65,-49 21,-16 36,-30 45,-41 10,-12 17,-23 21,-32 4,-8 5,-17 5,-24 0,-20 -14,-31 -40,-33l6 -29 193 0 11 29c-33,29 -68,58 -105,87l-150 117 90 225c7,19 15,35 24,46 8,11 17,19 28,24 11,5 25,9 42,10l-7 29 -158 0 -86 -244c-6,-16 -11,-26 -15,-32 -3,-4 -8,-9 -13,-12 -5,-2 -13,-3 -25,-3l-44 0 -62 291 -102 0 152 -678c5,-20 7,-34 9,-43 2,-9 4,-17 4,-25 1,-7 1,-14 1,-20 0,-16 -5,-28 -16,-36 -9,-6 -26,-9 -53,-10l7 -31 150 -6 35 0 -117 519z"/>
   <path class="fil2" d="M16616 6127l0 -73c29,-14 57,-24 84,-31 26,-8 51,-11 75,-11 30,0 54,5 76,13 22,10 39,23 51,40 11,16 17,37 17,60 0,22 -5,41 -14,58 -8,16 -20,30 -36,43 -16,12 -37,24 -62,36l0 4c16,2 32,7 45,14 14,6 28,16 39,27 12,10 20,23 28,39 6,14 9,31 9,51 0,29 -6,56 -19,79 -12,23 -33,41 -60,54 -26,14 -59,21 -97,21 -22,0 -46,-2 -71,-7 -26,-6 -49,-12 -71,-21l0 -81 46 0c10,26 21,46 36,58 15,12 35,18 60,18 34,0 59,-9 76,-28 18,-18 26,-45 26,-80 0,-37 -12,-67 -34,-86 -23,-20 -56,-30 -99,-30l-36 0 0 -34c36,-2 65,-9 88,-20 24,-11 42,-25 53,-44 13,-18 17,-37 17,-59 0,-29 -7,-51 -21,-66 -16,-15 -38,-23 -67,-23 -25,0 -44,6 -59,20 -15,13 -26,32 -34,59l-46 0z"/>
   <path class="fil2" d="M17845 5972l20 0c12,0 25,-3 40,-8 13,-4 29,-12 45,-21 17,-11 37,-27 65,-49 21,-16 36,-30 45,-41 11,-12 17,-23 21,-32 4,-8 5,-17 5,-24 0,-20 -14,-31 -40,-33l7 -29 192 0 11 29c-33,29 -68,58 -105,87l-149 117 89 225c7,19 15,35 24,46 8,11 18,19 28,24 11,5 25,9 42,10l-6 29 -159 0 -86 -244c-6,-16 -10,-26 -15,-32 -3,-4 -8,-9 -13,-12 -5,-2 -13,-3 -24,-3l-45 0 -61 291 -103 0 153 -678c4,-20 7,-34 8,-43 3,-9 4,-17 4,-25 1,-7 1,-14 1,-20 0,-16 -5,-28 -14,-36 -10,-6 -28,-9 -55,-10l7 -31 151 -6 34 0 -117 519z"/>
   <path class="fil2" d="M18289 6523l0 -81 47 0c7,26 18,45 34,58 16,12 36,18 61,18 34,0 59,-11 77,-31 17,-21 26,-51 26,-91 0,-28 -4,-50 -13,-68 -10,-19 -22,-32 -38,-39 -16,-9 -34,-12 -55,-12 -17,0 -32,1 -45,3 -12,3 -25,5 -40,10l-31 -18 0 -254 212 0c9,0 16,0 20,-1 3,-2 6,-4 8,-8 3,-2 5,-8 9,-15l30 0 -6 88 -222 0 0 169c13,-5 28,-10 43,-12 16,-3 32,-4 48,-4 30,0 58,6 81,18 23,13 43,31 55,54 13,23 19,50 19,80 0,34 -7,63 -22,89 -14,24 -35,42 -62,56 -27,12 -59,19 -97,19 -43,0 -91,-10 -139,-28l0 0z"/>
   <path class="fil2" d="M13999 2903l0 8c0,3 -1,6 -1,9 34,-49 69,-84 103,-108 34,-24 69,-34 104,-34 38,0 67,9 87,31 19,21 29,52 29,94 0,25 -4,56 -12,91l-50 211c-6,29 -10,51 -10,68 0,12 3,21 6,28 4,6 10,12 18,15 9,3 22,7 42,8l-6 29 -186 0 75 -301c5,-22 10,-44 14,-66 4,-23 7,-42 7,-60 0,-29 -5,-49 -15,-61 -11,-12 -25,-18 -47,-18 -16,0 -33,6 -52,18 -20,13 -39,33 -60,58 -22,27 -39,53 -52,78 -13,26 -23,57 -32,94l-53 258 -103 0 69 -301c7,-36 13,-63 16,-81 3,-17 5,-33 5,-45 0,-29 -5,-49 -16,-61 -10,-12 -26,-18 -46,-18 -16,0 -34,6 -54,19 -18,12 -39,33 -59,60 -22,26 -39,53 -53,79 -12,25 -21,57 -29,92l-54 256 -102 0 89 -404c3,-10 5,-23 8,-40 3,-18 6,-33 6,-45 0,-11 -3,-20 -6,-26 -3,-6 -9,-11 -17,-13 -8,-4 -22,-6 -40,-7l6 -32 136 -5 33 0 -39 154 7 2c36,-54 72,-94 108,-121 37,-25 73,-38 109,-38 38,0 67,10 87,31 19,22 30,54 30,94l0 0z"/>
   <path class="fil2" d="M14462 3180l0 -73c29,-15 57,-26 82,-33 27,-6 51,-10 76,-10 29,0 54,5 76,14 22,8 39,21 50,38 12,17 18,37 18,61 0,22 -5,40 -13,57 -9,17 -21,32 -38,44 -14,12 -35,24 -61,36l0 3c16,3 31,8 45,16 15,6 28,14 39,25 12,11 21,24 27,39 7,15 11,32 11,51 0,30 -6,57 -20,80 -13,23 -32,41 -59,55 -27,13 -60,19 -97,19 -23,0 -46,-2 -72,-7 -25,-5 -50,-11 -70,-20l0 -82 46 0c8,27 20,46 35,58 15,12 35,18 61,18 33,0 58,-8 75,-26 17,-19 26,-45 26,-82 0,-37 -11,-65 -34,-86 -22,-19 -55,-29 -99,-29l-35 0 0 -34c35,-2 64,-9 87,-21 25,-11 42,-25 54,-42 11,-18 17,-38 17,-61 0,-28 -7,-50 -23,-66 -15,-15 -37,-23 -66,-23 -24,0 -44,8 -59,20 -15,13 -26,34 -33,61l-46 0z"/>
   <path class="fil2" d="M13997 4967l0 9c0,3 0,6 -2,10 34,-49 70,-85 104,-109 34,-23 69,-35 105,-35 37,0 66,11 85,32 20,22 29,52 29,93 0,26 -3,56 -11,93l-49 210c-8,29 -11,51 -11,68 0,12 2,22 6,28 3,7 10,12 18,15 9,4 22,7 41,9l-5 29 -187 0 76 -301c5,-22 9,-44 13,-67 5,-22 7,-42 7,-61 0,-28 -4,-48 -14,-60 -11,-12 -26,-19 -48,-19 -15,0 -32,7 -52,20 -19,12 -39,31 -59,58 -22,26 -39,51 -52,78 -13,24 -24,56 -32,92l-54 260 -103 0 69 -301c8,-38 14,-64 16,-81 4,-19 5,-34 5,-47 0,-28 -5,-48 -14,-60 -11,-12 -26,-19 -48,-19 -16,0 -34,7 -53,20 -18,13 -39,33 -60,59 -22,27 -39,54 -52,79 -12,27 -22,57 -29,93l-55 257 -102 0 90 -406c2,-8 5,-21 7,-40 4,-18 6,-32 6,-45 0,-10 -2,-19 -6,-25 -2,-6 -8,-11 -17,-13 -7,-4 -20,-5 -40,-6l6 -32 136 -6 33 0 -39 154 8 3c36,-55 71,-95 108,-121 36,-26 73,-40 109,-40 38,0 67,11 86,33 21,21 31,52 31,92l0 0z"/>
   <path class="fil2" d="M14748 5151l0 18c-39,0 -74,8 -104,25 -30,17 -56,43 -77,76 -20,33 -34,71 -42,116l4 3c21,-16 42,-27 64,-34 21,-8 44,-11 68,-11 29,0 53,6 74,19 21,12 35,31 46,54 10,23 15,49 15,80 0,34 -6,63 -19,89 -13,25 -32,44 -60,60 -27,15 -60,22 -99,22 -57,0 -99,-18 -127,-53 -29,-34 -44,-87 -44,-155 0,-45 7,-88 22,-127 15,-40 35,-75 62,-105 27,-30 57,-53 92,-70 34,-17 72,-27 110,-29l15 22zm-114 233c-13,0 -25,1 -36,5 -12,2 -23,6 -33,12 -11,5 -21,12 -30,21 -4,2 -6,4 -8,8 -2,5 -3,11 -5,18 -1,8 -1,20 -1,37 0,48 9,86 25,111 17,26 41,39 75,39 19,0 35,-3 48,-11 14,-6 23,-15 32,-26 8,-12 15,-26 17,-42 4,-15 6,-32 6,-52 0,-38 -8,-67 -24,-89 -16,-20 -38,-31 -66,-31l0 0z"/>
   <polygon class="fil2" points="14170,4262 14170,4486 14084,4486 14084,4262 13864,4262 13864,4179 14084,4179 14084,3956 14170,3956 14170,4179 14390,4179 14390,4262 "/>
   <polygon class="fil2" points="17323,6040 17323,6264 17236,6264 17236,6040 17017,6040 17017,5957 17236,5957 17236,5734 17323,5734 17323,5957 17542,5957 17542,6040 "/>
   <path class="fil1 str3" d="M19046 6496l0 -4548c0,-119 95,-215 214,-215l2417 0c119,0 214,96 214,215l0 4548c0,119 -95,215 -214,215l-2417 0c-119,0 -214,-96 -214,-215l0 0z"/>
   <path class="fil2" d="M20340 2903l0 8c0,3 0,6 -1,9 35,-49 69,-84 103,-108 34,-24 69,-34 106,-34 37,0 65,9 85,31 19,21 30,52 30,94 0,25 -5,56 -12,91l-50 211c-7,29 -11,51 -11,68 0,12 3,21 6,28 5,6 11,12 18,15 9,3 23,7 42,8l-5 29 -187 0 75 -301c6,-22 10,-44 15,-66 3,-23 6,-42 6,-60 0,-29 -5,-49 -15,-61 -10,-12 -25,-18 -47,-18 -15,0 -33,6 -52,18 -19,13 -39,33 -60,58 -21,27 -38,53 -51,78 -13,26 -24,57 -31,94l-55 258 -102 0 68 -301c8,-36 13,-63 17,-81 2,-17 3,-33 3,-45 0,-29 -4,-49 -14,-61 -10,-12 -26,-18 -47,-18 -16,0 -33,6 -53,19 -19,12 -39,33 -60,60 -22,26 -39,53 -53,79 -12,25 -21,57 -29,92l-53 256 -103 0 89 -404c3,-10 5,-23 9,-40 4,-18 5,-33 5,-45 0,-11 -1,-20 -5,-26 -4,-6 -10,-11 -17,-13 -9,-4 -22,-6 -41,-7l7 -32 135 -5 33 0 -39 154 7 2c36,-54 73,-94 108,-121 36,-25 73,-38 109,-38 38,0 67,10 88,31 19,22 29,54 29,94l0 0z"/>
   <path class="fil2" d="M20940 3578c16,-5 27,-9 33,-13 5,-7 8,-14 9,-22 3,-10 3,-23 3,-43l0 -63 -214 0 0 -29 226 -340 55 0 0 331 8 0c15,0 26,-1 32,-2 6,-2 12,-7 16,-12 4,-6 8,-15 12,-28l29 0 -5 80 -92 0 0 63c0,17 0,29 1,38 1,8 3,14 6,19 2,4 7,9 12,11 5,4 13,6 26,10l0 18 -157 0 0 -18zm-106 -179l151 0 0 -96c0,-24 1,-51 1,-81 1,-29 2,-52 4,-67l-5 0 -151 240 0 4z"/>
   <path class="fil2" d="M20338 4967l0 9c0,3 0,6 0,10 34,-49 68,-85 102,-109 34,-23 69,-35 105,-35 38,0 66,11 85,32 21,22 31,52 31,93 0,26 -5,56 -13,93l-49 210c-8,29 -10,51 -10,68 0,12 1,22 5,28 5,7 11,12 19,15 7,4 22,7 40,9l-5 29 -185 0 74 -301c6,-22 11,-44 14,-67 4,-22 6,-42 6,-61 0,-28 -5,-48 -14,-60 -10,-12 -26,-19 -48,-19 -14,0 -32,7 -52,20 -18,12 -39,31 -59,58 -21,26 -38,51 -51,78 -14,24 -25,56 -32,92l-55 260 -102 0 68 -301c9,-38 14,-64 17,-81 3,-19 5,-34 5,-47 0,-28 -6,-48 -16,-60 -9,-12 -25,-19 -47,-19 -16,0 -33,7 -52,20 -20,13 -39,33 -61,59 -22,27 -39,54 -51,79 -13,27 -23,57 -30,93l-54 257 -103 0 90 -406c2,-8 5,-21 9,-40 3,-18 4,-32 4,-45 0,-10 -1,-19 -4,-25 -4,-6 -10,-11 -17,-13 -9,-4 -22,-5 -42,-6l7 -32 135 -6 33 0 -39 154 8 3c36,-55 72,-95 108,-121 36,-26 72,-40 109,-40 39,0 67,11 87,33 20,21 30,52 30,92l0 0z"/>
   <path class="fil2" d="M21134 5154l-223 510 -57 0 0 -19 209 -440 0 -6 -170 0c-11,0 -20,2 -26,4 -6,1 -11,5 -16,8 -3,3 -7,8 -11,14 -2,6 -6,18 -11,35l-32 0 7 -125 330 0 0 19z"/>
   <polygon class="fil2" points="20512,4262 20512,4486 20425,4486 20425,4262 20206,4262 20206,4179 20425,4179 20425,3956 20512,3956 20512,4179 20731,4179 20731,4262 "/>
  </g>
  <circle class="fil3 str4" cx="1519" cy="649" r="577"/>
  <circle class="fil3 str4" cx="7832" cy="649" r="577"/>
  <circle class="fil3 str4" cx="14144" cy="649" r="577"/>
  <circle class="fil3 str4" cx="20473" cy="638" r="577"/>
  <circle class="fil3 str4" cx="26802" cy="627" r="577"/>
  <path class="fil4" d="M1680 972l0 -30 -31 0c-88,0 -91,-10 -91,-46l0 -545c0,-24 0,-26 -22,-26 -60,62 -146,62 -177,62l0 31c20,0 77,0 127,-26l0 504c0,35 -2,46 -90,46l-31 0 0 30c34,-3 119,-3 157,-3 39,0 124,0 158,3z"/>
  <path class="fil4" d="M8021 803l-24 0c-5,29 -12,72 -21,87 -7,8 -71,8 -93,8l-175 0 103 -101c152,-134 210,-186 210,-283 0,-111 -87,-189 -206,-189 -109,0 -181,90 -181,176 0,55 48,55 51,55 17,0 51,-12 51,-52 0,-25 -18,-50 -52,-50 -8,0 -10,0 -12,1 22,-64 74,-100 131,-100 88,0 130,79 130,159 0,77 -49,154 -102,214l-187 208c-10,11 -10,13 -10,36l360 0 27 -169z"/>
  <path class="fil4" d="M14355 812l0 -30 -97 0 0 -442c0,-20 0,-25 -16,-25 -8,0 -11,0 -19,11l-298 456 0 30 258 0 0 85c0,35 -2,45 -74,45l-20 0 0 30c40,-3 90,-3 131,-3 41,0 92,0 132,3l0 -30 -20 0c-72,0 -74,-10 -74,-45l0 -85 97 0zm-166 -30l-237 0 237 -362 0 362z"/>
  <path class="fil4" d="M20684 801l0 -30 -97 0 0 -442c0,-19 0,-25 -16,-25 -9,0 -11,0 -19,12l-299 455 0 30 259 0 0 85c0,35 -2,46 -74,46l-20 0 0 30c40,-3 90,-3 131,-3 41,0 92,0 132,3l0 -30 -20 0c-72,0 -74,-11 -74,-46l0 -85 97 0zm-166 -30l-237 0 237 -362 0 362z"/>
  <path class="fil4" d="M26999 785c0,-80 -61,-156 -162,-176 79,-26 136,-94 136,-171 0,-80 -86,-134 -179,-134 -98,0 -172,58 -172,132 0,32 21,51 50,51 30,0 49,-22 49,-50 0,-49 -45,-49 -60,-49 30,-47 94,-60 129,-60 40,0 93,22 93,109 0,12 -1,68 -27,111 -29,46 -62,49 -86,50 -8,1 -31,3 -38,3 -8,1 -15,2 -15,12 0,11 7,11 24,11l42 0c80,0 116,66 116,161 0,132 -67,160 -110,160 -42,0 -114,-16 -148,-74 34,5 64,-16 64,-53 0,-35 -27,-55 -55,-55 -23,0 -54,14 -54,57 0,88 90,152 196,152 119,0 207,-88 207,-187z"/>
  <g>
   <path class="fil5" d="M5527 3880l0 -847 770 423 -770 424zm-2512 -504l2579 0 0 161 -2579 0 0 -161z"/>
  </g>
  <path class="fil5" d="M26884 5976c0,-10 -7,-10 -14,-10 -12,0 -13,1 -19,23 -13,54 -32,115 -65,115 -25,0 -25,-26 -25,-39 0,-7 0,-23 7,-50l70 -280c2,-6 3,-11 3,-13 0,-11 -8,-26 -28,-26 -29,0 -36,28 -38,36l-70 284c-5,17 -5,19 -14,32 -19,27 -47,56 -89,56 -44,0 -53,-42 -53,-74 0,-60 32,-147 56,-213 8,-21 13,-34 13,-53 0,-48 -32,-78 -74,-78 -90,0 -124,143 -124,149 0,10 10,10 14,10 13,0 14,-2 18,-16 8,-30 34,-122 90,-122 11,0 22,3 22,28 0,23 -10,50 -24,88 -25,68 -50,140 -50,190 0,85 56,113 109,113 51,0 84,-29 107,-59 18,53 60,59 78,59 36,0 57,-25 71,-55 18,-37 29,-95 29,-95z"/>
  <path id="1" class="fil5" d="M27083 6226c0,-40 -31,-77 -81,-88 40,-13 68,-47 68,-85 0,-40 -43,-67 -90,-67 -49,0 -86,29 -86,66 0,16 11,25 25,25 15,0 25,-11 25,-25 0,-24 -23,-24 -30,-24 15,-24 47,-30 65,-30 19,0 46,11 46,54 0,6 -1,34 -13,56 -15,23 -32,25 -44,25 -4,0 -15,1 -19,1 -4,1 -7,1 -7,6 0,6 3,6 12,6l21 0c40,0 58,33 58,80 0,66 -34,80 -55,80 -21,0 -57,-8 -74,-36 17,2 32,-9 32,-27 0,-18 -13,-27 -27,-27 -12,0 -28,6 -28,28 0,44 46,76 98,76 60,0 104,-44 104,-94z"/>
  <path class="fil5" d="M4711 1576c0,-42 -40,-64 -79,-64 -96,0 -120,126 -127,159l-20 107 -64 0c-16,0 -26,0 -26,20 0,10 9,10 24,10l60 0 -71 363c-12,60 -21,100 -27,120 -8,33 -20,84 -55,84 -10,0 -29,-3 -39,-18 29,-5 42,-28 42,-47 0,-22 -17,-31 -33,-31 -24,0 -48,19 -48,53 0,44 42,64 78,64 101,0 140,-204 147,-239l68 -349 80 0c16,0 26,0 26,-17 0,-13 -8,-13 -24,-13l-76 0 31 -157c8,-36 19,-88 54,-88 7,0 28,2 40,18 -29,5 -42,28 -42,47 0,22 17,32 33,32 24,0 48,-20 48,-54z"/>
  <path id="1" class="fil5" d="M4788 2307l-12 0c-2,14 -5,36 -10,43 -4,4 -36,4 -47,4l-87 0 52 -50c75,-67 104,-93 104,-142 0,-55 -43,-94 -103,-94 -54,0 -90,44 -90,88 0,27 24,27 25,27 9,0 26,-6 26,-26 0,-13 -9,-25 -26,-25 -4,0 -5,0 -6,0 11,-31 37,-49 65,-49 44,0 65,39 65,79 0,39 -24,77 -51,107l-93 104c-5,6 -5,7 -5,18l180 0 13 -84z"/>
  <path id="2" class="fil5" d="M5015 1653c0,-5 -4,-5 -6,-5 -5,0 -6,2 -7,6 -17,50 -61,50 -65,50 -25,0 -44,-14 -55,-32 -15,-24 -15,-56 -15,-73l136 0c10,0 12,0 12,-10 0,-48 -26,-95 -87,-95 -56,0 -101,50 -101,110 0,65 51,112 107,112 59,0 81,-53 81,-63zm-32 -64l-115 0c3,-73 43,-85 60,-85 50,0 55,66 55,85z"/>
  <path id="3" class="fil5" d="M5285 1805l0 -15c-33,0 -38,0 -38,-22l0 -272 -11 0 -18 45c-6,-14 -26,-45 -65,-45 -57,0 -108,48 -108,111 0,60 48,109 104,109 34,0 54,-20 65,-34l0 86c0,22 -6,22 -38,22l0 15 54 -1 55 1zm-70 -160c0,16 -9,29 -19,41 -7,7 -22,20 -45,20 -36,0 -65,-43 -65,-99 0,-58 34,-98 70,-98 39,0 59,42 59,68l0 68z"/>
  <path class="fil0 str5" d="M6297 3456c149,3 298,5 782,134 484,128 1304,383 2054,554 751,172 1432,260 2008,260 576,0 1045,-88 1524,-177 480,-88 968,-177 1443,-177 474,0 934,89 1316,193 382,105 687,225 976,340 290,115 563,224 847,269 284,45 577,25 871,-90 293,-115 587,-325 804,-502 218,-177 360,-322 557,-414 197,-93 450,-133 723,-62 274,70 567,253 847,478 280,226 546,495 901,765 355,270 799,542 1192,660 393,119 736,84 1064,-51 329,-136 644,-373 1018,-403 374,-31 809,145 1243,322"/>
 </g>
</svg>
