<?xml version="1.0" encoding="UTF-8"?>
<!DOCTYPE svg PUBLIC "-//W3C//DTD SVG 1.1//EN" "http://www.w3.org/Graphics/SVG/1.1/DTD/svg11.dtd">
<!-- Creator: CorelDRAW X7 -->
<svg xmlns="http://www.w3.org/2000/svg" xml:space="preserve" width="28.6382mm" height="26.5083mm" version="1.1" style="shape-rendering:geometricPrecision; text-rendering:geometricPrecision; image-rendering:optimizeQuality; fill-rule:evenodd; clip-rule:evenodd"
viewBox="0 0 763 706"
 xmlns:xlink="http://www.w3.org/1999/xlink">
 <defs>
  <style type="text/css">
   <![CDATA[
    .str5 {stroke:#373435;stroke-width:4.69786}
    .str0 {stroke:#BDBFC1;stroke-width:2.0305}
    .str1 {stroke:#373435;stroke-width:2.0305}
    .str3 {stroke:#00AFEF;stroke-width:2.0305}
    .str6 {stroke:#00AFEF;stroke-width:2.0305}
    .str4 {stroke:#00A859;stroke-width:2.0305}
    .str2 {stroke:#373435;stroke-width:2.0305;stroke-dasharray:20.304997 10.152499}
    .fil2 {fill:none}
    .fil1 {fill:#E6E7E8}
    .fil6 {fill:#8682AB}
    .fil4 {fill:#00AFEF}
    .fil5 {fill:#00A859}
    .fil8 {fill:#BDBFC1;fill-rule:nonzero}
    .fil0 {fill:#373435;fill-rule:nonzero}
    .fil3 {fill:#373435;fill-rule:nonzero}
    .fil7 {fill:#00AFEF;fill-rule:nonzero}
    .fil9 {fill:#00A859;fill-rule:nonzero}
   ]]>
  </style>
 </defs>
 <g id="Layer_x0020_1">
  <metadata id="CorelCorpID_0Corel-Layer"/>
  <path class="fil0" d="M94 26c0,-2 -2,-5 -6,-5 -6,0 -9,6 -10,10l0 -10 -12 1 0 3c6,0 6,0 6,5l0 22c0,4 0,4 -6,4l0 3 9 -1c4,0 8,0 11,1l0 -3 -2 0c-6,0 -6,-1 -6,-4l0 -13c0,-8 4,-16 10,-16 1,0 1,0 1,0 0,0 -2,1 -2,4 0,2 2,3 4,3 1,0 3,-1 3,-4l0 0z"/>
  <path id="1" class="fil0" d="M136 41c0,-11 -8,-20 -18,-20 -11,0 -19,9 -19,20 0,11 9,19 19,19 10,0 18,-9 18,-19zm-7 -1c0,3 0,8 -1,11 -2,4 -6,7 -10,7 -4,0 -8,-2 -10,-6 -2,-4 -2,-9 -2,-12 0,-3 0,-8 2,-12 2,-4 6,-5 10,-5 3,0 7,2 9,5 2,4 2,9 2,12z"/>
  <path id="2" class="fil0" d="M167 48l0 -5 -2 0 0 5c0,6 -3,10 -6,10 -5,0 -5,-8 -5,-10l0 -23 12 0 0 -3 -12 0 0 -15 -3 0c0,7 -2,16 -10,16l0 2 7 0 0 23c0,11 8,12 11,12 6,0 8,-6 8,-12l0 0z"/>
  <path id="3" class="fil0" d="M213 51l0 -5 -2 0 0 5c0,5 -3,6 -3,6 -3,0 -4,-4 -4,-5l0 -17c0,-3 0,-6 -3,-10 -3,-3 -7,-4 -11,-4 -7,0 -13,4 -13,9 0,3 2,4 4,4 2,0 4,-1 4,-4 0,-1 -1,-3 -5,-3 3,-3 7,-4 10,-4 4,0 9,3 9,11l0 3c-5,0 -11,0 -16,3 -6,3 -8,7 -8,11 0,7 8,9 13,9 6,0 10,-4 11,-8 1,4 3,7 7,7 2,0 7,-1 7,-8l0 0zm-14 -4c0,8 -7,11 -10,11 -4,0 -8,-3 -8,-7 0,-5 4,-12 18,-13l0 9z"/>
  <path id="4" class="fil0" d="M242 48l0 -5 -2 0 0 5c0,6 -2,10 -6,10 -5,0 -5,-8 -5,-10l0 -23 12 0 0 -3 -12 0 0 -15 -2 0c0,7 -3,16 -11,16l0 2 7 0 0 23c0,11 8,12 11,12 6,0 8,-6 8,-12l0 0z"/>
  <path id="5" class="fil0" d="M268 59l0 -3c-6,0 -6,0 -6,-4l0 -31 -12 1 0 3c6,0 6,0 6,5l0 22c0,4 0,4 -6,4l0 3 9 -1c3,0 6,1 9,1zm-5 -51c0,-3 -2,-5 -4,-5 -3,0 -5,2 -5,5 0,2 2,4 5,4 3,0 4,-2 4,-4z"/>
  <path id="6" class="fil0" d="M310 41c0,-11 -8,-20 -18,-20 -11,0 -19,9 -19,20 0,11 9,19 19,19 10,0 18,-9 18,-19zm-7 -1c0,3 0,8 -1,11 -2,4 -6,7 -10,7 -4,0 -8,-2 -10,-6 -2,-4 -2,-9 -2,-12 0,-3 0,-8 2,-12 2,-4 6,-5 10,-5 3,0 7,2 9,5 2,4 2,9 2,12z"/>
  <path id="7" class="fil0" d="M358 59l0 -3c-4,0 -6,0 -6,-2l0 -17c0,-7 0,-10 -3,-13 -1,-1 -4,-3 -9,-3 -6,0 -10,4 -12,9l0 -9 -12 1 0 3c6,0 6,0 6,5l0 22c0,4 -1,4 -6,4l0 3 9 -1 10 1 0 -3c-6,0 -7,0 -7,-4l0 -15c0,-9 6,-14 11,-14 6,0 7,5 7,10l0 19c0,4 -1,4 -7,4l0 3 10 -1 9 1z"/>
  <path id="8" class="fil0" d="M429 51l0 -5 -2 0 0 5c0,5 -2,6 -3,6 -3,0 -3,-4 -3,-5l0 -17c0,-3 0,-6 -3,-10 -4,-3 -8,-4 -12,-4 -7,0 -13,4 -13,9 0,3 2,4 4,4 3,0 4,-1 4,-4 0,-1 0,-3 -4,-3 2,-3 6,-4 9,-4 4,0 9,3 9,11l0 3c-4,0 -10,0 -16,3 -6,3 -8,7 -8,11 0,7 8,9 13,9 6,0 10,-4 11,-8 1,4 3,7 7,7 2,0 7,-1 7,-8l0 0zm-14 -4c0,8 -6,11 -10,11 -4,0 -8,-3 -8,-7 0,-5 4,-12 18,-13l0 9z"/>
  <path id="9" class="fil0" d="M461 26c0,-2 -2,-5 -6,-5 -6,0 -9,6 -10,10l0 -10 -12 1 0 3c6,0 6,0 6,5l0 22c0,4 -1,4 -6,4l0 3 9 -1c4,0 8,0 11,1l0 -3 -2 0c-6,0 -6,-1 -6,-4l0 -13c0,-8 4,-16 10,-16 1,0 1,0 1,0 0,0 -2,1 -2,4 0,2 2,3 4,3 1,0 3,-1 3,-4l0 0z"/>
  <path id="10" class="fil0" d="M503 41c0,-11 -8,-20 -18,-20 -11,0 -19,9 -19,20 0,11 9,19 19,19 10,0 18,-9 18,-19zm-7 -1c0,3 0,8 -1,11 -2,4 -6,7 -10,7 -4,0 -8,-2 -10,-6 -2,-4 -2,-9 -2,-12 0,-3 0,-8 2,-12 2,-4 6,-5 10,-5 3,0 7,2 9,5 2,4 2,9 2,12z"/>
  <path id="11" class="fil0" d="M551 59l0 -3c-6,0 -6,0 -6,-5l0 -30 -13 1 0 3c6,0 7,0 7,5l0 15c0,7 -4,13 -11,13 -7,0 -7,-4 -7,-9l0 -28 -12 1 0 3c6,0 6,0 6,8l0 12c0,7 0,15 13,15 5,0 8,-3 11,-8l0 8 12 -1z"/>
  <path id="12" class="fil0" d="M598 59l0 -3c-4,0 -6,0 -6,-2l0 -17c0,-7 0,-10 -3,-13 -1,-1 -4,-3 -9,-3 -6,0 -10,4 -12,9l0 -9 -12 1 0 3c6,0 6,0 6,5l0 22c0,4 -1,4 -6,4l0 3 9 -1 10 1 0 -3c-6,0 -7,0 -7,-4l0 -15c0,-9 6,-14 11,-14 6,0 7,5 7,10l0 19c0,4 -1,4 -7,4l0 3 10 -1 9 1z"/>
  <path id="13" class="fil0" d="M645 59l0 -3c-6,0 -7,0 -7,-5l0 -51 -12 1 0 3c6,0 6,0 6,4l0 19c-2,-3 -6,-6 -10,-6 -10,0 -19,9 -19,20 0,10 8,19 18,19 5,0 9,-3 11,-6l0 6 13 -1zm-13 -10c0,1 0,1 -1,3 -2,4 -6,6 -10,6 -4,0 -7,-2 -9,-6 -2,-3 -2,-8 -2,-11 0,-4 0,-9 2,-12 2,-3 5,-6 10,-6 3,0 7,1 9,5 1,2 1,2 1,3l0 18z"/>
  <path id="14" class="fil0" d="M311 81c0,0 0,-1 -1,-1 -2,0 -5,0 -7,0 -2,0 -5,0 -8,0 0,0 -1,0 -1,2 0,1 1,1 1,1 2,0 3,0 3,2 0,1 -2,3 -2,4l-19 22 -8 -25c0,-1 0,-1 0,-1 0,-2 3,-2 4,-2 1,0 2,0 2,-2 0,-1 -1,-1 -1,-1 -3,0 -6,0 -10,0 -3,0 -6,0 -9,0 0,0 -1,0 -1,2 0,1 1,1 2,1 4,0 5,0 5,2l9 28c0,1 1,1 1,2 0,0 -4,14 -4,15 -1,5 -2,5 -8,5 -1,0 -2,0 -2,2 0,1 1,1 1,1 4,0 7,0 10,0 3,0 7,0 10,0 1,0 2,0 2,-2 0,-1 -1,-1 -2,-1 -3,0 -5,0 -5,-1 0,-1 1,-5 1,-7l3 -11c0,-1 0,-1 1,-2l20 -24c4,-5 7,-7 11,-7 1,0 2,0 2,-2z"/>
  <path id="15" class="fil0" d="M328 121c0,-1 0,-2 0,-3 0,-1 0,-1 -2,-1l-16 0c-2,0 -2,0 -3,1 0,1 0,2 0,3 0,1 1,1 2,1l16 0c2,0 2,0 3,-1z"/>
  <path id="16" class="fil0" d="M371 130l0 -4 -2 0 0 4c0,5 -2,6 -3,6 -3,0 -4,-4 -4,-5l0 -16c0,-4 0,-7 -3,-10 -3,-4 -7,-5 -11,-5 -7,0 -13,4 -13,9 0,3 2,4 4,4 2,0 4,-1 4,-3 0,-1 -1,-4 -4,-4 2,-3 6,-4 9,-4 4,0 9,3 9,11l0 3c-5,0 -11,0 -16,3 -6,3 -8,7 -8,11 0,7 8,9 13,9 6,0 10,-4 11,-8 1,4 3,7 7,7 2,0 7,-1 7,-8l0 0zm-14 -4c0,8 -6,11 -10,11 -4,0 -8,-3 -8,-7 0,-5 4,-12 18,-12l0 8z"/>
  <path id="17" class="fil0" d="M416 138l0 -3c-5,0 -6,0 -8,-2l-12 -15c3,-3 6,-7 8,-10 3,-3 6,-4 10,-4l0 -3c-2,1 -4,1 -7,1 -2,0 -7,-1 -8,-1l0 3c2,0 3,1 3,3 0,1 -1,2 -2,3l-5 6 -6 -8c-1,-1 -1,-1 -1,-2 0,-1 1,-2 3,-2l0 -3 -9 1c-2,0 -6,0 -8,-1l0 3c6,0 6,0 10,5l8 11c-4,5 -4,5 -8,10 -4,5 -9,5 -11,5l0 3c2,0 5,0 7,0l8 0 0 -3c-2,0 -2,-1 -2,-2 0,-2 2,-5 7,-11l7 8c1,1 2,3 2,3 0,1 -1,2 -3,2l0 3 9 0c2,0 5,0 8,0z"/>
  <path id="18" class="fil0" d="M438 138l0 -3c-6,0 -6,0 -6,-4l0 -31 -12 1 0 3c5,0 6,1 6,5l0 22c0,4 -1,4 -6,4l0 3 9 0c3,0 6,0 9,0zm-5 -51c0,-3 -2,-5 -4,-5 -3,0 -5,3 -5,5 0,2 2,4 5,4 2,0 4,-2 4,-4z"/>
  <path id="19" class="fil0" d="M471 127c0,-4 -3,-7 -4,-8 -3,-3 -6,-3 -9,-4 -5,-1 -11,-2 -11,-7 0,-3 2,-6 10,-6 9,0 9,7 10,10 0,1 1,1 1,1 1,0 1,-1 1,-2l0 -9c0,-1 0,-2 -1,-2 -1,0 -1,0 -2,1 0,0 -1,1 -1,1 -4,-2 -7,-2 -8,-2 -11,0 -14,6 -14,10 0,3 2,6 4,8 3,2 5,2 11,3 2,1 9,2 9,8 0,5 -3,8 -10,8 -7,0 -10,-5 -12,-12 0,-1 0,-2 -1,-2 -1,0 -1,1 -1,3l0 11c0,1 0,2 1,2 1,0 1,0 2,-2 0,0 0,0 2,-2 4,4 7,4 9,4 10,0 14,-6 14,-12l0 0z"/>
  <path class="fil1" d="M92 639l405 -406c0,0 45,5 69,20 24,14 45,58 53,74 0,0 0,0 0,0l-527 312z"/>
  <polyline class="fil2 str0" points="87,644 369,644 497,494 497,233 "/>
  <line class="fil2 str1" x1="612" y1="233" x2="708" y2= "233" />
  <line class="fil2 str1" x1="612" y1="494" x2="708" y2= "494" />
  <line class="fil2 str1" x1="690" y1="233" x2="690" y2= "494" />
  <line class="fil2 str1" x1="669" y1="254" x2="711" y2= "211" />
  <line class="fil2 str1" x1="662" y1="506" x2="718" y2= "482" />
  <path class="fil3" d="M739 345c0,-4 -5,-5 -8,-5 -6,0 -9,4 -11,6 0,-4 -4,-6 -7,-6 -3,0 -4,2 -6,5 -1,3 -2,8 -2,8 0,1 1,1 1,1 1,0 1,0 2,-2 1,-6 3,-10 5,-10 2,0 2,2 2,3 0,2 0,3 0,5l-6 25c-1,1 -1,1 -1,1 0,1 1,2 3,2 2,0 3,-2 3,-3l5 -22c1,0 4,-11 12,-11 0,0 2,0 4,1 -3,1 -3,4 -3,4 0,1 1,3 3,3 1,0 4,-1 4,-5z"/>
  <path id="1" class="fil3" d="M759 384c0,-1 0,-1 -1,-1 0,0 0,0 -1,1 -1,5 -3,9 -10,9l-6 0 22 -26c0,-1 0,-1 0,-1 0,0 0,0 -1,0l-16 0c-1,0 -1,0 -1,0l-3 8c0,0 0,1 0,1 0,0 1,0 1,0 0,0 0,0 1,-1 1,-4 2,-7 9,-7l6 0 -22 26c0,0 0,1 0,1 0,0 0,0 1,0l17 0c1,0 1,0 1,0l3 -10c0,0 0,0 0,0z"/>
  <line class="fil2 str2" x1="87" y1="644" x2="497" y2= "233" />
  <circle class="fil4 str3" cx="497" cy="233" r="18"/>
  <circle class="fil4 str3" cx="619" cy="327" r="18"/>
  <circle class="fil5 str4" cx="87" cy="644" r="18"/>
  <polygon class="fil6 str5" points="140,582 87,644 "/>
  <g>
   <path class="fil0" d="M89 540l0 104 -4 0 0 -104 4 0zm-2 -22l11 26 -1 -1 0 0 -1 0 -1 -1 0 0 -1 0 -1 0 0 0 -1 -1 -1 0 0 0 -1 0 -1 0 0 0 -1 0 -1 0 -1 0 0 0 -1 0 -1 0 0 0 -1 0 -1 0 0 1 -1 0 -1 0 0 0 -1 0 -1 1 0 0 -1 0 -1 1 0 0 11 -26z"/>
  </g>
  <g>
   <path class="fil3" d="M176 646l-89 0 0 -4 89 0 0 4zm22 -2l-26 11 0 -1 1 -1 0 0 0 -1 0 -1 1 0 0 -1 0 -1 0 0 0 -1 1 -1 0 0 0 -1 0 -1 0 0 0 -1 0 -1 0 0 0 -1 0 -1 0 -1 -1 0 0 -1 0 -1 0 0 0 -1 -1 -1 0 0 0 -1 0 -1 -1 0 0 -1 0 0 26 11z"/>
  </g>
  <g>
   <path class="fil0" d="M152 572l-63 73 -4 -3 63 -73 4 3zm12 -18l-8 26 0 -1 -1 0 0 -1 0 -1 -1 0 0 -1 -1 0 0 -1 0 -1 -1 0 0 -1 -1 0 0 -1 -1 0 0 -1 -1 0 0 -1 -1 0 0 0 -1 -1 0 0 -1 0 -1 -1 0 0 -1 0 -1 -1 0 0 -1 0 -1 0 0 -1 -1 0 -1 0 0 0 25 -12z"/>
  </g>
  <g>
   <path class="fil7" d="M567 251l-3 4 0 0 -1 -1 -2 -1 -2 -1 -1 -1 -2 -1 -2 -1 -2 -1 -2 0 -2 -1 -2 -1 -2 0 -2 -1 -2 -1 -2 0 -2 -1 -2 -1 -3 0 -2 -1 -2 0 -2 -1 -3 0 -2 -1 -2 0 -3 -1 -2 0 -2 -1 -3 0 -2 0 -2 -1 -3 0 -2 -1 -2 0 0 -5 3 1 2 0 3 1 2 0 2 0 3 1 2 0 2 1 3 0 2 1 2 0 3 1 2 0 2 1 3 0 2 1 2 0 2 1 2 1 3 0 2 1 2 1 2 1 2 0 2 1 2 1 2 1 2 1 2 1 1 1 2 1 2 1 0 0zm39 48l-4 2 -1 -2 -1 -1 -1 -2 -1 -2 -1 -1 -1 -2 -1 -2 -1 -1 -1 -2 -1 -1 -1 -2 -1 -2 -1 -1 -1 -2 -1 -1 -1 -2 -1 -1 -1 -2 -2 -1 -1 -2 -1 -1 -1 -1 -2 -2 -1 -1 -1 -1 -2 -2 -1 -1 -1 -1 -2 -1 -1 -1 -2 -1 -2 -1 3 -4 2 1 1 1 2 1 2 1 1 2 2 1 1 1 1 2 2 1 1 1 1 2 2 1 1 2 1 1 1 2 2 1 1 2 1 2 1 1 1 2 1 1 1 2 1 2 1 1 1 2 1 2 1 1 1 2 1 2 1 1 1 2 1 2zm9 20l-22 -17 0 0 1 0 1 0 1 0 0 0 1 0 1 -1 0 0 1 0 1 0 0 0 1 -1 1 0 0 0 1 -1 0 0 1 0 1 -1 0 0 1 0 0 -1 1 0 0 -1 1 0 0 -1 1 0 0 -1 1 0 0 -1 1 0 0 -1 1 -1 0 0 3 28z"/>
  </g>
  <g>
   <path class="fil8" d="M220 526l-3 4 0 0 0 0 0 -1 0 0 -1 0 0 0 0 0 -1 0 0 0 0 -1 -1 0 0 0 0 0 -1 0 0 0 0 0 -1 0 0 0 0 0 -1 -1 0 0 0 0 -1 0 0 0 -1 0 0 0 0 0 -1 0 0 0 -1 0 0 0 -1 0 0 -1 1 -4 0 0 1 0 0 0 1 0 0 0 0 0 1 0 0 0 1 1 0 0 1 0 0 0 0 0 1 0 0 0 1 0 0 0 0 0 1 1 0 0 1 0 0 0 0 0 1 0 0 0 1 1 0 0 0 0 1 0 0 0 0 0 1 1 0 0zm7 9l-4 2 0 0 0 0 0 -1 0 0 -1 0 0 -1 0 0 0 0 0 0 0 -1 -1 0 0 0 0 0 0 -1 0 0 0 0 -1 0 0 -1 0 0 0 0 0 0 -1 -1 0 0 0 0 0 0 0 0 -1 -1 0 0 0 0 0 0 0 0 -1 0 3 -4 0 0 0 0 1 0 0 1 0 0 1 0 0 0 0 1 1 0 0 0 0 1 0 0 1 0 0 0 0 1 0 0 1 0 0 1 0 0 0 0 0 1 1 0 0 0 0 0 0 1 0 0 0 0 1 1 0 0 0 0 0 1 0 0zm9 20l-22 -17 1 0 0 0 1 0 1 0 1 0 0 0 1 -1 1 0 0 0 1 0 1 0 0 -1 1 0 1 0 0 -1 1 0 0 0 1 -1 1 0 0 0 1 -1 0 0 1 -1 0 0 1 -1 0 0 1 -1 0 0 1 -1 0 0 1 -1 0 -1 0 0 3 28z"/>
  </g>
  <g>
   <path class="fil8" d="M267 489l-2 4 0 0 -1 0 0 0 -1 0 0 -1 -1 0 0 0 -1 0 0 -1 -1 0 0 0 -1 0 -1 0 0 -1 -1 0 0 0 -1 0 -1 0 0 0 -1 -1 -1 0 0 0 -1 0 -1 0 -1 0 0 0 -1 -1 -1 0 0 0 -1 0 -1 0 0 0 -1 0 1 -5 0 0 1 0 1 0 0 1 1 0 1 0 1 0 0 0 1 0 1 0 1 0 0 1 1 0 1 0 0 0 1 0 1 1 0 0 1 0 1 0 0 0 1 1 1 0 0 0 1 0 1 1 0 0 1 0 1 0 0 1 1 0 0 0 0 0zm13 16l-4 2 -1 -1 0 0 0 -1 -1 0 0 -1 0 0 0 -1 -1 0 0 -1 0 0 -1 -1 0 0 0 0 -1 -1 0 0 0 -1 -1 0 0 -1 0 0 -1 0 0 -1 0 0 -1 -1 0 0 0 0 -1 -1 0 0 -1 0 0 -1 0 0 -1 0 0 -1 2 -4 1 1 0 0 1 1 0 0 1 0 0 1 1 0 0 1 1 0 0 1 1 0 0 0 0 1 1 0 0 1 1 0 0 1 0 0 1 1 0 0 0 1 1 0 0 1 0 0 1 1 0 0 0 1 1 1 0 0 0 1 0 0 1 1zm8 20l-22 -17 1 0 1 0 1 0 0 0 1 -1 1 0 0 0 1 0 1 0 0 0 1 -1 1 0 0 0 1 0 1 -1 0 0 1 0 0 -1 1 0 0 -1 1 0 1 0 0 -1 1 0 0 -1 1 0 0 -1 1 -1 0 0 0 -1 1 0 0 -1 0 0 3 28z"/>
  </g>
  <g>
   <path class="fil8" d="M314 453l-2 4 0 0 -1 0 -1 -1 0 0 -1 -1 -1 0 0 0 -1 -1 -1 0 -1 0 -1 0 0 -1 -1 0 -1 0 -1 -1 -1 0 -1 0 -1 0 -1 -1 -1 0 -1 0 -1 0 -1 0 -1 -1 -1 0 0 0 -1 0 -1 0 -1 0 -1 -1 -1 0 -2 0 -1 0 1 -5 1 0 1 1 1 0 1 0 1 0 1 0 1 0 1 1 1 0 1 0 1 0 1 0 1 1 1 0 1 0 1 0 1 1 1 0 1 0 1 0 1 1 1 0 1 0 1 1 1 0 0 0 1 1 1 0 1 1 1 0 1 1 0 0 0 0zm17 21l-4 2 0 0 -1 -1 0 -1 0 -1 -1 0 0 -1 -1 -1 0 0 0 -1 -1 -1 0 0 -1 -1 0 -1 -1 0 0 -1 0 -1 -1 0 0 -1 -1 0 0 -1 -1 -1 0 0 -1 -1 0 0 -1 -1 -1 0 0 -1 -1 0 0 -1 -1 0 -1 -1 0 0 2 -4 1 1 1 0 1 1 0 0 1 1 1 0 0 1 1 0 0 1 1 1 1 0 0 1 1 1 0 0 1 1 0 1 1 0 0 1 1 1 0 0 1 1 0 1 1 0 0 1 0 1 1 1 0 0 1 1 0 1 1 0 0 1 0 1zm9 20l-22 -17 1 0 0 0 1 0 1 0 1 0 0 0 1 0 1 -1 0 0 1 0 1 0 0 -1 1 0 1 0 0 0 1 -1 0 0 1 -1 1 0 0 0 1 -1 0 0 1 -1 0 0 1 -1 0 0 1 -1 0 0 1 -1 0 0 1 -1 0 -1 0 0 3 28z"/>
  </g>
  <g>
   <path class="fil8" d="M375 407l-3 3 0 0 -1 0 -1 -1 -1 0 -1 -1 -1 0 -1 -1 -1 0 -1 -1 -1 0 -1 0 -1 -1 -2 0 -1 -1 -1 0 -1 0 -2 -1 -1 0 -1 0 -1 0 -2 -1 -1 0 -1 0 -2 -1 -1 0 -1 0 -2 0 -1 -1 -1 0 -2 0 -1 0 -2 -1 -1 0 1 -4 1 0 2 0 1 0 1 0 2 1 1 0 1 0 2 1 1 0 2 0 1 0 1 1 2 0 1 0 1 1 2 0 1 0 1 1 1 0 2 0 1 1 1 0 1 1 2 0 1 1 1 0 1 1 1 0 1 1 2 0 1 1 1 1 0 0zm23 28l-4 2 -1 -1 -1 -1 0 -1 -1 -1 0 -1 -1 -1 0 -1 -1 -1 0 -1 -1 0 -1 -1 0 -1 -1 -1 0 -1 -1 -1 -1 -1 0 -1 -1 -1 -1 0 0 -1 -1 -1 -1 -1 -1 -1 0 0 -1 -1 -1 -1 -1 0 0 -1 -1 -1 -1 0 -1 -1 -1 -1 3 -3 1 0 1 1 1 1 1 0 0 1 1 1 1 1 1 0 1 1 1 1 0 1 1 1 1 1 1 1 0 0 1 1 1 1 0 1 1 1 1 1 0 1 1 1 1 1 0 1 1 1 0 1 1 1 0 1 1 1 1 1 0 1 1 1zm8 20l-22 -17 1 0 1 0 1 0 0 0 1 0 1 0 0 -1 1 0 1 0 0 0 1 0 1 -1 0 0 1 0 1 -1 0 0 1 0 0 -1 1 0 0 0 1 -1 1 0 0 -1 1 0 0 -1 1 0 0 -1 1 0 0 -1 0 0 1 -1 0 -1 0 0 3 28z"/>
  </g>
  <g>
   <path class="fil8" d="M432 359l-3 4 0 0 -1 -1 -1 0 -1 -1 -2 -1 -1 0 -1 -1 -1 0 -2 -1 -1 0 -1 -1 -2 0 -1 -1 -2 0 -1 -1 -2 0 -1 0 -2 -1 -1 0 -2 -1 -1 0 -2 0 -1 -1 -2 0 -1 0 -2 0 -2 -1 -1 0 -2 0 -2 -1 -1 0 -2 0 -2 -1 1 -4 2 0 2 0 1 1 2 0 2 0 1 1 2 0 1 0 2 1 2 0 1 0 2 1 1 0 2 0 2 1 1 0 2 0 1 1 2 0 1 1 2 0 1 1 2 0 1 1 1 0 2 1 1 1 2 0 1 1 1 1 1 0 2 1 0 0zm27 34l-4 2 -1 -1 -1 -1 0 -2 -1 -1 -1 -1 0 -1 -1 -1 -1 -1 0 -1 -1 -2 -1 -1 0 -1 -1 -1 -1 -1 -1 -1 0 -1 -1 -1 -1 -1 -1 -1 0 -1 -1 -1 -1 -1 -1 -1 -1 -1 -1 -1 -1 0 -1 -1 -1 -1 -1 -1 -1 -1 -1 0 -1 -1 3 -4 1 1 1 1 1 0 1 1 1 1 1 1 1 1 1 1 1 1 1 1 1 1 1 1 1 1 1 1 1 1 0 1 1 1 1 1 1 2 1 1 0 1 1 1 1 1 0 1 1 1 1 2 1 1 0 1 1 1 1 1 0 1 1 2zm9 20l-23 -17 1 0 1 0 1 0 0 0 1 -1 1 0 1 0 0 0 1 0 1 0 0 -1 1 0 1 0 0 -1 1 0 0 0 1 -1 1 0 0 0 1 -1 0 0 1 -1 0 0 1 0 0 -1 1 0 0 -1 1 -1 0 0 1 -1 0 0 1 -1 0 0 3 28z"/>
  </g>
  <g>
   <path class="fil8" d="M494 313l-2 4 0 0 -2 -1 -1 -1 -2 0 -1 -1 -2 -1 -2 -1 -1 0 -2 -1 -2 -1 -1 0 -2 -1 -2 -1 -2 0 -2 -1 -2 0 -1 -1 -2 0 -2 -1 -2 0 -2 -1 -2 0 -2 0 -2 -1 -2 0 -2 -1 -3 0 -2 0 -2 -1 -2 0 -2 0 -2 -1 -2 0 1 -5 2 1 2 0 2 0 2 1 2 0 2 0 2 1 2 0 3 1 2 0 2 0 2 1 2 0 2 1 2 0 2 1 2 0 2 1 1 0 2 1 2 1 2 0 2 1 2 1 2 0 1 1 2 1 2 1 1 0 2 1 2 1 1 1 0 0zm35 43l-5 2 0 -2 -1 -1 -1 -2 -1 -1 -1 -2 -1 -1 -1 -1 0 -2 -1 -1 -1 -2 -1 -1 -1 -2 -1 -1 -1 -1 -1 -2 -1 -1 -1 -1 -1 -2 -1 -1 -1 -1 -1 -1 -1 -1 -1 -2 -1 -1 -1 -1 -2 -1 -1 -1 -1 -1 -1 -1 -2 -1 -1 -1 -1 -1 2 -4 2 1 1 1 1 1 2 1 1 1 2 2 1 1 1 1 1 1 1 1 2 2 1 1 1 1 1 2 1 1 1 1 1 2 1 1 1 1 1 2 1 1 1 2 1 1 1 2 1 1 0 2 1 1 1 2 1 1 1 2 1 1 1 2zm8 20l-22 -17 1 0 1 0 0 0 1 0 1 -1 0 0 1 0 1 0 1 0 0 0 1 -1 1 0 0 0 1 -1 0 0 1 0 1 -1 0 0 1 0 0 -1 1 0 0 -1 1 0 0 0 1 -1 0 0 1 -1 0 -1 1 0 0 -1 1 0 0 -1 0 0 3 28z"/>
  </g>
  <line class="fil2 str2" x1="87" y1="642" x2="619" y2= "327" />
  <g>
   <path class="fil9" d="M159 623l-4 -3 0 1 2 -6 2 -6 2 -5 0 -4 1 -5 -1 -4 0 -3 -2 -4 -1 -3 -2 -3 -2 -2 -3 -2 -3 -2 -3 -2 -3 -1 -3 -1 -4 -1 -3 -1 -4 0 -3 0 -4 1 -3 0 -3 1 -3 1 -3 1 -3 2 -2 2 -2 2 -2 2 -1 3 -1 2 -1 3 -5 0 1 -4 1 -3 2 -3 2 -3 3 -3 2 -2 3 -2 4 -1 3 -2 4 0 4 -1 4 0 4 -1 3 1 4 0 4 1 4 1 4 2 3 2 3 2 3 3 3 2 2 4 2 3 1 4 1 5 0 4 0 5 -1 5 -1 6 -2 6 -3 6 0 0zm0 0l0 0 0 0 0 0zm-6 1l2 -4 4 3 -2 3 -4 -2zm-11 19l6 -28 0 1 1 1 0 0 0 1 1 1 0 0 1 1 0 0 1 1 0 0 1 1 0 0 1 1 0 0 1 1 0 0 1 0 0 1 1 0 1 1 0 0 1 0 0 0 1 1 1 0 0 0 1 0 1 1 1 0 0 0 1 0 1 0 0 0 -24 15z"/>
  </g>
  <line class="fil2 str6" x1="497" y1="266" x2="497" y2= "597" />
  <line class="fil2 str6" x1="619" y1="359" x2="619" y2= "597" />
  <line class="fil2 str6" x1="475" y1="579" x2="646" y2= "579" />
  <line class="fil2 str6" x1="484" y1="592" x2="510" y2= "567" />
  <line class="fil2 str6" x1="606" y1="592" x2="632" y2= "567" />
  <path class="fil7" d="M537 618c0,-5 -5,-6 -8,-6 -6,0 -9,4 -10,6 -1,-4 -4,-6 -7,-6 -3,0 -5,2 -6,5 -2,3 -3,8 -3,8 0,1 1,1 1,1 1,0 1,0 2,-2 1,-6 3,-10 6,-10 2,0 2,3 2,3 0,2 0,3 -1,5l-6 25c0,1 0,1 0,1 0,1 0,3 2,3 3,0 3,-3 3,-4l6 -22c0,0 4,-11 11,-11 0,0 3,0 4,1 -2,1 -3,4 -3,4 0,1 1,3 3,3 2,0 4,-1 4,-4z"/>
  <path id="1" class="fil7" d="M636 664c0,-1 -1,-1 -2,-1 -4,0 -4,0 -4,-1 0,-1 0,-1 0,-1l12 -47c0,0 0,-1 0,-1 0,-1 -1,-1 -1,-1 -1,0 -4,3 -5,6 -1,-3 -3,-6 -8,-6 -9,0 -19,13 -19,25 0,8 4,14 10,14 4,0 7,-3 9,-5 -1,7 -1,7 -3,13 -1,4 -1,4 -6,4 -2,0 -2,0 -2,2 0,1 0,1 1,1 2,0 5,0 8,0 3,0 6,0 9,0 0,0 1,0 1,-2zm-6 -25c-1,3 -6,10 -11,10 -4,0 -4,-5 -4,-8 0,-4 2,-14 4,-18 2,-5 6,-9 9,-9 1,0 3,0 5,3 0,1 1,3 1,5 0,0 0,1 0,1l-4 16z"/>
  <path id="2" class="fil7" d="M557 656c0,-1 0,-1 0,-1 -1,0 -1,0 -1,1 -2,5 -3,9 -11,9l-6 0 22 -26c0,0 0,-1 0,-1 0,0 0,0 0,0l-17 0c-1,0 -1,0 -1,1l-2 7c0,0 -1,1 -1,1 0,0 1,0 1,0 1,0 1,0 1,-1 1,-3 3,-7 9,-7l6 0 -21 26c-1,0 -1,1 -1,1 0,1 0,1 1,1l17 0c1,0 1,0 1,-1l3 -10c0,0 0,0 0,0z"/>
  <path id="3" class="fil7" d="M672 648c0,-7 -4,-11 -9,-11 -9,0 -18,10 -18,20 0,6 4,10 10,10 8,0 17,-9 17,-19zm-3 -2c0,3 -1,10 -5,14 -2,4 -6,7 -9,7 -4,0 -6,-4 -6,-9 0,-3 0,-9 4,-14 2,-4 6,-6 9,-6 4,0 7,3 7,8zm-3 4c0,0 0,0 0,0 0,0 0,-1 0,-1 -1,0 -1,2 -1,2l-12 0c0,-1 1,-1 1,-1 0,0 -1,-1 -1,-1 -1,0 -1,0 -1,1l-1 4c0,0 0,0 0,0 0,1 0,1 1,1 1,0 1,-1 1,-1l11 0c0,0 0,0 0,0 0,1 0,1 0,1 1,0 1,0 1,-1l1 -4z"/>
  <path id="4" class="fil7" d="M708 638c0,0 0,0 0,0 -1,0 -2,0 -3,0 -2,0 -3,0 -4,0 -1,0 -1,0 -1,0 0,1 0,1 0,1 1,0 2,0 2,1 0,1 -1,2 -1,2l-10 11 -4 -12c0,-1 0,-1 0,-1 0,-1 2,-1 3,-1 0,0 1,0 1,-1 0,0 -1,0 -1,0 -2,0 -3,0 -5,0 -1,0 -3,0 -4,0 -1,0 -1,0 -1,0 0,1 0,1 1,1 2,0 2,0 3,1l4 14c0,1 0,1 0,1 0,0 -2,7 -2,8 0,2 0,2 -3,2 -1,0 -2,0 -2,1 0,1 1,1 1,1 2,0 3,-1 5,-1 2,0 3,1 5,1 0,0 1,0 1,-1 0,-1 -1,-1 -1,-1 -2,0 -3,0 -3,0 0,-1 1,-3 1,-4l1 -5c1,-1 1,-1 1,-1l10 -13c2,-2 3,-3 5,-3 1,0 1,0 1,-1z"/>
  <path id="5" class="fil7" d="M581 622c-1,0 -1,1 -2,1 -1,0 -2,-1 -3,-1 0,-1 -1,-2 -1,-3 0,-1 1,-1 1,-2 1,-1 2,-1 3,-1 1,0 1,0 2,1 1,1 1,1 1,2 0,1 0,2 -1,3z"/>
  <path class="fil9" d="M27 703c0,-1 -1,-1 -2,-1 -4,0 -4,0 -4,-1 0,-1 0,-1 0,-2l12 -46c0,0 0,-1 0,-1 0,-1 -1,-1 -1,-1 -1,0 -4,3 -5,6 -1,-3 -4,-6 -8,-6 -9,0 -19,13 -19,25 0,8 4,13 10,13 4,0 7,-2 9,-4 -1,7 -1,7 -3,13 -1,4 -1,4 -7,4 -1,0 -2,0 -2,2 0,1 1,1 2,1 2,0 5,0 8,0 3,0 6,0 9,0 0,0 1,0 1,-2zm-6 -25c-1,3 -6,10 -11,10 -4,0 -4,-5 -4,-8 0,-4 2,-14 4,-18 2,-5 6,-9 9,-9 1,0 3,0 5,2 0,2 1,4 1,6 0,0 0,0 0,1l-4 16z"/>
  <path id="1" class="fil9" d="M63 687c0,-7 -4,-11 -10,-11 -8,0 -17,10 -17,19 0,7 4,11 10,11 8,0 17,-9 17,-19zm-3 -2c0,3 -1,10 -5,14 -2,4 -6,6 -9,6 -4,0 -6,-3 -6,-8 0,-3 0,-9 4,-14 2,-4 6,-6 9,-6 4,0 7,3 7,8zm-3 4c0,0 0,0 0,0 0,-1 0,-1 0,-1 -1,0 -1,1 -1,1l-12 0c0,0 1,0 1,0 0,-1 -1,-1 -1,-1 -1,0 -1,0 -1,1l-1 4c0,0 0,0 0,0 0,1 0,1 1,1 0,0 1,-2 1,-2l11 0c0,1 0,1 0,1 0,1 0,1 0,1 1,0 1,0 1,-1l1 -4z"/>
  <path id="2" class="fil9" d="M99 677c0,0 0,0 0,0 -1,0 -2,0 -4,0 -1,0 -2,0 -3,0 -1,0 -1,0 -1,0 0,1 0,1 0,1 1,0 2,0 2,1 0,1 -1,2 -1,2l-10 11 -4 -13c0,0 0,0 0,0 0,-1 2,-1 3,-1 0,0 1,0 1,-1 0,0 -1,0 -1,0 -2,0 -3,0 -5,0 -1,0 -3,0 -4,0 -1,0 -1,0 -1,0 0,1 0,1 1,1 2,0 2,0 2,1l5 14c0,0 0,1 0,1 0,0 -2,7 -2,8 0,2 0,2 -4,2 0,0 -1,0 -1,1 0,0 1,0 1,0 2,0 3,0 5,0 2,0 3,0 5,0 0,0 1,0 1,0 0,-1 -1,-1 -1,-1 -2,0 -3,0 -3,-1 0,0 1,-2 1,-3l1 -5c0,-1 0,-1 1,-2l10 -12c2,-2 3,-3 5,-3 1,0 1,0 1,-1z"/>
  <path class="fil3" d="M214 478c0,0 0,-1 -1,-1 -1,0 -3,0 -5,0 -2,0 -4,0 -6,0 0,0 -1,0 -1,1 0,1 1,1 1,1 1,0 2,1 2,2 0,1 -1,3 -2,3l-14 17 -6 -19c-1,-1 -1,-1 -1,-1 0,-2 3,-2 4,-2 1,0 2,0 2,-1 0,-1 -1,-1 -1,-1 -3,0 -5,0 -8,0 -2,0 -5,0 -7,0 0,0 -1,0 -1,1 0,1 1,1 1,1 4,0 4,1 5,2l7 22c0,0 0,1 0,1 0,0 -3,11 -3,12 -1,4 -1,4 -6,4 -1,0 -2,0 -2,1 0,1 1,1 1,1 3,0 5,0 8,0 3,0 5,0 8,0 0,0 1,0 1,-1 0,-1 0,-1 -2,-1 -2,0 -4,0 -4,-1 0,-1 1,-4 2,-6l2 -8c0,-1 0,-1 1,-2l15 -18c3,-4 6,-6 9,-6 0,0 1,0 1,-1z"/>
  <path class="fil3" d="M58 514c0,-1 -1,-1 -1,-1 -1,0 -1,0 -1,2 -3,7 -5,13 -17,13l-9 0 34 -40c0,-1 0,-2 0,-2 0,-1 0,-1 -1,-1l-26 0c-1,0 -1,1 -1,2l-4 12c0,0 0,1 0,1 0,0 1,0 1,0 1,0 1,0 1,-1 2,-6 4,-11 15,-11l9 0 -34 40c0,1 -1,1 -1,2 0,0 1,0 2,0l26 0c2,0 2,0 2,-1l5 -14c0,0 0,-1 0,-1z"/>
  <path class="fil3" d="M254 621c0,-1 0,-1 -1,-1 -4,0 -4,-1 -5,-2l-7 -21 10 -13 1 0c2,-2 4,-5 9,-5 1,0 1,0 1,-1 0,-1 0,-1 0,-1 -2,0 -4,0 -6,0 -2,0 -5,0 -7,0 0,0 -1,0 -1,1 0,1 0,1 1,1 0,0 2,0 2,2 0,0 0,1 -1,3l-10 11 -5 -13 0 -1c0,-1 1,-2 4,-2 0,0 1,0 1,-1 0,-1 -1,-1 -1,-1 -3,0 -5,0 -8,0 -2,0 -5,0 -7,0 0,0 -1,0 -1,1 0,1 1,1 2,1 3,0 3,1 4,2l7 18 -14 16c-4,5 -8,5 -10,5 0,0 -1,1 -1,1 0,0 1,1 1,1 2,0 4,0 6,0 2,0 5,0 7,0 0,0 1,0 1,-1 0,-1 -1,-1 -1,-1 -2,0 -2,-1 -2,-2 0,0 0,-1 0,-2 1,0 1,0 1,0l0 0 12 -15 6 16c0,0 0,1 0,1 0,1 -1,2 -3,2 -1,0 -1,0 -1,1 0,1 0,1 1,1 2,0 5,0 7,0 2,0 5,0 7,0 0,0 1,0 1,-1z"/>
 </g>
</svg>
