<?xml version="1.0" encoding="UTF-8" standalone="no"?>
<svg
   xmlns:dc="http://purl.org/dc/elements/1.1/"
   xmlns:cc="http://creativecommons.org/ns#"
   xmlns:rdf="http://www.w3.org/1999/02/22-rdf-syntax-ns#"
   xmlns:svg="http://www.w3.org/2000/svg"
   xmlns="http://www.w3.org/2000/svg"
   xmlns:sodipodi="http://sodipodi.sourceforge.net/DTD/sodipodi-0.dtd"
   xmlns:inkscape="http://www.inkscape.org/namespaces/inkscape"
   width="210mm"
   height="297mm"
   viewBox="0 0 210 297"
   version="1.1"
   id="svg8"
   inkscape:version="1.0.1 (3bc2e813f5, 2020-09-07)"
   sodipodi:docname="AB.svg">
  <defs
     id="defs2" />
  <sodipodi:namedview
     id="base"
     pagecolor="#ffffff"
     bordercolor="#666666"
     borderopacity="1.0"
     inkscape:pageopacity="0.0"
     inkscape:pageshadow="2"
     inkscape:zoom="0.175"
     inkscape:cx="649.3692"
     inkscape:cy="914.13791"
     inkscape:document-units="mm"
     inkscape:current-layer="layer1"
     inkscape:document-rotation="0"
     showgrid="false"
     inkscape:window-width="958"
     inkscape:window-height="1018"
     inkscape:window-x="953"
     inkscape:window-y="0"
     inkscape:window-maximized="0" />
  <metadata
     id="metadata5">
    <rdf:RDF>
      <cc:Work
         rdf:about="">
        <dc:format>image/svg+xml</dc:format>
        <dc:type
           rdf:resource="http://purl.org/dc/dcmitype/StillImage" />
        <dc:title></dc:title>
      </cc:Work>
    </rdf:RDF>
  </metadata>
  <g
     inkscape:label="Layer 1"
     inkscape:groupmode="layer"
     id="layer1">
    <path
       style="clip-rule:evenodd;fill:none;fill-rule:evenodd;stroke:#373435;stroke-width:2.64583;stroke-linecap:round;stroke-linejoin:round;stroke-miterlimit:4;stroke-dasharray:none;stroke-opacity:1;image-rendering:optimizeQuality;shape-rendering:geometricPrecision;text-rendering:geometricPrecision"
       inkscape:connector-curvature="0"
       id="path4195-7"
       d="m -76.179268,137.85123 h 11.769963 v 14.16519 l 11.451802,-28.33037 v 28.33037 l 11.451854,-28.33037 v 28.33037 l 11.13372,-28.33037 v 14.16518 h 11.769934"
       class="fil8 str4"
       inkscape:export-xdpi="100"
       inkscape:export-ydpi="100" />
    <rect
       style="clip-rule:evenodd;opacity:1;fill:#ff800c;fill-opacity:0.6;fill-rule:evenodd;stroke:#373536;stroke-width:2.64583;stroke-linecap:round;stroke-linejoin:round;stroke-miterlimit:4;stroke-dasharray:none;stroke-opacity:1;image-rendering:optimizeQuality;shape-rendering:geometricPrecision;text-rendering:geometricPrecision"
       id="rect4393-3"
       width="58.465576"
       height="50.147926"
       x="-167.08405"
       y="-127.02286"
       rx="0"
       ry="3.7782679"
       transform="rotate(-90)"
       inkscape:export-xdpi="100"
       inkscape:export-ydpi="100" />
    <text
       xml:space="preserve"
       style="font-style:normal;font-weight:normal;font-size:3.175px;line-height:0%;font-family:sans-serif;letter-spacing:0px;word-spacing:0px;clip-rule:evenodd;fill:#000000;fill-opacity:1;fill-rule:evenodd;stroke:none;stroke-width:0.264583px;stroke-linecap:butt;stroke-linejoin:miter;stroke-opacity:1;image-rendering:optimizeQuality;shape-rendering:geometricPrecision;text-rendering:geometricPrecision"
       x="-114.26608"
       y="141.14302"
       id="text4413-9"
       inkscape:export-xdpi="100"
       inkscape:export-ydpi="100"><tspan
         sodipodi:role="line"
         id="tspan4415-0"
         x="-114.26608"
         y="141.14302"
         style="font-style:italic;font-variant:normal;font-weight:normal;font-stretch:normal;font-size:21.1667px;line-height:1.25;font-family:Cambria;-inkscape-font-specification:'Cambria Italic';stroke-width:0.264583px">m<tspan
   style="font-style:normal;font-variant:normal;font-weight:normal;font-stretch:normal;font-size:13.7583px;font-family:Cambria;-inkscape-font-specification:Cambria;baseline-shift:sub;stroke-width:0.264583px"
   id="tspan4417-5">1</tspan></tspan></text>
    <text
       xml:space="preserve"
       style="font-style:normal;font-weight:normal;font-size:3.175px;line-height:0%;font-family:sans-serif;letter-spacing:0px;word-spacing:0px;clip-rule:evenodd;fill:#000000;fill-opacity:1;fill-rule:evenodd;stroke:none;stroke-width:0.264583px;stroke-linecap:butt;stroke-linejoin:miter;stroke-opacity:1;image-rendering:optimizeQuality;shape-rendering:geometricPrecision;text-rendering:geometricPrecision"
       x="-56.331196"
       y="173.50209"
       id="text4413-8-68"
       inkscape:export-xdpi="100"
       inkscape:export-ydpi="100"><tspan
         sodipodi:role="line"
         id="tspan4415-1-4"
         x="-56.331196"
         y="173.50209"
         style="font-style:italic;font-variant:normal;font-weight:normal;font-stretch:normal;font-size:21.1667px;line-height:1.25;font-family:Cambria;-inkscape-font-specification:'Cambria Italic';stroke-width:0.264583px">k<tspan
   style="font-style:normal;font-variant:normal;font-weight:normal;font-stretch:normal;font-size:13.7583px;font-family:Cambria;-inkscape-font-specification:Cambria;baseline-shift:sub;stroke-width:0.264583px"
   id="tspan4417-9-9">1</tspan></tspan></text>
    <path
       style="clip-rule:evenodd;fill:none;fill-rule:evenodd;stroke:#373435;stroke-width:4.7625;stroke-linecap:round;stroke-linejoin:round;stroke-miterlimit:4;stroke-dasharray:none;stroke-opacity:1;image-rendering:optimizeQuality;shape-rendering:geometricPrecision;text-rendering:geometricPrecision"
       inkscape:connector-curvature="0"
       id="path4195-4-0"
       d="m 33.840145,152.18461 h 11.76994 v 14.16518 l 11.4518,-28.33036 v 28.33036 l 11.45185,-28.33036 v 28.33036 l 11.13372,-28.33036 v 14.16518 h 11.76994"
       class="fil8 str4"
       inkscape:export-xdpi="100"
       inkscape:export-ydpi="100" />
    <rect
       style="clip-rule:evenodd;opacity:1;fill:#ff800c;fill-opacity:0.6;fill-rule:evenodd;stroke:#373536;stroke-width:3.20495;stroke-linecap:round;stroke-linejoin:round;stroke-miterlimit:4;stroke-dasharray:none;stroke-opacity:1;image-rendering:optimizeQuality;shape-rendering:geometricPrecision;text-rendering:geometricPrecision"
       id="rect4393-4-7"
       width="86.753387"
       height="49.588814"
       x="-194.56718"
       y="-16.723927"
       rx="0"
       ry="3.7361429"
       transform="rotate(-90)"
       inkscape:export-xdpi="100"
       inkscape:export-ydpi="100" />
    <text
       xml:space="preserve"
       style="font-style:normal;font-weight:normal;font-size:3.175px;line-height:0%;font-family:sans-serif;letter-spacing:0px;word-spacing:0px;clip-rule:evenodd;fill:#000000;fill-opacity:1;fill-rule:evenodd;stroke:none;stroke-width:0.264583px;stroke-linecap:butt;stroke-linejoin:miter;stroke-opacity:1;image-rendering:optimizeQuality;shape-rendering:geometricPrecision;text-rendering:geometricPrecision"
       x="39.854603"
       y="188.42305"
       id="text4413-8-8-9"
       inkscape:export-xdpi="100"
       inkscape:export-ydpi="100"><tspan
         sodipodi:role="line"
         id="tspan4415-1-6-2"
         x="39.854603"
         y="188.42305"
         style="font-style:italic;font-variant:normal;font-weight:normal;font-stretch:normal;font-size:21.1667px;line-height:1.25;font-family:Cambria;-inkscape-font-specification:'Cambria Italic';stroke-width:0.264583px">k<tspan
   id="tspan4494-8"
   style="font-style:normal;font-variant:normal;font-weight:normal;font-stretch:normal;font-size:13.7583px;font-family:Cambria;-inkscape-font-specification:Cambria;baseline-shift:sub;stroke-width:0.264583px">2</tspan></tspan></text>
    <text
       xml:space="preserve"
       style="font-style:normal;font-weight:normal;font-size:3.175px;line-height:0%;font-family:sans-serif;letter-spacing:0px;word-spacing:0px;clip-rule:evenodd;fill:#000000;fill-opacity:1;fill-rule:evenodd;stroke:none;stroke-width:0.264583px;stroke-linecap:butt;stroke-linejoin:miter;stroke-opacity:1;image-rendering:optimizeQuality;shape-rendering:geometricPrecision;text-rendering:geometricPrecision"
       x="69.06884"
       y="188.42305"
       id="text4413-8-6-3"
       inkscape:export-xdpi="100"
       inkscape:export-ydpi="100"><tspan
         sodipodi:role="line"
         id="tspan4415-1-5-5"
         x="69.06884"
         y="188.42305"
         style="font-style:italic;font-variant:normal;font-weight:normal;font-stretch:normal;font-size:21.1667px;line-height:1.25;font-family:Cambria;-inkscape-font-specification:'Cambria Italic';stroke-width:0.264583px">k<tspan
   style="font-style:normal;font-variant:normal;font-weight:normal;font-stretch:normal;font-size:13.7583px;font-family:Cambria;-inkscape-font-specification:Cambria;baseline-shift:sub;stroke-width:0.264583px"
   id="tspan4854-0">4</tspan></tspan></text>
    <g
       id="g5331"
       transform="matrix(0.26458333,0,0,0.26458333,-924.05804,325.06471)"
       inkscape:export-xdpi="100"
       inkscape:export-ydpi="100"
       style="clip-rule:evenodd;fill-rule:evenodd;image-rendering:optimizeQuality;shape-rendering:geometricPrecision;text-rendering:geometricPrecision">
      <text
         id="text4413-0-2"
         y="-710.6369"
         x="3477.0515"
         style="font-style:normal;font-weight:normal;line-height:0%;font-family:sans-serif;letter-spacing:0px;word-spacing:0px;clip-rule:evenodd;fill:#000000;fill-opacity:1;fill-rule:evenodd;stroke:none;stroke-width:1px;stroke-linecap:butt;stroke-linejoin:miter;stroke-opacity:1;image-rendering:optimizeQuality;shape-rendering:geometricPrecision;text-rendering:geometricPrecision"
         xml:space="preserve"><tspan
           style="font-style:italic;font-variant:normal;font-weight:normal;font-stretch:normal;font-size:80px;line-height:1.25;font-family:Cambria;-inkscape-font-specification:'Cambria Italic'"
           y="-710.6369"
           x="3477.0515"
           id="tspan4415-18-4"
           sodipodi:role="line">m<tspan
   style="font-style:normal;font-variant:normal;font-weight:normal;font-stretch:normal;font-size:65%;font-family:Cambria;-inkscape-font-specification:Cambria;baseline-shift:sub"
   id="tspan4492-0">2</tspan></tspan></text>
      <text
         id="text4413-1-6"
         y="-574.61078"
         x="3476.8992"
         style="font-style:normal;font-weight:normal;line-height:0%;font-family:sans-serif;letter-spacing:0px;word-spacing:0px;clip-rule:evenodd;fill:#000000;fill-opacity:1;fill-rule:evenodd;stroke:none;stroke-width:1px;stroke-linecap:butt;stroke-linejoin:miter;stroke-opacity:1;image-rendering:optimizeQuality;shape-rendering:geometricPrecision;text-rendering:geometricPrecision"
         xml:space="preserve"><tspan
           style="font-style:italic;font-variant:normal;font-weight:normal;font-stretch:normal;font-size:80px;line-height:1.25;font-family:Cambria;-inkscape-font-specification:'Cambria Italic'"
           y="-574.61078"
           x="3476.8992"
           id="tspan4415-19-3"
           sodipodi:role="line">m<tspan
   id="tspan4852-8"
   style="font-style:normal;font-variant:normal;font-weight:normal;font-stretch:normal;font-size:65%;font-family:Cambria;-inkscape-font-specification:Cambria;baseline-shift:sub">5</tspan></tspan></text>
      <text
         id="text4413-1-6-4"
         y="-630.65527"
         x="3500.8572"
         style="font-style:normal;font-weight:normal;line-height:0%;font-family:sans-serif;letter-spacing:0px;word-spacing:0px;clip-rule:evenodd;fill:#000000;fill-opacity:1;fill-rule:evenodd;stroke:none;stroke-width:1px;stroke-linecap:butt;stroke-linejoin:miter;stroke-opacity:1;image-rendering:optimizeQuality;shape-rendering:geometricPrecision;text-rendering:geometricPrecision"
         xml:space="preserve"><tspan
           style="font-style:normal;font-variant:normal;font-weight:normal;font-stretch:normal;font-size:80px;line-height:1.25;font-family:Cambria;-inkscape-font-specification:Cambria"
           y="-630.65527"
           x="3500.8572"
           id="tspan4415-19-3-0"
           sodipodi:role="line">+</tspan></text>
    </g>
    <text
       xml:space="preserve"
       style="font-style:normal;font-weight:normal;font-size:3.175px;line-height:0%;font-family:sans-serif;letter-spacing:0px;word-spacing:0px;clip-rule:evenodd;fill:#000000;fill-opacity:1;fill-rule:evenodd;stroke:none;stroke-width:0.264583px;stroke-linecap:butt;stroke-linejoin:miter;stroke-opacity:1;image-rendering:optimizeQuality;shape-rendering:geometricPrecision;text-rendering:geometricPrecision"
       x="57.143986"
       y="189.19612"
       id="text4413-1-6-4-3"
       inkscape:export-xdpi="100"
       inkscape:export-ydpi="100"><tspan
         sodipodi:role="line"
         id="tspan4415-19-3-0-8"
         x="57.143986"
         y="189.19612"
         style="font-style:normal;font-variant:normal;font-weight:normal;font-stretch:normal;font-size:21.1667px;line-height:1.25;font-family:Cambria;-inkscape-font-specification:Cambria;stroke-width:0.264583px">+</tspan></text>
    <path
       style="clip-rule:evenodd;fill:none;fill-rule:evenodd;stroke:#373435;stroke-width:2.64583;stroke-linecap:round;stroke-linejoin:round;stroke-miterlimit:4;stroke-dasharray:none;stroke-opacity:1;image-rendering:optimizeQuality;shape-rendering:geometricPrecision;text-rendering:geometricPrecision"
       inkscape:connector-curvature="0"
       id="path4195-4-3-5-2-5"
       d="m 253.4866,165.11538 h 11.76994 v 14.16518 l 11.4518,-28.33036 v 28.33036 l 11.45185,-28.33036 v 28.33036 l 11.13372,-28.33036 v 14.16518 h 11.76994"
       class="fil8 str4"
       inkscape:export-xdpi="100"
       inkscape:export-ydpi="100" />
    <text
       xml:space="preserve"
       style="font-style:normal;font-weight:normal;font-size:3.175px;line-height:0%;font-family:sans-serif;letter-spacing:0px;word-spacing:0px;clip-rule:evenodd;fill:#000000;fill-opacity:1;fill-rule:evenodd;stroke:none;stroke-width:0.264583px;stroke-linecap:butt;stroke-linejoin:miter;stroke-opacity:1;image-rendering:optimizeQuality;shape-rendering:geometricPrecision;text-rendering:geometricPrecision"
       x="273.3345"
       y="143.08705"
       id="text4413-8-8-5-4-1-2"
       inkscape:export-xdpi="100"
       inkscape:export-ydpi="100"><tspan
         sodipodi:role="line"
         id="tspan4415-1-6-3-7-3-1"
         x="273.3345"
         y="143.08705"
         style="font-style:italic;font-variant:normal;font-weight:normal;font-stretch:normal;font-size:21.1667px;line-height:1.25;font-family:Cambria;-inkscape-font-specification:'Cambria Italic';stroke-width:0.264583px">k<tspan
   style="font-style:normal;font-variant:normal;font-weight:normal;font-stretch:normal;font-size:13.7583px;font-family:Cambria;-inkscape-font-specification:Cambria;baseline-shift:sub;stroke-width:0.264583px"
   id="tspan4862-0-9">6</tspan></tspan></text>
    <rect
       style="clip-rule:evenodd;opacity:1;fill:#ff800c;fill-opacity:0.6;fill-rule:evenodd;stroke:#373536;stroke-width:2.64583;stroke-linecap:round;stroke-linejoin:round;stroke-miterlimit:4;stroke-dasharray:none;stroke-opacity:1;image-rendering:optimizeQuality;shape-rendering:geometricPrecision;text-rendering:geometricPrecision"
       id="rect4393-4-9-7-3-8-9"
       width="58.465576"
       height="50.147926"
       x="-194.34818"
       y="312.73209"
       rx="0"
       ry="3.7782679"
       transform="rotate(-90)"
       inkscape:export-xdpi="100"
       inkscape:export-ydpi="100" />
    <text
       xml:space="preserve"
       style="font-style:normal;font-weight:normal;font-size:3.175px;line-height:0%;font-family:sans-serif;letter-spacing:0px;word-spacing:0px;clip-rule:evenodd;fill:#000000;fill-opacity:1;fill-rule:evenodd;stroke:none;stroke-width:0.264583px;stroke-linecap:butt;stroke-linejoin:miter;stroke-opacity:1;image-rendering:optimizeQuality;shape-rendering:geometricPrecision;text-rendering:geometricPrecision"
       x="325.48892"
       y="168.40715"
       id="text4413-0-3-2-8-5-7"
       inkscape:export-xdpi="100"
       inkscape:export-ydpi="100"><tspan
         sodipodi:role="line"
         id="tspan4415-18-5-4-2-0-4"
         x="325.48892"
         y="168.40715"
         style="font-style:italic;font-variant:normal;font-weight:normal;font-stretch:normal;font-size:21.1667px;line-height:1.25;font-family:Cambria;-inkscape-font-specification:'Cambria Italic';stroke-width:0.264583px">m<tspan
   style="font-style:normal;font-variant:normal;font-weight:normal;font-stretch:normal;font-size:13.7583px;font-family:Cambria;-inkscape-font-specification:Cambria;baseline-shift:sub;stroke-width:0.264583px"
   id="tspan4864-1-7">8</tspan></tspan></text>
    <path
       style="clip-rule:evenodd;fill:none;fill-rule:evenodd;stroke:#373435;stroke-width:4.7625;stroke-linecap:round;stroke-linejoin:round;stroke-miterlimit:4;stroke-dasharray:none;stroke-opacity:1;image-rendering:optimizeQuality;shape-rendering:geometricPrecision;text-rendering:geometricPrecision"
       inkscape:connector-curvature="0"
       id="path4195-4-0-8"
       d="m 143.6379,151.19049 h 11.76993 v 14.16519 l 11.4518,-28.33037 v 28.33037 l 11.45186,-28.33037 v 28.33037 l 11.13372,-28.33037 v 14.16518 h 11.76994"
       class="fil8 str4"
       inkscape:export-xdpi="100"
       inkscape:export-ydpi="100" />
    <rect
       style="clip-rule:evenodd;opacity:1;fill:#ff800c;fill-opacity:0.6;fill-rule:evenodd;stroke:#373536;stroke-width:3.20495;stroke-linecap:round;stroke-linejoin:round;stroke-miterlimit:4;stroke-dasharray:none;stroke-opacity:1;image-rendering:optimizeQuality;shape-rendering:geometricPrecision;text-rendering:geometricPrecision"
       id="rect4393-4-7-3"
       width="86.753387"
       height="49.588814"
       x="-194.56718"
       y="93.07383"
       rx="0"
       ry="3.7361429"
       transform="rotate(-90)"
       inkscape:export-xdpi="100"
       inkscape:export-ydpi="100" />
    <text
       xml:space="preserve"
       style="font-style:normal;font-weight:normal;font-size:3.175px;line-height:0%;font-family:sans-serif;letter-spacing:0px;word-spacing:0px;clip-rule:evenodd;fill:#000000;fill-opacity:1;fill-rule:evenodd;stroke:none;stroke-width:0.264583px;stroke-linecap:butt;stroke-linejoin:miter;stroke-opacity:1;image-rendering:optimizeQuality;shape-rendering:geometricPrecision;text-rendering:geometricPrecision"
       x="149.65236"
       y="187.42889"
       id="text4413-8-8-9-7"
       inkscape:export-xdpi="100"
       inkscape:export-ydpi="100"><tspan
         sodipodi:role="line"
         id="tspan4415-1-6-2-5"
         x="149.65236"
         y="187.42889"
         style="font-style:italic;font-variant:normal;font-weight:normal;font-stretch:normal;font-size:21.1667px;line-height:1.25;font-family:Cambria;-inkscape-font-specification:'Cambria Italic';stroke-width:0.264583px">k<tspan
   id="tspan5534"
   style="font-style:normal;font-variant:normal;font-weight:normal;font-stretch:normal;font-size:13.7583px;font-family:Cambria;-inkscape-font-specification:Cambria;baseline-shift:sub;stroke-width:0.264583px">3</tspan></tspan></text>
    <text
       xml:space="preserve"
       style="font-style:normal;font-weight:normal;font-size:3.175px;line-height:0%;font-family:sans-serif;letter-spacing:0px;word-spacing:0px;clip-rule:evenodd;fill:#000000;fill-opacity:1;fill-rule:evenodd;stroke:none;stroke-width:0.264583px;stroke-linecap:butt;stroke-linejoin:miter;stroke-opacity:1;image-rendering:optimizeQuality;shape-rendering:geometricPrecision;text-rendering:geometricPrecision"
       x="178.86659"
       y="187.42889"
       id="text4413-8-6-3-3"
       inkscape:export-xdpi="100"
       inkscape:export-ydpi="100"><tspan
         sodipodi:role="line"
         id="tspan4415-1-5-5-6"
         x="178.86659"
         y="187.42889"
         style="font-style:italic;font-variant:normal;font-weight:normal;font-stretch:normal;font-size:21.1667px;line-height:1.25;font-family:Cambria;-inkscape-font-specification:'Cambria Italic';stroke-width:0.264583px">k<tspan
   id="tspan5536"
   style="font-style:normal;font-variant:normal;font-weight:normal;font-stretch:normal;font-size:13.7583px;font-family:Cambria;-inkscape-font-specification:Cambria;baseline-shift:sub;stroke-width:0.264583px">5</tspan></tspan></text>
    <g
       style="clip-rule:evenodd;fill-rule:evenodd;image-rendering:optimizeQuality;shape-rendering:geometricPrecision;text-rendering:geometricPrecision"
       id="g5331-0"
       transform="matrix(0.26458333,0,0,0.26458333,-814.26029,324.07057)"
       inkscape:export-xdpi="100"
       inkscape:export-ydpi="100">
      <text
         id="text4413-0-2-4"
         y="-710.6369"
         x="3477.0515"
         style="font-style:normal;font-weight:normal;line-height:0%;font-family:sans-serif;letter-spacing:0px;word-spacing:0px;clip-rule:evenodd;fill:#000000;fill-opacity:1;fill-rule:evenodd;stroke:none;stroke-width:1px;stroke-linecap:butt;stroke-linejoin:miter;stroke-opacity:1;image-rendering:optimizeQuality;shape-rendering:geometricPrecision;text-rendering:geometricPrecision"
         xml:space="preserve"><tspan
           style="font-style:italic;font-variant:normal;font-weight:normal;font-stretch:normal;font-size:80px;line-height:1.25;font-family:Cambria;-inkscape-font-specification:'Cambria Italic'"
           y="-710.6369"
           x="3477.0515"
           id="tspan4415-18-4-6"
           sodipodi:role="line">m<tspan
   id="tspan5538"
   style="font-style:normal;font-variant:normal;font-weight:normal;font-stretch:normal;font-size:65%;font-family:Cambria;-inkscape-font-specification:Cambria;baseline-shift:sub">3</tspan></tspan></text>
      <text
         id="text4413-1-6-9"
         y="-574.61078"
         x="3476.8992"
         style="font-style:normal;font-weight:normal;line-height:0%;font-family:sans-serif;letter-spacing:0px;word-spacing:0px;clip-rule:evenodd;fill:#000000;fill-opacity:1;fill-rule:evenodd;stroke:none;stroke-width:1px;stroke-linecap:butt;stroke-linejoin:miter;stroke-opacity:1;image-rendering:optimizeQuality;shape-rendering:geometricPrecision;text-rendering:geometricPrecision"
         xml:space="preserve"><tspan
           style="font-style:italic;font-variant:normal;font-weight:normal;font-stretch:normal;font-size:80px;line-height:1.25;font-family:Cambria;-inkscape-font-specification:'Cambria Italic'"
           y="-574.61078"
           x="3476.8992"
           id="tspan4415-19-3-01"
           sodipodi:role="line">m<tspan
   id="tspan5540"
   style="font-style:normal;font-variant:normal;font-weight:normal;font-stretch:normal;font-size:65%;font-family:Cambria;-inkscape-font-specification:Cambria;baseline-shift:sub">6</tspan></tspan></text>
      <text
         id="text4413-1-6-4-5"
         y="-630.65527"
         x="3500.8572"
         style="font-style:normal;font-weight:normal;line-height:0%;font-family:sans-serif;letter-spacing:0px;word-spacing:0px;clip-rule:evenodd;fill:#000000;fill-opacity:1;fill-rule:evenodd;stroke:none;stroke-width:1px;stroke-linecap:butt;stroke-linejoin:miter;stroke-opacity:1;image-rendering:optimizeQuality;shape-rendering:geometricPrecision;text-rendering:geometricPrecision"
         xml:space="preserve"><tspan
           style="font-style:normal;font-variant:normal;font-weight:normal;font-stretch:normal;font-size:80px;line-height:1.25;font-family:Cambria;-inkscape-font-specification:Cambria"
           y="-630.65527"
           x="3500.8572"
           id="tspan4415-19-3-0-0"
           sodipodi:role="line">+</tspan></text>
    </g>
    <text
       xml:space="preserve"
       style="font-style:normal;font-weight:normal;font-size:3.175px;line-height:0%;font-family:sans-serif;letter-spacing:0px;word-spacing:0px;clip-rule:evenodd;fill:#000000;fill-opacity:1;fill-rule:evenodd;stroke:none;stroke-width:0.264583px;stroke-linecap:butt;stroke-linejoin:miter;stroke-opacity:1;image-rendering:optimizeQuality;shape-rendering:geometricPrecision;text-rendering:geometricPrecision"
       x="166.94176"
       y="188.20197"
       id="text4413-1-6-4-3-8"
       inkscape:export-xdpi="100"
       inkscape:export-ydpi="100"><tspan
         sodipodi:role="line"
         id="tspan4415-19-3-0-8-0"
         x="166.94176"
         y="188.20197"
         style="font-style:normal;font-variant:normal;font-weight:normal;font-stretch:normal;font-size:21.1667px;line-height:1.25;font-family:Cambria;-inkscape-font-specification:Cambria;stroke-width:0.264583px">+</tspan></text>
    <g
       id="g5522"
       transform="matrix(0.26458333,0,0,0.26458333,-920.65129,395.54257)"
       inkscape:export-xdpi="100"
       inkscape:export-ydpi="100"
       style="clip-rule:evenodd;fill-rule:evenodd;image-rendering:optimizeQuality;shape-rendering:geometricPrecision;text-rendering:geometricPrecision">
      <rect
         transform="rotate(-90)"
         ry="14.120855"
         rx="0"
         y="4249.1113"
         x="759.5921"
         height="187.42229"
         width="327.88681"
         id="rect4393-4-7-3-8"
         style="clip-rule:evenodd;opacity:1;fill:#ff800c;fill-opacity:0.6;fill-rule:evenodd;stroke:#373536;stroke-width:12.1132;stroke-linecap:round;stroke-linejoin:round;stroke-miterlimit:4;stroke-dasharray:none;stroke-opacity:1;image-rendering:optimizeQuality;shape-rendering:geometricPrecision;text-rendering:geometricPrecision" />
      <g
         transform="translate(819.81694,-270.13039)"
         id="g5331-0-9"
         style="clip-rule:evenodd;fill-rule:evenodd;image-rendering:optimizeQuality;shape-rendering:geometricPrecision;text-rendering:geometricPrecision">
        <text
           xml:space="preserve"
           style="font-style:normal;font-weight:normal;line-height:0%;font-family:sans-serif;letter-spacing:0px;word-spacing:0px;clip-rule:evenodd;fill:#000000;fill-opacity:1;fill-rule:evenodd;stroke:none;stroke-width:1px;stroke-linecap:butt;stroke-linejoin:miter;stroke-opacity:1;image-rendering:optimizeQuality;shape-rendering:geometricPrecision;text-rendering:geometricPrecision"
           x="3477.0515"
           y="-710.6369"
           id="text4413-0-2-4-0"><tspan
             sodipodi:role="line"
             id="tspan4415-18-4-6-4"
             x="3477.0515"
             y="-710.6369"
             style="font-style:italic;font-variant:normal;font-weight:normal;font-stretch:normal;font-size:80px;line-height:1.25;font-family:Cambria;-inkscape-font-specification:'Cambria Italic'">m<tspan
   style="font-style:normal;font-variant:normal;font-weight:normal;font-stretch:normal;font-size:65%;font-family:Cambria;-inkscape-font-specification:Cambria;baseline-shift:sub"
   id="tspan5542">4</tspan></tspan></text>
        <text
           xml:space="preserve"
           style="font-style:normal;font-weight:normal;line-height:0%;font-family:sans-serif;letter-spacing:0px;word-spacing:0px;clip-rule:evenodd;fill:#000000;fill-opacity:1;fill-rule:evenodd;stroke:none;stroke-width:1px;stroke-linecap:butt;stroke-linejoin:miter;stroke-opacity:1;image-rendering:optimizeQuality;shape-rendering:geometricPrecision;text-rendering:geometricPrecision"
           x="3476.8992"
           y="-574.61078"
           id="text4413-1-6-9-1"><tspan
             sodipodi:role="line"
             id="tspan4415-19-3-01-0"
             x="3476.8992"
             y="-574.61078"
             style="font-style:italic;font-variant:normal;font-weight:normal;font-stretch:normal;font-size:80px;line-height:1.25;font-family:Cambria;-inkscape-font-specification:'Cambria Italic'">m<tspan
   style="font-style:normal;font-variant:normal;font-weight:normal;font-stretch:normal;font-size:65%;font-family:Cambria;-inkscape-font-specification:Cambria;baseline-shift:sub"
   id="tspan5544">7</tspan></tspan></text>
        <text
           xml:space="preserve"
           style="font-style:normal;font-weight:normal;line-height:0%;font-family:sans-serif;letter-spacing:0px;word-spacing:0px;clip-rule:evenodd;fill:#000000;fill-opacity:1;fill-rule:evenodd;stroke:none;stroke-width:1px;stroke-linecap:butt;stroke-linejoin:miter;stroke-opacity:1;image-rendering:optimizeQuality;shape-rendering:geometricPrecision;text-rendering:geometricPrecision"
           x="3500.8572"
           y="-630.65527"
           id="text4413-1-6-4-5-1"><tspan
             sodipodi:role="line"
             id="tspan4415-19-3-0-0-1"
             x="3500.8572"
             y="-630.65527"
             style="font-style:normal;font-variant:normal;font-weight:normal;font-stretch:normal;font-size:80px;line-height:1.25;font-family:Cambria;-inkscape-font-specification:Cambria">+</tspan></text>
      </g>
    </g>
  </g>
</svg>
