<?xml version="1.0" encoding="UTF-8"?>
<!DOCTYPE svg PUBLIC "-//W3C//DTD SVG 1.1//EN" "http://www.w3.org/Graphics/SVG/1.1/DTD/svg11.dtd">
<!-- Creator: CorelDRAW X7 -->
<svg xmlns="http://www.w3.org/2000/svg" xml:space="preserve" width="27.7611mm" height="26.8014mm" version="1.1" style="shape-rendering:geometricPrecision; text-rendering:geometricPrecision; image-rendering:optimizeQuality; fill-rule:evenodd; clip-rule:evenodd"
viewBox="0 0 419 404"
 xmlns:xlink="http://www.w3.org/1999/xlink">
 <defs>
  <style type="text/css">
   <![CDATA[
    .str4 {stroke:#373435;stroke-width:2.6584}
    .str3 {stroke:#373435;stroke-width:1.14901}
    .str1 {stroke:#00AFEF;stroke-width:1.14901}
    .str2 {stroke:#00A859;stroke-width:1.14901}
    .str0 {stroke:#373435;stroke-width:1.14901;stroke-dasharray:11.490072 5.745036}
    .fil3 {fill:none}
    .fil1 {fill:#E6E7E8}
    .fil6 {fill:#8682AB}
    .fil4 {fill:#00AFEF}
    .fil5 {fill:#00A859}
    .fil2 {fill:#BDBFC1;fill-rule:nonzero}
    .fil9 {fill:#373435;fill-rule:nonzero}
    .fil0 {fill:#373435;fill-rule:nonzero}
    .fil8 {fill:#00AFEF;fill-rule:nonzero}
    .fil7 {fill:#00A859;fill-rule:nonzero}
   ]]>
  </style>
 </defs>
 <g id="Layer_x0020_1">
  <metadata id="CorelCorpID_0Corel-Layer"/>
  <path class="fil0" d="M125 358c0,0 -1,0 -1,0 -2,0 -2,-1 -3,-1l-4 -12 6 -7 0 -1c1,-1 3,-2 6,-2 0,0 0,0 0,-1 0,0 0,0 0,0 -1,0 -2,0 -3,0 -2,0 -3,0 -4,0 0,0 -1,0 -1,0 0,1 0,1 1,1 0,0 1,0 1,1 0,0 0,1 -1,1l-5 7 -3 -8 0 0c0,0 0,-1 2,-1 0,0 0,0 0,-1 0,0 0,0 0,0 -1,0 -3,0 -4,0 -2,0 -3,0 -4,0 0,0 -1,0 -1,0 0,1 0,1 1,1 2,0 2,0 2,1l4 10 -8 9c-2,3 -4,3 -5,3 0,0 0,1 0,1 0,0 0,0 0,0 1,0 2,0 3,0 2,0 3,0 4,0 0,0 1,0 1,-1 0,0 -1,0 -1,0 -1,0 -1,-1 -1,-1 0,0 0,-1 0,-1 0,0 0,0 0,0l1 0 7 -9 3 9c0,0 0,1 0,1 0,0 -1,1 -2,1 0,0 -1,0 -1,1 0,0 1,0 1,0 1,0 3,0 4,0 1,0 3,0 4,0 0,0 1,0 1,-1z"/>
  <path class="fil0" d="M108 270c0,0 0,0 -1,0 0,0 -1,0 -2,0 -2,0 -3,0 -4,0 0,0 0,0 0,1 0,0 0,0 0,0 1,0 1,0 1,1 0,1 -1,2 -1,2l-8 10 -3 -11c-1,-1 -1,-1 -1,-1 0,-1 2,-1 3,-1 0,0 0,0 0,-1 0,0 0,0 0,0 -2,0 -3,0 -5,0 -1,0 -2,0 -3,0 -1,0 -1,0 -1,1 0,0 0,0 1,0 2,0 2,0 2,1l4 13c0,0 0,0 0,0 0,0 -1,6 -1,7 -1,2 -1,2 -4,2 0,0 -1,0 -1,1 0,0 1,0 1,0 1,0 3,0 4,0 2,0 3,0 5,0 0,0 0,0 0,0 0,-1 0,-1 -1,-1 -1,0 -2,0 -2,0 0,-1 1,-2 1,-4l1 -4c0,-1 0,-1 0,-1l9 -11c2,-2 3,-3 5,-3 1,0 1,0 1,-1z"/>
  <path class="fil0" d="M20 291c0,-1 -1,-1 -1,-1 0,0 0,0 -1,1 -1,4 -2,8 -9,8l-5 0 19 -23c0,0 0,-1 0,-1 0,0 0,0 -1,0l-14 0c-1,0 -1,0 -1,0l-2 7c0,0 0,1 0,1 0,0 0,0 0,0 1,0 1,0 1,-1 1,-3 3,-6 8,-6l6 0 -20 23c0,0 0,0 0,1 0,0 0,0 1,0l15 0c1,0 1,0 1,-1l2 -8c0,0 1,0 1,0z"/>
  <polygon class="fil1" points="281,132 49,364 176,364 408,132 "/>
  <g>
   <path class="fil2" d="M157 366l-108 0 0 -3 108 0 0 3zm12 -2l-14 7 0 -1 0 0 1 -1 0 0 0 0 0 -1 0 0 0 -1 0 0 0 0 0 -1 0 0 0 0 1 -1 0 0 0 -1 0 0 0 0 -1 -1 0 0 0 -1 0 0 0 0 0 -1 0 0 0 -1 0 0 0 0 0 -1 -1 0 0 0 0 -1 0 0 14 6z"/>
  </g>
  <g>
   <path class="fil2" d="M201 322l-108 0 0 -3 108 0 0 3zm12 -2l-14 6 0 0 0 0 0 -1 1 0 0 0 0 -1 0 0 0 -1 0 0 0 0 0 -1 0 0 0 -1 0 0 0 0 0 -1 0 0 0 -1 0 0 0 0 0 -1 0 0 0 0 0 -1 0 0 0 -1 0 0 0 0 -1 -1 0 0 0 -1 0 0 0 0 14 6z"/>
  </g>
  <g>
   <path class="fil2" d="M245 278l-108 0 0 -3 108 0 0 3zm12 -2l-14 6 0 0 0 0 0 -1 1 0 0 -1 0 0 0 0 0 -1 0 0 0 0 0 -1 0 0 0 -1 0 0 0 0 0 -1 0 0 0 -1 0 0 0 0 0 -1 0 0 0 -1 0 0 0 0 0 -1 0 0 0 0 -1 -1 0 0 0 -1 0 0 0 0 14 6z"/>
  </g>
  <g>
   <path class="fil2" d="M289 233l-108 0 0 -2 108 0 0 2zm12 -1l-14 6 0 0 0 0 0 -1 0 0 1 -1 0 0 0 0 0 -1 0 0 0 -1 0 0 0 0 0 -1 0 0 0 -1 0 0 0 0 0 -1 0 0 0 0 0 -1 0 0 0 -1 0 0 0 0 0 -1 0 0 -1 -1 0 0 0 0 0 -1 0 0 0 0 14 6z"/>
  </g>
  <g>
   <path class="fil2" d="M333 189l-108 0 0 -2 108 0 0 2zm12 -1l-14 6 0 0 0 -1 0 0 0 0 1 -1 0 0 0 -1 0 0 0 0 0 -1 0 0 0 0 0 -1 0 0 0 -1 0 0 0 0 0 -1 0 0 0 -1 0 0 0 0 0 -1 0 0 0 -1 0 0 0 0 -1 -1 0 0 0 0 0 -1 0 0 0 0 14 6z"/>
  </g>
  <g>
   <path class="fil2" d="M377 145l-108 0 0 -2 108 0 0 2zm12 -1l-14 6 0 0 0 -1 0 0 0 0 1 -1 0 0 0 -1 0 0 0 0 0 -1 0 0 0 -1 0 0 0 0 0 -1 0 0 0 -1 0 0 0 0 0 -1 0 0 0 0 0 -1 0 0 0 -1 0 0 0 0 -1 -1 0 0 0 -1 0 0 0 0 0 0 14 6z"/>
  </g>
  <line class="fil3 str0" x1="49" y1="364" x2="281" y2= "132" />
  <line class="fil3 str0" x1="176" y1="364" x2="408" y2= "132" />
  <circle class="fil4 str1" cx="281" cy="132" r="10"/>
  <circle class="fil4 str1" cx="408" cy="132" r="10"/>
  <circle class="fil5 str2" cx="49" cy="364" r="10"/>
  <circle class="fil5 str2" cx="176" cy="364" r="10"/>
  <line class="fil3 str3" x1="291" y1="132" x2="345" y2= "132" />
  <polygon class="fil6 str4" points="79,329 49,364 "/>
  <path class="fil7" d="M100 403c0,-1 -1,-1 -1,-1 -3,0 -3,0 -3,0 0,-1 0,-1 0,-1l7 -26c0,-1 0,-1 0,-1 0,0 0,-1 0,-1 -1,0 -3,2 -3,3 -1,-1 -2,-3 -5,-3 -5,0 -10,8 -10,15 0,4 2,7 5,7 2,0 4,-1 5,-2 -1,3 -1,3 -1,7 -1,2 -1,2 -4,2 -1,0 -1,0 -1,1 0,1 0,1 0,1 2,0 4,0 5,0 2,0 3,0 5,0 0,0 1,0 1,-1zm-4 -14c0,1 -3,5 -6,5 -2,0 -2,-3 -2,-4 0,-3 1,-8 2,-10 1,-3 4,-6 5,-6 1,0 2,0 3,2 0,1 1,2 1,3 0,0 0,0 0,1l-3 9z"/>
  <path id="1" class="fil7" d="M118 404c0,-1 0,-1 0,-1 -2,0 -2,0 -2,0l-3 -8 4 -5 0 0c1,0 2,-1 4,-1 0,0 0,0 0,-1 0,0 0,0 0,0 -1,0 -2,0 -2,0 -1,0 -2,0 -3,0 0,0 0,0 0,0 0,1 0,1 0,1 0,0 1,0 1,0 0,0 0,1 -1,1l-3 4 -2 -4 0 -1c0,0 1,0 1,0 1,0 1,0 1,-1 0,0 0,0 -1,0 0,0 -1,0 -2,0 -1,0 -2,0 -3,0 0,0 0,0 0,0 0,1 0,1 0,1 2,0 2,0 2,0l2 7 -5 6c-1,1 -2,1 -3,1 0,0 0,1 0,1 0,0 0,0 0,0 1,0 1,0 2,0 1,0 2,0 2,0 1,0 1,0 1,0 0,-1 0,-1 0,-1 -1,0 -1,0 -1,0 0,0 0,-1 0,-1 0,0 0,0 0,0l0 0 5 -5 2 5c0,0 0,1 0,1 0,0 -1,0 -2,0 0,0 0,0 0,1 0,0 0,0 0,0 1,0 2,0 3,0 1,0 2,0 3,0 0,0 0,0 0,0z"/>
  <path class="fil8" d="M332 112l0 -2 -2 0c-4,0 -4,-1 -4,-2l0 -27c0,-1 0,-1 -1,-1 -3,3 -8,3 -9,3l0 1c1,0 4,0 6,-1l0 25c0,1 0,2 -4,2l-2 0 0 2c2,-1 6,-1 8,-1 2,0 6,0 8,1z"/>
  <path id="1" class="fil8" d="M349 96c-1,0 -1,0 -2,0 0,0 0,0 -1,0 0,-1 0,-1 0,-2 0,0 0,-1 0,-1 1,0 1,-1 1,-1 1,0 1,1 2,1 0,0 0,1 0,1 0,1 0,1 0,2z"/>
  <path id="2" class="fil8" d="M380 120c0,-1 -1,-1 -1,-1 -3,0 -3,0 -3,0 0,-1 0,-1 1,-1l6 -26c0,-1 0,-1 0,-1 0,-1 0,-1 0,-1 -1,0 -3,2 -3,3 -1,-1 -2,-3 -4,-3 -6,0 -11,8 -11,15 0,4 2,7 5,7 2,0 4,-1 5,-3 0,4 0,4 -1,8 -1,2 -1,2 -4,2 -1,0 -1,0 -1,1 0,1 0,1 0,1 2,0 4,0 5,0 2,0 4,0 5,0 0,0 1,0 1,-1zm-4 -14c0,1 -3,5 -6,5 -2,0 -2,-3 -2,-4 0,-3 1,-8 2,-10 1,-3 4,-6 6,-6 0,0 1,0 2,2 0,1 1,2 1,3 0,0 0,0 0,0l-3 10z"/>
  <path id="3" class="fil8" d="M398 121c0,-1 0,-1 0,-1 -2,0 -2,0 -2,0l-3 -8 4 -5 0 0c1,0 2,-1 4,-2 0,0 0,0 0,0 0,0 0,0 0,0 -1,0 -1,0 -2,0 -1,0 -2,0 -3,0 0,0 0,0 0,0 0,0 0,0 0,0 0,0 1,1 1,1 0,0 0,1 0,1l-4 4 -2 -5 0 0c0,0 1,0 2,-1 0,0 0,0 0,0 0,0 0,0 0,0 -1,0 -2,0 -3,0 -1,0 -2,0 -3,0 0,0 0,0 0,0 0,0 0,0 0,0 2,0 2,1 2,1l2 7 -4 6c-2,1 -3,1 -4,1 0,0 0,1 0,1 0,0 0,0 0,0 1,0 1,0 2,0 1,0 2,0 3,0 0,0 0,0 0,0 0,-1 0,-1 0,-1 -1,0 -1,0 -1,0 0,0 0,-1 0,-1 0,0 0,0 0,0l0 0 5 -5 2 5c0,0 0,1 0,1 0,0 -1,0 -1,0 -1,0 -1,0 -1,1 0,0 0,0 1,0 0,0 1,0 2,0 1,0 2,0 3,0 0,0 0,0 0,0z"/>
  <g>
   <path class="fil9" d="M50 306l0 58 -2 0 0 -58 2 0zm-1 -13l6 15 0 -1 -1 0 0 0 0 0 -1 0 0 0 -1 0 0 -1 0 0 -1 0 0 0 -1 0 0 0 0 0 -1 0 0 0 0 0 -1 0 0 0 -1 0 0 0 0 0 -1 0 0 0 -1 1 0 0 0 0 -1 0 0 0 -1 0 0 0 0 1 0 0 6 -15z"/>
  </g>
  <g>
   <path class="fil7" d="M157 366l-108 0 0 -3 108 0 0 3zm12 -2l-14 7 0 -1 0 0 1 -1 0 0 0 0 0 -1 0 0 0 -1 0 0 0 0 0 -1 0 0 0 0 1 -1 0 0 0 -1 0 0 0 0 -1 -1 0 0 0 -1 0 0 0 0 0 -1 0 0 0 -1 0 0 0 0 0 -1 -1 0 0 0 0 -1 0 0 14 6z"/>
  </g>
  <g>
   <path class="fil9" d="M85 324l-35 41 -2 -1 35 -42 2 2zm7 -11l-4 15 0 0 -1 -1 0 0 0 0 0 -1 0 0 -1 0 0 -1 0 0 0 0 -1 -1 0 0 0 0 0 0 -1 -1 0 0 0 0 -1 0 0 -1 0 0 -1 0 0 0 0 0 -1 -1 0 0 0 0 -1 0 0 0 0 0 -1 -1 0 0 -1 0 0 0 14 -7z"/>
  </g>
  <g>
   <path class="fil8" d="M389 133l-108 0 0 -3 108 0 0 3zm12 -1l-14 6 0 -1 0 0 0 0 1 -1 0 0 0 0 0 -1 0 0 0 -1 0 0 0 0 0 -1 0 0 0 -1 0 0 0 0 0 -1 0 0 0 -1 0 0 0 0 0 -1 0 0 0 0 0 -1 0 0 0 -1 0 0 -1 0 0 -1 0 0 0 -1 0 0 14 7z"/>
  </g>
  <path class="fil9" d="M71 27l0 -2 -1 0 0 2c0,4 -1,6 -3,6 -3,0 -3,-5 -3,-6l0 -13 7 0 0 -1 -7 0 0 -9 -1 0c0,4 -2,9 -7,9l0 1 5 0 0 13c0,6 4,7 6,7 3,0 4,-4 4,-7l0 0z"/>
  <path id="1" class="fil9" d="M92 15c0,-2 -2,-3 -4,-3 -3,0 -5,3 -6,5l0 -5 -6 1 0 1c3,0 3,0 3,3l0 13c0,2 0,2 -3,2l0 1 5 0c2,0 4,0 6,0l0 -1 -1 0c-3,0 -4,-1 -4,-3l0 -7c0,-5 2,-9 6,-9 0,0 1,0 1,0 -1,0 -1,1 -1,2 0,1 1,2 2,2 0,0 2,0 2,-2l0 0z"/>
  <path id="2" class="fil9" d="M116 29l0 -3 -1 0 0 3c0,3 -1,3 -2,3 -1,0 -2,-2 -2,-2l0 -10c0,-2 0,-4 -1,-6 -2,-1 -5,-2 -7,-2 -4,0 -7,2 -7,5 0,2 1,2 2,2 1,0 2,-1 2,-2 0,0 0,-2 -2,-2 1,-2 4,-2 5,-2 2,0 5,2 5,6l0 2c-2,0 -6,0 -9,1 -3,2 -4,5 -4,7 0,4 4,5 7,5 3,0 6,-2 6,-4 1,2 2,4 4,4 1,0 4,-1 4,-5l0 0zm-8 -2c0,4 -3,6 -5,6 -3,0 -5,-2 -5,-4 0,-3 2,-7 10,-7l0 5z"/>
  <path id="3" class="fil9" d="M143 33l0 -1c-3,0 -4,0 -4,-2l0 -9c0,-4 0,-5 -2,-7 0,-1 -2,-2 -5,-2 -3,0 -5,2 -7,5l0 -5 -7 1 0 1c4,0 4,0 4,3l0 13c0,2 0,2 -4,2l0 1 6 0 5 0 0 -1c-3,0 -4,0 -4,-2l0 -9c0,-5 4,-8 7,-8 3,0 3,3 3,5l0 12c0,2 0,2 -3,2l0 1 5 0 6 0z"/>
  <path id="4" class="fil9" d="M161 27c0,-2 -2,-4 -2,-4 -2,-2 -4,-2 -6,-3 -2,0 -6,-1 -6,-4 0,-1 2,-3 6,-3 5,0 5,4 5,5 0,1 1,1 1,1 1,0 1,0 1,-1l0 -5c0,-1 0,-1 -1,-1 0,0 0,0 -1,0 0,1 -1,1 -1,1 -2,-1 -4,-1 -4,-1 -6,0 -8,3 -8,6 0,1 1,3 2,4 2,1 3,1 6,2 2,0 5,1 5,4 0,3 -1,5 -5,5 -4,0 -6,-3 -7,-7 0,-1 0,-1 0,-1 -1,0 -1,0 -1,1l0 7c0,0 0,1 1,1 0,0 0,0 1,-1 0,0 0,0 1,-1 2,2 4,2 5,2 6,0 8,-3 8,-7l0 0z"/>
  <path id="5" class="fil9" d="M175 33l0 -1c-4,0 -4,0 -4,-2l0 -30 -7 1 0 1c3,0 4,0 4,3l0 25c0,2 -1,2 -4,2l0 1 5 0 6 0z"/>
  <path id="6" class="fil9" d="M199 29l0 -3 -1 0 0 3c0,3 -2,3 -2,3 -2,0 -2,-2 -2,-2l0 -10c0,-2 0,-4 -2,-6 -1,-1 -4,-2 -6,-2 -4,0 -7,2 -7,5 0,2 1,2 2,2 1,0 2,-1 2,-2 0,0 0,-2 -2,-2 1,-2 3,-2 5,-2 2,0 5,2 5,6l0 2c-3,0 -6,0 -9,1 -4,2 -5,5 -5,7 0,4 5,5 8,5 3,0 5,-2 6,-4 0,2 2,4 4,4 1,0 4,-1 4,-5l0 0zm-8 -2c0,4 -4,6 -6,6 -2,0 -4,-2 -4,-4 0,-3 2,-7 10,-7l0 5z"/>
  <path id="7" class="fil9" d="M216 27l0 -2 -2 0 0 2c0,4 -1,6 -3,6 -3,0 -3,-5 -3,-6l0 -13 7 0 0 -1 -7 0 0 -9 -1 0c0,4 -2,9 -6,9l0 1 4 0 0 13c0,6 4,7 6,7 3,0 5,-4 5,-7l0 0z"/>
  <path id="8" class="fil9" d="M230 33l0 -1c-3,0 -3,0 -3,-2l0 -18 -7 1 0 1c3,0 4,0 4,3l0 13c0,2 -1,2 -4,2l0 1 5 0c2,0 3,0 5,0zm-3 -29c0,-1 -1,-2 -2,-2 -2,0 -3,1 -3,2 0,2 1,3 3,3 2,0 2,-1 2,-3z"/>
  <path id="9" class="fil9" d="M254 23c0,-6 -5,-11 -10,-11 -6,0 -11,5 -11,11 0,6 5,11 11,11 5,0 10,-5 10,-11zm-4 0c0,1 0,4 -1,6 -1,2 -3,4 -5,4 -3,0 -5,-1 -6,-4 -1,-2 -1,-5 -1,-6 0,-2 0,-5 1,-7 1,-2 4,-3 6,-3 2,0 4,1 5,3 1,2 1,5 1,7z"/>
  <path id="10" class="fil9" d="M281 33l0 -1c-2,0 -4,0 -4,-2l0 -9c0,-4 0,-5 -1,-7 -1,-1 -2,-2 -5,-2 -4,0 -6,2 -7,5l0 -5 -7 1 0 1c3,0 4,0 4,3l0 13c0,2 -1,2 -4,2l0 1 5 0 6 0 0 -1c-3,0 -4,0 -4,-2l0 -9c0,-5 3,-8 7,-8 3,0 3,3 3,5l0 12c0,2 0,2 -4,2l0 1 6 0 5 0z"/>
  <path id="11" class="fil9" d="M310 33l0 -1c-3,0 -3,0 -3,-2l0 -18 -7 1 0 1c3,0 3,0 3,3l0 13c0,2 0,2 -3,2l0 1 5 0c2,0 3,0 5,0zm-3 -29c0,-1 -1,-2 -2,-2 -2,0 -3,1 -3,2 0,2 1,3 3,3 1,0 2,-1 2,-3z"/>
  <path id="12" class="fil9" d="M337 33l0 -1c-2,0 -4,0 -4,-2l0 -9c0,-4 0,-5 -1,-7 -1,-1 -2,-2 -5,-2 -4,0 -6,2 -7,5l0 -5 -7 1 0 1c3,0 4,0 4,3l0 13c0,2 -1,2 -4,2l0 1 5 0 6 0 0 -1c-4,0 -4,0 -4,-2l0 -9c0,-5 3,-8 6,-8 3,0 4,3 4,5l0 12c0,2 -1,2 -4,2l0 1 6 0 5 0z"/>
  <path id="13" class="fil9" d="M112 77c0,0 0,0 -1,0 -3,0 -3,-1 -3,-2l-6 -15 8 -9 1 -1c1,-1 2,-3 6,-3 1,0 1,0 1,-1 0,-1 0,-1 -1,-1 -1,0 -2,0 -4,0 -1,0 -3,0 -5,0 0,0 -1,0 -1,1 0,1 1,1 1,1 0,0 2,0 2,1 0,1 0,1 -1,2l-7 8 -4 -9 0 -1c0,0 1,-1 3,-1 0,0 0,0 0,-1 0,-1 0,-1 0,-1 -2,0 -4,0 -6,0 -1,0 -3,0 -5,0 0,0 -1,0 -1,1 0,1 1,1 2,1 2,0 2,0 3,1l5 14 -10 11c-3,3 -6,3 -7,4 -1,0 -1,0 -1,0 0,1 0,1 1,1 1,0 2,0 4,0 1,0 3,0 5,0 0,0 1,0 1,-1 0,0 -1,0 -1,0 -1,-1 -2,-1 -2,-2 0,0 0,-1 1,-1 0,0 0,0 0,0l0 0 9 -11 4 12c0,0 1,0 1,0 0,1 -1,1 -3,2 -1,0 -1,0 -1,0 0,1 1,1 1,1 2,0 3,0 5,0 2,0 4,0 5,0 1,0 1,0 1,-1z"/>
  <path id="14" class="fil9" d="M130 68c0,0 0,-1 0,-1 0,-1 0,-1 -1,-1l-9 0c-1,0 -1,0 -1,1 0,0 -1,1 -1,1 0,1 1,1 2,1l9 0c1,0 1,0 1,-1z"/>
  <path id="15" class="fil9" d="M157 78l0 -1c-4,0 -4,-1 -4,-3l0 -29 -7 0 0 2c3,0 4,0 4,2l0 11c-2,-2 -4,-3 -6,-3 -6,0 -11,5 -11,11 0,6 5,11 10,11 3,0 5,-2 6,-4l0 4 8 -1zm-8 -6c0,1 0,1 0,2 -1,2 -4,3 -6,3 -2,0 -4,-1 -5,-3 -1,-2 -1,-4 -1,-6 0,-2 0,-5 1,-7 1,-2 3,-3 6,-3 1,0 3,1 5,3 0,1 0,1 0,2l0 9z"/>
  <path id="16" class="fil9" d="M170 78l0 -1c-3,0 -4,-1 -4,-3l0 -17 -6 0 0 2c3,0 3,0 3,2l0 13c0,3 0,3 -3,3l0 1 5 0c1,0 3,0 5,0zm-3 -29c0,-1 -1,-2 -2,-2 -2,0 -3,1 -3,2 0,1 1,3 3,3 1,0 2,-2 2,-3z"/>
  <path id="17" class="fil9" d="M189 60c0,-2 -2,-3 -4,-3 -3,0 -5,3 -6,5l0 -5 -6 0 0 2c3,0 3,0 3,3l0 12c0,3 0,3 -3,3l0 1 5 0c2,0 4,0 6,0l0 -1 -1 0c-3,0 -4,-1 -4,-3l0 -7c0,-5 2,-9 6,-9 0,0 1,0 1,0 -1,0 -1,1 -1,2 0,1 1,2 2,2 0,0 2,-1 2,-2l0 0z"/>
  <path id="18" class="fil9" d="M210 72c0,0 -1,0 -1,0 0,0 0,0 0,0 -2,5 -6,5 -7,5 -2,0 -4,-1 -5,-3 -2,-2 -2,-5 -2,-7l14 0c1,0 1,0 1,-1 0,-5 -3,-9 -9,-9 -5,0 -10,4 -10,10 0,7 5,12 11,12 6,0 8,-6 8,-7zm-3 -6l-12 0c1,-7 5,-8 6,-8 5,0 6,6 6,8z"/>
  <path id="19" class="fil9" d="M231 72c0,0 0,0 0,0 -1,0 -1,0 -1,0 -2,5 -5,5 -6,5 -3,0 -7,-2 -7,-9 0,-8 4,-10 6,-10 1,0 4,0 5,2 -2,0 -2,1 -2,2 0,1 1,2 2,2 2,0 3,-1 3,-2 0,-4 -4,-5 -8,-5 -6,0 -10,5 -10,11 0,6 5,11 10,11 7,0 8,-6 8,-7z"/>
  <path id="20" class="fil9" d="M248 72l0 -3 -1 0 0 3c0,4 -1,5 -3,5 -3,0 -3,-4 -3,-5l0 -13 7 0 0 -2 -7 0 0 -8 -1 0c0,3 -2,9 -7,9l0 1 4 0 0 13c0,6 5,7 7,7 3,0 4,-4 4,-7l0 0z"/>
  <path id="21" class="fil9" d="M263 78l0 -1c-3,0 -3,-1 -3,-3l0 -17 -7 0 0 2c3,0 3,0 3,2l0 13c0,3 0,3 -3,3l0 1 5 0c2,0 3,0 5,0zm-3 -29c0,-1 -1,-2 -2,-2 -2,0 -3,1 -3,2 0,1 1,3 3,3 1,0 2,-2 2,-3z"/>
  <path id="22" class="fil9" d="M287 68c0,-6 -5,-11 -11,-11 -6,0 -10,5 -10,11 0,6 5,11 10,11 6,0 11,-5 11,-11zm-4 -1c0,2 0,5 -1,7 -1,2 -3,3 -6,3 -2,0 -4,-1 -5,-3 -1,-2 -1,-5 -1,-7 0,-1 0,-4 1,-6 1,-2 3,-3 5,-3 2,0 5,1 6,3 1,2 1,5 1,6z"/>
  <path id="23" class="fil9" d="M314 78l0 -1c-2,0 -4,0 -4,-2l0 -9c0,-4 0,-6 -1,-7 -1,-1 -2,-2 -5,-2 -4,0 -6,2 -7,5l0 -5 -7 0 0 2c3,0 4,0 4,3l0 12c0,3 -1,3 -4,3l0 1 5 0 6 0 0 -1c-4,0 -4,0 -4,-3l0 -8c0,-5 3,-8 6,-8 3,0 4,2 4,5l0 11c0,3 -1,3 -4,3l0 1 6 0 5 0z"/>
  <path class="fil0" d="M131 351c0,0 -1,0 -1,0 -2,0 -2,-1 -3,-1l-4 -12 6 -7 0 -1c1,-1 3,-2 5,-2 1,0 1,0 1,-1 0,0 0,-1 0,-1 -1,0 -2,1 -3,1 -2,0 -3,-1 -4,-1 -1,0 -1,0 -1,1 0,1 0,1 0,1 1,0 2,0 2,1 0,0 0,0 -1,1l-5 7 -3 -8 0 0c0,-1 0,-1 2,-1 0,0 0,0 0,-1 0,0 0,-1 0,-1 -2,0 -3,1 -5,1 -1,0 -2,-1 -3,-1 -1,0 -1,0 -1,1 0,1 0,1 1,1 2,0 2,0 2,1l4 10 -8 9c-2,3 -4,3 -5,3 -1,0 -1,0 -1,0 0,1 1,1 1,1 1,0 2,0 3,0 1,0 3,0 4,0 0,0 1,0 1,-1 0,0 -1,0 -1,0 -1,0 -1,-1 -1,-1 0,-1 0,-1 0,-1 0,0 0,0 0,0l0 -1 8 -8 3 9c0,0 0,1 0,1 0,0 -1,1 -2,1 0,0 -1,0 -1,0 0,1 1,1 1,1 1,0 3,0 4,0 1,0 3,0 4,0 0,0 1,0 1,-1z"/>
 </g>
</svg>
