<?xml version="1.0" encoding="UTF-8"?>
<!DOCTYPE svg PUBLIC "-//W3C//DTD SVG 1.0//EN" "http://www.w3.org/TR/2001/REC-SVG-20010904/DTD/svg10.dtd">
<!-- Creator: CorelDRAW X7 -->
<svg xmlns="http://www.w3.org/2000/svg" xml:space="preserve" width="100%" height="100%" version="1.0" style="shape-rendering:geometricPrecision; text-rendering:geometricPrecision; image-rendering:optimizeQuality; fill-rule:evenodd; clip-rule:evenodd"
viewBox="0 0 5220 3020"
 xmlns:xlink="http://www.w3.org/1999/xlink">
 <defs>
  <style type="text/css">
   <![CDATA[
    .str2 {stroke:#373435;stroke-width:20}
    .str0 {stroke:#373435;stroke-width:10}
    .str3 {stroke:black;stroke-width:2.54}
    .str1 {stroke:#373435;stroke-width:10;stroke-linecap:round;stroke-linejoin:round}
    .fil3 {fill:none}
    .fil0 {fill:#F1F1F2}
    .fil1 {fill:#E1EECD}
    .fil4 {fill:#373435;fill-rule:nonzero}
    .fil2 {fill:url(#id6)}
   ]]>
  </style>
      <clipPath id="id0">
       <path d="M422 709l0 820 -198 0 0 -820 198 0z"/>
      </clipPath>
      <clipPath id="id1">
       <path d="M422 709l0 820 -198 0 0 -820 198 0z"/>
      </clipPath>
      <clipPath id="id2">
       <path d="M422 709l0 820 -198 0 0 -820 198 0z"/>
      </clipPath>
      <clipPath id="id3">
       <path d="M422 1809l0 820 -198 0 0 -820 198 0z"/>
      </clipPath>
      <clipPath id="id4">
       <path d="M422 1809l0 820 -198 0 0 -820 198 0z"/>
      </clipPath>
      <clipPath id="id5">
       <path d="M422 1809l0 820 -198 0 0 -820 198 0z"/>
      </clipPath>
  <linearGradient id="id6" gradientUnits="objectBoundingBox" x1="49.9999%" y1="0%" x2="49.9999%" y2="99.9996%">
   <stop offset="0" style="stop-opacity:1; stop-color:#F1F1F2"/>
   <stop offset="0.701961" style="stop-opacity:1; stop-color:#E9F0E0"/>
   <stop offset="1" style="stop-opacity:1; stop-color:#E1EECD"/>
  </linearGradient>
 </defs>
 <g id="Layer_x0020_1">
  <metadata id="CorelCorpID_0Corel-Layer"/>
  <g id="_1613439683872">
   <g>
    <rect class="fil0 str0" x="922" y="810" width="600" height="600" rx="83" ry="120"/>
    <rect class="fil1 str0" x="922" y="1910" width="600" height="600" rx="83" ry="120"/>
    <rect class="fil2 str0" x="4222" y="810" width="600" height="1700" rx="83" ry="340"/>
    <rect class="fil2 str0" x="3122" y="810" width="600" height="1700" rx="83" ry="340"/>
    <rect class="fil0 str0" x="2022" y="810" width="600" height="600" rx="83" ry="120"/>
    <rect class="fil1 str0" x="2022" y="1910" width="600" height="600" rx="83" ry="120"/>
    <path class="fil3 str1" d="M922 1110l-151 0 0 -85 -66 170 0 -170 -66 170 0 -170 -66 170 0 -85 -151 0"/>
    <path class="fil3 str1" d="M922 2210l-151 0 0 -85 -66 170 0 -170 -66 170 0 -170 -66 170 0 -85 -151 0"/>
    <path class="fil3 str1" d="M4222 1110l-151 0 0 -85 -66 170 0 -170 -66 170 0 -170 -66 170 0 -85 -151 0"/>
    <path class="fil3 str1" d="M4222 2210l-151 0 0 -85 -66 170 0 -170 -66 170 0 -170 -66 170 0 -85 -151 0"/>
    <path class="fil3 str1" d="M3122 1110l-151 0 0 -85 -66 170 0 -170 -66 170 0 -170 -66 170 0 -85 -151 0"/>
    <path class="fil3 str1" d="M3122 2210l-151 0 0 -85 -66 170 0 -170 -66 170 0 -170 -66 170 0 -85 -151 0"/>
    <path class="fil3 str1" d="M2022 1110l-151 0 0 -85 -66 170 0 -170 -66 170 0 -170 -66 170 0 -85 -151 0"/>
    <path class="fil3 str1" d="M2022 2210l-151 0 0 -85 -66 170 0 -170 -66 170 0 -170 -66 170 0 -85 -151 0"/>
    <path class="fil3 str2" d="M422 712l0 819"/>
    <path class="fil3 str2" d="M422 1812l0 819"/>
    <g>
     <g style="clip-path:url(#id0)">
     </g>
     <g style="clip-path:url(#id1)">
      <path class="fil3 str3" d="M-274 1225l674 -674"/>
      <path id="1" class="fil3 str3" d="M-184 1315l674 -674"/>
      <path id="2" class="fil3 str3" d="M-94 1405l674 -674"/>
      <path id="3" class="fil3 str3" d="M-4 1495l674 -674"/>
      <path id="4" class="fil3 str3" d="M86 1585l674 -674"/>
      <path id="5" class="fil3 str3" d="M175 1675l674 -675"/>
      <path id="6" class="fil3 str3" d="M265 1764l674 -674"/>
      <path id="7" class="fil3 str3" d="M355 1854l674 -674"/>
     </g>
     <g style="clip-path:url(#id2)">
     </g>
    </g>
    <g>
     <g style="clip-path:url(#id3)">
     </g>
     <g style="clip-path:url(#id4)">
      <path class="fil3 str3" d="M-251 2337l651 -652"/>
      <path id="1" class="fil3 str3" d="M-161 2427l651 -652"/>
      <path id="2" class="fil3 str3" d="M-72 2516l652 -651"/>
      <path id="3" class="fil3 str3" d="M18 2606l652 -651"/>
      <path id="4" class="fil3 str3" d="M108 2696l652 -652"/>
      <path id="5" class="fil3 str3" d="M198 2786l651 -652"/>
      <path id="6" class="fil3 str3" d="M288 2876l651 -652"/>
      <path id="7" class="fil3 str3" d="M377 2965l652 -651"/>
     </g>
     <g style="clip-path:url(#id5)">
     </g>
    </g>
    <path class="fil4" d="M573 901c0,3 3,7 8,7 9,0 11,-8 11,-10l15 -57c10,1 28,7 28,23 0,2 0,3 -1,7 -1,5 -1,7 -1,10 0,20 13,27 24,27 12,0 19,-9 22,-14 6,-11 10,-28 10,-29 0,-3 -2,-3 -4,-3 -4,0 -4,0 -6,7 -3,14 -9,33 -21,33 -8,0 -8,-6 -8,-12 0,-6 2,-14 2,-16 1,-6 1,-6 1,-10 0,-19 -20,-26 -37,-29 6,-4 12,-10 20,-19 14,-16 25,-29 40,-29 5,0 7,3 7,3 -12,2 -13,12 -13,14 0,4 2,9 10,9 6,0 14,-5 14,-16 0,-7 -5,-16 -18,-16 -15,0 -27,11 -37,23 -16,18 -20,23 -30,28l29 -116c0,0 1,-3 1,-3 0,-3 -2,-4 -4,-4 -1,0 -4,1 -5,1l-28 2c-3,1 -6,1 -6,6 0,3 2,3 6,3 14,0 15,2 15,5 0,1 -1,5 -1,5l-42 166c0,1 -1,3 -1,4z"/>
    <path id="1" class="fil4" d="M701 823c4,0 17,0 28,-6l0 110c0,7 -1,10 -20,10l-7 0 0 6c8,0 26,0 34,0 9,0 27,0 35,0l0 -6 -7 0c-19,0 -20,-3 -20,-10l0 -119c0,-5 0,-6 -5,-6 -13,14 -31,14 -38,14l0 7z"/>
    <path class="fil4" d="M1114 654c0,2 3,2 4,2 4,0 4,0 5,-4 2,-9 10,-36 26,-36 3,0 7,1 7,8 0,7 -3,15 -7,26 -8,20 -15,41 -15,55 0,25 16,33 32,33 15,0 24,-9 31,-17 5,15 17,17 23,17 10,0 16,-7 20,-16 5,-11 9,-27 9,-28 0,-2 -3,-2 -5,-2 -3,0 -3,0 -5,6 -4,16 -9,34 -19,34 -7,0 -7,-8 -7,-12 0,-2 0,-6 2,-14l20 -82c1,-1 1,-3 1,-3 0,-4 -2,-8 -8,-8 -8,0 -10,8 -11,11l-21 82c-1,5 -1,6 -3,9 -6,8 -14,17 -26,17 -13,0 -16,-13 -16,-22 0,-17 10,-43 17,-62 2,-6 3,-10 3,-15 0,-14 -9,-23 -21,-23 -26,0 -36,42 -36,44z"/>
    <path id="1" class="fil4" d="M1260 652c5,0 17,0 28,-5l0 109c0,8 0,10 -19,10l-7 0 0 7c7,-1 26,-1 34,-1 8,0 27,0 34,1l0 -7 -6 0c-20,0 -20,-2 -20,-10l0 -119c0,-5 0,-5 -5,-5 -13,13 -32,13 -39,13l0 7z"/>
    <path class="fil4" d="M2211 654c0,2 2,2 4,2 4,0 4,0 5,-4 2,-9 10,-36 26,-36 3,0 6,1 6,8 0,7 -2,15 -6,26 -8,20 -15,41 -15,55 0,25 16,33 32,33 14,0 24,-9 31,-17 5,15 17,17 22,17 11,0 17,-7 21,-16 5,-11 9,-27 9,-28 0,-2 -3,-2 -5,-2 -3,0 -3,0 -5,6 -4,16 -9,34 -19,34 -7,0 -7,-8 -7,-12 0,-2 0,-6 2,-14l20 -82c1,-1 1,-3 1,-3 0,-4 -2,-8 -8,-8 -9,0 -11,8 -11,11l-21 82c-1,5 -1,6 -4,9 -5,8 -13,17 -26,17 -12,0 -15,-13 -15,-22 0,-17 9,-43 17,-62 2,-6 3,-10 3,-15 0,-14 -9,-23 -21,-23 -27,0 -36,42 -36,44z"/>
    <path id="1" class="fil4" d="M2349 773l79 0 5 -37 -5 0c-1,6 -2,16 -4,19 -2,2 -16,2 -21,2l-38 0 23 -22c33,-29 45,-41 45,-62 0,-24 -19,-41 -44,-41 -24,0 -40,19 -40,38 0,12 11,12 11,12 4,0 11,-2 11,-11 0,-6 -4,-11 -11,-11 -2,0 -2,0 -3,0 5,-14 17,-21 29,-21 19,0 28,17 28,34 0,17 -10,34 -22,47l-41 45c-2,2 -2,3 -2,8z"/>
    <path class="fil4" d="M3310 654c0,2 3,2 4,2 4,0 4,0 5,-4 2,-9 10,-36 26,-36 3,0 7,1 7,8 0,7 -3,15 -7,26 -8,20 -15,41 -15,55 0,25 16,33 32,33 15,0 24,-9 31,-17 5,15 17,17 23,17 10,0 16,-7 20,-16 5,-11 9,-27 9,-28 0,-2 -3,-2 -5,-2 -3,0 -3,0 -5,6 -4,16 -9,34 -19,34 -7,0 -7,-8 -7,-12 0,-2 0,-6 2,-14l20 -82c1,-1 1,-3 1,-3 0,-4 -2,-8 -8,-8 -8,0 -10,8 -11,11l-21 82c-1,5 -1,6 -4,9 -5,8 -13,17 -25,17 -13,0 -16,-13 -16,-22 0,-17 10,-43 17,-62 2,-6 3,-10 3,-15 0,-14 -9,-23 -21,-23 -26,0 -36,42 -36,44z"/>
    <path id="1" class="fil4" d="M3446 744c0,20 20,34 43,34 26,0 45,-20 45,-41 0,-18 -13,-34 -35,-39 17,-5 30,-20 30,-37 0,-17 -19,-29 -39,-29 -22,0 -38,13 -38,29 0,7 5,11 11,11 7,0 11,-5 11,-11 0,-11 -10,-11 -13,-11 6,-10 20,-13 28,-13 9,0 20,5 20,24 0,2 0,15 -6,24 -6,10 -13,11 -19,11 -1,0 -6,1 -8,1 -2,0 -3,0 -3,2 0,3 1,3 5,3l9 0c18,0 26,14 26,35 0,29 -15,35 -24,35 -9,0 -25,-4 -33,-16 8,1 14,-4 14,-12 0,-8 -6,-12 -12,-12 -5,0 -12,3 -12,12z"/>
    <path class="fil4" d="M4408 654c0,2 3,2 5,2 3,0 3,0 5,-4 2,-9 9,-36 26,-36 3,0 6,1 6,8 0,7 -3,15 -7,26 -7,20 -14,41 -14,55 0,25 16,33 31,33 15,0 25,-9 32,-17 5,15 17,17 22,17 11,0 16,-7 21,-16 5,-11 8,-27 8,-28 0,-2 -2,-2 -4,-2 -3,0 -4,0 -5,6 -4,16 -10,34 -19,34 -8,0 -8,-8 -8,-12 0,-2 0,-6 2,-14l21 -82c0,-1 0,-3 0,-3 0,-4 -2,-8 -7,-8 -9,0 -11,8 -11,11l-21 82c-1,5 -1,6 -4,9 -5,8 -14,17 -26,17 -13,0 -15,-13 -15,-22 0,-17 9,-43 16,-62 2,-6 4,-10 4,-15 0,-14 -9,-23 -22,-23 -26,0 -36,42 -36,44z"/>
    <path id="1" class="fil4" d="M4542 738l56 0 0 18c0,8 0,10 -16,10l-4 0 0 7c8,-1 19,-1 28,-1 9,0 20,0 29,1l0 -7 -4 0c-16,0 -16,-2 -16,-10l0 -18 21 0 0 -7 -21 0 0 -96c0,-4 0,-5 -4,-5 -2,0 -2,0 -4,2l-65 99 0 7zm6 -7l52 -79 0 79 -52 0z"/>
    <path class="fil4" d="M473 1935c0,22 3,56 18,88 17,34 41,53 44,53 2,0 3,-1 3,-3 0,-1 0,-1 -5,-6 -35,-36 -44,-89 -44,-132 0,-49 11,-98 45,-134 4,-3 4,-4 4,-5 0,-2 -1,-2 -3,-2 -3,0 -28,19 -45,55 -14,31 -17,62 -17,86z"/>
    <path id="1" class="fil4" d="M806 2073c0,2 1,3 3,3 3,0 28,-19 45,-55 14,-31 17,-63 17,-86 0,-22 -3,-56 -18,-88 -17,-35 -41,-53 -44,-53 -2,0 -3,1 -3,2 0,1 0,2 5,7 28,28 44,73 44,132 0,48 -10,98 -45,133 -4,4 -4,4 -4,5z"/>
    <path id="2" class="fil4" d="M575 2001c0,3 3,7 8,7 9,0 11,-8 11,-10l15 -57c10,1 28,7 28,23 0,2 0,3 -1,7 -1,5 -1,7 -1,10 0,20 13,27 24,27 12,0 19,-9 22,-14 6,-11 10,-28 10,-29 0,-3 -2,-3 -4,-3 -4,0 -4,0 -6,7 -3,14 -9,33 -21,33 -8,0 -8,-6 -8,-12 0,-6 2,-14 2,-16 1,-6 1,-6 1,-10 0,-19 -20,-26 -37,-29 6,-4 12,-10 20,-19 14,-16 25,-29 40,-29 5,0 7,3 7,3 -12,2 -13,12 -13,14 0,4 2,9 10,9 6,0 14,-5 14,-16 0,-7 -5,-16 -18,-16 -15,0 -27,11 -37,23 -16,18 -20,23 -30,28l29 -116c0,0 1,-3 1,-3 0,-3 -2,-4 -4,-4 -1,0 -4,1 -5,1l-28 2c-3,1 -6,1 -6,6 0,3 2,3 6,3 14,0 15,2 15,5 0,1 -1,5 -1,5l-42 166c0,1 -1,3 -1,4z"/>
    <path id="3" class="fil4" d="M695 2009c0,18 14,39 38,39 24,0 46,-20 46,-47 0,-25 -17,-47 -40,-47 -10,0 -19,4 -27,11l0 -41c4,1 11,3 18,3 26,0 41,-20 41,-22 0,-2 -1,-3 -2,-3 -1,0 -1,0 -2,1 -4,2 -15,6 -29,6 -8,0 -18,-1 -28,-6 -2,0 -2,0 -2,0 -3,0 -3,1 -3,5l0 62c0,4 0,6 3,6 2,0 2,-1 3,-2 2,-3 10,-15 27,-15 11,0 17,10 18,14 4,8 4,16 4,26 0,8 0,20 -5,29 -5,9 -13,14 -22,14 -16,0 -28,-11 -32,-24 1,1 2,1 4,1 7,0 11,-5 11,-11 0,-5 -4,-10 -11,-10 -3,0 -10,2 -10,11z"/>
    <path class="fil4" d="M1573 1935c0,22 3,56 18,88 17,34 41,53 44,53 2,0 3,-1 3,-3 0,-1 0,-1 -5,-6 -35,-36 -44,-89 -44,-132 0,-49 11,-98 45,-134 4,-3 4,-4 4,-5 0,-2 -1,-2 -3,-2 -3,0 -28,19 -45,55 -14,31 -17,62 -17,86z"/>
    <path id="1" class="fil4" d="M1906 2073c0,2 1,3 3,3 3,0 28,-19 45,-55 14,-31 17,-63 17,-86 0,-22 -3,-56 -18,-88 -17,-35 -41,-53 -44,-53 -2,0 -3,1 -3,2 0,1 0,2 5,7 28,28 44,73 44,132 0,48 -10,98 -45,133 -4,4 -4,4 -4,5z"/>
    <path id="2" class="fil4" d="M1675 2001c0,3 3,7 8,7 9,0 11,-8 11,-10l15 -57c10,1 28,7 28,23 0,2 0,3 -1,7 -1,5 -1,7 -1,10 0,20 13,27 24,27 12,0 19,-9 22,-14 6,-11 10,-28 10,-29 0,-3 -2,-3 -4,-3 -4,0 -4,0 -6,7 -3,14 -9,33 -21,33 -8,0 -8,-6 -8,-12 0,-6 2,-14 2,-16 1,-6 1,-6 1,-10 0,-19 -20,-26 -37,-29 6,-4 12,-10 20,-19 14,-16 25,-29 40,-29 5,0 7,3 7,3 -12,2 -13,12 -13,14 0,4 2,9 10,9 6,0 14,-5 14,-16 0,-7 -5,-16 -18,-16 -15,0 -27,11 -37,23 -16,18 -20,23 -30,28l29 -116c0,0 1,-3 1,-3 0,-3 -2,-4 -4,-4 -1,0 -4,1 -5,1l-28 2c-3,1 -6,1 -6,6 0,3 2,3 6,3 14,0 15,2 15,5 0,1 -1,5 -1,5l-42 166c0,1 -1,3 -1,4z"/>
    <path id="3" class="fil4" d="M1793 1976c0,57 24,72 44,72 24,0 44,-20 44,-48 0,-27 -19,-47 -43,-47 -14,0 -22,11 -26,21l0 -5c0,-54 26,-61 37,-61 5,0 14,1 19,8 -4,0 -12,0 -12,10 0,6 5,9 10,9 3,0 9,-1 9,-10 0,-12 -9,-23 -26,-23 -27,0 -56,28 -56,74zm19 20c0,-17 7,-38 26,-38 4,0 13,0 20,13 4,8 4,19 4,29 0,10 0,21 -4,28 -6,13 -16,14 -21,14 -13,0 -20,-13 -21,-16 -4,-10 -4,-27 -4,-30z"/>
    <path class="fil4" d="M2673 1935c0,22 3,56 18,88 17,34 41,53 44,53 2,0 3,-1 3,-3 0,-1 0,-1 -5,-6 -35,-36 -44,-89 -44,-132 0,-49 11,-98 45,-134 4,-3 4,-4 4,-5 0,-2 -1,-2 -3,-2 -3,0 -28,19 -45,55 -14,31 -17,62 -17,86z"/>
    <path id="1" class="fil4" d="M3006 2073c0,2 1,3 3,3 3,0 28,-19 45,-55 14,-31 17,-63 17,-86 0,-22 -3,-56 -18,-88 -17,-35 -41,-53 -44,-53 -2,0 -3,1 -3,2 0,1 0,2 5,7 28,28 44,73 44,132 0,48 -10,98 -45,133 -4,4 -4,4 -4,5z"/>
    <path id="2" class="fil4" d="M2775 2001c0,3 3,7 8,7 9,0 11,-8 11,-10l15 -57c10,1 28,7 28,23 0,2 0,3 -1,7 -1,5 -1,7 -1,10 0,20 13,27 24,27 12,0 19,-9 22,-14 6,-11 10,-28 10,-29 0,-3 -2,-3 -4,-3 -4,0 -4,0 -6,7 -3,14 -9,33 -21,33 -8,0 -8,-6 -8,-12 0,-6 2,-14 2,-16 1,-6 1,-6 1,-10 0,-19 -20,-26 -37,-29 6,-4 12,-10 20,-19 14,-16 25,-29 40,-29 5,0 7,3 7,3 -12,2 -13,12 -13,14 0,4 2,9 10,9 6,0 14,-5 14,-16 0,-7 -5,-16 -18,-16 -15,0 -27,11 -37,23 -16,18 -20,23 -30,28l29 -116c0,0 1,-3 1,-3 0,-3 -2,-4 -4,-4 -1,0 -4,1 -5,1l-28 2c-3,1 -6,1 -6,6 0,3 2,3 6,3 14,0 15,2 15,5 0,1 -1,5 -1,5l-42 166c0,1 -1,3 -1,4z"/>
    <path id="3" class="fil4" d="M2896 1944l5 0c1,-3 3,-17 5,-19 2,-2 18,-2 21,-2l44 0c-2,4 -19,27 -24,34 -19,28 -26,58 -26,79 0,3 0,12 10,12 10,0 10,-9 10,-12l0 -10c0,-12 0,-24 2,-35 1,-5 4,-23 13,-36l29 -41c2,-2 2,-2 2,-7l-52 0c-26,0 -26,-3 -27,-7l-5 0 -7 44z"/>
    <path class="fil4" d="M3773 1935c0,22 3,56 18,88 17,34 41,53 44,53 2,0 3,-1 3,-3 0,-1 0,-1 -5,-6 -35,-36 -44,-89 -44,-132 0,-49 11,-98 45,-134 4,-3 4,-4 4,-5 0,-2 -1,-2 -3,-2 -3,0 -28,19 -45,55 -14,31 -17,62 -17,86z"/>
    <path id="1" class="fil4" d="M4106 2073c0,2 1,3 3,3 3,0 28,-19 45,-55 14,-31 17,-63 17,-86 0,-22 -3,-56 -18,-88 -17,-35 -41,-53 -44,-53 -2,0 -3,1 -3,2 0,1 0,2 5,7 28,28 44,73 44,132 0,48 -10,98 -45,133 -4,4 -4,4 -4,5z"/>
    <path id="2" class="fil4" d="M3875 2001c0,3 3,7 8,7 9,0 11,-8 11,-10l15 -57c10,1 28,7 28,23 0,2 0,3 -1,7 -1,5 -1,7 -1,10 0,20 13,27 24,27 12,0 19,-9 22,-14 6,-11 10,-28 10,-29 0,-3 -2,-3 -4,-3 -4,0 -4,0 -6,7 -3,14 -9,33 -21,33 -8,0 -8,-6 -8,-12 0,-6 2,-14 2,-16 1,-6 1,-6 1,-10 0,-19 -20,-26 -37,-29 6,-4 12,-10 20,-19 14,-16 25,-29 40,-29 5,0 7,3 7,3 -12,2 -13,12 -13,14 0,4 2,9 10,9 6,0 14,-5 14,-16 0,-7 -5,-16 -18,-16 -15,0 -27,11 -37,23 -16,18 -20,23 -30,28l29 -116c0,0 1,-3 1,-3 0,-3 -2,-4 -4,-4 -1,0 -4,1 -5,1l-28 2c-3,1 -6,1 -6,6 0,3 2,3 6,3 14,0 15,2 15,5 0,1 -1,5 -1,5l-42 166c0,1 -1,3 -1,4z"/>
    <path id="3" class="fil4" d="M3993 2011c0,23 22,37 44,37 24,0 44,-18 44,-40 0,-8 -3,-17 -11,-26 -4,-5 -7,-7 -21,-15 16,-8 26,-19 26,-33 0,-20 -19,-32 -38,-32 -21,0 -38,16 -38,36 0,4 0,13 9,23 2,3 10,8 15,11 -12,7 -30,18 -30,39zm11 0c0,-12 6,-25 24,-35l26 16c6,4 16,11 16,23 0,16 -16,27 -33,27 -18,0 -33,-13 -33,-31zm4 -82c0,-12 14,-21 29,-21 15,0 29,11 29,26 0,12 -9,22 -21,30l-26 -17c-10,-7 -11,-14 -11,-18z"/>
    <path class="fil4" d="M1670 901c0,3 3,7 8,7 9,0 11,-8 11,-10l14 -57c11,1 29,7 29,23 0,2 0,3 -1,7 -1,5 -1,7 -1,10 0,20 13,27 24,27 12,0 18,-9 21,-14 7,-11 11,-28 11,-29 0,-3 -3,-3 -5,-3 -3,0 -3,0 -5,7 -4,14 -9,33 -21,33 -8,0 -9,-6 -9,-12 0,-6 2,-14 3,-16 1,-6 1,-6 1,-10 0,-19 -20,-26 -37,-29 6,-4 12,-10 20,-19 14,-16 25,-29 39,-29 6,0 8,3 8,3 -12,2 -13,12 -13,14 0,4 2,9 10,9 6,0 14,-5 14,-16 0,-7 -5,-16 -18,-16 -15,0 -27,11 -37,23 -16,18 -20,23 -30,28l29 -116c0,0 0,-3 0,-3 0,-3 -1,-4 -4,-4 0,0 -3,1 -4,1l-28 2c-3,1 -7,1 -7,6 0,3 3,3 7,3 14,0 14,2 14,5 0,1 0,5 0,5l-42 166c-1,1 -1,3 -1,4z"/>
    <path id="1" class="fil4" d="M1789 943l79 0 6 -36 -5 0c-1,6 -3,15 -5,18 -2,2 -16,2 -20,2l-38 0 22 -22c33,-29 46,-40 46,-62 0,-24 -19,-41 -45,-41 -24,0 -40,20 -40,39 0,12 11,12 12,12 3,0 11,-3 11,-12 0,-5 -4,-11 -12,-11 -1,0 -2,0 -2,1 5,-14 16,-22 28,-22 20,0 29,17 29,34 0,17 -11,34 -23,47l-40 46c-3,2 -3,2 -3,7z"/>
    <path class="fil4" d="M2769 901c0,3 3,7 8,7 9,0 11,-8 11,-10l15 -57c10,1 28,7 28,23 0,2 0,3 -1,7 -1,5 -1,7 -1,10 0,20 13,27 24,27 12,0 19,-9 22,-14 6,-11 10,-28 10,-29 0,-3 -2,-3 -4,-3 -4,0 -4,0 -6,7 -3,14 -9,33 -21,33 -8,0 -8,-6 -8,-12 0,-6 2,-14 2,-16 1,-6 1,-6 1,-10 0,-19 -20,-26 -37,-29 6,-4 12,-10 20,-19 14,-16 25,-29 40,-29 5,0 7,3 7,3 -12,2 -13,12 -13,14 0,4 2,9 10,9 6,0 14,-5 14,-16 0,-7 -5,-16 -18,-16 -15,0 -27,11 -37,23 -16,18 -20,23 -30,28l29 -116c0,0 1,-3 1,-3 0,-3 -2,-4 -4,-4 -1,0 -4,1 -5,1l-28 2c-3,1 -6,1 -6,6 0,3 2,3 6,3 14,0 15,2 15,5 0,1 -1,5 -1,5l-42 166c0,1 -1,3 -1,4z"/>
    <path id="1" class="fil4" d="M2887 915c0,19 20,33 43,33 25,0 45,-19 45,-41 0,-17 -14,-34 -36,-38 18,-6 30,-21 30,-37 0,-18 -19,-30 -39,-30 -21,0 -37,13 -37,29 0,7 4,11 10,11 7,0 11,-4 11,-11 0,-10 -10,-10 -13,-10 7,-11 21,-13 28,-13 9,0 21,4 21,23 0,3 -1,15 -6,25 -7,10 -14,10 -19,11 -2,0 -7,0 -8,0 -2,0 -4,1 -4,3 0,2 2,2 5,2l10 0c17,0 25,14 25,35 0,29 -15,35 -24,35 -9,0 -25,-3 -32,-16 7,1 14,-4 14,-12 0,-7 -6,-11 -12,-11 -5,0 -12,2 -12,12z"/>
    <path class="fil4" d="M3868 901c0,3 2,7 8,7 8,0 10,-8 11,-10l14 -57c11,1 29,7 29,23 0,2 0,3 -1,7 -1,5 -1,7 -1,10 0,20 13,27 23,27 13,0 19,-9 22,-14 6,-11 10,-28 10,-29 0,-3 -2,-3 -4,-3 -3,0 -4,0 -5,7 -4,14 -9,33 -22,33 -7,0 -8,-6 -8,-12 0,-6 2,-14 2,-16 2,-6 2,-6 2,-10 0,-19 -20,-26 -38,-29 7,-4 13,-10 20,-19 15,-16 26,-29 40,-29 5,0 7,3 8,3 -12,2 -14,12 -14,14 0,4 3,9 10,9 6,0 14,-5 14,-16 0,-7 -5,-16 -17,-16 -15,0 -28,11 -37,23 -16,18 -21,23 -31,28l29 -116c0,0 1,-3 1,-3 0,-3 -2,-4 -4,-4 -1,0 -4,1 -4,1l-28 2c-4,1 -7,1 -7,6 0,3 3,3 7,3 13,0 14,2 14,5 0,1 -1,5 -1,5l-42 166c0,1 0,3 0,4z"/>
    <path id="1" class="fil4" d="M3982 908l57 0 0 19c0,7 -1,10 -16,10l-5 0 0 6c9,0 20,0 29,0 9,0 20,0 29,0l0 -6 -5 0c-16,0 -16,-3 -16,-10l0 -19 21 0 0 -6 -21 0 0 -96c0,-5 0,-6 -3,-6 -2,0 -3,0 -5,3l-65 99 0 6zm6 -6l52 -79 0 79 -52 0z"/>
    <path class="fil4" d="M1074 1072c0,3 3,3 4,3 4,0 4,0 6,-7 5,-19 10,-33 19,-33 7,0 7,8 7,11 0,5 -1,10 -2,15l-21 84c0,2 -1,3 -1,4 0,3 3,7 8,7 4,0 8,-2 10,-7l12 -45c1,-6 3,-12 4,-18 4,-14 4,-15 7,-21 8,-14 21,-30 40,-30 13,0 13,14 13,18 0,8 -2,16 -3,19l-18 73c0,2 -1,3 -1,4 0,3 2,7 8,7 4,0 8,-2 10,-7l12 -45c1,-6 3,-12 4,-18 4,-14 4,-15 7,-21 8,-14 20,-30 40,-30 13,0 13,14 13,18 0,18 -12,52 -16,63 -4,9 -5,12 -5,18 0,12 8,22 21,22 27,0 36,-42 36,-43 0,-3 -2,-3 -4,-3 -4,0 -4,1 -5,5 -2,8 -10,35 -26,35 -6,0 -6,-4 -6,-8 0,-7 3,-14 5,-21 6,-15 17,-47 17,-63 0,-24 -16,-29 -29,-29 -20,0 -34,12 -43,24 -2,-19 -17,-24 -29,-24 -17,0 -31,9 -41,22 -2,-14 -11,-22 -24,-22 -10,0 -15,6 -20,15 -5,11 -9,28 -9,28z"/>
    <path id="1" class="fil4" d="M1300 1071c4,0 17,0 28,-6l0 110c0,7 -1,10 -20,10l-7 0 0 6c8,0 26,0 35,0 8,0 27,0 34,0l0 -6 -7 0c-19,0 -19,-2 -19,-10l0 -119c0,-5 0,-6 -5,-6 -13,14 -32,14 -39,14l0 7z"/>
    <path class="fil4" d="M972 2210c0,22 3,56 19,88 17,35 41,53 44,53 2,0 3,-1 3,-3 0,-1 0,-1 -5,-6 -35,-35 -44,-89 -44,-132 0,-49 10,-98 45,-133 4,-4 4,-4 4,-5 0,-2 -1,-3 -3,-3 -3,0 -28,19 -45,55 -14,31 -18,62 -18,86z"/>
    <path id="1" class="fil4" d="M1406 2348c0,2 1,3 3,3 3,0 28,-19 45,-55 14,-31 18,-62 18,-86 0,-22 -3,-56 -19,-88 -17,-35 -41,-53 -44,-53 -2,0 -3,1 -3,3 0,1 0,1 6,6 27,28 43,73 43,132 0,48 -10,98 -45,134 -4,3 -4,3 -4,4z"/>
    <path id="2" class="fil4" d="M1077 2199c0,3 3,3 5,3 3,0 3,0 5,-6 5,-20 10,-34 19,-34 7,0 7,8 7,11 0,5 0,10 -2,15l-21 84c0,2 -1,4 -1,4 0,3 3,8 8,8 4,0 8,-2 10,-8l12 -45c1,-6 3,-12 4,-18 4,-14 4,-15 7,-20 9,-15 21,-31 40,-31 13,0 13,14 13,19 0,7 -2,15 -2,18l-19 73c0,2 -1,4 -1,4 0,3 3,8 8,8 4,0 8,-2 10,-8l12 -45c1,-6 3,-12 4,-18 4,-14 4,-15 7,-20 8,-15 21,-31 40,-31 13,0 13,14 13,19 0,17 -12,51 -16,62 -4,10 -5,12 -5,18 0,13 8,23 22,23 26,0 35,-42 35,-44 0,-3 -2,-3 -4,-3 -3,0 -3,1 -5,5 -2,8 -9,35 -26,35 -6,0 -6,-4 -6,-8 0,-7 3,-14 5,-21 6,-15 17,-46 17,-63 0,-24 -16,-29 -29,-29 -20,0 -34,12 -43,25 -2,-20 -17,-25 -29,-25 -17,0 -31,9 -41,22 -2,-14 -11,-22 -23,-22 -11,0 -16,6 -21,15 -5,11 -9,28 -9,28z"/>
    <path id="3" class="fil4" d="M1295 2285c0,18 15,38 38,38 25,0 46,-20 46,-47 0,-25 -17,-46 -40,-46 -10,0 -19,3 -27,11l0 -42c5,2 12,3 18,3 26,0 41,-19 41,-22 0,-1 0,-2 -2,-2 0,0 -1,0 -2,0 -4,2 -14,6 -28,6 -9,0 -19,-1 -29,-5 -1,-1 -2,-1 -2,-1 -2,0 -2,2 -2,5l0 63c0,3 0,5 3,5 1,0 2,0 3,-2 2,-3 10,-15 27,-15 11,0 16,10 18,14 3,8 4,16 4,27 0,7 0,20 -5,29 -6,8 -13,13 -23,13 -16,0 -28,-11 -31,-23 0,0 1,0 3,0 7,0 11,-5 11,-10 0,-5 -4,-11 -11,-11 -3,0 -10,2 -10,12z"/>
    <path class="fil4" d="M2072 2210c0,22 3,56 19,88 17,35 41,53 44,53 2,0 3,-1 3,-3 0,-1 0,-1 -5,-6 -35,-35 -44,-89 -44,-132 0,-49 10,-98 45,-133 4,-4 4,-4 4,-5 0,-2 -1,-3 -3,-3 -3,0 -28,19 -45,55 -14,31 -18,62 -18,86z"/>
    <path id="1" class="fil4" d="M2506 2348c0,2 1,3 3,3 3,0 28,-19 45,-55 14,-31 18,-62 18,-86 0,-22 -3,-56 -19,-88 -17,-35 -41,-53 -44,-53 -2,0 -3,1 -3,3 0,1 0,1 6,6 27,28 43,73 43,132 0,48 -10,98 -45,134 -4,3 -4,3 -4,4z"/>
    <path id="2" class="fil4" d="M2177 2199c0,3 3,3 5,3 3,0 3,0 5,-6 5,-20 10,-34 19,-34 7,0 7,8 7,11 0,5 0,10 -2,15l-21 84c0,2 -1,4 -1,4 0,3 3,8 8,8 4,0 8,-2 10,-8l12 -45c1,-6 3,-12 4,-18 4,-14 4,-15 7,-20 9,-15 21,-31 40,-31 13,0 13,14 13,19 0,7 -2,15 -2,18l-19 73c0,2 -1,4 -1,4 0,3 3,8 8,8 4,0 8,-2 10,-8l12 -45c1,-6 3,-12 4,-18 4,-14 4,-15 7,-20 8,-15 21,-31 40,-31 13,0 13,14 13,19 0,17 -12,51 -16,62 -4,10 -5,12 -5,18 0,13 8,23 22,23 26,0 35,-42 35,-44 0,-3 -2,-3 -4,-3 -3,0 -3,1 -5,5 -2,8 -9,35 -26,35 -6,0 -6,-4 -6,-8 0,-7 3,-14 5,-21 6,-15 17,-46 17,-63 0,-24 -16,-29 -29,-29 -20,0 -34,12 -43,25 -2,-20 -17,-25 -29,-25 -17,0 -31,9 -41,22 -2,-14 -11,-22 -23,-22 -11,0 -16,6 -21,15 -5,11 -9,28 -9,28z"/>
    <path id="3" class="fil4" d="M2393 2252c0,56 25,71 45,71 23,0 43,-20 43,-47 0,-27 -19,-48 -42,-48 -15,0 -22,11 -27,21l0 -5c0,-53 27,-61 37,-61 5,0 14,1 19,8 -3,0 -12,0 -12,10 0,7 5,10 10,10 4,0 10,-2 10,-10 0,-13 -9,-23 -27,-23 -27,0 -56,27 -56,74zm20 19c0,-17 7,-38 26,-38 3,0 13,0 19,13 4,8 4,19 4,29 0,10 0,21 -4,29 -6,12 -16,13 -20,13 -14,0 -20,-12 -21,-15 -4,-10 -4,-27 -4,-31z"/>
    <path class="fil4" d="M3172 2210c0,22 3,56 19,88 17,35 41,53 44,53 2,0 3,-1 3,-3 0,-1 0,-1 -5,-6 -35,-35 -44,-89 -44,-132 0,-49 10,-98 45,-133 4,-4 4,-4 4,-5 0,-2 -1,-3 -3,-3 -3,0 -28,19 -45,55 -14,31 -18,62 -18,86z"/>
    <path id="1" class="fil4" d="M3606 2348c0,2 1,3 3,3 3,0 28,-19 45,-55 14,-31 18,-62 18,-86 0,-22 -3,-56 -19,-88 -17,-35 -41,-53 -44,-53 -2,0 -3,1 -3,3 0,1 0,1 6,6 27,28 43,73 43,132 0,48 -10,98 -45,134 -4,3 -4,3 -4,4z"/>
    <path id="2" class="fil4" d="M3277 2199c0,3 3,3 5,3 3,0 3,0 5,-6 5,-20 10,-34 19,-34 7,0 7,8 7,11 0,5 0,10 -2,15l-21 84c0,2 -1,4 -1,4 0,3 3,8 8,8 4,0 8,-2 10,-8l12 -45c1,-6 3,-12 4,-18 4,-14 4,-15 7,-20 9,-15 21,-31 40,-31 13,0 13,14 13,19 0,7 -2,15 -2,18l-19 73c0,2 -1,4 -1,4 0,3 3,8 8,8 4,0 8,-2 10,-8l12 -45c1,-6 3,-12 4,-18 4,-14 4,-15 7,-20 8,-15 21,-31 40,-31 13,0 13,14 13,19 0,17 -12,51 -16,62 -4,10 -5,12 -5,18 0,13 8,23 22,23 26,0 35,-42 35,-44 0,-3 -2,-3 -4,-3 -3,0 -3,1 -5,5 -2,8 -9,35 -26,35 -6,0 -6,-4 -6,-8 0,-7 3,-14 5,-21 6,-15 17,-46 17,-63 0,-24 -16,-29 -29,-29 -20,0 -34,12 -43,25 -2,-20 -17,-25 -29,-25 -17,0 -31,9 -41,22 -2,-14 -11,-22 -23,-22 -11,0 -16,6 -21,15 -5,11 -9,28 -9,28z"/>
    <path id="3" class="fil4" d="M3496 2219l6 0c0,-3 2,-17 5,-19 1,-1 18,-1 21,-1l43 0c-2,3 -19,26 -23,33 -19,29 -26,58 -26,80 0,2 0,11 9,11 10,0 10,-9 10,-11l0 -11c0,-12 1,-23 2,-35 1,-5 4,-23 14,-36l28 -40c2,-3 2,-3 2,-8l-51 0c-26,0 -27,-2 -27,-7l-6 0 -7 44z"/>
    <path class="fil4" d="M4272 2210c0,22 3,56 19,88 17,35 41,53 44,53 2,0 3,-1 3,-3 0,-1 0,-1 -5,-6 -35,-35 -44,-89 -44,-132 0,-49 10,-98 45,-133 4,-4 4,-4 4,-5 0,-2 -1,-3 -3,-3 -3,0 -28,19 -45,55 -14,31 -18,62 -18,86z"/>
    <path id="1" class="fil4" d="M4706 2348c0,2 1,3 3,3 3,0 28,-19 45,-55 14,-31 18,-62 18,-86 0,-22 -3,-56 -19,-88 -17,-35 -41,-53 -44,-53 -2,0 -3,1 -3,3 0,1 0,1 6,6 27,28 43,73 43,132 0,48 -10,98 -45,134 -4,3 -4,3 -4,4z"/>
    <path id="2" class="fil4" d="M4377 2199c0,3 3,3 5,3 3,0 3,0 5,-6 5,-20 10,-34 19,-34 7,0 7,8 7,11 0,5 0,10 -2,15l-21 84c0,2 -1,4 -1,4 0,3 3,8 8,8 4,0 8,-2 10,-8l12 -45c1,-6 3,-12 4,-18 4,-14 4,-15 7,-20 9,-15 21,-31 40,-31 13,0 13,14 13,19 0,7 -2,15 -2,18l-19 73c0,2 -1,4 -1,4 0,3 3,8 8,8 4,0 8,-2 10,-8l12 -45c1,-6 3,-12 4,-18 4,-14 4,-15 7,-20 8,-15 21,-31 40,-31 13,0 13,14 13,19 0,17 -12,51 -16,62 -4,10 -5,12 -5,18 0,13 8,23 22,23 26,0 35,-42 35,-44 0,-3 -2,-3 -4,-3 -3,0 -3,1 -5,5 -2,8 -9,35 -26,35 -6,0 -6,-4 -6,-8 0,-7 3,-14 5,-21 6,-15 17,-46 17,-63 0,-24 -16,-29 -29,-29 -20,0 -34,12 -43,25 -2,-20 -17,-25 -29,-25 -17,0 -31,9 -41,22 -2,-14 -11,-22 -23,-22 -11,0 -16,6 -21,15 -5,11 -9,28 -9,28z"/>
    <path id="3" class="fil4" d="M4593 2287c0,22 22,36 44,36 24,0 44,-17 44,-40 0,-7 -2,-17 -10,-26 -4,-4 -8,-6 -21,-15 15,-8 25,-19 25,-33 0,-19 -18,-31 -38,-31 -21,0 -38,15 -38,35 0,4 0,13 9,23 3,3 10,8 16,12 -12,6 -31,18 -31,39zm11 0c0,-13 7,-26 25,-36l26 16c6,4 16,11 16,24 0,15 -16,26 -34,26 -18,0 -33,-13 -33,-30zm4 -82c0,-13 14,-22 29,-22 16,0 29,11 29,26 0,12 -8,22 -21,30l-26 -17c-10,-6 -11,-14 -11,-17z"/>
    <path class="fil4" d="M2171 1072c0,3 3,3 4,3 4,0 4,0 6,-7 5,-19 10,-33 19,-33 7,0 7,8 7,11 0,5 -1,10 -2,15l-21 84c-1,2 -1,3 -1,4 0,3 2,7 8,7 3,0 8,-2 10,-7l11 -45c2,-6 4,-12 5,-18 4,-14 4,-15 7,-21 8,-14 20,-30 40,-30 13,0 13,14 13,18 0,8 -2,16 -3,19l-18 73c-1,2 -1,3 -1,4 0,3 2,7 8,7 3,0 8,-2 10,-7l11 -45c2,-6 4,-12 5,-18 4,-14 4,-15 7,-21 8,-14 20,-30 40,-30 13,0 13,14 13,18 0,18 -13,52 -17,63 -3,9 -4,12 -4,18 0,12 8,22 21,22 27,0 36,-42 36,-43 0,-3 -2,-3 -4,-3 -4,0 -4,1 -5,5 -2,8 -10,35 -26,35 -6,0 -6,-4 -6,-8 0,-7 2,-14 5,-21 5,-15 17,-47 17,-63 0,-24 -16,-29 -30,-29 -19,0 -34,12 -42,24 -2,-19 -17,-24 -30,-24 -17,0 -30,9 -40,22 -2,-14 -12,-22 -24,-22 -10,0 -16,6 -20,15 -5,11 -9,28 -9,28z"/>
    <path id="1" class="fil4" d="M2389 1191l78 0 6 -36 -5 0c-1,6 -3,15 -5,18 -1,2 -15,2 -20,2l-38 0 22 -22c33,-29 46,-40 46,-61 0,-25 -19,-42 -45,-42 -24,0 -39,20 -39,39 0,12 10,12 11,12 3,0 11,-3 11,-12 0,-5 -4,-11 -11,-11 -2,0 -2,0 -3,1 5,-14 16,-22 29,-22 19,0 28,17 28,35 0,16 -11,33 -22,46l-41 46c-2,2 -2,2 -2,7z"/>
    <path class="fil4" d="M3270 1070c0,3 3,3 4,3 4,0 4,-1 6,-7 5,-20 10,-33 19,-33 7,0 7,8 7,11 0,4 -1,10 -2,14l-21 85c0,2 -1,3 -1,4 0,3 3,7 8,7 4,0 8,-2 10,-7l12 -45c1,-7 3,-12 4,-19 4,-14 4,-14 7,-20 8,-14 20,-30 40,-30 13,0 13,14 13,18 0,8 -2,16 -3,18l-18 74c-1,2 -1,3 -1,4 0,3 2,7 8,7 3,0 8,-2 10,-7l12 -45c1,-7 3,-12 4,-19 4,-14 4,-14 7,-20 8,-14 20,-30 40,-30 13,0 13,14 13,18 0,18 -13,51 -16,62 -4,10 -5,13 -5,19 0,12 8,22 21,22 27,0 36,-42 36,-43 0,-3 -2,-3 -4,-3 -4,0 -4,0 -5,5 -2,7 -10,35 -26,35 -6,0 -6,-4 -6,-8 0,-7 3,-15 5,-21 6,-15 17,-47 17,-63 0,-24 -16,-30 -30,-30 -19,0 -33,13 -42,25 -2,-19 -17,-25 -29,-25 -17,0 -31,10 -41,23 -2,-14 -11,-23 -24,-23 -10,0 -15,7 -20,15 -5,12 -9,28 -9,29z"/>
    <path id="1" class="fil4" d="M3486 1161c0,19 20,33 43,33 26,0 45,-19 45,-41 0,-17 -13,-34 -35,-38 17,-6 29,-21 29,-38 0,-17 -18,-29 -39,-29 -21,0 -37,13 -37,29 0,7 5,11 11,11 6,0 10,-5 10,-11 0,-10 -9,-10 -13,-10 7,-11 21,-14 28,-14 9,0 21,5 21,24 0,3 -1,15 -6,24 -6,10 -14,11 -19,11 -2,1 -7,1 -8,1 -2,0 -3,0 -3,2 0,3 1,3 5,3l9 0c17,0 25,14 25,35 0,29 -14,35 -24,35 -9,0 -25,-4 -32,-16 7,1 14,-4 14,-12 0,-7 -6,-12 -12,-12 -5,0 -12,3 -12,13z"/>
    <path class="fil4" d="M4369 1072c0,3 2,3 4,3 4,0 4,0 5,-7 5,-19 11,-33 19,-33 8,0 8,8 8,11 0,5 -1,10 -2,15l-21 84c-1,2 -1,3 -1,4 0,3 2,7 8,7 3,0 8,-2 10,-7l11 -45c2,-6 3,-12 5,-18 3,-14 3,-15 7,-21 8,-14 20,-30 39,-30 13,0 13,14 13,18 0,8 -2,16 -2,19l-18 73c-1,2 -1,3 -1,4 0,3 2,7 8,7 3,0 8,-2 10,-7l11 -45c1,-6 3,-12 5,-18 3,-14 3,-15 7,-21 8,-14 20,-30 39,-30 13,0 13,14 13,18 0,18 -12,52 -16,63 -4,9 -4,12 -4,18 0,12 7,22 21,22 26,0 36,-42 36,-43 0,-3 -2,-3 -4,-3 -4,0 -4,1 -5,5 -2,8 -10,35 -26,35 -6,0 -7,-4 -7,-8 0,-7 3,-14 5,-21 6,-15 18,-47 18,-63 0,-24 -17,-29 -30,-29 -20,0 -34,12 -42,24 -3,-19 -17,-24 -30,-24 -17,0 -31,9 -40,22 -2,-14 -12,-22 -24,-22 -10,0 -16,6 -20,15 -6,11 -9,28 -9,28z"/>
    <path id="1" class="fil4" d="M4582 1157l56 0 0 18c0,8 0,10 -16,10l-5 0 0 6c9,0 20,0 29,0 9,0 20,0 29,0l0 -6 -5 0c-15,0 -16,-2 -16,-10l0 -18 21 0 0 -7 -21 0 0 -96c0,-5 0,-6 -3,-6 -2,0 -3,0 -4,3l-65 99 0 7zm6 -7l51 -79 0 79 -51 0z"/>
    <path class="fil4" d="M1012 2669c0,22 3,56 19,88 16,35 41,53 44,53 1,0 2,-1 2,-3 0,-1 0,-1 -4,-6 -36,-36 -45,-89 -45,-132 0,-49 11,-98 46,-134 3,-3 3,-4 3,-4 0,-2 -1,-3 -2,-3 -3,0 -29,19 -45,55 -15,31 -18,62 -18,86z"/>
    <path id="1" class="fil4" d="M1367 2807c0,2 1,3 3,3 2,0 28,-19 44,-55 15,-31 18,-62 18,-86 0,-22 -3,-56 -18,-88 -17,-35 -42,-53 -44,-53 -2,0 -3,1 -3,3 0,0 0,1 5,6 28,28 44,73 44,132 0,48 -11,98 -46,133 -3,4 -3,4 -3,5z"/>
    <path id="2" class="fil4" d="M1117 2658c0,3 3,3 4,3 4,0 4,-1 5,-4 2,-9 10,-36 26,-36 4,0 7,1 7,8 0,7 -3,15 -7,26 -7,19 -15,40 -15,55 0,24 17,33 32,33 15,0 24,-9 31,-17 5,15 17,17 23,17 10,0 16,-7 20,-16 5,-11 9,-27 9,-28 0,-3 -2,-3 -4,-3 -4,0 -4,1 -6,7 -4,16 -9,33 -19,33 -7,0 -7,-7 -7,-11 0,-2 0,-7 2,-15l20 -81c1,-2 1,-3 1,-4 0,-3 -2,-7 -8,-7 -8,0 -10,8 -11,10l-20 83c-2,5 -2,5 -4,9 -6,8 -14,16 -26,16 -13,0 -16,-12 -16,-21 0,-18 10,-43 17,-62 2,-6 3,-10 3,-15 0,-15 -9,-23 -21,-23 -26,0 -36,42 -36,43z"/>
    <path id="3" class="fil4" d="M1255 2743c0,19 15,39 39,39 24,0 46,-20 46,-47 0,-25 -18,-46 -40,-46 -11,0 -20,3 -27,10l0 -41c4,1 11,3 18,3 26,0 41,-19 41,-22 0,-1 -1,-2 -3,-2 0,0 0,0 -1,0 -4,2 -15,6 -29,6 -9,0 -18,-1 -28,-6 -2,0 -2,0 -3,0 -2,0 -2,2 -2,5l0 63c0,3 0,5 3,5 2,0 2,-1 3,-2 2,-3 10,-15 27,-15 11,0 16,10 18,14 4,8 4,16 4,27 0,7 0,20 -5,29 -5,8 -13,13 -23,13 -15,0 -27,-11 -31,-23 1,0 1,0 4,0 7,0 10,-5 10,-10 0,-5 -3,-11 -10,-11 -3,0 -11,2 -11,11z"/>
    <path class="fil4" d="M2112 2669c0,22 3,56 19,88 16,35 41,53 44,53 1,0 2,-1 2,-3 0,-1 0,-1 -4,-6 -36,-36 -45,-89 -45,-132 0,-49 11,-98 46,-134 3,-3 3,-4 3,-4 0,-2 -1,-3 -2,-3 -3,0 -29,19 -45,55 -15,31 -18,62 -18,86z"/>
    <path id="1" class="fil4" d="M2467 2807c0,2 1,3 3,3 2,0 28,-19 44,-55 15,-31 18,-62 18,-86 0,-22 -3,-56 -18,-88 -17,-35 -42,-53 -44,-53 -2,0 -3,1 -3,3 0,0 0,1 5,6 28,28 44,73 44,132 0,48 -11,98 -46,133 -3,4 -3,4 -3,5z"/>
    <path id="2" class="fil4" d="M2217 2658c0,3 3,3 4,3 4,0 4,-1 5,-4 2,-9 10,-36 26,-36 4,0 7,1 7,8 0,7 -3,15 -7,26 -7,19 -15,40 -15,55 0,24 17,33 32,33 15,0 24,-9 31,-17 5,15 17,17 23,17 10,0 16,-7 20,-16 5,-11 9,-27 9,-28 0,-3 -2,-3 -4,-3 -4,0 -4,1 -6,7 -4,16 -9,33 -19,33 -7,0 -7,-7 -7,-11 0,-2 0,-7 2,-15l20 -81c1,-2 1,-3 1,-4 0,-3 -2,-7 -8,-7 -8,0 -10,8 -11,10l-20 83c-2,5 -2,5 -4,9 -6,8 -14,16 -26,16 -13,0 -16,-12 -16,-21 0,-18 10,-43 17,-62 2,-6 3,-10 3,-15 0,-15 -9,-23 -21,-23 -26,0 -36,42 -36,43z"/>
    <path id="3" class="fil4" d="M2354 2711c0,56 24,71 44,71 23,0 43,-20 43,-48 0,-26 -18,-47 -42,-47 -14,0 -22,11 -26,21l0 -5c0,-53 26,-61 37,-61 5,0 14,1 18,8 -3,0 -11,0 -11,10 0,6 5,10 9,10 4,0 10,-2 10,-11 0,-12 -9,-22 -27,-22 -27,0 -55,27 -55,74zm19 19c0,-17 7,-38 26,-38 3,0 13,0 20,13 3,8 3,19 3,29 0,10 0,21 -3,29 -7,12 -16,13 -21,13 -13,0 -20,-12 -21,-16 -4,-10 -4,-26 -4,-30z"/>
    <rect class="fil3 str2" x="110" y="410" width="5000" height="2500"/>
   </g>
   <rect class="fil3 str2" x="10" y="10" width="5200" height="3000"/>
   <path class="fil4" d="M2069 284c0,5 0,7 3,7 2,0 2,0 4,-4 0,0 1,-1 10,-16 9,10 27,20 52,20 33,0 56,-28 56,-59 0,-28 -19,-51 -43,-57l-36 -8c-17,-5 -28,-20 -28,-36 0,-20 15,-37 37,-37 47,0 53,46 55,59 0,1 0,3 3,3 4,0 4,-1 4,-7l0 -56c0,-5 0,-7 -3,-7 -2,0 -2,0 -4,4l-10 16c-9,-9 -20,-20 -45,-20 -32,0 -55,25 -55,55 0,23 15,44 37,51 3,1 17,5 37,10 7,2 16,4 24,14 6,7 9,17 9,26 0,20 -15,40 -38,40 -8,0 -30,-1 -45,-15 -16,-15 -17,-33 -17,-43 -1,-3 -3,-3 -4,-3 -3,0 -3,2 -3,7l0 56z"/>
   <path id="1" class="fil4" d="M2215 320c0,13 12,23 26,23 18,0 29,-16 36,-32l50 -121c7,-17 21,-18 26,-18l0 -8c-7,0 -15,0 -21,0 -5,0 -19,0 -25,0l0 8c9,1 13,5 13,12 0,3 0,4 -1,7l-29 69 -31 -75c-1,-3 -2,-4 -2,-5 0,-8 11,-8 16,-8l0 -8c-7,0 -26,0 -31,0 -7,0 -19,0 -27,0l0 8c13,0 19,0 23,10l42 103c-1,4 -5,13 -7,17 -6,15 -14,35 -32,35 -2,0 -8,0 -14,-6 9,-1 11,-7 11,-11 0,-8 -5,-12 -11,-12 -6,0 -12,3 -12,12z"/>
   <path id="2" class="fil4" d="M2367 281c0,5 0,7 4,7 1,0 1,0 7,-6 0,0 0,-1 5,-6 13,12 25,12 31,12 33,0 46,-19 46,-39 0,-15 -9,-24 -12,-27 -9,-9 -20,-11 -32,-14 -16,-3 -35,-6 -35,-23 0,-10 7,-21 32,-21 31,0 32,25 33,34 0,2 2,2 3,2 4,0 4,-1 4,-6l0 -29c0,-5 0,-7 -3,-7 -2,0 -2,0 -6,4 -1,1 -4,3 -5,4 -11,-8 -22,-8 -26,-8 -35,0 -46,19 -46,35 0,10 5,18 13,24 9,7 17,9 37,13 6,1 29,6 29,26 0,14 -10,26 -32,26 -23,0 -34,-16 -39,-40 -1,-4 -1,-5 -4,-5 -4,0 -4,2 -4,7l0 37z"/>
   <path id="3" class="fil4" d="M2475 172l24 0 0 78c0,35 26,38 36,38 20,0 28,-20 28,-38l0 -16 -7 0 0 15c0,21 -9,32 -19,32 -19,0 -19,-26 -19,-31l0 -78 40 0 0 -8 -40 0 0 -52 -7 0c0,22 -9,53 -36,54l0 6z"/>
   <path id="4" class="fil4" d="M2587 223c0,38 29,65 62,65 34,0 47,-31 47,-37 0,-3 -2,-3 -4,-3 -2,0 -3,2 -3,4 -10,29 -36,29 -39,29 -14,0 -25,-9 -31,-19 -9,-14 -9,-32 -9,-42l79 0c6,0 7,0 7,-6 0,-28 -15,-56 -51,-56 -32,0 -58,30 -58,65zm23 -9c2,-42 26,-49 35,-49 29,0 32,38 32,49l-67 0z"/>
   <path id="5" class="fil4" d="M2713 285c10,0 24,-1 32,-1 7,0 22,1 32,1l0 -9c-19,0 -22,0 -22,-13l0 -52c0,-29 20,-45 38,-45 18,0 21,16 21,32l0 65c0,13 -3,13 -22,13l0 9c9,0 24,-1 32,-1 7,0 22,1 31,1l0 -9c-19,0 -22,0 -22,-13l0 -52c0,-29 20,-45 38,-45 18,0 21,16 21,32l0 65c0,13 -3,13 -22,13l0 9c10,0 24,-1 32,-1 7,0 22,1 32,1l0 -9c-15,0 -22,0 -22,-8l0 -54c0,-25 0,-33 -9,-43 -4,-5 -13,-11 -30,-11 -24,0 -36,17 -41,28 -4,-25 -25,-28 -37,-28 -21,0 -34,12 -42,30l0 -30 -40 4 0 8c20,0 22,2 22,16l0 75c0,13 -3,13 -22,13l0 9z"/>
   <path id="6" class="fil4" d="M3058 124c6,0 23,0 37,-8l0 147c0,10 -1,13 -26,13l-9 0 0 9c10,-1 34,-1 46,-1 11,0 36,0 45,1l0 -9 -9 0c-25,0 -26,-3 -26,-13l0 -159c0,-7 0,-7 -6,-7 -18,18 -43,18 -52,18l0 9z"/>
  </g>
 </g>
</svg>
