<?xml version="1.0" encoding="UTF-8"?>
<!DOCTYPE svg PUBLIC "-//W3C//DTD SVG 1.0//EN" "http://www.w3.org/TR/2001/REC-SVG-20010904/DTD/svg10.dtd">
<!-- Creator: CorelDRAW X7 -->
<svg xmlns="http://www.w3.org/2000/svg" xml:space="preserve" width="100%" height="100%" version="1.0" style="shape-rendering:geometricPrecision; text-rendering:geometricPrecision; image-rendering:optimizeQuality; fill-rule:evenodd; clip-rule:evenodd"
viewBox="0 0 10608 4419"
 xmlns:xlink="http://www.w3.org/1999/xlink">
 <defs>
  <style type="text/css">
   <![CDATA[
    .str1 {stroke:#373435;stroke-width:50}
    .str0 {stroke:#373435;stroke-width:20}
    .fil1 {fill:none}
    .fil4 {fill:#57A9E2}
    .fil0 {fill:#E05757}
    .fil2 {fill:#FFE694}
    .fil3 {fill:#373435;fill-rule:nonzero}
    .fil5 {fill:white;fill-opacity:0.501961}
   ]]>
  </style>
 </defs>
 <g id="Layer_x0020_1">
  <metadata id="CorelCorpID_0Corel-Layer"/>
  <rect class="fil0 str0" x="8583" y="2204" width="500" height="500"/>
  <rect class="fil0 str0" x="8583" y="2704" width="500" height="500"/>
  <rect class="fil1 str0" x="6583" y="2204" width="500" height="500"/>
  <rect class="fil1 str0" x="6583" y="3204" width="500" height="500"/>
  <rect class="fil1 str0" transform="matrix(1.99384E-014 -0.752831 0.752831 1.99384E-014 8582.69 2203.72)" width="664" height="664"/>
  <rect class="fil1 str0" transform="matrix(1.99384E-014 -0.752831 0.752831 1.99384E-014 9582.69 2203.72)" width="664" height="664"/>
  <rect class="fil1 str0" transform="matrix(1.99384E-014 -0.752831 0.752831 1.99384E-014 9582.69 3203.72)" width="664" height="664"/>
  <rect class="fil1 str0" x="6583" y="2704" width="500" height="500"/>
  <rect class="fil1 str0" x="6583" y="3704" width="500" height="500"/>
  <rect class="fil1 str0" transform="matrix(1.99384E-014 -0.752831 0.752831 1.99384E-014 9082.69 2203.72)" width="664" height="664"/>
  <rect class="fil1 str0" transform="matrix(1.99384E-014 -0.752831 0.752831 1.99384E-014 10082.7 2203.72)" width="664" height="664"/>
  <rect class="fil1 str0" transform="matrix(1.99384E-014 -0.752831 0.752831 1.99384E-014 10082.7 3203.72)" width="664" height="664"/>
  <rect class="fil0 str0" x="9083" y="2204" width="500" height="500"/>
  <rect class="fil0 str0" x="9083" y="2704" width="500" height="500"/>
  <rect class="fil1 str0" x="7083" y="2204" width="500" height="500"/>
  <rect class="fil1 str0" x="7083" y="3204" width="500" height="500"/>
  <rect class="fil1 str0" transform="matrix(1.99384E-014 -0.752831 0.752831 1.99384E-014 8582.69 1703.72)" width="664" height="664"/>
  <rect class="fil1 str0" transform="matrix(1.99384E-014 -0.752831 0.752831 1.99384E-014 9582.69 1703.72)" width="664" height="664"/>
  <rect class="fil1 str0" transform="matrix(1.99384E-014 -0.752831 0.752831 1.99384E-014 9582.69 2703.72)" width="664" height="664"/>
  <rect class="fil1 str0" x="7083" y="2704" width="500" height="500"/>
  <rect class="fil1 str0" x="7083" y="3704" width="500" height="500"/>
  <rect class="fil1 str0" transform="matrix(1.99384E-014 -0.752831 0.752831 1.99384E-014 9082.69 1703.72)" width="664" height="664"/>
  <rect class="fil1 str0" transform="matrix(1.99384E-014 -0.752831 0.752831 1.99384E-014 10082.7 1703.72)" width="664" height="664"/>
  <rect class="fil1 str0" transform="matrix(1.99384E-014 -0.752831 0.752831 1.99384E-014 10082.7 2703.72)" width="664" height="664"/>
  <rect class="fil1 str0" x="7583" y="2204" width="500" height="500"/>
  <rect class="fil1 str0" x="7583" y="3204" width="500" height="500"/>
  <rect class="fil1 str0" x="8583" y="3204" width="500" height="500"/>
  <rect class="fil1 str0" transform="matrix(1.99384E-014 -0.752831 0.752831 1.99384E-014 8582.69 1203.72)" width="664" height="664"/>
  <rect class="fil1 str0" transform="matrix(1.99384E-014 -0.752831 0.752831 1.99384E-014 9582.69 1203.72)" width="664" height="664"/>
  <rect class="fil1 str0" x="7583" y="2704" width="500" height="500"/>
  <rect class="fil1 str0" x="7583" y="3704" width="500" height="500"/>
  <rect class="fil1 str0" x="8583" y="3704" width="500" height="500"/>
  <rect class="fil1 str0" transform="matrix(1.99384E-014 -0.752831 0.752831 1.99384E-014 9082.69 1203.72)" width="664" height="664"/>
  <rect class="fil1 str0" transform="matrix(1.99384E-014 -0.752831 0.752831 1.99384E-014 10082.7 1203.72)" width="664" height="664"/>
  <rect class="fil1 str0" x="8083" y="2204" width="500" height="500"/>
  <rect class="fil1 str0" x="8083" y="3204" width="500" height="500"/>
  <rect class="fil1 str0" x="9083" y="3204" width="500" height="500"/>
  <rect class="fil1 str0" transform="matrix(1.99384E-014 -0.752831 0.752831 1.99384E-014 8582.69 703.72)" width="664" height="664"/>
  <rect class="fil1 str0" transform="matrix(1.99384E-014 -0.752831 0.752831 1.99384E-014 9582.69 703.72)" width="664" height="664"/>
  <rect class="fil1 str0" x="8083" y="2704" width="500" height="500"/>
  <rect class="fil1 str0" x="8083" y="3704" width="500" height="500"/>
  <rect class="fil1 str0" x="9083" y="3704" width="500" height="500"/>
  <rect class="fil1 str0" transform="matrix(1.99384E-014 -0.752831 0.752831 1.99384E-014 9082.69 703.72)" width="664" height="664"/>
  <rect class="fil1 str0" transform="matrix(1.99384E-014 -0.752831 0.752831 1.99384E-014 10082.7 703.72)" width="664" height="664"/>
  <rect class="fil2 str0" x="9583" y="3204" width="500" height="500"/>
  <rect class="fil2 str0" x="9583" y="3704" width="500" height="500"/>
  <rect class="fil2 str0" x="10083" y="3204" width="500" height="500"/>
  <rect class="fil2 str0" x="10083" y="3704" width="500" height="500"/>
  <path class="fil3" d="M9639 3528c0,3 3,3 4,3 11,0 23,-1 34,-1 11,0 22,1 33,1 2,0 6,0 6,-5 0,-4 -2,-4 -8,-4 -16,0 -16,-2 -16,-4 0,-2 0,-2 1,-6l19 -77 77 0 -18 75c-3,10 -4,12 -24,12 -4,0 -7,0 -7,6 0,3 3,3 4,3 10,0 22,-1 33,-1 11,0 23,1 34,1 2,0 5,0 5,-5 0,-4 -2,-4 -7,-4 -17,0 -17,-2 -17,-4 0,-1 0,-3 1,-7l39 -153c2,-9 4,-11 22,-11 6,0 8,0 8,-5 0,-3 -2,-4 -4,-4 -10,0 -22,1 -33,1 -11,0 -23,-1 -34,-1 -2,0 -5,0 -5,6 0,3 2,3 7,3 9,0 17,0 17,5 0,1 0,1 -1,5l-18 69 -77 0 17 -68c2,-9 5,-11 22,-11 6,0 9,0 9,-5 0,-3 -2,-4 -4,-4 -11,0 -22,1 -33,1 -12,0 -23,-1 -34,-1 -2,0 -6,0 -6,6 0,3 3,3 8,3 9,0 16,0 16,5 0,1 0,1 -1,5l-38 153c-2,10 -4,12 -23,12 -5,0 -8,0 -8,6z"/>
  <path id="1" class="fil3" d="M9843 3470l6 0c0,-4 2,-17 5,-20 1,-1 18,-1 21,-1l44 0c-3,4 -20,27 -24,34 -19,28 -26,58 -26,79 0,2 0,12 10,12 9,0 9,-10 9,-12l0 -11c0,-11 1,-23 3,-34 0,-5 3,-23 13,-37l28 -40c2,-2 2,-3 2,-7l-51 0c-26,0 -26,-3 -27,-7l-6 0 -7 44z"/>
  <path id="2" class="fil3" d="M9949 3470l6 0c0,-4 2,-17 5,-20 1,-1 18,-1 21,-1l43 0c-2,4 -19,27 -23,34 -19,28 -26,58 -26,79 0,2 0,12 9,12 10,0 10,-10 10,-12l0 -11c0,-11 1,-23 2,-34 1,-5 4,-23 14,-37l28 -40c2,-2 2,-3 2,-7l-51 0c-26,0 -27,-3 -28,-7l-5 0 -7 44z"/>
  <path class="fil3" d="M9639 4028c0,3 3,3 4,3 11,0 23,-1 34,-1 11,0 22,1 33,1 2,0 6,0 6,-5 0,-4 -2,-4 -8,-4 -16,0 -16,-2 -16,-4 0,-2 0,-2 1,-6l19 -77 77 0 -18 75c-3,10 -4,12 -24,12 -4,0 -7,0 -7,6 0,3 3,3 4,3 10,0 22,-1 33,-1 11,0 23,1 34,1 2,0 5,0 5,-5 0,-4 -2,-4 -7,-4 -17,0 -17,-2 -17,-4 0,-1 0,-3 1,-7l39 -153c2,-9 4,-11 22,-11 6,0 8,0 8,-5 0,-3 -2,-4 -4,-4 -10,0 -22,1 -33,1 -11,0 -23,-1 -34,-1 -2,0 -5,0 -5,6 0,3 2,3 7,3 9,0 17,0 17,5 0,1 0,1 -1,5l-18 69 -77 0 17 -68c2,-9 5,-11 22,-11 6,0 9,0 9,-5 0,-3 -2,-4 -4,-4 -11,0 -22,1 -33,1 -12,0 -23,-1 -34,-1 -2,0 -6,0 -6,6 0,3 3,3 8,3 9,0 16,0 16,5 0,1 0,1 -1,5l-38 153c-2,10 -4,12 -23,12 -5,0 -8,0 -8,6z"/>
  <path id="1" class="fil3" d="M9840 4037c0,23 22,37 44,37 24,0 44,-18 44,-40 0,-8 -2,-18 -10,-26 -4,-5 -8,-7 -21,-15 15,-8 26,-19 26,-33 0,-20 -19,-32 -39,-32 -21,0 -38,16 -38,36 0,3 1,13 9,23 3,2 11,8 16,11 -12,6 -31,18 -31,39zm11 0c0,-12 7,-26 25,-36l26 17c6,4 16,10 16,23 0,16 -16,27 -34,27 -18,0 -33,-13 -33,-31zm4 -82c0,-13 14,-22 29,-22 16,0 29,11 29,27 0,12 -8,22 -21,29l-26 -17c-10,-6 -11,-13 -11,-17z"/>
  <path id="2" class="fil3" d="M9949 3970l6 0c0,-4 2,-17 5,-20 1,-1 18,-1 21,-1l43 0c-2,4 -19,27 -23,34 -19,28 -26,58 -26,79 0,2 0,12 9,12 10,0 10,-10 10,-12l0 -11c0,-11 1,-23 2,-34 1,-5 4,-23 14,-37l28 -40c2,-2 2,-3 2,-7l-51 0c-26,0 -27,-3 -28,-7l-5 0 -7 44z"/>
  <path class="fil3" d="M10136 3528c0,3 3,3 4,3 11,0 22,-1 33,-1 12,0 23,1 34,1 2,0 6,0 6,-5 0,-4 -2,-4 -8,-4 -16,0 -16,-2 -16,-4 0,-2 0,-2 1,-6l19 -77 77 0 -19 75c-2,10 -4,12 -23,12 -4,0 -7,0 -7,6 0,3 3,3 4,3 10,0 22,-1 33,-1 11,0 23,1 34,1 2,0 5,0 5,-5 0,-4 -2,-4 -8,-4 -16,0 -16,-2 -16,-4 0,-1 0,-3 1,-7l38 -153c3,-9 5,-11 23,-11 6,0 8,0 8,-5 0,-3 -2,-4 -4,-4 -11,0 -22,1 -33,1 -11,0 -23,-1 -34,-1 -2,0 -5,0 -5,6 0,3 2,3 7,3 9,0 17,0 17,5 0,1 0,1 -2,5l-17 69 -77 0 17 -68c2,-9 4,-11 22,-11 6,0 9,0 9,-5 0,-3 -2,-4 -4,-4 -11,0 -23,1 -34,1 -11,0 -22,-1 -33,-1 -2,0 -6,0 -6,6 0,3 2,3 8,3 9,0 16,0 16,5 0,1 0,1 -1,5l-38 153c-2,10 -4,12 -23,12 -5,0 -8,0 -8,6z"/>
  <path id="1" class="fil3" d="M10340 3470l6 0c0,-4 2,-17 5,-20 1,-1 18,-1 21,-1l43 0c-2,4 -19,27 -23,34 -19,28 -26,58 -26,79 0,2 0,12 9,12 10,0 10,-10 10,-12l0 -11c0,-11 1,-23 2,-34 1,-5 4,-23 14,-37l28 -40c2,-2 2,-3 2,-7l-51 0c-26,0 -27,-3 -28,-7l-5 0 -7 44z"/>
  <path id="2" class="fil3" d="M10443 3537c0,23 22,37 44,37 24,0 44,-18 44,-40 0,-8 -2,-18 -10,-26 -4,-5 -8,-7 -21,-15 15,-8 25,-19 25,-33 0,-20 -19,-32 -38,-32 -21,0 -38,16 -38,36 0,3 0,13 9,23 2,2 10,8 16,11 -13,6 -31,18 -31,39zm11 0c0,-12 6,-26 24,-36l26 17c6,4 16,10 16,23 0,16 -16,27 -33,27 -18,0 -33,-13 -33,-31zm4 -82c0,-13 14,-22 29,-22 15,0 29,11 29,27 0,12 -8,22 -21,29l-26 -17c-10,-6 -11,-13 -11,-17z"/>
  <path class="fil3" d="M10136 4028c0,3 3,3 4,3 11,0 22,-1 33,-1 12,0 23,1 34,1 2,0 6,0 6,-5 0,-4 -2,-4 -8,-4 -16,0 -16,-2 -16,-4 0,-2 0,-2 1,-6l19 -77 77 0 -19 75c-2,10 -4,12 -23,12 -4,0 -7,0 -7,6 0,3 3,3 4,3 10,0 22,-1 33,-1 11,0 23,1 34,1 2,0 5,0 5,-5 0,-4 -2,-4 -8,-4 -16,0 -16,-2 -16,-4 0,-1 0,-3 1,-7l38 -153c3,-9 5,-11 23,-11 6,0 8,0 8,-5 0,-3 -2,-4 -4,-4 -11,0 -22,1 -33,1 -11,0 -23,-1 -34,-1 -2,0 -5,0 -5,6 0,3 2,3 7,3 9,0 17,0 17,5 0,1 0,1 -2,5l-17 69 -77 0 17 -68c2,-9 4,-11 22,-11 6,0 9,0 9,-5 0,-3 -2,-4 -4,-4 -11,0 -23,1 -34,1 -11,0 -22,-1 -33,-1 -2,0 -6,0 -6,6 0,3 2,3 8,3 9,0 16,0 16,5 0,1 0,1 -1,5l-38 153c-2,10 -4,12 -23,12 -5,0 -8,0 -8,6z"/>
  <path id="1" class="fil3" d="M10337 4037c0,23 22,37 44,37 24,0 44,-18 44,-40 0,-8 -2,-18 -10,-26 -4,-5 -8,-7 -21,-15 15,-8 25,-19 25,-33 0,-20 -18,-32 -38,-32 -21,0 -38,16 -38,36 0,3 0,13 9,23 3,2 10,8 16,11 -13,6 -31,18 -31,39zm11 0c0,-12 7,-26 25,-36l26 17c6,4 16,10 16,23 0,16 -16,27 -34,27 -18,0 -33,-13 -33,-31zm4 -82c0,-13 14,-22 29,-22 16,0 29,11 29,27 0,12 -8,22 -21,29l-26 -17c-10,-6 -11,-13 -11,-17z"/>
  <path id="2" class="fil3" d="M10443 4037c0,23 22,37 44,37 24,0 44,-18 44,-40 0,-8 -2,-18 -10,-26 -4,-5 -8,-7 -21,-15 15,-8 25,-19 25,-33 0,-20 -19,-32 -38,-32 -21,0 -38,16 -38,36 0,3 0,13 9,23 2,2 10,8 16,11 -13,6 -31,18 -31,39zm11 0c0,-12 6,-26 24,-36l26 17c6,4 16,10 16,23 0,16 -16,27 -33,27 -18,0 -33,-13 -33,-31zm4 -82c0,-13 14,-22 29,-22 15,0 29,11 29,27 0,12 -8,22 -21,29l-26 -17c-10,-6 -11,-13 -11,-17z"/>
  <rect class="fil4 str0" x="6583" y="204" width="500" height="500"/>
  <rect class="fil4 str0" x="6583" y="704" width="500" height="500"/>
  <rect class="fil4 str0" x="6583" y="1204" width="500" height="500"/>
  <rect class="fil4 str0" x="6583" y="1704" width="500" height="500"/>
  <rect class="fil4 str0" x="7083" y="204" width="500" height="500"/>
  <rect class="fil4 str0" x="7083" y="704" width="500" height="500"/>
  <rect class="fil4 str0" x="7083" y="1204" width="500" height="500"/>
  <rect class="fil4 str0" x="7083" y="1704" width="500" height="500"/>
  <rect class="fil4 str0" x="7583" y="204" width="500" height="500"/>
  <rect class="fil4 str0" x="7583" y="704" width="500" height="500"/>
  <rect class="fil4 str0" x="7583" y="1204" width="500" height="500"/>
  <rect class="fil4 str0" x="7583" y="1704" width="500" height="500"/>
  <rect class="fil4 str0" x="8083" y="204" width="500" height="500"/>
  <rect class="fil4 str0" x="8083" y="704" width="500" height="500"/>
  <rect class="fil4 str0" x="8083" y="1204" width="500" height="500"/>
  <rect class="fil4 str0" x="8083" y="1704" width="500" height="500"/>
  <path class="fil3" d="M6639 528c0,3 3,3 4,3 11,0 23,-1 34,-1 11,0 22,1 33,1 2,0 6,0 6,-5 0,-4 -2,-4 -8,-4 -16,0 -16,-2 -16,-4 0,-2 0,-2 1,-6l19 -77 77 0 -18 75c-3,10 -4,12 -24,12 -4,0 -7,0 -7,6 0,3 3,3 4,3 10,0 22,-1 33,-1 11,0 23,1 34,1 2,0 5,0 5,-5 0,-4 -2,-4 -7,-4 -17,0 -17,-2 -17,-4 0,-1 0,-3 1,-7l39 -153c2,-9 4,-11 22,-11 6,0 8,0 8,-5 0,-3 -2,-4 -4,-4 -10,0 -22,1 -33,1 -11,0 -23,-1 -34,-1 -2,0 -5,0 -5,6 0,3 2,3 7,3 9,0 17,0 17,5 0,1 0,1 -1,5l-18 69 -77 0 17 -68c2,-9 5,-11 22,-11 6,0 9,0 9,-5 0,-3 -2,-4 -4,-4 -11,0 -22,1 -33,1 -12,0 -23,-1 -34,-1 -2,0 -6,0 -6,6 0,3 3,3 8,3 9,0 16,0 16,5 0,1 0,1 -1,5l-38 153c-2,10 -4,12 -23,12 -5,0 -8,0 -8,6z"/>
  <path id="1" class="fil3" d="M6850 448c5,0 17,0 28,-5l0 109c0,8 -1,11 -20,11l-6 0 0 6c7,0 25,0 34,0 8,0 27,0 34,0l0 -6 -7 0c-19,0 -19,-3 -19,-11l0 -118c0,-5 0,-6 -5,-6 -13,14 -32,14 -39,14l0 6z"/>
  <path id="2" class="fil3" d="M6956 448c4,0 17,0 28,-5l0 109c0,8 -1,11 -20,11l-7 0 0 6c8,0 26,0 35,0 8,0 27,0 34,0l0 -6 -7 0c-19,0 -19,-3 -19,-11l0 -118c0,-5 0,-6 -5,-6 -13,14 -32,14 -39,14l0 6z"/>
  <path class="fil3" d="M6639 1028c0,3 3,3 4,3 11,0 23,-1 34,-1 11,0 22,1 33,1 2,0 6,0 6,-5 0,-4 -2,-4 -8,-4 -16,0 -16,-2 -16,-4 0,-2 0,-2 1,-6l19 -77 77 0 -18 75c-3,10 -4,12 -24,12 -4,0 -7,0 -7,6 0,3 3,3 4,3 10,0 22,-1 33,-1 11,0 23,1 34,1 2,0 5,0 5,-5 0,-4 -2,-4 -7,-4 -17,0 -17,-2 -17,-4 0,-1 0,-3 1,-7l39 -153c2,-9 4,-11 22,-11 6,0 8,0 8,-5 0,-3 -2,-4 -4,-4 -10,0 -22,1 -33,1 -11,0 -23,-1 -34,-1 -2,0 -5,0 -5,6 0,3 2,3 7,3 9,0 17,0 17,5 0,1 0,1 -1,5l-18 69 -77 0 17 -68c2,-9 5,-11 22,-11 6,0 9,0 9,-5 0,-3 -2,-4 -4,-4 -11,0 -22,1 -33,1 -12,0 -23,-1 -34,-1 -2,0 -6,0 -6,6 0,3 3,3 8,3 9,0 16,0 16,5 0,1 0,1 -1,5l-38 153c-2,10 -4,12 -23,12 -5,0 -8,0 -8,6z"/>
  <path id="1" class="fil3" d="M6842 1069l79 0 6 -37 -6 0c-1,7 -2,16 -4,19 -2,2 -16,2 -20,2l-39 0 23 -22c33,-29 46,-41 46,-62 0,-24 -19,-41 -45,-41 -24,0 -40,20 -40,38 0,12 11,12 11,12 4,0 11,-2 11,-11 0,-5 -3,-11 -11,-11 -2,0 -2,0 -3,0 5,-13 17,-21 29,-21 19,0 28,17 28,34 0,17 -10,34 -22,47l-41 45c-2,3 -2,3 -2,8z"/>
  <path id="2" class="fil3" d="M6956 948c4,0 17,0 28,-5l0 109c0,8 -1,11 -20,11l-7 0 0 6c8,0 26,0 35,0 8,0 27,0 34,0l0 -6 -7 0c-19,0 -19,-3 -19,-11l0 -118c0,-5 0,-6 -5,-6 -13,14 -32,14 -39,14l0 6z"/>
  <path class="fil3" d="M6639 1525c0,4 3,4 4,4 11,0 23,-1 34,-1 11,0 22,1 33,1 2,0 6,0 6,-5 0,-4 -2,-4 -8,-4 -16,0 -16,-2 -16,-5 0,-1 0,-2 1,-5l19 -77 77 0 -18 75c-3,10 -4,12 -24,12 -4,0 -7,0 -7,5 0,4 3,4 4,4 10,0 22,-1 33,-1 11,0 23,1 34,1 2,0 5,0 5,-5 0,-4 -2,-4 -7,-4 -17,0 -17,-2 -17,-5 0,0 0,-2 1,-6l39 -153c2,-9 4,-11 22,-11 6,0 8,0 8,-5 0,-3 -2,-4 -4,-4 -10,0 -22,1 -33,1 -11,0 -23,-1 -34,-1 -2,0 -5,0 -5,5 0,4 2,4 7,4 9,0 17,0 17,5 0,0 0,1 -1,5l-18 69 -77 0 17 -68c2,-9 5,-11 22,-11 6,0 9,0 9,-5 0,-3 -2,-4 -4,-4 -11,0 -22,1 -33,1 -12,0 -23,-1 -34,-1 -2,0 -6,0 -6,5 0,4 3,4 8,4 9,0 16,0 16,5 0,0 0,1 -1,5l-38 153c-2,10 -4,12 -23,12 -5,0 -8,0 -8,5z"/>
  <path id="1" class="fil3" d="M6840 1538c0,20 20,33 43,33 26,0 45,-19 45,-40 0,-18 -13,-34 -35,-39 17,-5 30,-20 30,-37 0,-17 -19,-29 -39,-29 -22,0 -38,13 -38,29 0,7 5,11 11,11 6,0 11,-5 11,-11 0,-11 -10,-11 -13,-11 6,-10 20,-13 28,-13 8,0 20,5 20,24 0,2 0,15 -6,24 -6,10 -13,11 -19,11 -1,0 -6,1 -8,1 -2,0 -3,0 -3,2 0,2 1,2 5,2l9 0c18,0 25,15 25,36 0,28 -14,35 -23,35 -10,0 -25,-4 -33,-17 8,2 14,-3 14,-11 0,-8 -6,-12 -12,-12 -5,0 -12,3 -12,12z"/>
  <path id="2" class="fil3" d="M6956 1446c4,0 17,0 28,-6l0 110c0,8 -1,10 -20,10l-7 0 0 7c8,-1 26,-1 35,-1 8,0 27,0 34,1l0 -7 -7 0c-19,0 -19,-2 -19,-10l0 -119c0,-5 0,-5 -5,-5 -13,13 -32,13 -39,13l0 7z"/>
  <path class="fil3" d="M6639 2028c0,3 3,3 4,3 11,0 23,-1 34,-1 11,0 22,1 33,1 2,0 6,0 6,-5 0,-4 -2,-4 -8,-4 -16,0 -16,-2 -16,-4 0,-2 0,-2 1,-6l19 -77 77 0 -18 75c-3,10 -4,12 -24,12 -4,0 -7,0 -7,6 0,3 3,3 4,3 10,0 22,-1 33,-1 11,0 23,1 34,1 2,0 5,0 5,-5 0,-4 -2,-4 -7,-4 -17,0 -17,-2 -17,-4 0,-1 0,-3 1,-7l39 -153c2,-9 4,-11 22,-11 6,0 8,0 8,-5 0,-3 -2,-4 -4,-4 -10,0 -22,1 -33,1 -11,0 -23,-1 -34,-1 -2,0 -5,0 -5,6 0,3 2,3 7,3 9,0 17,0 17,5 0,1 0,1 -1,5l-18 69 -77 0 17 -68c2,-9 5,-11 22,-11 6,0 9,0 9,-5 0,-3 -2,-4 -4,-4 -11,0 -22,1 -33,1 -12,0 -23,-1 -34,-1 -2,0 -6,0 -6,6 0,3 3,3 8,3 9,0 16,0 16,5 0,1 0,1 -1,5l-38 153c-2,10 -4,12 -23,12 -5,0 -8,0 -8,6z"/>
  <path id="1" class="fil3" d="M6837 2034l57 0 0 19c0,7 -1,10 -16,10l-5 0 0 6c9,0 20,0 29,0 9,0 20,0 29,0l0 -6 -5 0c-16,0 -16,-3 -16,-10l0 -19 21 0 0 -6 -21 0 0 -97c0,-4 0,-5 -3,-5 -2,0 -3,0 -5,2l-65 100 0 6zm6 -6l52 -79 0 79 -52 0z"/>
  <path id="2" class="fil3" d="M6956 1948c4,0 17,0 28,-5l0 109c0,8 -1,11 -20,11l-7 0 0 6c8,0 26,0 35,0 8,0 27,0 34,0l0 -6 -7 0c-19,0 -19,-3 -19,-11l0 -118c0,-5 0,-6 -5,-6 -13,14 -32,14 -39,14l0 6z"/>
  <path class="fil3" d="M7136 528c0,3 3,3 4,3 11,0 22,-1 33,-1 12,0 23,1 34,1 2,0 6,0 6,-5 0,-4 -2,-4 -8,-4 -16,0 -16,-2 -16,-4 0,-2 0,-2 1,-6l19 -77 77 0 -19 75c-2,10 -4,12 -23,12 -4,0 -7,0 -7,6 0,3 3,3 4,3 10,0 22,-1 33,-1 11,0 23,1 34,1 2,0 5,0 5,-5 0,-4 -2,-4 -8,-4 -16,0 -16,-2 -16,-4 0,-1 0,-3 1,-7l38 -153c3,-9 5,-11 23,-11 6,0 8,0 8,-5 0,-3 -2,-4 -4,-4 -11,0 -22,1 -33,1 -11,0 -23,-1 -34,-1 -2,0 -5,0 -5,6 0,3 2,3 7,3 9,0 17,0 17,5 0,1 0,1 -2,5l-17 69 -77 0 17 -68c2,-9 4,-11 22,-11 6,0 9,0 9,-5 0,-3 -2,-4 -4,-4 -11,0 -23,1 -34,1 -11,0 -22,-1 -33,-1 -2,0 -6,0 -6,6 0,3 2,3 8,3 9,0 16,0 16,5 0,1 0,1 -1,5l-38 153c-2,10 -4,12 -23,12 -5,0 -8,0 -8,6z"/>
  <path id="1" class="fil3" d="M7347 448c4,0 17,0 28,-5l0 109c0,8 -1,11 -20,11l-7 0 0 6c8,0 26,0 35,0 8,0 27,0 34,0l0 -6 -7 0c-19,0 -19,-3 -19,-11l0 -118c0,-5 0,-6 -5,-6 -13,14 -32,14 -39,14l0 6z"/>
  <path id="2" class="fil3" d="M7445 569l78 0 6 -37 -5 0c-1,7 -3,16 -5,19 -1,2 -15,2 -20,2l-38 0 23 -22c33,-29 45,-41 45,-62 0,-24 -19,-41 -45,-41 -24,0 -39,20 -39,38 0,12 10,12 11,12 4,0 11,-2 11,-11 0,-5 -4,-11 -11,-11 -2,0 -2,0 -3,0 5,-13 16,-21 29,-21 19,0 28,17 28,34 0,17 -11,34 -22,47l-41 45c-2,3 -2,3 -2,8z"/>
  <path class="fil3" d="M7136 1028c0,3 3,3 4,3 11,0 22,-1 33,-1 12,0 23,1 34,1 2,0 6,0 6,-5 0,-4 -2,-4 -8,-4 -16,0 -16,-2 -16,-4 0,-2 0,-2 1,-6l19 -77 77 0 -19 75c-2,10 -4,12 -23,12 -4,0 -7,0 -7,6 0,3 3,3 4,3 10,0 22,-1 33,-1 11,0 23,1 34,1 2,0 5,0 5,-5 0,-4 -2,-4 -8,-4 -16,0 -16,-2 -16,-4 0,-1 0,-3 1,-7l38 -153c3,-9 5,-11 23,-11 6,0 8,0 8,-5 0,-3 -2,-4 -4,-4 -11,0 -22,1 -33,1 -11,0 -23,-1 -34,-1 -2,0 -5,0 -5,6 0,3 2,3 7,3 9,0 17,0 17,5 0,1 0,1 -2,5l-17 69 -77 0 17 -68c2,-9 4,-11 22,-11 6,0 9,0 9,-5 0,-3 -2,-4 -4,-4 -11,0 -23,1 -34,1 -11,0 -22,-1 -33,-1 -2,0 -6,0 -6,6 0,3 2,3 8,3 9,0 16,0 16,5 0,1 0,1 -1,5l-38 153c-2,10 -4,12 -23,12 -5,0 -8,0 -8,6z"/>
  <path id="1" class="fil3" d="M7339 1069l78 0 6 -37 -5 0c-1,7 -2,16 -5,19 -1,2 -15,2 -20,2l-38 0 23 -22c33,-29 45,-41 45,-62 0,-24 -19,-41 -44,-41 -24,0 -40,20 -40,38 0,12 11,12 11,12 4,0 11,-2 11,-11 0,-5 -4,-11 -11,-11 -2,0 -2,0 -3,0 5,-13 16,-21 29,-21 19,0 28,17 28,34 0,17 -10,34 -22,47l-41 45c-2,3 -2,3 -2,8z"/>
  <path id="2" class="fil3" d="M7445 1069l78 0 6 -37 -5 0c-1,7 -3,16 -5,19 -1,2 -15,2 -20,2l-38 0 23 -22c33,-29 45,-41 45,-62 0,-24 -19,-41 -45,-41 -24,0 -39,20 -39,38 0,12 10,12 11,12 4,0 11,-2 11,-11 0,-5 -4,-11 -11,-11 -2,0 -2,0 -3,0 5,-13 16,-21 29,-21 19,0 28,17 28,34 0,17 -11,34 -22,47l-41 45c-2,3 -2,3 -2,8z"/>
  <path class="fil3" d="M7136 1525c0,4 3,4 4,4 11,0 22,-1 33,-1 12,0 23,1 34,1 2,0 6,0 6,-5 0,-4 -2,-4 -8,-4 -16,0 -16,-2 -16,-5 0,-1 0,-2 1,-5l19 -77 77 0 -19 75c-2,10 -4,12 -23,12 -4,0 -7,0 -7,5 0,4 3,4 4,4 10,0 22,-1 33,-1 11,0 23,1 34,1 2,0 5,0 5,-5 0,-4 -2,-4 -8,-4 -16,0 -16,-2 -16,-5 0,0 0,-2 1,-6l38 -153c3,-9 5,-11 23,-11 6,0 8,0 8,-5 0,-3 -2,-4 -4,-4 -11,0 -22,1 -33,1 -11,0 -23,-1 -34,-1 -2,0 -5,0 -5,5 0,4 2,4 7,4 9,0 17,0 17,5 0,0 0,1 -2,5l-17 69 -77 0 17 -68c2,-9 4,-11 22,-11 6,0 9,0 9,-5 0,-3 -2,-4 -4,-4 -11,0 -23,1 -34,1 -11,0 -22,-1 -33,-1 -2,0 -6,0 -6,5 0,4 2,4 8,4 9,0 16,0 16,5 0,0 0,1 -1,5l-38 153c-2,10 -4,12 -23,12 -5,0 -8,0 -8,5z"/>
  <path id="1" class="fil3" d="M7337 1538c0,20 20,33 43,33 26,0 45,-19 45,-40 0,-18 -13,-34 -35,-39 17,-5 29,-20 29,-37 0,-17 -18,-29 -39,-29 -21,0 -37,13 -37,29 0,7 5,11 11,11 6,0 11,-5 11,-11 0,-11 -10,-11 -14,-11 7,-10 21,-13 29,-13 8,0 20,5 20,24 0,2 -1,15 -6,24 -6,10 -14,11 -19,11 -2,0 -7,1 -8,1 -2,0 -3,0 -3,2 0,2 1,2 5,2l9 0c17,0 25,15 25,36 0,28 -14,35 -24,35 -9,0 -25,-4 -32,-17 7,2 14,-3 14,-11 0,-8 -6,-12 -12,-12 -5,0 -12,3 -12,12z"/>
  <path id="2" class="fil3" d="M7445 1567l78 0 6 -37 -5 0c-1,6 -3,16 -5,19 -1,2 -15,2 -20,2l-38 0 23 -22c33,-29 45,-41 45,-62 0,-24 -19,-41 -45,-41 -24,0 -39,19 -39,38 0,12 10,12 11,12 4,0 11,-3 11,-11 0,-6 -4,-11 -11,-11 -2,0 -2,0 -3,0 5,-14 16,-22 29,-22 19,0 28,18 28,35 0,17 -11,34 -22,47l-41 45c-2,2 -2,3 -2,8z"/>
  <path class="fil3" d="M7136 2028c0,3 3,3 4,3 11,0 22,-1 33,-1 12,0 23,1 34,1 2,0 6,0 6,-5 0,-4 -2,-4 -8,-4 -16,0 -16,-2 -16,-4 0,-2 0,-2 1,-6l19 -77 77 0 -19 75c-2,10 -4,12 -23,12 -4,0 -7,0 -7,6 0,3 3,3 4,3 10,0 22,-1 33,-1 11,0 23,1 34,1 2,0 5,0 5,-5 0,-4 -2,-4 -8,-4 -16,0 -16,-2 -16,-4 0,-1 0,-3 1,-7l38 -153c3,-9 5,-11 23,-11 6,0 8,0 8,-5 0,-3 -2,-4 -4,-4 -11,0 -22,1 -33,1 -11,0 -23,-1 -34,-1 -2,0 -5,0 -5,6 0,3 2,3 7,3 9,0 17,0 17,5 0,1 0,1 -2,5l-17 69 -77 0 17 -68c2,-9 4,-11 22,-11 6,0 9,0 9,-5 0,-3 -2,-4 -4,-4 -11,0 -23,1 -34,1 -11,0 -22,-1 -33,-1 -2,0 -6,0 -6,6 0,3 2,3 8,3 9,0 16,0 16,5 0,1 0,1 -1,5l-38 153c-2,10 -4,12 -23,12 -5,0 -8,0 -8,6z"/>
  <path id="1" class="fil3" d="M7334 2034l57 0 0 19c0,7 -1,10 -17,10l-4 0 0 6c9,0 20,0 29,0 9,0 20,0 28,0l0 -6 -4 0c-16,0 -16,-3 -16,-10l0 -19 21 0 0 -6 -21 0 0 -97c0,-4 0,-5 -4,-5 -1,0 -2,0 -4,2l-65 100 0 6zm6 -6l52 -79 0 79 -52 0z"/>
  <path id="2" class="fil3" d="M7445 2069l78 0 6 -37 -5 0c-1,7 -3,16 -5,19 -1,2 -15,2 -20,2l-38 0 23 -22c33,-29 45,-41 45,-62 0,-24 -19,-41 -45,-41 -24,0 -39,20 -39,38 0,12 10,12 11,12 4,0 11,-2 11,-11 0,-5 -4,-11 -11,-11 -2,0 -2,0 -3,0 5,-13 16,-21 29,-21 19,0 28,17 28,34 0,17 -11,34 -22,47l-41 45c-2,3 -2,3 -2,8z"/>
  <path class="fil3" d="M7635 525c0,4 3,4 4,4 11,0 23,-1 34,-1 11,0 22,1 33,1 2,0 6,0 6,-5 0,-4 -2,-4 -8,-4 -16,0 -16,-2 -16,-5 0,-1 0,-2 1,-5l19 -77 77 0 -18 75c-3,10 -4,12 -24,12 -4,0 -7,0 -7,5 0,4 3,4 4,4 10,0 22,-1 33,-1 11,0 23,1 34,1 2,0 5,0 5,-5 0,-4 -2,-4 -7,-4 -17,0 -17,-2 -17,-5 0,0 0,-2 1,-6l39 -153c2,-9 4,-11 22,-11 6,0 8,0 8,-5 0,-3 -2,-4 -4,-4 -10,0 -22,1 -33,1 -11,0 -23,-1 -34,-1 -2,0 -5,0 -5,5 0,4 2,4 7,4 9,0 17,0 17,5 0,0 0,1 -1,5l-18 69 -77 0 17 -68c2,-9 5,-11 22,-11 6,0 9,0 9,-5 0,-3 -2,-4 -4,-4 -11,0 -22,1 -33,1 -12,0 -23,-1 -34,-1 -2,0 -6,0 -6,5 0,4 3,4 8,4 9,0 16,0 16,5 0,0 0,1 -1,5l-38 153c-2,10 -4,12 -23,12 -5,0 -8,0 -8,5z"/>
  <path id="1" class="fil3" d="M7846 446c5,0 17,0 28,-6l0 110c0,8 -1,10 -20,10l-6 0 0 7c7,-1 25,-1 34,-1 8,0 27,0 34,1l0 -7 -7 0c-19,0 -19,-2 -19,-10l0 -119c0,-5 0,-5 -5,-5 -13,13 -32,13 -39,13l0 7z"/>
  <path id="2" class="fil3" d="M7942 538c0,20 20,33 43,33 26,0 45,-19 45,-40 0,-18 -13,-34 -35,-39 17,-5 29,-20 29,-37 0,-17 -18,-29 -39,-29 -21,0 -37,13 -37,29 0,7 5,11 11,11 6,0 11,-5 11,-11 0,-11 -10,-11 -14,-11 7,-10 21,-13 29,-13 8,0 20,5 20,24 0,2 -1,15 -6,24 -6,10 -14,11 -19,11 -2,0 -7,1 -8,1 -2,0 -3,0 -3,2 0,2 1,2 5,2l9 0c17,0 25,15 25,36 0,28 -14,35 -24,35 -9,0 -25,-4 -32,-17 7,2 14,-3 14,-11 0,-8 -6,-12 -12,-12 -5,0 -12,3 -12,12z"/>
  <path class="fil3" d="M7635 1025c0,4 3,4 4,4 11,0 23,-1 34,-1 11,0 22,1 33,1 2,0 6,0 6,-5 0,-4 -2,-4 -8,-4 -16,0 -16,-2 -16,-5 0,-1 0,-2 1,-5l19 -77 77 0 -18 75c-3,10 -4,12 -24,12 -4,0 -7,0 -7,5 0,4 3,4 4,4 10,0 22,-1 33,-1 11,0 23,1 34,1 2,0 5,0 5,-5 0,-4 -2,-4 -7,-4 -17,0 -17,-2 -17,-5 0,0 0,-2 1,-6l39 -153c2,-9 4,-11 22,-11 6,0 8,0 8,-5 0,-3 -2,-4 -4,-4 -10,0 -22,1 -33,1 -11,0 -23,-1 -34,-1 -2,0 -5,0 -5,5 0,4 2,4 7,4 9,0 17,0 17,5 0,0 0,1 -1,5l-18 69 -77 0 17 -68c2,-9 5,-11 22,-11 6,0 9,0 9,-5 0,-3 -2,-4 -4,-4 -11,0 -22,1 -33,1 -12,0 -23,-1 -34,-1 -2,0 -6,0 -6,5 0,4 3,4 8,4 9,0 16,0 16,5 0,0 0,1 -1,5l-38 153c-2,10 -4,12 -23,12 -5,0 -8,0 -8,5z"/>
  <path id="1" class="fil3" d="M7838 1067l79 0 6 -37 -6 0c-1,6 -2,16 -4,19 -2,2 -16,2 -21,2l-38 0 23 -22c33,-29 46,-41 46,-62 0,-24 -20,-41 -45,-41 -24,0 -40,19 -40,38 0,12 11,12 11,12 4,0 11,-3 11,-11 0,-6 -3,-11 -11,-11 -2,0 -2,0 -3,0 5,-14 17,-22 29,-22 19,0 28,18 28,35 0,17 -10,34 -22,47l-41 45c-2,2 -2,3 -2,8z"/>
  <path id="2" class="fil3" d="M7942 1038c0,20 20,33 43,33 26,0 45,-19 45,-40 0,-18 -13,-34 -35,-39 17,-5 29,-20 29,-37 0,-17 -18,-29 -39,-29 -21,0 -37,13 -37,29 0,7 5,11 11,11 6,0 11,-5 11,-11 0,-11 -10,-11 -14,-11 7,-10 21,-13 29,-13 8,0 20,5 20,24 0,2 -1,15 -6,24 -6,10 -14,11 -19,11 -2,0 -7,1 -8,1 -2,0 -3,0 -3,2 0,2 1,2 5,2l9 0c17,0 25,15 25,36 0,28 -14,35 -24,35 -9,0 -25,-4 -32,-17 7,2 14,-3 14,-11 0,-8 -6,-12 -12,-12 -5,0 -12,3 -12,12z"/>
  <path class="fil3" d="M7635 1525c0,4 3,4 4,4 11,0 23,-1 34,-1 11,0 22,1 33,1 2,0 6,0 6,-5 0,-4 -2,-4 -8,-4 -16,0 -16,-2 -16,-5 0,-1 0,-2 1,-5l19 -77 77 0 -18 75c-3,10 -4,12 -24,12 -4,0 -7,0 -7,5 0,4 3,4 4,4 10,0 22,-1 33,-1 11,0 23,1 34,1 2,0 5,0 5,-5 0,-4 -2,-4 -7,-4 -17,0 -17,-2 -17,-5 0,0 0,-2 1,-6l39 -153c2,-9 4,-11 22,-11 6,0 8,0 8,-5 0,-3 -2,-4 -4,-4 -10,0 -22,1 -33,1 -11,0 -23,-1 -34,-1 -2,0 -5,0 -5,5 0,4 2,4 7,4 9,0 17,0 17,5 0,0 0,1 -1,5l-18 69 -77 0 17 -68c2,-9 5,-11 22,-11 6,0 9,0 9,-5 0,-3 -2,-4 -4,-4 -11,0 -22,1 -33,1 -12,0 -23,-1 -34,-1 -2,0 -6,0 -6,5 0,4 3,4 8,4 9,0 16,0 16,5 0,0 0,1 -1,5l-38 153c-2,10 -4,12 -23,12 -5,0 -8,0 -8,5z"/>
  <path id="1" class="fil3" d="M7836 1538c0,20 20,33 43,33 26,0 45,-19 45,-40 0,-18 -13,-34 -35,-39 17,-5 30,-20 30,-37 0,-17 -19,-29 -39,-29 -22,0 -38,13 -38,29 0,7 5,11 11,11 6,0 11,-5 11,-11 0,-11 -10,-11 -13,-11 6,-10 20,-13 28,-13 8,0 20,5 20,24 0,2 0,15 -6,24 -6,10 -13,11 -19,11 -1,0 -6,1 -8,1 -2,0 -3,0 -3,2 0,2 1,2 5,2l9 0c18,0 25,15 25,36 0,28 -14,35 -23,35 -10,0 -25,-4 -33,-17 8,2 14,-3 14,-11 0,-8 -6,-12 -12,-12 -5,0 -12,3 -12,12z"/>
  <path id="2" class="fil3" d="M7942 1538c0,20 20,33 43,33 26,0 45,-19 45,-40 0,-18 -13,-34 -35,-39 17,-5 29,-20 29,-37 0,-17 -18,-29 -39,-29 -21,0 -37,13 -37,29 0,7 5,11 11,11 6,0 11,-5 11,-11 0,-11 -10,-11 -14,-11 7,-10 21,-13 29,-13 8,0 20,5 20,24 0,2 -1,15 -6,24 -6,10 -14,11 -19,11 -2,0 -7,1 -8,1 -2,0 -3,0 -3,2 0,2 1,2 5,2l9 0c17,0 25,15 25,36 0,28 -14,35 -24,35 -9,0 -25,-4 -32,-17 7,2 14,-3 14,-11 0,-8 -6,-12 -12,-12 -5,0 -12,3 -12,12z"/>
  <path class="fil3" d="M7635 2025c0,4 3,4 4,4 11,0 23,-1 34,-1 11,0 22,1 33,1 2,0 6,0 6,-5 0,-4 -2,-4 -8,-4 -16,0 -16,-2 -16,-5 0,-1 0,-2 1,-5l19 -77 77 0 -18 75c-3,10 -4,12 -24,12 -4,0 -7,0 -7,5 0,4 3,4 4,4 10,0 22,-1 33,-1 11,0 23,1 34,1 2,0 5,0 5,-5 0,-4 -2,-4 -7,-4 -17,0 -17,-2 -17,-5 0,0 0,-2 1,-6l39 -153c2,-9 4,-11 22,-11 6,0 8,0 8,-5 0,-3 -2,-4 -4,-4 -10,0 -22,1 -33,1 -11,0 -23,-1 -34,-1 -2,0 -5,0 -5,5 0,4 2,4 7,4 9,0 17,0 17,5 0,0 0,1 -1,5l-18 69 -77 0 17 -68c2,-9 5,-11 22,-11 6,0 9,0 9,-5 0,-3 -2,-4 -4,-4 -11,0 -22,1 -33,1 -12,0 -23,-1 -34,-1 -2,0 -6,0 -6,5 0,4 3,4 8,4 9,0 16,0 16,5 0,0 0,1 -1,5l-38 153c-2,10 -4,12 -23,12 -5,0 -8,0 -8,5z"/>
  <path id="1" class="fil3" d="M7833 2032l57 0 0 18c0,8 -1,10 -16,10l-5 0 0 7c9,-1 20,-1 29,-1 9,0 20,0 29,1l0 -7 -5 0c-16,0 -16,-2 -16,-10l0 -18 21 0 0 -7 -21 0 0 -96c0,-4 0,-5 -3,-5 -2,0 -3,0 -5,2l-65 99 0 7zm6 -7l52 -79 0 79 -52 0z"/>
  <path id="2" class="fil3" d="M7942 2038c0,20 20,33 43,33 26,0 45,-19 45,-40 0,-18 -13,-34 -35,-39 17,-5 29,-20 29,-37 0,-17 -18,-29 -39,-29 -21,0 -37,13 -37,29 0,7 5,11 11,11 6,0 11,-5 11,-11 0,-11 -10,-11 -14,-11 7,-10 21,-13 29,-13 8,0 20,5 20,24 0,2 -1,15 -6,24 -6,10 -14,11 -19,11 -2,0 -7,1 -8,1 -2,0 -3,0 -3,2 0,2 1,2 5,2l9 0c17,0 25,15 25,36 0,28 -14,35 -24,35 -9,0 -25,-4 -32,-17 7,2 14,-3 14,-11 0,-8 -6,-12 -12,-12 -5,0 -12,3 -12,12z"/>
  <path class="fil3" d="M8134 528c0,3 3,3 4,3 11,0 22,-1 33,-1 11,0 23,1 34,1 2,0 5,0 5,-5 0,-4 -2,-4 -7,-4 -17,0 -17,-2 -17,-4 0,-2 0,-2 1,-6l19 -77 78 0 -19 75c-2,10 -4,12 -23,12 -5,0 -8,0 -8,6 0,3 3,3 4,3 11,0 23,-1 34,-1 11,0 22,1 33,1 2,0 6,0 6,-5 0,-4 -2,-4 -8,-4 -16,0 -16,-2 -16,-4 0,-1 0,-3 1,-7l38 -153c2,-9 5,-11 22,-11 6,0 9,0 9,-5 0,-3 -2,-4 -4,-4 -11,0 -22,1 -33,1 -12,0 -23,-1 -34,-1 -2,0 -6,0 -6,6 0,3 3,3 8,3 9,0 16,0 16,5 0,1 0,1 -1,5l-17 69 -77 0 17 -68c2,-9 4,-11 22,-11 6,0 8,0 8,-5 0,-3 -2,-4 -4,-4 -10,0 -22,1 -33,1 -11,0 -23,-1 -34,-1 -1,0 -5,0 -5,6 0,3 2,3 7,3 9,0 17,0 17,5 0,1 0,1 -1,5l-38 153c-3,10 -4,12 -24,12 -4,0 -7,0 -7,6z"/>
  <path id="1" class="fil3" d="M8345 448c4,0 17,0 28,-5l0 109c0,8 -1,11 -20,11l-7 0 0 6c8,0 26,0 34,0 9,0 27,0 35,0l0 -6 -7 0c-19,0 -20,-3 -20,-11l0 -118c0,-5 0,-6 -5,-6 -13,14 -31,14 -38,14l0 6z"/>
  <path id="2" class="fil3" d="M8438 534l56 0 0 19c0,7 0,10 -16,10l-4 0 0 6c8,0 19,0 28,0 9,0 20,0 29,0l0 -6 -5 0c-15,0 -16,-3 -16,-10l0 -19 22 0 0 -6 -22 0 0 -97c0,-4 0,-5 -3,-5 -2,0 -3,0 -4,2l-65 100 0 6zm6 -6l51 -79 0 79 -51 0z"/>
  <path class="fil3" d="M8134 1028c0,3 3,3 4,3 11,0 22,-1 33,-1 11,0 23,1 34,1 2,0 5,0 5,-5 0,-4 -2,-4 -7,-4 -17,0 -17,-2 -17,-4 0,-2 0,-2 1,-6l19 -77 78 0 -19 75c-2,10 -4,12 -23,12 -5,0 -8,0 -8,6 0,3 3,3 4,3 11,0 23,-1 34,-1 11,0 22,1 33,1 2,0 6,0 6,-5 0,-4 -2,-4 -8,-4 -16,0 -16,-2 -16,-4 0,-1 0,-3 1,-7l38 -153c2,-9 5,-11 22,-11 6,0 9,0 9,-5 0,-3 -2,-4 -4,-4 -11,0 -22,1 -33,1 -12,0 -23,-1 -34,-1 -2,0 -6,0 -6,6 0,3 3,3 8,3 9,0 16,0 16,5 0,1 0,1 -1,5l-17 69 -77 0 17 -68c2,-9 4,-11 22,-11 6,0 8,0 8,-5 0,-3 -2,-4 -4,-4 -10,0 -22,1 -33,1 -11,0 -23,-1 -34,-1 -1,0 -5,0 -5,6 0,3 2,3 7,3 9,0 17,0 17,5 0,1 0,1 -1,5l-38 153c-3,10 -4,12 -24,12 -4,0 -7,0 -7,6z"/>
  <path id="1" class="fil3" d="M8337 1069l78 0 6 -37 -5 0c-1,7 -3,16 -5,19 -1,2 -15,2 -20,2l-38 0 22 -22c33,-29 46,-41 46,-62 0,-24 -19,-41 -45,-41 -24,0 -39,20 -39,38 0,12 10,12 11,12 3,0 11,-2 11,-11 0,-5 -4,-11 -11,-11 -2,0 -3,0 -3,0 5,-13 16,-21 28,-21 20,0 29,17 29,34 0,17 -11,34 -22,47l-41 45c-2,3 -2,3 -2,8z"/>
  <path id="2" class="fil3" d="M8438 1034l56 0 0 19c0,7 0,10 -16,10l-4 0 0 6c8,0 19,0 28,0 9,0 20,0 29,0l0 -6 -5 0c-15,0 -16,-3 -16,-10l0 -19 22 0 0 -6 -22 0 0 -97c0,-4 0,-5 -3,-5 -2,0 -3,0 -4,2l-65 100 0 6zm6 -6l51 -79 0 79 -51 0z"/>
  <path class="fil3" d="M8134 1525c0,4 3,4 4,4 11,0 22,-1 33,-1 11,0 23,1 34,1 2,0 5,0 5,-5 0,-4 -2,-4 -7,-4 -17,0 -17,-2 -17,-5 0,-1 0,-2 1,-5l19 -77 78 0 -19 75c-2,10 -4,12 -23,12 -5,0 -8,0 -8,5 0,4 3,4 4,4 11,0 23,-1 34,-1 11,0 22,1 33,1 2,0 6,0 6,-5 0,-4 -2,-4 -8,-4 -16,0 -16,-2 -16,-5 0,0 0,-2 1,-6l38 -153c2,-9 5,-11 22,-11 6,0 9,0 9,-5 0,-3 -2,-4 -4,-4 -11,0 -22,1 -33,1 -12,0 -23,-1 -34,-1 -2,0 -6,0 -6,5 0,4 3,4 8,4 9,0 16,0 16,5 0,0 0,1 -1,5l-17 69 -77 0 17 -68c2,-9 4,-11 22,-11 6,0 8,0 8,-5 0,-3 -2,-4 -4,-4 -10,0 -22,1 -33,1 -11,0 -23,-1 -34,-1 -1,0 -5,0 -5,5 0,4 2,4 7,4 9,0 17,0 17,5 0,0 0,1 -1,5l-38 153c-3,10 -4,12 -24,12 -4,0 -7,0 -7,5z"/>
  <path id="1" class="fil3" d="M8335 1538c0,20 20,33 43,33 25,0 45,-19 45,-40 0,-18 -14,-34 -36,-39 18,-5 30,-20 30,-37 0,-17 -19,-29 -39,-29 -21,0 -37,13 -37,29 0,7 4,11 10,11 7,0 11,-5 11,-11 0,-11 -10,-11 -13,-11 7,-10 21,-13 28,-13 9,0 21,5 21,24 0,2 -1,15 -6,24 -7,10 -14,11 -19,11 -2,0 -7,1 -8,1 -2,0 -4,0 -4,2 0,2 2,2 5,2l10 0c17,0 25,15 25,36 0,28 -15,35 -24,35 -9,0 -25,-4 -32,-17 7,2 14,-3 14,-11 0,-8 -6,-12 -12,-12 -5,0 -12,3 -12,12z"/>
  <path id="2" class="fil3" d="M8438 1532l56 0 0 18c0,8 0,10 -16,10l-4 0 0 7c8,-1 19,-1 28,-1 9,0 20,0 29,1l0 -7 -5 0c-15,0 -16,-2 -16,-10l0 -18 22 0 0 -7 -22 0 0 -96c0,-4 0,-5 -3,-5 -2,0 -3,0 -4,2l-65 99 0 7zm6 -7l51 -79 0 79 -51 0z"/>
  <path class="fil3" d="M8134 2028c0,3 3,3 4,3 11,0 22,-1 33,-1 11,0 23,1 34,1 2,0 5,0 5,-5 0,-4 -2,-4 -7,-4 -17,0 -17,-2 -17,-4 0,-2 0,-2 1,-6l19 -77 78 0 -19 75c-2,10 -4,12 -23,12 -5,0 -8,0 -8,6 0,3 3,3 4,3 11,0 23,-1 34,-1 11,0 22,1 33,1 2,0 6,0 6,-5 0,-4 -2,-4 -8,-4 -16,0 -16,-2 -16,-4 0,-1 0,-3 1,-7l38 -153c2,-9 5,-11 22,-11 6,0 9,0 9,-5 0,-3 -2,-4 -4,-4 -11,0 -22,1 -33,1 -12,0 -23,-1 -34,-1 -2,0 -6,0 -6,6 0,3 3,3 8,3 9,0 16,0 16,5 0,1 0,1 -1,5l-17 69 -77 0 17 -68c2,-9 4,-11 22,-11 6,0 8,0 8,-5 0,-3 -2,-4 -4,-4 -10,0 -22,1 -33,1 -11,0 -23,-1 -34,-1 -1,0 -5,0 -5,6 0,3 2,3 7,3 9,0 17,0 17,5 0,1 0,1 -1,5l-38 153c-3,10 -4,12 -24,12 -4,0 -7,0 -7,6z"/>
  <path id="1" class="fil3" d="M8332 2034l56 0 0 19c0,7 0,10 -16,10l-4 0 0 6c8,0 19,0 28,0 9,0 20,0 29,0l0 -6 -4 0c-16,0 -16,-3 -16,-10l0 -19 21 0 0 -6 -21 0 0 -97c0,-4 0,-5 -4,-5 -2,0 -2,0 -4,2l-65 100 0 6zm6 -6l52 -79 0 79 -52 0z"/>
  <path id="2" class="fil3" d="M8438 2034l56 0 0 19c0,7 0,10 -16,10l-4 0 0 6c8,0 19,0 28,0 9,0 20,0 29,0l0 -6 -5 0c-15,0 -16,-3 -16,-10l0 -19 22 0 0 -6 -22 0 0 -97c0,-4 0,-5 -3,-5 -2,0 -3,0 -4,2l-65 100 0 6zm6 -6l51 -79 0 79 -51 0z"/>
  <path class="fil3" d="M8675 2535c0,4 3,4 4,4 11,0 23,-1 34,-1 11,0 22,1 33,1 2,0 6,0 6,-5 0,-4 -2,-4 -8,-4 -16,0 -16,-2 -16,-5 0,-1 0,-2 1,-5l19 -77 77 0 -18 75c-3,10 -4,12 -24,12 -4,0 -7,0 -7,5 0,4 3,4 4,4 10,0 22,-1 33,-1 11,0 23,1 34,1 2,0 5,0 5,-5 0,-4 -2,-4 -7,-4 -17,0 -17,-2 -17,-5 0,0 0,-2 1,-6l39 -153c2,-9 4,-11 22,-11 6,0 8,0 8,-5 0,-3 -2,-4 -4,-4 -10,0 -22,1 -33,1 -11,0 -23,-1 -34,-1 -2,0 -5,0 -5,5 0,4 2,4 7,4 9,0 17,0 17,5 0,0 0,1 -1,5l-18 69 -77 0 17 -68c2,-9 5,-11 22,-11 6,0 9,0 9,-5 0,-3 -2,-4 -4,-4 -11,0 -22,1 -33,1 -12,0 -23,-1 -34,-1 -2,0 -6,0 -6,5 0,4 3,4 8,4 9,0 16,0 16,5 0,0 0,1 -1,5l-38 153c-2,10 -4,12 -23,12 -5,0 -8,0 -8,5z"/>
  <path id="1" class="fil3" d="M8876 2548c0,20 20,33 43,33 26,0 45,-19 45,-40 0,-18 -13,-34 -35,-39 17,-5 30,-20 30,-37 0,-17 -19,-29 -39,-29 -22,0 -38,13 -38,29 0,7 5,11 11,11 6,0 11,-5 11,-11 0,-11 -10,-11 -13,-11 6,-10 20,-13 28,-13 8,0 20,5 20,24 0,2 0,15 -6,24 -6,10 -13,11 -19,11 -1,0 -6,1 -8,1 -2,0 -3,0 -3,2 0,2 1,2 5,2l9 0c18,0 25,15 25,36 0,28 -14,35 -23,35 -10,0 -25,-4 -33,-17 8,2 14,-3 14,-11 0,-8 -6,-12 -12,-12 -5,0 -12,3 -12,12z"/>
  <path id="2" class="fil3" d="M8982 2548c0,20 20,33 43,33 26,0 45,-19 45,-40 0,-18 -13,-34 -35,-39 17,-5 29,-20 29,-37 0,-17 -18,-29 -39,-29 -21,0 -37,13 -37,29 0,7 5,11 11,11 6,0 11,-5 11,-11 0,-11 -10,-11 -14,-11 7,-10 21,-13 29,-13 8,0 20,5 20,24 0,2 -1,15 -6,24 -6,10 -14,11 -19,11 -2,0 -7,1 -8,1 -2,0 -3,0 -3,2 0,2 1,2 5,2l9 0c17,0 25,15 25,36 0,28 -14,35 -24,35 -9,0 -25,-4 -32,-17 7,2 14,-3 14,-11 0,-8 -6,-12 -12,-12 -5,0 -12,3 -12,12z"/>
  <path class="fil3" d="M8675 3015c0,3 3,3 4,3 11,0 23,-1 34,-1 11,0 22,1 33,1 2,0 6,0 6,-5 0,-4 -2,-4 -8,-4 -16,0 -16,-2 -16,-5 0,-1 0,-1 1,-5l19 -77 77 0 -18 75c-3,10 -4,12 -24,12 -4,0 -7,0 -7,6 0,3 3,3 4,3 10,0 22,-1 33,-1 11,0 23,1 34,1 2,0 5,0 5,-5 0,-4 -2,-4 -7,-4 -17,0 -17,-2 -17,-5 0,0 0,-2 1,-6l39 -153c2,-9 4,-11 22,-11 6,0 8,0 8,-5 0,-3 -2,-4 -4,-4 -10,0 -22,1 -33,1 -11,0 -23,-1 -34,-1 -2,0 -5,0 -5,6 0,3 2,3 7,3 9,0 17,0 17,5 0,1 0,1 -1,5l-18 69 -77 0 17 -68c2,-9 5,-11 22,-11 6,0 9,0 9,-5 0,-3 -2,-4 -4,-4 -11,0 -22,1 -33,1 -12,0 -23,-1 -34,-1 -2,0 -6,0 -6,6 0,3 3,3 8,3 9,0 16,0 16,5 0,1 0,1 -1,5l-38 153c-2,10 -4,12 -23,12 -5,0 -8,0 -8,6z"/>
  <path id="1" class="fil3" d="M8873 3021l57 0 0 19c0,7 -1,10 -16,10l-5 0 0 6c9,0 20,0 29,0 9,0 20,0 29,0l0 -6 -5 0c-16,0 -16,-3 -16,-10l0 -19 21 0 0 -6 -21 0 0 -97c0,-4 0,-5 -3,-5 -2,0 -3,0 -5,2l-65 100 0 6zm6 -6l52 -79 0 79 -52 0z"/>
  <path id="2" class="fil3" d="M8982 3028c0,19 20,33 43,33 26,0 45,-19 45,-41 0,-17 -13,-34 -35,-38 17,-6 29,-21 29,-38 0,-17 -18,-29 -39,-29 -21,0 -37,13 -37,29 0,7 5,11 11,11 6,0 11,-5 11,-11 0,-10 -10,-10 -14,-10 7,-11 21,-14 29,-14 8,0 20,5 20,24 0,3 -1,15 -6,24 -6,10 -14,11 -19,11 -2,1 -7,1 -8,1 -2,0 -3,0 -3,2 0,3 1,3 5,3l9 0c17,0 25,14 25,35 0,29 -14,35 -24,35 -9,0 -25,-4 -32,-16 7,1 14,-4 14,-12 0,-7 -6,-12 -12,-12 -5,0 -12,3 -12,13z"/>
  <path class="fil3" d="M9154 2515c0,3 3,3 4,3 10,0 22,-1 33,-1 11,0 23,1 34,1 2,0 5,0 5,-5 0,-4 -2,-4 -7,-4 -17,0 -17,-2 -17,-5 0,-1 0,-1 1,-5l19 -77 78 0 -19 75c-2,10 -4,12 -23,12 -5,0 -8,0 -8,6 0,3 3,3 4,3 11,0 23,-1 34,-1 11,0 22,1 33,1 2,0 6,0 6,-5 0,-4 -2,-4 -8,-4 -16,0 -16,-2 -16,-5 0,0 0,-2 1,-6l38 -153c2,-9 5,-11 22,-11 6,0 9,0 9,-5 0,-3 -2,-4 -4,-4 -11,0 -22,1 -33,1 -12,0 -23,-1 -34,-1 -2,0 -6,0 -6,6 0,3 3,3 8,3 9,0 16,0 16,5 0,1 0,1 -1,5l-17 69 -77 0 17 -68c2,-9 4,-11 22,-11 6,0 8,0 8,-5 0,-3 -2,-4 -4,-4 -10,0 -22,1 -33,1 -11,0 -23,-1 -34,-1 -2,0 -5,0 -5,6 0,3 2,3 7,3 9,0 17,0 17,5 0,1 0,1 -1,5l-38 153c-3,10 -4,12 -24,12 -4,0 -7,0 -7,6z"/>
  <path id="1" class="fil3" d="M9355 2528c0,19 20,33 43,33 25,0 45,-19 45,-41 0,-17 -14,-34 -36,-38 18,-6 30,-21 30,-38 0,-17 -19,-29 -39,-29 -21,0 -37,13 -37,29 0,7 4,11 10,11 7,0 11,-5 11,-11 0,-10 -10,-10 -13,-10 7,-11 21,-14 28,-14 9,0 21,5 21,24 0,3 -1,15 -6,24 -7,10 -14,11 -19,11 -2,1 -7,1 -8,1 -2,0 -4,0 -4,2 0,3 2,3 5,3l10 0c17,0 25,14 25,35 0,29 -15,35 -24,35 -9,0 -25,-4 -32,-16 7,1 14,-4 14,-12 0,-7 -6,-12 -12,-12 -5,0 -12,3 -12,13z"/>
  <path id="2" class="fil3" d="M9458 2521l56 0 0 19c0,7 0,10 -16,10l-4 0 0 6c8,0 19,0 28,0 9,0 20,0 29,0l0 -6 -5 0c-15,0 -16,-3 -16,-10l0 -19 22 0 0 -6 -22 0 0 -97c0,-4 0,-5 -3,-5 -2,0 -3,0 -4,2l-65 100 0 6zm6 -6l51 -79 0 79 -51 0z"/>
  <path class="fil3" d="M9154 3017c0,3 3,3 4,3 10,0 22,0 33,0 11,0 23,0 34,0 2,0 5,0 5,-5 0,-3 -2,-3 -7,-3 -17,0 -17,-3 -17,-5 0,-1 0,-2 1,-6l19 -77 78 0 -19 76c-2,9 -4,12 -23,12 -5,0 -8,0 -8,5 0,3 3,3 4,3 11,0 23,0 34,0 11,0 22,0 33,0 2,0 6,0 6,-5 0,-3 -2,-3 -8,-3 -16,0 -16,-3 -16,-5 0,0 0,-2 1,-7l38 -152c2,-9 5,-12 22,-12 6,0 9,0 9,-5 0,-3 -2,-3 -4,-3 -11,0 -22,0 -33,0 -12,0 -23,0 -34,0 -2,0 -6,0 -6,5 0,3 3,3 8,3 9,0 16,0 16,5 0,1 0,2 -1,6l-17 69 -77 0 17 -68c2,-9 4,-12 22,-12 6,0 8,0 8,-5 0,-3 -2,-3 -4,-3 -10,0 -22,0 -33,0 -11,0 -23,0 -34,0 -2,0 -5,0 -5,5 0,3 2,3 7,3 9,0 17,0 17,5 0,1 0,2 -1,6l-38 153c-3,9 -4,12 -24,12 -4,0 -7,0 -7,5z"/>
  <path id="1" class="fil3" d="M9352 3024l56 0 0 18c0,8 0,10 -16,10l-4 0 0 6c8,0 19,0 28,0 9,0 20,0 29,0l0 -6 -4 0c-16,0 -16,-2 -16,-10l0 -18 21 0 0 -7 -21 0 0 -96c0,-5 0,-6 -4,-6 -2,0 -2,0 -4,3l-65 99 0 7zm6 -7l52 -79 0 79 -52 0z"/>
  <path id="2" class="fil3" d="M9458 3024l56 0 0 18c0,8 0,10 -16,10l-4 0 0 6c8,0 19,0 28,0 9,0 20,0 29,0l0 -6 -5 0c-15,0 -16,-2 -16,-10l0 -18 22 0 0 -7 -22 0 0 -96c0,-5 0,-6 -3,-6 -2,0 -3,0 -4,3l-65 99 0 7zm6 -7l51 -79 0 79 -51 0z"/>
  <path class="fil3" d="M6773 2454c0,21 1,47 13,68 12,23 33,29 47,29 15,0 36,-6 49,-33 9,-19 10,-41 10,-64 0,-22 -1,-45 -11,-66 -13,-27 -36,-31 -48,-31 -17,0 -38,7 -49,33 -9,20 -11,42 -11,64zm24 -3c0,-18 0,-37 2,-52 5,-34 26,-36 34,-36 9,0 27,5 33,33 3,16 3,37 3,55 0,21 0,40 -3,58 -5,27 -21,36 -33,36 -11,0 -28,-7 -33,-35 -3,-16 -3,-42 -3,-59z"/>
  <path class="fil3" d="M6773 3454c0,21 1,47 13,68 12,23 33,29 47,29 15,0 36,-6 49,-33 9,-19 10,-41 10,-64 0,-22 -1,-45 -11,-66 -13,-27 -36,-31 -48,-31 -17,0 -38,7 -49,33 -9,20 -11,42 -11,64zm24 -3c0,-18 0,-37 2,-52 5,-34 26,-36 34,-36 9,0 27,5 33,33 3,16 3,37 3,55 0,21 0,40 -3,58 -5,27 -21,36 -33,36 -11,0 -28,-7 -33,-35 -3,-16 -3,-42 -3,-59z"/>
  <path class="fil3" d="M6773 2954c0,21 1,47 13,68 12,23 33,29 47,29 15,0 36,-6 49,-33 9,-19 10,-41 10,-64 0,-22 -1,-45 -11,-66 -13,-27 -36,-31 -48,-31 -17,0 -38,7 -49,33 -9,20 -11,42 -11,64zm24 -3c0,-18 0,-37 2,-52 5,-34 26,-36 34,-36 9,0 27,5 33,33 3,16 3,37 3,55 0,21 0,40 -3,58 -5,27 -21,36 -33,36 -11,0 -28,-7 -33,-35 -3,-16 -3,-42 -3,-59z"/>
  <path class="fil3" d="M6773 3954c0,21 1,47 13,68 12,23 33,29 47,29 15,0 36,-6 49,-33 9,-19 10,-41 10,-64 0,-22 -1,-45 -11,-66 -13,-27 -36,-31 -48,-31 -17,0 -38,7 -49,33 -9,20 -11,42 -11,64zm24 -3c0,-18 0,-37 2,-52 5,-34 26,-36 34,-36 9,0 27,5 33,33 3,16 3,37 3,55 0,21 0,40 -3,58 -5,27 -21,36 -33,36 -11,0 -28,-7 -33,-35 -3,-16 -3,-42 -3,-59z"/>
  <path class="fil3" d="M7273 2454c0,21 1,47 13,68 12,23 33,29 47,29 15,0 36,-6 49,-33 9,-19 10,-41 10,-64 0,-22 -1,-45 -11,-66 -13,-27 -36,-31 -48,-31 -17,0 -38,7 -49,33 -9,20 -11,42 -11,64zm24 -3c0,-18 0,-37 2,-52 5,-34 26,-36 34,-36 9,0 27,5 33,33 3,16 3,37 3,55 0,21 0,40 -3,58 -5,27 -21,36 -33,36 -11,0 -28,-7 -33,-35 -3,-16 -3,-42 -3,-59z"/>
  <path class="fil3" d="M7273 3454c0,21 1,47 13,68 12,23 33,29 47,29 15,0 36,-6 49,-33 9,-19 10,-41 10,-64 0,-22 -1,-45 -11,-66 -13,-27 -36,-31 -48,-31 -17,0 -38,7 -49,33 -9,20 -11,42 -11,64zm24 -3c0,-18 0,-37 2,-52 5,-34 26,-36 34,-36 9,0 27,5 33,33 3,16 3,37 3,55 0,21 0,40 -3,58 -5,27 -21,36 -33,36 -11,0 -28,-7 -33,-35 -3,-16 -3,-42 -3,-59z"/>
  <path class="fil3" d="M7273 2954c0,21 1,47 13,68 12,23 33,29 47,29 15,0 36,-6 49,-33 9,-19 10,-41 10,-64 0,-22 -1,-45 -11,-66 -13,-27 -36,-31 -48,-31 -17,0 -38,7 -49,33 -9,20 -11,42 -11,64zm24 -3c0,-18 0,-37 2,-52 5,-34 26,-36 34,-36 9,0 27,5 33,33 3,16 3,37 3,55 0,21 0,40 -3,58 -5,27 -21,36 -33,36 -11,0 -28,-7 -33,-35 -3,-16 -3,-42 -3,-59z"/>
  <path class="fil3" d="M7273 3954c0,21 1,47 13,68 12,23 33,29 47,29 15,0 36,-6 49,-33 9,-19 10,-41 10,-64 0,-22 -1,-45 -11,-66 -13,-27 -36,-31 -48,-31 -17,0 -38,7 -49,33 -9,20 -11,42 -11,64zm24 -3c0,-18 0,-37 2,-52 5,-34 26,-36 34,-36 9,0 27,5 33,33 3,16 3,37 3,55 0,21 0,40 -3,58 -5,27 -21,36 -33,36 -11,0 -28,-7 -33,-35 -3,-16 -3,-42 -3,-59z"/>
  <path class="fil3" d="M7773 2454c0,21 1,47 13,68 12,23 33,29 47,29 15,0 36,-6 49,-33 9,-19 10,-41 10,-64 0,-22 -1,-45 -11,-66 -13,-27 -36,-31 -48,-31 -17,0 -38,7 -49,33 -9,20 -11,42 -11,64zm24 -3c0,-18 0,-37 2,-52 5,-34 26,-36 34,-36 9,0 27,5 33,33 3,16 3,37 3,55 0,21 0,40 -3,58 -5,27 -21,36 -33,36 -11,0 -28,-7 -33,-35 -3,-16 -3,-42 -3,-59z"/>
  <path class="fil3" d="M7773 3454c0,21 1,47 13,68 12,23 33,29 47,29 15,0 36,-6 49,-33 9,-19 10,-41 10,-64 0,-22 -1,-45 -11,-66 -13,-27 -36,-31 -48,-31 -17,0 -38,7 -49,33 -9,20 -11,42 -11,64zm24 -3c0,-18 0,-37 2,-52 5,-34 26,-36 34,-36 9,0 27,5 33,33 3,16 3,37 3,55 0,21 0,40 -3,58 -5,27 -21,36 -33,36 -11,0 -28,-7 -33,-35 -3,-16 -3,-42 -3,-59z"/>
  <path class="fil3" d="M8773 3454c0,21 1,47 13,68 12,23 33,29 47,29 15,0 36,-6 49,-33 9,-19 10,-41 10,-64 0,-22 -1,-45 -11,-66 -13,-27 -36,-31 -48,-31 -17,0 -38,7 -49,33 -9,20 -11,42 -11,64zm24 -3c0,-18 0,-37 2,-52 5,-34 26,-36 34,-36 9,0 27,5 33,33 3,16 3,37 3,55 0,21 0,40 -3,58 -5,27 -21,36 -33,36 -11,0 -28,-7 -33,-35 -3,-16 -3,-42 -3,-59z"/>
  <path class="fil3" d="M7773 2954c0,21 1,47 13,68 12,23 33,29 47,29 15,0 36,-6 49,-33 9,-19 10,-41 10,-64 0,-22 -1,-45 -11,-66 -13,-27 -36,-31 -48,-31 -17,0 -38,7 -49,33 -9,20 -11,42 -11,64zm24 -3c0,-18 0,-37 2,-52 5,-34 26,-36 34,-36 9,0 27,5 33,33 3,16 3,37 3,55 0,21 0,40 -3,58 -5,27 -21,36 -33,36 -11,0 -28,-7 -33,-35 -3,-16 -3,-42 -3,-59z"/>
  <path class="fil3" d="M7773 3954c0,21 1,47 13,68 12,23 33,29 47,29 15,0 36,-6 49,-33 9,-19 10,-41 10,-64 0,-22 -1,-45 -11,-66 -13,-27 -36,-31 -48,-31 -17,0 -38,7 -49,33 -9,20 -11,42 -11,64zm24 -3c0,-18 0,-37 2,-52 5,-34 26,-36 34,-36 9,0 27,5 33,33 3,16 3,37 3,55 0,21 0,40 -3,58 -5,27 -21,36 -33,36 -11,0 -28,-7 -33,-35 -3,-16 -3,-42 -3,-59z"/>
  <path class="fil3" d="M8773 3954c0,21 1,47 13,68 12,23 33,29 47,29 15,0 36,-6 49,-33 9,-19 10,-41 10,-64 0,-22 -1,-45 -11,-66 -13,-27 -36,-31 -48,-31 -17,0 -38,7 -49,33 -9,20 -11,42 -11,64zm24 -3c0,-18 0,-37 2,-52 5,-34 26,-36 34,-36 9,0 27,5 33,33 3,16 3,37 3,55 0,21 0,40 -3,58 -5,27 -21,36 -33,36 -11,0 -28,-7 -33,-35 -3,-16 -3,-42 -3,-59z"/>
  <path class="fil3" d="M8273 2454c0,21 1,47 13,68 12,23 33,29 47,29 15,0 36,-6 49,-33 9,-19 10,-41 10,-64 0,-22 -1,-45 -11,-66 -13,-27 -36,-31 -48,-31 -17,0 -38,7 -49,33 -9,20 -11,42 -11,64zm24 -3c0,-18 0,-37 2,-52 5,-34 26,-36 34,-36 9,0 27,5 33,33 3,16 3,37 3,55 0,21 0,40 -3,58 -5,27 -21,36 -33,36 -11,0 -28,-7 -33,-35 -3,-16 -3,-42 -3,-59z"/>
  <path class="fil3" d="M8273 3454c0,21 1,47 13,68 12,23 33,29 47,29 15,0 36,-6 49,-33 9,-19 10,-41 10,-64 0,-22 -1,-45 -11,-66 -13,-27 -36,-31 -48,-31 -17,0 -38,7 -49,33 -9,20 -11,42 -11,64zm24 -3c0,-18 0,-37 2,-52 5,-34 26,-36 34,-36 9,0 27,5 33,33 3,16 3,37 3,55 0,21 0,40 -3,58 -5,27 -21,36 -33,36 -11,0 -28,-7 -33,-35 -3,-16 -3,-42 -3,-59z"/>
  <path class="fil3" d="M9273 3454c0,21 1,47 13,68 12,23 33,29 47,29 15,0 36,-6 49,-33 9,-19 10,-41 10,-64 0,-22 -1,-45 -11,-66 -13,-27 -36,-31 -48,-31 -17,0 -38,7 -49,33 -9,20 -11,42 -11,64zm24 -3c0,-18 0,-37 2,-52 5,-34 26,-36 34,-36 9,0 27,5 33,33 3,16 3,37 3,55 0,21 0,40 -3,58 -5,27 -21,36 -33,36 -11,0 -28,-7 -33,-35 -3,-16 -3,-42 -3,-59z"/>
  <path class="fil3" d="M8273 2954c0,21 1,47 13,68 12,23 33,29 47,29 15,0 36,-6 49,-33 9,-19 10,-41 10,-64 0,-22 -1,-45 -11,-66 -13,-27 -36,-31 -48,-31 -17,0 -38,7 -49,33 -9,20 -11,42 -11,64zm24 -3c0,-18 0,-37 2,-52 5,-34 26,-36 34,-36 9,0 27,5 33,33 3,16 3,37 3,55 0,21 0,40 -3,58 -5,27 -21,36 -33,36 -11,0 -28,-7 -33,-35 -3,-16 -3,-42 -3,-59z"/>
  <path class="fil3" d="M8273 3954c0,21 1,47 13,68 12,23 33,29 47,29 15,0 36,-6 49,-33 9,-19 10,-41 10,-64 0,-22 -1,-45 -11,-66 -13,-27 -36,-31 -48,-31 -17,0 -38,7 -49,33 -9,20 -11,42 -11,64zm24 -3c0,-18 0,-37 2,-52 5,-34 26,-36 34,-36 9,0 27,5 33,33 3,16 3,37 3,55 0,21 0,40 -3,58 -5,27 -21,36 -33,36 -11,0 -28,-7 -33,-35 -3,-16 -3,-42 -3,-59z"/>
  <path class="fil3" d="M9273 3954c0,21 1,47 13,68 12,23 33,29 47,29 15,0 36,-6 49,-33 9,-19 10,-41 10,-64 0,-22 -1,-45 -11,-66 -13,-27 -36,-31 -48,-31 -17,0 -38,7 -49,33 -9,20 -11,42 -11,64zm24 -3c0,-18 0,-37 2,-52 5,-34 26,-36 34,-36 9,0 27,5 33,33 3,16 3,37 3,55 0,21 0,40 -3,58 -5,27 -21,36 -33,36 -11,0 -28,-7 -33,-35 -3,-16 -3,-42 -3,-59z"/>
  <path class="fil3" d="M8773 454c0,21 1,47 13,68 12,23 33,29 47,29 15,0 36,-6 49,-33 9,-19 10,-41 10,-64 0,-22 -1,-45 -11,-66 -13,-27 -36,-31 -48,-31 -17,0 -38,7 -49,33 -9,20 -11,42 -11,64zm24 -3c0,-18 0,-37 2,-52 5,-34 26,-36 34,-36 9,0 27,5 33,33 3,16 3,37 3,55 0,21 0,40 -3,58 -5,27 -21,36 -33,36 -11,0 -28,-7 -33,-35 -3,-16 -3,-42 -3,-59z"/>
  <path class="fil3" d="M9773 454c0,21 1,47 13,68 12,23 33,29 47,29 15,0 36,-6 49,-33 9,-19 10,-41 10,-64 0,-22 -1,-45 -11,-66 -13,-27 -36,-31 -48,-31 -17,0 -38,7 -49,33 -9,20 -11,42 -11,64zm24 -3c0,-18 0,-37 2,-52 5,-34 26,-36 34,-36 9,0 27,5 33,33 3,16 3,37 3,55 0,21 0,40 -3,58 -5,27 -21,36 -33,36 -11,0 -28,-7 -33,-35 -3,-16 -3,-42 -3,-59z"/>
  <path class="fil3" d="M8773 954c0,21 1,47 13,68 12,23 33,29 47,29 15,0 36,-6 49,-33 9,-19 10,-41 10,-64 0,-22 -1,-45 -11,-66 -13,-27 -36,-31 -48,-31 -17,0 -38,7 -49,33 -9,20 -11,42 -11,64zm24 -3c0,-18 0,-37 2,-52 5,-34 26,-36 34,-36 9,0 27,5 33,33 3,16 3,37 3,55 0,21 0,40 -3,58 -5,27 -21,36 -33,36 -11,0 -28,-7 -33,-35 -3,-16 -3,-42 -3,-59z"/>
  <path class="fil3" d="M9773 954c0,21 1,47 13,68 12,23 33,29 47,29 15,0 36,-6 49,-33 9,-19 10,-41 10,-64 0,-22 -1,-45 -11,-66 -13,-27 -36,-31 -48,-31 -17,0 -38,7 -49,33 -9,20 -11,42 -11,64zm24 -3c0,-18 0,-37 2,-52 5,-34 26,-36 34,-36 9,0 27,5 33,33 3,16 3,37 3,55 0,21 0,40 -3,58 -5,27 -21,36 -33,36 -11,0 -28,-7 -33,-35 -3,-16 -3,-42 -3,-59z"/>
  <path class="fil3" d="M8773 1454c0,21 1,47 13,68 12,23 33,29 47,29 15,0 36,-6 49,-33 9,-19 10,-41 10,-64 0,-22 -1,-45 -11,-66 -13,-27 -36,-31 -48,-31 -17,0 -38,7 -49,33 -9,20 -11,42 -11,64zm24 -3c0,-18 0,-37 2,-52 5,-34 26,-36 34,-36 9,0 27,5 33,33 3,16 3,37 3,55 0,21 0,40 -3,58 -5,27 -21,36 -33,36 -11,0 -28,-7 -33,-35 -3,-16 -3,-42 -3,-59z"/>
  <path class="fil3" d="M9773 1454c0,21 1,47 13,68 12,23 33,29 47,29 15,0 36,-6 49,-33 9,-19 10,-41 10,-64 0,-22 -1,-45 -11,-66 -13,-27 -36,-31 -48,-31 -17,0 -38,7 -49,33 -9,20 -11,42 -11,64zm24 -3c0,-18 0,-37 2,-52 5,-34 26,-36 34,-36 9,0 27,5 33,33 3,16 3,37 3,55 0,21 0,40 -3,58 -5,27 -21,36 -33,36 -11,0 -28,-7 -33,-35 -3,-16 -3,-42 -3,-59z"/>
  <path class="fil3" d="M9773 2454c0,21 1,47 13,68 12,23 33,29 47,29 15,0 36,-6 49,-33 9,-19 10,-41 10,-64 0,-22 -1,-45 -11,-66 -13,-27 -36,-31 -48,-31 -17,0 -38,7 -49,33 -9,20 -11,42 -11,64zm24 -3c0,-18 0,-37 2,-52 5,-34 26,-36 34,-36 9,0 27,5 33,33 3,16 3,37 3,55 0,21 0,40 -3,58 -5,27 -21,36 -33,36 -11,0 -28,-7 -33,-35 -3,-16 -3,-42 -3,-59z"/>
  <path class="fil3" d="M8773 1954c0,21 1,47 13,68 12,23 33,29 47,29 15,0 36,-6 49,-33 9,-19 10,-41 10,-64 0,-22 -1,-45 -11,-66 -13,-27 -36,-31 -48,-31 -17,0 -38,7 -49,33 -9,20 -11,42 -11,64zm24 -3c0,-18 0,-37 2,-52 5,-34 26,-36 34,-36 9,0 27,5 33,33 3,16 3,37 3,55 0,21 0,40 -3,58 -5,27 -21,36 -33,36 -11,0 -28,-7 -33,-35 -3,-16 -3,-42 -3,-59z"/>
  <path class="fil3" d="M9773 1954c0,21 1,47 13,68 12,23 33,29 47,29 15,0 36,-6 49,-33 9,-19 10,-41 10,-64 0,-22 -1,-45 -11,-66 -13,-27 -36,-31 -48,-31 -17,0 -38,7 -49,33 -9,20 -11,42 -11,64zm24 -3c0,-18 0,-37 2,-52 5,-34 26,-36 34,-36 9,0 27,5 33,33 3,16 3,37 3,55 0,21 0,40 -3,58 -5,27 -21,36 -33,36 -11,0 -28,-7 -33,-35 -3,-16 -3,-42 -3,-59z"/>
  <path class="fil3" d="M9773 2954c0,21 1,47 13,68 12,23 33,29 47,29 15,0 36,-6 49,-33 9,-19 10,-41 10,-64 0,-22 -1,-45 -11,-66 -13,-27 -36,-31 -48,-31 -17,0 -38,7 -49,33 -9,20 -11,42 -11,64zm24 -3c0,-18 0,-37 2,-52 5,-34 26,-36 34,-36 9,0 27,5 33,33 3,16 3,37 3,55 0,21 0,40 -3,58 -5,27 -21,36 -33,36 -11,0 -28,-7 -33,-35 -3,-16 -3,-42 -3,-59z"/>
  <path class="fil3" d="M9273 454c0,21 1,47 13,68 12,23 33,29 47,29 15,0 36,-6 49,-33 9,-19 10,-41 10,-64 0,-22 -1,-45 -11,-66 -13,-27 -36,-31 -48,-31 -17,0 -38,7 -49,33 -9,20 -11,42 -11,64zm24 -3c0,-18 0,-37 2,-52 5,-34 26,-36 34,-36 9,0 27,5 33,33 3,16 3,37 3,55 0,21 0,40 -3,58 -5,27 -21,36 -33,36 -11,0 -28,-7 -33,-35 -3,-16 -3,-42 -3,-59z"/>
  <path class="fil3" d="M10273 454c0,21 1,47 13,68 12,23 33,29 47,29 15,0 36,-6 49,-33 9,-19 10,-41 10,-64 0,-22 -1,-45 -11,-66 -13,-27 -36,-31 -48,-31 -17,0 -38,7 -49,33 -9,20 -11,42 -11,64zm24 -3c0,-18 0,-37 2,-52 5,-34 26,-36 34,-36 9,0 27,5 33,33 3,16 3,37 3,55 0,21 0,40 -3,58 -5,27 -21,36 -33,36 -11,0 -28,-7 -33,-35 -3,-16 -3,-42 -3,-59z"/>
  <path class="fil3" d="M9273 954c0,21 1,47 13,68 12,23 33,29 47,29 15,0 36,-6 49,-33 9,-19 10,-41 10,-64 0,-22 -1,-45 -11,-66 -13,-27 -36,-31 -48,-31 -17,0 -38,7 -49,33 -9,20 -11,42 -11,64zm24 -3c0,-18 0,-37 2,-52 5,-34 26,-36 34,-36 9,0 27,5 33,33 3,16 3,37 3,55 0,21 0,40 -3,58 -5,27 -21,36 -33,36 -11,0 -28,-7 -33,-35 -3,-16 -3,-42 -3,-59z"/>
  <path class="fil3" d="M10273 954c0,21 1,47 13,68 12,23 33,29 47,29 15,0 36,-6 49,-33 9,-19 10,-41 10,-64 0,-22 -1,-45 -11,-66 -13,-27 -36,-31 -48,-31 -17,0 -38,7 -49,33 -9,20 -11,42 -11,64zm24 -3c0,-18 0,-37 2,-52 5,-34 26,-36 34,-36 9,0 27,5 33,33 3,16 3,37 3,55 0,21 0,40 -3,58 -5,27 -21,36 -33,36 -11,0 -28,-7 -33,-35 -3,-16 -3,-42 -3,-59z"/>
  <path class="fil3" d="M9273 1454c0,21 1,47 13,68 12,23 33,29 47,29 15,0 36,-6 49,-33 9,-19 10,-41 10,-64 0,-22 -1,-45 -11,-66 -13,-27 -36,-31 -48,-31 -17,0 -38,7 -49,33 -9,20 -11,42 -11,64zm24 -3c0,-18 0,-37 2,-52 5,-34 26,-36 34,-36 9,0 27,5 33,33 3,16 3,37 3,55 0,21 0,40 -3,58 -5,27 -21,36 -33,36 -11,0 -28,-7 -33,-35 -3,-16 -3,-42 -3,-59z"/>
  <path class="fil3" d="M10273 1454c0,21 1,47 13,68 12,23 33,29 47,29 15,0 36,-6 49,-33 9,-19 10,-41 10,-64 0,-22 -1,-45 -11,-66 -13,-27 -36,-31 -48,-31 -17,0 -38,7 -49,33 -9,20 -11,42 -11,64zm24 -3c0,-18 0,-37 2,-52 5,-34 26,-36 34,-36 9,0 27,5 33,33 3,16 3,37 3,55 0,21 0,40 -3,58 -5,27 -21,36 -33,36 -11,0 -28,-7 -33,-35 -3,-16 -3,-42 -3,-59z"/>
  <path class="fil3" d="M10273 2454c0,21 1,47 13,68 12,23 33,29 47,29 15,0 36,-6 49,-33 9,-19 10,-41 10,-64 0,-22 -1,-45 -11,-66 -13,-27 -36,-31 -48,-31 -17,0 -38,7 -49,33 -9,20 -11,42 -11,64zm24 -3c0,-18 0,-37 2,-52 5,-34 26,-36 34,-36 9,0 27,5 33,33 3,16 3,37 3,55 0,21 0,40 -3,58 -5,27 -21,36 -33,36 -11,0 -28,-7 -33,-35 -3,-16 -3,-42 -3,-59z"/>
  <path class="fil3" d="M9273 1954c0,21 1,47 13,68 12,23 33,29 47,29 15,0 36,-6 49,-33 9,-19 10,-41 10,-64 0,-22 -1,-45 -11,-66 -13,-27 -36,-31 -48,-31 -17,0 -38,7 -49,33 -9,20 -11,42 -11,64zm24 -3c0,-18 0,-37 2,-52 5,-34 26,-36 34,-36 9,0 27,5 33,33 3,16 3,37 3,55 0,21 0,40 -3,58 -5,27 -21,36 -33,36 -11,0 -28,-7 -33,-35 -3,-16 -3,-42 -3,-59z"/>
  <path class="fil3" d="M10273 1954c0,21 1,47 13,68 12,23 33,29 47,29 15,0 36,-6 49,-33 9,-19 10,-41 10,-64 0,-22 -1,-45 -11,-66 -13,-27 -36,-31 -48,-31 -17,0 -38,7 -49,33 -9,20 -11,42 -11,64zm24 -3c0,-18 0,-37 2,-52 5,-34 26,-36 34,-36 9,0 27,5 33,33 3,16 3,37 3,55 0,21 0,40 -3,58 -5,27 -21,36 -33,36 -11,0 -28,-7 -33,-35 -3,-16 -3,-42 -3,-59z"/>
  <path class="fil3" d="M10273 2954c0,21 1,47 13,68 12,23 33,29 47,29 15,0 36,-6 49,-33 9,-19 10,-41 10,-64 0,-22 -1,-45 -11,-66 -13,-27 -36,-31 -48,-31 -17,0 -38,7 -49,33 -9,20 -11,42 -11,64zm24 -3c0,-18 0,-37 2,-52 5,-34 26,-36 34,-36 9,0 27,5 33,33 3,16 3,37 3,55 0,21 0,40 -3,58 -5,27 -21,36 -33,36 -11,0 -28,-7 -33,-35 -3,-16 -3,-42 -3,-59z"/>
  <g id="_1629253030864">
   <path class="fil3" d="M2612 146l27 0 71 103 0 64 -31 0 0 13c10,-1 38,-1 50,-1 12,0 39,0 50,1l0 -13 -31 0 0 -64 66 -98c3,-4 5,-4 11,-4 5,-1 10,-1 15,-1l6 0 0 -13c-11,0 -24,0 -32,0 -11,0 -27,0 -37,0l0 13c6,0 14,0 21,3 -1,1 -1,1 -2,3l-53 78 -57 -84 24 0 0 -13c-12,0 -39,0 -52,0 -11,0 -36,0 -46,0l0 13z"/>
   <path class="fil3" d="M2858 192l0 6c6,0 15,-1 20,-1 5,0 14,1 20,1l0 -6c-12,0 -14,0 -14,-8l0 -29 0 -2c1,3 9,13 22,13 21,0 39,-18 39,-41 0,-22 -17,-39 -37,-39 -13,0 -21,7 -24,11l0 -11 -26 2 0 5c13,0 14,1 14,9l0 82c0,8 -2,8 -14,8zm26 -48l0 -40c5,-9 14,-14 23,-14 13,0 24,16 24,35 0,22 -13,37 -26,37 -7,0 -14,-4 -18,-11 -3,-4 -3,-4 -3,-8l0 1z"/>
   <path id="1" class="fil3" d="M2959 147c0,14 17,19 28,19 12,0 20,-8 23,-16 1,7 5,15 14,15 3,0 14,-3 14,-17l0 -10 -4 0 0 10c0,10 -5,11 -7,11 -5,0 -6,-8 -6,-9l0 -35c0,-7 0,-14 -6,-21 -7,-7 -16,-9 -25,-9 -14,0 -26,8 -26,19 0,6 3,9 8,9 5,0 8,-4 8,-8 0,-2 -1,-8 -9,-8 5,-7 13,-9 19,-9 9,0 19,7 19,23l0 7c-9,0 -22,1 -33,6 -13,6 -17,15 -17,23l0 0zm13 0c0,-10 8,-25 37,-26l0 18c0,17 -13,23 -21,23 -9,0 -16,-7 -16,-15z"/>
   <path id="2" class="fil3" d="M3044 164c7,-1 16,-1 21,-1 7,0 15,0 22,1l0 -6 -4 0c-13,0 -13,-2 -13,-8l0 -27c0,-18 7,-33 21,-33 1,0 1,0 2,0 -1,0 -4,2 -4,7 0,4 3,7 7,7 3,0 8,-2 8,-8 0,-5 -6,-10 -13,-10 -13,0 -20,11 -22,19l0 -19 -25 2 0 5c13,0 14,1 14,10l0 47c0,8 -2,8 -14,8l0 6z"/>
  </g>
  <path class="fil3" d="M5766 2134l28 0 70 103 0 64 -31 0 0 13c11,-1 38,-1 50,-1 12,0 39,0 50,1l0 -13 -31 0 0 -64 67 -98c2,-4 4,-4 11,-5 4,0 10,0 14,0l6 0 0 -14c-11,1 -24,1 -32,1 -11,0 -27,0 -37,-1l0 14c6,0 14,0 21,2 0,2 0,2 -2,4l-52 77 -58 -83 24 0 0 -14c-11,1 -39,1 -51,1 -12,0 -37,0 -47,-1l0 14z"/>
  <path id="1" class="fil3" d="M6024 2275c0,2 1,5 8,5l200 0c4,0 8,-1 8,-5 0,-2 -2,-5 -8,-5l-200 0c-4,0 -8,0 -8,5zm0 -63c0,2 1,5 8,5l200 0c4,0 8,-1 8,-5 0,-2 -2,-5 -8,-5l-200 0c-4,0 -8,1 -8,5z"/>
  <g id="_1629253028240">
   <path class="fil3" d="M4604 1745l27 0 71 103 0 64 -31 0 0 13c10,-1 38,-1 50,-1 12,0 39,0 50,1l0 -13 -31 0 0 -64 66 -98c3,-4 5,-4 11,-5 5,0 10,0 15,0l6 0 0 -14c-11,1 -24,1 -32,1 -11,0 -27,0 -37,-1l0 14c6,0 14,0 21,2 -1,2 -1,2 -2,4l-53 77 -57 -83 24 0 0 -14c-12,1 -39,1 -52,1 -11,0 -36,0 -46,-1l0 14z"/>
   <path class="fil3" d="M4850 1725c0,22 19,39 39,39 22,0 39,-17 39,-39 0,-23 -17,-42 -39,-42 -22,0 -39,20 -39,42zm15 -2c0,-7 0,-16 4,-24 5,-8 13,-12 20,-12 8,0 16,4 20,12 5,7 5,18 5,24 0,7 0,16 -4,24 -4,8 -12,13 -21,13 -7,0 -15,-4 -20,-12 -4,-8 -4,-18 -4,-25z"/>
   <path id="1" class="fil3" d="M4932 1692c11,0 12,1 14,7l25 62c2,2 2,3 4,3 2,0 3,-1 4,-3l23 -57c2,-4 5,-12 16,-12l0 -5c-4,0 -9,0 -13,0 -4,0 -12,0 -15,0l0 5c6,0 8,4 8,8 0,1 0,2 -1,4l-18 45 -20 -49c-1,-3 -1,-3 -1,-3 0,-5 7,-5 10,-5l0 -5c-5,0 -15,0 -19,0 -5,0 -12,0 -17,0l0 5z"/>
  </g>
  <g id="_1629255082608">
   <path class="fil3" d="M3604 880l27 0 71 103 0 64 -31 0 0 13c10,0 38,0 50,0 12,0 39,0 50,0l0 -13 -31 0 0 -64 66 -97c3,-4 5,-4 11,-5 5,-1 10,-1 15,-1l6 0 0 -13c-11,0 -24,1 -32,1 -11,0 -27,0 -37,-1l0 13c6,0 14,0 21,3 -1,1 -1,2 -2,3l-53 78 -57 -84 24 0 0 -13c-12,1 -39,1 -52,1 -11,0 -36,0 -46,-1l0 13z"/>
   <path class="fil3" d="M3850 898c7,0 15,-1 20,-1 7,0 16,0 23,1l0 -6 -4 0c-13,0 -13,-2 -13,-8l0 -27c0,-18 7,-33 20,-33 2,0 2,0 2,0 0,0 -4,2 -4,7 0,5 4,7 8,7 3,0 8,-2 8,-7 0,-6 -6,-11 -14,-11 -12,0 -19,12 -21,19l0 -19 -25 2 0 5c13,0 14,2 14,10l0 47c0,8 -2,8 -14,8l0 6z"/>
   <path id="1" class="fil3" d="M3919 859c0,24 19,41 39,41 22,0 30,-20 30,-23 0,-2 -2,-2 -3,-2 -1,0 -2,1 -2,2 -6,18 -22,18 -24,18 -9,0 -16,-5 -20,-11 -5,-9 -5,-21 -5,-27l49 0c4,0 5,0 5,-4 0,-17 -10,-34 -32,-34 -21,0 -37,18 -37,40zm15 -6c1,-26 16,-30 22,-30 18,0 20,23 20,30l-42 0z"/>
   <path id="2" class="fil3" d="M3998 898c6,0 15,-1 20,-1 5,0 14,1 20,1l0 -6c-12,0 -14,0 -14,-8l0 -32c0,-18 13,-28 24,-28 11,0 13,9 13,19l0 41c0,8 -2,8 -14,8l0 6c6,0 15,-1 20,-1 5,0 14,1 20,1l0 -6c-12,0 -14,0 -14,-8l0 -32c0,-18 13,-28 24,-28 11,0 13,9 13,19l0 41c0,8 -2,8 -14,8l0 6c7,0 16,-1 20,-1 5,0 14,1 20,1l0 -6c-9,0 -14,0 -14,-5l0 -34c0,-15 0,-20 -5,-27 -3,-3 -8,-6 -19,-6 -15,0 -22,10 -25,17 -3,-15 -16,-17 -24,-17 -13,0 -21,7 -26,18l0 -18 -25 2 0 5c13,0 14,2 14,10l0 47c0,8 -2,8 -14,8l0 6z"/>
  </g>
  <rect class="fil1 str1" x="6583" y="204" width="2000" height="2000"/>
  <rect class="fil4 str0" transform="matrix(0.752831 -0.132744 -0 0.752831 501.74 760.094)" width="664" height="664"/>
  <rect class="fil4 str0" transform="matrix(0.752831 -0.132744 -0 0.752831 501.74 1260.09)" width="664" height="664"/>
  <rect class="fil4 str0" transform="matrix(0.752831 -0.132744 -0 0.752831 501.74 1760.09)" width="664" height="664"/>
  <rect class="fil4 str0" transform="matrix(0.752831 -0.132744 -0 0.752831 501.74 2260.09)" width="664" height="664"/>
  <rect class="fil4 str0" transform="matrix(0.752831 -0.132744 -0 0.752831 1001.74 671.93)" width="664" height="664"/>
  <rect class="fil4 str0" transform="matrix(0.752831 -0.132744 -0 0.752831 1001.74 1171.93)" width="664" height="664"/>
  <rect class="fil4 str0" transform="matrix(0.752831 -0.132744 -0 0.752831 1001.74 1671.93)" width="664" height="664"/>
  <rect class="fil4 str0" transform="matrix(0.752831 -0.132744 -0 0.752831 1001.74 2171.93)" width="664" height="664"/>
  <rect class="fil4 str0" transform="matrix(0.752831 -0.132744 -0 0.752831 1501.74 583.767)" width="664" height="664"/>
  <rect class="fil4 str0" transform="matrix(0.752831 -0.132744 -0 0.752831 1501.74 1083.77)" width="664" height="664"/>
  <rect class="fil4 str0" transform="matrix(0.752831 -0.132744 -0 0.752831 1501.74 1583.77)" width="664" height="664"/>
  <rect class="fil4 str0" transform="matrix(0.752831 -0.132744 -0 0.752831 1501.74 2083.77)" width="664" height="664"/>
  <rect class="fil4 str0" transform="matrix(0.752831 -0.132744 -0 0.752831 2001.74 495.603)" width="664" height="664"/>
  <rect class="fil4 str0" transform="matrix(0.752831 -0.132744 -0 0.752831 2001.74 995.603)" width="664" height="664"/>
  <rect class="fil4 str0" transform="matrix(0.752831 -0.132744 -0 0.752831 2001.74 1495.6)" width="664" height="664"/>
  <rect class="fil4 str0" transform="matrix(0.752831 -0.132744 -0 0.752831 2001.74 1995.6)" width="664" height="664"/>
  <path class="fil3" d="M558 1074c0,3 3,3 4,3 11,-2 23,-5 34,-7 11,-2 22,-3 34,-5 1,0 5,-1 5,-6 0,-4 -2,-3 -8,-2 -16,2 -16,0 -16,-2 0,-1 0,-2 1,-6l19 -80 77 -14 -18 79c-3,10 -4,12 -24,16 -4,0 -7,1 -7,6 0,4 3,3 4,3 11,-2 22,-5 33,-7 11,-2 23,-3 34,-5 2,0 5,-1 5,-6 0,-4 -2,-3 -7,-2 -17,3 -17,0 -17,-2 0,0 0,-2 1,-7l39 -159c2,-10 4,-12 22,-15 6,-1 8,-2 8,-7 0,-3 -2,-3 -4,-3 -10,2 -22,5 -33,7 -11,2 -23,3 -34,5 -1,0 -5,1 -5,6 0,4 2,3 7,2 9,-1 17,-3 17,2 0,1 0,2 -1,6l-18 72 -77 14 17 -71c2,-10 5,-13 22,-16 6,-1 9,-1 9,-6 0,-3 -2,-4 -4,-3 -11,2 -22,5 -33,7 -12,1 -23,3 -34,5 -2,0 -6,1 -6,6 0,3 3,3 8,2 9,-2 16,-3 16,2 0,1 0,1 -1,5l-38 160c-2,10 -4,13 -23,16 -5,1 -8,2 -8,7z"/>
  <path id="1" class="fil3" d="M769 957c5,0 17,-2 28,-10l0 110c0,7 0,10 -20,13l-6 2 0 6c7,-2 26,-5 34,-7 8,-1 27,-4 34,-5l0 -7 -7 2c-19,3 -19,1 -19,-7l0 -119c0,-5 0,-5 -5,-4 -13,15 -32,19 -39,20l0 6z"/>
  <path id="2" class="fil3" d="M875 939c4,-1 17,-3 28,-11l0 110c0,8 -1,10 -20,14l-6 1 0 6c7,-1 25,-5 34,-6 8,-2 27,-5 34,-6l0 -6 -7 1c-19,3 -19,1 -19,-7l0 -118c0,-6 0,-6 -5,-5 -13,16 -32,19 -39,20l0 7z"/>
  <path class="fil3" d="M558 1574c0,3 3,3 4,3 11,-2 23,-5 34,-7 11,-2 22,-3 34,-5 1,0 5,-1 5,-6 0,-4 -2,-3 -8,-2 -16,2 -16,0 -16,-2 0,-1 0,-2 1,-6l19 -80 77 -14 -18 79c-3,10 -4,12 -24,16 -4,0 -7,1 -7,6 0,4 3,3 4,3 11,-2 22,-5 33,-7 11,-2 23,-3 34,-5 2,0 5,-1 5,-6 0,-4 -2,-3 -7,-2 -17,3 -17,0 -17,-2 0,0 0,-2 1,-7l39 -159c2,-10 4,-12 22,-15 6,-1 8,-2 8,-7 0,-3 -2,-3 -4,-3 -10,2 -22,5 -33,7 -11,2 -23,3 -34,5 -1,0 -5,1 -5,6 0,4 2,3 7,2 9,-1 17,-3 17,2 0,1 0,2 -1,6l-18 72 -77 14 17 -71c2,-10 5,-13 22,-16 6,-1 9,-1 9,-6 0,-3 -2,-4 -4,-3 -11,2 -22,5 -33,7 -12,1 -23,3 -34,5 -2,0 -6,1 -6,6 0,3 3,3 8,2 9,-2 16,-3 16,2 0,1 0,1 -1,5l-38 160c-2,10 -4,13 -23,16 -5,1 -8,2 -8,7z"/>
  <path id="1" class="fil3" d="M761 1580l79 -14 6 -38 -6 1c-1,7 -2,16 -4,20 -2,2 -16,4 -20,5l-39 7 23 -26c33,-35 46,-49 46,-70 0,-24 -19,-38 -45,-33 -24,4 -40,26 -40,45 0,12 11,10 11,10 4,-1 11,-4 11,-13 0,-6 -3,-10 -11,-9 -2,0 -2,0 -3,1 5,-15 17,-25 29,-27 19,-4 28,12 28,29 0,17 -10,36 -22,51l-41 53c-2,2 -2,3 -2,8z"/>
  <path id="2" class="fil3" d="M875 1439c4,-1 17,-3 28,-11l0 110c0,8 -1,10 -20,14l-6 1 0 6c7,-1 25,-5 34,-6 8,-2 27,-5 34,-6l0 -6 -7 1c-19,3 -19,1 -19,-7l0 -118c0,-6 0,-6 -5,-5 -13,16 -32,19 -39,20l0 7z"/>
  <path class="fil3" d="M558 2072c0,3 3,3 4,2 11,-1 23,-4 34,-6 11,-2 22,-3 34,-5 1,-1 5,-1 5,-6 0,-4 -2,-4 -8,-3 -16,3 -16,1 -16,-2 0,-1 0,-1 1,-6l19 -80 77 -13 -18 78c-3,10 -4,13 -24,16 -4,1 -7,2 -7,7 0,3 3,3 4,3 11,-2 22,-5 33,-7 11,-2 23,-3 34,-5 2,0 5,-1 5,-6 0,-4 -2,-3 -7,-2 -17,2 -17,0 -17,-2 0,-1 0,-3 1,-7l39 -159c2,-10 4,-13 22,-16 6,-1 8,-1 8,-6 0,-3 -2,-4 -4,-3 -10,2 -22,5 -33,6 -11,2 -23,4 -34,6 -1,0 -5,1 -5,6 0,3 2,3 7,2 9,-2 17,-3 17,2 0,1 0,1 -1,5l-18 73 -77 13 17 -71c2,-9 5,-12 22,-15 6,-1 9,-1 9,-7 0,-3 -2,-3 -4,-3 -11,2 -22,5 -33,7 -12,2 -23,3 -34,5 -2,1 -6,1 -6,7 0,3 3,3 8,2 9,-2 16,-3 16,2 0,0 0,1 -1,5l-38 160c-2,10 -4,13 -23,16 -5,1 -8,1 -8,7z"/>
  <path id="1" class="fil3" d="M759 2049c0,19 20,30 43,26 26,-5 45,-27 45,-49 0,-17 -13,-31 -35,-32 17,-9 30,-26 30,-42 0,-18 -19,-26 -39,-23 -22,4 -38,19 -38,36 0,7 5,10 11,9 7,-1 11,-7 11,-13 0,-11 -10,-9 -13,-8 6,-12 20,-17 28,-18 8,-2 20,1 20,20 0,2 0,15 -6,25 -6,11 -13,13 -19,14 -1,1 -6,2 -8,2 -2,1 -3,1 -3,3 0,3 1,2 5,2l9 -2c18,-3 26,10 26,31 0,29 -15,37 -24,39 -10,2 -25,1 -33,-10 8,-1 14,-6 14,-14 0,-8 -6,-11 -12,-10 -5,1 -12,5 -12,14z"/>
  <path id="2" class="fil3" d="M875 1936c4,0 17,-2 28,-10l0 110c0,7 -1,10 -20,13l-6 2 0 6c7,-2 25,-5 34,-7 8,-1 27,-4 34,-5l0 -7 -7 2c-19,3 -19,1 -19,-7l0 -119c0,-5 0,-5 -5,-4 -13,15 -32,19 -39,20l0 6z"/>
  <path class="fil3" d="M558 2574c0,3 3,3 4,3 11,-2 23,-5 34,-7 11,-2 22,-3 34,-5 1,0 5,-1 5,-6 0,-4 -2,-3 -8,-2 -16,2 -16,0 -16,-2 0,-1 0,-2 1,-6l19 -80 77 -14 -18 79c-3,10 -4,12 -24,16 -4,0 -7,1 -7,6 0,4 3,3 4,3 11,-2 22,-5 33,-7 11,-2 23,-3 34,-5 2,0 5,-1 5,-6 0,-4 -2,-3 -7,-2 -17,3 -17,0 -17,-2 0,0 0,-2 1,-7l39 -159c2,-10 4,-12 22,-15 6,-1 8,-2 8,-7 0,-3 -2,-3 -4,-3 -10,2 -22,5 -33,7 -11,2 -23,3 -34,5 -1,0 -5,1 -5,6 0,4 2,3 7,2 9,-1 17,-3 17,2 0,1 0,2 -1,6l-18 72 -77 14 17 -71c2,-10 5,-13 22,-16 6,-1 9,-1 9,-6 0,-3 -2,-4 -4,-3 -11,2 -22,5 -33,7 -12,1 -23,3 -34,5 -2,0 -6,1 -6,6 0,3 3,3 8,2 9,-2 16,-3 16,2 0,1 0,1 -1,5l-38 160c-2,10 -4,13 -23,16 -5,1 -8,2 -8,7z"/>
  <path id="1" class="fil3" d="M757 2546l56 -10 0 18c0,8 -1,10 -16,13l-5 1 0 6c9,-2 20,-4 29,-5 9,-2 20,-4 29,-5l0 -6 -5 0c-15,3 -16,1 -16,-7l0 -18 21 -4 0 -6 -21 3 0 -96c0,-4 0,-5 -3,-5 -2,0 -3,1 -5,3l-64 111 0 7zm5 -8l52 -88 0 79 -52 9z"/>
  <path id="2" class="fil3" d="M875 2439c4,-1 17,-3 28,-11l0 110c0,8 -1,10 -20,14l-6 1 0 6c7,-1 25,-5 34,-6 8,-2 27,-5 34,-6l0 -6 -7 1c-19,3 -19,1 -19,-7l0 -118c0,-6 0,-6 -5,-5 -13,16 -32,19 -39,20l0 7z"/>
  <path class="fil3" d="M1055 986c0,4 3,3 4,3 11,-2 22,-5 33,-7 12,-2 23,-3 34,-5 2,0 6,-1 6,-6 0,-3 -2,-3 -8,-2 -16,3 -16,1 -16,-2 0,-1 0,-2 1,-6l19 -80 77 -14 -19 79c-2,10 -4,13 -23,16 -4,1 -7,1 -7,7 0,3 3,3 4,2 10,-1 22,-4 33,-6 11,-2 23,-3 34,-5 2,-1 5,-1 5,-6 0,-4 -2,-4 -7,-3 -17,3 -17,1 -17,-2 0,0 0,-2 1,-6l38 -160c3,-9 5,-12 23,-15 6,-1 8,-1 8,-7 0,-3 -2,-3 -4,-3 -11,2 -22,5 -33,7 -11,2 -23,3 -34,5 -2,1 -5,1 -5,7 0,3 2,3 7,2 9,-2 17,-3 17,2 0,0 0,1 -1,5l-18 72 -77 14 17 -71c2,-9 4,-12 22,-15 6,-1 9,-2 9,-7 0,-3 -2,-3 -4,-3 -11,2 -23,5 -34,7 -11,2 -22,3 -33,5 -2,0 -6,1 -6,6 0,4 2,3 8,2 9,-1 16,-3 16,2 0,1 0,2 -1,6l-38 160c-2,10 -4,12 -23,16 -5,1 -8,1 -8,6z"/>
  <path id="1" class="fil3" d="M1266 870c4,-1 17,-3 28,-11l0 110c0,8 -1,10 -20,14l-6 1 0 6c7,-1 25,-5 34,-6 8,-2 27,-5 34,-6l0 -6 -7 1c-19,3 -19,1 -19,-7l0 -118c0,-5 0,-6 -5,-5 -13,16 -32,19 -39,20l0 7z"/>
  <path id="2" class="fil3" d="M1364 974l78 -14 6 -38 -5 1c-1,6 -3,16 -5,19 -1,2 -15,5 -20,6l-38 6 23 -25c33,-35 45,-49 45,-70 0,-24 -19,-38 -45,-33 -24,4 -39,26 -39,45 0,12 10,10 11,10 4,-1 11,-5 11,-13 0,-6 -4,-11 -11,-9 -2,0 -2,0 -3,0 5,-14 16,-24 29,-26 19,-4 28,12 28,29 0,17 -11,36 -22,51l-41 52c-2,3 -2,3 -2,9z"/>
  <path class="fil3" d="M1055 1486c0,4 3,3 4,3 11,-2 22,-5 33,-7 12,-2 23,-3 34,-5 2,0 6,-1 6,-6 0,-3 -2,-3 -8,-2 -16,3 -16,1 -16,-2 0,-1 0,-2 1,-6l19 -80 77 -14 -19 79c-2,10 -4,13 -23,16 -4,1 -7,1 -7,7 0,3 3,3 4,2 10,-1 22,-4 33,-6 11,-2 23,-3 34,-5 2,-1 5,-1 5,-6 0,-4 -2,-4 -7,-3 -17,3 -17,1 -17,-2 0,0 0,-2 1,-6l38 -160c3,-9 5,-12 23,-15 6,-1 8,-1 8,-7 0,-3 -2,-3 -4,-3 -11,2 -22,5 -33,7 -11,2 -23,3 -34,5 -2,1 -5,1 -5,7 0,3 2,3 7,2 9,-2 17,-3 17,2 0,0 0,1 -1,5l-18 72 -77 14 17 -71c2,-9 4,-12 22,-15 6,-1 9,-2 9,-7 0,-3 -2,-3 -4,-3 -11,2 -23,5 -34,7 -11,2 -22,3 -33,5 -2,0 -6,1 -6,6 0,4 2,3 8,2 9,-1 16,-3 16,2 0,1 0,2 -1,6l-38 160c-2,10 -4,12 -23,16 -5,1 -8,1 -8,6z"/>
  <path id="1" class="fil3" d="M1258 1492l79 -14 5 -38 -5 1c-1,7 -2,16 -5,20 -1,2 -15,4 -20,5l-38 7 23 -26c33,-35 45,-48 45,-70 0,-24 -19,-37 -44,-33 -24,4 -40,27 -40,46 0,11 11,10 11,9 4,0 11,-4 11,-13 0,-5 -4,-10 -11,-9 -2,1 -2,1 -3,1 5,-15 17,-25 29,-27 19,-3 28,12 28,30 0,17 -10,35 -22,50l-41 53c-2,3 -2,3 -2,8z"/>
  <path id="2" class="fil3" d="M1364 1474l78 -14 6 -38 -5 1c-1,6 -3,16 -5,19 -1,2 -15,5 -20,6l-38 6 23 -25c33,-35 45,-49 45,-70 0,-24 -19,-38 -45,-33 -24,4 -39,26 -39,45 0,12 10,10 11,10 4,-1 11,-5 11,-13 0,-6 -4,-11 -11,-9 -2,0 -2,0 -3,0 5,-14 16,-24 29,-26 19,-4 28,12 28,29 0,17 -11,36 -22,51l-41 52c-2,3 -2,3 -2,9z"/>
  <path class="fil3" d="M1055 1984c0,4 3,3 4,3 11,-2 22,-5 33,-7 12,-2 23,-3 34,-5 2,0 6,-1 6,-6 0,-4 -2,-3 -8,-2 -16,3 -16,0 -16,-2 0,-1 0,-2 1,-6l19 -80 77 -14 -19 79c-2,10 -4,12 -23,16 -4,0 -7,1 -7,6 0,4 3,3 4,3 10,-2 22,-5 33,-7 11,-2 23,-3 34,-5 2,0 5,-1 5,-6 0,-3 -2,-3 -7,-2 -17,3 -17,1 -17,-2 0,0 0,-2 1,-7l38 -159c3,-10 5,-12 23,-15 6,-1 8,-2 8,-7 0,-3 -2,-3 -4,-3 -11,2 -22,5 -33,7 -11,2 -23,3 -34,5 -2,0 -5,1 -5,6 0,4 2,3 7,2 9,-1 17,-3 17,2 0,1 0,2 -1,6l-18 72 -77 14 17 -71c2,-10 4,-12 22,-16 6,-1 9,-1 9,-6 0,-3 -2,-4 -4,-3 -11,2 -23,5 -34,7 -11,2 -22,3 -33,5 -2,0 -6,1 -6,6 0,3 2,3 8,2 9,-2 16,-3 16,2 0,1 0,1 -1,6l-38 159c-2,10 -4,13 -23,16 -5,1 -8,2 -8,7z"/>
  <path id="1" class="fil3" d="M1256 1962c0,19 20,29 43,25 26,-4 45,-27 45,-49 0,-17 -13,-31 -35,-32 17,-8 29,-25 29,-42 0,-17 -18,-26 -39,-22 -21,3 -37,19 -37,35 0,7 5,10 11,9 6,-1 11,-7 11,-13 0,-10 -10,-8 -14,-8 7,-11 21,-17 29,-18 8,-2 20,1 20,20 0,3 0,15 -6,25 -6,12 -14,13 -19,15 -2,0 -7,1 -8,2 -2,0 -3,1 -3,3 0,2 1,2 5,1l9 -1c18,-3 25,10 25,30 0,29 -14,38 -24,39 -9,2 -25,1 -32,-10 7,0 14,-6 14,-14 0,-8 -6,-11 -12,-10 -5,1 -12,5 -12,15z"/>
  <path id="2" class="fil3" d="M1364 1971l78 -14 6 -38 -5 1c-1,7 -3,17 -5,20 -1,2 -15,4 -20,5l-38 7 23 -26c33,-35 45,-48 45,-70 0,-24 -19,-37 -45,-33 -24,4 -39,27 -39,46 0,11 10,10 11,9 4,0 11,-4 11,-13 0,-5 -4,-10 -11,-9 -2,1 -2,1 -3,1 5,-15 16,-25 29,-27 19,-3 28,12 28,30 0,17 -11,35 -22,50l-41 53c-2,3 -2,3 -2,8z"/>
  <path class="fil3" d="M1055 2486c0,4 3,3 4,3 11,-2 22,-5 33,-7 12,-2 23,-3 34,-5 2,0 6,-1 6,-6 0,-3 -2,-3 -8,-2 -16,3 -16,1 -16,-2 0,-1 0,-2 1,-6l19 -80 77 -14 -19 79c-2,10 -4,13 -23,16 -4,1 -7,1 -7,7 0,3 3,3 4,2 10,-1 22,-4 33,-6 11,-2 23,-3 34,-5 2,-1 5,-1 5,-6 0,-4 -2,-4 -7,-3 -17,3 -17,1 -17,-2 0,0 0,-2 1,-6l38 -160c3,-9 5,-12 23,-15 6,-1 8,-1 8,-7 0,-3 -2,-3 -4,-3 -11,2 -22,5 -33,7 -11,2 -23,3 -34,5 -2,1 -5,1 -5,7 0,3 2,3 7,2 9,-2 17,-3 17,2 0,0 0,1 -1,5l-18 72 -77 14 17 -71c2,-9 4,-12 22,-15 6,-1 9,-2 9,-7 0,-3 -2,-3 -4,-3 -11,2 -23,5 -34,7 -11,2 -22,3 -33,5 -2,0 -6,1 -6,6 0,4 2,3 8,2 9,-1 16,-3 16,2 0,1 0,2 -1,6l-38 160c-2,10 -4,12 -23,16 -5,1 -8,1 -8,6z"/>
  <path id="1" class="fil3" d="M1253 2458l57 -10 0 19c0,7 -1,10 -16,12l-5 1 0 7c9,-2 20,-4 29,-6 9,-2 20,-4 28,-4l0 -7 -4 1c-16,3 -16,0 -16,-7l0 -19 21 -3 0 -7 -21 4 0 -97c0,-4 0,-5 -3,-5 -2,1 -3,1 -5,4l-65 111 0 6zm6 -8l52 -88 0 79 -52 9z"/>
  <path id="2" class="fil3" d="M1364 2474l78 -14 6 -38 -5 1c-1,6 -3,16 -5,19 -1,2 -15,5 -20,6l-38 6 23 -25c33,-35 45,-49 45,-70 0,-24 -19,-38 -45,-33 -24,4 -39,26 -39,45 0,12 10,10 11,10 4,-1 11,-5 11,-13 0,-6 -4,-11 -11,-9 -2,0 -2,0 -3,0 5,-14 16,-24 29,-26 19,-4 28,12 28,29 0,17 -11,36 -22,51l-41 52c-2,3 -2,3 -2,9z"/>
  <path class="fil3" d="M1554 896c0,3 3,3 4,3 11,-2 23,-5 34,-7 11,-2 22,-3 33,-5 2,0 6,-1 6,-6 0,-4 -2,-3 -8,-2 -16,2 -16,0 -16,-2 0,-1 0,-2 1,-6l19 -80 77 -14 -18 79c-3,10 -4,12 -24,16 -4,0 -7,1 -7,6 0,4 3,3 4,3 11,-2 22,-5 33,-7 11,-2 23,-3 34,-5 2,0 5,-1 5,-6 0,-3 -2,-3 -7,-2 -17,3 -17,1 -17,-2 0,0 0,-2 1,-7l39 -159c2,-10 4,-12 22,-15 6,-1 8,-2 8,-7 0,-3 -2,-3 -4,-3 -10,2 -22,5 -33,7 -11,2 -23,3 -34,5 -1,0 -5,1 -5,6 0,4 2,3 7,2 9,-1 17,-3 17,2 0,1 0,2 -1,6l-18 72 -77 14 17 -71c2,-10 5,-12 22,-16 6,-1 9,-1 9,-6 0,-3 -2,-4 -4,-3 -11,2 -22,5 -33,7 -12,2 -23,3 -34,5 -2,0 -6,1 -6,6 0,3 3,3 8,2 9,-2 16,-3 16,2 0,1 0,1 -1,6l-38 159c-2,10 -4,13 -23,16 -5,1 -8,2 -8,7z"/>
  <path id="1" class="fil3" d="M1765 780c5,-1 17,-3 28,-11l0 110c0,7 -1,10 -20,13l-6 2 0 6c7,-2 25,-5 34,-7 8,-1 27,-4 34,-5l0 -7 -7 2c-19,3 -19,1 -19,-7l0 -119c0,-5 0,-5 -5,-4 -13,15 -32,19 -39,20l0 7z"/>
  <path id="2" class="fil3" d="M1861 855c0,19 20,30 43,26 26,-5 45,-28 45,-49 0,-18 -13,-32 -35,-32 17,-9 29,-26 29,-43 0,-17 -18,-26 -39,-22 -21,4 -37,19 -37,35 0,7 5,10 11,9 6,-1 11,-6 11,-12 0,-11 -10,-9 -14,-9 7,-11 21,-16 29,-18 8,-1 20,1 20,20 0,3 0,15 -6,26 -6,11 -14,13 -19,14 -2,0 -7,2 -8,2 -2,1 -3,1 -3,3 0,2 1,2 5,2l9 -2c17,-3 25,10 25,31 0,28 -14,37 -24,39 -9,1 -25,1 -32,-11 7,0 14,-6 14,-14 0,-7 -6,-11 -12,-9 -5,0 -12,5 -12,14z"/>
  <path class="fil3" d="M1554 1396c0,3 3,3 4,3 11,-2 23,-5 34,-7 11,-2 22,-3 33,-5 2,0 6,-1 6,-6 0,-4 -2,-3 -8,-2 -16,2 -16,0 -16,-2 0,-1 0,-2 1,-6l19 -80 77 -14 -18 79c-3,10 -4,12 -24,16 -4,0 -7,1 -7,6 0,4 3,3 4,3 11,-2 22,-5 33,-7 11,-2 23,-3 34,-5 2,0 5,-1 5,-6 0,-3 -2,-3 -7,-2 -17,3 -17,1 -17,-2 0,0 0,-2 1,-7l39 -159c2,-10 4,-12 22,-15 6,-1 8,-2 8,-7 0,-3 -2,-3 -4,-3 -10,2 -22,5 -33,7 -11,2 -23,3 -34,5 -1,0 -5,1 -5,6 0,4 2,3 7,2 9,-1 17,-3 17,2 0,1 0,2 -1,6l-18 72 -77 14 17 -71c2,-10 5,-12 22,-16 6,-1 9,-1 9,-6 0,-3 -2,-4 -4,-3 -11,2 -22,5 -33,7 -12,2 -23,3 -34,5 -2,0 -6,1 -6,6 0,3 3,3 8,2 9,-2 16,-3 16,2 0,1 0,1 -1,6l-38 159c-2,10 -4,13 -23,16 -5,1 -8,2 -8,7z"/>
  <path id="1" class="fil3" d="M1757 1402l79 -14 6 -38 -6 1c-1,7 -2,16 -4,20 -2,2 -16,4 -20,5l-39 7 23 -26c33,-35 46,-49 46,-70 0,-24 -19,-38 -45,-33 -24,4 -40,26 -40,45 0,12 11,10 11,10 4,-1 11,-4 11,-13 0,-6 -3,-10 -11,-9 -2,0 -2,0 -3,1 5,-15 17,-25 29,-27 19,-3 28,12 28,29 0,17 -10,36 -22,51l-41 53c-2,2 -2,3 -2,8z"/>
  <path id="2" class="fil3" d="M1861 1355c0,19 20,30 43,26 26,-5 45,-28 45,-49 0,-18 -13,-32 -35,-32 17,-9 29,-26 29,-43 0,-17 -18,-26 -39,-22 -21,4 -37,19 -37,35 0,7 5,10 11,9 6,-1 11,-6 11,-12 0,-11 -10,-9 -14,-9 7,-11 21,-16 29,-18 8,-1 20,1 20,20 0,3 0,15 -6,26 -6,11 -14,13 -19,14 -2,0 -7,2 -8,2 -2,1 -3,1 -3,3 0,2 1,2 5,2l9 -2c17,-3 25,10 25,31 0,28 -14,37 -24,39 -9,1 -25,1 -32,-11 7,0 14,-6 14,-14 0,-7 -6,-11 -12,-9 -5,0 -12,5 -12,14z"/>
  <path class="fil3" d="M1554 1896c0,3 3,3 4,3 11,-2 23,-5 34,-7 11,-2 22,-3 33,-5 2,0 6,-1 6,-6 0,-4 -2,-3 -8,-2 -16,2 -16,0 -16,-2 0,-1 0,-2 1,-6l19 -80 77 -14 -18 79c-3,10 -4,12 -24,16 -4,0 -7,1 -7,6 0,4 3,3 4,3 11,-2 22,-5 33,-7 11,-2 23,-3 34,-5 2,0 5,-1 5,-6 0,-3 -2,-3 -7,-2 -17,3 -17,1 -17,-2 0,0 0,-2 1,-7l39 -159c2,-10 4,-12 22,-15 6,-1 8,-2 8,-7 0,-3 -2,-3 -4,-3 -10,2 -22,5 -33,7 -11,2 -23,3 -34,5 -1,0 -5,1 -5,6 0,4 2,3 7,2 9,-1 17,-3 17,2 0,1 0,2 -1,6l-18 72 -77 14 17 -71c2,-10 5,-12 22,-16 6,-1 9,-1 9,-6 0,-3 -2,-4 -4,-3 -11,2 -22,5 -33,7 -12,2 -23,3 -34,5 -2,0 -6,1 -6,6 0,3 3,3 8,2 9,-2 16,-3 16,2 0,1 0,1 -1,6l-38 159c-2,10 -4,13 -23,16 -5,1 -8,2 -8,7z"/>
  <path id="1" class="fil3" d="M1755 1874c0,19 20,29 43,25 26,-4 45,-27 45,-49 0,-17 -13,-31 -35,-32 17,-8 30,-25 30,-42 0,-17 -19,-26 -39,-22 -22,3 -38,19 -38,35 0,7 5,10 11,9 7,-1 11,-7 11,-13 0,-10 -10,-8 -13,-8 6,-11 20,-17 28,-18 8,-2 20,1 20,20 0,3 0,15 -6,25 -6,12 -13,13 -19,15 -1,0 -6,1 -8,2 -2,0 -3,1 -3,3 0,2 1,2 5,1l9 -1c18,-3 25,10 25,30 0,29 -14,38 -23,39 -10,2 -25,1 -33,-10 8,0 14,-6 14,-14 0,-8 -6,-11 -12,-10 -5,1 -12,5 -12,15z"/>
  <path id="2" class="fil3" d="M1861 1855c0,19 20,30 43,26 26,-5 45,-28 45,-49 0,-18 -13,-32 -35,-32 17,-9 29,-26 29,-43 0,-17 -18,-26 -39,-22 -21,4 -37,19 -37,35 0,7 5,10 11,9 6,-1 11,-6 11,-12 0,-11 -10,-9 -14,-9 7,-11 21,-16 29,-18 8,-1 20,1 20,20 0,3 0,15 -6,26 -6,11 -14,13 -19,14 -2,0 -7,2 -8,2 -2,1 -3,1 -3,3 0,2 1,2 5,2l9 -2c17,-3 25,10 25,31 0,28 -14,37 -24,39 -9,1 -25,1 -32,-11 7,0 14,-6 14,-14 0,-7 -6,-11 -12,-9 -5,0 -12,5 -12,14z"/>
  <path class="fil3" d="M1554 2396c0,3 3,3 4,3 11,-2 23,-5 34,-7 11,-2 22,-3 33,-5 2,0 6,-1 6,-6 0,-4 -2,-3 -8,-2 -16,2 -16,0 -16,-2 0,-1 0,-2 1,-6l19 -80 77 -14 -18 79c-3,10 -4,12 -24,16 -4,0 -7,1 -7,6 0,4 3,3 4,3 11,-2 22,-5 33,-7 11,-2 23,-3 34,-5 2,0 5,-1 5,-6 0,-3 -2,-3 -7,-2 -17,3 -17,1 -17,-2 0,0 0,-2 1,-7l39 -159c2,-10 4,-12 22,-15 6,-1 8,-2 8,-7 0,-3 -2,-3 -4,-3 -10,2 -22,5 -33,7 -11,2 -23,3 -34,5 -1,0 -5,1 -5,6 0,4 2,3 7,2 9,-1 17,-3 17,2 0,1 0,2 -1,6l-18 72 -77 14 17 -71c2,-10 5,-12 22,-16 6,-1 9,-1 9,-6 0,-3 -2,-4 -4,-3 -11,2 -22,5 -33,7 -12,2 -23,3 -34,5 -2,0 -6,1 -6,6 0,3 3,3 8,2 9,-2 16,-3 16,2 0,1 0,1 -1,6l-38 159c-2,10 -4,13 -23,16 -5,1 -8,2 -8,7z"/>
  <path id="1" class="fil3" d="M1752 2368l57 -10 0 18c0,8 -1,10 -16,13l-5 1 0 6c9,-2 20,-4 29,-5 9,-2 20,-4 29,-5l0 -6 -5 0c-15,3 -16,1 -16,-7l0 -18 21 -4 0 -6 -21 3 0 -96c0,-4 0,-5 -3,-5 -2,0 -3,1 -5,3l-65 111 0 7zm6 -8l52 -88 0 79 -52 9z"/>
  <path id="2" class="fil3" d="M1861 2355c0,19 20,30 43,26 26,-5 45,-28 45,-49 0,-18 -13,-32 -35,-32 17,-9 29,-26 29,-43 0,-17 -18,-26 -39,-22 -21,4 -37,19 -37,35 0,7 5,10 11,9 6,-1 11,-6 11,-12 0,-11 -10,-9 -14,-9 7,-11 21,-16 29,-18 8,-1 20,1 20,20 0,3 0,15 -6,26 -6,11 -14,13 -19,14 -2,0 -7,2 -8,2 -2,1 -3,1 -3,3 0,2 1,2 5,2l9 -2c17,-3 25,10 25,31 0,28 -14,37 -24,39 -9,1 -25,1 -32,-11 7,0 14,-6 14,-14 0,-7 -6,-11 -12,-9 -5,0 -12,5 -12,14z"/>
  <path class="fil3" d="M2053 811c0,3 3,2 4,2 11,-2 22,-5 33,-6 11,-2 23,-4 34,-6 2,0 5,-1 5,-6 0,-3 -2,-3 -7,-2 -17,3 -17,1 -17,-2 0,-1 0,-2 2,-6l18 -80 78 -13 -19 78c-2,10 -4,13 -23,16 -5,1 -8,1 -8,7 0,3 3,3 4,3 11,-2 23,-5 34,-7 11,-2 22,-3 33,-5 2,-1 6,-1 6,-6 0,-4 -2,-4 -8,-3 -16,3 -16,1 -16,-2 0,0 0,-2 1,-6l38 -160c2,-9 5,-12 22,-15 6,-1 9,-1 9,-6 0,-4 -2,-4 -4,-3 -11,1 -22,4 -33,6 -12,2 -23,3 -34,5 -2,1 -6,1 -6,7 0,3 3,3 8,2 9,-2 16,-3 16,2 0,1 0,1 -1,5l-17 72 -77 14 17 -71c2,-9 4,-12 22,-15 6,-1 8,-2 8,-7 0,-3 -2,-3 -4,-3 -10,2 -22,5 -33,7 -11,2 -23,3 -34,5 -1,0 -5,1 -5,6 0,4 2,3 8,2 8,-1 16,-2 16,2 0,1 0,2 -1,6l-38 160c-3,10 -4,12 -23,16 -5,1 -8,1 -8,7z"/>
  <path id="1" class="fil3" d="M2264 694c4,-1 17,-3 28,-10l0 109c0,8 -1,10 -20,14l-7 1 0 7c8,-2 26,-6 34,-7 9,-2 27,-5 35,-6l0 -6 -7 1c-19,3 -20,1 -20,-7l0 -118c0,-5 0,-6 -5,-5 -13,16 -31,19 -38,20l0 7z"/>
  <path id="2" class="fil3" d="M2357 763l56 -9 0 18c0,8 0,10 -16,13l-4 1 0 6c8,-2 19,-4 28,-6 9,-1 20,-3 29,-4l0 -7 -4 1c-16,3 -17,1 -17,-7l0 -18 22 -4 0 -7 -22 4 0 -96c0,-4 0,-6 -3,-5 -2,0 -2,0 -4,3l-65 111 0 6zm6 -7l51 -88 0 79 -51 9z"/>
  <path class="fil3" d="M2053 1311c0,3 3,2 4,2 11,-2 22,-5 33,-6 11,-2 23,-4 34,-6 2,0 5,-1 5,-6 0,-3 -2,-3 -7,-2 -17,3 -17,1 -17,-2 0,-1 0,-2 2,-6l18 -80 78 -13 -19 78c-2,10 -4,13 -23,16 -5,1 -8,1 -8,7 0,3 3,3 4,3 11,-2 23,-5 34,-7 11,-2 22,-3 33,-5 2,-1 6,-1 6,-6 0,-4 -2,-4 -8,-3 -16,3 -16,1 -16,-2 0,0 0,-2 1,-6l38 -160c2,-9 5,-12 22,-15 6,-1 9,-1 9,-6 0,-4 -2,-4 -4,-3 -11,1 -22,4 -33,6 -12,2 -23,3 -34,5 -2,1 -6,1 -6,7 0,3 3,3 8,2 9,-2 16,-3 16,2 0,1 0,1 -1,5l-17 72 -77 14 17 -71c2,-9 4,-12 22,-15 6,-1 8,-2 8,-7 0,-3 -2,-3 -4,-3 -10,2 -22,5 -33,7 -11,2 -23,3 -34,5 -1,0 -5,1 -5,6 0,4 2,3 8,2 8,-1 16,-2 16,2 0,1 0,2 -1,6l-38 160c-3,10 -4,12 -23,16 -5,1 -8,1 -8,7z"/>
  <path id="1" class="fil3" d="M2256 1316l78 -14 6 -37 -5 0c-1,7 -3,17 -5,20 -1,2 -15,5 -20,5l-38 7 22 -26c33,-35 46,-48 46,-70 0,-24 -19,-37 -45,-33 -24,5 -39,27 -39,46 0,11 10,10 11,9 3,0 11,-4 11,-13 0,-5 -4,-10 -11,-9 -2,1 -2,1 -3,1 5,-15 16,-24 28,-27 20,-3 29,13 29,30 0,17 -11,35 -22,51l-41 52c-2,3 -2,3 -2,8z"/>
  <path id="2" class="fil3" d="M2357 1263l56 -9 0 18c0,8 0,10 -16,13l-4 1 0 6c8,-2 19,-4 28,-6 9,-1 20,-3 29,-4l0 -7 -4 1c-16,3 -17,1 -17,-7l0 -18 22 -4 0 -7 -22 4 0 -96c0,-4 0,-6 -3,-5 -2,0 -2,0 -4,3l-65 111 0 6zm6 -7l51 -88 0 79 -51 9z"/>
  <path class="fil3" d="M2053 1808c0,4 3,3 4,3 11,-2 22,-5 33,-7 11,-2 23,-3 34,-5 2,0 5,-1 5,-6 0,-4 -2,-3 -7,-2 -17,3 -17,0 -17,-2 0,-1 0,-2 2,-6l18 -80 78 -14 -19 79c-2,10 -4,12 -23,16 -5,1 -8,1 -8,6 0,4 3,3 4,3 11,-2 23,-5 34,-7 11,-2 22,-3 33,-5 2,0 6,-1 6,-6 0,-3 -2,-3 -8,-2 -16,3 -16,1 -16,-2 0,0 0,-2 1,-7l38 -159c2,-9 5,-12 22,-15 6,-1 9,-2 9,-7 0,-3 -2,-3 -4,-3 -11,2 -22,5 -33,7 -12,2 -23,3 -34,5 -2,0 -6,1 -6,6 0,4 3,3 8,2 9,-1 16,-2 16,2 0,1 0,2 -1,6l-17 72 -77 14 17 -71c2,-10 4,-12 22,-16 6,-1 8,-1 8,-6 0,-3 -2,-3 -4,-3 -10,2 -22,5 -33,7 -11,2 -23,3 -34,5 -1,0 -5,1 -5,6 0,3 2,3 8,2 8,-1 16,-3 16,2 0,1 0,1 -1,6l-38 160c-3,10 -4,12 -23,15 -5,1 -8,2 -8,7z"/>
  <path id="1" class="fil3" d="M2254 1786c0,19 20,29 43,25 26,-4 45,-27 45,-48 0,-18 -14,-32 -36,-33 18,-8 30,-25 30,-42 0,-17 -19,-26 -39,-22 -21,3 -37,19 -37,35 0,7 4,10 10,9 7,-1 11,-6 11,-13 0,-10 -10,-8 -13,-8 7,-11 21,-17 28,-18 9,-1 21,1 21,20 0,3 -1,15 -6,25 -7,12 -14,14 -19,15 -2,0 -7,2 -8,2 -2,0 -4,1 -4,3 0,2 2,2 6,1l9 -1c17,-3 25,10 25,30 0,29 -15,38 -24,40 -9,1 -25,0 -32,-11 7,0 14,-6 14,-14 0,-8 -6,-11 -12,-10 -5,1 -12,5 -12,15z"/>
  <path id="2" class="fil3" d="M2357 1761l56 -10 0 19c0,7 0,10 -16,12l-4 1 0 7c8,-2 19,-4 28,-6 9,-1 20,-3 29,-4l0 -7 -4 1c-16,3 -17,0 -17,-7l0 -19 22 -3 0 -7 -22 4 0 -97c0,-4 0,-5 -3,-4 -2,0 -2,0 -4,3l-65 111 0 6zm6 -7l51 -88 0 78 -51 10z"/>
  <path class="fil3" d="M2053 2311c0,3 3,2 4,2 11,-2 22,-5 33,-6 11,-2 23,-4 34,-6 2,0 5,-1 5,-6 0,-3 -2,-3 -7,-2 -17,3 -17,1 -17,-2 0,-1 0,-2 2,-6l18 -80 78 -13 -19 78c-2,10 -4,13 -23,16 -5,1 -8,1 -8,7 0,3 3,3 4,3 11,-2 23,-5 34,-7 11,-2 22,-3 33,-5 2,-1 6,-1 6,-6 0,-4 -2,-4 -8,-3 -16,3 -16,1 -16,-2 0,0 0,-2 1,-6l38 -160c2,-9 5,-12 22,-15 6,-1 9,-1 9,-6 0,-4 -2,-4 -4,-3 -11,1 -22,4 -33,6 -12,2 -23,3 -34,5 -2,1 -6,1 -6,7 0,3 3,3 8,2 9,-2 16,-3 16,2 0,1 0,1 -1,5l-17 72 -77 14 17 -71c2,-9 4,-12 22,-15 6,-1 8,-2 8,-7 0,-3 -2,-3 -4,-3 -10,2 -22,5 -33,7 -11,2 -23,3 -34,5 -1,0 -5,1 -5,6 0,4 2,3 8,2 8,-1 16,-2 16,2 0,1 0,2 -1,6l-38 160c-3,10 -4,12 -23,16 -5,1 -8,1 -8,7z"/>
  <path id="1" class="fil3" d="M2251 2282l56 -10 0 19c0,7 0,10 -16,12l-4 1 0 7c8,-2 19,-4 28,-6 9,-1 20,-3 29,-4l0 -7 -4 1c-16,3 -16,0 -16,-7l0 -19 21 -3 0 -7 -21 4 0 -97c0,-4 0,-5 -4,-4 -2,0 -2,0 -4,3l-65 111 0 6zm6 -7l52 -89 0 79 -52 10z"/>
  <path id="2" class="fil3" d="M2357 2263l56 -9 0 18c0,8 0,10 -16,13l-4 1 0 6c8,-2 19,-4 28,-6 9,-1 20,-3 29,-4l0 -7 -4 1c-16,3 -17,1 -17,-7l0 -18 22 -4 0 -7 -22 4 0 -96c0,-4 0,-6 -3,-5 -2,0 -2,0 -4,3l-65 111 0 6zm6 -7l51 -88 0 79 -51 9z"/>
  <rect class="fil1 str1" transform="matrix(1 -0.176327 -0 1 501.74 760.094)" width="2000" height="2000"/>
  <g>
   <path class="fil5" d="M1502 1584l2000 -353 0 2000 -2000 353 0 -2000z"/>
   <path id="1" class="fil1 str0" d="M1502 1584l2000 -353 0 2000 -2000 353 0 -2000z"/>
  </g>
  <rect class="fil1 str1" x="8583" y="2204" width="1000" height="1000"/>
  <rect class="fil1 str1" x="9583" y="3204" width="1000" height="1000"/>
  <path class="fil3" d="M8615 2451l75 0 0 -16 -75 0 0 16z"/>
  <path class="fil3" d="M8618 2951l75 0 0 -16 -75 0 0 16z"/>
  <path class="fil3" d="M9103 2451l75 0 0 -16 -75 0 0 16z"/>
  <path class="fil3" d="M9103 2943l75 0 0 -17 -75 0 0 17z"/>
  <rect class="fil0 str0" transform="matrix(0.752831 -0.132744 -0 0.752831 2501.74 2407.44)" width="664" height="664"/>
  <rect class="fil0 str0" transform="matrix(0.752831 -0.132744 -0 0.752831 2501.74 2907.44)" width="664" height="664"/>
  <rect class="fil0 str0" transform="matrix(0.752831 -0.132744 -0 0.752831 3001.74 2319.28)" width="664" height="664"/>
  <rect class="fil0 str0" transform="matrix(0.752831 -0.132744 -0 0.752831 3001.74 2819.28)" width="664" height="664"/>
  <path class="fil3" d="M2594 2733c0,4 3,3 4,3 11,-2 23,-5 34,-7 11,-2 22,-3 33,-5 2,0 6,-1 6,-6 0,-3 -2,-3 -8,-2 -16,3 -16,1 -16,-2 0,-1 0,-2 1,-6l19 -80 77 -14 -18 79c-3,10 -4,13 -24,16 -4,1 -7,1 -7,7 0,3 3,3 4,2 11,-2 22,-4 33,-6 11,-2 23,-4 34,-5 2,-1 5,-1 5,-6 0,-4 -2,-4 -7,-3 -17,3 -17,1 -17,-2 0,0 0,-2 1,-6l39 -160c2,-9 4,-12 22,-15 6,-1 8,-2 8,-7 0,-3 -2,-3 -4,-3 -10,2 -22,5 -33,7 -11,2 -23,3 -34,5 -1,1 -5,1 -5,7 0,3 2,3 7,2 9,-2 17,-3 17,2 0,0 0,1 -1,5l-18 72 -77 14 17 -71c2,-10 5,-12 22,-15 6,-1 9,-2 9,-7 0,-3 -2,-3 -4,-3 -11,2 -22,5 -33,7 -12,2 -23,3 -34,5 -2,0 -6,1 -6,6 0,4 3,3 8,2 9,-1 16,-3 16,2 0,1 0,2 -1,6l-38 160c-2,10 -4,12 -23,16 -5,0 -8,1 -8,6z"/>
  <path id="1" class="fil3" d="M2795 2711c0,19 20,30 43,26 26,-5 45,-28 45,-49 0,-18 -13,-32 -35,-32 17,-9 30,-26 30,-43 0,-17 -19,-26 -39,-22 -22,4 -38,19 -38,35 0,7 5,10 11,9 7,-1 11,-6 11,-12 0,-11 -10,-9 -13,-9 6,-11 20,-16 28,-18 8,-1 20,1 20,20 0,3 0,15 -6,26 -6,11 -13,13 -19,14 -1,0 -6,2 -8,2 -2,1 -3,1 -3,3 0,2 1,2 5,2l9 -2c18,-3 25,10 25,31 0,28 -14,37 -23,39 -10,1 -25,1 -33,-11 8,0 14,-6 14,-14 0,-7 -6,-11 -12,-10 -5,1 -12,6 -12,15z"/>
  <path id="2" class="fil3" d="M2901 2692c0,19 20,30 43,26 26,-5 45,-27 45,-49 0,-17 -13,-31 -35,-32 17,-9 29,-26 29,-42 0,-18 -18,-26 -39,-23 -21,4 -37,19 -37,36 0,7 5,10 11,9 6,-1 11,-7 11,-13 0,-11 -10,-9 -14,-8 7,-12 21,-17 29,-18 8,-2 20,1 20,20 0,2 0,15 -6,25 -6,11 -14,13 -19,14 -2,1 -7,2 -8,2 -2,1 -3,1 -3,3 0,3 1,3 5,2l9 -2c17,-3 25,10 25,31 0,29 -14,37 -24,39 -9,2 -25,1 -32,-10 7,-1 14,-6 14,-14 0,-8 -6,-11 -12,-10 -5,1 -12,5 -12,14z"/>
  <path class="fil3" d="M2594 3213c0,3 3,3 4,2 11,-1 23,-4 34,-6 11,-2 22,-3 33,-5 2,-1 6,-1 6,-6 0,-4 -2,-4 -8,-3 -16,3 -16,1 -16,-2 0,-1 0,-1 1,-6l19 -80 77 -13 -18 78c-3,10 -4,13 -24,16 -4,1 -7,2 -7,7 0,3 3,3 4,3 11,-2 22,-5 33,-7 11,-2 23,-3 34,-5 2,0 5,-1 5,-6 0,-4 -2,-3 -7,-2 -17,2 -17,0 -17,-2 0,-1 0,-3 1,-7l39 -159c2,-10 4,-13 22,-16 6,-1 8,-1 8,-6 0,-3 -2,-4 -4,-3 -10,2 -22,5 -33,6 -11,2 -23,4 -34,6 -1,0 -5,1 -5,6 0,3 2,3 7,2 9,-2 17,-3 17,2 0,1 0,1 -1,5l-18 73 -77 13 17 -71c2,-9 5,-12 22,-15 6,-1 9,-1 9,-7 0,-3 -2,-3 -4,-3 -11,2 -22,5 -33,7 -12,2 -23,3 -34,5 -2,1 -6,1 -6,7 0,3 3,3 8,2 9,-2 16,-3 16,2 0,0 0,1 -1,5l-38 160c-2,10 -4,13 -23,16 -5,1 -8,1 -8,7z"/>
  <path id="1" class="fil3" d="M2792 3184l57 -10 0 19c0,7 -1,10 -16,13l-5 0 0 7c9,-2 20,-4 29,-6 9,-1 20,-3 29,-4l0 -7 -5 1c-15,3 -16,1 -16,-7l0 -18 21 -4 0 -7 -21 4 0 -96c0,-5 0,-6 -3,-5 -2,0 -3,0 -5,3l-65 111 0 6zm6 -7l52 -88 0 79 -52 9z"/>
  <path id="2" class="fil3" d="M2901 3172c0,19 20,29 43,25 26,-4 45,-27 45,-49 0,-17 -13,-31 -35,-32 17,-8 29,-25 29,-42 0,-18 -18,-26 -39,-22 -21,3 -37,19 -37,35 0,7 5,10 11,9 6,-1 11,-7 11,-13 0,-10 -10,-9 -14,-8 7,-11 21,-17 29,-18 8,-2 20,1 20,20 0,3 0,15 -6,25 -6,12 -14,13 -19,15 -2,0 -7,1 -8,2 -2,0 -3,1 -3,3 0,2 1,2 5,1l9 -1c17,-4 25,10 25,30 0,29 -14,38 -24,39 -9,2 -25,1 -32,-10 7,0 14,-6 14,-14 0,-8 -6,-11 -12,-10 -5,1 -12,5 -12,15z"/>
  <path class="fil3" d="M3073 2628c0,4 3,3 4,3 11,-2 22,-5 33,-7 11,-2 23,-3 34,-5 2,0 5,-1 5,-6 0,-3 -2,-3 -7,-2 -17,3 -17,0 -17,-2 0,-1 0,-2 2,-6l18 -80 78 -14 -19 79c-2,10 -4,13 -23,16 -5,1 -8,1 -8,7 0,3 3,2 4,2 11,-2 23,-4 34,-6 11,-2 22,-4 33,-6 2,0 6,0 6,-6 0,-3 -2,-3 -8,-2 -16,3 -16,1 -16,-2 0,0 0,-2 1,-6l38 -160c2,-9 5,-12 22,-15 6,-1 9,-2 9,-7 0,-3 -2,-3 -4,-3 -11,2 -22,5 -33,7 -12,2 -23,3 -34,5 -2,1 -6,1 -6,7 0,3 3,3 8,2 9,-2 16,-3 16,1 0,1 0,2 -1,6l-17 72 -77 14 17 -71c2,-10 4,-12 22,-15 6,-1 8,-2 8,-7 0,-3 -2,-3 -4,-3 -10,2 -22,5 -33,7 -11,2 -23,3 -34,5 -1,0 -5,1 -5,6 0,4 2,3 8,2 8,-1 16,-3 16,2 0,1 0,2 -1,6l-38 160c-3,10 -4,12 -23,16 -5,0 -8,1 -8,6z"/>
  <path id="1" class="fil3" d="M3274 2606c0,19 20,30 43,25 26,-4 45,-27 45,-48 0,-18 -14,-32 -36,-32 18,-9 30,-26 30,-43 0,-17 -19,-26 -39,-22 -21,4 -37,19 -37,35 0,7 4,10 10,9 7,-1 11,-6 11,-12 0,-11 -10,-9 -13,-9 7,-11 21,-16 28,-18 9,-1 21,1 21,20 0,3 -1,15 -6,26 -7,11 -14,13 -19,14 -2,0 -7,2 -8,2 -2,0 -4,1 -4,3 0,2 2,2 6,1l9 -1c17,-3 25,10 25,31 0,28 -15,37 -24,39 -9,1 -25,0 -32,-11 7,0 14,-6 14,-14 0,-7 -6,-11 -12,-10 -5,1 -12,5 -12,15z"/>
  <path id="2" class="fil3" d="M3377 2581l56 -10 0 19c0,7 0,10 -16,13l-4 0 0 7c8,-2 19,-4 28,-6 9,-1 20,-3 29,-4l0 -7 -4 1c-16,3 -17,1 -17,-7l0 -18 22 -4 0 -7 -22 4 0 -96c0,-5 0,-6 -3,-5 -2,0 -2,0 -4,3l-65 111 0 6zm6 -7l51 -88 0 79 -51 9z"/>
  <path class="fil3" d="M3073 3131c0,3 3,3 4,2 11,-2 22,-4 33,-6 11,-2 23,-4 34,-5 2,-1 5,-1 5,-6 0,-4 -2,-4 -7,-3 -17,3 -17,1 -17,-2 0,-1 0,-1 2,-6l18 -80 78 -13 -19 78c-2,10 -4,13 -23,16 -5,1 -8,2 -8,7 0,3 3,3 4,3 11,-2 23,-5 34,-7 11,-2 22,-3 33,-5 2,-1 6,-1 6,-6 0,-4 -2,-4 -8,-3 -16,3 -16,1 -16,-1 0,-1 0,-3 1,-7l38 -160c2,-9 5,-12 22,-15 6,-1 9,-1 9,-6 0,-3 -2,-4 -4,-3 -11,2 -22,4 -33,6 -12,2 -23,4 -34,6 -2,0 -6,0 -6,6 0,3 3,3 8,2 9,-2 16,-3 16,2 0,1 0,1 -1,5l-17 73 -77 13 17 -71c2,-9 4,-12 22,-15 6,-1 8,-2 8,-7 0,-3 -2,-3 -4,-3 -10,2 -22,5 -33,7 -11,2 -23,3 -34,5 -1,1 -5,1 -5,7 0,3 2,3 8,2 8,-2 16,-3 16,2 0,0 0,1 -1,5l-38 160c-3,10 -4,13 -23,16 -5,1 -8,1 -8,7z"/>
  <path id="1" class="fil3" d="M3271 3102l56 -10 0 19c0,7 0,10 -16,13l-4 0 0 7c8,-2 19,-4 28,-6 9,-1 20,-3 29,-4l0 -7 -4 1c-16,3 -16,1 -16,-7l0 -18 21 -4 0 -7 -21 4 0 -96c0,-5 0,-6 -4,-5 -2,0 -2,0 -4,3l-65 111 0 6zm6 -7l52 -88 0 79 -52 9z"/>
  <path id="2" class="fil3" d="M3377 3084l56 -10 0 18c0,8 0,10 -16,13l-4 1 0 6c8,-2 19,-4 28,-5 9,-2 20,-4 29,-5l0 -6 -4 0c-16,3 -17,1 -17,-7l0 -18 22 -4 0 -6 -22 3 0 -96c0,-4 0,-6 -3,-5 -2,0 -2,1 -4,3l-65 111 0 7zm6 -8l51 -88 0 79 -51 9z"/>
  <rect class="fil1 str1" transform="matrix(1 -0.176327 -0 1 2501.74 2407.44)" width="1000" height="1000"/>
  <path class="fil3" d="M2534 2660l75 -13 0 -17 -75 13 0 17z"/>
  <path class="fil3" d="M2537 3160l75 -14 0 -16 -75 13 0 17z"/>
  <path class="fil3" d="M3022 2574l75 -13 0 -17 -75 13 0 17z"/>
  <path class="fil3" d="M3022 3066l75 -13 0 -17 -75 13 0 17z"/>
  <path class="fil1 str0" d="M2502 407l2000 1648"/>
  <path class="fil1 str0" d="M502 2760l2000 1647"/>
  <path class="fil1 str0" d="M2502 2407l1000 824"/>
  <path class="fil1 str0" d="M502 760l2000 1647"/>
  <g>
   <path class="fil5" d="M2502 2407l2000 -352 0 2000 -2000 352 0 -2000z"/>
   <path id="1" class="fil1 str0" d="M2502 2407l2000 -352 0 2000 -2000 352 0 -2000z"/>
  </g>
  <path class="fil1 str0" d="M502 1760l-500 88"/>
  <path class="fil1 str0" d="M1502 584l0 -500"/>
  <path class="fil3" d="M847 444c0,12 12,18 22,18 30,0 41,-59 43,-69l20 -102 23 0c5,0 8,0 8,-5 0,-3 -2,-3 -7,-3l-22 0c4,-21 5,-26 9,-46 2,-10 5,-25 15,-25 3,0 8,0 12,5 -8,1 -12,8 -12,13 0,7 5,10 9,10 7,0 14,-6 14,-16 0,-12 -11,-19 -23,-19 -27,0 -34,37 -36,47l-6 31 -19 0c-5,0 -8,0 -8,5 0,3 3,3 7,3l18 0 -21 106c-3,17 -6,29 -8,35 -2,9 -5,24 -16,24 -2,0 -8,-1 -11,-5 9,-2 12,-8 12,-14 0,-6 -5,-9 -9,-9 -7,0 -14,6 -14,16z"/>
  <path id="1" class="fil3" d="M956 312c0,6 5,11 11,11 6,0 12,-4 12,-11 0,-7 -6,-11 -12,-11 -6,0 -11,6 -11,11zm-9 130c7,0 18,0 23,0 8,0 15,0 22,0l0 -6c-13,0 -14,-1 -14,-9l0 -78 -30 2 0 7c14,0 16,1 16,12l0 56c0,10 -3,10 -17,10l0 6z"/>
  <path class="fil3" d="M111 1288c0,3 3,3 4,3 4,0 4,-1 5,-5 2,-8 10,-35 26,-35 3,0 6,1 6,8 0,7 -2,14 -6,25 -8,20 -15,41 -15,56 0,24 16,32 32,32 15,0 24,-8 31,-16 5,15 17,16 23,16 10,0 16,-7 20,-15 5,-11 9,-27 9,-28 0,-3 -3,-3 -5,-3 -3,0 -3,0 -5,7 -4,15 -9,33 -19,33 -7,0 -7,-7 -7,-11 0,-2 0,-7 2,-15l20 -81c1,-2 1,-3 1,-4 0,-3 -2,-7 -8,-7 -8,0 -10,8 -11,10l-21 83c-1,5 -1,5 -4,9 -5,8 -13,16 -26,16 -12,0 -15,-12 -15,-21 0,-18 10,-43 17,-62 2,-6 3,-10 3,-16 0,-14 -9,-22 -21,-22 -26,0 -36,41 -36,43z"/>
  <path id="1" class="fil3" d="M254 1277c0,6 5,11 12,11 6,0 11,-4 11,-11 0,-7 -5,-11 -11,-11 -7,0 -12,6 -12,11zm-8 130c6,0 18,0 23,0 7,0 15,0 22,0l0 -6c-14,0 -15,-1 -15,-9l0 -78 -30 2 0 7c14,0 16,1 16,12l0 56c0,10 -2,10 -16,10l0 6z"/>
  <path class="fil3" d="M1949 238c0,13 12,19 23,19 29,0 41,-59 43,-70l19 -101 24 0c4,0 7,0 7,-5 0,-4 -2,-4 -7,-4l-22 0c4,-21 5,-26 9,-45 2,-11 6,-26 16,-26 2,0 8,1 12,5 -9,2 -13,8 -13,14 0,6 5,9 10,9 7,0 14,-5 14,-15 0,-12 -12,-19 -23,-19 -28,0 -35,37 -37,46l-6 31 -19 0c-4,0 -7,0 -7,6 0,3 3,3 7,3l17 0 -20 105c-4,18 -6,29 -8,35 -2,10 -6,25 -16,25 -3,0 -8,-1 -11,-5 8,-2 12,-9 12,-14 0,-6 -5,-9 -10,-9 -7,0 -14,5 -14,15z"/>
  <path id="1" class="fil3" d="M2049 99c14,0 16,2 16,12l0 126 5 0c1,0 2,-3 8,-13 3,5 12,15 28,15 25,0 47,-20 47,-48 0,-27 -21,-47 -45,-47 -16,0 -26,9 -29,13l0 -67 -30 3 0 6zm31 114l0 -44c0,-4 0,-4 2,-7 8,-12 20,-14 25,-14 10,0 17,6 22,14 6,8 6,20 6,29 0,8 0,21 -6,30 -5,7 -13,14 -24,14 -10,0 -17,-5 -22,-13 -3,-5 -3,-5 -3,-9z"/>
  <path class="fil3" d="M111 2304c0,3 3,3 4,3 4,0 4,-1 5,-5 2,-8 10,-35 26,-35 3,0 6,1 6,8 0,7 -2,14 -6,25 -8,20 -15,41 -15,56 0,24 16,32 32,32 15,0 24,-8 31,-16 5,15 17,16 23,16 10,0 16,-7 20,-15 5,-11 9,-27 9,-28 0,-3 -3,-3 -5,-3 -3,0 -3,0 -5,7 -4,15 -9,33 -19,33 -7,0 -7,-7 -7,-11 0,-2 0,-7 2,-15l20 -81c1,-2 1,-3 1,-4 0,-3 -2,-7 -8,-7 -8,0 -10,8 -11,10l-21 83c-1,5 -1,5 -4,9 -5,8 -13,16 -26,16 -12,0 -15,-12 -15,-21 0,-18 10,-43 17,-62 2,-6 3,-10 3,-16 0,-14 -9,-22 -21,-22 -26,0 -36,41 -36,43z"/>
  <path id="1" class="fil3" d="M244 2285c15,0 17,2 17,12l0 126 5 0c0,0 2,-3 8,-13 3,5 12,16 28,16 25,0 47,-21 47,-48 0,-27 -21,-48 -45,-48 -17,0 -26,10 -29,14l0 -67 -31 2 0 6zm32 114l0 -43c0,-4 0,-5 2,-8 8,-12 20,-13 25,-13 9,0 17,5 22,13 6,9 6,21 6,30 0,7 0,20 -6,30 -5,6 -13,13 -24,13 -10,0 -17,-5 -22,-13 -3,-4 -3,-5 -3,-9z"/>
  <rect class="fil2 str0" transform="matrix(0.752831 -0.132744 -0 0.752831 3501.74 3231.11)" width="664" height="664"/>
  <rect class="fil2 str0" transform="matrix(0.752831 -0.132744 -0 0.752831 3501.74 3731.11)" width="664" height="664"/>
  <rect class="fil2 str0" transform="matrix(0.752831 -0.132744 -0 0.752831 4001.74 3142.95)" width="664" height="664"/>
  <rect class="fil2 str0" transform="matrix(0.752831 -0.132744 -0 0.752831 4001.74 3642.95)" width="664" height="664"/>
  <path class="fil3" d="M3558 3545c0,3 3,3 4,3 11,-2 23,-5 34,-7 11,-2 22,-3 34,-5 1,0 5,-1 5,-6 0,-4 -2,-3 -8,-2 -16,2 -16,0 -16,-2 0,-1 0,-2 1,-6l19 -80 77 -14 -18 79c-3,10 -4,12 -24,16 -4,0 -7,1 -7,6 0,4 3,3 4,3 11,-2 22,-5 33,-7 11,-2 23,-3 34,-5 2,0 5,-1 5,-6 0,-3 -2,-3 -7,-2 -17,3 -17,0 -17,-2 0,0 0,-2 1,-7l39 -159c2,-10 4,-12 22,-15 6,-1 8,-2 8,-7 0,-3 -2,-3 -4,-3 -10,2 -22,5 -33,7 -11,2 -23,3 -34,5 -1,0 -5,1 -5,6 0,4 2,3 7,2 9,-1 17,-3 17,2 0,1 0,2 -1,6l-18 72 -77 14 17 -71c2,-10 5,-13 22,-16 6,-1 9,-1 9,-6 0,-3 -2,-4 -4,-3 -11,2 -22,5 -33,7 -12,2 -23,3 -34,5 -2,0 -6,1 -6,6 0,3 3,3 8,2 9,-2 16,-3 16,2 0,1 0,1 -1,5l-38 160c-2,10 -4,13 -23,16 -5,1 -8,2 -8,7z"/>
  <path id="1" class="fil3" d="M3762 3451l6 -1c0,-3 2,-17 5,-20 1,-2 18,-4 21,-5l44 -8c-3,4 -19,30 -24,38 -19,32 -26,63 -26,84 0,2 0,12 10,10 9,-2 9,-11 9,-13l0 -11c0,-12 1,-24 3,-35 0,-5 3,-24 13,-39l28 -45c2,-3 2,-3 2,-8l-51 9c-26,5 -26,2 -27,-2l-6 1 -7 45z"/>
  <path id="2" class="fil3" d="M3868 3432l6 -1c0,-3 2,-17 5,-20 1,-1 18,-4 21,-5l43 -7c-2,3 -19,29 -23,37 -19,32 -26,63 -26,84 0,3 0,12 9,10 10,-1 10,-11 10,-13l0 -11c0,-11 1,-23 2,-35 1,-5 4,-24 14,-38l28 -46c2,-3 2,-3 2,-7l-51 9c-26,4 -27,1 -27,-3l-6 1 -7 45z"/>
  <path class="fil3" d="M3558 4045c0,3 3,3 4,3 11,-2 23,-5 34,-7 11,-2 22,-3 34,-5 1,0 5,-1 5,-6 0,-4 -2,-3 -8,-2 -16,2 -16,0 -16,-2 0,-1 0,-2 1,-6l19 -80 77 -14 -18 79c-3,10 -4,12 -24,16 -4,0 -7,1 -7,6 0,4 3,3 4,3 11,-2 22,-5 33,-7 11,-2 23,-3 34,-5 2,0 5,-1 5,-6 0,-3 -2,-3 -7,-2 -17,3 -17,0 -17,-2 0,0 0,-2 1,-7l39 -159c2,-10 4,-12 22,-15 6,-1 8,-2 8,-7 0,-3 -2,-3 -4,-3 -10,2 -22,5 -33,7 -11,2 -23,3 -34,5 -1,0 -5,1 -5,6 0,4 2,3 7,2 9,-1 17,-3 17,2 0,1 0,2 -1,6l-18 72 -77 14 17 -71c2,-10 5,-13 22,-16 6,-1 9,-1 9,-6 0,-3 -2,-4 -4,-3 -11,2 -22,5 -33,7 -12,2 -23,3 -34,5 -2,0 -6,1 -6,6 0,3 3,3 8,2 9,-2 16,-3 16,2 0,1 0,1 -1,5l-38 160c-2,10 -4,13 -23,16 -5,1 -8,2 -8,7z"/>
  <path id="1" class="fil3" d="M3759 4019c0,23 22,33 44,29 24,-4 44,-25 44,-48 0,-8 -2,-17 -10,-24 -4,-4 -7,-5 -21,-11 15,-11 26,-24 26,-38 0,-19 -19,-28 -39,-25 -21,4 -38,23 -38,42 0,4 1,14 9,22 3,2 11,6 16,9 -12,8 -31,23 -31,44zm11 -2c0,-12 7,-27 25,-40l26 12c6,3 16,8 16,21 0,15 -16,29 -34,32 -18,3 -33,-7 -33,-25zm4 -82c0,-13 14,-25 29,-27 16,-3 29,6 29,21 0,12 -8,24 -21,33l-26 -12c-10,-5 -11,-12 -11,-15z"/>
  <path id="2" class="fil3" d="M3868 3932l6 -1c0,-3 2,-17 5,-20 1,-1 18,-4 21,-5l43 -7c-2,3 -19,29 -23,37 -19,32 -26,63 -26,84 0,3 0,12 9,10 10,-1 10,-11 10,-13l0 -11c0,-11 1,-23 2,-35 1,-5 4,-24 14,-38l28 -46c2,-3 2,-3 2,-7l-51 9c-26,4 -27,1 -27,-3l-6 1 -7 45z"/>
  <path class="fil3" d="M4055 3457c0,4 3,3 4,3 11,-2 22,-5 33,-7 12,-2 23,-3 34,-5 2,0 6,-1 6,-6 0,-3 -2,-3 -8,-2 -16,3 -16,1 -16,-2 0,-1 0,-2 1,-6l19 -80 77 -14 -19 79c-2,10 -4,13 -23,16 -4,1 -7,1 -7,7 0,3 3,3 4,2 10,-1 22,-4 33,-6 11,-2 23,-3 34,-5 2,-1 5,-1 5,-6 0,-4 -2,-4 -7,-3 -17,3 -17,1 -17,-2 0,0 0,-2 1,-6l38 -160c3,-9 5,-12 23,-15 6,-1 8,-1 8,-7 0,-3 -2,-3 -4,-3 -11,2 -22,5 -33,7 -11,2 -23,3 -34,5 -2,1 -5,1 -5,7 0,3 2,3 7,2 9,-2 17,-3 17,2 0,0 0,1 -1,5l-18 72 -77 14 17 -71c2,-9 4,-12 22,-15 6,-1 9,-2 9,-7 0,-3 -2,-3 -4,-3 -11,2 -23,5 -34,7 -11,2 -22,3 -33,5 -2,0 -6,1 -6,6 0,4 2,3 8,2 9,-1 16,-2 16,2 0,1 0,2 -1,6l-38 160c-2,10 -4,12 -23,16 -5,1 -8,1 -8,6z"/>
  <path id="1" class="fil3" d="M4259 3363l6 0c0,-4 2,-18 5,-21 1,-1 18,-4 21,-5l43 -7c-2,4 -19,30 -23,37 -19,32 -26,63 -26,85 0,2 0,11 9,9 10,-1 10,-11 10,-13l0 -11c0,-11 1,-23 2,-35 1,-5 4,-24 14,-38l28 -46c2,-2 2,-3 2,-7l-51 9c-26,4 -27,2 -27,-2l-6 0 -7 45z"/>
  <path id="2" class="fil3" d="M4362 3413c0,22 22,33 44,29 24,-4 44,-26 44,-48 0,-8 -2,-17 -10,-24 -4,-4 -8,-6 -21,-12 15,-10 25,-23 25,-37 0,-20 -19,-28 -38,-25 -21,4 -38,23 -38,42 0,4 0,13 9,22 2,2 10,6 16,9 -13,8 -31,23 -31,44zm11 -2c0,-12 6,-27 24,-40l27 12c5,3 15,7 15,20 0,16 -15,30 -33,33 -18,3 -33,-7 -33,-25zm4 -83c0,-13 14,-24 29,-27 15,-2 29,6 29,22 0,12 -8,23 -21,33l-26 -12c-10,-5 -11,-12 -11,-16z"/>
  <path class="fil3" d="M4055 3957c0,4 3,3 4,3 11,-2 22,-5 33,-7 12,-2 23,-3 34,-5 2,0 6,-1 6,-6 0,-3 -2,-3 -8,-2 -16,3 -16,1 -16,-2 0,-1 0,-2 1,-6l19 -80 77 -14 -19 79c-2,10 -4,13 -23,16 -4,1 -7,1 -7,7 0,3 3,3 4,2 10,-1 22,-4 33,-6 11,-2 23,-3 34,-5 2,-1 5,-1 5,-6 0,-4 -2,-4 -7,-3 -17,3 -17,1 -17,-2 0,0 0,-2 1,-6l38 -160c3,-9 5,-12 23,-15 6,-1 8,-1 8,-7 0,-3 -2,-3 -4,-3 -11,2 -22,5 -33,7 -11,2 -23,3 -34,5 -2,1 -5,1 -5,7 0,3 2,3 7,2 9,-2 17,-3 17,2 0,0 0,1 -1,5l-18 72 -77 14 17 -71c2,-9 4,-12 22,-15 6,-1 9,-2 9,-7 0,-3 -2,-3 -4,-3 -11,2 -23,5 -34,7 -11,2 -22,3 -33,5 -2,0 -6,1 -6,6 0,4 2,3 8,2 9,-1 16,-2 16,2 0,1 0,2 -1,6l-38 160c-2,10 -4,12 -23,16 -5,1 -8,1 -8,6z"/>
  <path id="1" class="fil3" d="M4256 3932c0,22 22,32 44,28 24,-4 44,-25 44,-48 0,-7 -2,-16 -10,-24 -4,-4 -8,-5 -21,-11 15,-11 25,-23 25,-37 0,-20 -18,-29 -38,-25 -21,3 -38,22 -38,42 0,4 0,13 9,22 3,2 10,6 16,8 -13,9 -31,24 -31,45zm11 -2c0,-13 7,-27 25,-40l26 11c6,3 16,8 16,21 0,16 -16,29 -34,32 -18,4 -33,-7 -33,-24zm4 -83c0,-13 14,-24 29,-27 16,-3 29,6 29,21 0,12 -8,24 -21,34l-26 -13c-10,-4 -11,-11 -11,-15z"/>
  <path id="2" class="fil3" d="M4362 3913c0,22 22,33 44,29 24,-4 44,-26 44,-48 0,-8 -2,-17 -10,-24 -4,-4 -8,-6 -21,-12 15,-10 25,-23 25,-37 0,-20 -19,-28 -38,-25 -21,4 -38,23 -38,42 0,4 0,13 9,22 2,2 10,6 16,9 -13,8 -31,23 -31,44zm11 -2c0,-12 6,-27 24,-40l27 12c5,3 15,7 15,20 0,16 -15,30 -33,33 -18,3 -33,-7 -33,-25zm4 -83c0,-13 14,-24 29,-27 15,-2 29,6 29,22 0,12 -8,23 -21,33l-26 -12c-10,-5 -11,-12 -11,-16z"/>
  <rect class="fil1 str1" transform="matrix(1 -0.176327 -0 1 3501.74 3231.11)" width="1000" height="1000"/>
 </g>
</svg>
