<?xml version="1.0" encoding="UTF-8"?>
<!DOCTYPE svg PUBLIC "-//W3C//DTD SVG 1.1//EN" "http://www.w3.org/Graphics/SVG/1.1/DTD/svg11.dtd">
<!-- Creator: CorelDRAW X7 -->
<svg xmlns="http://www.w3.org/2000/svg" xml:space="preserve" width="105.655mm" height="17.6671mm" version="1.1" style="shape-rendering:geometricPrecision; text-rendering:geometricPrecision; image-rendering:optimizeQuality; fill-rule:evenodd; clip-rule:evenodd"
viewBox="0 0 75053 12550"
 xmlns:xlink="http://www.w3.org/1999/xlink">
 <defs>
  <style type="text/css">
   <![CDATA[
    .str0 {stroke:#373435;stroke-width:125.308}
    .str2 {stroke:#F06277;stroke-width:125.308}
    .str1 {stroke:#373435;stroke-width:125.308;stroke-dasharray:626.537613 375.922568}
    .fil5 {fill:none}
    .fil3 {fill:#373435}
    .fil6 {fill:#F06277}
    .fil2 {fill:#373435;fill-rule:nonzero}
    .fil9 {fill:#373435;fill-rule:nonzero}
    .fil4 {fill:#ED3237;fill-rule:nonzero}
    .fil0 {fill:url(#id0)}
    .fil7 {fill:url(#id1)}
    .fil8 {fill:url(#id2)}
    .fil1 {fill:url(#id3)}
   ]]>
  </style>
  <linearGradient id="id0" gradientUnits="userSpaceOnUse" x1="6341.03" y1="9573.67" x2="11122.4" y2="3055.26">
   <stop offset="0" style="stop-opacity:1; stop-color:#91D8F7"/>
   <stop offset="1" style="stop-opacity:1; stop-color:#FEFEFE"/>
  </linearGradient>
  <linearGradient id="id1" gradientUnits="userSpaceOnUse" xlink:href="#id0" x1="48882.1" y1="9573.67" x2="53663.4" y2="3055.26">
  </linearGradient>
  <linearGradient id="id2" gradientUnits="userSpaceOnUse" x1="64119.9" y1="9999.38" x2="70225.4" y2="2162.62">
   <stop offset="0" style="stop-opacity:1; stop-color:#6B809B"/>
   <stop offset="1" style="stop-opacity:1; stop-color:#FEFEFE"/>
  </linearGradient>
  <linearGradient id="id3" gradientUnits="userSpaceOnUse" x1="20262.7" y1="10306.6" x2="29000.6" y2="1855.39">
   <stop offset="0" style="stop-opacity:1; stop-color:#0098DA"/>
   <stop offset="1" style="stop-opacity:1; stop-color:#FEFEFE"/>
  </linearGradient>
 </defs>
 <g id="Layer_x0020_1">
  <metadata id="CorelCorpID_0Corel-Layer"/>
  <g id="_2408436127792">
   <path class="fil0 str0" d="M11253 12270c-1378,0 -4857,377 -7099,138 -2242,-238 -4050,-1031 -3928,-4135 181,-4600 -630,-6080 270,-6984 900,-904 7836,-500 8620,-458 785,41 5183,-690 6547,-690 3412,0 638,4262 1246,7299 127,633 298,1949 132,2993 -136,861 -502,1537 -1309,1493 -1724,-93 -3089,344 -4479,344z"/>
   <path class="fil1 str0" d="M17393 1693c-51,-2079 4028,-1617 4964,-1516 935,102 8311,213 8958,207 647,-6 1112,117 1103,896 -9,778 -562,2505 -201,5444 263,2160 943,4974 -2556,4824 -721,-31 -1396,-22 -2130,-63 -4406,-245 -6515,615 -8138,614 -1622,-1 -2519,-528 -2352,-1666 165,-1043 -6,-2352 -134,-2977 -384,-1886 545,-4246 486,-5763z"/>
   <path class="fil2" d="M3741 3898l0 -94 -55 0c-182,0 -224,-21 -257,-121l-655 -1895c-15,-40 -21,-61 -70,-61 -48,0 -58,18 -73,61l-627 1813c-55,155 -176,200 -340,203l0 94 309 -9 349 9 0 -94c-152,0 -227,-76 -227,-155 0,-9 3,-39 6,-45l139 -397 749 0 161 464c3,12 9,30 9,42 0,91 -170,91 -252,91l0 94c109,-9 322,-9 437,-9l397 9zm-785 -785l-683 0 340 -986 343 986z"/>
   <path class="fil2" d="M30389 9973c0,-263 -248,-491 -585,-527 294,-58 504,-252 504,-476 0,-264 -279,-513 -674,-513l-1109 0 0 94 72 0c234,0 240,34 240,143l0 1598c0,109 -6,142 -240,142l-72 0 0 94 1188 0c404,0 676,-270 676,-555l0 0zm-376 -1003c0,194 -148,449 -485,449l-439 0 0 -746c0,-100 6,-122 148,-122l376 0c294,0 400,258 400,419l0 0zm73 1000c0,216 -157,464 -470,464l-379 0c-142,0 -148,-21 -148,-121l0 -828 570 0c300,0 427,282 427,485l0 0z"/>
   <circle class="fil3 str0" cx="4781" cy="7992" r="391"/>
   <circle class="fil3 str0" cx="16832" cy="6004" r="391"/>
   <circle class="fil3 str0" cx="29758" cy="2487" r="391"/>
   <path class="fil2" d="M5360 10478c0,-42 -39,-42 -85,-42 -72,0 -75,3 -97,79 -24,100 -78,327 -182,327 -36,0 -57,-24 -57,-94 0,-58 6,-82 18,-130l209 -840c12,-46 12,-52 12,-67 0,-94 -72,-130 -136,-130 -40,0 -158,18 -194,169l-209 852c-12,55 -15,67 -100,152 -43,39 -119,88 -210,88 -151,0 -157,-142 -157,-209 0,-182 103,-452 176,-643 27,-76 42,-112 42,-164 0,-170 -155,-270 -318,-270 -316,0 -464,410 -464,473 0,43 39,43 85,43 57,0 72,0 85,-40 24,-78 106,-366 279,-366 15,0 42,0 42,54 0,64 -36,158 -55,200 -97,261 -182,479 -182,649 0,276 198,382 449,382 85,0 212,-15 361,-154 58,106 194,154 312,154 143,0 219,-103 258,-164 79,-127 118,-297 118,-309z"/>
   <path id="1" class="fil2" d="M5892 11533l0 -47 -48 0c-136,0 -141,-16 -141,-72l0 -851c0,-36 0,-39 -35,-39 -94,97 -227,97 -276,97l0 47c30,0 120,0 199,-40l0 786c0,54 -5,72 -141,72l-49 0 0 47c53,-4 185,-4 246,-4 61,0 192,0 245,4z"/>
   <path class="fil4" d="M13999 3074c0,-143 -143,-240 -343,-240 -376,0 -464,331 -491,485l-55 297 -279 0c-51,0 -106,0 -106,88 0,55 52,55 97,55l261 0 -212 1155c-31,161 -37,194 -76,346 -9,45 -52,206 -152,206 0,0 -48,0 -91,-24 100,-52 125,-146 125,-194 0,-82 -61,-140 -152,-140 -109,0 -215,94 -215,228 0,148 151,239 330,239 112,0 364,-64 507,-512 39,-131 54,-188 78,-322l182 -982 334 0c51,0 106,0 106,-88 0,-55 -55,-55 -97,-55l-315 0c24,-142 97,-554 118,-597 15,-39 60,-76 103,-76 12,0 55,3 97,25 -67,36 -121,109 -121,194 0,81 60,139 151,139 106,0 216,-91 216,-227z"/>
   <path id="1" class="fil4" d="M14261 5305l-38 0c-8,46 -18,112 -33,135 -11,12 -111,12 -144,12l-273 0 160 -156c237,-209 328,-291 328,-442 0,-173 -137,-295 -322,-295 -171,0 -283,140 -283,275 0,85 76,85 80,85 26,0 79,-19 79,-81 0,-39 -27,-79 -80,-79 -12,0 -15,0 -20,2 35,-99 117,-155 205,-155 138,0 203,123 203,248 0,121 -76,241 -159,335l-291 324c-17,17 -17,20 -17,56l562 0 43 -264z"/>
   <path id="2" class="fil4" d="M14967 3266c0,-15 -12,-18 -19,-18 -14,0 -17,9 -20,21 -53,156 -190,156 -205,156 -76,0 -136,-45 -171,-101 -46,-73 -46,-173 -46,-228l423 0c34,0 38,0 38,-31 0,-151 -82,-298 -271,-298 -176,0 -315,157 -315,346 0,203 159,350 333,350 185,0 253,-168 253,-197zm-100 -201l-359 0c9,-226 136,-264 188,-264 156,0 171,204 171,264z"/>
   <path id="3" class="fil4" d="M15810 3741l0 -47c-101,0 -118,0 -118,-69l0 -848 -33 0 -58 137c-20,-42 -82,-137 -203,-137 -176,0 -335,147 -335,344 0,189 147,342 323,342 106,0 168,-65 201,-109l0 271c0,69 -16,69 -118,69l0 47 170 -5 171 5zm-218 -501c0,49 -27,91 -61,128 -19,21 -68,62 -139,62 -111,0 -203,-135 -203,-309 0,-181 106,-307 218,-307 121,0 185,132 185,213l0 213z"/>
   <path class="fil2" d="M30139 4247c0,-42 -39,-42 -85,-42 -73,0 -76,3 -97,78 -24,100 -79,328 -182,328 -36,0 -58,-24 -58,-94 0,-58 7,-82 19,-131l209 -839c12,-46 12,-52 12,-67 0,-94 -73,-131 -136,-131 -40,0 -158,19 -195,170l-209 852c-12,55 -15,67 -100,152 -42,39 -118,88 -209,88 -152,0 -158,-143 -158,-209 0,-182 103,-452 176,-643 28,-76 43,-112 43,-164 0,-170 -155,-270 -319,-270 -315,0 -464,410 -464,473 0,43 40,43 85,43 58,0 73,0 85,-40 24,-79 106,-367 279,-367 15,0 43,0 43,55 0,64 -37,158 -55,200 -97,261 -182,479 -182,649 0,276 197,382 449,382 85,0 212,-15 361,-155 57,107 194,155 312,155 142,0 218,-103 258,-164 79,-127 118,-297 118,-309z"/>
   <path id="1" class="fil2" d="M30729 5043c0,-124 -96,-243 -253,-274 124,-41 212,-148 212,-267 0,-125 -134,-210 -279,-210 -153,0 -268,91 -268,207 0,50 33,79 77,79 47,0 77,-34 77,-78 0,-76 -71,-76 -94,-76 47,-74 147,-94 202,-94 62,0 145,34 145,170 0,18 -3,106 -42,173 -46,73 -97,77 -135,79 -12,1 -49,4 -59,4 -12,2 -23,3 -23,19 0,16 11,16 36,16l67 0c124,0 181,103 181,252 0,206 -105,250 -172,250 -65,0 -179,-26 -232,-115 53,7 100,-26 100,-84 0,-54 -41,-84 -85,-84 -36,0 -84,21 -84,88 0,137 141,238 306,238 185,0 323,-138 323,-293z"/>
   <path class="fil2" d="M19158 7441c0,-43 -39,-43 -85,-43 -73,0 -75,3 -97,79 -24,100 -79,328 -182,328 -36,0 -57,-25 -57,-94 0,-58 6,-82 18,-131l209 -840c12,-45 12,-51 12,-66 0,-94 -72,-131 -136,-131 -40,0 -158,18 -194,170l-209 852c-13,55 -16,67 -100,152 -43,39 -119,88 -210,88 -151,0 -157,-143 -157,-210 0,-182 103,-451 176,-642 27,-76 42,-113 42,-164 0,-170 -155,-270 -318,-270 -316,0 -464,409 -464,473 0,42 39,42 85,42 57,0 72,0 84,-39 25,-79 107,-367 279,-367 16,0 43,0 43,55 0,63 -37,157 -55,200 -97,261 -182,479 -182,649 0,276 197,382 449,382 85,0 212,-16 361,-155 58,106 194,155 312,155 143,0 218,-103 258,-164 79,-127 118,-297 118,-309z"/>
   <path id="1" class="fil2" d="M19736 8232l-38 0c-8,46 -18,112 -33,135 -11,12 -111,12 -144,12l-273 0 160 -156c237,-209 328,-291 328,-443 0,-173 -137,-294 -322,-294 -171,0 -283,140 -283,275 0,84 76,84 80,84 26,0 79,-18 79,-80 0,-39 -27,-79 -80,-79 -12,0 -15,0 -20,2 35,-99 117,-155 205,-155 138,0 203,123 203,247 0,122 -76,241 -159,335l-291 325c-17,16 -17,19 -17,56l562 0 43 -264z"/>
   <path class="fil3 str0" d="M28211 1630c118,246 -41,1080 -38,1079 60,-50 978,-397 1191,-475 -368,-169 -760,-437 -1147,-617l-6 13z"/>
   <path class="fil5 str1" d="M16826 6004c2759,-2442 8445,-4240 12063,-3795 718,89 374,-108 869,278"/>
   <path class="fil6 str2" d="M15627 5510c141,234 61,1079 63,1078 56,-56 937,-487 1142,-584 -382,-134 -798,-365 -1200,-508l-5 14z"/>
   <path class="fil5 str2" d="M16826 6004c-223,124 -3585,129 -4017,0"/>
  </g>
  <path class="fil7 str0" d="M53794 12270c-1378,0 -4857,377 -7099,138 -2242,-238 -4050,-1031 -3928,-4135 181,-4600 -630,-6080 270,-6984 900,-904 7836,-500 8620,-458 785,41 5184,-690 6547,-690 3412,0 638,4262 1247,7299 126,633 297,1949 131,2993 -136,861 -502,1537 -1309,1493 -1724,-93 -3088,344 -4479,344z"/>
  <path class="fil8 str0" d="M59934 1693c-51,-2079 4028,-1617 4964,-1516 935,102 8311,213 8958,207 647,-6 1112,117 1103,896 -9,778 -562,2505 -201,5444 263,2160 943,4974 -2556,4824 -721,-31 -1396,-22 -2130,-63 -4406,-245 -6515,615 -8138,614 -1622,-1 -2519,-528 -2352,-1666 165,-1043 -6,-2352 -133,-2977 -385,-1886 544,-4246 485,-5763z"/>
  <path class="fil2" d="M46282 3898l0 -94 -55 0c-181,0 -224,-21 -257,-121l-655 -1895c-15,-40 -21,-61 -70,-61 -48,0 -58,18 -73,61l-627 1813c-55,155 -176,200 -340,203l0 94 309 -9 349 9 0 -94c-152,0 -227,-76 -227,-155 0,-9 3,-39 6,-45l139 -397 749 0 161 464c3,12 9,30 9,42 0,91 -170,91 -252,91l0 94c109,-9 322,-9 437,-9l397 9zm-785 -785l-683 0 340 -986 343 986z"/>
  <path class="fil2" d="M72930 9973c0,-263 -248,-491 -585,-527 294,-58 504,-252 504,-476 0,-264 -279,-513 -674,-513l-1109 0 0 94 73 0c233,0 239,34 239,143l0 1598c0,109 -6,142 -239,142l-73 0 0 94 1188 0c404,0 676,-270 676,-555l0 0zm-376 -1003c0,194 -148,449 -485,449l-439 0 0 -746c0,-100 6,-122 148,-122l376 0c294,0 400,258 400,419l0 0zm73 1000c0,216 -157,464 -470,464l-379 0c-142,0 -148,-21 -148,-121l0 -828 570 0c300,0 427,282 427,485l0 0z"/>
  <circle class="fil3 str0" cx="47322" cy="7992" r="391"/>
  <circle class="fil3 str0" cx="59373" cy="6004" r="391"/>
  <circle class="fil3 str0" cx="72299" cy="2487" r="391"/>
  <path class="fil2" d="M47901 10478c0,-42 -39,-42 -85,-42 -72,0 -75,3 -97,79 -24,100 -78,327 -181,327 -37,0 -58,-24 -58,-94 0,-58 6,-82 18,-130l209 -840c12,-46 12,-52 12,-67 0,-94 -72,-130 -136,-130 -39,0 -158,18 -194,169l-209 852c-12,55 -15,67 -100,152 -43,39 -119,88 -210,88 -151,0 -157,-142 -157,-209 0,-182 103,-452 176,-643 27,-76 42,-112 42,-164 0,-170 -155,-270 -318,-270 -316,0 -464,410 -464,473 0,43 39,43 85,43 57,0 72,0 85,-40 24,-78 106,-366 279,-366 15,0 42,0 42,54 0,64 -36,158 -55,200 -97,261 -182,479 -182,649 0,276 198,382 449,382 85,0 212,-15 361,-154 58,106 194,154 312,154 143,0 219,-103 258,-164 79,-127 118,-297 118,-309z"/>
  <path id="1" class="fil2" d="M48433 11533l0 -47 -48 0c-136,0 -141,-16 -141,-72l0 -851c0,-36 0,-39 -35,-39 -94,97 -227,97 -276,97l0 47c31,0 120,0 199,-40l0 786c0,54 -5,72 -141,72l-49 0 0 47c53,-4 185,-4 246,-4 61,0 192,0 245,4z"/>
  <path class="fil4" d="M56540 3074c0,-143 -143,-240 -343,-240 -376,0 -464,331 -491,485l-55 297 -279 0c-51,0 -106,0 -106,88 0,55 52,55 97,55l261 0 -212 1155c-31,161 -37,194 -76,346 -9,45 -52,206 -152,206 0,0 -48,0 -91,-24 100,-52 125,-146 125,-194 0,-82 -61,-140 -152,-140 -109,0 -215,94 -215,228 0,148 151,239 330,239 112,0 364,-64 507,-512 39,-131 54,-188 78,-322l182 -982 334 0c51,0 106,0 106,-88 0,-55 -55,-55 -97,-55l-315 0c24,-142 97,-554 118,-597 15,-39 61,-76 103,-76 12,0 55,3 97,25 -67,36 -121,109 -121,194 0,81 60,139 151,139 106,0 216,-91 216,-227z"/>
  <path id="1" class="fil4" d="M56802 5305l-38 0c-8,46 -18,112 -33,135 -11,12 -111,12 -144,12l-273 0 160 -156c237,-209 328,-291 328,-442 0,-173 -137,-295 -321,-295 -172,0 -284,140 -284,275 0,85 76,85 80,85 26,0 79,-19 79,-81 0,-39 -27,-79 -80,-79 -12,0 -15,0 -20,2 35,-99 117,-155 205,-155 138,0 203,123 203,248 0,121 -76,241 -159,335l-291 324c-17,17 -17,20 -17,56l562 0 43 -264z"/>
  <path id="2" class="fil4" d="M57508 3266c0,-15 -12,-18 -19,-18 -14,0 -17,9 -20,21 -53,156 -190,156 -205,156 -75,0 -136,-45 -171,-101 -45,-73 -45,-173 -45,-228l422 0c34,0 38,0 38,-31 0,-151 -81,-298 -271,-298 -176,0 -315,157 -315,346 0,203 159,350 333,350 185,0 253,-168 253,-197zm-100 -201l-359 0c9,-226 136,-264 188,-264 156,0 171,204 171,264z"/>
  <path id="3" class="fil4" d="M58351 3741l0 -47c-101,0 -118,0 -118,-69l0 -848 -33 0 -58 137c-20,-42 -82,-137 -203,-137 -176,0 -335,147 -335,344 0,189 147,342 323,342 106,0 168,-65 201,-109l0 271c0,69 -16,69 -118,69l0 47 170 -5 171 5zm-218 -501c0,49 -27,91 -61,128 -19,21 -68,62 -139,62 -111,0 -203,-135 -203,-309 0,-181 106,-307 218,-307 121,0 185,132 185,213l0 213z"/>
  <path class="fil2" d="M72680 4247c0,-42 -39,-42 -85,-42 -73,0 -76,3 -97,78 -24,100 -79,328 -182,328 -36,0 -57,-24 -57,-94 0,-58 6,-82 18,-131l209 -839c12,-46 12,-52 12,-67 0,-94 -73,-131 -136,-131 -40,0 -158,19 -194,170l-210 852c-12,55 -15,67 -100,152 -42,39 -118,88 -209,88 -152,0 -158,-143 -158,-209 0,-182 103,-452 176,-643 28,-76 43,-112 43,-164 0,-170 -155,-270 -319,-270 -315,0 -464,410 -464,473 0,43 40,43 85,43 58,0 73,0 85,-40 24,-79 106,-367 279,-367 15,0 43,0 43,55 0,64 -37,158 -55,200 -97,261 -182,479 -182,649 0,276 197,382 449,382 85,0 212,-15 361,-155 57,107 194,155 312,155 143,0 218,-103 258,-164 79,-127 118,-297 118,-309z"/>
  <path id="1" class="fil2" d="M73270 5043c0,-124 -96,-243 -253,-274 124,-41 212,-148 212,-267 0,-125 -134,-210 -279,-210 -153,0 -268,91 -268,207 0,50 33,79 77,79 47,0 77,-34 77,-78 0,-76 -71,-76 -94,-76 47,-74 147,-94 202,-94 62,0 145,34 145,170 0,18 -3,106 -42,173 -46,73 -97,77 -135,79 -12,1 -49,4 -59,4 -12,2 -23,3 -23,19 0,16 11,16 36,16l67 0c124,0 181,103 181,252 0,206 -105,250 -172,250 -65,0 -179,-26 -232,-115 53,7 100,-26 100,-84 0,-54 -41,-84 -84,-84 -37,0 -85,21 -85,88 0,137 141,238 306,238 185,0 323,-138 323,-293z"/>
  <path class="fil2" d="M61699 7441c0,-43 -39,-43 -85,-43 -72,0 -75,3 -97,79 -24,100 -79,328 -182,328 -36,0 -57,-25 -57,-94 0,-58 6,-82 18,-131l209 -840c12,-45 12,-51 12,-66 0,-94 -72,-131 -136,-131 -40,0 -158,18 -194,170l-209 852c-13,55 -16,67 -100,152 -43,39 -119,88 -210,88 -151,0 -157,-143 -157,-210 0,-182 103,-451 176,-642 27,-76 42,-113 42,-164 0,-170 -155,-270 -318,-270 -316,0 -464,409 -464,473 0,42 39,42 85,42 57,0 72,0 84,-39 25,-79 107,-367 279,-367 16,0 43,0 43,55 0,63 -37,157 -55,200 -97,261 -182,479 -182,649 0,276 198,382 449,382 85,0 212,-16 361,-155 58,106 194,155 312,155 143,0 219,-103 258,-164 79,-127 118,-297 118,-309z"/>
  <path id="1" class="fil2" d="M62277 8232l-38 0c-8,46 -18,112 -33,135 -11,12 -111,12 -144,12l-273 0 160 -156c237,-209 328,-291 328,-443 0,-173 -137,-294 -322,-294 -171,0 -283,140 -283,275 0,84 76,84 80,84 26,0 79,-18 79,-80 0,-39 -27,-79 -80,-79 -12,0 -15,0 -20,2 35,-99 117,-155 205,-155 138,0 203,123 203,247 0,122 -76,241 -159,335l-291 325c-17,16 -17,19 -17,56l562 0 43 -264z"/>
  <path class="fil3 str0" d="M70752 1630c118,246 -41,1080 -38,1079 60,-50 978,-397 1191,-475 -368,-169 -760,-437 -1147,-617l-6 13z"/>
  <path class="fil5 str1" d="M59367 6004c2759,-2442 8445,-4240 12063,-3795 718,89 374,-108 869,278"/>
  <path class="fil6 str2" d="M58168 5510c141,234 61,1079 63,1078 56,-56 937,-487 1142,-584 -382,-134 -798,-365 -1200,-508l-5 14z"/>
  <path class="fil5 str2" d="M59367 6004c-223,124 -3585,129 -4016,0"/>
  <path class="fil9" d="M73003 7816l-50 -60c-171,144 -357,249 -536,249 -141,0 -242,-59 -365,-129 -102,-60 -211,-120 -351,-120 -88,0 -179,28 -256,64 -70,35 -140,73 -200,122l-190 155 49 59c172,-144 358,-249 537,-249 141,0 242,60 365,130 102,60 211,119 351,119 88,0 179,-28 256,-63 70,-35 140,-74 200,-123l190 -154z"/>
 </g>
</svg>
