<?xml version="1.0" encoding="UTF-8"?>
<!DOCTYPE svg PUBLIC "-//W3C//DTD SVG 1.1//EN" "http://www.w3.org/Graphics/SVG/1.1/DTD/svg11.dtd">
<!-- Creator: CorelDRAW X7 -->
<svg xmlns="http://www.w3.org/2000/svg" xml:space="preserve" width="58.1229mm" height="17.6671mm" version="1.1" style="shape-rendering:geometricPrecision; text-rendering:geometricPrecision; image-rendering:optimizeQuality; fill-rule:evenodd; clip-rule:evenodd"
viewBox="0 0 81553 24789"
 xmlns:xlink="http://www.w3.org/1999/xlink">
 <defs>
  <style type="text/css">
   <![CDATA[
    .str0 {stroke:#373435;stroke-width:247.511}
    .str1 {stroke:#F06277;stroke-width:247.511}
    .str2 {stroke:#ED3237;stroke-width:247.511}
    .str3 {stroke:#373435;stroke-width:247.511;stroke-dasharray:1237.553056 742.531834}
    .str4 {stroke:#F06277;stroke-width:247.511;stroke-dasharray:1237.553056 247.510611}
    .fil7 {fill:none}
    .fil3 {fill:#373435}
    .fil5 {fill:#F06277}
    .fil6 {fill:#F06277}
    .fil2 {fill:#373435;fill-rule:nonzero}
    .fil4 {fill:#ED3237;fill-rule:nonzero}
    .fil0 {fill:url(#id0)}
    .fil1 {fill:url(#id1)}
   ]]>
  </style>
  <linearGradient id="id0" gradientUnits="userSpaceOnUse" x1="12525" y1="18910.1" x2="21969.2" y2="6034.83">
   <stop offset="0" style="stop-opacity:1; stop-color:#91D8F7"/>
   <stop offset="1" style="stop-opacity:1; stop-color:#FEFEFE"/>
  </linearGradient>
  <linearGradient id="id1" gradientUnits="userSpaceOnUse" x1="57358.6" y1="20357.9" x2="74618" y2="3664.81">
   <stop offset="0" style="stop-opacity:1; stop-color:#0098DA"/>
   <stop offset="1" style="stop-opacity:1; stop-color:#FEFEFE"/>
  </linearGradient>
 </defs>
 <g id="Layer_x0020_1">
  <metadata id="CorelCorpID_0Corel-Layer"/>
  <path class="fil0 str0" d="M22226 24237c-2721,0 -9592,743 -14020,272 -4429,-471 -8001,-2037 -7759,-8167 357,-9087 -1246,-12010 532,-13795 1778,-1786 15478,-988 17028,-906 1549,81 10238,-1362 12931,-1362 6740,0 1261,8418 2462,14418 250,1249 588,3849 261,5911 -270,1700 -992,3035 -2587,2948 -3405,-184 -6100,681 -8848,681z"/>
  <path class="fil1 str0" d="M51690 3345c-99,-4107 7957,-3196 9804,-2995 1848,200 16418,421 17696,408 1278,-12 2197,232 2178,1770 -19,1538 -1110,4949 -396,10754 518,4266 1861,9824 -5049,9528 -1425,-61 -2757,-44 -4208,-124 -8703,-485 -12869,1215 -16074,1213 -3205,-2 -4976,-1044 -4645,-3291 326,-2061 -13,-4646 -265,-5881 -758,-3725 1076,-8386 959,-11382z"/>
  <path class="fil2" d="M7528 7699l0 -185 -107 0c-360,0 -444,-42 -509,-240l-1294 -3743c-30,-78 -42,-120 -138,-120 -96,0 -113,36 -144,120l-1239 3582c-108,305 -348,395 -671,401l0 185 611 -17 689 17 0 -185c-300,0 -450,-150 -450,-306 0,-18 6,-77 12,-89l276 -785 1479 0 318 916c6,24 18,60 18,84 0,180 -336,180 -498,180l0 185c216,-17 635,-17 863,-17l784 17zm-1551 -1551l-1347 0 671 -1946 676 1946z"/>
  <path class="fil2" d="M77361 19700c0,-521 -491,-970 -1156,-1042 581,-114 995,-497 995,-941 0,-521 -551,-1012 -1330,-1012l-2192 0 0 186 144 0c461,0 473,66 473,281l0 3157c0,215 -12,281 -473,281l-144 0 0 186 2348 0c796,0 1335,-533 1335,-1096l0 0zm-742 -1983c0,384 -294,887 -959,887l-868 0 0 -1474c0,-197 12,-239 293,-239l743 0c581,0 791,509 791,826l0 0zm143 1977c0,425 -311,916 -928,916l-749 0c-281,0 -293,-42 -293,-239l0 -1635 1126 0c593,0 844,556 844,958l0 0z"/>
  <circle class="fil3 str0" cx="9582" cy="15786" r="772"/>
  <circle class="fil3 str0" cx="33386" cy="11859" r="772"/>
  <circle class="fil3 str0" cx="50570" cy="11859" r="772"/>
  <circle class="fil3 str0" cx="76114" cy="4912" r="772"/>
  <path class="fil2" d="M10086 20243c0,-84 -78,-84 -168,-84 -144,0 -150,6 -192,156 -47,197 -155,646 -359,646 -72,0 -114,-48 -114,-185 0,-114 12,-162 36,-258l413 -1659c24,-90 24,-102 24,-132 0,-185 -143,-257 -269,-257 -78,0 -311,36 -383,335l-414 1683c-24,108 -30,132 -197,300 -84,78 -234,173 -414,173 -299,0 -311,-281 -311,-413 0,-359 204,-892 347,-1270 54,-149 84,-221 84,-323 0,-335 -305,-533 -629,-533 -622,0 -916,808 -916,934 0,84 78,84 168,84 114,0 143,0 167,-78 48,-156 210,-724 551,-724 30,0 84,0 84,107 0,126 -72,312 -108,396 -191,515 -359,946 -359,1281 0,545 390,755 887,755 167,0 419,-30 712,-305 114,209 384,305 617,305 282,0 431,-204 509,-323 156,-252 234,-587 234,-611z"/>
  <path id="1" class="fil2" d="M11137 22327l0 -93 -96 0c-269,0 -278,-33 -278,-144l0 -1680c0,-71 0,-78 -69,-78 -186,192 -450,192 -545,192l0 93c60,0 236,0 392,-78l0 1551c0,108 -9,144 -279,144l-95 0 0 93c104,-9 365,-9 485,-9 120,0 380,0 485,9z"/>
  <path class="fil4" d="M5895 10895c0,-282 -281,-473 -676,-473 -743,0 -917,652 -970,958l-108 587 -551 0c-102,0 -210,0 -210,174 0,107 102,107 192,107l515 0 -419 2282c-60,318 -72,383 -150,683 -18,90 -102,407 -300,407 0,0 -95,0 -179,-48 197,-102 245,-287 245,-383 0,-162 -120,-276 -299,-276 -216,0 -425,186 -425,450 0,293 299,473 652,473 222,0 719,-126 1001,-1012 77,-258 107,-372 155,-635l360 -1941 658 0c102,0 210,0 210,-173 0,-108 -108,-108 -192,-108l-622 0c47,-282 191,-1096 233,-1180 30,-78 120,-150 204,-150 24,0 108,6 191,48 -131,72 -239,216 -239,384 0,161 120,275 299,275 210,0 425,-180 425,-449z"/>
  <path id="1" class="fil4" d="M6324 15824l0 -93 -96 0c-270,0 -278,-33 -278,-144l0 -1680c0,-72 0,-78 -69,-78 -186,192 -450,192 -545,192l0 93c59,0 236,0 392,-78l0 1551c0,108 -9,144 -279,144l-96 0 0 93c105,-9 366,-9 486,-9 119,0 380,0 485,9z"/>
  <path class="fil2" d="M76866 8389c0,-84 -77,-84 -167,-84 -144,0 -150,6 -192,156 -48,197 -156,647 -359,647 -72,0 -114,-48 -114,-186 0,-114 12,-162 36,-258l413 -1659c24,-89 24,-102 24,-131 0,-186 -144,-258 -269,-258 -78,0 -312,36 -384,335l-413 1683c-24,108 -30,132 -197,300 -84,78 -234,174 -414,174 -299,0 -311,-282 -311,-414 0,-359 203,-892 347,-1269 54,-150 84,-222 84,-324 0,-335 -305,-533 -629,-533 -623,0 -916,809 -916,934 0,84 78,84 168,84 113,0 143,0 167,-78 48,-155 210,-724 551,-724 30,0 84,0 84,108 0,125 -72,311 -108,395 -191,515 -359,946 -359,1281 0,546 389,755 886,755 168,0 419,-30 713,-305 114,209 383,305 617,305 281,0 431,-204 509,-323 156,-252 233,-587 233,-611z"/>
  <path id="1" class="fil2" d="M78031 9961c0,-246 -188,-479 -500,-542 246,-81 420,-291 420,-527 0,-246 -264,-413 -551,-413 -303,0 -530,179 -530,407 0,99 65,156 152,156 93,0 153,-66 153,-153 0,-150 -141,-150 -186,-150 93,-147 291,-185 399,-185 122,0 287,65 287,335 0,36 -6,210 -84,341 -90,144 -191,153 -266,156 -24,3 -96,9 -117,9 -24,3 -45,6 -45,36 0,33 21,33 72,33l132 0c245,0 356,204 356,497 0,407 -207,494 -338,494 -129,0 -354,-51 -459,-228 105,16 198,-50 198,-164 0,-108 -81,-168 -168,-168 -72,0 -167,42 -167,174 0,272 278,470 605,470 365,0 637,-273 637,-578z"/>
  <g id="_2996359914032">
   <path class="fil2" d="M48611 17314c0,-84 -78,-84 -168,-84 -143,0 -149,6 -191,155 -48,198 -156,647 -360,647 -72,0 -113,-48 -113,-185 0,-114 11,-162 35,-258l414 -1659c24,-90 24,-102 24,-132 0,-185 -144,-257 -270,-257 -78,0 -311,36 -383,335l-413 1683c-24,108 -30,132 -198,300 -84,77 -234,173 -413,173 -300,0 -312,-281 -312,-413 0,-359 204,-892 348,-1270 54,-149 83,-221 83,-323 0,-336 -305,-533 -628,-533 -623,0 -917,808 -917,934 0,84 78,84 168,84 114,0 144,0 168,-78 48,-156 209,-725 551,-725 30,0 83,0 83,108 0,126 -71,312 -107,396 -192,515 -360,946 -360,1281 0,545 390,755 887,755 168,0 419,-30 713,-306 113,210 383,306 616,306 282,0 432,-204 509,-324 156,-251 234,-586 234,-610z"/>
   <path id="1" class="fil2" d="M50357 14657c0,-260 -246,-485 -578,-521 290,-57 497,-248 497,-470 0,-260 -275,-506 -665,-506l-1096 0 0 93 72 0c231,0 237,33 237,141l0 1578c0,108 -6,140 -237,140l-72 0 0 93 1174 0c398,0 668,-266 668,-548l0 0zm-372 -991c0,192 -146,443 -479,443l-434 0 0 -736c0,-99 6,-120 147,-120l371 0c291,0 395,254 395,413l0 0zm72 988c0,213 -155,458 -464,458l-374 0c-141,0 -147,-20 -147,-119l0 -818 563 0c297,0 422,279 422,479l0 0z"/>
   <path class="fil2" d="M48611 17314c0,-84 -78,-84 -168,-84 -143,0 -149,6 -191,155 -48,198 -156,647 -360,647 -72,0 -113,-48 -113,-185 0,-114 11,-162 35,-258l414 -1659c24,-90 24,-102 24,-132 0,-185 -144,-257 -270,-257 -78,0 -311,36 -383,335l-413 1683c-24,108 -30,132 -198,300 -84,77 -234,173 -413,173 -300,0 -312,-281 -312,-413 0,-359 204,-892 348,-1270 54,-149 83,-221 83,-323 0,-336 -305,-533 -628,-533 -623,0 -917,808 -917,934 0,84 78,84 168,84 114,0 144,0 168,-78 48,-156 209,-725 551,-725 30,0 83,0 83,108 0,126 -71,312 -107,396 -192,515 -360,946 -360,1281 0,545 390,755 887,755 168,0 419,-30 713,-306 113,210 383,306 616,306 282,0 432,-204 509,-324 156,-251 234,-586 234,-610z"/>
   <path id="1" class="fil2" d="M49752 18877l-75 0c-15,90 -36,221 -66,266 -21,24 -218,24 -284,24l-539 0 317 -308c467,-414 647,-575 647,-875 0,-341 -270,-581 -635,-581 -338,0 -560,276 -560,542 0,168 150,168 159,168 51,0 156,-36 156,-159 0,-78 -54,-155 -159,-155 -24,0 -30,0 -39,3 69,-195 231,-306 404,-306 273,0 401,243 401,488 0,240 -149,476 -314,662l-575 641c-33,33 -33,39 -33,111l1111 0 84 -521z"/>
  </g>
  <g id="_2996359918096">
   <path class="fil2" d="M29764 9335c0,-84 -77,-84 -167,-84 -144,0 -150,6 -192,156 -48,197 -156,647 -359,647 -72,0 -114,-48 -114,-186 0,-114 12,-162 36,-258l413 -1659c24,-89 24,-102 24,-131 0,-186 -144,-258 -269,-258 -78,0 -312,36 -384,335l-413 1683c-24,108 -30,132 -198,300 -83,78 -233,174 -413,174 -299,0 -311,-282 -311,-414 0,-359 203,-892 347,-1269 54,-150 84,-222 84,-324 0,-335 -306,-533 -629,-533 -623,0 -916,809 -916,934 0,84 78,84 167,84 114,0 144,0 168,-78 48,-155 210,-724 551,-724 30,0 84,0 84,108 0,125 -72,311 -108,395 -192,515 -359,946 -359,1281 0,546 389,755 886,755 168,0 419,-30 713,-305 114,209 383,305 617,305 281,0 431,-204 509,-323 156,-252 233,-587 233,-611z"/>
   <path id="1" class="fil2" d="M31708 7227l0 -93 -54 0c-180,0 -222,-21 -255,-120l-646 -1872c-15,-38 -21,-59 -69,-59 -48,0 -57,17 -72,59l-620 1791c-54,153 -174,198 -335,201l0 93 305 -9 344 9 0 -93c-149,0 -224,-75 -224,-153 0,-9 3,-39 6,-45l138 -392 739 0 159 458c3,12 9,30 9,42 0,90 -168,90 -249,90l0 93c108,-9 318,-9 432,-9l392 9zm-776 -776l-673 0 335 -973 338 973z"/>
   <path class="fil2" d="M29764 9335c0,-84 -77,-84 -167,-84 -144,0 -150,6 -192,156 -48,197 -156,647 -359,647 -72,0 -114,-48 -114,-186 0,-114 12,-162 36,-258l413 -1659c24,-89 24,-102 24,-131 0,-186 -144,-258 -269,-258 -78,0 -312,36 -384,335l-413 1683c-24,108 -30,132 -198,300 -83,78 -233,174 -413,174 -299,0 -311,-282 -311,-414 0,-359 203,-892 347,-1269 54,-150 84,-222 84,-324 0,-335 -306,-533 -629,-533 -623,0 -916,809 -916,934 0,84 78,84 167,84 114,0 144,0 168,-78 48,-155 210,-724 551,-724 30,0 84,0 84,108 0,125 -72,311 -108,395 -192,515 -359,946 -359,1281 0,546 389,755 886,755 168,0 419,-30 713,-305 114,209 383,305 617,305 281,0 431,-204 509,-323 156,-252 233,-587 233,-611z"/>
   <path id="1" class="fil2" d="M30905 10898l-74 0c-16,90 -36,222 -66,266 -21,24 -219,24 -285,24l-539 0 318 -308c467,-413 646,-575 646,-874 0,-342 -269,-581 -634,-581 -339,0 -560,275 -560,542 0,167 149,167 158,167 51,0 156,-36 156,-158 0,-78 -54,-156 -159,-156 -24,0 -30,0 -39,3 69,-195 231,-305 405,-305 272,0 401,242 401,488 0,239 -150,476 -314,661l-575 641c-33,33 -33,39 -33,111l1111 0 83 -521z"/>
  </g>
  <g id="_2996359922768">
   <path class="fil4" d="M61133 15875l647 -2594c24,-95 24,-143 24,-143 0,-138 -102,-252 -269,-252 -162,0 -228,66 -282,120 -173,-162 -365,-222 -581,-222 -1018,0 -1599,988 -1599,1761 0,635 431,946 970,946 192,0 378,-48 581,-161l-101 425c-144,557 -486,731 -809,731 -162,0 -299,-19 -371,-37 125,-101 167,-257 167,-335 0,-150 -113,-275 -299,-275 -210,0 -425,173 -425,443 0,371 473,419 916,419 725,0 1300,-305 1431,-826zm-371 -1084c-54,209 -407,485 -695,485 -317,0 -347,-294 -347,-426 0,-329 210,-1054 294,-1263 197,-497 503,-587 658,-587 180,0 372,96 443,359l-353 1432z"/>
   <path id="1" class="fil4" d="M63568 11949c0,-261 -245,-485 -578,-521 291,-57 497,-249 497,-470 0,-261 -275,-507 -665,-507l-1096 0 0 93 72 0c231,0 237,33 237,141l0 1578c0,108 -6,141 -237,141l-72 0 0 93 1174 0c399,0 668,-267 668,-548l0 0zm-371 -991c0,191 -147,443 -479,443l-435 0 0 -737c0,-99 6,-120 147,-120l371 0c291,0 396,255 396,414l0 0zm72 988c0,212 -156,458 -465,458l-374 0c-141,0 -147,-21 -147,-120l0 -817 563 0c297,0 423,278 423,479l0 0z"/>
   <path class="fil4" d="M61133 15875l647 -2594c24,-95 24,-143 24,-143 0,-138 -102,-252 -269,-252 -162,0 -228,66 -282,120 -173,-162 -365,-222 -581,-222 -1018,0 -1599,988 -1599,1761 0,635 431,946 970,946 192,0 378,-48 581,-161l-101 425c-144,557 -486,731 -809,731 -162,0 -299,-19 -371,-37 125,-101 167,-257 167,-335 0,-150 -113,-275 -299,-275 -210,0 -425,173 -425,443 0,371 473,419 916,419 725,0 1300,-305 1431,-826zm-371 -1084c-54,209 -407,485 -695,485 -317,0 -347,-294 -347,-426 0,-329 210,-1054 294,-1263 197,-497 503,-587 658,-587 180,0 372,96 443,359l-353 1432z"/>
   <path id="1" class="fil4" d="M62963 16168l-75 0c-15,90 -36,222 -66,267 -21,24 -218,24 -284,24l-539 0 317 -309c468,-413 647,-575 647,-874 0,-342 -269,-581 -635,-581 -338,0 -560,275 -560,542 0,167 150,167 159,167 51,0 156,-35 156,-158 0,-78 -54,-156 -159,-156 -24,0 -30,0 -39,3 69,-195 231,-305 404,-305 273,0 402,242 402,488 0,239 -150,476 -315,661l-575 641c-33,33 -33,39 -33,111l1111 0 84 -521z"/>
  </g>
  <g id="_2996359927408">
   <path class="fil4" d="M38862 9030l647 -2594c24,-95 24,-143 24,-143 0,-138 -102,-252 -270,-252 -161,0 -227,66 -281,120 -174,-162 -366,-222 -581,-222 -1018,0 -1599,988 -1599,1761 0,635 431,946 970,946 192,0 377,-48 581,-161l-102 425c-144,557 -485,731 -808,731 -162,0 -300,-19 -372,-36 126,-102 168,-258 168,-336 0,-150 -114,-275 -299,-275 -210,0 -426,173 -426,443 0,371 473,419 917,419 724,0 1299,-305 1431,-826zm-371 -1084c-54,209 -407,485 -695,485 -318,0 -347,-294 -347,-425 0,-330 209,-1055 293,-1264 198,-497 503,-587 659,-587 180,0 371,96 443,359l-353 1432z"/>
   <path id="1" class="fil4" d="M41494 5652l0 -93 -54 0c-179,0 -221,-21 -254,-120l-647 -1871c-15,-39 -21,-60 -69,-60 -48,0 -57,18 -72,60l-620 1790c-54,153 -173,198 -335,201l0 93 305 -9 345 9 0 -93c-150,0 -225,-75 -225,-153 0,-9 3,-39 6,-45l138 -392 740 0 158 458c3,12 9,30 9,42 0,90 -167,90 -248,90l0 93c107,-9 317,-9 431,-9l392 9zm-775 -776l-674 0 335 -973 339 973z"/>
   <path class="fil4" d="M38862 9030l647 -2594c24,-95 24,-143 24,-143 0,-138 -102,-252 -270,-252 -161,0 -227,66 -281,120 -174,-162 -366,-222 -581,-222 -1018,0 -1599,988 -1599,1761 0,635 431,946 970,946 192,0 377,-48 581,-161l-102 425c-144,557 -485,731 -808,731 -162,0 -300,-19 -372,-36 126,-102 168,-258 168,-336 0,-150 -114,-275 -299,-275 -210,0 -426,173 -426,443 0,371 473,419 917,419 724,0 1299,-305 1431,-826zm-371 -1084c-54,209 -407,485 -695,485 -318,0 -347,-294 -347,-425 0,-330 209,-1055 293,-1264 198,-497 503,-587 659,-587 180,0 371,96 443,359l-353 1432z"/>
   <path id="1" class="fil4" d="M40692 9323l-75 0c-15,90 -36,222 -66,267 -21,24 -219,24 -285,24l-539 0 318 -309c467,-413 647,-575 647,-874 0,-342 -270,-581 -635,-581 -339,0 -560,275 -560,542 0,167 150,167 159,167 51,0 155,-35 155,-158 0,-78 -54,-156 -158,-156 -24,0 -30,0 -39,3 69,-195 230,-305 404,-305 272,0 401,242 401,488 0,239 -150,476 -314,662l-575 640c-33,33 -33,39 -33,111l1111 0 84 -521z"/>
  </g>
  <path class="fil5 str1" d="M45017 12834c-278,-463 -120,-2132 -125,-2129 -109,110 -1849,962 -2255,1154 755,264 1576,720 2371,1002l9 -27z"/>
  <path class="fil6 str1" d="M56122 10884c279,462 120,2132 125,2129 109,-110 1850,-962 2255,-1154 -755,-265 -1576,-720 -2370,-1003l-10 28z"/>
  <path class="fil3 str0" d="M73058 3220c234,486 -80,2134 -75,2131 119,-99 1932,-785 2354,-938 -728,-334 -1503,-864 -2267,-1219l-12 26z"/>
  <path class="fil7 str2" d="M10826 14482c542,729 516,1268 102,2093"/>
  <path class="fil7 str2" d="M11490 13614c1253,1571 383,3102 306,3420"/>
  <path class="fil7 str2" d="M7794 15238c-240,769 -108,1207 456,1687"/>
  <path class="fil7 str2" d="M6946 14737c-588,1646 365,2654 1003,2953"/>
  <path class="fil7 str3" d="M9582 15786c2182,4998 13024,2707 16713,233 744,-499 6551,-4136 7067,-3938l24 -222"/>
  <path class="fil4" d="M45941 6372c0,185 138,347 335,347l6 0c66,0 126,-18 198,-18 479,0 767,539 803,599l-324 767c-647,1467 -1006,1922 -1006,2036 0,78 84,90 144,90l401 0c84,0 132,0 180,-60 66,-90 605,-1090 946,-1941 671,1767 904,2031 1180,2031 203,0 329,-174 329,-348 0,-149 -96,-251 -191,-299 -108,-48 -210,-30 -414,-264 -814,-952 -928,-3288 -2138,-3288 -365,0 -449,210 -449,348z"/>
  <g id="_2996359930288">
   <path class="fil2" d="M68998 5970l0 -279 -677 18c-232,0 -565,0 -785,-18l0 279c137,0 297,0 452,60 -12,24 -12,36 -42,71l-1110 1634 -1206 -1765 505 0 0 -279c-244,18 -820,18 -1087,18 -238,0 -773,0 -980,-18l0 279 582 0 1479 2169 0 1348 -642 0 0 279c214,-18 796,-18 1046,-18 255,0 825,0 1051,18l0 -279 -648 0 0 -1348 1396 -2050c54,-83 101,-83 232,-101 101,-12 208,-18 309,-18l125 0z"/>
   <path id="1" class="fil2" d="M70474 10446c0,-243 -187,-475 -496,-537 243,-81 415,-288 415,-523 0,-244 -261,-410 -546,-410 -300,0 -526,178 -526,404 0,98 66,154 152,154 92,0 151,-65 151,-151 0,-149 -139,-149 -184,-149 92,-145 288,-184 395,-184 122,0 285,66 285,333 0,36 -6,208 -83,339 -89,142 -190,151 -264,154 -24,3 -95,9 -116,9 -24,3 -45,6 -45,35 0,33 21,33 72,33l130 0c244,0 354,202 354,493 0,404 -205,490 -336,490 -128,0 -350,-50 -454,-226 104,15 196,-50 196,-163 0,-107 -80,-166 -167,-166 -71,0 -166,41 -166,172 0,270 276,466 600,466 362,0 633,-270 633,-573z"/>
   <path id="2" class="fil2" d="M71935 10437l-74 0c-15,89 -36,220 -66,265 -21,23 -217,23 -282,23l-535 0 315 -306c464,-409 642,-570 642,-867 0,-338 -267,-576 -630,-576 -335,0 -555,273 -555,538 0,166 148,166 157,166 51,0 155,-36 155,-157 0,-78 -54,-155 -158,-155 -23,0 -30,0 -38,3 68,-193 228,-303 400,-303 271,0 399,241 399,484 0,238 -149,472 -312,657l-571 635c-32,33 -32,39 -32,110l1102 0 83 -517z"/>
   <path class="fil2" d="M68998 5970l0 -279 -677 18c-232,0 -565,0 -785,-18l0 279c137,0 297,0 452,60 -12,24 -12,36 -42,71l-1110 1634 -1206 -1765 505 0 0 -279c-244,18 -820,18 -1087,18 -238,0 -773,0 -980,-18l0 279 582 0 1479 2169 0 1348 -642 0 0 279c214,-18 796,-18 1046,-18 255,0 825,0 1051,18l0 -279 -648 0 0 -1348 1396 -2050c54,-83 101,-83 232,-101 101,-12 208,-18 309,-18l125 0z"/>
   <path id="1" class="fil2" d="M71050 6252c0,-258 -244,-481 -573,-516 288,-57 493,-247 493,-467 0,-258 -274,-501 -660,-501l-1087 0 0 92 72 0c228,0 234,32 234,139l0 1565c0,107 -6,140 -234,140l-72 0 0 92 1164 0c396,0 663,-264 663,-544l0 0zm-368 -983c0,191 -146,440 -476,440l-430 0 0 -731c0,-98 6,-118 145,-118l369 0c288,0 392,252 392,409l0 0zm71 981c0,210 -155,454 -461,454l-371 0c-139,0 -145,-21 -145,-119l0 -811 558 0c294,0 419,277 419,476l0 0z"/>
  </g>
  <g id="_2996359937040">
   <path class="fil2" d="M20270 12175l0 -279 -677 17c-232,0 -565,0 -784,-17l0 279c136,0 296,0 451,59 -12,24 -12,36 -42,72l-1110 1633 -1206 -1764 505 0 0 -279c-244,17 -820,17 -1087,17 -238,0 -772,0 -980,-17l0 279 582 0 1479 2168 0 1348 -642 0 0 279c214,-17 796,-17 1046,-17 255,0 825,0 1051,17l0 -279 -647 0 0 -1348 1395 -2049c54,-84 101,-84 232,-101 101,-12 208,-18 309,-18l125 0z"/>
   <path id="1" class="fil2" d="M21722 16642l-74 0c-15,89 -36,219 -66,264 -20,24 -216,24 -282,24l-534 0 314 -306c464,-410 642,-570 642,-868 0,-338 -267,-576 -630,-576 -335,0 -555,274 -555,538 0,166 149,166 157,166 51,0 155,-35 155,-157 0,-77 -54,-155 -158,-155 -23,0 -29,0 -38,3 68,-193 229,-303 401,-303 270,0 398,241 398,484 0,238 -149,473 -312,657l-570 635c-33,33 -33,39 -33,110l1102 0 83 -516z"/>
   <path id="2" class="fil2" d="M23118 17158l0 -92 -95 0c-267,0 -276,-32 -276,-142l0 -1666c0,-72 0,-78 -69,-78 -184,190 -445,190 -540,190l0 93c59,0 234,0 389,-78l0 1539c0,107 -9,142 -276,142l-95 0 0 92c104,-9 362,-9 481,-9 119,0 377,0 481,9z"/>
   <path class="fil2" d="M20270 12175l0 -279 -677 17c-232,0 -565,0 -784,-17l0 279c136,0 296,0 451,59 -12,24 -12,36 -42,72l-1110 1633 -1206 -1764 505 0 0 -279c-244,17 -820,17 -1087,17 -238,0 -772,0 -980,-17l0 279 582 0 1479 2168 0 1348 -642 0 0 279c214,-17 796,-17 1046,-17 255,0 825,0 1051,17l0 -279 -647 0 0 -1348 1395 -2049c54,-84 101,-84 232,-101 101,-12 208,-18 309,-18l125 0z"/>
   <path id="1" class="fil2" d="M22518 13000l0 -92 -53 0c-179,0 -220,-20 -253,-119l-642 -1856c-14,-38 -20,-59 -68,-59 -47,0 -56,18 -71,59l-615 1776c-53,152 -172,196 -333,199l0 92 303 -9 342 9 0 -92c-149,0 -223,-74 -223,-151 0,-9 3,-39 6,-45l137 -389 733 0 158 455c3,11 9,29 9,41 0,89 -167,89 -247,89l0 92c107,-9 315,-9 428,-9l389 9zm-769 -769l-669 0 333 -965 336 965z"/>
  </g>
  <path class="fil7 str3" d="M50570 11859c5450,-4824 16680,-8375 23828,-7495 1417,175 738,-214 1716,549"/>
  <path class="fil5 str1" d="M38939 10884c278,462 120,2132 125,2129 109,-110 1849,-962 2255,-1154 -755,-265 -1576,-720 -2370,-1003l-10 28z"/>
  <path class="fil7 str1" d="M58502 11859c-440,245 -7080,255 -7932,0"/>
  <path class="fil7 str1" d="M41319 11859c-440,245 -7080,255 -7933,0"/>
  <path class="fil7 str4" d="M42637 11859c440,-246 7080,-255 7933,0"/>
  <g id="_2996359940304">
   <circle class="fil3 str0" cx="55683" cy="17521" r="772"/>
   <circle class="fil3 str0" cx="55546" cy="6699" r="772"/>
   <path class="fil2" d="M58625 4148c0,-84 -78,-84 -168,-84 -143,0 -149,6 -191,156 -48,197 -156,646 -360,646 -71,0 -113,-48 -113,-185 0,-114 12,-162 36,-258l413 -1659c24,-90 24,-102 24,-131 0,-186 -144,-258 -270,-258 -78,0 -311,36 -383,335l-413 1683c-24,108 -30,132 -198,300 -84,78 -234,173 -413,173 -300,0 -312,-281 -312,-413 0,-359 204,-892 348,-1269 54,-150 84,-222 84,-324 0,-335 -306,-533 -629,-533 -623,0 -917,809 -917,934 0,84 78,84 168,84 114,0 144,0 168,-78 48,-155 209,-724 551,-724 30,0 84,0 84,107 0,126 -72,312 -108,396 -192,515 -360,946 -360,1281 0,545 390,755 887,755 168,0 419,-30 713,-305 113,209 383,305 616,305 282,0 432,-204 509,-323 156,-252 234,-587 234,-611z"/>
   <path id="1" class="fil2" d="M59832 5738l0 -93 -300 0 0 -1363c0,-59 0,-77 -48,-77 -26,0 -35,0 -59,36l-920 1404 0 93 797 0 0 260c0,108 -6,141 -228,141l-63 0 0 93c123,-9 279,-9 405,-9 125,0 284,0 407,9l0 -93 -63 0c-221,0 -228,-33 -228,-141l0 -260 300 0zm-512 -93l-731 0 731 -1117 0 1117z"/>
   <path class="fil2" d="M58727 20789c0,-84 -78,-84 -168,-84 -143,0 -149,6 -191,156 -48,197 -156,646 -360,646 -71,0 -113,-48 -113,-185 0,-114 12,-162 36,-258l413 -1659c24,-89 24,-102 24,-131 0,-186 -144,-258 -270,-258 -78,0 -311,36 -383,335l-413 1683c-24,108 -30,132 -198,300 -84,78 -234,173 -413,173 -300,0 -312,-281 -312,-413 0,-359 204,-892 348,-1269 54,-150 84,-222 84,-324 0,-335 -306,-533 -629,-533 -623,0 -917,809 -917,934 0,84 78,84 168,84 114,0 144,0 168,-78 48,-155 209,-724 551,-724 30,0 84,0 84,108 0,125 -72,311 -108,395 -192,515 -360,946 -360,1281 0,545 390,755 887,755 168,0 419,-30 713,-305 113,209 383,305 616,305 282,0 432,-204 509,-323 156,-252 234,-587 234,-611z"/>
   <path id="1" class="fil2" d="M59934 22379l0 -93 -300 0 0 -1363c0,-59 0,-77 -48,-77 -26,0 -35,0 -59,36l-920 1404 0 93 797 0 0 260c0,108 -6,141 -228,141l-63 0 0 93c123,-9 279,-9 405,-9 125,0 284,0 407,9l0 -93 -63 0c-221,0 -228,-33 -228,-141l0 -260 300 0zm-512 -93l-731 0 731 -1117 0 1117z"/>
  </g>
 </g>
</svg>
