{
  "Units":"inch",
  "Group":
  [
 	{
      "Draw":{
        "Translation":[ 4, 2, 2],
        "Rotation":0,
        "Segments":{
	      "IndexedLineSet": {
			"Color":[100,100,100],
	        "Coord":[ 0,0,0, 10,0,0, 10,12,2, 0,12,5 ],
		    "Width":1
          }
	    }
      }
    }
  ]
}