<?xml version='1.0' encoding='UTF-8'?>
<!-- This file was generated by dvisvgm 2.13.3 -->
<svg version='1.1' xmlns='http://www.w3.org/2000/svg' xmlns:xlink='http://www.w3.org/1999/xlink' width='57.093785pt' height='57.089925pt' viewBox='-72.000035 -72.00005 57.093785 57.089925'>
<defs>
<pattern id='pat0-0' x='0' y='0' width='99.6277' height='2.98883' viewBox='0 0 99.6277 2.98883' patternUnits='userSpaceOnUse' patternTransform='matrix(1 0 0 -1 -71.8008 -15.1079)'>
<clipPath id='pc0'>
<rect x='0' y='0' width='99.6277' height='.99628'/>
</clipPath>
<g clip-path='url(#pc0)'>
<path d='M0 .5H99.6289' stroke='#000' fill='none' stroke-width='.3985' stroke-miterlimit='10'/>
</g>
</pattern>
</defs>
<g id='page1'>
<path d='M-71.800785-15.109375V-71.8008H-15.1055V-15.109375Z' fill='#d9d9d9'/>
<path d='M-71.800785-15.109375V-71.8008H-15.1055V-15.109375Z' stroke='#000' fill='none' stroke-width='.3985' stroke-miterlimit='10'/>
<path d='M-34.9492-15.109375V-71.8008H-71.800785V-15.109375Z' fill='url(#pat0-0)'/>
<path d='M-34.9492-15.109375V-71.8008H-71.800785V-15.109375Z' stroke='#000' fill='none' stroke-width='.3985' stroke-miterlimit='10'/>
</g>
</svg>