<?xml version="1.0" encoding="UTF-8" standalone="no"?>
<!-- Created with Inkscape (http://www.inkscape.org/) -->

<svg
   xmlns:dc="http://purl.org/dc/elements/1.1/"
   xmlns:cc="http://creativecommons.org/ns#"
   xmlns:rdf="http://www.w3.org/1999/02/22-rdf-syntax-ns#"
   xmlns:svg="http://www.w3.org/2000/svg"
   xmlns="http://www.w3.org/2000/svg"
   xmlns:sodipodi="http://sodipodi.sourceforge.net/DTD/sodipodi-0.dtd"
   xmlns:inkscape="http://www.inkscape.org/namespaces/inkscape"
   width="103.86033mm"
   height="88mm"
   viewBox="0 0 103.86033 88"
   version="1.1"
   id="svg8"
   inkscape:version="0.92.1 r15371"
   sodipodi:docname="digikeijs.svg">
  <defs
     id="defs2" />
  <sodipodi:namedview
     id="base"
     pagecolor="#ffffff"
     bordercolor="#666666"
     borderopacity="1.0"
     inkscape:pageopacity="0.0"
     inkscape:pageshadow="2"
     inkscape:zoom="1.4142136"
     inkscape:cx="257.78493"
     inkscape:cy="142.55613"
     inkscape:document-units="mm"
     inkscape:current-layer="layer1"
     showgrid="false"
     inkscape:measure-start="45.6084,1006.21"
     inkscape:measure-end="57.3924,969.557"
     inkscape:window-width="1837"
     inkscape:window-height="925"
     inkscape:window-x="0"
     inkscape:window-y="86"
     inkscape:window-maximized="0"
     showguides="true"
     fit-margin-top="0"
     fit-margin-left="0"
     fit-margin-right="0"
     fit-margin-bottom="0">
    <inkscape:grid
       type="xygrid"
       id="grid4513"
       units="mm"
       spacingx="0.1"
       spacingy="0.1"
       empspacing="10"
       originx="-10.250537"
       originy="-191.52872" />
  </sodipodi:namedview>
  <metadata
     id="metadata5">
    <rdf:RDF>
      <cc:Work
         rdf:about="">
        <dc:format>image/svg+xml</dc:format>
        <dc:type
           rdf:resource="http://purl.org/dc/dcmitype/StillImage" />
        <dc:title></dc:title>
      </cc:Work>
    </rdf:RDF>
  </metadata>
  <g
     inkscape:label="Capa 1"
     inkscape:groupmode="layer"
     id="layer1"
     transform="translate(-10.250537,-17.471279)">
    <g
       id="box">
      <rect
         id="base0"
         width="80"
         height="88"
         x="22.185064"
         y="17.471279"
         style="stroke-width:0.1;stroke-miterlimit:4;stroke-dasharray:none"
         rx="1"
         ry="1" />
      <rect
         id="base1"
         width="83.800003"
         height="66"
         x="20.285063"
         y="28.471279"
         style="stroke-width:0.22310331"
         rx="1"
         ry="1" />
      <path
         style="fill:#0a0a0a;fill-opacity:1;fill-rule:nonzero;stroke:none;stroke-width:0.37795275;stroke-linecap:round;stroke-linejoin:round;stroke-miterlimit:25.70000076;stroke-dasharray:none;stroke-opacity:1"
         d="m 76.716797,122.69727 -26.117188,12.73437 a 18.897638,18.897638 0 0 0 -11.802734,17.50195 18.897638,18.897638 0 0 0 12.132813,17.64063 l 25.787109,12.5957 z M 57.693359,145.375 a 7.5590551,7.5590551 0 0 1 7.558594,7.55859 7.5590551,7.5590551 0 0 1 -7.558594,7.5586 7.5590551,7.5590551 0 0 1 -7.558593,-7.5586 7.5590551,7.5590551 0 0 1 7.558593,-7.55859 z"
         transform="scale(0.26458333)"
         id="hole1"
         inkscape:connector-curvature="0" />
      <path
         style="fill:#0a0a0a;fill-opacity:1;fill-rule:nonzero;stroke:none;stroke-width:0.37795275;stroke-linecap:round;stroke-linejoin:round;stroke-miterlimit:25.70000076;stroke-dasharray:none;stroke-opacity:1"
         d="m 393.36523,122.71094 v 60.47265 l 25.78711,-12.5957 a 18.897638,18.897638 0 0 0 12.13282,-17.64062 18.897638,18.897638 0 0 0 -11.80274,-17.50196 z m 19.02344,22.67578 a 7.5590551,7.5590551 0 0 1 7.5586,7.56055 7.5590551,7.5590551 0 0 1 -7.5586,7.55859 7.5590551,7.5590551 0 0 1 -7.55859,-7.55859 7.5590551,7.5590551 0 0 1 7.55859,-7.56055 z"
         transform="scale(0.26458333)"
         id="hole2"
         inkscape:connector-curvature="0" />
      <path
         style="fill:#0a0a0a;fill-opacity:1;fill-rule:nonzero;stroke:none;stroke-width:0.37795275;stroke-linecap:round;stroke-linejoin:round;stroke-miterlimit:25.70000076;stroke-dasharray:none;stroke-opacity:1"
         d="M 76.662109,281.4043 50.544922,294.13867 A 18.897638,18.897638 0 0 0 38.742188,311.64062 18.897638,18.897638 0 0 0 50.875,329.28125 l 25.787109,12.5957 z m -19.023437,22.67773 a 7.5590551,7.5590551 0 0 1 7.558594,7.55859 7.5590551,7.5590551 0 0 1 -7.558594,7.5586 7.5590551,7.5590551 0 0 1 -7.558594,-7.5586 7.5590551,7.5590551 0 0 1 7.558594,-7.55859 z"
         transform="scale(0.26458333)"
         id="hole3"
         inkscape:connector-curvature="0" />
      <path
         style="fill:#0a0a0a;fill-opacity:1;fill-rule:nonzero;stroke:none;stroke-width:0.37795275;stroke-linecap:round;stroke-linejoin:round;stroke-miterlimit:25.70000076;stroke-dasharray:none;stroke-opacity:1"
         d="m 393.35547,281.375 v 60.47266 l 25.78711,-12.59571 a 18.897638,18.897638 0 0 0 12.13281,-17.64062 18.897638,18.897638 0 0 0 -11.80273,-17.50195 z m 19.02344,22.67773 a 7.5590551,7.5590551 0 0 1 7.55859,7.5586 7.5590551,7.5590551 0 0 1 -7.55859,7.56055 7.5590551,7.5590551 0 0 1 -7.5586,-7.56055 7.5590551,7.5590551 0 0 1 7.5586,-7.5586 z"
         transform="scale(0.26458333)"
         id="hole4"
         inkscape:connector-curvature="0" />
      <rect
         id="label"
         width="80"
         height="62"
         x="22.185064"
         y="30.471279"
         style="fill:#303030;fill-opacity:1;fill-rule:nonzero;stroke-width:0.21686956"
         rx="1"
         ry="1" />
      <text
         xml:space="preserve"
         style="font-style:normal;font-variant:normal;font-weight:normal;font-stretch:normal;font-size:7.05555534px;line-height:125%;font-family:'Droid Sans';-inkscape-font-specification:'Droid Sans';letter-spacing:0px;word-spacing:0px;fill:#ffffff;fill-opacity:1;stroke:none;stroke-width:0.26458332px;stroke-linecap:butt;stroke-linejoin:miter;stroke-opacity:1"
         x="27.44334"
         y="50.871101"
         id="brand"><tspan
           sodipodi:role="line"
           id="tspan16"
           x="27.44334"
           y="50.871101"
           style="font-style:normal;font-variant:normal;font-weight:normal;font-stretch:normal;font-size:7.05555534px;font-family:'Droid Sans';-inkscape-font-specification:'Droid Sans';fill:#ffffff;fill-opacity:1;stroke-width:0.26458332px">digikeijs</tspan></text>
    </g>
  </g>
</svg>
