<?xml version="1.0" encoding="UTF-8" standalone="no"?>
<svg
   xmlns:dc="http://purl.org/dc/elements/1.1/"
   xmlns:cc="http://creativecommons.org/ns#"
   xmlns:rdf="http://www.w3.org/1999/02/22-rdf-syntax-ns#"
   xmlns:svg="http://www.w3.org/2000/svg"
   xmlns="http://www.w3.org/2000/svg"
   id="svg4510"
   version="1.1"
   viewBox="0 0 3.81 9.2999994"
   height="0.36614171in"
   width="0.15000001in">
  <defs
     id="defs4504" />
  <metadata
     id="metadata4507">
    <rdf:RDF>
      <cc:Work
         rdf:about="">
        <dc:format>image/svg+xml</dc:format>
        <dc:type
           rdf:resource="http://purl.org/dc/dcmitype/StillImage" />
        <dc:title></dc:title>
      </cc:Work>
    </rdf:RDF>
  </metadata>
  <g
     transform="translate(0.63500005,1.55)"
     id="breadboard">
    <g
       style="stroke-width:0.66666669"
       transform="matrix(1.5,0,0,1.5,-0.63500005,-1.55)"
       id="element1">
      <rect
         ry="0"
         rx="0"
         y="0"
         x="0"
         height="6.1999998"
         width="2.54"
         id="rect817"
         style="opacity:1;fill:#00a500;fill-opacity:1;stroke:none;stroke-width:0.01620355;stroke-miterlimit:4;stroke-dasharray:none;stroke-dashoffset:0" />
      <rect
         style="fill:#008400;fill-opacity:1;fill-rule:nonzero;stroke:none;stroke-width:0.16666667;stroke-linecap:round;stroke-linejoin:round;stroke-miterlimit:25.70000076;stroke-dasharray:none;stroke-opacity:1"
         id="rect819"
         width="2.54"
         height="0.94"
         x="0"
         y="0.94374675" />
      <rect
         style="fill:#00bd00;fill-opacity:1;fill-rule:nonzero;stroke:none;stroke-width:0.16666667;stroke-linecap:round;stroke-linejoin:round;stroke-miterlimit:25.70000076;stroke-dasharray:none;stroke-opacity:1"
         id="rect821"
         width="2.5400002"
         height="1.88"
         x="0"
         y="4.3082161" />
      <circle
         r="1.02"
         style="fill:#514c38;fill-opacity:1;fill-rule:nonzero;stroke:none;stroke-width:0.16666667;stroke-linecap:round;stroke-linejoin:round;stroke-miterlimit:25.70000076;stroke-dasharray:none;stroke-opacity:1"
         id="circle823"
         cx="1.27"
         cy="3.0999999" />
      <rect
         style="fill:#312d22;fill-opacity:1;fill-rule:nonzero;stroke:none;stroke-width:0.13945898;stroke-linecap:round;stroke-linejoin:round;stroke-miterlimit:25.70000076;stroke-dasharray:none;stroke-opacity:1"
         id="rect825"
         width="2.04"
         height="0.23623511"
         x="2.0700564"
         y="1.1758878"
         transform="rotate(45)" />
    </g>
  </g>
</svg>
