<?xml version="1.0" encoding="UTF-8" standalone="no"?>
<!-- Created with Fritzing (http://www.fritzing.org/) -->

<svg
   xmlns:dc="http://purl.org/dc/elements/1.1/"
   xmlns:cc="http://creativecommons.org/ns#"
   xmlns:rdf="http://www.w3.org/1999/02/22-rdf-syntax-ns#"
   xmlns:svg="http://www.w3.org/2000/svg"
   xmlns="http://www.w3.org/2000/svg"
   xmlns:sodipodi="http://sodipodi.sourceforge.net/DTD/sodipodi-0.dtd"
   xmlns:inkscape="http://www.inkscape.org/namespaces/inkscape"
   width="1.0049297in"
   viewBox="0 0 1004.9296 500"
   height="0.5in"
   x="0in"
   gorn="0"
   y="0in"
   id="svg1210"
   version="1.2"
   sodipodi:docname="6n137_6a48ec42c944b98d91cd1d17f5a65f29_1_schematic.svg"
   inkscape:version="0.92.4 (5da689c313, 2019-01-14)">
  <sodipodi:namedview
     pagecolor="#ffffff"
     bordercolor="#666666"
     borderopacity="1"
     objecttolerance="10"
     gridtolerance="10"
     guidetolerance="10"
     inkscape:pageopacity="0"
     inkscape:pageshadow="2"
     inkscape:window-width="1672"
     inkscape:window-height="857"
     id="namedview92"
     showgrid="false"
     inkscape:zoom="8.8489558"
     inkscape:cx="39.252513"
     inkscape:cy="24.113008"
     inkscape:window-x="1984"
     inkscape:window-y="88"
     inkscape:window-maximized="0"
     inkscape:current-layer="svg1210" />
  <metadata
     id="metadata1216">
    <rdf:RDF>
      <cc:Work
         rdf:about="">
        <dc:format>image/svg+xml</dc:format>
        <dc:type
           rdf:resource="http://purl.org/dc/dcmitype/StillImage" />
        <dc:title />
      </cc:Work>
    </rdf:RDF>
  </metadata>
  <defs
     id="defs1214" />
  <desc
     id="desc1146">
    <referenceFile>generic_ic_dip_8_schem.svg</referenceFile>
  </desc>
  <desc
     id="desc1148">Fritzing schematic generated by brd2svg</desc>
  <g
     gorn="0.4"
     id="schematic">
    <rect
       width="587.5"
       height="487.5"
       x="206.25"
       style="opacity:0.93999999;fill:none;stroke:#000000;stroke-width:12.5;stroke-linecap:round;stroke-linejoin:round"
       gorn="0.4.0"
       y="6.25"
       id="rect1150" />
    <text
       font-size="48.6111"
       x="487.50009"
       style="font-size:48.61109924px;font-family:'Droid Sans';text-anchor:middle;fill:#000000;stroke:none"
       gorn="0.4.1"
       y="68.055672"
       id="label">6N137</text>
    <line
       y1="100"
       x1="4.8611002"
       x2="200"
       style="fill:none;stroke:#787878;stroke-width:9.72220039;stroke-linecap:round;stroke-linejoin:round"
       gorn="0.4.2"
       y2="100"
       id="line1153" />
    <rect
       width="200"
       connectorName="1"
       height="9.7222004"
       x="0"
       style="fill:none;stroke-width:0"
       gorn="0.4.3"
       y="95.138901"
       id="connector0pin" />
    <rect
       width="0"
       height="9.7222004"
       x="0"
       style="fill:none;stroke-width:0"
       gorn="0.4.4"
       y="95.138901"
       id="connector0terminal" />
    <text
       class="text"
       font-size="34.7222"
       x="100"
       style="font-size:34.72219849px;font-family:'Droid Sans';text-anchor:middle;fill:#8c8c8c;stroke:none;stroke-width:0"
       gorn="0.4.5"
       y="85.416702"
       id="text1158">1</text>
    <line
       y1="200"
       x1="4.8611002"
       x2="200"
       style="fill:none;stroke:#787878;stroke-width:9.72220039;stroke-linecap:round;stroke-linejoin:round"
       gorn="0.4.6"
       y2="200"
       id="line1160" />
    <rect
       width="200"
       connectorName="2"
       height="9.7222004"
       x="0"
       style="fill:none;stroke-width:0"
       gorn="0.4.7"
       y="195.13901"
       id="connector1pin" />
    <rect
       width="0"
       height="9.7222004"
       x="0"
       style="fill:none;stroke-width:0"
       gorn="0.4.8"
       y="195.13901"
       id="connector1terminal" />
    <text
       font-size="48.6111"
       x="219.444"
       style="font-size:48.61109924px;font-family:'Droid Sans';text-anchor:start;fill:#8c8c8c;stroke:none"
       gorn="0.4.9"
       y="185.37718"
       id="label1">Anode</text>
    <text
       class="text"
       font-size="34.7222"
       x="100"
       style="font-size:34.72219849px;font-family:'Droid Sans';text-anchor:middle;fill:#8c8c8c;stroke:none;stroke-width:0"
       gorn="0.4.10"
       y="185.41701"
       id="text1165">2</text>
    <line
       y1="300"
       x1="4.8611002"
       x2="200"
       style="fill:none;stroke:#787878;stroke-width:9.72220039;stroke-linecap:round;stroke-linejoin:round"
       gorn="0.4.11"
       y2="300"
       id="line1167" />
    <rect
       width="200"
       connectorName="3"
       height="9.7222004"
       x="0"
       style="fill:none;stroke-width:0"
       gorn="0.4.12"
       y="295.13901"
       id="connector2pin" />
    <rect
       width="0"
       height="9.7222004"
       x="0"
       style="fill:none;stroke-width:0"
       gorn="0.4.13"
       y="295.13901"
       id="connector2terminal" />
    <text
       font-size="48.6111"
       x="219.444"
       style="font-size:48.61109924px;font-family:'Droid Sans';text-anchor:start;fill:#8c8c8c;stroke:none"
       gorn="0.4.14"
       y="285.37726"
       id="label2">Cathode</text>
    <text
       class="text"
       font-size="34.7222"
       x="100"
       style="font-size:34.72219849px;font-family:'Droid Sans';text-anchor:middle;fill:#8c8c8c;stroke:none;stroke-width:0"
       gorn="0.4.15"
       y="285.41699"
       id="text1172">3</text>
    <line
       y1="400"
       x1="4.8611002"
       x2="200"
       style="fill:none;stroke:#787878;stroke-width:9.72220039;stroke-linecap:round;stroke-linejoin:round"
       gorn="0.4.16"
       y2="400"
       id="line1174" />
    <rect
       width="200"
       connectorName="4"
       height="9.7222004"
       x="0"
       style="fill:none;stroke-width:0"
       gorn="0.4.17"
       y="395.13901"
       id="connector3pin" />
    <rect
       width="0"
       height="9.7222004"
       x="0"
       style="fill:none;stroke-width:0"
       gorn="0.4.18"
       y="395.13901"
       id="connector3terminal" />
    <text
       class="text"
       font-size="34.7222"
       x="100"
       style="font-size:34.72219849px;font-family:'Droid Sans';text-anchor:middle;fill:#8c8c8c;stroke:none;stroke-width:0"
       gorn="0.4.19"
       y="385.41699"
       id="text1179">4</text>
    <line
       y1="100"
       x1="799.9303"
       x2="994.84644"
       style="fill:none;stroke:#787878;stroke-width:9.72220039;stroke-linecap:round;stroke-linejoin:round"
       gorn="0.4.20"
       y2="100"
       id="line1181" />
    <rect
       width="200"
       height="9.7222004"
       x="800"
       style="fill:none;stroke-width:0"
       gorn="0.4.21"
       y="95.138901"
       id="connector7pin"
       connectorname="8" />
    <rect
       width="0"
       height="9.7222004"
       x="1000"
       style="fill:none;stroke-width:0"
       gorn="0.4.22"
       y="95.138901"
       id="connector7terminal" />
    <text
       font-size="48.6111"
       x="776.38916"
       style="font-size:48.61109924px;font-family:'Droid Sans';text-anchor:end;fill:#8c8c8c;stroke:none"
       gorn="0.4.23"
       y="85.377228"
       id="label7">Vcc</text>
    <text
       class="text"
       font-size="34.7222"
       x="901.0412"
       style="font-size:34.72219849px;font-family:'Droid Sans';text-anchor:middle;fill:#8c8c8c;stroke:none;stroke-width:0"
       gorn="0.4.24"
       y="85.416702"
       id="text1186">8</text>
    <line
       y1="200"
       x1="799.9303"
       x2="999.93011"
       style="fill:none;stroke:#787878;stroke-width:9.72220039;stroke-linecap:round;stroke-linejoin:round"
       gorn="0.4.25"
       y2="200"
       id="line1188" />
    <rect
       width="200"
       height="9.7222004"
       x="800"
       style="fill:none;stroke-width:0"
       gorn="0.4.26"
       y="195.13901"
       id="connector6pin"
       connectorname="7" />
    <rect
       width="0"
       height="9.7222004"
       x="1000"
       style="fill:none;stroke-width:0"
       gorn="0.4.27"
       y="195.13901"
       id="connector6terminal" />
    <text
       font-size="48.6111"
       x="776.38916"
       style="font-size:48.61109924px;font-family:'Droid Sans';text-anchor:end;fill:#8c8c8c;stroke:none"
       gorn="0.4.28"
       y="185.37718"
       id="label6">Vx</text>
    <text
       class="text"
       font-size="34.7222"
       x="901.0412"
       style="font-size:34.72219849px;font-family:'Droid Sans';text-anchor:middle;fill:#8c8c8c;stroke:none;stroke-width:0"
       gorn="0.4.29"
       y="185.41701"
       id="text1193">7</text>
    <line
       y1="300"
       x1="799.9303"
       x2="999.93005"
       style="fill:none;stroke:#787878;stroke-width:9.72220039;stroke-linecap:round;stroke-linejoin:round"
       gorn="0.4.30"
       y2="300"
       id="line1195" />
    <rect
       width="200"
       height="9.7222004"
       x="800"
       style="fill:none;stroke-width:0"
       gorn="0.4.31"
       y="295.13901"
       id="connector5pin"
       connectorname="6" />
    <rect
       width="0"
       height="9.7222004"
       x="1000"
       style="fill:none;stroke-width:0"
       gorn="0.4.32"
       y="295.13901"
       id="connector5terminal" />
    <text
       font-size="48.6111"
       x="776.38916"
       style="font-size:48.61109924px;font-family:'Droid Sans';text-anchor:end;fill:#8c8c8c;stroke:none"
       gorn="0.4.33"
       y="285.37726"
       id="label5">Vo</text>
    <text
       class="text"
       font-size="34.7222"
       x="901.0412"
       style="font-size:34.72219849px;font-family:'Droid Sans';text-anchor:middle;fill:#8c8c8c;stroke:none;stroke-width:0"
       gorn="0.4.34"
       y="285.41699"
       id="text1200">6</text>
    <line
       y1="400"
       x1="799.9303"
       x2="999.93005"
       style="fill:none;stroke:#787878;stroke-width:9.72220039;stroke-linecap:round;stroke-linejoin:round"
       gorn="0.4.35"
       y2="400"
       id="line1202" />
    <rect
       width="200"
       height="9.7222004"
       x="800"
       style="fill:none;stroke-width:0"
       gorn="0.4.36"
       y="395.13901"
       id="connector4pin"
       connectorname="5" />
    <rect
       width="0"
       height="9.7222004"
       x="1000"
       style="fill:none;stroke-width:0"
       gorn="0.4.37"
       y="395.13901"
       id="connector4terminal" />
    <text
       font-size="48.6111"
       x="776.38916"
       style="font-size:48.61109924px;font-family:'Droid Sans';text-anchor:end;fill:#8c8c8c;stroke:none"
       gorn="0.4.38"
       y="385.37726"
       id="label4">GND</text>
    <text
       class="text"
       font-size="34.7222"
       x="901.0412"
       style="font-size:34.72219849px;font-family:'Droid Sans';text-anchor:middle;fill:#8c8c8c;stroke:none;stroke-width:0"
       gorn="0.4.39"
       y="385.41699"
       id="text1207">5</text>
    <g
       gorn="0.4.40"
       id="led">
      <path
         d="m 489.90882,245.11717 h 22.46094 v -0.32552 0"
         style="fill:none;fill-rule:evenodd;stroke:#000000;stroke-width:3;stroke-linecap:butt;stroke-linejoin:miter;stroke-miterlimit:4;stroke-dasharray:none;stroke-opacity:1"
         gorn="0.4.40.0"
         id="path5002" />
      <g
         transform="matrix(1,0,0,0.58817271,0,104.96665)"
         id="g55">
        <g
           id="g53">
          <g
             id="g51">
            <g
               gorn="0.4.40.1.0.0.0"
               id="g50">
              <g
                 gorn="0.4.40.1.0.0.0.0"
                 id="g48">
                <path
                   d="m 528.6514,238.28123 -7.08428,4.09012 -7.08429,4.09011 0,-8.18023 0,-8.18022 7.08429,4.09011 z"
                   style="opacity:0.93999999;fill:#000001;fill-opacity:1;stroke:#000000;stroke-width:3.91172934;stroke-miterlimit:4;stroke-dasharray:none;stroke-opacity:1"
                   gorn="0.4.40.1.0.0.0.0.0"
                   id="path5004" />
              </g>
            </g>
          </g>
        </g>
      </g>
      <path
         d="m 489.90882,265.9505 h 22.46094 v -0.32552 0"
         style="fill:none;fill-rule:evenodd;stroke:#000000;stroke-width:3;stroke-linecap:butt;stroke-linejoin:miter;stroke-miterlimit:4;stroke-dasharray:none;stroke-opacity:1"
         gorn="0.4.40.2"
         id="path5006" />
      <g
         transform="matrix(1,0,0,0.58817271,0,125.79998)"
         id="g65">
        <g
           id="g63">
          <g
             id="g61">
            <g
               gorn="0.4.40.3.0.0.0"
               id="g56">
              <g
                 gorn="0.4.40.3.0.0.0.0"
                 id="g54">
                <path
                   d="m 528.6514,238.28123 -7.08428,4.09012 -7.08429,4.09011 0,-8.18023 0,-8.18022 7.08429,4.09011 z"
                   style="opacity:0.93999999;fill:#000001;fill-opacity:1;stroke:#000000;stroke-width:3.91172934;stroke-miterlimit:4;stroke-dasharray:none;stroke-opacity:1"
                   gorn="0.4.40.3.0.0.0.0.0"
                   id="path5008" />
              </g>
            </g>
          </g>
        </g>
      </g>
      <line
         y1="279.44205"
         x1="470.91837"
         x2="445.23804"
         style="fill:none;stroke:#000000;stroke-width:4.99339771;stroke-linecap:round"
         gorn="0.4.40.4"
         y2="279.44205"
         id="line5" />
      <line
         y1="279.44205"
         x1="445.23804"
         x2="419.55771"
         style="fill:none;stroke:#000000;stroke-width:4.99339771;stroke-linecap:round"
         gorn="0.4.40.5"
         y2="279.44205"
         id="line7" />
      <g
         transform="matrix(7.1334253,0,0,7.1334253,330.63243,120.35952)"
         id="g78">
        <g
           id="g76">
          <g
             id="g74">
            <g
               gorn="0.4.40.6.0.0.0"
               id="g72">
              <g
                 gorn="0.4.40.6.0.0.0.0"
                 id="g70">
                <polygon
                   style="fill:#ffffff;stroke:#000000;stroke-width:0.69999999;stroke-linecap:round"
                   gorn="0.4.40.6.0.0.0.0.0"
                   points="16.066,22.301 12.466,15.101 16.066,15.101 19.666,15.101 "
                   id="polygon9" />
              </g>
            </g>
          </g>
        </g>
      </g>
      <line
         y1="228.08138"
         x1="445.23804"
         x2="445.23804"
         style="fill:none;stroke:#000000;stroke-width:3.21004128;stroke-linecap:round"
         gorn="0.4.40.7"
         y2="279.44205"
         id="line11" />
      <path
         d="m 200.06923,300 245.16881,-0.30638 v -20.25158"
         style="fill:none;stroke:#000000;stroke-width:4.99339771;stroke-linecap:round"
         gorn="0.4.40.8"
         id="connector1pin_1_" />
      <path
         d="m 200.06923,200 245.16881,-2.45309 v 30.53446"
         style="fill:none;stroke:#000000;stroke-width:4.99339771;stroke-linecap:round;stroke-miterlimit:4;stroke-dasharray:none"
         gorn="0.4.40.9"
         id="connector0pin_1_" />
      <rect
         width="0.0071334257"
         height="0.0071334257"
         x="445.23804"
         style="fill:none;stroke-width:7.13342524"
         gorn="0.4.40.10"
         y="351.63602"
         id="connector1terminal_1_" />
    </g>
    <g
       gorn="0.4.41"
       id="nand">
      <path
         d="m 563.80206,172.49718 a 74.999939,77.485428 0 0 1 74.99734,76.83978 74.999939,77.485428 0 0 1 -73.74752,78.12031 l -1.24982,-77.47467 z"
         style="fill:none;fill-opacity:1;stroke:#000000;stroke-width:5;stroke-miterlimit:4;stroke-dasharray:none;stroke-opacity:1"
         gorn="0.4.41.0"
         id="path914" />
      <circle
         r="12.5"
         cy="249.99858"
         style="fill:none;fill-opacity:1;stroke:#000000;stroke-width:4.99999952;stroke-miterlimit:4;stroke-dasharray:none;stroke-opacity:1"
         gorn="0.4.41.1"
         id="path918"
         cx="651.82294" />
      <path
         d="M 799.99995,199.99999 H 699.99996 V 99.999995 H 529.94788 v 99.999995 h 32.55208"
         style="fill:none;fill-rule:evenodd;stroke:#000000;stroke-width:3;stroke-linecap:butt;stroke-linejoin:miter;stroke-miterlimit:4;stroke-dasharray:none;stroke-opacity:1"
         gorn="0.4.41.2"
         id="path5010" />
      <path
         d="M 792.73294,299.99998 H 699.99996 V 250.48705 H 665.6747"
         style="fill:none;fill-rule:evenodd;stroke:#000000;stroke-width:3;stroke-linecap:butt;stroke-linejoin:miter;stroke-miterlimit:4;stroke-dasharray:none;stroke-opacity:1"
         gorn="0.4.41.3"
         id="path5012" />
    </g>
  </g>
</svg>
