<?xml version="1.0" encoding="UTF-8" standalone="no"?>
<!-- Created with Inkscape (http://www.inkscape.org/) -->

<svg
   xmlns:dc="http://purl.org/dc/elements/1.1/"
   xmlns:cc="http://creativecommons.org/ns#"
   xmlns:rdf="http://www.w3.org/1999/02/22-rdf-syntax-ns#"
   xmlns:svg="http://www.w3.org/2000/svg"
   xmlns="http://www.w3.org/2000/svg"
   xmlns:sodipodi="http://sodipodi.sourceforge.net/DTD/sodipodi-0.dtd"
   xmlns:inkscape="http://www.inkscape.org/namespaces/inkscape"
   width="5.0800004mm"
   height="8.1000023mm"
   viewBox="0 0 5.0800004 8.1000023"
   version="1.1"
   id="svg4510"
   inkscape:version="0.92.1 r15371"
   sodipodi:docname="phoenix-1_5_08mm_pitch_breadboard.svg">
  <defs
     id="defs4504" />
  <sodipodi:namedview
     id="base"
     pagecolor="#ffffff"
     bordercolor="#666666"
     borderopacity="1.0"
     inkscape:pageopacity="0.0"
     inkscape:pageshadow="2"
     inkscape:zoom="3.959798"
     inkscape:cx="-26.428351"
     inkscape:cy="1.3789475"
     inkscape:document-units="mm"
     inkscape:current-layer="layer1"
     showgrid="true"
     showguides="false"
     inkscape:window-width="1361"
     inkscape:window-height="812"
     inkscape:window-x="491"
     inkscape:window-y="177"
     inkscape:window-maximized="0"
     fit-margin-top="0"
     fit-margin-left="0"
     fit-margin-right="0"
     fit-margin-bottom="0">
    <inkscape:grid
       type="xygrid"
       id="grid5121"
       units="in"
       spacingx="1.27"
       spacingy="1.27"
       originx="-95.250004"
       originy="-157.00001" />
  </sodipodi:namedview>
  <metadata
     id="metadata4507">
    <rdf:RDF>
      <cc:Work
         rdf:about="">
        <dc:format>image/svg+xml</dc:format>
        <dc:type
           rdf:resource="http://purl.org/dc/dcmitype/StillImage" />
        <dc:title></dc:title>
      </cc:Work>
    </rdf:RDF>
  </metadata>
  <g
     inkscape:label="Capa 1"
     inkscape:groupmode="layer"
     id="layer1"
     transform="translate(-95.25,-131.89999)">
    <g
       id="module">
      <rect
         style="opacity:1;fill:#00a500;fill-opacity:1;stroke:none;stroke-width:0.04861066;stroke-miterlimit:4;stroke-dasharray:none;stroke-dashoffset:0"
         id="rect6015"
         width="5.0799999"
         height="8.1000004"
         x="95.25"
         y="131.89999"
         rx="0"
         ry="0" />
      <rect
         y="132.535"
         x="95.25"
         height="0.63499999"
         width="5.0799999"
         id="rect5123"
         style="fill:#008400;fill-opacity:1;fill-rule:nonzero;stroke:none;stroke-width:0.5;stroke-linecap:round;stroke-linejoin:round;stroke-miterlimit:25.70000076;stroke-dasharray:none;stroke-opacity:1" />
      <rect
         y="138.73"
         x="95.25"
         height="1.2700001"
         width="5.0800004"
         id="rect5123-3"
         style="fill:#00bd00;fill-opacity:1;fill-rule:nonzero;stroke:none;stroke-width:0.5;stroke-linecap:round;stroke-linejoin:round;stroke-miterlimit:25.70000076;stroke-dasharray:none;stroke-opacity:1" />
      <ellipse
         ry="1.2699914"
         rx="1.27"
         cy="135.70999"
         cx="97.790001"
         id="screw"
         style="fill:#514c38;fill-opacity:1;fill-rule:nonzero;stroke:none;stroke-width:0.5;stroke-linecap:round;stroke-linejoin:round;stroke-miterlimit:25.70000076;stroke-dasharray:none;stroke-opacity:1" />
      <rect
         transform="rotate(45)"
         y="26.562246"
         x="163.85892"
         height="0.47247022"
         width="2.4975653"
         id="screw-1"
         style="fill:#312d22;fill-opacity:1;fill-rule:nonzero;stroke:none;stroke-width:0.41837695;stroke-linecap:round;stroke-linejoin:round;stroke-miterlimit:25.70000076;stroke-dasharray:none;stroke-opacity:1" />
    </g>
  </g>
</svg>
