<?xml version="1.0" encoding="UTF-8" standalone="no"?>
<!-- Created with Inkscape (http://www.inkscape.org/) -->

<svg
   xmlns:dc="http://purl.org/dc/elements/1.1/"
   xmlns:cc="http://creativecommons.org/ns#"
   xmlns:rdf="http://www.w3.org/1999/02/22-rdf-syntax-ns#"
   xmlns:svg="http://www.w3.org/2000/svg"
   xmlns="http://www.w3.org/2000/svg"
   xmlns:sodipodi="http://sodipodi.sourceforge.net/DTD/sodipodi-0.dtd"
   xmlns:inkscape="http://www.inkscape.org/namespaces/inkscape"
   width="104.2mm"
   height="16mm"
   viewBox="0 0 104.2 16"
   version="1.1"
   id="svg1714"
   inkscape:version="0.92.4 (5da689c313, 2019-01-14)"
   sodipodi:docname="straight_track_n_breadboard.svg">
  <defs
     id="defs1708" />
  <sodipodi:namedview
     id="base"
     pagecolor="#ffffff"
     bordercolor="#666666"
     borderopacity="1.0"
     inkscape:pageopacity="0.0"
     inkscape:pageshadow="2"
     inkscape:zoom="3.959798"
     inkscape:cx="104.73072"
     inkscape:cy="36.782235"
     inkscape:document-units="mm"
     inkscape:current-layer="svg1714"
     showgrid="false"
     inkscape:window-width="1867"
     inkscape:window-height="965"
     inkscape:window-x="0"
     inkscape:window-y="36"
     inkscape:window-maximized="0"
     fit-margin-top="0"
     fit-margin-left="0"
     fit-margin-right="0"
     fit-margin-bottom="0"
     inkscape:measure-start="-25,38.0357"
     inkscape:measure-end="0.593038,11.7576">
    <inkscape:grid
       type="xygrid"
       id="grid1735"
       units="mm"
       spacingx="1"
       empspacing="10"
       spacingy="1"
       originx="-8.1569084"
       originy="-255.23456" />
  </sodipodi:namedview>
  <metadata
     id="metadata1711">
    <rdf:RDF>
      <cc:Work
         rdf:about="">
        <dc:format>image/svg+xml</dc:format>
        <dc:type
           rdf:resource="http://purl.org/dc/dcmitype/StillImage" />
        <dc:title />
      </cc:Work>
    </rdf:RDF>
  </metadata>
  <g
     inkscape:label="Capa 1"
     inkscape:groupmode="layer"
     id="layer1"
     transform="translate(-8.1569081,-25.765422)">
    <g
       id="sleepers"
       transform="translate(0,10.265422)">
      <rect
         y="15.5"
         x="9.9638395"
         height="16"
         width="1.8"
         id="rect1716"
         style="fill:#000000;fill-opacity:1;fill-rule:nonzero;stroke:none;stroke-width:0.5;stroke-linecap:round;stroke-linejoin:round;stroke-miterlimit:25.70000076;stroke-dasharray:none;stroke-opacity:1" />
      <rect
         y="15.5"
         x="14.903146"
         height="16"
         width="1.8000001"
         id="rect1716-9"
         style="fill:#000000;fill-opacity:1;fill-rule:nonzero;stroke:none;stroke-width:0.5;stroke-linecap:round;stroke-linejoin:round;stroke-miterlimit:25.70000076;stroke-dasharray:none;stroke-opacity:1" />
      <rect
         y="15.5"
         x="19.842455"
         height="16"
         width="1.8000001"
         id="rect1716-90"
         style="fill:#000000;fill-opacity:1;fill-rule:nonzero;stroke:none;stroke-width:0.5;stroke-linecap:round;stroke-linejoin:round;stroke-miterlimit:25.70000076;stroke-dasharray:none;stroke-opacity:1" />
      <rect
         y="15.5"
         x="24.781761"
         height="16"
         width="1.8000001"
         id="rect1716-7"
         style="fill:#000000;fill-opacity:1;fill-rule:nonzero;stroke:none;stroke-width:0.5;stroke-linecap:round;stroke-linejoin:round;stroke-miterlimit:25.70000076;stroke-dasharray:none;stroke-opacity:1" />
      <rect
         y="15.5"
         x="29.721067"
         height="16"
         width="1.8000001"
         id="rect1716-6"
         style="fill:#000000;fill-opacity:1;fill-rule:nonzero;stroke:none;stroke-width:0.5;stroke-linecap:round;stroke-linejoin:round;stroke-miterlimit:25.70000076;stroke-dasharray:none;stroke-opacity:1" />
      <rect
         y="15.5"
         x="34.660374"
         height="16"
         width="1.8000001"
         id="rect1716-3"
         style="fill:#000000;fill-opacity:1;fill-rule:nonzero;stroke:none;stroke-width:0.5;stroke-linecap:round;stroke-linejoin:round;stroke-miterlimit:25.70000076;stroke-dasharray:none;stroke-opacity:1" />
      <rect
         y="15.5"
         x="39.599682"
         height="16"
         width="1.8000001"
         id="rect1716-76"
         style="fill:#000000;fill-opacity:1;fill-rule:nonzero;stroke:none;stroke-width:0.5;stroke-linecap:round;stroke-linejoin:round;stroke-miterlimit:25.70000076;stroke-dasharray:none;stroke-opacity:1" />
      <rect
         y="15.5"
         x="44.53899"
         height="16"
         width="1.8000001"
         id="rect1716-1"
         style="fill:#000000;fill-opacity:1;fill-rule:nonzero;stroke:none;stroke-width:0.5;stroke-linecap:round;stroke-linejoin:round;stroke-miterlimit:25.70000076;stroke-dasharray:none;stroke-opacity:1" />
      <rect
         y="15.5"
         x="49.478298"
         height="16"
         width="1.8000001"
         id="rect1716-5"
         style="fill:#000000;fill-opacity:1;fill-rule:nonzero;stroke:none;stroke-width:0.5;stroke-linecap:round;stroke-linejoin:round;stroke-miterlimit:25.70000076;stroke-dasharray:none;stroke-opacity:1" />
      <rect
         y="15.5"
         x="54.417599"
         height="16"
         width="1.8000001"
         id="rect1716-0"
         style="fill:#000000;fill-opacity:1;fill-rule:nonzero;stroke:none;stroke-width:0.5;stroke-linecap:round;stroke-linejoin:round;stroke-miterlimit:25.70000076;stroke-dasharray:none;stroke-opacity:1" />
      <rect
         y="15.5"
         x="64.296219"
         height="16"
         width="1.8000001"
         id="rect1716-65"
         style="fill:#000000;fill-opacity:1;fill-rule:nonzero;stroke:none;stroke-width:0.5;stroke-linecap:round;stroke-linejoin:round;stroke-miterlimit:25.70000076;stroke-dasharray:none;stroke-opacity:1" />
      <rect
         y="15.5"
         x="69.235527"
         height="16"
         width="1.8000001"
         id="rect1716-08"
         style="fill:#000000;fill-opacity:1;fill-rule:nonzero;stroke:none;stroke-width:0.5;stroke-linecap:round;stroke-linejoin:round;stroke-miterlimit:25.70000076;stroke-dasharray:none;stroke-opacity:1" />
      <rect
         y="15.5"
         x="74.174828"
         height="16"
         width="1.8000001"
         id="rect1716-12"
         style="fill:#000000;fill-opacity:1;fill-rule:nonzero;stroke:none;stroke-width:0.5;stroke-linecap:round;stroke-linejoin:round;stroke-miterlimit:25.70000076;stroke-dasharray:none;stroke-opacity:1" />
      <rect
         y="15.5"
         x="103.81067"
         height="16"
         width="1.8000001"
         id="rect1716-2"
         style="fill:#000000;fill-opacity:1;fill-rule:nonzero;stroke:none;stroke-width:0.5;stroke-linecap:round;stroke-linejoin:round;stroke-miterlimit:25.70000076;stroke-dasharray:none;stroke-opacity:1" />
      <rect
         y="15.5"
         x="108.74998"
         height="16"
         width="1.8000001"
         id="rect1716-69"
         style="fill:#000000;fill-opacity:1;fill-rule:nonzero;stroke:none;stroke-width:0.5;stroke-linecap:round;stroke-linejoin:round;stroke-miterlimit:25.70000076;stroke-dasharray:none;stroke-opacity:1" />
      <rect
         y="15.5"
         x="88.992752"
         height="16"
         width="1.8000001"
         id="rect1716-10"
         style="fill:#000000;fill-opacity:1;fill-rule:nonzero;stroke:none;stroke-width:0.5;stroke-linecap:round;stroke-linejoin:round;stroke-miterlimit:25.70000076;stroke-dasharray:none;stroke-opacity:1" />
      <rect
         y="15.5"
         x="59.356907"
         height="16"
         width="1.8000001"
         id="rect1716-4"
         style="fill:#000000;fill-opacity:1;fill-rule:nonzero;stroke:none;stroke-width:0.5;stroke-linecap:round;stroke-linejoin:round;stroke-miterlimit:25.70000076;stroke-dasharray:none;stroke-opacity:1" />
      <rect
         y="15.5"
         x="93.932053"
         height="16"
         width="1.8000001"
         id="rect1716-27"
         style="fill:#000000;fill-opacity:1;fill-rule:nonzero;stroke:none;stroke-width:0.5;stroke-linecap:round;stroke-linejoin:round;stroke-miterlimit:25.70000076;stroke-dasharray:none;stroke-opacity:1" />
      <rect
         y="15.5"
         x="98.871361"
         height="16"
         width="1.8000001"
         id="rect1716-40"
         style="fill:#000000;fill-opacity:1;fill-rule:nonzero;stroke:none;stroke-width:0.5;stroke-linecap:round;stroke-linejoin:round;stroke-miterlimit:25.70000076;stroke-dasharray:none;stroke-opacity:1" />
      <rect
         y="15.5"
         x="84.053452"
         height="16"
         width="1.8000001"
         id="rect1716-32"
         style="fill:#000000;fill-opacity:1;fill-rule:nonzero;stroke:none;stroke-width:0.5;stroke-linecap:round;stroke-linejoin:round;stroke-miterlimit:25.70000076;stroke-dasharray:none;stroke-opacity:1" />
      <rect
         y="15.5"
         x="79.114143"
         height="16"
         width="1.8000001"
         id="rect1716-8"
         style="fill:#000000;fill-opacity:1;fill-rule:nonzero;stroke:none;stroke-width:0.5;stroke-linecap:round;stroke-linejoin:round;stroke-miterlimit:25.70000076;stroke-dasharray:none;stroke-opacity:1" />
    </g>
    <g
       id="rails"
       transform="translate(1.1569086,42.654554)">
      <path
         inkscape:connector-curvature="0"
         id="rail1"
         d="M 6.9999995,-4.000008 H 111.2"
         style="fill:none;fill-rule:evenodd;stroke:#a2a2a2;stroke-width:0.77824813;stroke-linecap:butt;stroke-linejoin:miter;stroke-miterlimit:4;stroke-dasharray:none;stroke-opacity:1" />
      <path
         inkscape:connector-curvature="0"
         id="rail2"
         d="M 6.9999995,-13.778256 H 111.2"
         style="fill:none;fill-rule:evenodd;stroke:#a2a2a2;stroke-width:0.77824813;stroke-linecap:butt;stroke-linejoin:miter;stroke-miterlimit:4;stroke-dasharray:none;stroke-opacity:1" />
    </g>
  </g>
</svg>
