(module DBV0005A_N (layer F.Cu)
  (fp_text reference REF** (at 0 0) (layer F.SilkS)
    (effects (font (size 1 1) (thickness .15)))
  )
  (fp_text value DBV0005A_N (at 0 0) (layer F.SilkS)
    (effects (font (size 1 1) (thickness .15)))
  )
  (fp_text user "Copyright 2021 Accelerated Designs. All rights reserved." (at 0 0) (layer Cmts.User)
    (effects (font (size .127 .127) (thickness .002)))
  )
  (fp_text user "*" (at 0 0) (layer F.SilkS)
    (effects (font (size 1 1) (thickness .15)))
  )
  (fp_text user "*" (at 0 0) (layer F.Fab)
    (effects (font (size 1 1) (thickness .15)))
  )
  (fp_text user ".Designator" (at -.25 -.950001 270) (layer F.Fab)
    (effects (font (size 1 1) (thickness .15)))
  )
  (fp_text user ".Designator" (at -.25 -.950001 270) (layer Cmts.User)
    (effects (font (size 1 1) (thickness .15)))
  )
  (fp_line (start 1.197729 -1.138024) (end 1.421757 -1.138024) (layer F.Fab) (width .1))
  (fp_line (start 1.421757 -.737974) (end 1.421757 -1.138024) (layer F.Fab) (width .1))
  (fp_line (start .799457 -.737974) (end .799457 -1.138024) (layer F.Fab) (width .1))
  (fp_line (start .799457 -1.138024) (end .833544 -1.138024) (layer F.Fab) (width .1))
  (fp_line (start .799457 -.737974) (end .833544 -.737974) (layer F.Fab) (width .1))
  (fp_line (start .833544 -.737974) (end 1.087214 -.737974) (layer F.Fab) (width .1))
  (fp_line (start 1.103368 -1.138024) (end 1.197729 -1.138024) (layer F.Fab) (width .1))
  (fp_line (start 1.087214 -1.138024) (end 1.103368 -1.138024) (layer F.Fab) (width .1))
  (fp_line (start 1.103368 -.737974) (end 1.197729 -.737974) (layer F.Fab) (width .1))
  (fp_line (start 1.087214 -.737974) (end 1.103368 -.737974) (layer F.Fab) (width .1))
  (fp_line (start 1.197729 -.737974) (end 1.421757 -.737974) (layer F.Fab) (width .1))
  (fp_line (start .833544 -1.138024) (end 1.087214 -1.138024) (layer F.Fab) (width .1))
  (fp_line (start 1.197729 .766976) (end 1.421757 .766976) (layer F.Fab) (width .1))
  (fp_line (start 1.421757 1.167026) (end 1.421757 .766976) (layer F.Fab) (width .1))
  (fp_line (start .799457 1.167026) (end .799457 .766976) (layer F.Fab) (width .1))
  (fp_line (start .799457 .766976) (end .833544 .766976) (layer F.Fab) (width .1))
  (fp_line (start .799457 1.167026) (end .833544 1.167026) (layer F.Fab) (width .1))
  (fp_line (start .833544 1.167026) (end 1.087214 1.167026) (layer F.Fab) (width .1))
  (fp_line (start 1.103368 .766976) (end 1.197729 .766976) (layer F.Fab) (width .1))
  (fp_line (start 1.087214 .766976) (end 1.103368 .766976) (layer F.Fab) (width .1))
  (fp_line (start 1.103368 1.167026) (end 1.197729 1.167026) (layer F.Fab) (width .1))
  (fp_line (start 1.087214 1.167026) (end 1.103368 1.167026) (layer F.Fab) (width .1))
  (fp_line (start 1.197729 1.167026) (end 1.421757 1.167026) (layer F.Fab) (width .1))
  (fp_line (start .833544 .766976) (end 1.087214 .766976) (layer F.Fab) (width .1))
  (fp_line (start -1.423043 -.737974) (end -1.199015 -.737974) (layer F.Fab) (width .1))
  (fp_line (start -1.423043 -.737974) (end -1.423043 -1.138024) (layer F.Fab) (width .1))
  (fp_line (start -.800743 -.737974) (end -.800743 -1.138024) (layer F.Fab) (width .1))
  (fp_line (start -.834829 -.737974) (end -.800743 -.737974) (layer F.Fab) (width .1))
  (fp_line (start -.834829 -1.138024) (end -.800743 -1.138024) (layer F.Fab) (width .1))
  (fp_line (start -1.088499 -1.138024) (end -.834829 -1.138024) (layer F.Fab) (width .1))
  (fp_line (start -1.199015 -.737974) (end -1.104654 -.737974) (layer F.Fab) (width .1))
  (fp_line (start -1.104654 -.737974) (end -1.088499 -.737974) (layer F.Fab) (width .1))
  (fp_line (start -1.199015 -1.138024) (end -1.104654 -1.138024) (layer F.Fab) (width .1))
  (fp_line (start -1.104654 -1.138024) (end -1.088499 -1.138024) (layer F.Fab) (width .1))
  (fp_line (start -1.423043 -1.138024) (end -1.199015 -1.138024) (layer F.Fab) (width .1))
  (fp_line (start -1.088499 -.737974) (end -.834829 -.737974) (layer F.Fab) (width .1))
  (fp_line (start -1.423043 .214526) (end -1.199015 .214526) (layer F.Fab) (width .1))
  (fp_line (start -1.423043 .214526) (end -1.423043 -.185524) (layer F.Fab) (width .1))
  (fp_line (start -.800743 .214526) (end -.800743 -.185524) (layer F.Fab) (width .1))
  (fp_line (start -.834829 .214526) (end -.800743 .214526) (layer F.Fab) (width .1))
  (fp_line (start -.834829 -.185524) (end -.800743 -.185524) (layer F.Fab) (width .1))
  (fp_line (start -1.088499 -.185524) (end -.834829 -.185524) (layer F.Fab) (width .1))
  (fp_line (start -1.199015 .214526) (end -1.104654 .214526) (layer F.Fab) (width .1))
  (fp_line (start -1.104654 .214526) (end -1.088499 .214526) (layer F.Fab) (width .1))
  (fp_line (start -1.199015 -.185524) (end -1.104654 -.185524) (layer F.Fab) (width .1))
  (fp_line (start -1.104654 -.185524) (end -1.088499 -.185524) (layer F.Fab) (width .1))
  (fp_line (start -1.423043 -.185524) (end -1.199015 -.185524) (layer F.Fab) (width .1))
  (fp_line (start -1.088499 .214526) (end -.834829 .214526) (layer F.Fab) (width .1))
  (fp_line (start -1.423043 1.167026) (end -1.199015 1.167026) (layer F.Fab) (width .1))
  (fp_line (start -1.423043 1.167026) (end -1.423043 .766976) (layer F.Fab) (width .1))
  (fp_line (start -.800743 1.167026) (end -.800743 .766976) (layer F.Fab) (width .1))
  (fp_line (start -.834829 1.167026) (end -.800743 1.167026) (layer F.Fab) (width .1))
  (fp_line (start -.834829 .766976) (end -.800743 .766976) (layer F.Fab) (width .1))
  (fp_line (start -1.088499 .766976) (end -.834829 .766976) (layer F.Fab) (width .1))
  (fp_line (start -1.199015 1.167026) (end -1.104654 1.167026) (layer F.Fab) (width .1))
  (fp_line (start -1.104654 1.167026) (end -1.088499 1.167026) (layer F.Fab) (width .1))
  (fp_line (start -1.199015 .766976) (end -1.104654 .766976) (layer F.Fab) (width .1))
  (fp_line (start -1.104654 .766976) (end -1.088499 .766976) (layer F.Fab) (width .1))
  (fp_line (start -1.423043 .766976) (end -1.199015 .766976) (layer F.Fab) (width .1))
  (fp_line (start -1.088499 1.167026) (end -.834829 1.167026) (layer F.Fab) (width .1))
  (fp_line (start .799457 1.398801) (end .799457 -1.369799) (layer F.Fab) (width .1))
  (fp_line (start -.724543 -1.445999) (end .723257 -1.445999) (layer F.Fab) (width .1))
  (fp_line (start -.800743 1.398801) (end -.800743 -1.369799) (layer F.Fab) (width .1))
  (fp_line (start -.725 1.475001) (end -.724543 1.475001) (layer F.Fab) (width .1))
  (fp_line (start .723257 -1.445999) (end .723715 -1.445999) (layer F.Fab) (width .1))
  (fp_line (start -.724543 1.475001) (end .723257 1.475001) (layer F.Fab) (width .1))
  (fp_line (start .723257 1.475001) (end .723715 1.475001) (layer F.Fab) (width .1))
  (fp_line (start -.725 -1.445999) (end -.724543 -1.445999) (layer F.Fab) (width .1))
  (fp_line (start .799457 1.399868) (end .799457 1.398801) (layer F.Fab) (width .1))
  (fp_line (start -.800743 -1.369799) (end -.800743 -1.370841) (layer F.Fab) (width .1))
  (fp_line (start -.800743 1.399868) (end -.800743 1.398801) (layer F.Fab) (width .1))
  (fp_line (start .799457 -1.369799) (end .799457 -1.370841) (layer F.Fab) (width .1))
  (fp_line (start 0 .499999) (end 0 -.500002) (layer F.CrtYd) (width .05))
  (fp_line (start -.500002 0) (end .499999 0) (layer F.CrtYd) (width .05))
  (fp_line (start -2.100001 1.799999) (end 2.099998 1.799999) (layer F.CrtYd) (width .05))
  (fp_line (start -2.100001 -1.800001) (end 2.099998 -1.800001) (layer F.CrtYd) (width .05))
  (fp_line (start 2.099998 1.799999) (end 2.099998 -1.800001) (layer F.CrtYd) (width .05))
  (fp_line (start -2.100001 1.799999) (end -2.100001 -1.800001) (layer F.CrtYd) (width .05))
  (fp_line (start -.399999 1.549999) (end .375003 1.549999) (layer F.SilkS) (width .12))
  (fp_line (start -1.625001 -1.549999) (end .349999 -1.549999) (layer F.SilkS) (width .12))
  (fp_arc (start .723255 -1.369792) (end .799455 -1.37084) (angle -88.866501)(layer F.Fab) (width .1))
  (fp_arc (start -.72454 -1.369792) (end -.724999 -1.445998) (angle -88.866501)(layer F.Fab) (width .1))
  (fp_arc (start .723268 1.398806) (end .723713 1.475) (angle -88.866501)(layer F.Fab) (width .1))
  (fp_arc (start -.724553 1.398806) (end -.80074 1.399867) (angle -88.866501)(layer F.Fab) (width .1))
  (pad 1 smd rect (at -1.375001 -.950001 90) (size .599999 1.000001) (layers F.Cu F.Paste F.Mask))
  (pad 2 smd rect (at -1.375001 0 90) (size .599999 1.000001) (layers F.Cu F.Paste F.Mask))
  (pad 3 smd rect (at -1.375001 .949998 90) (size .599999 1.000001) (layers F.Cu F.Paste F.Mask))
  (pad 4 smd rect (at 1.374999 .949998 90) (size .599999 1.000001) (layers F.Cu F.Paste F.Mask))
  (pad 5 smd rect (at 1.374999 -.950001 90) (size .599999 1.000001) (layers F.Cu F.Paste F.Mask))
)
