(kicad_sch (version 20211123) (generator eeschema)

  (uuid 9b3c58a7-a9b9-4498-abc0-f9f43e4f0292)

  (paper "A4")

  (title_block
    (title "Water Level Detector")
    (rev "1.0")
  )

  (lib_symbols
  )


  (sheet (at 26.67 16.51) (size 16.51 22.86) (fields_autoplaced)
    (stroke (width 0.1524) (type solid) (color 0 0 0 0))
    (fill (color 0 0 0 0.0000))
    (uuid 1cc6c6b3-e05f-423c-9962-a5a8a11351b9)
    (property "Sheet name" "Block_Diagram" (id 0) (at 26.67 15.7984 0)
      (effects (font (size 1.27 1.27)) (justify left bottom))
    )
    (property "Sheet file" "Block_Diagram.kicad_sch" (id 1) (at 26.67 39.9546 0)
      (effects (font (size 1.27 1.27)) (justify left top))
    )
  )

  (sheet (at 62.23 52.07) (size 20.32 27.94) (fields_autoplaced)
    (stroke (width 0.1524) (type solid) (color 0 0 0 0))
    (fill (color 0 0 0 0.0000))
    (uuid ab3d7b3a-bd6a-44ad-8cdf-4873210aa41a)
    (property "Sheet name" "Power_Section" (id 0) (at 62.23 51.3584 0)
      (effects (font (size 1.27 1.27)) (justify left bottom))
    )
    (property "Sheet file" "Power_Sectionkicad_sch.kicad_sch" (id 1) (at 62.23 80.5946 0)
      (effects (font (size 1.27 1.27)) (justify left top))
    )
  )

  (sheet_instances
    (path "/" (page "1"))
    (path "/1cc6c6b3-e05f-423c-9962-a5a8a11351b9" (page "2"))
    (path "/ab3d7b3a-bd6a-44ad-8cdf-4873210aa41a" (page "3"))
  )

  (symbol_instances
    (path "/ab3d7b3a-bd6a-44ad-8cdf-4873210aa41a/1026de6b-c767-4a31-bde0-09a618318813"
      (reference "#PWR?") (unit 1) (value "GND") (footprint "")
    )
    (path "/ab3d7b3a-bd6a-44ad-8cdf-4873210aa41a/16296eb5-a666-4413-a61b-1f1053351223"
      (reference "#PWR?") (unit 1) (value "GND") (footprint "")
    )
    (path "/ab3d7b3a-bd6a-44ad-8cdf-4873210aa41a/35879657-4cb0-4c46-8ba1-e9cdb255d7c0"
      (reference "#PWR?") (unit 1) (value "GND") (footprint "")
    )
    (path "/ab3d7b3a-bd6a-44ad-8cdf-4873210aa41a/4b29145e-b52e-422c-a9c3-2c3945c75dd7"
      (reference "#PWR?") (unit 1) (value "GND") (footprint "")
    )
    (path "/ab3d7b3a-bd6a-44ad-8cdf-4873210aa41a/a98e2f59-0abf-4abf-b85a-04ef84ba7391"
      (reference "#PWR?") (unit 1) (value "GND") (footprint "")
    )
    (path "/ab3d7b3a-bd6a-44ad-8cdf-4873210aa41a/b30bcac4-5af8-42d5-824a-2ef81c3c2aeb"
      (reference "#PWR?") (unit 1) (value "+3V3") (footprint "")
    )
    (path "/ab3d7b3a-bd6a-44ad-8cdf-4873210aa41a/cb0aa85e-619b-4855-9c82-c001045b0d1d"
      (reference "#PWR?") (unit 1) (value "GND") (footprint "")
    )
    (path "/ab3d7b3a-bd6a-44ad-8cdf-4873210aa41a/ce75fce1-ecda-44dc-84ef-e00e718632bd"
      (reference "#PWR?") (unit 1) (value "+5V") (footprint "")
    )
    (path "/ab3d7b3a-bd6a-44ad-8cdf-4873210aa41a/d1343c01-090d-4b83-9b31-12b001662ee2"
      (reference "#PWR?") (unit 1) (value "GND") (footprint "")
    )
    (path "/ab3d7b3a-bd6a-44ad-8cdf-4873210aa41a/e8c97f80-875d-4e43-aff0-f2ce89d27d67"
      (reference "#PWR?") (unit 1) (value "GND") (footprint "")
    )
    (path "/ab3d7b3a-bd6a-44ad-8cdf-4873210aa41a/bf7919d4-26dc-441b-8ab5-80e456958f42"
      (reference "C?") (unit 1) (value "0.1uF") (footprint "")
    )
    (path "/ab3d7b3a-bd6a-44ad-8cdf-4873210aa41a/e59b4c21-c09d-42aa-b730-556add28d328"
      (reference "C?") (unit 1) (value "0.1uF") (footprint "")
    )
    (path "/ab3d7b3a-bd6a-44ad-8cdf-4873210aa41a/4ed0b271-ec60-4198-ae8d-069596a44c0e"
      (reference "CR?") (unit 1) (value "TPD1E10B06DYARQ1") (footprint "TPD1E10B06DYARQ1:TPD1E10B06DYARQ1")
    )
    (path "/ab3d7b3a-bd6a-44ad-8cdf-4873210aa41a/28de0815-26f4-4b51-a7a0-bb99e524e8b6"
      (reference "J1") (unit 1) (value "E8124-010-01") (footprint "E8124-010-01:E8124-010-01")
    )
    (path "/ab3d7b3a-bd6a-44ad-8cdf-4873210aa41a/d322577b-ce68-457c-b58e-7d842ef9770d"
      (reference "J1") (unit 2) (value "E8124-010-01") (footprint "E8124-010-01:E8124-010-01")
    )
    (path "/ab3d7b3a-bd6a-44ad-8cdf-4873210aa41a/8313bbf1-5a4b-4a08-9a82-3c553ac6698f"
      (reference "R?") (unit 1) (value "5.11k") (footprint "")
    )
    (path "/ab3d7b3a-bd6a-44ad-8cdf-4873210aa41a/cae3716c-f701-46f3-b2c9-af9a09351758"
      (reference "R?") (unit 1) (value "5.11k") (footprint "")
    )
    (path "/ab3d7b3a-bd6a-44ad-8cdf-4873210aa41a/6711cc39-d929-413f-82a3-0c83a8061b9d"
      (reference "U?") (unit 1) (value "TCR2EF33") (footprint "SOT-25   SMV_TOS")
    )
    (path "/ab3d7b3a-bd6a-44ad-8cdf-4873210aa41a/d6131b77-f327-4be8-8f47-68b049cf34ef"
      (reference "U?") (unit 1) (value "ESDS314DBVR") (footprint "DBV0005A_N")
    )
  )
)
