(module E8124-010-01_PUL (layer F.Cu)
  (fp_text reference REF** (at 0 0) (layer F.SilkS)
    (effects (font (size 1 1) (thickness .15)))
  )
  (fp_text value E8124-010-01_PUL (at 0 0) (layer F.SilkS)
    (effects (font (size 1 1) (thickness .15)))
  )
  (fp_text user "Copyright 2021 Accelerated Designs. All rights reserved." (at 0 0) (layer Cmts.User)
    (effects (font (size .127 .127) (thickness .002)))
  )
  (fp_text user "*" (at -5.29209 -4.7192) (layer F.SilkS)
    (effects (font (size 1 1) (thickness .15)))
  )
  (fp_text user "*" (at -5.29209 -4.7192) (layer F.Fab)
    (effects (font (size 1 1) (thickness .15)))
  )
  (fp_text user "*" (at -5.29209 -4.7192) (layer F.SilkS)
    (effects (font (size 1 1) (thickness .15)))
  )
  (fp_text user "*" (at -5.29209 -4.7192) (layer F.Fab)
    (effects (font (size 1 1) (thickness .15)))
  )
  (fp_line (start -4.3688 5.0292) (end 4.3688 5.0292) (layer F.Fab) (width .1))
  (fp_line (start 4.3688 5.0292) (end 4.3688 -5.0292) (layer F.Fab) (width .1))
  (fp_line (start 4.3688 -5.0292) (end -4.3688 -5.0292) (layer F.Fab) (width .1))
  (fp_line (start -4.3688 -5.0292) (end -4.3688 5.0292) (layer F.Fab) (width .1))
  (fp_line (start 4.6228 -2.85369) (end 4.96824 -2.85369) (layer F.CrtYd) (width .05))
  (fp_line (start 4.96824 -2.85369) (end 4.96824 -5.16509) (layer F.CrtYd) (width .05))
  (fp_line (start 4.96824 -5.16509) (end 4.6228 -5.16509) (layer F.CrtYd) (width .05))
  (fp_line (start 4.6228 -5.16509) (end 4.6228 -5.2832) (layer F.CrtYd) (width .05))
  (fp_line (start 4.6228 -5.2832) (end 3.15849 -5.2832) (layer F.CrtYd) (width .05))
  (fp_line (start 3.15849 -5.2832) (end 3.15849 -5.41782) (layer F.CrtYd) (width .05))
  (fp_line (start 3.15849 -5.41782) (end -3.15849 -5.41782) (layer F.CrtYd) (width .05))
  (fp_line (start -3.15849 -5.41782) (end -3.15849 -5.2832) (layer F.CrtYd) (width .05))
  (fp_line (start -3.15849 -5.2832) (end -4.6228 -5.2832) (layer F.CrtYd) (width .05))
  (fp_line (start -4.6228 -5.2832) (end -4.6228 -5.16509) (layer F.CrtYd) (width .05))
  (fp_line (start -4.6228 -5.16509) (end -4.96824 -5.16509) (layer F.CrtYd) (width .05))
  (fp_line (start -4.96824 -5.16509) (end -4.96824 -2.85369) (layer F.CrtYd) (width .05))
  (fp_line (start -4.96824 -2.85369) (end -4.6228 -2.85369) (layer F.CrtYd) (width .05))
  (fp_line (start -4.6228 -2.85369) (end -4.6228 -2.2352) (layer F.CrtYd) (width .05))
  (fp_line (start -4.6228 -2.2352) (end -4.8768 -2.2352) (layer F.CrtYd) (width .05))
  (fp_line (start -4.8768 -2.2352) (end -4.8768 .88519) (layer F.CrtYd) (width .05))
  (fp_line (start -4.8768 .88519) (end -6.82371 .88519) (layer F.CrtYd) (width .05))
  (fp_line (start -6.82371 .88519) (end -6.82371 3.19659) (layer F.CrtYd) (width .05))
  (fp_line (start -6.82371 3.19659) (end -4.8768 3.19659) (layer F.CrtYd) (width .05))
  (fp_line (start -4.8768 3.19659) (end -4.8768 3.7592) (layer F.CrtYd) (width .05))
  (fp_line (start -4.8768 3.7592) (end -6.82371 3.7592) (layer F.CrtYd) (width .05))
  (fp_line (start -6.82371 3.7592) (end -6.82371 5.2832) (layer F.CrtYd) (width .05))
  (fp_line (start -6.82371 5.2832) (end 6.82371 5.2832) (layer F.CrtYd) (width .05))
  (fp_line (start 6.82371 5.2832) (end 6.82371 3.7592) (layer F.CrtYd) (width .05))
  (fp_line (start 6.82371 3.7592) (end 4.8768 3.7592) (layer F.CrtYd) (width .05))
  (fp_line (start 4.8768 3.7592) (end 4.8768 3.19659) (layer F.CrtYd) (width .05))
  (fp_line (start 4.8768 3.19659) (end 6.82371 3.19659) (layer F.CrtYd) (width .05))
  (fp_line (start 6.82371 3.19659) (end 6.82371 .88519) (layer F.CrtYd) (width .05))
  (fp_line (start 6.82371 .88519) (end 4.8768 .88519) (layer F.CrtYd) (width .05))
  (fp_line (start 4.8768 .88519) (end 4.8768 -2.2352) (layer F.CrtYd) (width .05))
  (fp_line (start 4.8768 -2.2352) (end 4.6228 -2.2352) (layer F.CrtYd) (width .05))
  (fp_line (start 4.6228 -2.2352) (end 4.6228 -2.85369) (layer F.CrtYd) (width .05))
  (fp_line (start 6.12521 2.04089) (end 6.125194 6.451175) (layer Cmts.User) (width 0))
  (fp_line (start -6.12521 2.04089) (end -6.125226 6.451175) (layer Cmts.User) (width 0))
  (fp_line (start -6.125225 6.070175) (end 6.125195 6.070175) (layer Cmts.User) (width 0))
  (fp_line (start 5.871202 6.19717) (end 6.125195 6.070175) (layer Cmts.User) (width 0))
  (fp_line (start 5.871203 5.943179) (end 6.125195 6.070175) (layer Cmts.User) (width 0))
  (fp_line (start 5.871203 5.943179) (end 5.871202 6.19717) (layer Cmts.User) (width 0))
  (fp_line (start -5.871232 5.94318) (end -6.125225 6.070175) (layer Cmts.User) (width 0))
  (fp_line (start -5.871232 6.197171) (end -6.125225 6.070175) (layer Cmts.User) (width 0))
  (fp_line (start -5.871232 6.197171) (end -5.871232 5.94318) (layer Cmts.User) (width 0))
  (fp_line (start 4.26974 -4.00939) (end 4.269728 -7.240608) (layer Cmts.User) (width 0))
  (fp_line (start -4.26974 -4.00939) (end -4.269752 -7.240608) (layer Cmts.User) (width 0))
  (fp_line (start -4.26975 -6.859608) (end 4.26973 -6.859608) (layer Cmts.User) (width 0))
  (fp_line (start 4.015737 -6.732613) (end 4.26973 -6.859608) (layer Cmts.User) (width 0))
  (fp_line (start 4.015737 -6.986603) (end 4.26973 -6.859608) (layer Cmts.User) (width 0))
  (fp_line (start 4.015737 -6.986603) (end 4.015737 -6.732613) (layer Cmts.User) (width 0))
  (fp_line (start -4.015758 -6.986602) (end -4.26975 -6.859608) (layer Cmts.User) (width 0))
  (fp_line (start -4.015758 -6.732612) (end -4.26975 -6.859608) (layer Cmts.User) (width 0))
  (fp_line (start -4.015758 -6.732612) (end -4.015758 -6.986602) (layer Cmts.User) (width 0))
  (fp_line (start 4.3688 5.0292) (end 4.36879 7.677275) (layer Cmts.User) (width 0))
  (fp_line (start -4.3688 5.0292) (end -4.36881 7.677275) (layer Cmts.User) (width 0))
  (fp_line (start -4.368808 7.296275) (end 4.368792 7.296275) (layer Cmts.User) (width 0))
  (fp_line (start 4.114799 7.42327) (end 4.368792 7.296275) (layer Cmts.User) (width 0))
  (fp_line (start 4.114799 7.169279) (end 4.368792 7.296275) (layer Cmts.User) (width 0))
  (fp_line (start 4.114799 7.169279) (end 4.114799 7.42327) (layer Cmts.User) (width 0))
  (fp_line (start -4.114815 7.16928) (end -4.368808 7.296275) (layer Cmts.User) (width 0))
  (fp_line (start -4.114816 7.423271) (end -4.368808 7.296275) (layer Cmts.User) (width 0))
  (fp_line (start -4.114816 7.423271) (end -4.114815 7.16928) (layer Cmts.User) (width 0))
  (fp_line (start -2.25171 -4.71932) (end -2.251715 -6.017603) (layer Cmts.User) (width 0))
  (fp_line (start -2.75209 -4.71932) (end -2.752095 -6.017603) (layer Cmts.User) (width 0))
  (fp_line (start -1.736093 -5.636603) (end -2.752093 -5.636603) (layer Cmts.User) (width 0))
  (fp_line (start -3.267713 -5.636603) (end -2.251713 -5.636603) (layer Cmts.User) (width 0))
  (fp_line (start -3.006086 -5.509608) (end -2.752093 -5.636603) (layer Cmts.User) (width 0))
  (fp_line (start -3.006086 -5.763599) (end -2.752093 -5.636603) (layer Cmts.User) (width 0))
  (fp_line (start -3.006086 -5.763599) (end -3.006086 -5.509608) (layer Cmts.User) (width 0))
  (fp_line (start -1.997721 -5.763598) (end -2.251713 -5.636603) (layer Cmts.User) (width 0))
  (fp_line (start -1.997721 -5.509607) (end -2.251713 -5.636603) (layer Cmts.User) (width 0))
  (fp_line (start -1.997721 -5.509607) (end -1.997721 -5.763598) (layer Cmts.User) (width 0))
  (fp_line (start 1.20015 -3.51028) (end 1.20014 -6.24053) (layer Cmts.User) (width 0))
  (fp_line (start .40005 -3.51028) (end .40004 -6.24053) (layer Cmts.User) (width 0))
  (fp_line (start .400041 -5.85953) (end 1.200141 -5.85953) (layer Cmts.User) (width 0))
  (fp_line (start .946149 -5.732535) (end 1.200141 -5.85953) (layer Cmts.User) (width 0))
  (fp_line (start .946149 -5.986526) (end 1.200141 -5.85953) (layer Cmts.User) (width 0))
  (fp_line (start .946149 -5.986526) (end .946149 -5.732535) (layer Cmts.User) (width 0))
  (fp_line (start .654034 -5.986525) (end .400041 -5.85953) (layer Cmts.User) (width 0))
  (fp_line (start .654034 -5.732534) (end .400041 -5.85953) (layer Cmts.User) (width 0))
  (fp_line (start .654034 -5.732534) (end .654034 -5.986525) (layer Cmts.User) (width 0))
  (fp_line (start 4.3688 5.0292) (end 8.743223 5.0292) (layer Cmts.User) (width 0))
  (fp_line (start 4.3688 -5.0292) (end 8.743223 -5.0292) (layer Cmts.User) (width 0))
  (fp_line (start 8.362223 -5.0292) (end 8.362223 5.0292) (layer Cmts.User) (width 0))
  (fp_line (start 8.489219 -4.775208) (end 8.362223 -5.0292) (layer Cmts.User) (width 0))
  (fp_line (start 8.235228 -4.775207) (end 8.362223 -5.0292) (layer Cmts.User) (width 0))
  (fp_line (start 8.235228 -4.775207) (end 8.489219 -4.775208) (layer Cmts.User) (width 0))
  (fp_line (start 8.235227 4.775208) (end 8.362223 5.0292) (layer Cmts.User) (width 0))
  (fp_line (start 8.489218 4.775207) (end 8.362223 5.0292) (layer Cmts.User) (width 0))
  (fp_line (start 8.489218 4.775207) (end 8.235227 4.775208) (layer Cmts.User) (width 0))
  (fp_line (start 4.96824 -2.85369) (end 4.96824 -5.16509) (layer F.CrtYd) (width .05))
  (fp_line (start 4.96824 -5.16509) (end 4.6228 -5.16509) (layer F.CrtYd) (width .05))
  (fp_line (start 4.6228 -5.16509) (end 4.6228 -5.2832) (layer F.CrtYd) (width .05))
  (fp_line (start 4.6228 -5.2832) (end 3.15849 -5.2832) (layer F.CrtYd) (width .05))
  (fp_line (start 3.15849 -5.2832) (end 3.15849 -5.41782) (layer F.CrtYd) (width .05))
  (fp_line (start 3.15849 -5.41782) (end -3.15849 -5.41782) (layer F.CrtYd) (width .05))
  (fp_line (start -3.15849 -5.41782) (end -3.15849 -5.2832) (layer F.CrtYd) (width .05))
  (fp_line (start -3.15849 -5.2832) (end -4.6228 -5.2832) (layer F.CrtYd) (width .05))
  (fp_line (start -4.6228 -5.2832) (end -4.6228 -5.16509) (layer F.CrtYd) (width .05))
  (fp_line (start -4.6228 -5.16509) (end -4.96824 -5.16509) (layer F.CrtYd) (width .05))
  (fp_line (start -4.96824 -5.16509) (end -4.96824 -2.85369) (layer F.CrtYd) (width .05))
  (fp_line (start -4.96824 -2.85369) (end -4.6228 -2.85369) (layer F.CrtYd) (width .05))
  (fp_line (start -4.6228 -2.85369) (end -4.6228 -2.2352) (layer F.CrtYd) (width .05))
  (fp_line (start -4.6228 -2.2352) (end -4.8768 -2.2352) (layer F.CrtYd) (width .05))
  (fp_line (start -4.8768 -2.2352) (end -4.8768 .88519) (layer F.CrtYd) (width .05))
  (fp_line (start -4.8768 .88519) (end -6.82371 .88519) (layer F.CrtYd) (width .05))
  (fp_line (start -6.82371 .88519) (end -6.82371 3.19659) (layer F.CrtYd) (width .05))
  (fp_line (start -6.82371 3.19659) (end -4.8768 3.19659) (layer F.CrtYd) (width .05))
  (fp_line (start -4.8768 3.19659) (end -4.8768 3.7592) (layer F.CrtYd) (width .05))
  (fp_line (start -4.8768 3.7592) (end -6.82371 3.7592) (layer F.CrtYd) (width .05))
  (fp_line (start -6.82371 3.7592) (end -6.82371 5.2832) (layer F.CrtYd) (width .05))
  (fp_line (start -6.82371 5.2832) (end 6.82371 5.2832) (layer F.CrtYd) (width .05))
  (fp_line (start 6.82371 5.2832) (end 6.82371 3.7592) (layer F.CrtYd) (width .05))
  (fp_line (start 6.82371 3.7592) (end 4.8768 3.7592) (layer F.CrtYd) (width .05))
  (fp_line (start 4.8768 3.7592) (end 4.8768 3.19659) (layer F.CrtYd) (width .05))
  (fp_line (start 4.8768 3.19659) (end 6.82371 3.19659) (layer F.CrtYd) (width .05))
  (fp_line (start 6.82371 3.19659) (end 6.82371 .88519) (layer F.CrtYd) (width .05))
  (fp_line (start 6.82371 .88519) (end 4.8768 .88519) (layer F.CrtYd) (width .05))
  (fp_line (start 4.8768 .88519) (end 4.8768 -2.2352) (layer F.CrtYd) (width .05))
  (fp_line (start 4.8768 -2.2352) (end 4.6228 -2.2352) (layer F.CrtYd) (width .05))
  (fp_line (start 4.6228 -2.2352) (end 4.6228 -2.85369) (layer F.CrtYd) (width .05))
  (fp_line (start 4.6228 -2.85369) (end 4.96824 -2.85369) (layer F.CrtYd) (width .05))
  (pad A1 smd rect (at -2.75209 -4.71932) (size .3048 .889) (layers F.Cu F.Paste F.Mask))
  (pad A2 smd rect (at -2.25171 -4.71932) (size .3048 .889) (layers F.Cu F.Paste F.Mask))
  (pad A3 smd rect (at -1.75133 -4.71932) (size .3048 .889) (layers F.Cu F.Paste F.Mask))
  (pad A4 smd rect (at -1.25095 -4.71932) (size .3048 .889) (layers F.Cu F.Paste F.Mask))
  (pad A5 smd rect (at -.75057 -4.71932) (size .3048 .889) (layers F.Cu F.Paste F.Mask))
  (pad A6 smd rect (at -.25019 -4.71932) (size .3048 .889) (layers F.Cu F.Paste F.Mask))
  (pad A7 smd rect (at .25019 -4.71932) (size .3048 .889) (layers F.Cu F.Paste F.Mask))
  (pad A8 smd rect (at .75057 -4.71932) (size .3048 .889) (layers F.Cu F.Paste F.Mask))
  (pad A9 smd rect (at 1.25095 -4.71932) (size .3048 .889) (layers F.Cu F.Paste F.Mask))
  (pad A10 smd rect (at 1.75133 -4.71932) (size .3048 .889) (layers F.Cu F.Paste F.Mask))
  (pad A11 smd rect (at 2.25171 -4.71932) (size .3048 .889) (layers F.Cu F.Paste F.Mask))
  (pad A12 smd rect (at 2.75209 -4.71932) (size .3048 .889) (layers F.Cu F.Paste F.Mask))
  (pad B1 thru_hole circle (at 2.80035 -3.51028) (size .6604 .6604) (drill .4064) (layers *.Cu *.Mask))
  (pad B2 thru_hole circle (at 2.4003 -2.80924) (size .6604 .6604) (drill .4064) (layers *.Cu *.Mask))
  (pad B3 thru_hole circle (at 1.6002 -2.80924) (size .6604 .6604) (drill .4064) (layers *.Cu *.Mask))
  (pad B4 thru_hole circle (at 1.20015 -3.51028) (size .6604 .6604) (drill .4064) (layers *.Cu *.Mask))
  (pad B5 thru_hole circle (at .8001 -2.80924) (size .6604 .6604) (drill .4064) (layers *.Cu *.Mask))
  (pad B6 thru_hole circle (at .40005 -3.51028) (size .6604 .6604) (drill .4064) (layers *.Cu *.Mask))
  (pad B7 thru_hole circle (at -.40005 -3.51028) (size .6604 .6604) (drill .4064) (layers *.Cu *.Mask))
  (pad B8 thru_hole circle (at -.8001 -2.80924) (size .6604 .6604) (drill .4064) (layers *.Cu *.Mask))
  (pad B9 thru_hole circle (at -1.20015 -3.51028) (size .6604 .6604) (drill .4064) (layers *.Cu *.Mask))
  (pad B10 thru_hole circle (at -1.6002 -2.80924) (size .6604 .6604) (drill .4064) (layers *.Cu *.Mask))
  (pad B11 thru_hole circle (at -2.4003 -2.80924) (size .6604 .6604) (drill .4064) (layers *.Cu *.Mask))
  (pad B12 thru_hole circle (at -2.80035 -3.51028) (size .6604 .6604) (drill .4064) (layers *.Cu *.Mask))
  (pad 25 smd oval (at -4.26974 -4.00939) (size .889 1.8034) (layers F.Cu F.Paste F.Mask))
  (pad 26 smd oval (at 4.26974 -4.00939) (size .889 1.8034) (layers F.Cu F.Paste F.Mask))
  (pad 27 smd oval (at -6.12521 2.04089) (size .889 1.8034) (layers F.Cu F.Paste F.Mask))
  (pad 28 smd oval (at 6.12521 2.04089) (size .889 1.8034) (layers F.Cu F.Paste F.Mask))
  (pad 29 np_thru_hole circle (at -3.59918 -2.80924) (size .6604 .6604) (drill .6604) (layers *.Cu *.Mask))
  (pad S_1_H1 np_thru_hole circle (at -4.26974 -4.45389) (size .508 .508) (drill .508) (layers *.Cu *.Mask))
  (pad S_1_H2 np_thru_hole circle (at -4.26974 -3.56489) (size .508 .508) (drill .508) (layers *.Cu *.Mask))
  (pad S_2_H1 np_thru_hole circle (at 4.26974 -4.45389) (size .508 .508) (drill .508) (layers *.Cu *.Mask))
  (pad S_2_H2 np_thru_hole circle (at 4.26974 -3.56489) (size .508 .508) (drill .508) (layers *.Cu *.Mask))
  (pad S_3_H1 np_thru_hole circle (at -6.12521 1.59639) (size .508 .508) (drill .508) (layers *.Cu *.Mask))
  (pad S_3_H2 np_thru_hole circle (at -6.12521 2.48539) (size .508 .508) (drill .508) (layers *.Cu *.Mask))
  (pad S_4_H1 np_thru_hole circle (at 6.12521 1.59639) (size .508 .508) (drill .508) (layers *.Cu *.Mask))
  (pad S_4_H2 np_thru_hole circle (at 6.12521 2.48539) (size .508 .508) (drill .508) (layers *.Cu *.Mask))
  (pad S_5_H1 np_thru_hole circle (at 3.73888 -2.80924) (size .6604 .6604) (drill .6604) (layers *.Cu *.Mask))
  (pad S_5_H2 np_thru_hole circle (at 3.45948 -2.80924) (size .6604 .6604) (drill .6604) (layers *.Cu *.Mask))
)
