Merge branch...

Merge branch '3767-Fix-Limit-number-memory-and-cpu-of-services-container-for-docker-runners' of gitlab.com:fplanchon/gitlab-runner into 3767-Fix-Limit-number-memory-and-cpu-of-services-container-for-docker-runners
Status Job ID Name Coverage
  Prebuild
passed #437784727
clone test repo

00:01:24

failed #437784726
docker
helper images

01:00:01

passed #437784728
gitlab-org
tests definitions

00:04:53

 
  Test
skipped #437784731
check feature flags docs
skipped #437784733
check mocks
skipped #437784732
check modules
skipped #437784734
code_quality
skipped #437784730
docs lint
skipped #437784760
git 1.7.1
skipped #437784729
allowed to fail
license_management
skipped #437784735
docker
unit test 1/8
skipped #437784736
docker
unit test 2/8
skipped #437784737
docker
unit test 3/8
skipped #437784738
docker
unit test 4/8
skipped #437784739
docker
unit test 5/8
skipped #437784741
docker
unit test 6/8
skipped #437784743
docker
unit test 7/8
skipped #437784744
docker
unit test 8/8
skipped #437784746
docker allowed to fail
unit test with race 1/8
skipped #437784747
docker allowed to fail
unit test with race 2/8
skipped #437784748
docker allowed to fail
unit test with race 3/8
skipped #437784750
docker allowed to fail
unit test with race 4/8
skipped #437784753
docker allowed to fail
unit test with race 5/8
skipped #437784755
docker allowed to fail
unit test with race 6/8
skipped #437784757
docker allowed to fail
unit test with race 7/8
skipped #437784758
docker allowed to fail
unit test with race 8/8
 
  Coverage
passed #437784766
race conditions detector

00:01:30

failed #437784762
test coverage report

00:01:33

failed #437784765
test junit report

00:01:40

 
  Build
skipped #437784768
gitlab-org
binaries darwin/386 darwin/amd64
skipped #437784770
gitlab-org
binaries freebsd/386 freebsd/amd64 freebsd/arm
skipped #437784772
gitlab-org
binaries linux/386 linux/amd64 linux/arm linux/arm64
skipped #437784774
gitlab-org
binaries windows/386 windows/amd64
 
  Package
skipped #437784776
gitlab-org
package-deb
skipped #437784779
gitlab-org
package-rpm
 
  Release
failed #437784781
static QA

00:00:35

 
  Docs
skipped #437784784
allowed to fail manual
review-docs-cleanup
skipped #437784783
allowed to fail manual
review-docs-deploy
 
Name Stage Failure
failed
test junit report Coverage
go: finding github.com/docker/spdystream v0.0.0-20160310174837-449fdfce4d96
go: finding golang.org/x/time v0.0.0-20190308202827-9d24e82272b4
go: finding k8s.io/utils v0.0.0-20190923111123-69764acb6e8e
cat: '.testoutput/*.regular.output.txt': No such file or directory
make: *** [Makefile:124: parallel_test_junit_report] Error 1
Uploading artifacts...
WARNING: out/junit/report.xml: no matching files
ERROR: No files to upload
ERROR: Job failed: exit code 1
failed
test coverage report Coverage
go: finding sigs.k8s.io/yaml v1.1.0
go: finding github.com/dgrijalva/jwt-go v3.2.0+incompatible
go: finding github.com/docker/go-metrics v0.0.0-20181218153428-b84716841b82
go: finding github.com/docker/spdystream v0.0.0-20160310174837-449fdfce4d96
go: finding golang.org/x/time v0.0.0-20190308202827-9d24e82272b4
go: finding k8s.io/utils v0.0.0-20190923111123-69764acb6e8e
grep: .cover/*.count.cover.txt: No such file or directory
make: *** [Makefile:120: parallel_test_coverage_report] Error 2
ERROR: Job failed: exit code 1
failed
static QA Release
 * [new tag]         v9.5.1                   -> v9.5.1
Checking out b066a796 as 3767-Fix-Limit-number-memory-and-cpu-of-services-container-for-docker-runners...

Skipping Git submodules setup
$ unset GPG_KEY
$ if [ "$(cat gl-code-quality-report.json)" != "[]" ] ; then # collapsed multi-line command
cat: can't open 'gl-code-quality-report.json': No such file or directory
jq: error: Could not open file gl-code-quality-report.json: No such file or directory
ERROR: Job failed: exit code 2
failed
helper images Prebuild The script exceeded the maximum execution time set for the job
 ---> 25c2f854d417
Step 5/8 : COPY ./scripts/ /usr/bin
---> 6e8682d1b93c
Step 6/8 : COPY ./binaries/gitlab-runner-helper.x86_64 /usr/bin/gitlab-runner-helper
---> b8a680b8a2eb
Step 7/8 : RUN echo 'hosts: files dns' >> /etc/nsswitch.conf
---> Running in 92465a5a7d9b
Pulling docker image gitlab/gitlab-runner-helper:x86_64-003fe500 ...
ERROR: Job failed: execution took longer than 1h0m0s seconds