{
  "type": "fp:research_shaped",
  "group": "fp",
  "pattern": [
    "III",
    "IDI",
    "III"
  ],
  "key": {
    "I": {
      "item": "fpatdecoration:hazard_block",
      "data": 15
    },
    "D": {
      "item": "minecraft:torch"
    }
  },
  "result": {
    "data": 15,
    "count": 8,
    "item": "fpatshell:hazard_block_1"
  }
}