{
    "parent": "block/cube",
    "textures": 
    {
        "down":"fpatdecoration:blocks/hs_1",
        "up":"fpatdecoration:blocks/hs_1",
        "north":"fpatdecoration:blocks/hs_1",
        "east":"fpatdecoration:blocks/hs_1",
        "south":"fpatdecoration:blocks/hs_1",
        "west":"fpatdecoration:blocks/hs_1"
    }
}