[ 
    {
        "id":"fpat.forestry.meeting",
        "page": "fpatforestry",
        "x":-2,
        "y":2,
        "parents":["fpat.forestry.foliage", "fpat.forestry.hives", "fpat.forestry.flowers", "fpat.forestry.plants"],
        "icon":{"name":"fpatforestry:icon","meta":0},
        "enables":[],
        "need":[],
        "time":1
    },
    
    {
        "id":"fpat.forestry.foliage", 
        "page": "fpatforestry",
        "x":-3,
        "y":3,
        "parents":[],
        "icon":{"name":"minecraft:leaves","meta":0},
        "enables":[],
        "need":[],
        "time":0
    },
    
    {
        "id":"fpat.forestry.hives", 
        "page": "fpatforestry",
        "x":-3,
        "y":4,
        "parents":[],
        "icon":{"name":"fpatforestry:menelaus_hive","meta":0},
        "enables":[],
        "need":[],
        "time":0
    },
    
    {
        "id":"fpat.forestry.flowers", 
        "page": "fpatforestry",
        "x":-1,
        "y":3,
        "parents":[],
        "icon":{"name":"minecraft:red_flower","meta":0},
        "enables":[],
        "need":[],
        "time":0
    },
    
    {
        "id":"fpat.forestry.plants", 
        "page": "fpatforestry",
        "x":-1,
        "y":4,
        "parents":[],
        "icon":{"name":"minecraft:log","meta":0},
        "enables":[],
        "need":[],
        "time":0
    },
    
    {
        "id":"fpat.forestry.compositescoop", 
        "page": "fpatforestry",
        "x":3,
        "y":3,
        "parents":["fp:tools.scrench"],
        "icon":{"name":"fpatforestry:composite_scoop","meta":0},
        "enables":[{"name":"fpatforestry:composite_scoop", "meta":0}],
        "need": [ { "name": "forestry:scoop", "meta": 0, "size":1 }, {"name":"fp:scrench"}],
        "apsect":["biologie", "tierhaltung"],
        "time":1000,
        "neon":1000
    },
    
    {
        "id":"fpat.forestry.neonscoop", 
        "page": "fpatforestry",
        "x":3,
        "y":4,
        "parents":["fpat.forestry.compositescoop", "fp:crys_neon"],
        "icon":{"name":"fpatforestry:neon_scoop","meta":0},
        "enables":[{"name":"fpatforestry:neon_scoop", "meta":0}],
        "need": [ { "name": "forestry:scoop", "meta": 0, "size":1 }, {"name":"fp:scrench"}, {"OreDict":"ingotNeon", "size":2} ],
        "aspect":["biologie", "tierhaltung", "neonenergie"],
        "time":2000,
        "neon":2000
    },
    
    {
        "id":"fpat.forestry.retiumscoop", 
        "page": "fpatforestry",
        "x":3,
        "y":5,
        "parents":["fpat.forestry.neonscoop", "fp:crys_retium", "fp:menelaus"],
        "icon":{"name":"fpatforestry:retium_scoop","meta":0},
        "enables":[{"name":"fpatforestry:retium_scoop", "meta":0}],
        "need": [ { "name": "forestry:scoop", "meta": 0, "size":1 }, {"name":"fp:scrench"}, {"OreDict":"ingotRetium", "size":2} ],
        "aspect":["neonenergie","energieverbindung", "biologie", "tierhaltung"],
        "time":3000,
        "neon":3000
    }
]