{
    "display": {
        "icon": {
            "item": "fpatforestry:icon"
        },
        "title": {
            "translate": "advancements.fpatforestry.root.title"
        },
        "description": {
            "translate": "advancements.fpatforestry.root.description"
        },
        "background": "fp:textures/blocks/color_iron_8.png",
        "show_toast": true,
        "announce_to_chat": true
    },
    "criteria": {
        "tick": {
            "trigger": "minecraft:tick"
            }
    },
    "requirements": [
        ["tick"]
    ]
}