{
	"parent": "block/cube",
	"textures": 
	{
		"down":"fpatforestry:blocks/cyber_top",
		"up":"fpatforestry:blocks/cyber_top",
		"north":"fpatforestry:blocks/cyber_side",
		"east":"fpatforestry:blocks/cyber_side",
		"south":"fpatforestry:blocks/cyber_side",
		"west":"fpatforestry:blocks/cyber_side"
	}
}
