{
    "parent": "block/cube",
    "textures": {
    "particle":"fpatdecoration:blocks/board_computer_0_1",
    "down":"fp:blocks/color_iron_0",
    "up":"fp:blocks/color_iron_0",
    "north":"fpatdecoration:blocks/board_computer_0_1",
    "east":"fp:blocks/color_iron_0",
    "south":"fp:blocks/color_iron_0",
    "west":"fp:blocks/color_iron_0"
    }
}
