{
  "type": "fp:research_shaped",
  "group": "fp",
  "pattern": [
    "AKA",
    "CFC",
    "AMA"
  ],
  "key": {
    "K": {
      "data": 0,
      "item": "fp:extern_cooler"
    },
    "C": {
      "data": 0,
      "item": "fp:wire"
    },
    "A": {
      "type": "forge:ore_dict",
      "ore": "ingotAluminum"
    },
    "F": {
      "data": 7,
      "item": "fp:color_iron"
    },
    "M": {
      "data": 19,
      "item": "fp:spaceship"
    }
  },
  "result": {
    "data": 6,
    "item": "fpatdecoration:modul4_3"
  }
}