{
  "type": "fp:research_shaped",
  "group": "fp",
  "pattern": [
    "CSC",
    "IMI",
    "KBK"
  ],
  "key": {
    "C": [
        {
            "data": 0,
            "item": "fp:cristall"
        },
        {
            "data": 3,
            "item": "fp:cristall"
        },
        {
            "data": 6,
            "item": "fp:cristall"
        },
        {
            "data": 9,
            "item": "fp:cristall"
        },
        {
            "data": 12,
            "item": "fp:cristall"
        }
    ],
    "S": [
	{
      "item": "fp:escenner"
    },
	{
      "item": "fp:escenner",
	  "data":1
    }
	],
    "I": {
      "item": "minecraft:iron_ingot"
    },
    "M": {
      "data": 10,
      "item": "fp:color_iron"
    },
    "K": {
      "data": 3,
      "item": "fp:spaceship"
    },
    "B": {
      "data": 7,
      "item": "fp:spaceship"
    }
  },
  "result": {
    "data": 6,
    "item": "fpatdecoration:scanner_4"
  }
}