{
    "variants":
	{
        "color=white,facing=north,on=false":  { "model": "fpatdecoration:scanner_block_w_off_4", "y":0 },
        "color=white,facing=east,on=false":  { "model": "fpatdecoration:scanner_block_w_off_4", "y":90 },
        "color=white,facing=south,on=false":  { "model": "fpatdecoration:scanner_block_w_off_4", "y":180 },
        "color=white,facing=west,on=false":  { "model": "fpatdecoration:scanner_block_w_off_4", "y":270 },
        "color=silver,facing=north,on=false":  { "model": "fpatdecoration:scanner_block_g_off_4", "y":0 },
        "color=silver,facing=east,on=false":  { "model": "fpatdecoration:scanner_block_g_off_4", "y":90 },
        "color=silver,facing=south,on=false":  { "model": "fpatdecoration:scanner_block_g_off_4", "y":180 },
        "color=silver,facing=west,on=false":  { "model": "fpatdecoration:scanner_block_g_off_4", "y":270 },
        "color=black,facing=north,on=false":  { "model": "fpatdecoration:scanner_block_s_off_4", "y":0 },
        "color=black,facing=east,on=false":  { "model": "fpatdecoration:scanner_block_s_off_4", "y":90 },
        "color=black,facing=south,on=false": { "model": "fpatdecoration:scanner_block_s_off_4", "y":180 },
        "color=black,facing=west,on=false": { "model": "fpatdecoration:scanner_block_s_off_4", "y":270 },
		 
		"color=white,facing=north,on=true":  { "model": "fpatdecoration:scanner_block_w_on_4", "y":0 },
        "color=white,facing=east,on=true":  { "model": "fpatdecoration:scanner_block_w_on_4", "y":90 },
        "color=white,facing=south,on=true":  { "model": "fpatdecoration:scanner_block_w_on_4", "y":180 },
        "color=white,facing=west,on=true":  { "model": "fpatdecoration:scanner_block_w_on_4", "y":270 },
        "color=silver,facing=north,on=true":  { "model": "fpatdecoration:scanner_block_g_on_4", "y":0 },
        "color=silver,facing=east,on=true":  { "model": "fpatdecoration:scanner_block_g_on_4", "y":90 },
        "color=silver,facing=south,on=true":  { "model": "fpatdecoration:scanner_block_g_on_4", "y":180 },
        "color=silver,facing=west,on=true":  { "model": "fpatdecoration:scanner_block_g_on_4", "y":270 },
        "color=black,facing=north,on=true":  { "model": "fpatdecoration:scanner_block_s_on_4", "y":0 },
        "color=black,facing=east,on=true":  { "model": "fpatdecoration:scanner_block_s_on_4", "y":90 },
        "color=black,facing=south,on=true": { "model": "fpatdecoration:scanner_block_s_on_4", "y":180 },
        "color=black,facing=west,on=true": { "model": "fpatdecoration:scanner_block_s_on_4", "y":270 }
    }
}
