{
    "parent": "fp:block/modul_base",
    "textures":
    {
        "metal":"fp:blocks/color_iron_4",
        "server":"fpatdecoration:blocks/calculation_front_yellow",
        "modul":"fpatdecoration:blocks/color_iron_4",
        "lufter":"fpatdecoration:blocks/fans_yellow"
    }
}
