{
  "type": "fp:research_shaped",
  "group": "fp",
  "pattern": [
    "ABA",
    "ADA",
    "A A"
  ],
  "key": {
    "A": {
      "type": "forge:ore_dict",
      "ore": "ingotAluminum"
    },
    "B": {
      "data": 2,
      "item": "fp:color_iron"
    },
    "D": {
      "data": 8,
      "item": "minecraft:dye"
    }
  },
  "result": {
    "data": 11,
    "item": "fpatdecoration:wardrobe_1"
  }
}