{
    "variants": {
        "color=white,facing=north": { "model": "fpatdecoration:modul_1_w_2", "y":0 },
        "color=white,facing=east": { "model": "fpatdecoration:modul_1_w_2", "y":90 },
        "color=white,facing=south": { "model": "fpatdecoration:modul_1_w_2", "y":180 },
        "color=white,facing=west": { "model": "fpatdecoration:modul_1_w_2", "y":270 },
        "color=silver,facing=north": { "model": "fpatdecoration:modul_1_g_2", "y":0 },
        "color=silver,facing=east": { "model": "fpatdecoration:modul_1_g_2", "y":90 },
        "color=silver,facing=south": { "model": "fpatdecoration:modul_1_g_2", "y":180 },
        "color=silver,facing=west": { "model": "fpatdecoration:modul_1_g_2", "y":270 },
        "color=black,facing=north": { "model": "fpatdecoration:modul_1_s_2", "y":0 },
        "color=black,facing=east": { "model": "fpatdecoration:modul_1_s_2", "y":90 },
        "color=black,facing=south": { "model": "fpatdecoration:modul_1_s_2", "y":180 },
        "color=black,facing=west": { "model": "fpatdecoration:modul_1_s_2", "y":270 }    }
}

