{
    "variants": {
        "color=white,facing=north": { "model": "fpatdecoration:board_computer_3", "y":0 },
        "color=white,facing=east": { "model": "fpatdecoration:board_computer_3", "y":90 },
        "color=white,facing=south": { "model": "fpatdecoration:board_computer_3", "y":180 },
        "color=white,facing=west": { "model": "fpatdecoration:board_computer_3", "y":270 },
        "color=silver,facing=north": { "model": "fpatdecoration:board_computer_4", "y":0 },
        "color=silver,facing=east": { "model": "fpatdecoration:board_computer_4", "y":90 },
        "color=silver,facing=south": { "model": "fpatdecoration:board_computer_4", "y":180 },
        "color=silver,facing=west": { "model": "fpatdecoration:board_computer_4", "y":270 },
        "color=black,facing=north": { "model": "fpatdecoration:board_computer_5", "y":0 },
        "color=black,facing=east": { "model": "fpatdecoration:board_computer_5", "y":90 },
        "color=black,facing=south": { "model": "fpatdecoration:board_computer_5", "y":180 },
        "color=black,facing=west": { "model": "fpatdecoration:board_computer_5", "y":270 }
    }
}

