{
	"parent": "block/cube",
	"textures": {
	"particle":"fpatdecoration:blocks/scanner_green_an",
	"down":"fpatdecoration:blocks/color_iron_13",
	"up":"fpatdecoration:blocks/scanner_top_green_an",
	"north":"fpatdecoration:blocks/scanner_green_an",
	"east":"fpatdecoration:blocks/color_iron_13",
	"south":"fpatdecoration:blocks/luftung_green",
	"west":"fpatdecoration:blocks/color_iron_13"
	}
}