{
    "parent": "fp:block/modul_base",
    "textures":
    {
        "metal":"fp:blocks/color_iron_6",
        "server":"fpatdecoration:blocks/server_front_pink",
        "modul":"fpatdecoration:blocks/modul_6_1",
        "lufter":"fpatdecoration:blocks/luftung_pink"
    }
}
