{
  "type": "fp:research_shaped",
  "group": "fp",
  "pattern": [
    "SCS",
    "LFL",
    "SAS"
  ],
  "key": {
    "S": {
      "item": "fp:aiflash2"
    },
    "C": {
      "item": "minecraft:chest"
    },
    "L": {
      "data": 7,
      "item": "fp:chip"
    },
    "F": {
      "data": 4,
      "item": "fp:color_iron"
    },
    "A": {
      "data": 4,
      "item": "fp:wire"
    }
  },
  "result": {
    "data": 6,
    "item": "fpatdecoration:flash_server_6"
  }
}