{
    "parent": "fp:block/modul_base",
    "textures":
    {
        "metal":"fp:blocks/color_iron_5",
        "server":"fpatdecoration:blocks/server_front_lime",
        "modul":"fpatdecoration:blocks/modul_5_1",
        "lufter":"fpatdecoration:blocks/luftung_lime"
    }
}
