{
    "variants": {
        "color=white,facing=north": { "model": "fpatdecoration:modul_2_w_3", "y":0 },
        "color=white,facing=east": { "model": "fpatdecoration:modul_2_w_3", "y":90 },
        "color=white,facing=south": { "model": "fpatdecoration:modul_2_w_3", "y":180 },
        "color=white,facing=west": { "model": "fpatdecoration:modul_2_w_3", "y":270 },
        "color=silver,facing=north": { "model": "fpatdecoration:modul_2_g_3", "y":0 },
        "color=silver,facing=east": { "model": "fpatdecoration:modul_2_g_3", "y":90 },
        "color=silver,facing=south": { "model": "fpatdecoration:modul_2_g_3", "y":180 },
        "color=silver,facing=west": { "model": "fpatdecoration:modul_2_g_3", "y":270 },
        "color=black,facing=north": { "model": "fpatdecoration:modul_2_s_3", "y":0 },
        "color=black,facing=east": { "model": "fpatdecoration:modul_2_s_3", "y":90 },
        "color=black,facing=south": { "model": "fpatdecoration:modul_2_s_3", "y":180 },
        "color=black,facing=west": { "model": "fpatdecoration:modul_2_s_3", "y":270 }
    }
}

