{
    "parent": "fpatdecoration:block/flash_server_11",
	"textures": {
		"slot1":"fp:blocks/flash_server_slot1_on",
		"slot2":"fp:blocks/flash_server_slot2_on",
		"slot3":"fp:blocks/flash_server_slot3_on",
		"slot4":"fp:blocks/flash_server_slot4_on"
	}
}
