{
    "parent": "fp:block/modul_base",
    "textures":
    {
        "metal":"fp:blocks/color_iron_6",
        "server":"fpatdecoration:blocks/calculation_front_pink",
        "modul":"fpatdecoration:blocks/color_iron_6",
        "lufter":"fpatdecoration:blocks/fans_pink"
    }
}
