{
  "type": "fp:research_shaped",
  "group": "fp",
  "pattern": [
    "TDT",
    "SMS",
    "PCP"
  ],
  "key": {
    "T": {
      "data": 28,
      "item": "fp:spaceship"
    },
    "D": {
      "item": "fp:scrench"
    },
    "S": {
      "data": 15,
      "item": "fp:spaceship"
    },
    "M": {
      "data": 10,
      "item": "fp:color_iron"
    },
    "C": {
      "data": 6,
      "item": "fp:spaceship"
    },
    "P": {
      "item": "fp:aiflash0"
    }
  },
  "result": {
    "data": 6,
    "item": "fpatdecoration:modul2_4"
  }
}