{
    "parent": "fp:block/modul_base",
    "textures":
    {
        "metal":"fp:blocks/color_iron_11",
        "server":"fpatdecoration:blocks/calculation_front_blue",
        "modul":"fpatdecoration:blocks/color_iron_11",
        "lufter":"fpatdecoration:blocks/fans_blue"
    }
}
