{
	"parent": "fpatdecoration:block/flash_server_base",
	"textures": {
	"side":"fpatdecoration:blocks/color_iron_10",
	"front":"fpatdecoration:blocks/flash_server_purple",
	"back":"fpatdecoration:blocks/luftung_purple"
	}
}
