{
	"forge_marker": 1,
	"defaults": {
		"model": "fp:flash_server_w"
	},
    "variants":
    {
		"slot1":
		{
			"true": { "textures":{"slot1":"fp:blocks/flash_server_slot1_on" } },
			"false": { "textures":{"slot1":"fp:blocks/flash_server_slot1_off" } }
		},
		"slot2":
		{
			"true": { "textures":{"slot2":"fp:blocks/flash_server_slot2_on" } },
			"false": { "textures":{"slot2":"fp:blocks/flash_server_slot2_off" } }
		},
		"slot3":
		{
			"true": { "textures":{"slot3":"fp:blocks/flash_server_slot3_on" } },
			"false": { "textures":{"slot3":"fp:blocks/flash_server_slot3_off" } }
		},
		"slot4":
		{
			"true": { "textures":{"slot4":"fp:blocks/flash_server_slot4_on" } },
			"false": { "textures":{"slot4":"fp:blocks/flash_server_slot4_off" } }
		},
		"facing":
		{
			"north":{"y":0},
			"east":{"y":90},
			"south":{"y":180},
			"west":{"y":270}
		},
		"color":
		{
			"white": { "model": "fpatdecoration:flash_server_0"},
			"silver": { "model": "fpatdecoration:flash_server_1"},
			"black": { "model": "fpatdecoration:flash_server_2"}
		}
    }
}
