{
    "parent": "fp:block/modul_base",
    "textures":
    {
        "metal":"fp:blocks/color_iron_0",
        "server":"fpatdecoration:blocks/server_front_white",
        "modul":"fpatdecoration:blocks/modul_0_3",
        "lufter":"fpatdecoration:blocks/luftung_white"
    }
}
