{
	"parent": "block/cube",
	"textures": {
		"particle":"fpatdecoration:blocks/scanner_pink_an",
		"down":"fpatdecoration:blocks/color_iron_6",
		"up":"fpatdecoration:blocks/scanner_top_pink_an",
		"north":"fpatdecoration:blocks/scanner_pink_an",
		"east":"fpatdecoration:blocks/color_iron_6",
		"south":"fpatdecoration:blocks/luftung_pink",
		"west":"fpatdecoration:blocks/color_iron_6"
	}
}