{
    "parent": "block/cube",
    "textures": 
    {
        "down":"fpatdecoration:blocks/hs_13",
        "up":"fpatdecoration:blocks/hs_13",
        "north":"fpatdecoration:blocks/hs_13",
        "east":"fpatdecoration:blocks/hs_13",
        "south":"fpatdecoration:blocks/hs_13",
        "west":"fpatdecoration:blocks/hs_13"
    }
}