{
  "type": "fp:research_shaped",
  "group": "fp",
  "pattern": [
    "TDT",
    "SMS",
    "CNC"
  ],
  "key": {
    "T": {
      "data": 28,
      "item": "fp:spaceship"
    },
    "D": {
      "item": "fp:scrench"
    },
    "S": {
      "data": 15,
      "item": "fp:spaceship"
    },
    "M": {
      "data": 14,
      "item": "fp:color_iron"
    },
    "N": {
      "data": 5,
      "item": "fp:spaceship"
    },
    "C": {
      "data": 0,
      "item": "fp:wire"
    }
  },
  "result": {
    "data": 10,
    "item": "fpatdecoration:modul1_5"
  }
}