{
	"parent": "block/cube",
	"textures": {
		"particle":"fpatdecoration:blocks/scanner_lightblue_an",
		"down":"fpatdecoration:blocks/color_iron_3",
		"up":"fpatdecoration:blocks/scanner_top_lightblue_an",
		"north":"fpatdecoration:blocks/scanner_lightblue_an",
		"east":"fpatdecoration:blocks/color_iron_3",
		"south":"fpatdecoration:blocks/luftung_lightblue",
		"west":"fpatdecoration:blocks/color_iron_3"
	}
}