{
  "type": "fp:research_shaped",
  "group": "fp",
  "pattern": [
    "III",
    "IDI",
    "III"
  ],
  "key": {
    "I": {
      "item": "fp:spaceship",
      "data": 14
    },
    "D": {
      "type": "forge:ore_dict",
      "ore": "dyeLime"
    }
  },
  "result": {
    "data": 5,
    "count": 8,
    "item": "fpatdecoration:hazard_block"
  }
}