{
  "type": "fp:research_shaped",
  "group": "fp",
  "pattern": [
    "IPI",
    "IBI",
    "IFI"
  ],
  "key": {
    "I": {
      "type": "forge:ore_dict",
      "ore": "ingotIron"
    },
    "P": {
      "item": "minecraft:piston"
    },
    "B": {
      "item": "minecraft:iron_bars"
    },
    "F": {
      "data": 2,
      "item": "fp:color_iron"
    }
  },
  "result": {
    "data": 2,
    "item": "fpatdecoration:part_press"
  }
}