{
	"parent": "block/cube",
	"textures": {
		"particle":"fpatdecoration:blocks/scanner_brown_an",
		"down":"fpatdecoration:blocks/color_iron_12",
		"up":"fpatdecoration:blocks/scanner_top_brown_an",
		"north":"fpatdecoration:blocks/scanner_brown_an",
		"east":"fpatdecoration:blocks/color_iron_12",
		"south":"fpatdecoration:blocks/luftung_brown",
		"west":"fpatdecoration:blocks/color_iron_12"
	}
}