[
    {
        "id":"fpat.deco.wardrobe",
        "page": "fpatdecoration",        
        "x":0,
        "y":0,
        "parents":["deco.wardrobe"],
        "icon":{"name":"fp:wandrope", "meta":0},
     	"enables":[{"name":"fpatdecoration:wardrobe_light_grey1", "meta":0},{"name":"fpatdecoration:wardrobe_light_grey1", "meta":1},{"name":"fpatdecoration:wardrobe_light_grey1", "meta":2},{"name":"fpatdecoration:wardrobe_light_grey1", "meta":3},{"name":"fpatdecoration:wardrobe_light_grey1", "meta":4},{"name":"fpatdecoration:wardrobe_light_grey1", "meta":5},{"name":"fpatdecoration:wardrobe_light_grey1", "meta":6},{"name":"fpatdecoration:wardrobe_light_grey1", "meta":7},{"name":"fpatdecoration:wardrobe_light_grey1", "meta":8},{"name":"fpatdecoration:wardrobe_light_grey1", "meta":9},{"name":"fpatdecoration:wardrobe_light_grey1", "meta":10},{"name":"fpatdecoration:wardrobe_light_grey1", "meta":11},{"name":"fpatdecoration:wardrobe_light_grey2", "meta":0},{"name":"fpatdecoration:wardrobe_light_grey2", "meta":1},{"name":"fpatdecoration:wardrobe_light_grey2", "meta":2},{"name":"fpatdecoration:wardrobe_light_grey2", "meta":3},{"name":"fpatdecoration:wardrobe_light_grey2", "meta":4},{"name":"fpatdecoration:wardrobe_light_grey2", "meta":5},{"name":"fpatdecoration:wardrobe_light_grey2", "meta":6},{"name":"fpatdecoration:wardrobe_light_grey2", "meta":7},{"name":"fpatdecoration:wardrobe_light_grey2", "meta":8},{"name":"fpatdecoration:wardrobe_light_grey2", "meta":9},{"name":"fpatdecoration:wardrobe_light_grey2", "meta":10},{"name":"fpatdecoration:wardrobe_light_grey2", "meta":11},{"name":"fpatdecoration:wardrobe_light_grey3", "meta":0},{"name":"fpatdecoration:wardrobe_light_grey3", "meta":1},{"name":"fpatdecoration:wardrobe_light_grey3", "meta":2},{"name":"fpatdecoration:wardrobe_light_grey3", "meta":3},{"name":"fpatdecoration:wardrobe_light_grey3", "meta":4},{"name":"fpatdecoration:wardrobe_light_grey3", "meta":5},{"name":"fpatdecoration:wardrobe_light_grey3", "meta":6},{"name":"fpatdecoration:wardrobe_light_grey3", "meta":7},{"name":"fpatdecoration:wardrobe_light_grey3", "meta":8},{"name":"fpatdecoration:wardrobe_light_grey3", "meta":9},{"name":"fpatdecoration:wardrobe_light_grey3", "meta":10},{"name":"fpatdecoration:wardrobe_light_grey3", "meta":11},{"name":"fpatdecoration:wardrobe_light_grey4", "meta":0},{"name":"fpatdecoration:wardrobe_light_grey4", "meta":1},{"name":"fpatdecoration:wardrobe_light_grey4", "meta":2},{"name":"fpatdecoration:wardrobe_light_grey4", "meta":3},{"name":"fpatdecoration:wardrobe_light_grey4", "meta":4},{"name":"fpatdecoration:wardrobe_light_grey4", "meta":5},{"name":"fpatdecoration:wardrobe_light_grey4", "meta":6},{"name":"fpatdecoration:wardrobe_light_grey4", "meta":7},{"name":"fpatdecoration:wardrobe_light_grey4", "meta":8},{"name":"fpatdecoration:wardrobe_light_grey4", "meta":9},{"name":"fpatdecoration:wardrobe_light_grey4", "meta":10},{"name":"fpatdecoration:wardrobe_light_grey4", "meta":11},{"name":"fpatdecoration:wardrobe_light_grey5", "meta":0},{"name":"fpatdecoration:wardrobe_light_grey5", "meta":1},{"name":"fpatdecoration:wardrobe_light_grey5", "meta":2},{"name":"fpatdecoration:wardrobe_light_grey5", "meta":3},{"name":"fpatdecoration:wardrobe_light_grey5", "meta":4},{"name":"fpatdecoration:wardrobe_light_grey5", "meta":5},{"name":"fpatdecoration:wardrobe_light_grey5", "meta":6},{"name":"fpatdecoration:wardrobe_light_grey5", "meta":7},{"name":"fpatdecoration:wardrobe_light_grey5", "meta":8},{"name":"fpatdecoration:wardrobe_light_grey5", "meta":9},{"name":"fpatdecoration:wardrobe_light_grey5", "meta":10},{"name":"fpatdecoration:wardrobe_light_grey5", "meta":11},{"name":"fpatdecoration:wardrobe_grey1", "meta":0},{"name":"fpatdecoration:wardrobe_grey1", "meta":1},{"name":"fpatdecoration:wardrobe_grey1", "meta":2},{"name":"fpatdecoration:wardrobe_grey1", "meta":3},{"name":"fpatdecoration:wardrobe_grey1", "meta":4},{"name":"fpatdecoration:wardrobe_grey1", "meta":5},{"name":"fpatdecoration:wardrobe_grey1", "meta":6},{"name":"fpatdecoration:wardrobe_grey1", "meta":7},{"name":"fpatdecoration:wardrobe_grey1", "meta":8},{"name":"fpatdecoration:wardrobe_grey1", "meta":9},{"name":"fpatdecoration:wardrobe_grey1", "meta":10},{"name":"fpatdecoration:wardrobe_grey1", "meta":11},{"name":"fpatdecoration:wardrobe_grey2", "meta":0},{"name":"fpatdecoration:wardrobe_grey2", "meta":1},{"name":"fpatdecoration:wardrobe_grey2", "meta":2},{"name":"fpatdecoration:wardrobe_grey2", "meta":3},{"name":"fpatdecoration:wardrobe_grey2", "meta":4},{"name":"fpatdecoration:wardrobe_grey2", "meta":5},{"name":"fpatdecoration:wardrobe_grey2", "meta":6},{"name":"fpatdecoration:wardrobe_grey2", "meta":7},{"name":"fpatdecoration:wardrobe_grey2", "meta":8},{"name":"fpatdecoration:wardrobe_grey2", "meta":9},{"name":"fpatdecoration:wardrobe_grey2", "meta":10},{"name":"fpatdecoration:wardrobe_grey2", "meta":11},{"name":"fpatdecoration:wardrobe_grey3", "meta":0},{"name":"fpatdecoration:wardrobe_grey3", "meta":1},{"name":"fpatdecoration:wardrobe_grey3", "meta":2},{"name":"fpatdecoration:wardrobe_grey3", "meta":3},{"name":"fpatdecoration:wardrobe_grey3", "meta":4},{"name":"fpatdecoration:wardrobe_grey3", "meta":5},{"name":"fpatdecoration:wardrobe_grey3", "meta":6},{"name":"fpatdecoration:wardrobe_grey3", "meta":7},{"name":"fpatdecoration:wardrobe_grey3", "meta":8},{"name":"fpatdecoration:wardrobe_grey3", "meta":9},{"name":"fpatdecoration:wardrobe_grey3", "meta":10},{"name":"fpatdecoration:wardrobe_grey3", "meta":11},{"name":"fpatdecoration:wardrobe_grey4", "meta":0},{"name":"fpatdecoration:wardrobe_grey4", "meta":1},{"name":"fpatdecoration:wardrobe_grey4", "meta":2},{"name":"fpatdecoration:wardrobe_grey4", "meta":3},{"name":"fpatdecoration:wardrobe_grey4", "meta":4},{"name":"fpatdecoration:wardrobe_grey4", "meta":5},{"name":"fpatdecoration:wardrobe_grey4", "meta":6},{"name":"fpatdecoration:wardrobe_grey4", "meta":7},{"name":"fpatdecoration:wardrobe_grey4", "meta":8},{"name":"fpatdecoration:wardrobe_grey4", "meta":9},{"name":"fpatdecoration:wardrobe_grey4", "meta":10},{"name":"fpatdecoration:wardrobe_grey4", "meta":11},{"name":"fpatdecoration:wardrobe_grey5", "meta":0},{"name":"fpatdecoration:wardrobe_grey5", "meta":1},{"name":"fpatdecoration:wardrobe_grey5", "meta":2},{"name":"fpatdecoration:wardrobe_grey5", "meta":3},{"name":"fpatdecoration:wardrobe_grey5", "meta":4},{"name":"fpatdecoration:wardrobe_grey5", "meta":5},{"name":"fpatdecoration:wardrobe_grey5", "meta":6},{"name":"fpatdecoration:wardrobe_grey5", "meta":7},{"name":"fpatdecoration:wardrobe_grey5", "meta":8},{"name":"fpatdecoration:wardrobe_grey5", "meta":9},{"name":"fpatdecoration:wardrobe_grey5", "meta":10},{"name":"fpatdecoration:wardrobe_grey5", "meta":11}],
        "need":[],
        "level":2,
        "time":0
    },
    
    {
        "id":"fpat.deco.flashserver",
        "page": "fpatdecoration",        
        "x":0,
        "y":1,
        "parents":["log.flashserver"],
        "icon":{"name":"fp:flash_server","meta":2},
        "enables":[{"name":"fpatdecoration:flash_server_1", "meta":2},{"name":"fpatdecoration:flash_server_1", "meta":6},{"name":"fpatdecoration:flash_server_1", "meta":10},{"name":"fpatdecoration:flash_server_5", "meta":2},{"name":"fpatdecoration:flash_server_2", "meta":2},{"name":"fpatdecoration:flash_server_2", "meta":6},{"name":"fpatdecoration:flash_server_2", "meta":10},{"name":"fpatdecoration:flash_server_5", "meta":6},{"name":"fpatdecoration:flash_server_3", "meta":6},{"name":"fpatdecoration:flash_server_3", "meta":10},{"name":"fpatdecoration:flash_server_5", "meta":10},{"name":"fpatdecoration:flash_server_4", "meta":10},{"name":"fpatdecoration:flash_server_4", "meta":6},{"name":"fpatdecoration:flash_server_4", "meta":2},{"name":"fpatdecoration:flash_server_3", "meta":2}],
        "need":[],
        "level":2,
        "time":0
    },
    
    {
        "id":"fpat.deco.space.advanced.computer",
        "page": "fpatdecoration",
        "x":1,
        "y":2,
        "parents":["space.advanced"],
        "icon":{"name":"fp:advanced_boardcomputer", "meta":2},
        "enables":[{"name":"fpatdecoration:advanced_board_computer_0", "meta":2},{"name":"fpatdecoration:advanced_board_computer_1", "meta":6},{"name":"fpatdecoration:advanced_board_computer_1", "meta":10},{"name":"fpatdecoration:advanced_board_computer2", "meta":2},{"name":"fpatdecoration:advanced_board_computer_2", "meta":6},{"name":"fpatdecoration:advanced_board_computer_2", "meta":10},{"name":"fpatdecoration:advanced_board_computer_3", "meta":2},{"name":"fpatdecoration:advanced_board_computer_3", "meta":6},{"name":"fpatdecoration:advanced_board_computer_3", "meta":10},{"name":"fpatdecoration:advanced_board_computer_4", "meta":2},{"name":"fpatdecoration:advanced_board_computer_4", "meta":6},{"name":"fpatdecoration:advanced_board_computer_4", "meta":10},{"name":"fpatdecoration:advanced_board_computer_5", "meta":2},{"name":"fpatdecoration:advanced_board_computer_5", "meta":6},{"name":"fpatdecoration:advanced_board_computer_5", "meta":10}],
        "need":[],
        "level":2,
        "time":0
    },
    
    {
        "id":"fpat.deco.space.computer",
        "page": "fpatdecoration",
        "x":0,
        "y":2,
        "parents":["space.computer"],
        "icon":{"name":"fp:board_computer", "meta":2},
        "enables":[{"name":"fpatdecoration:board_computer", "meta":2},{"name":"fpatdecoration:board_computer", "meta":6},{"name":"fpatdecoration:board_computer", "meta":10},{"name":"fpatdecoration:board_computer_2", "meta":2},{"name":"fpatdecoration:board_computer_2", "meta":6},{"name":"fpatdecoration:board_computer_2", "meta":10},{"name":"fpatdecoration:board_computer_3", "meta":2},{"name":"fpatdecoration:board_computer_3", "meta":6},{"name":"fpatdecoration:board_computer_3", "meta":10},{"name":"fpatdecoration:board_computer_4", "meta":2},{"name":"fpatdecoration:board_computer_4", "meta":6},{"name":"fpatdecoration:board_computer_4", "meta":10},{"name":"fpatdecoration:board_computer_5", "meta":2},{"name":"fpatdecoration:board_computer_5", "meta":6},{"name":"fpatdecoration:board_computer_5", "meta":10}],
        "need":[],
        "level":2,
        "time":0
    },
    
    {
        "id": "fpat.deco.upgradeT1",
        "page": "fpatdecoration",
        "x": 0,
        "y": 3,
        "parents":["upgradeT1"],
        "icon":{"name":"fp:modul_1", "meta": 2},
        "enables": [{"name":"fpatdecoration:modul1_1", "meta":2},{"name":"fpatdecoration:modul1_1", "meta":6},{"name":"fpatdecoration:modul1_1", "meta":10},{"name":"fpatdecoration:modul1_2", "meta":2},{"name":"fpatdecoration:modul1_2", "meta":6},{"name":"fpatdecoration:modul1_2", "meta":10},{"name":"fpatdecoration:modul1_3", "meta":2},{"name":"fpatdecoration:modul1_3", "meta":6},{"name":"fpatdecoration:modul1_3", "meta":10},{"name":"fpatdecoration:modul1_4", "meta":2},{"name":"fpatdecoration:modul1_4", "meta":6},{"name":"fpatdecoration:modul1_4", "meta":10},{"name":"fpatdecoration:modul1_5", "meta":2},{"name":"fpatdecoration:modul1_5", "meta":6},{"name":"fpatdecoration:modul1_5", "meta":10}],
        "need":[],
        "level": 2,
        "time": 0
    },
    
    {
        "id": "fpat.deco.upgradeT4",
        "page": "fpatdecoration",
        "x": 1,
        "y": 3,
        "parents":["calculation"],
        "icon":{"name":"fp:modul1calc", "meta": 2},
        "enables": [{"name":"fpatdecoration:modul4_1", "meta":2},{"name":"fpatdecoration:modul4_1", "meta":6},{"name":"fpatdecoration:modul4_1", "meta":10},{"name":"fpatdecoration:modul4_2", "meta":2},{"name":"fpatdecoration:modul4_2", "meta":6},{"name":"fpatdecoration:modul4_2", "meta":10},{"name":"fpatdecoration:modul4_3", "meta":2},{"name":"fpatdecoration:modul4_3", "meta":6},{"name":"fpatdecoration:modul4_3", "meta":10},{"name":"fpatdecoration:modul4_4", "meta":2},{"name":"fpatdecoration:modul4_4", "meta":6},{"name":"fpatdecoration:modul4_4", "meta":10},{"name":"fpatdecoration:modul4_5", "meta":2},{"name":"fpatdecoration:modul4_5", "meta":6},{"name":"fpatdecoration:modul4_5", "meta":10}],
        "need":[],
        "level": 2,
        "time": 0
    },
    
    {
        "id": "fpat.deco.upgradeT2",
        "page": "fpatdecoration",
        "x": 2,
        "y": 3,
        "parents":["upgradeT2"],
        "icon":{"name":"fp:modul_2", "meta": 2},
        "enables": [{"name":"fpatdecoration:modul2_1", "meta":2},{"name":"fpatdecoration:modul2_1", "meta":6},{"name":"fpatdecoration:modul2_1", "meta":10},{"name":"fpatdecoration:modul2_2", "meta":2},{"name":"fpatdecoration:modul2_2", "meta":6},{"name":"fpatdecoration:modul2_2", "meta":10},{"name":"fpatdecoration:modul2_3", "meta":2},{"name":"fpatdecoration:modul2_3", "meta":6},{"name":"fpatdecoration:modul2_3", "meta":10},{"name":"fpatdecoration:modul2_4", "meta":2},{"name":"fpatdecoration:modul2_4", "meta":6},{"name":"fpatdecoration:modul2_4", "meta":10},{"name":"fpatdecoration:modul2_5", "meta":2},{"name":"fpatdecoration:modul2_5", "meta":6},{"name":"fpatdecoration:modul2_5", "meta":10}],
        "need":[],
        "level": 2,
        "time": 0
    },
    
    {
        "id": "fpat.deco.upgradeT3",
        "page": "fpatdecoration",
        "x": 3,
        "y": 3,
        "parents":["upgradeT3"],
        "icon":{"name":"fp:modul_3", "meta": 2},
        "enables": [{"name":"fpatdecoration:modul3_1", "meta":2},{"name":"fpatdecoration:modul3_1", "meta":6},{"name":"fpatdecoration:modul3_1", "meta":10},{"name":"fpatdecoration:modul3_2", "meta":2},{"name":"fpatdecoration:modul3_2", "meta":6},{"name":"fpatdecoration:modul3_2", "meta":10},{"name":"fpatdecoration:modul3_3", "meta":2},{"name":"fpatdecoration:modul3_3", "meta":6},{"name":"fpatdecoration:modul3_3", "meta":10},{"name":"fpatdecoration:modul3_4", "meta":2},{"name":"fpatdecoration:modul3_4", "meta":6},{"name":"fpatdecoration:modul3_4", "meta":10},{"name":"fpatdecoration:modul3_5", "meta":2},{"name":"fpatdecoration:modul3_5", "meta":6},{"name":"fpatdecoration:modul3_5", "meta":10}],
        "need":[],
        "aspects": [],
        "level": 2,
        "time": 0
    },
    
    {
        "id": "fpat.deco.scanner",
        "page": "fpatdecoration",
        "x": 0,
        "y": -1,
        "parents":["scanner"],
        "icon":{"name":"fp:scanner_block","meta":0},
        "enables": [{"name":"fpatdecoration:scanner_1", "meta":2},{"name":"fpatdecoration:scanner_1", "meta":6},{"name":"fpatdecoration:scanner_1", "meta":10},{"name":"fpatdecoration:scanner_2", "meta":2},{"name":"fpatdecoration:scanner_2", "meta":6},{"name":"fpatdecoration:scanner_2", "meta":10},{"name":"fpatdecoration:scanner_3", "meta":2},{"name":"fpatdecoration:scanner_3", "meta":6},{"name":"fpatdecoration:scanner_3", "meta":10},{"name":"fpatdecoration:scanner_4", "meta":2},{"name":"fpatdecoration:scanner_4", "meta":6},{"name":"fpatdecoration:scanner_4", "meta":10},{"name":"fpatdecoration:scanner_5", "meta":2},{"name":"fpatdecoration:scanner_5", "meta":6},{"name":"fpatdecoration:scanner_5", "meta":10}],
        "need":[],
        "aspects": [],
        "level": 2,
        "time": 0
    },
    
    {
        "id": "fpat.deco.partpress",
        "page": "fpatdecoration",
        "x": 0,
        "y": -2,
        "parents":["partpress"],
        "icon":{"name":"fp:partpress","meta":0},
        "enables": [{"name":"fpatdecoration:part_press", "meta":0},{"name":"fpatdecoration:part_press", "meta":1},{"name":"fpatdecoration:part_press", "meta":2},{"name":"fpatdecoration:part_press", "meta":3},{"name":"fpatdecoration:part_press", "meta":4},{"name":"fpatdecoration:part_press", "meta":5},{"name":"fpatdecoration:part_press", "meta":6},{"name":"fpatdecoration:part_press", "meta":7},{"name":"fpatdecoration:part_press", "meta":8},{"name":"fpatdecoration:part_press", "meta":9},{"name":"fpatdecoration:part_press", "meta":10},{"name":"fpatdecoration:part_press", "meta":11},{"name":"fpatdecoration:part_press", "meta":12},{"name":"fpatdecoration:part_press", "meta":13},{"name":"fpatdecoration:part_press", "meta":14},{"name":"fpatdecoration:part_press", "meta":15}],
        "need":[],
        "aspects": [],
        "level": 2,
        "time": 0
    }
]