{
    "parent": "block/cube",
    "textures": 
    {
        "down":"fpatdecoration:blocks/color_matrix_icon",
        "up":"fpatdecoration:blocks/color_matrix_icon",
        "north":"fpatdecoration:blocks/color_matrix_icon",
        "east":"fpatdecoration:blocks/color_matrix_icon",
        "south":"fpatdecoration:blocks/color_matrix_icon",
        "west":"fpatdecoration:blocks/color_matrix_icon"
    }
}