{
  "type": "fp:research_shaped",
  "group": "fp",
  "pattern": [
    "CC ",
    "CH ",
    " H "
  ],
  "key": {
    "C": {
      "type": "forge:ore_dict",
      "ore": "ingotNeon"
    },
    "H": {
      "data": 48,
      "item": "fp:spaceship"
    }
  },
  "result": {
    "item": "fpatarmory:neon_axe"
  }
}