C:\Users\Fowaz PC\Documents\NetBeansProjects\DataMining\src\main\java\Apriori\Transaction.java
C:\Users\Fowaz PC\Documents\NetBeansProjects\DataMining\src\main\java\Apriori\Apriori.java
C:\Users\Fowaz PC\Documents\NetBeansProjects\DataMining\src\main\java\Apriori\Main.java
C:\Users\Fowaz PC\Documents\NetBeansProjects\DataMining\src\main\java\Apriori\Item.java
