0 0
0 0
0 0
0 0
0 0
0 0
0 0
0.25974026 0
2.2077923 0.84415585
4.090909 1.4285715
4.74026 1.7532467
5.2597404 1.8181819
5.6493506 2.012987
5.064935 1.5584415
4.090909 1.038961
3.3766234 0.58441556
2.7922077 0.25974026
2.4025974 0
2.1428573 0
1.8181819 0
1.4285715 0
1.038961 0
0.77922076 0
0.45454547 0
0.19480519 0
0 0
0 0
0 0
0 0
0 0
0.064935066 0.064935066
1.4285715 0.064935066
4.74026 0.38961038
8.051948 3.116883
9.350649 4.4805193
9.675324 4.3506494
9.285715 3.7012987
9.155844 3.5064933
8.961039 3.3116884
8.766233 2.987013
7.9870133 2.5324676
7.0779223 1.8181819
5.844156 1.2337662
4.74026 0.77922076
3.8961039 0.25974026
3.5714285 0.064935066
4.3506494 0.19480519
4.2857146 0
3.7662337 0
3.1818182 0
2.5974028 0
2.2077923 0
2.1428573 0
2.2077923 0
2.4025974 0
2.922078 0
3.3766234 0
3.7662337 0
3.7662337 0
4.090909 0
4.4805193 0
4.3506494 0
4.8701296 0.97402596
5.2597404 1.3636364
5.12987 1.5584415
5.12987 1.5584415
4.6753244 1.3636364
4.155844 0.97402596
3.5064933 0.45454547
2.987013 0.064935066
4.090909 0.6493507
7.0129867 2.987013
8.896104 3.9610388
10.25974 4.74026
12.012987 5.714286
13.051949 6.818182
13.636364 7.4025974
12.662337 6.818182
10.454545 5.12987
8.506494 3.9610388
7.0129867 3.116883
5.714286 2.3376622
4.74026 1.7532467
3.8961039 1.2337662
3.3766234 0.6493507
2.987013 0.25974026
2.7922077 0
2.5974028 0
2.2077923 0
2.012987 0
1.8181819 0
1.6233766 0
1.2337662 0
0.84415585 0
0.45454547 0
0.19480519 0
0 0
0 0
0 0
0 0
0 0
0 0
0 0
0 0
0 0
0 0
0 0
0 0
0 0
0 0
0 0
0 0
0.19480519 0
1.038961 0
2.4025974 0.064935066
3.5064933 0.58441556
4.3506494 0.38961038
4.935065 0.58441556
5.5194807 0.6493507
6.2987013 1.2337662
6.818182 1.3636364
6.818182 1.3636364
7.0779223 1.4285715
7.0129867 1.7532467
7.4025974 2.3376622
7.467532 2.7922077
7.4025974 2.7922077
6.818182 2.4025974
6.233766 1.8181819
5.6493506 1.4285715
5.12987 0.84415585
4.8701296 0.45454547
4.3506494 0.25974026
3.8961039 0.064935066
3.5064933 0.064935066
2.987013 0
2.4025974 0
1.9480519 0
1.5584415 0
1.1688311 0
0.77922076 0
0.25974026 0
0 0
0 0
0 0
0 0
0 0
0 0
0 0
0 0
0 0
0 0
0 0
0 0
0 0
0 0
0 0
0 0
0.064935066 0
0.6493507 0
1.6233766 0
2.7922077 0
3.3766234 0
3.7012987 0
4.090909 0
4.74026 0
5.324675 0
6.103896 0.064935066
