[gd_scene load_steps=3 format=3 uid="uid://d2iabdieg6w34"]

[ext_resource type="FontFile" uid="uid://dm3ch1vmt4ixr" path="res://Assets/Fonts/font.ttf" id="1_jox7n"]
[ext_resource type="Script" path="res://Scripts/PointsLabel.gd" id="2_svf4p"]

[node name="PointsLabel" type="Label"]
offset_right = 40.0
offset_bottom = 23.0
theme_override_fonts/font = ExtResource("1_jox7n")
theme_override_font_sizes/font_size = 10
text = "100"
horizontal_alignment = 1
vertical_alignment = 1
script = ExtResource("2_svf4p")
