[gd_scene load_steps=7 format=3 uid="uid://ghwxedshb8n2"]

[ext_resource type="Texture2D" uid="uid://d7iqe7ort45q" path="res://Assets/Sprites/Coin1.png" id="1_biq5j"]
[ext_resource type="Texture2D" uid="uid://boarwxnd8uqy8" path="res://Assets/Sprites/Coin2.png" id="2_wjaxw"]
[ext_resource type="Texture2D" uid="uid://rc8mt153lydh" path="res://Assets/Sprites/Coin3.png" id="3_gahgs"]
[ext_resource type="Texture2D" uid="uid://wn4dcjfa6g3m" path="res://Assets/Sprites/Coin4.png" id="4_6ws5i"]
[ext_resource type="Script" path="res://Coin.gd" id="5_eam1s"]

[sub_resource type="SpriteFrames" id="SpriteFrames_0ds1e"]
animations = [{
"frames": [{
"duration": 1.0,
"texture": ExtResource("1_biq5j")
}, {
"duration": 1.0,
"texture": ExtResource("2_wjaxw")
}, {
"duration": 1.0,
"texture": ExtResource("3_gahgs")
}, {
"duration": 1.0,
"texture": ExtResource("4_6ws5i")
}],
"loop": true,
"name": &"default",
"speed": 10.0
}]

[node name="Coin" type="AnimatedSprite2D"]
sprite_frames = SubResource("SpriteFrames_0ds1e")
script = ExtResource("5_eam1s")
