{
  "gitzone": {
    "projectType": "npm",
    "module": {
      "githost": "gitlab.com",
      "gitscope": "uptime.link",
      "gitrepo": "detector",
      "description": "a detector for answering network questions locally. It does not rely on any online services.",
      "npmPackagename": "@uptime.link/detector",
      "license": "MIT",
      "projectDomain": "uptime.link"
    }
  },
  "npmci": {
    "npmGlobalTools": [],
    "npmAccessLevel": "public"
  }
}