{
  "gitzone": {
    "projectType": "npm",
    "module": {
      "githost": "gitlab.com",
      "gitscope": "uptime.link",
      "gitrepo": "api",
      "description": "the api package for uptime.link",
      "npmPackagename": "@uptime.link/api",
      "license": "UNLICENSED",
      "projectDomain": "uptime.link"
    }
  },
  "npmci": {
    "npmGlobalTools": [],
    "npmAccessLevel": "public"
  }
}