{
  "gitzone": {
    "projectType": "npm",
    "module": {
      "githost": "gitlab.com",
      "gitscope": "pushrocks",
      "gitrepo": "webjwt",
      "description": "a package to handle jwt in the web",
      "npmPackagename": "@pushrocks/webjwt",
      "license": "MIT",
      "projectDomain": "push.rocks"
    }
  },
  "npmci": {
    "npmGlobalTools": [],
    "npmAccessLevel": "public"
  }
}