{
  "gitzone": {
    "projectType": "npm",
    "module": {
      "githost": "gitlab.com",
      "gitscope": "pushrocks",
      "gitrepo": "smartxml",
      "shortDescription": "a package for creating and parsing xml formated files",
      "npmPackagename": "@pushrocks/smartxml",
      "license": "MIT",
      "projectDomain": "push.rocks"
    }
  },
  "npmci": {
    "npmGlobalTools": [],
    "npmAccessLevel": "public"
  }
}