{
  "npmci": {
    "npmAccessLevel": "public"
  },
  "npmdocker": {},
  "gitzone": {
    "module": {
      "githost": "gitlab.com",
      "gitscope": "push.rocks",
      "gitrepo": "smartnginx",
      "shortDescription": "control nginx from node, TypeScript ready",
      "npmPackagename": "@push.rocks/smartnginx",
      "license": "MIT"
    }
  }
}